##TITLE=AC1682_2981_8571508_A8kTSi5g7l
##JCAMPDX= 6.0         $$ Bruker NMR JCAMP-DX V2.0
##DATA TYPE= NMR SPECTRUM
##DATA CLASS= NTUPLES
##ORIGIN= BRUKER
##OWNER= Administrator
$$ 1.72 TOPSPIN		Version 2.1
$$ 2014-04-11 21:39:42.293 -0700  Administrator@X
$$ Compression mode = diff/dup
##.OBSERVE FREQUENCY= 400.02188249412
##.OBSERVE NUCLEUS= ^1H
##.ACQUISITION MODE= SIMULTANEOUS (DQD)
##.ACQUISITION SCHEME= undefined
##.AVERAGES= 8
##.DIGITISER RES= 22
##SPECTROMETER/DATA SYSTEM= spect
##.PULSE SEQUENCE= zg30
##.SOLVENT NAME= COFFEE_meoh
##.SHIFT REFERENCE= INTERNAL, COFFEE_meoh, 1, 14.98509
##AUDIT TRAIL= $$ (NUMBER, WHEN, WHO, WHERE, PROCESS, VERSION, WHAT)
$$ ##TITLE= Audit trail, TOPSPIN		Version 2.1
$$ ##JCAMPDX= 5.01
$$ ##ORIGIN= Bruker BioSpin GmbH
$$ ##OWNER= Administrator
$$ $$ E:\/data/COFFEE/nmr/AC1682_2981_8571508_A8kTSi5g7l/30/pdata/1/auditp.txt
$$ ##AUDIT TRAIL=  $$ (NUMBER, WHEN, WHO, WHERE, PROCESS, VERSION, WHAT)
(   1,<2014-04-11 21:39:35.012 -0700>,<Administrator>,<X>,<go>,<TOPSPIN 2.1>,
      <created by zg
	started at 2014-04-11 21:38:28.949 -0700,
	POWCHK enabled, PULCHK disabled,
       configuration hash MD5:
       C8 4E 4E 5D D3 5C D8 9E 9F 52 82 E0 59 8A DE 15
       data hash MD5: 64K
       74 C9 C7 D3 6B 35 B3 81 04 9C 93 F4 58 EE 30 94>)
(   2,<2014-04-11 21:39:38.043 -0700>,<Administrator>,<X>,<proc1d>,<TOPSPIN 2.1>,
      <Start of raw data processing
       efp LB = 0 FT_mod = 6 PKNL = 1 PHC0 = 0 PHC1 = 0 SI = 32K 
       data hash MD5: 32K
       FD 6A 8F 05 02 38 34 91 D1 3E D2 1E DD D7 44 F8>)
(   3,<2014-04-11 21:39:38.355 -0700>,<Administrator>,<X>,<proc1d>,<TOPSPIN 2.1>,
      <pk PHC0 = 96.15784 PHC1 = 0 
       data hash MD5: 32K
       F0 E1 16 FE 2E 45 2D 45 16 44 07 A8 BF DC B7 98>)
(   4,<2014-04-11 21:39:38.496 -0700>,<Administrator>,<X>,<proc1d>,<TOPSPIN 2.1>,
      <abs ABSG = 1 
       data hash MD5: 32K
       E6 91 D1 82 DE A7 65 04 F3 A5 9C C4 0E 3D 87 3E>)
(   5,<2014-04-11 21:39:38.684 -0700>,<Administrator>,<X>,<proc1d>,<TOPSPIN 2.1>,
      <abs ABSG = 2 
       data hash MD5: 32K
       15 0B 23 71 FA 09 47 FF 9C 3A 78 A2 80 15 CE 01>)
(   6,<2014-04-11 21:39:38.777 -0700>,<Administrator>,<X>,<proc1d>,<TOPSPIN 2.1>,
      <abs ABSG = 3 
       data hash MD5: 32K
       DE 91 9F 36 77 EB 87 0F D8 01 3E 95 D5 9D 48 5C>)
(   7,<2014-04-11 21:39:38.871 -0700>,<Administrator>,<X>,<proc1d>,<TOPSPIN 2.1>,
      <abs ABSG = 4 
       data hash MD5: 32K
       FA EF 3B C9 98 87 01 D2 7B 90 DE 5E 1D 1D 4B 52>)
(   8,<2014-04-11 21:39:38.918 -0700>,<Administrator>,<X>,<proc1d>,<TOPSPIN 2.1>,
      <abs ABSG = 5 
       data hash MD5: 32K
       55 6A F2 E9 F5 DB 08 B7 0C F5 2D 12 3E 0E 0C EC>)
$$ ##END=
$$ 
$$ $$ hash MD5
$$ $$ 9D BC 49 E9 F6 22 A7 AF EF BE 15 74 6B EF 12 80
##$RELAX= 
##$RELAX= 
##$RELAX= 
##$RELAX= 
##$RELAX= 
##$RELAX= 
##$RELAX= 
$$ Bruker specific parameters
$$ --------------------------
##$DU= <E:\>
##$EXPNO= 30
##$NAME= <AC1682_2981_8571508_A8kTSi5g7l>
##$PROCNO= 1
$$ [...]
##$TP= (0..7)
150 150 150 150 150 150 150 150
##$TP07= 0
##$TPNAME0= <>
##$TPNAME1= <>
##$TPNAME2= <>
##$TPNAME3= <>
##$TPNAME4= <>
##$TPNAME5= <>
##$TPNAME6= <>
##$TPNAME7= <>
##$TPOAL= (0..7)
0.5 0.5 0.5 0.5 0.5 0.5 0.5 0.5
##$TPOFFS= (0..7)
0 0 0 0 0 0 0 0
##$TUNHIN= 0
##$TUNHOUT= 0
##$TUNXOUT= 0
##$USERA1= <user>
##$USERA2= <user>
##$USERA3= <user>
##$USERA4= <user>
##$USERA5= <user>
##$V9= 5
##$VALIST= <valist>
##$VCLIST= <CCCCCCCCCCCCCCC>
##$VD= 0
##$VDLIST= <DDDDDDDDDDDDDDD>
##$VPLIST= <PPPPPPPPPPPPPPP>
##$VTLIST= <TTTTTTTTTTTTTTT>
##$WBST= 1024
##$WBSW= 4
##$XGAIN= (0..3)
0 0 0 0
##$XL= 0
##$YL= 0
##$YMAX_a= 640640
##$YMIN_a= -529286
##$ZGOPTNS= <>
##$ZL1= 120
##$ZL2= 120
##$ZL3= 120
##$ZL4= 120
##$ABSF1= 14.98509
##$ABSF2= -5.573092
##$ABSG= 5
##$ABSL= 3
##$ALPHA= 0
##$AQORDER= 0
##$ASSFAC= 0
##$ASSFACI= 0
##$ASSFACX= 0
##$ASSWID= 0
##$AUNMP= <proc_prof1d_extract_pilot.lims>
##$AXLEFT= 0
##$AXNAME= <>
##$AXNUC= <1H>
##$AXRIGHT= 0
##$AXTYPE= 0
##$AXUNIT= <>
##$AZFE= 0.1
##$AZFW= 0.1
##$BCFW= 0
##$BC_mod= 0
##$BYTORDP= 0
##$COROFFS= 0
##$CY= 15
##$DATMOD= 1
##$DC= 0
##$DFILT= <>
##$DTYPP= 0
##$F1P= 0
##$F2P= 0
##$FCOR= 0.5
##$FTSIZE= 32768
##$FT_mod= 6
##$GAMMA= 0
##$GB= 0
##$INTBC= 1
##$INTSCL= 1
##$ISEN= 128
##$LB= 0
##$LEV0= 0
##$LPBIN= 0
##$MAXI= 10000
##$MC2= 0
##$MEAN= 0
##$ME_mod= 0
##$MI= 0
##$NCOEF= 0
##$NC_proc= -8
##$NLEV= 6
##$NOISF1= 0
##$NOISF2= 0
##$NSP= 0
##$NTH_PI= 0
##$NZP= 0
##$OFFSET= 14.98509
##$PC= 1
##$PHC0= 96.15784
##$PHC1= 0
##$PH_mod= 1
##$PKNL= yes
##$PPARMOD= 0
##$PPDIAG= 0
##$PPIPTYP= 0
##$PPMPNUM= 2147483647
##$PPRESOL= 1
##$PSCAL= 4
##$PSIGN= 0
##$PYNMP= <proc.py>
##$REVERSE= no
##$SF= 400.02
##$SI= 32768
##$SIGF1= 0
##$SIGF2= 0
##$SINO= 400
##$SIOLD= 32768
##$SPECTYP= <>
##$SREGLST= <1H.CDCl3>
##$SSB= 0
##$STSI= 32768
##$STSR= 0
##$SW_p= 8223.68421052631
##$SYMM= 0
##$S_DEV= 0
##$TDeff= 65536
##$TDoff= 0
##$TI= <>
##$TILT= no
##$TM1= 0
##$TM2= 0
##$TOPLEV= 0
##$USERP1= <user>
##$USERP2= <user>
##$USERP3= <user>
##$USERP4= <user>
##$USERP5= <user>
##$WDW= 1
##$XDIM= 32768
##$YMAX_p= 446981147
##$YMIN_p= -855335
##$CURPLOT= <Network HP LaserJet P1505>
##$CURPRIN= <$Network HP LaserJet P1505>
##$DFORMAT= <normdp>
##$LAYOUT= <+/1D_H.xwp>
##$LFORMAT= <normlp>
##$PFORMAT= <normpl>
##$SURQMSG= 1
$$ End of Bruker specific parameters
$$ ---------------------------------
##NTUPLES= NMR SPECTRUM
##VAR_NAME=  FREQUENCY,     SPECTRUM/REAL,   SPECTRUM/IMAG
##SYMBOL=    X,             R,               I
##VAR_TYPE=  INDEPENDENT,   DEPENDENT,       DEPENDENT
##VAR_FORM=  AFFN,          ASDF,            ASDF
##VAR_DIM=   32768,         32768,           32768
##UNITS=     HZ,            ARBITRARY UNITS, ARBITRARY UNITS
##FACTOR=    0.250966925370066, 1,           1
##FIRST=     8223.43324360094, 136625,       27975
##LAST=      0,             -252107,         -25885
##MIN=       0,             -855335,         0
##MAX=       8223.43324360094, 446981147,    0
$$ Real data points
##PAGE= N=1
##DATA TABLE= (X++(R..R)), XYDATA
$$ [...]
$$ plain form
19418 237159 12925 53160 -448322 239016 -165235 61059 -12292 -178057 -178881 -309667 26470
19406 91563 -154830 -77009 61973 -170470 -156362 15618 -418644 -30492 -103006 -178853 -209266
19395 -209266 60937 -86874 -161816 -68564 93756 187566 -636390 -224559 -229959 -76361 -179927
19384 -179927 155500 -109965 270242 72582 -268618 125950 -15633 -139598 68692 182225
19374 182225 -143672 201082 127239 36781 -125864 2925 40054 -123318 -106588 22862 -72586
19362 -290071 -25773 87725 -106112 -49183 -115612 153399 -288166 -18681 -368009 -48755 -115847
19351 -115847 -210991 99546 165793 -81902 -203823 -55164 -276663 -33557 82656 105640 -297647
19339 123176 -99430 42554 -82913 23148 -18657 -125184 86070 -207728 -220319 -190772 -359866
$$ packed form
19418B37159A2925M0235d48322B39016a65235F1059a2292j65765q24j30786B6470
19406I1563a54830g7009F1973a70470J4108A5618d18644c0492p2514p5847l0413
19395b09266F0937h6874p4942f8564I3756R3810f36390b24559n400g6361j03566
19384a79927A55500a09965B70242G2582b68618A25950a5633j23965F8692J13533
19374A82225a43672B01082p3843C6781a25864B925L7129a23318J6730B2862g2586
19362b90071b5773H7725a06112d9183o6429A53399b88166a8681l49328d8755o7092
19351a15847r5144I9546O6247h1902j21921e5164k21499c3557H2656K2984b97647
19339A23176i9430D2554h2913B3148a8657j06527H6070b07728j2591K9547j69094
$$ plain form
19328 -359866 -9315 10865 -265561 309138 29499 -147207 205830 39880 91209 -192036 -555241
19317 -555241 -274635 -44263 -22339 -89533 -194244 -50954 -170478 -151705 74005 -130372 -237121
19306 -237121 -97150 86869 -147563 -534625 -203793 -319971 -241993 -171012 295240 -98235
19295 -415558 4116 193654 105836 151976 165346 -94591 -217378 -393585 249693 -71366 -283199
19284 -283199 -397283 -154104 400430 -248935 -11344 -35121 -197242 -90575 95897 -34329
19273 139826 -1287 -130714 -226357 -222367 -73065 -185296 -215974 162294 228245 -86422 -281505
19262 -281505 -229377 -270856 -15699 -317631 -84807 115951 39315 -53469 -103683 -16205 -151301
19251 -151301 -46229 146161 220725 -103745 412436 -262997 29052 98592 181567 -134598
$$ packed form
19328c59866i315A0865b65561C09138B9499a47207B05830C9880N1329a92036l63205
19317e55241b74635d4263K1924o7194j04711e0954j19524J8773G4005a30372j06749
19306b37121i7150H6869a47563l87062b03793j16178P7978P0981B95240i8235
19295d15558D116J89538q7818M6140J3370i4591j22787j76207B49693g1366k11833
19284b83199j14084a54104D00430b48935a1344k3777j62121i0575I5897c4329
19273A39826a287j29427r5643L990g3065j12231l0678A62294O5951h6422j95083
19262b81505N2128m1479a5699l01932h4807A15951C9315e3469n0214a6205j35096
19251a51301d6229A46161P4564a03745D12436b62997B9052O9540Q2975a34598
$$ plain form
19240 -440851 -186605 7293 -164217 -160526 150506 -240954 -137600 85176 140081 54265 5304
19228 -91625 161718 126611 176710 -10844 -91197 299057 -32063 -175577 -584313 -129767 -240279
19217 -240279 60720 -196172 -302993 -335062 -200277 265030 204350 144522 -95798 60030 -200899
19205 -106819 182659 -498762 -769 -467953 -46582 -92341 -102625 -111909 -160538 -111618 -116572 51028
19192 -71830 -35423 -278690 -296165 -100521 39347 -197952 13893 2298 -262925 -107971 2215
19180 -241779 -184844 -245443 204319 -340244 -94044 322433 -55452 -55786 245845 -42203 -181052
19169 -181052 -130082 -241056 -63318 -39903 236164 102879 38567 4452 -116345 -89210 166458
19157 117613 -338706 228433 -93141 -69681 -40703 323746 59198 -136376 -30873 66870 2102
$$ packed form
19240d40851a86605G293a64217L691A50506b40954J03354H5176N4905E4265E304
19228i1625A61718l5107N0099a0844q0353B99057c2063j43514m08736a29767j10512
19217b40279F0720a96172j06821l2069J34785B65030o0680n9828i5798F0030b00899
19205a06819A82659d98762g69m67184d6582m5759j0284r284m8629M8920m954E1028
19192g1830c5423k43267j7475a00521C9347a97952A3893B298b62925a07971B215
19180b41779N6935o0599B04319c40244i4044C22433e5452l34B45845d2203j38849
19169a81052N0970j10974f3318K3415B36164A02879C8567D452a16345K7135A66458
19157A17613c38706B28433i3141K3460K8978C23746E9198a36376c0873F6870B102
$$ plain form
19145 -47096 -105108 -10257 -180445 -151102 83629 -162558 -195886 46451 -32447 -140223 -47031
19133 127139 -69947 -198198 -155919 -96849 -467394 -354557 -468292 -52295 140348 -171319
19122 -275388 -121546 17800 -16258 -123056 -151126 -320140 -128524 -163959 64798 -190119
19111 -322341 -138964 -368645 -234098 -68 -235527 -47908 36277 23274 -181481 349652 105586
19099 -122695 -118196 27803 271658 -129246 179485 -96816 -385906 -194761 -91825 -443422
19089 -443422 48229 -54611 -76303 -30640 -49111 16788 -143658 -2577 70671 -56667 112826
19077 -119345 -100308 -96682 18314 -270629 -228589 -140588 -155595 -136544 -158061 -131052 100653
19065 37807 -242454 -107235 -56045 -135952 -61801 234635 -119122 -2916 289453 107583 6157
$$ packed form
19145d7096n8012a0257j70188K9343H3629a62558l3328D6451c2447j07776d7031
19133A27139f9947j28251M2279N9070l70545J12837j13735e2295A40348a71319
19122b75388a21546A7800a6258j06798k8070j69014a28524l5435F4798a90119
19111c22341a38964k29681J34547f8k35459d7908C6277j3003a81481C49652A05586
19099a22695M499B7803K43855a29246A79485i6816k89090J91145i1825l51597
19089d43422D8229e4611k1692c0640j8471A6788a43658b577G0671e6667A12826
19077a19345J9037L626A8314b70629M2040Q8001j5007J9051k1517K7009A00653
19065C7807b42454a07235N1190p9907f1801B34635a19122b916B89453A07583F157
$$ plain form
19053 34125 129599 247014 -138358 153675 -26486 -40604 -66180 68834 -79259 3102 -106832
19041 108735 -129963 -83613 -292475 -72849 8814 -126448 -32030 -162115 -388557 -207034
19031 -207034 -225766 -189228 381058 27798 78707 -93603 -162349 7507 -44905 -109688 -90007
19020 -90007 212679 -86176 -125298 36690 -148428 -39215 156065 -208737 22328 -163865 -216688
19009 -216688 -16929 -140016 144090 207792 253096 -129421 -184372 279949 -69370 138975
18998 -236281 -133863 -411221 -168180 68245 34398 -142027 -118851 29788 125476 -435385
18987 -55509 -13496 -10015 -55709 -249067 -113991 59507 -192794 -179897 -231974 80393 -243903
18975 71756 -113947 -172509 -88304 -17973 -229860 19906 113434 -220003 -683 -69813 -280878
$$ packed form
19053C4125R5474J17415a38358A53675b6486j4118k5576F8834g9259C102a06832
19041A08735a29963M6350k08862g2849H814a26448c2030j30085k26442J81523
19031b07034j8732L6538C81058B7798N0909i3603o8746G507d4905o4783J9681
19020i0007B12679h6176l9122C6690a48428c9215A56065b08737B2328a63865n2823
19009b16688a6929j23087A44090O3702M5304a29421n4951B79949f9370A38975
18998b36281J02418k77358a68180F8245l3847a42027K3176B9788R5688d35385
18987e5509a3496L481m5694j93358a13991E9507a92794J2897n2077H0393b43903
18975G1756a13947n8562Q4205a7973k11887A9906R3528b20003f83o9130k11065
$$ plain form
18964 -280878 -77014 -107923 71325 381269 135739 7327 21399 -244301 -202025 -221689 -74687
18952 -142602 259127 19325 -251544 61311 -240068 -156733 -21708 -31365 -253670 -184693 220144
18940 -268334 -397732 -16206 -48513 272328 -265347 -52440 -151046 2378 -222209 -75986 218828
18928 -57306 7513 27272 -267541 -194492 -60494 -2552 168189 -90607 -99573 -140473 -264172 -259596
18916 -259596 112658 -369388 -246627 -18281 27059 -319851 -24213 271446 -145285 -49044
18905 119396 -41377 -196762 42079 -179666 147133 9406 -150175 15652 -403212 -9028 -248137
18894 -248137 -276662 -56305 -248573 -217064 162205 36119 62307 -118480 -249273 -114171
18883 179678 36919 -191951 -79053 120823 -343205 -42180 -5762 -36004 -10217 -90868 -24459
$$ packed form
18964b80878g7014l0909G1325L09944A35739G327J4072b44301M2276j9664g4687
18952a42602B59127A9325b51544F1311b40068Q3335b1708r657k22305O8977B20144
18940b68334j29398a6206l2307B72328b65347e2440r8606B378b22209g5986B18828
18928e7306G513J9759b67541P3049f0494b552A68189i0607q966m0900j23699M576
18916b59596A12658c69388J22761a8281B7059c19851b4213B71446a45285d9044
18905A19396d1377j55385D2079a79666A47133I406a50175A5652d03212i028k39109
18894b48137k8525e6305j92268L1509A62205C6119K6188a18480j30793a14171
18883A79678C6919a91951g9053A20823c43205d2180e762l0242a0217q0651b4459
$$ plain form
18871 -181043 -144985 35567 -61700 -35403 145127 -31493 114796 -134345 -196648 -315413 276592
18859 243939 -183934 -209833 74012 44973 -7882 -44017 127130 -30670 -54761 110429 -255412
18847 -75445 -324572 141166 198801 4530 209950 -33731 -186627 -34221 -78748 167274 -109595
18835 -94355 -40057 -81475 -185791 304526 -137282 134921 204423 161463 -332487 60558 -235610
18823 109620 -49747 305193 84174 -198455 24026 -43651 -130406 -66843 158826 -47465 -4730
18811 289424 14072 -190698 -10571 -145747 22875 33923 -539821 -86595 -51768 132437 -439448
18799 -374608 -143996 31240 -66512 -119787 -15610 -161750 -74039 -100426 -236375 -38663 -119226
18788 -119226 -75608 75745 178695 102541 -290498 108234 -218780 -99550 -236557 -159282
$$ packed form
18871a81043L6058C5567f1700K6297A45127c1493A14796a34345o2303j18765B76592
18859B43939a83934k5899G4012k9039g882l6135A27130c0670k4091A10429b55412
18847g5445k49127A41166N7635D530K05420c3731j52896c4221m4527A67274a09595
18835i4355d0057m1418j04316C04526a37282A34921O9502m2960c32487F0558b35610
18823A09620d9747C05193H4174a98455B4026d3651q6755O3563A58826d7465d730
18811B89424A4072a90698a0571j35176B2875J1048e39821h6595L4827A32437d39448
18799c74608a43996C1240f6512n3275a5610j46140g4039k6387j35949c8663q0563
18788a19226M3618G5745J02950p6154b90498A08234b18780i9550j37007P7275
$$ plain form
18778 -159282 44494 10722 -240332 265223 188491 -26530 -52094 110169 -343549 -232017
18768 -232017 -190281 -88685 120817 118571 -179709 215687 -3983 75215 -109268 -45637 280773
18756 215997 -69056 -102278 -95794 -125685 -65728 -385553 117671 -35300 -178844 -44366 -70983
18745 -70983 -127720 -243709 164486 150461 -202034 -61620 49649 152817 -77346 221848 195409
18734 195409 -299654 -367035 -342283 -455560 90353 -370271 -135448 42306 -260279 -149673
18724 -149673 65539 -116962 -130183 212210 13218 -311466 -56404 -4076 -56991 75312 19980
18712 295050 -522324 -79011 13285 -165860 124033 -102621 151679 -132134 -128794 -30661
18701 -40132 -218286 -144693 -38281 -185005 -31520 29882 -267037 156683 20629 156844 -7442
$$ packed form
18778a59282D4494A0722b40332B65223p6732b6530k5564A10169c43549J11532
18768b32017M1736h8685A20817k246a79709B15687c983G5215a09268d5637B80773
18756B15997f9056l3222O484k9891N9957l19825A17671c5300j43544d4366k6617
18745g0983n6737j15989A64486j4025b02034f1620D9649J03168g7346B21848k6439
18734A95409b99654o7381K4752j13277I0353c70271a35448D2306b60279J10606
18724a49673F5539a16962j3221B12210A3218c11466e6404d076n2915G5312A9980
18712B95050e22324g9011A3285a65860A24033a02621A51679a32134L340c0661
18701d0132j78154P3593c8281j46724c1520B9882b67037A56683B0629J36215g442
$$ plain form
18689 -166743 -124424 -143410 -117658 42875 -139575 -224886 -85862 71965 28478 6266 -209365
18677 212611 -158479 -253143 141656 129586 205615 -366004 -56932 148419 67409 25021 -395064
18665 -17004 50722 22736 -26552 -115131 -220042 -14810 74616 -30078 -61270 -284113 97271
18653 -232004 577 -437313 90649 35771 -317647 -66054 134616 -26324 129093 246625 -120145
18641 -144530 -48440 -177638 -81192 -76595 -148536 -170022 -266029 103121 45173 -57434 202777
18629 -83099 -309735 196021 -287223 118546 -318407 -179448 -254674 317965 -21813 -32296
18619 -32296 69403 -124233 -28520 85706 -59945 -97919 22085 261714 68216 62693 -245228
18607 -128116 -27056 -33690 -104831 -195199 219877 -167557 32634 57815 -110902 -8260 1104
$$ packed form
18689a66743M2319j8986K5752D2875a39575q5311h5862G1965B8478F266b09365
18677B12611a58479r4664A41656j2070P6029c66004e6932A48419F7409B5021c95064
18665a7004E0722B2736b6552q8579j04911a4810G4616c0078l1192k22843I7271
18653b32004E77d37313I0649C5771c17647f6054A34616b6324A29093J17532a20145
18641a44530d8440j29198h1192M597p1941k1486r6007A03121D5173e7434B02777
18629h3099k26636A96021b87223A18546c18407J38959p5226C17965b1813j0483
18619c2296F9403a24233b8520H5706e9945l7974B2085K39629F8216n523b45228
18607a28116b7056o634p1141r0368B19877a67557C2634K5181a10902h260A104
$$ plain form
18595 -429374 89210 99784 -98207 75617 -102007 -1418 -127243 2875 69711 -88539 -383868
18584 -383868 194814 343783 -11374 65170 -409599 -87939 163396 -207673 -211569 -8519 137490
18572 -114561 102533 -375277 -74431 -87975 220535 308383 98396 -134033 167359 279563
18562 279563 171236 -104517 45087 -90311 174217 2618 -674 -38546 -36064 -299120 404831
18550 -278668 164524 -30530 -88315 -43208 -39274 -89303 161808 -111262 166786 25668 -143170
18538 -35344 321245 -26169 -31990 311592 -87432 -3060 -175094 -5702 58496 114545 71388 -6487
18525 -213735 104011 172748 -46791 161924 -180642 133391 197365 -351313 -366033 -49076
18514 -34547 144125 -128261 -103628 114723 221553 37723 -164908 -149596 -185256 -55875 25492
$$ packed form
18595d29374H9210J0574i8207G5617a02007a418j25825B875O6836h8539k95329
18584c83868A94814J48969a1374F5170d09599h7939A63396b07673l896h519A37490
18572a14561A02533c75277g4431j3544B20535Q7848I8396a34033A67359J12204
18562B79563j08327a04517D5087i0311A74217B618f74l7872K482k63056D04831
18550b78668A64524c0530n7785d3208L934n0029A61808a11262A66786B5668a43170
18538c5344C21245b6169n821C11592h7432c060j72034e702E8496N6049m3157f487
18525b13735A04011O8737d6791A61924a80642A33391O3974c51313j4720d9076
18514c4547A44125a28261K4633A14723J06830C7723a64908J5312l5660e5875B5492
$$ plain form
18502 222417 -213838 -91699 -217151 -198966 -153753 439823 58048 -30001 85130 -143021 102915
18490 -245408 -64257 -88840 204917 242487 332619 -75009 -155783 -16554 -38203 -31545 -315699
18479 -315699 -50422 -186928 45385 236123 -96867 -2859 82780 -117688 -53543 -212308 -116984
18468 -116984 -579841 71617 -127870 117295 -34358 -105026 -271100 33253 -30826 -248893
18458 -248893 125896 -74558 101145 -107884 -29541 134273 95641 -267349 -61630 57076
18447 -150867 23678 156652 -231204 -242416 -27016 -65690 -285413 -70715 177584 49100 97922
18436 97922 145744 -105126 227096 -47762 -262416 -47191 -97858 13421 -105068 118377 -119753
18424 -113920 -223820 -333361 -176561 -134240 -147904 -273819 -112784 -198702 -356870 168172
$$ packed form
18502B22417b13838i1699j25452J8185M5213D39823E8048c0001H5130a43021A02915
18490b45408f4257k4583B04917L7570R0132g5009q0774a6554k1649O658k84154
18479c15699e0422j36506D5385J90738i6867b859H2780a17688e3543j58765R5324
18468a16984m62857G1617a27870A17295c4358p0668j66074C3253c0826k18067
18458b48893A25896g4558A01145a07884b9541A34273l8632b67349f1630E7076
18447a50867B3678J32974b31204j1212b7016l8674k19723g0715A77584D9100M8822
18436I7922M7822a05126B27096d7762k14654d7191n0667A3421a05068A18377a19753
18424a13920j09900j09541J56800M2321j3664j25915a12784q5918j58168A68172
$$ plain form
18413 -417 -177721 254892 -11755 102069 83492 -144010 -24556 18873 -43643 -58979 -1737
18401 128486 -141803 -112183 40620 444903 -212520 103780 64214 254209 -379846 26804
18390 -245623 -116107 -415683 -155893 -115531 -336482 -57707 -195772 -216893 -190667 94287
18379 171036 96754 64947 -26016 27658 95962 7226 -119014 208422 169984 -190726 -216785
18368 -216785 -221459 -164039 -196264 -251146 79253 -104770 -35142 -72595 144193 -181571 36513
18356 279517 -12479 208053 214885 -23461 -77788 154183 72645 71706 146736 170105 -256754
18344 -15038 -181825 319806 17411 -128646 -332567 -27700 -43240 7463 121825 208285 -14103
18332 -193881 -246852 278928 -131198 4486 -23180 -184646 260898 145981 4557 -208846 133241
$$ packed form
18413d17j77304B54892a1755A02069j8577a44010b4556A8873d3643j5336a737
18401A28486a41803K9620D0620M04283b12520A03780l9566J89995c79846B6804
18390b45623a16107k99576a55893M0362k20951e7707j38065k1121K6226I4287
18379A71036p4282l1807b6016B7658O8304G226a19014B08422l8438a90726k6059
18368b16785m674N7420l2225n4882G9253a04770c5142l7453A44193a81571C6513
18356B79517a2479B08053O832b3461n4327A54183G2645r39P5030K3369b56754
18344a5038j66787C19806A7411a28646k03921b7700j5540G463J14362Q6460a4103
18332a93881n2971B78928a31198D486b3180j61466B60898j14917D557b08846A33241
$$ plain form
18320 -17873 178530 -15746 -118036 -212716 421694 -233265 -61158 -123244 85592 7109 -143760
18308 -128370 -100914 7839 -109744 38738 196342 162251 245067 -451591 -379113 -35770 159044
18296 -198308 -43260 -6212 -74860 -201991 211185 -223560 59587 -136355 -70783 58482 75530
18285 75530 -145188 414593 152841 -49608 -134707 83042 145636 196037 -15495 -46305 24247
18273 120746 -8891 -190898 259138 -66330 -188527 398824 -31598 -221396 -126319 264348
18262 -227866 -180484 113043 -169873 134379 314509 -231256 -131762 92767 51604 -21001
18251 -76884 86363 -49138 76878 -30952 95272 217873 83123 142877 -97610 111500 -232565
18239 25328 18631 125015 185665 101943 22543 19595 -133334 324817 121831 81513 39623
$$ packed form
18320a7873A78530a5746j02290r4680D21694b33265f1158o2086H5592G109a43760
18308a28370K7456G839a09744C8738J57604l4091Q2816d51591P2478c5770A59044
18296a98308d3260f212o8648j27131B11185b23560E9587a36355O5572E8482J7048
18285G5530a45188D14593A52841d9608q5099H3042O2594N0401a5495l0810B4247
18273A20746h891j82007B59138f6330j22197C98824c1598j89798R5077B64348
18262b27866M7382A13043a69873A34379J80130b31256R9494I2767m1163b1001
18251g6884H6363d9138G6878c0952I5272J22601H3123N9754i7610A11500b32565
18239B5328o697J06384O0650q3722B2543k948a33334C24817A21831m0318C9623
$$ plain form
18227 -109047 -235853 -173272 120301 -121089 -97175 328284 -129128 235802 -147898 -104469
18217 -104469 -5980 -156887 -351172 10522 153557 -11993 -26613 -117544 -227487 341051 162524
18205 -97772 28504 176682 102097 -155232 -219308 212321 91050 -106368 -13061 -62686 -155174
18194 -155174 -103557 -70333 -56257 -104914 33115 280094 212502 -186810 124240 276557 -117340
18182 -104242 35318 107708 51371 -294431 -36009 22995 -239761 80919 -43896 184916 46672
18170 15093 443671 -209173 168875 -14674 -30612 51804 208891 51613 -49869 106144 -424080
18158 -256292 -140053 -353 -154917 255511 -332829 -32824 286657 91366 -194698 406568
18147 175145 41569 -151168 154355 224832 72287 115763 175395 236410 32537 9131 -52367
$$ packed form
18227a09047j26806O2581A20301a21089K3914C28284a29128B35802a47898M3429
18217a04469e980j50907j94285A0522J43035a1993j4620r0931j09943C41051A62524
18205i7772B8504J48178p4585a55232o4076B12321I1050a06368a3061m9625r2488
18194a55174N1617L3224J4076m8657C3115K46979o7592a86810A24240J52317a17340
18182a04242C5318P2390E1371b94431c6009B2995b39761H0919d3896A84916D6672
18170A5093M28578b09173A68875a4674j5938E1804J57087E1613d9869A06144d24080
18158b56292J16239c53j54564B55511c32829c2824B86657I1366a94698D06568
18147A75145D1569a51168A54355P0477G2287M3476N9632O1015C2537I131e2367
$$ plain form
18135 -24041 216444 99390 -66119 -202961 -11763 9101 101297 -136416 58581 146902 -180174
18123 28468 86964 -25015 50406 -151101 185994 -90085 -88694 -18193 -333016 140311 32285
18111 371410 82206 -149756 72206 213168 -244591 -9036 -27208 166133 112661 -186416 -249616
18100 -249616 -176387 113638 81223 98273 106601 168539 -15149 -134834 -13937 168041 -87373
18088 -236179 121428 25349 330291 160036 -67477 100913 57605 -19499 246721 171434
18078 171434 73980 143472 81953 -19693 -52984 -223143 117551 143773 -64032 9594 377658
18067 377658 308849 97801 326658 219166 -192068 -27183 171699 132630 78958 78182 -65931
18055 -88295 -76034 -220887 418044 180032 89555 396847 -238073 148848 204264 -192419
$$ packed form
18135b4041B16444I9390f6119j36842a1763I101R2196a36416E8581Q8321a80174
18123B8468N8496b5015E0406a51101A85994i0085J391a8193l14823A40311C2285
18111C71410H2206a49756G2206J40962b44591i036j8172A66133n3472a86416o3200
18100b49616P3229A13638l2415J7050Q328O1938a5149j19685a3937A68041h7373
18088b36179A21428B5349L04942A60036f7477A00913m3308a9499B46721p5287
18078A71434G3980O9492o1519a9693l3291j70159A17551K6222f4032I594L68064
18067C77658o8809I7801K28857j07492a92068b7183A71699l9069n3672p76f5931
18055h8295J2261j44853D18044A80032H9555L07292b38073A48848N5416a92419
$$ plain form
18044 -38650 11397 381780 -231140 -121771 77259 -49899 82448 -92049 331016 365441 275688
18033 275688 56825 117287 -98412 -23779 -60389 148193 230463 -185561 -125706 64564 109847
18022 109847 -71405 -19780 168846 -141484 88154 95805 -58497 214357 -22668 354858 -7035
18010 -171419 -35639 74904 240004 43718 176636 149823 242832 -256855 -106382 131927
17999 -109119 289187 -68033 -118346 -75662 -266359 15827 -88454 -14238 115529 22134 125311
17988 125311 -106043 -149181 363384 -102261 -25936 359581 80811 277179 -251588 398180
17977 -35215 -289539 129241 229104 313831 57957 33435 107379 -102283 36656 238565 54812
17965 94500 -3217 -60146 165684 24110 125249 64797 -79928 -130588 -20355 558485 -92344
$$ packed form
18044c8650A1397L70383b31140J09369G7259d9899H2448i2049C31016L4425q9753
18033B75688E6825O0462i8412b3779l6610A48193Q2270a85561N9855F4564M5283
18022A09847g1405a9780A68846a41484H8154P651e8497B14357b2668C54858g035
18010a71419c5639G4904J65100D3718J32918k6813R3009b56855a06382A31927
17999a09119B89187f8033n0313M2684j90697A5827h8454a4238A15529B2134J03177
17988A25311a06043m3138C63384a02261b5936C59581H0811J96368b51588C98180
17977c5215k54324A29241R9863Q4727E7957k4522P3944a02283C6656K01909E4812
17965I4500c217n6929A65684B4110J01139o0452g9928n0660b0355E58485i2344
$$ plain form
17953 -31713 181536 -155600 299273 205667 267199 -280088 167138 370081 -27887 189550
17942 135864 112809 95897 -15860 -162826 109850 -81388 53481 100593 118091 167484 260747
17931 260747 247351 83932 68236 245663 89585 -224310 78719 46966 51740 162098 189916
17920 189916 -65439 -194352 219889 -265596 99959 60274 399735 244875 260067 324636
17910 324636 295358 69606 -82675 -25049 115877 273511 -54273 -106280 -197806 326217 116796
17898 164682 -101304 120621 -154578 14078 98024 -70648 478975 284618 -363858 92791
17887 -75066 157678 28006 273131 220019 442035 42638 310657 158654 193396 188186 499828
17876 499828 207231 56161 138731 216717 320669 14252 514722 -86382 135780 76035 274408
$$ packed form
17953c1713A81536a55600B99273r3606O1532b80088A67138K02943b7887A89550
17942A35864k3055j6912a5860j46966A09850h1388E3481M7112J7498M9393R3263
17931B60747j3396H3932j5696J77427H9585b24310G8719l1753M774J10358K7818
17920A89916f5439j28913B19889b65596I9959l9685L39461j54860J5192O4569
17910C24636k9278F9606h2675b5049A15877J57634e4273n2007r1526C26217A16796
17898A64682a01304A20621a54578A4078Q3946g0648D78975j94357c63858I2791
17887g5066A57678B8006K45125n3112K22016D2638K68019j52003L4742n210L11642
17876D99828B07231E6161Q2570P7986J03952A4252N00470h6382A35780n9745J98373
$$ plain form
17865 274408 142545 15936 370986 210102 176793 251629 -17994 56878 -8520 270969 -35289
17853 -41317 18304 -172055 6548 152995 137614 71987 160746 -507408 133447 507 21183
17842 21183 166728 209354 -7079 -84994 319347 -138625 375596 24469 -60139 301351 -81549
17830 -56818 174001 -59093 5449 -2386 -194809 -13754 -4609 -281876 -33381 197839 41317
17818 107373 314358 204071 -139216 310146 42668 430903 226597 257256 119507 133828
17808 133828 34425 -51997 120080 76567 -68161 -159040 77841 -113337 224159 233040 423147
17797 423147 181491 277039 323018 406306 -69031 60865 -23926 79001 10356 204512 387733
17786 387733 137626 47082 -106838 -72044 73783 277584 -165201 386168 180959 9883
$$ packed form
17865B74408j31863A5936L55050j60884l3309P4836a7994E6878h520B70969c5289
17853d1317A8304a72055F548J46447j5381o5627Q8759e07408A33447E07K0676
17842B1183J45545M2626g079p7915C19347a38625C75596B4469f0139C01351h1549
17830e6818A74001e9093E449b386j92423a3754d609k77267c3381A97839D1317
17818A07373K06985j10287a39216C10146D2668L88235k04306L0659A19507J4321
17808A33828C4425e1997A20080m3513f8161r0879G7841a13337B24159Q881J90107
17797D23147A81491R5548M5979Q3288f9031F0865b3926G9001A0356J94156J83221
17786C87733A37626D7082a06838L4794G3783K03801a65201C86168A80959I883
$$ plain form
17775 256160 118861 -10589 -302389 -99927 -133325 301656 175274 148876 387628 -28357
17764 315169 -86109 103278 280409 -51824 150215 105453 -71802 32761 221885 233816 -73772
17752 -224955 180817 21178 560422 405681 123023 -93647 137109 489271 336076 351452
17742 351452 100504 417947 49158 -31637 322698 239841 196417 51457 117892 19638 63781
17731 63781 -189248 37567 227432 -13107 242315 276835 344923 138288 395805 -5225 346514
17719 393419 -307963 21886 401516 162055 93313 269960 -82267 135773 82321 18927
17708 418444 230338 220466 -5063 5831 -272584 174110 216510 -12963 241762 235825 212712
17697 212712 217922 -37500 256722 -146303 371996 249205 116812 133294 -76891 64593 187877
$$ packed form
17775B56160A18861a0589k91800i9927l3398C01656j26382k6398K38752b8357
17764C15169h6109A03278J77131e1824A50215m4762g1802C2761J89124J1931g3772
17752b24955A80817B1178N39244j54741A23023i3647A37109L52162j53195J5376
17742C51452A00504L17443D9158c1637C22698q2857m3424E1457O6435A9638M4143
17731F3781a89248C7567J89865a3107B42315L4520O8088A38288K57517e225C46514
17719C93419c07963B1886L79630A62055o8742J76647h2267A35773n3452A8927
17708D18444j88106r872e063E831b72584A74110M2400a2963B41762n937k3113
17697B12712N210c7500B56722a46303C71996j22791A16812J6482g6891F4593J23284
$$ plain form
17686 187877 -58669 -140751 122743 225230 -39279 106772 157745 131583 118009 106288 36289
17674 392331 96810 105198 220446 47130 -42273 310022 205114 350752 13343 -25669 202721
17662 290606 192210 309331 259137 690885 497379 227288 58422 -33546 41009 186021
17652 186021 9467 586624 641110 51502 115390 186703 -227169 522560 -183178 -172394 120369
17640 -16494 100606 333901 11078 319667 195214 316897 128483 508917 -122613 48298
17629 9197 291088 192117 171573 461696 386211 305397 222864 286853 240233 57228 240577
17618 240577 125274 134857 243500 -190083 135861 3191 -76410 137952 -149950 551120
17607 194238 243942 315100 48234 -309630 187793 57030 123358 63820 -23996 32835 54651
$$ packed form
17686A87877e8669q2082A22743J02487c9279A06772N0973k6162j3574j1721C6289
17674C92331I6810Q388J15248D7130d2273C10022j04908J45638A3343b5669B02721
17662B90606r8396J17121n0194M31748j93506B27288E8422c3546D1009J45012
17652A86021I467N77157N4486E1502O3888P1313b27169E22560a83178J0784A20369
17640a6494A00606K33295A1078L08589j24453J21683A28483L80434a22613D8298
17629I197K81891r8971k0544K90123p5485q0814q2533O3989m6620E7228J83349
17618B40577j15303R583J08643a90083A35861C191g6410A37952a49950E51120
17607A94238M9704P1158D8234c09630A87793E7030O6328n9538b3996C2835K1816
$$ plain form
17596 54651 421503 286814 407536 78998 -116967 163119 3086 -252942 157753 -168417
17585 211765 238363 261230 210317 -56217 -95522 338675 84087 -41952 56677 209307 258056
17574 258056 204436 -50363 129194 -26473 150966 398289 347129 -34407 265977 491126
17564 491126 148223 191737 80156 304991 184146 402568 181998 324423 293881 196681
17554 196681 41085 -54756 99309 129030 9404 295581 -50256 65260 221724 -174977 331761
17542 -30599 6403 32932 250843 137937 72414 -236530 416188 451630 157204 -69729 286141
17530 344541 235646 51839 307029 225434 209230 212099 178083 497619 343291 267125 195761
17519 195761 -99378 -10846 76994 -27084 374949 214614 261993 -1387 417049 28689 -30671
$$ packed form
17596E4651L66852j34689J20722G8998a16967A63119C086b52942A57753a68417
17585B11765K6598K2867n0913e6217l9305C38675H4087d1952E6677J52630M8749
17574B58056n3620e0363A29194b6473A50966K47323n1160c4407B65977K25149
17564D91126A48223M3514H0156K24835j20845K18422A81998J42425l0542r7200
17554A96681D1085e4756I9309K9721I404K86177e0256F5260J56464a74977C31761
17542c0599F403K6529K17911j12906o5523b36530D16188L5442A57204f9729B86141
17530C44541j08895E1839K55190q1595j6204K869l4016L19536j54328p6166p1364
17519A95761i9378a0846G6994b7084C74949j60335M7379a387D17049B8689c0671
$$ plain form
17507 43247 469388 -170150 43374 354823 397199 174017 137432 98407 58524 407494 172536
17495 230601 266661 623980 467941 -195296 263917 159902 418041 50186 84482 284606
17485 284606 421882 242721 145046 -46141 213154 222359 383124 38637 193076 189327 285489
17474 285489 325530 238121 173651 290203 250573 18863 249100 338437 208493 375818 396465
17463 396465 12525 222612 337743 294642 174121 111889 149657 327922 426617 384436 23657
17451 242685 485875 291038 272197 142973 374804 559856 12688 512923 542801 318120
17441 318120 499151 501440 228501 84743 270031 273038 412836 200332 390642 -86334 324017
17429 313662 260302 362808 361562 297578 376904 403357 165620 272630 568877 369473 339107
$$ packed form
17507D3247M26141a70150D3374L11449M2376A74017l6585l9025l9883L48970A72536
17495B30601L6060L57319j56039a95296B63917j04015K58139E0186L4296K00124
17485B84606J37276j79161r7675d6141B13154R205J60765C8637J54439l749R6162
17474B85489M0041q7409o4470J16552l9630A8863K30237Q9337j29944J67325K0647
17463C96465A2525K10087J15131m3101j20521o2232L7768J78265R8695m2181B3657
17451B42685K43190j94837j8841j29224K31831J85052A2688N00235K9878k24681
17441C18120J81031K289B28501H4743J85288L007J39798B00332J90310h6334C24017
17429C13662n3360J02506j246o3984P9326K6453A65620J07010K96247j99404l0366
$$ plain form
17418 339107 524471 162048 419380 763479 304989 679375 422640 214643 132161 329411
17408 329411 412817 172771 199643 140220 172701 180494 475041 307426 408739 398370 58601
17396 585530 240723 488729 265295 89208 248665 95358 281517 348011 509548 292366
17386 292366 663525 330306 74026 360416 433663 159909 19756 282971 319852 -28560
17375 324064 520050 389407 -160101 -42971 339281 464570 263133 159015 455433 -82247
17364 314485 285653 377313 369670 444242 336392 340994 574856 689568 175131 318943 372353
17353 372353 384673 217566 534746 564245 82610 347822 233018 413217 188828 404905
17343 404905 812698 197202 549986 -232322 351484 253060 19341 140605 164609 425910
$$ packed form
17418C39107J85364A62048K57332L44099C04989L74386k56735k07997q2482J97250
17408C29411Q3406A72771K6872n9423L2481P793K94547j67615J01313j0369E8601
17396E85530B40723K48006k23434H9208J59457I5358J86159O6494J61537k17182
17386B92366L71159C30306G4026K86390P3247A59909A9756K63215L6881b8560
17375C24064J95986j30643a60101d2971C39281J25289k01437j04118K96418h2247
17364C14485k8832R1660p643P4572j07850M602K33862J14712A75131J43812N3410
17353C72353J2320j67107L17180K9499H2610K65212j14804J80199A88828K16077
17343D04905M07793A97202L52784b32322C51484r8424A9341J21264K4004K61301
$$ plain form
17333 425910 -99218 -1596 463843 -9619 281150 -177210 74371 321818 8502 416271 139414
17321 -39150 333151 20278 385707 98466 191552 450203 361007 325204 336844 -29849 565929
17309 106685 185902 155861 145514 374891 216321 138246 606536 303231 568963 301413
17299 301413 319295 392938 599896 343764 587724 112391 231776 333890 502279 570422
17289 570422 119997 366232 319955 487872 341185 -29508 335459 390559 615315 352519
17279 352519 320726 182846 521638 519235 318646 126240 76864 244051 -26903 99850 19607
17267 208523 173249 423995 558863 315927 330633 206396 172994 252655 213632 425967
17257 425967 -28100 427667 164866 620057 520808 378105 420819 353024 402932 82566 137385
$$ packed form
17333D25910i9218a596D63843i619B81150a77210G4371K47447H502M07769A39414
17321c9150C33151B0278L65429I8466R3086K58651q9196l5803J1640b9849E65929
17309A06685P9217l0041j0347K29377j58570p8075M68290C03231K65732k67550
17299C01413J7882P3643K06958k56132K43960A12391J19385J02114J68389O8143
17289E70422A19997K46235m6277J67917j46687b9508C35459N5100K24756k62796
17279C52519l1793j37880L38792k403k00589A26240m9376J67187b6903I9850A9607
17267B08523l5274K50746J34868k42936J4706j24237l3402P9661l9023K12335
17257D25967b8100D27667A64866M55191r9249j42703M2714o7795M9908H2566N4819
$$ plain form
17246 137385 324576 381402 381208 296231 232930 197030 447768 407686 749092 212788 187872
17235 187872 711166 68686 166231 485691 281415 242258 432147 656446 466276 370841
17225 370841 394736 407491 708131 305393 574139 122220 455672 417787 286156 586734
17215 586734 303210 317347 364184 373508 321630 401945 181244 497808 650167 492374 332735
17204 332735 320820 236901 569316 779401 561232 546822 223518 430619 376855 426525
17194 426525 414842 624972 557180 658370 338101 293379 23155 495125 209992 46164
17183 154774 219080 394852 392721 378533 419935 352146 599562 606587 785395 742224 532465
17172 532465 522848 569328 279522 360019 211836 383676 190420 576789 258863 694874
$$ packed form
17246A37385J87191N6826j94q4977o3301l5900K50738m0082L41406B12788k4916
17235A87872N23294F8686R7545L19460k04276l9157J89889K24299j90170r5435
17225C70841K3895J2755L00640C05393K68746A22220L33452l7885j31631L00578
17215E86734k83524J4137M6837R324n1878Q0315A81244L16564J52359j57793j59639
17204C32735j1915q3919L32415K10085k18169j4410B23518K07101n3764M9670
17194D26525j1683K10130o7792J01190l20269m4722B3155M71970B09992D6164
17183A54774O4306J75772k131j4188M1402o7789K47416P025J78808m3171k09759
17172E32465r617M6480B79522Q0497j48183J71840A90420L86369B58863M36011
$$ plain form
17162 694874 549145 241020 339516 335895 604445 308907 465201 296516 309766 493252
17152 493252 264884 251735 303461 412567 417502 429016 465392 276609 541093 498410 363739
17141 363739 422499 688740 417875 519552 498862 576613 295308 586272 543591 724903
17131 724903 871415 299147 782740 681935 580439 608298 540170 601332 720294 533269
17121 533269 435606 829298 610229 168337 485613 574101 721138 514974 591646 618209
17111 618209 725314 583112 592564 353370 631611 713601 451689 662635 651506 529964
17101 529964 649624 500733 414758 714851 740148 509162 623840 866918 785622 645759
17091 645759 638480 888742 458402 859964 618041 652346 948490 662125 973702 890989
$$ packed form
17162F94874j45729B41020R8496l621K68550k95538J56294j68685J3250J83486
17152D93252k28368j3149N1726J09106M935J1514L6376j88783K64484m2683j34671
17141C63739N8760K66241k70865J01677k0690P7751k81305K90964m2681J81312
17131G24903J46512B99147M83593j00805j01496K7859o8128O1162J18962j87025
17121E33269r7663L93692k19069A68337L17276Q8488J47037k06164P6672K6563
17111F18209J07105j42202R452k39194K78241Q1990k61912K10946j1129j21542
17101E29964J19660j48891q5975L00093K5297k30986J14678K43078q1296j39863
17091F45759p279K50262m30340M01562k41923L4305K96144k86365L11577q2713
$$ plain form
17081 890989 1018539 842081 1136809 798489 900633 1052626 817242 694304 803678 843228
17071 843228 845404 883268 930092 825826 641594 1175243 1181097 1243621 803734 861041 1014894
17060 1014894 616416 730579 336237 721429 806429 1009465 827845 943450 756520 706419
17050 706419 960840 871169 555478 723405 776535 824905 806815 870914 741065 920797
17040 920797 1118450 562888 788952 846444 924842 567701 662273 771316 925051 906622
17030 906622 952226 1058657 930935 746288 814996 857590 1130236 1010697 589681 989739
17020 989739 1132583 864288 870077 853958 1097381 967224 1051064 803309 999279 1126925
17010 1126925 898314 1061495 1007319 878478 853695 729018 1089518 965595 982470 1080929
$$ packed form
17081H90989J27550j76458K94728l38320J02144J51993k35384j22938J09374L9550
17071H43228K176L7864M6824j04266j84232N33649N854O2524m39887N7307J53853
17060A014894l98478J14163C36237L85192Q5000K03036j81620J15605j86930n0101
17050G06419K54421q9671l15691J67927N3130M8370j8090O4099j29849J79732
17040I20797J97653n55562K26064N7492P8398l57141R4572J09043J53735j8429
17030I06622M5604J06431j27722j84647O8708M2594K72646j19539m21016M00058
17020I89739J42844k68295N789j6119K43423j30157Q3840k47755J95970J27646
17010A126925k28611J63181n4176j28841k4783j24677L60500j23923J6875R8459
$$ plain form
17000 1080929 1105042 903310 1353296 783441 1110895 1132495 1156525 666952 1422820 881938
16990 881938 1133003 994520 1393755 1100884 1204862 1112923 1232798 1290752 1107343 1282489
16980 1282489 1079718 733963 1101562 1426374 1075600 1055172 1307325 1152167 1293227 1345671
16970 1345671 868283 1271796 1323823 1372133 1702058 1169541 1469517 1190751 1536448 1297533
16960 1297533 1500422 1424197 1674094 1300637 1167279 1498171 1181065 1356775 1157279 1205011
16950 1205011 1185206 1470889 1302004 1372908 1542810 1937951 1914972 1843757 1570301 1853355
16940 1853355 1416810 1728724 1325526 1560513 1557051 1733421 1374879 1812946 1565655 1703923
16930 1703923 1724344 1901697 1749047 1598268 1918566 1655564 2080820 1814347 1733778 1802143
$$ packed form
17000A080929K4113k01732M49986n69855L27454K1600K4030m89573P55868n40882
16990H81938K51065j38483L99235k92871J03978r1939J19875N7954j83409J75146
16980A282489k02771l45755L67599L24812l50774k0428K52153j55158J41060N2444
16970A345671m77388M03513N2027M8310L29925n32517K99976k78766L45697k38915
16960A297533K02889p6225K49897l73457j33358L30892l17106J75710j99496M7732
16950A205011j9805K85683j68885P0904J69902L95141k2979p1215k73456K83054
16940A853355m36545L11914m03198K34987l462J76370l58542M38067k47291J38268
16930A703923K0421J77353j52650j50779L20298k63002M25256k66473q0569O8365
$$ plain form
16920 1802143 1608925 1827921 1866798 1782621 1850546 1763829 2143450 1731479 2094763 2145542
16910 2145542 2166990 2107542 2019896 1894228 1677647 2290543 2164679 1738304 2061074 1986344
16900 1986344 2420193 2058652 2474734 2260400 2270494 2061336 2325981 2126076 2449437 2443322
16890 2443322 2412655 2279506 2645416 2798835 2886412 2747183 2563214 2739799 2576151 2559106
16880 2559106 2615690 3103568 2615362 2828464 2783792 2835850 3043822 2862491 2911650 3130186
16870 3130186 3154749 3106428 3135382 3129744 3196067 3183940 3178677 3493509 3522730 3605847 3412833
16859 3412833 3724040 3648253 3637551 3570005 3626371 3807418 3796934 4146792 4164770 4030980
16849 4030980 4413507 4033001 4372898 4572787 4413748 4483570 4196216 4466974 4585883 4536067
$$ packed form
16920A802143j93218K18996L8877q4177O7925q6717L79621m11971L63284N0779
16910B145542K1448n9448q7646j25668k16581O12896j25864m26375L22770p4730
16900A986344M33849l61541M16082k14334J0094k09158K64645j99905L23361o115
16890B443322l0667j33149L65910J53419Q7577j39229j83969J76585j63648j7045
16880B559106N6584M87878m88206K13102m4672N2058K07972j81331M9159K18536
16870C130186K4563m8321K8954n638O6323j2127n263L14832K9221Q3117j93014
16859C412833L11207p5787j0702o7546N6366J81047j0484L49858J7978j33790
16849D030980L82527l80506L39897J99889j59039O9822k87354K70758J18909m9816
$$ plain form
16839 4536067 4423050 4844077 4944871 4626803 4726116 5058989 5260287 5214566 5479428 5643437
16829 5643437 5432011 5419928 5547236 5419502 5945134 5873855 6104665 6070063 6085761 6479135
16819 6479135 6369091 6513841 6825287 6762791 6890355 6776069 6943102 7152105 7316057 7722361
16809 7722361 7403450 7591125 7853121 7975687 8335895 8577549 8629404 8772565 8684779 9074044
16799 9074044 9545151 9343125 9409067 9719659 10069963 10464084 10754417 10711619 11187204 11250628
16789 11250628 11955580 11917050 11946757 12147586 12745827 13271368 13509623 13625374 14175950 14887052
16779 14887052 14454113 14878268 15465696 15870231 16442230 16489904 17395739 17600312 17970768
16770 17970768 18929784 19158270 19852765 19969119 20851656 21725914 22372500 22557931 23611603
$$ packed form
16839D536067j13017M21027J00794l18068R9313L32873K01298m5721K64862J64009
16829E643437k11426j2083J27308j27734N25632p1279K30810l4602J5698L93374
16819F479135j10044J44750L11446o2496J27564j14286J67033K09003J63952M06304
16809G722361l18911J87675K61996J22566L60208K41654N1855J43161q7786L89265
16799I074044M71107k02026O5942L10592L50304L94121K90333m2798M75585O3424
16789A1250628P04952l8530K9707K00829N98241N25541K38255J15751N50576P11102
16779A4887052m32939M24155N87428M04535N71999M7674R05835K04573L70456
16770A7970768R59016K28486O94495J16354Q82537Q74258O46586J85431J053672
$$ plain form
16761 23611603 24148619 25123495 25963515 26376283 27533150 28501054 29255948 30343200 31559339
16752 31559339 32415740 33490364 34722469 35521083 37009464 38477584 39937283 41035149
16744 41035149 42835649 44560127 46045594 47765818 49755293 51600346 53777866 55606724
16736 55606724 57951784 60084831 62763422 65054310 67568574 70148145 72890027 75667594
16728 75667594 78519456 81570222 84880439 87477847 91033774 94153595 97141577 100418595
16720 100418595 103446391 106804041 109488032 112535238 114754608 117378525 119563503 121507569
16712 121507569 123397523 124818443 125768969 126064544 126667587 126771335 125874107 125103914 123887742
16703 123887742 122560423 120456352 118428383 116103994 113256014 110221824 107470690 104328312
$$ packed form
16761B3611603N37016R74876Q40020M12768J156867R67904P54894J087252J216139
16752C1559339Q56401J074624J232105P98614J488381J468120J459699J097866
16744D1035149J800500J724478J485467J720224J989475J845053K177520J828858
16736E5606724K345060K133047K678591K290888K514264K579571K741882K777567
16728G5667594K851862L050766L310217K597408L555927L119821K987982L277018
16720A00418595L027796L357650K683991L047206K219370K623917K184978J944066
16712A21507569J889954J420920R50526K95575O03043J03748q97228p70193j216172
16703A23887742j327319k104071k027969k324389k847980l034190k751134l142378
$$ plain form
16695 104328312 101244867 98051063 95125510 91774081 87944965 85273122 82098725 78910025
16687 78910025 76041232 72918327 69857785 67658411 64632676 62374858 59961234 57464961
16679 57464961 55191025 53090604 51018510 49007778 47249936 45420679 43951500 42072474
16671 42072474 40456901 39056000 37529254 35977561 34917278 33648588 32910554 31670518
16663 31670518 30831554 29612819 28483864 27661526 26373213 25853118 25088671 23986991 23627914
16654 23627914 22942967 22265139 21380502 21186828 19854976 19698231 19264749 18299378 18058768
16645 18058768 17369605 16931944 16469824 16023795 15894681 15475521 14957313 14733272 14483875
16636 14483875 13857299 13627596 13249144 12936378 12224713 12375628 12057481 11690014 11458960
$$ packed form
16695A04328312l083445l193804k925553l351429l829116k671843l174397l188700
16687G8910025k868793l122905l060542k199374l025735k257818k413624k496273
16679E7464961k273936k100421k072094k010732j757842j829257j469179j879026
16671D2072474j615573j400901j526746j551693j060283j268690p38034j240036
16663C1670518q38964j218735j128955q22338j288313n20095p64447j101680l59077
16654B3627914o84947o77828q84637j93674j331852j56745m33482r65371k40610
16645A8058768o89163m37661m62120m46029j29114m19160n18208k24041k49397
16636A4483875o26576k29703l78452l12766p11665J50915l18147l67467k31054
$$ plain form
16627 11458960 11526432 11079991 10650130 10657661 10226696 10264540 9717920 9790017 9238885 9562240
16617 9562240 8926002 9252283 8895670 8483085 8301053 7849888 8130824 8176558 7709199 7704978
16607 7704978 7334249 7212054 7291223 7156144 7276752 6746328 6892917 6975496 6463201 6324267
16597 6324267 6205883 6242894 5696342 6083105 5779055 5836695 5782592 5261371 5369775 5514075
16587 5514075 5245348 4928351 5031851 5340248 4963364 4880892 4812646 4942045 4883778 4941944
16577 4941944 4701833 4435215 4052277 4383935 4200412 4291203 3991317 4242202 4023978 3814386
16567 3814386 3835780 3964814 3430107 3749806 3814605 3650264 3924494 3656082 3702055 3384254
16557 3384254 3184369 3414071 3224555 2966838 3639030 3545158 2902629 3553485 3177996 3082138
$$ packed form
16627A1458960O7472m46441m29861P531m30965L7844n46620P2097n51132L23355
16617I562240o36238L26281l56613m12585j82032m51165K80936M5734m67359m221
16607G704978l70729j22195P9169j35079J20608n30424J46589Q2579n12295j38934
16597F324267j18384L7011n46552L86763l04050N7640n4103n21221J08404J44300
16587E514075k68727l16997J03500L08397l76884q2472o8246J29399n8267N8166
16577D941944k40111k66618l82938L31658j83523R0791k99886K50885k18224k09592
16567C814386K1394J29034n34707L19699O4799j64341K74230k68412M5973l17801
16557C384254j99885K29702j89516k57717O72192r3872o42529O50856l75489r5858
$$ plain form
16547 3082138 2813757 2882083 2902671 2929943 3052666 3085161 2502096 3138539 2991090 3036898
16537 3036898 2598099 2622706 2691817 2592423 2428933 2955038 2771373 2584508 2759214 2419483
16527 2419483 2368574 2341619 2489077 2488513 2184097 2444158 2513702 2457333 2487194 2308749 2310770
16516 2310770 2483181 2072717 2093791 1961659 2147067 2001356 2067074 2447231 2178813 1773163
16506 1773163 1819691 1726437 1714574 1838693 2130810 1873759 1939940 2075627 1699633 1805943
16496 1805943 1624870 1912947 1712008 1562052 1829765 1967547 1828543 1494764 1901272
16487 1901272 1647127 1824281 1307170 1419018 1457899 1603373 1950659 1821510 1589701 1419255
16477 1419255 1379333 1500691 1652419 1948703 1503131 1373936 1730537 1317311 1730432 1343117
$$ packed form
16547C082138k68381O8326K0588K7272J22723L2495n83065O36443j47449M5808
16537C036898m38799K4607O9111r9394j63490N26105j83665j86865J74706l39731
16527B419483n0909k6955J47458n64l04416K60061O9544n6369K9861j78445K021
16516B310770J72411m10464K1074j32132J85408j45711O5718L80157k68418m05650
16506A773163M6528r3254j1863J24119K92117k57051O6181J35687l75994J06310
16496A805943j81073K88077k00939j49956K67713J37782j39004l33779M06508
16487A901272k54145J77154n17111J11848L8881J45474L47286j29149k31809j70446
16477A419255l9922J21358J51728K96284m45572j29195L56601m13226M13121l87315
$$ plain form
16467 1343117 1479669 1324250 1584908 1672333 1454416 1425453 1476823 1057529 1451012 1513838
16457 1513838 1421008 1483579 1231992 1285327 1072020 1102129 1338210 1280859 1425548 964526
16447 964526 1400377 1443069 1268251 1166776 1302702 1213058 1504930 1025251 1120255 1117194
16437 1117194 746601 838298 1343191 1104744 1069850 1269093 1244284 1155845 982500 1121363
16427 1121363 1466866 1072454 852938 1210455 1033347 976389 1205225 1209685 1164191 1064142
16417 1064142 843643 1234474 1112881 633781 1032147 1098947 881904 1076760 1266006 1058210
16407 1058210 794961 1087644 1120293 1133902 1039511 985395 1172871 1053270 1174778 814892
16397 814892 958123 1035599 1123124 1024457 686203 1176345 753618 857706 673615 794733
$$ packed form
16467A343117J36552j55419K60658Q7425k17917k8963N1370m19294L93483O2826
16457A513838r2830O2571k51587N3335k13307L0109K36081n7351J44689m61022
16447I64526M35851M2692j74818j01475J35926q9644K91872m79679R5004l061
16437A117194l70593R1697N04893k38447l4894J99243k4809q8439j73345J38863
16427A121363L45503l94412k19516L57517j77108n6958K28836M460m5494j00049
16417A064142k20499L90831j21593m79100L98366O6800k17043J94856J89246k07796
16407A058210k63249K92683L2649J3609r4391n4116J87476j19601J21508l59886
16397H14892J43231P7476Q7525r8667l38254M90142m22727J04088j84091J21118
$$ plain form
16387 794733 985988 1056315 804080 808576 817020 870202 764986 1074620 867934 660873 1042016
16376 1042016 1110516 990609 645767 543924 778345 971753 780841 822589 561549 560483
16366 560483 714709 959579 587953 1006157 639858 1004432 790533 506742 893301 717499
16356 717499 1134227 841714 939340 714417 512770 854682 563857 587736 857063 478548
16346 478548 861255 675081 849103 563441 916085 1077283 594359 909329 862701 738797
16336 738797 647319 509409 1020175 630414 741789 788945 432366 599238 561671 703140
16326 703140 449482 846549 441783 452257 732522 1022292 602837 883495 529007 672360
16316 672360 382405 646013 704642 884028 874334 632338 627673 785969 364654 533345
$$ packed form
16387G94733J91255P0327k52235M496Q444N3182j05216L09634k06686k07061L81143
16376A042016O8500j19907l44842j01843K34421J93408j90912M1748k61040j066
16366E60483J54226K44870l71626M18204l66299L64574k13899k83791L86559j75802
16356G17499M16728k92513R7626k24923k01647L41912k90825K3879K69327l78515
16346D78548L82707j86174J74022k85662L52644J61198m82924L14970m6628j23904
16336G38797r1478j37910N10766l89761J11375M7156l56579J66872l7567J41469
16326G03140k53658L97067m04766J0474K80265K89770m19455K80658l54488J43353
16316F72360k89955K63608N8629J79386r694k41996m665J58296C64654J68691
$$ plain form
16306 533345 740401 887014 178678 589554 907095 733685 870315 304288 603673 892675
16296 892675 844910 324400 603764 385664 529108 889342 650329 554209 889251 551326
16286 551326 1051061 759029 540218 422662 517348 373058 549014 426945 694315 476193
16276 476193 541343 661076 377174 565986 587312 573026 514048 388987 568124 350616
16266 350616 628248 716428 947253 349681 350029 425240 450587 663671 658615 498547 784399
16255 784399 469252 55609 648666 320336 505683 198372 737736 665226 509601 581081
16245 581081 362681 357760 11364 490974 289485 -61078 99767 484789 275098 530416
16235 530416 597154 510443 595188 459362 -129399 306791 301579 429295 576828 633541 413523
$$ packed form
16306E33345K07056J46613A78678M10876L17541j73410J36630C04288K99385K89002
16296H92675m7765C24400K79364k18100J43444L60234k39013r6120L35042l37925
16286E51326M99735k92032k18811j17556R4686j44290J75956j22069K67370k18122
16276D76193O5150J19733k83902J88812K1326j4286n8978j25061J79137k17508
16266C50616K77632Q8180K30825C49681L48P5211K5347K13084n056j60068K85852
16255G84399l15147E5609N93057C20336J85347A98372N39364p2510j55625P1480
16245E81081k18400m921A1364M79610k01489f1078I9767L85022k09691K55318
16235E30416O6738q6711Q4745j35826a29399C06791n212J27716J47533N6713k20018
$$ plain form
16224 413523 493711 552407 154347 194348 282042 376274 445898 45070 435972 196254 153266
16213 153266 196218 389984 90274 213067 361663 438242 397903 -25240 513397 284815
16203 284815 211431 311257 218594 104630 197534 188682 334956 254352 370334 358221 426102
16192 426102 131154 207714 442809 387210 264937 246523 15285 109215 370143 -30096 528101
16180 -33949 287310 26946 308711 -9255 224680 521286 451044 498929 175442 164902 339643
16169 339643 402745 163711 12462 453235 69802 114555 1654 407361 306061 341371 357280
16158 357280 385403 92606 229843 -10932 540355 234583 36991 360711 136715 171459
16148 171459 209569 368709 233087 164920 314302 312643 -151638 245441 112360 306473
$$ packed form
16224D13523Q0188N8696A54347M0001Q7694R4232O9624D5070L90902A96254m2988
16213A53266M2952J93766I0274J22793J48596P6579m0339b5240E13397k28582
16203B84815p3384R9826r2663A04630R2904q852J46274q0604J15982j2113O7881
16192D26102A31154P6560K35095n5599j22273j8414A5285R3930K60928c0096E28101
16180c3949B87310B6946K81765i255B24680K96606p0242M7885A75442j0540J74741
16169C39643O3102A63711A2462M40773F9802M4753A654M05707j01300L5310J5909
16158C57280K8123I2606J37237a0932E40355B34583C6991L23720A36715L4744
16148A71459L8110J59140j35622o8167J49382j659a51638B45441A12360J94113
$$ plain form
16138 306473 55242 144127 375406 439548 112057 243435 416705 208406 313926 158899
16128 158899 475662 444861 63323 170924 222826 279987 221139 266000 -146263 193388 418928
16117 418928 364908 279066 126480 107741 343049 311117 345574 193334 177025 174620 196835
16106 196835 498816 180152 33841 429455 545005 307232 455566 122730 113751 497598
16096 497598 151762 -27551 97261 287802 374092 192443 166855 -294202 213441 572670
16086 572670 316663 104668 448836 338341 393597 576032 628867 445969 724135 542431
16076 542431 334888 13794 550579 304743 362896 239951 162960 -83992 141713 79563
16066 79563 11818 130991 175381 80837 195604 253707 216735 159185 -78267 37214 471179
$$ packed form
16138C06473E5242Q8885K31279O4142A12057J31378J73270k08299J05520j55027
16128A58899L16763l0801F3323J07601N1902N7161n8848M4861a46263A93388K25540
16117D18928n4020q5842A26480j8739K35308l1932L4457j52240j6309k405K2215
16106A96835L01981A80152C3841L95614J15550k37773J48334A22730q979L83847
16096D97598A51762b7551I7261J90541Q6290j81649k5588b94202B13441L59229
16086E72670k56007A04668L44168j10495N5256J82435N2835j82898K78166j81704
16076E42431k07543A3794N36785k45836N8153j22945p6991h3992A41713o2150
16066G9563A1818J19173M4390H0837J14767N8103l6972n7550g8267C7214M33965
$$ plain form
16055 471179 25685 134266 60561 165039 325221 552765 818386 705024 627033 234069
16044 477775 185627 99024 174890 -2396 197897 247549 68204 222872 -134345 149554 193313
16033 193313 222929 25883 40358 248917 330210 137008 333507 -20197 45251 -59186 -65166
16022 -65166 -139979 299611 -219179 -128040 -156809 358194 80300 309655 301604 -26497 -228580
16011 -228580 205043 260442 131608 -41830 -145424 -38825 54594 28805 76186 212461 307310
16000 307310 -127973 287452 68594 240176 -373689 198394 393793 -5084 114935 139731
15990 139731 178719 193298 11715 264449 -42453 -90801 333511 266995 -10909 -13636 198792
15978 84439 68089 132018 -172182 321094 -131534 482626 4119 -84673 -46720 -66829 -49927
$$ packed form
16055D71179B5685J08581F0561J04478J60182K27544K65621j13362p7991B34069
16044D77775A85627q6603P5866b396A97897M9652F8204J54668a34345A49554M3759
16033A93313K9616B5883J4475K08559Q1293A37008J96499b0197D5251e9186n980
16022f5166p4813B99611b19179R1139k8769C58194H0300K29355q051b6497k02083
16011b28580B05043N5399j28834d1830j03594c8825E4594k5789M7381J36275R4849
16000C07310a27973B87452F8594J71582c73689A98394J95399e084A14935K4796
15990A39731L8988J4579A1715K52734d2453m8348C33511o6516a0909k727A98792
15978H4439j6350O3929a72182C21094a31534D82626D119h4673L7953k0109J6902
$$ plain form
15967 -49927 96446 -10239 -30917 67549 204679 17074 73390 30282 134718 444561 314974
15956 314974 -314714 192598 -31872 -301415 228339 43436 32487 -36739 122553 160167
15946 160167 -148133 68630 212857 -154439 275998 187733 170368 -83872 267669 62283
15935 311097 72596 -98172 212707 62644 286063 -60467 -97117 -299113 -52598 -116056 108505
15923 191277 -35542 -46803 410795 -6721 -85381 -97483 366297 -201409 30237 253243 276615
15912 276615 -109333 -127203 -451481 4022 19940 -369780 -26870 -33899 129114 -38648 -55333
15901 -55333 21688 -265996 -181470 2235 -37720 -132872 -99922 -81015 -20281 -101566 398544
15889 -22675 -101913 -326562 74769 -196558 -2864 141865 3302 293059 -48010 -108262 29102
$$ packed form
15967d9927I6446a0239k0678F7549J37130A7074N6316C0282J04436L09843j29587
15956C14974c14714A92598c1872k69543B28339D3436j0949c6739A22553L7614
15946A60167a48133F8630J44227a54439B75998q8265j7365h3872B67669F2283
15935C11097G2596i8172B12707F2644K23419f0467l6650k01996e2598o3458A08505
15923A91277c5542j1261D10795f721p8660j2102C66297b01409C0237K23006K3372
15912B76615a09333j7870l24278D022J5918c69780b6870p029A29114c8648j6685
15901e5333B1688b65996Q4526B235c7720r5152L2950J8907b0281q1285C98544
15889b2675p9238k24649G4769a96558b864A41865C302K89757d8010o0252B9102
$$ plain form
15877 120840 -17043 -36456 67976 379836 219661 119450 131361 128945 -38450 36111 -33322
15865 288650 -78408 -47617 -125577 -184111 -42815 167738 -24875 257251 35852 -193312 452624
15853 -147812 278860 119499 -258496 121760 -149158 58259 64988 228477 291366 324902
15843 324902 94810 341362 302212 178897 99514 184189 71140 67296 65187 -49818 -78151
15832 -78151 283931 -77912 -116243 -156740 450185 -144948 -5593 146446 -3120 50575 202961
15821 202961 -180121 76118 -3264 -33068 -197629 -95750 -11437 36526 32252 125924 45701
15809 -83170 -142246 -234536 47157 -141914 244313 188483 -327256 -114112 -219375 -401330
15799 -401330 138 283366 -140914 48204 -151882 154896 156396 -20049 -14593 -33471 59757
$$ packed form
15877A20840a7043j9413F7976L11860j60175j00211J1911k416c8450C6111c3322
15865B88650g8408L0791p7960n8534d2815A67738b4875B57251C5852a93312D52624
15853a47812B78860A19499b58496A21760a49158E8259O729J63489O2889L3536
15843C24902I4810K46552l9150j23315p9383Q4675G1140l844k109d9818k8333
15832g8151B83931g7912l8331m0497D50185a44948e593A46446c120E0575J52386
15821B02961a80121G6118c264k9804j64561i5750a1437C6526m274R3672D5701
15809h3170n9076r2290D7157a41914B44313n5830c27256a14112j05263j81955
15799d01330A38K83228a40914D8204a51882A54896J500b0049N456j8878E9757
$$ plain form
15787 -71500 89904 99985 -12028 -17167 159147 -83013 -174807 -21054 -179230 293704 -190096
15775 180739 390547 -9327 48942 -36078 62251 69025 118089 84390 324858 -53994 -76833
15764 -76833 255935 5655 15580 142116 349053 -121464 17639 74133 -71654 -8924 -20231
15753 -20231 130391 -306849 391856 123244 -133439 -279531 -52088 53052 289686 169954
15743 169954 117668 87776 131615 208675 14983 -55170 339 192350 -292542 172948 241287
15732 241287 268616 445735 259940 -92277 34552 -47750 14334 196349 239803 -69036 323398
15720 8914 -68936 281145 207109 -35620 -10408 -178494 95112 -208678 75109 143765 132065
15709 132065 196704 285282 262090 346158 411619 283084 91626 52369 179608 -4992 -167492
$$ packed form
15787g1500H9904J0081a2028n139A59147h3013r1794b1054j58176B93704a90096
15775A80739K09808i327D8942c6078F2251O774M9064l3699K40468e3994k2839
15764g6833B55935E655R925J26536K06937a21464A7639N6494g1654h924j1307
15753b0231A30391c06849C91856A23244a33439j46092e2088E3052K36634j19732
15743A69954n2286k9892M3839P7060A4983e5170C39J92011b92542A72948O8339
15732B41287K7329J77119j85795i2277C4552d7750A4334J82015M3454f9036C23398
15720H914f8936B81145p4036c5620a0408j68086I5112b08678G5109O8656j1700
15709A32065O4639Q8578k3192Q4068O5461j28535I1626l9257J27239d992j62500
$$ plain form
15698 -167492 440710 -135659 1076 -78760 94020 219069 19692 223567 -13802 211861 345121
15687 345121 186505 314715 -193950 -84718 484853 248925 137261 170614 -30453 283472
15676 147114 186788 -51837 1465 -87819 142341 59052 19904 189400 262665 119002 -163044
15664 216622 266928 4310 32641 -74471 -60196 -284698 210320 -448175 -11266 -158201 305969
15652 52775 135494 217969 166097 446207 -51863 137136 390700 30264 146510 211860 -62169
15640 -79529 118140 123702 285757 274925 -18078 36862 -98482 163353 135051 -153863 -64844
15628 30891 -21180 -80345 -298711 -197119 -76053 171771 184182 4012 -270585 63145 187692
15617 187692 84018 22389 -182792 -134177 291241 121170 127677 327433 129862 -176738
$$ packed form
15698a67492D40710a35659A076g8760I4020J25049A9692K03875a3802B11861J33260
15687C45121j58616J28210a93950h4718D84853k35928j11664L3353c0453B83472
15676A47114L9674e1837A465h7819A42341E9052A9904J69496P3265A19002a63044
15664B16622N0306D310K8331g4471J4275k24502B10320d48175a1266j46935C05969
15652E2775Q2719Q2475n1872K80110e1863A37136K53564C0264J16246O5350f2169
15640g9529A18140N562J62055j0832a8078C6862i8482A63353k8302a53863f4844
15628C0891b1180n9165k18366J01592g6053A71771J2411D012b70585F3145J24547
15617A87692H4018B2389a82792M8615B91241A21170O507J99756A29862a76738
$$ plain form
15606 464571 227798 19806 -124156 277118 247341 183914 123423 -35151 278675 158442
15596 158442 155871 -6986 155750 17805 171808 240254 108352 216818 238476 36421 162978
15585 162978 137344 41343 163131 446193 -420971 -56356 11090 -210802 214305 272553
15575 272553 38757 53406 135890 79605 46225 56385 262270 10819 145167 -32312 -108987
15564 -108987 -57924 114120 28882 195173 -71697 -60576 -82682 299622 -98652 33965 -232188
15552 8047 100387 -16575 -115841 165882 -13177 -81690 -67139 27703 91561 409624 67615
15540 214648 211488 73394 349344 346679 488949 -11318 -128656 12741 302521 110111 196857
15529 196857 243829 156672 48107 312968 -70663 60933 140067 217054 -1271 52222 326399
$$ packed form
15606D64571B27798A9806a24156B77118k9777o3427o0491c5151B78675j20233
15596A58442k571f986A55750A7805J54003O8446A08352J08466K1658C6421J26557
15585A62978k5634D1343J21788K83062d20971e6356A1090b10802B14305N8248
15575B72553C8757J4649Q2484n6285l3380J0160K05885A0819J34348c2312p6675
15564a08987N1063A14120B8882J66291g1697J1121k2106B99622i8652C3965b32188
15552H047R2340a6575r9266A65882a3177o8513J4551B7703O3858L18063F7615
15540B14648l160G3394K75950k665J42270a1318j17338A2741K89780A10111Q6746
15529A96857M6972q7157D8107K64861g0663F0933P9134P6987a271E2222K74177
$$ plain form
15518 326399 70677 101672 371821 -200693 106789 208591 386399 398567 -69487 341290
15507 -83222 122421 -111602 -170195 -33476 280251 344127 241485 167592 -6514 75689 -33440
15495 241979 75680 -152923 9433 325353 134763 236138 586 327359 97317 -86290 98257
15483 348072 115128 102350 -47888 -300985 159255 209499 346114 97425 44855 352308
15473 352308 236547 242976 428529 173664 157941 245935 165656 34513 64125 285024 200706
15462 200706 138769 702936 55252 416844 268785 12710 351274 512590 42215 381803
15452 381803 -34049 11215 -101308 -253757 96671 220448 -145762 122982 273377 396243
15442 396243 82350 5945 -103429 314648 232140 285016 470681 -16432 -46833 56991 212848
$$ packed form
15518C26399G0677L0995K70149b00693A06789J01802J77808J2168f9487C41290
15507h3222A22421a11602n8593c3476B80251O3876j02642p3893f514G5689c3440
15495B41979G5680a52923I433L15920A34763J01375E86L26773I7317h6290I8257
15483C48072A15128j2778d7888k53097A59255N0244J36615I7425D4855L07453
15473C52308j15761O429J85553A73664j5723Q7994q0279C4513K9612K20899q4318
15462B00706o1937N64167E5252L61592j48059A2710L38564J61316D2215L39588
15452C81803c4049A1215a01308j52449I6671J23777a45762A22982J50395J22866
15442C96243H2350E945a03429C14648q2508N2876J85665a6432l0401E6991J55857
$$ plain form
15431 212848 323164 113790 346064 189773 -27288 179715 175459 151582 133957 42393 247634
15420 247634 318792 25906 37646 137203 142451 209173 92233 319332 161853 101172 272802
15409 272802 517162 427592 381721 130818 435416 -12229 -223779 63838 14764 91899 -29075
15397 68747 -6200 -54351 176356 140301 252773 255918 202177 73218 277672 198179 299629
15386 299629 -136807 163763 347973 -204486 246650 350786 176480 272105 199772 157941
15376 157941 379179 430795 176377 640360 255215 237743 617161 291580 111629 250596
15366 250596 75557 265177 390638 294557 316037 474080 293049 457934 451994 283908
15356 283908 175467 377390 178183 85519 289379 270821 451729 105336 134659 97432
$$ packed form
15431B12848J10316A13790K32274j56291b7288A79715m256k3877j7625D2393K05241
15420B47634P1158B5906J1740R9557N248O6722I2233K27099j57479o0681J71630
15409B72802K44360q9570m5871A30818L04598a2229k11550F3838A4764P7135b9075
15397F8747f200m8151A76356l6055J12472L145n3741G3218K04454p9493J01450
15386B99629a36807A63763J84210b04486B46650J04136j74306R5625p2333m1831
15376A57941K21238N1616A76377M63983B55215j7472L79418B91580A11629J38967
15366B50596G5557J89620J25461r6081K1480J58043j81031J64885n940j68086
15356B83908j08441K01923A78183H5519K03860j8558J80908A05336K9323l7227
$$ plain form
15346 97432 350348 266615 329012 347905 466219 510201 252990 80254 45312 283747 296419
15335 296419 342830 342476 121644 484224 144756 407267 -71574 324416 21101 11096 352125
15324 352125 419294 323877 273159 483785 123832 -144307 413972 155840 99077 358306
15314 358306 419899 939036 358445 513663 277437 417529 462814 310532 357382 439034
15304 439034 457708 271275 12112 53563 191052 384764 218436 347194 37577 307269
15294 307269 411934 192269 375173 193404 197937 464201 46423 147878 301563 673470
15284 673470 263221 507298 157570 487366 281104 316023 188774 585957 366320 178159
15273 315306 290946 337709 140038 682210 116639 88120 486111 376309 423891 596245
$$ packed form
15346I7432K52916q3733O2397J8893J18314M3982B52990H0254l4942K38435J2672
15335B96419M6411l54A21644L62580A44756K62511g1574C24416B1101j0005L41029
15324C52125O7169r5417n0718K10626A23832a44307D13972A55840n6763K59229
15314C58306O1593N19137C58445J55218k36226J40092M5285j52282M6850Q1652
15304D39034J8674j86433A2112M1451J37489J93712j66328J28758C7577K69692
15294C07269J04665A92269J82904j81769M533K66264D6423J01455J53685L71907
15284F73470B63221K44077A57570L29796k06262L4919j27249L97183k19637A78159
15273C15306k4360M6763A40038N42172A16639k8519L97991j09802M7582J72354
$$ plain form
15263 596245 298619 347481 404650 525242 491774 675057 287102 810446 516232 477324
15253 477324 934719 1020320 1648375 1321747 1508078 1207555 1551696 912406 756791 519386
15243 519386 37678 151808 309638 250083 210735 425915 305469 383566 484992 327874
15233 327874 93382 262228 -26621 174834 652331 209407 276369 298949 23842 196111
15223 196111 218317 23541 507175 432429 130728 319101 277100 541801 473224 120246
15212 241155 373787 231810 238563 260365 159094 163147 311503 -44835 341989 206891 34112
15200 396230 174693 -217424 113753 360353 264087 -90236 -32749 44284 -2939 126428 455138
15189 455138 386363 348428 272696 584134 439917 429215 398350 432185 316239 451382 300433
$$ packed form
15263E96245k97626M8862N7169J20592l3468J83283B87102N23344k94214l8908
15253D77324M57395Q5601O28055l26628J86331l00523L44141o39290j55615k37405
15243E19386C7678J14130J57830n9555l9348K15180j20446P8097J01426j57118
15233C27874I3382J68846b6621A74834M77497B09407O6962K2580B3842J72269
15223A96111K2206B3541M83634p4746A30728J88373m2001K64701o8577A20246
15212B41155J32632j41977O753K1802j01271M053J48356d4835C41989j35098C4112
15200C96230A74693b17424A13753K46600r6266i0236c2749D4284b939A26428L28710
15189D55138o8775l7935p5732L11438j44217j0702l0865L3835j15946J35143j50949
$$ plain form
15178 300433 162426 617854 421506 322922 341185 707224 564585 435702 719720 462759
15168 462759 522983 209376 220390 301611 381148 336248 527951 595801 576026 436819 457162
15157 457162 492620 373950 522475 704314 64663 321029 279508 490040 524181 159345
15146 240879 542065 284049 198828 403169 467692 322690 268926 520194 358919 333743
15136 333743 253119 501588 591100 593275 129108 439042 86920 226631 169876 265844 253479
15125 253479 333768 334754 233218 564494 647393 770933 490246 368575 224820 744528
15115 744528 615491 358174 158009 496684 292824 414207 290547 781792 699621 376068
15105 376068 471025 507033 493075 281335 800082 516231 442799 898633 655941 558340
$$ packed form
15178C00433j38007M55428j96348r8584J8263L66039j42639j28883K84018k56961
15168D62759O0224B09376J1014Q1221P9537m4900J91703O7850j9775j39207K0343
15157D57162L5458j18670J48525J81839F4663K56366m1521K10532L4141A59345
15146B40879L01186k58016q5221K04341O4523j45002n3764K51268j61275k5176
15136C33743q0624K48469Q9512K175A29108L09934H6920J39711n6755R5968j2365
15125B53479Q0289R86j01536L31276Q2899J23540k80687j21671j43755N19708
15115G44528j29037k57317A58009L38675k03860J21383j23660M91245q2171l23553
15105C76068R4957L6008j3958k11740N18747k83851p3432M55834k42692r7601
$$ plain form
15095 558340 707559 512874 593923 417798 335952 772027 462314 167366 664691 506416
15085 506416 517373 268912 585151 325753 295477 589344 568148 637880 419085 453338
15075 453338 374765 221628 385058 327951 484190 700672 786633 495584 626982 531483
15065 531483 208779 518263 327501 491237 654770 621447 662161 591911 758170 810917
15055 810917 705079 687538 1015683 834525 628362 796669 857705 1182236 760042 792102
15045 792102 868807 944228 898400 826914 1067198 588700 648790 687376 781224 597757 723159
15034 723159 189425 866600 653446 238812 311112 593634 294114 680422 362149 794209
15024 794209 138311 632741 513664 506668 506247 604688 302907 392723 607181 642999 596983
$$ packed form
15095E58340J49219j94685Q1049j76125q1846M36075l09713A67366M97325j58275
15085E06416J0957k48461L16239k59398l0276K93867k1196O9732k18795L4253
15075D53338p8573j53137J63430n7107J56239K16482Q5961k91049J31398r5499
15065E31483B08779L09484j90762J63736J63533l3323M0714p0250J66259N2747
15055H10917j05838j7541L28145j81158k06163J68307O1036L24531m22194L2060
15045G92102P6705P5421m5828p1486K40284m78498O0090L8586R3848j83467J25402
15034G23159A89425O77175k13154B38812P2300K82522B94114L86308l18273M32060
15024G94209A38311M94430j19077o996m21R8441l01781Q9816K14458L5818m6016
$$ plain form
15013 596983 719919 523631 793604 765886 427777 894741 584529 828602 489558 584068
15003 584068 588346 472582 559882 354336 730634 914972 455314 529241 442323 135660
14992 544339 908307 358015 609953 811678 289759 559794 794164 656251 927888 686786
14982 686786 733257 1109799 487742 751441 869467 425340 837735 336013 609531 783222
14972 783222 811478 609460 982063 829583 684205 926652 537023 538568 622539 639149
14962 639149 698627 693237 676345 995200 1011953 1040113 882739 1096277 863892 906449 933719
14951 933719 870819 737673 964165 909976 758949 813204 1085319 961897 892816 802333
14941 802333 1001934 783371 1277677 943212 1119330 1005006 876232 835015 862702 1299937
$$ packed form
15013E96983J22936j96288K69973k7718l38109M66964l10212K44073l39044R4510
15003E84068M278j15764Q7300k05546L76298J84338D55314P3927q6918A35660
14992E44339L63968C58015K51938K01725B89759K70035K34370j37913K71637k41102
14982F86786M6471L76542D87742K63699J18026D25340M12395C36013K73518J73691
14972G83222K8256k02018L72603j52480j45378K42447l89629J545Q3971J6610
14962F39149N9478n390j6892L18855J6753K8160j57374K13538k32385M2557K7270
14951I33719o2900j33146K26492n4189j51027N4255K72115j23422o9081r0483
14941H02333J99601k18563M94306l34465J76118j14324j28774m1217K7687M37235
$$ plain form
14931 1299937 698489 1021911 818616 670689 364416 771788 709298 861352 790907 888146
14921 888146 1053704 1181449 326779 784428 577952 704015 650960 1104765 1018487 650051
14911 650051 886756 684174 894481 621975 501714 700369 629051 465025 604588 527598
14901 527598 906697 352575 618716 725300 866910 805538 772366 705026 587530 557556
14891 557556 515894 629489 678430 510855 871656 695340 592096 599019 701578 740594
14881 740594 391440 771134 764089 612722 688998 809120 813176 566897 386912 885621
14871 885621 880971 466853 785723 772638 1134323 1056953 898178 868101 825665 766240 878466
14860 878466 728294 774334 822585 582483 986449 627309 779255 993237 944344 939924
$$ packed form
14931A299937o01448L23422k03295j47927l06273M07372o2490J52054p0445R7239
14921H88146J65558J27745C26779M57649k06476J26063n3055M53805q6278l68436
14911F50051K36705k02582K10307k72506j20261J98655p1318j64026J39563p6990
14901E27598L79099C52575K66141J06584J41610o1372l3172o7340j17496k9974
14891E57556m1662J13595M8941j67575L60801j76316j03244O923J02559L9016
14881G40594l49154L79694p045j51367P6276J20122M056k46279j79985M98709
14871H85621m650m14118L18870j3085L61685p7370j58775l0077m2436n9425J12226
14860H78466j50172M6040M8251k40102M03966l59140J51946K13982m8893m420
$$ plain form
14850 939924 1285016 1484087 1011755 822856 875481 1080060 1075301 891324 722741 1242069
14840 1242069 1098849 446804 1032998 899036 838649 1139000 993107 507034 700886 947411
14830 947411 972708 842220 890986 1035191 1051115 1188870 962715 882201 1156443 1158872 1068210
14819 1068210 998561 769931 1070931 733723 897668 903388 1026379 854695 1140240 710824
14809 710824 775605 966220 721223 640101 877947 801034 1038157 679261 834992 868182
14799 868182 1318154 1259742 999040 1211767 1182256 1241910 1368471 1156347 1109423 916417
14789 916417 1023839 1444206 1455261 1469059 1388314 1344595 1383369 1425570 1558322 1636469 1234631
14778 1234631 981306 1241529 1045012 1337493 1284118 1356126 1320700 1190610 1207387 1344631
$$ packed form
14850I39924L45092J99071m72332j88899N2625K04579m759j83977j68583N19328
14840A242069j43220D46804N86194j33962o0387L00351j45893m86073J93852K46525
14830I47411K5297j30488M8766J44205J5924J37755k26155q0514K74242K429r0662
14819A068210o9649k28630L01000l37208J63945N720J22991j71684K85545m29416
14809G10824O4781J90615k44997q1122K37846p6913K37123l58896J55731L3190
14799H68182M49972n8412k60702K12727k9511N9654J26561k12124m6924j93006
14789I16417J07422M20367J1055J3798q0745m3719L8774M2201J32752P8147m01838
14778A234631k53325K60223j96517K92481n3375P2008l5426j30090J6777J37244
$$ plain form
14768 1344631 1188816 989627 1130811 1226877 1169923 1106162 1375585 1028156 1128623 1131322
14758 1131322 911305 1279697 889330 1455428 744196 1074680 606598 1114727 1329948
14749 1329948 1332742 1068030 1493224 1491255 1579514 1371589 1094753 1195018 614470 1202332
14739 1202332 896565 1009939 1023338 1450845 1040811 1239739 1045960 1142345 1062066 1445609
14729 1445609 947604 1399867 1524519 1203420 1421808 1470632 1288122 1341397 1365785 1316138
14719 1316138 1508404 1205172 1383078 1042502 1152422 1050099 758677 1180603 1085047 1026156
14709 1026156 1036310 1097011 1218957 1001466 1091922 1091141 1252330 946992 1078939 1361645
14699 1361645 1404380 1269353 1157927 1148232 1564757 1369451 1483672 1213724 1108606 1416141
$$ packed form
14768A344631j55815j99189J41184R6066n6954o3761K69423l47429J00467K699
14758A131322k20017L68392l90367N66098p11232L30484m68082N08129K15221
14749A329948K794k64712M25194j969Q8259k07925k76836J00265n80548N87862
14739A202332l05767J13374J3399M27507m10034J98928j93779R6385q0279L83543
14729A445609m98005M52263J24652l21099K18388M8824j82510N3275K4388m9647
14719A316138J92266l03232J77906l40576J09920j02323k91422M21926r5556n8891
14709A026156J0154O0701J21946k17491R0456p81J61189l05338J31947K82706
14699A361645M2735j35027j11426r695M16525j95306J14221k69948j05118L07535
$$ plain form
14689 1416141 1379499 1329939 803829 1071907 1022781 1205562 1323921 1477208 1035029 1184725
14679 1184725 912648 1136359 1521143 1161661 1517201 849189 1102262 1509672 816057
14670 816057 1078673 800027 1218777 983585 1152385 1270953 1539666 1077153 1017420 1339053
14660 1339053 1050666 1376770 1017381 1345895 1260692 1293765 1150596 1037194 1243735 1421339
14650 1421339 843804 1345354 1578034 1390113 1038736 1217396 1400345 1440487 1351585 1378838
14640 1378838 1344662 1307665 1368894 1278908 1391761 1436821 1549443 1074792 1654942 1218623
14630 1218623 1540902 1049647 1354188 1165210 1526919 1641325 1561654 1607470 1731749 1458826
14620 1458826 1407126 1304804 1629421 1510886 1625091 1469565 1183539 1292225 1651570 938638
$$ packed form
14689A416141l6642m9560n26110K68078m9126J82781J18359J53287m42179J49696
14679A184725k72077K23711L84784l59482L55540o68012K53073M07410o93615
14670H16057K62616k78646M18750k35192J68800J18568K68713m62513n9733L21633
14660A339053k88387L26104l59389L28514q5203L3073j43169j13402K06541J77604
14650A421339n77535N01550K32680j87921l51377J78660J82949M0142q8902K7253
14640A378838l4176l6997O1229q9986J12853M5060J12622m74651N80150m36319
14630A218623L22279m91255L04541j88978L61709J14406p9671M5816J24279k72923
14620A458826n1700j02322L24617j18535J14205j55526k86026J08686L59345p12932
$$ plain form
14610 938638 1453867 1538525 1338700 1327945 1070376 1328336 1389206 1575270 1877010 1705924
14600 1705924 1111192 1721513 1545407 1682572 1831250 1545506 1645158 1984623 1807443 1754693
14590 1754693 1587517 1846217 1773944 1690499 1969933 1730338 1956188 2118501 1918808 1855634
14580 1855634 1972565 1783011 1892624 1843003 2349356 1745013 1898530 2169796 2116253 2241801
14570 2241801 2241447 2143007 2293370 2394100 2354807 2499035 2190665 2350277 2608251 2553276
14560 2553276 2645447 2854306 2936626 3120711 3478137 3333867 3818922 4382514 4646133 5458178
14550 5458178 7292861 10422129 15935594 22716127 30645193 32396856 20861344 10080442
14541 5136245 3315464 2556741 2133593 1908331 2060527 1894057 2172284 1834940 2091280
$$ packed form
14610I38638N15229Q4658j99825j0755k57569K57960O0870J86064L01740j71086
14600A705924n94732O10321j76106J37165J48678k85744R9652L39465j77180n2750
14590A754693j67176K58700p2273q3445K79434k39595K25850J62313j99693o3174
14580A855634J16931j89554J09613m9621N06353o04343J53517K71266n3543J25548
14570B241801l54r8440J50363J00730l9293J44228l08370J59612K57974n4975
14560B553276R2171K08859Q2320J84085L57426j44270M85055N63592K63619Q12045
14550E458178J834683L129268N513465O780533P929066J751663j1535512A0080442
14541E136245j820781p58723m23148k25262J52196j66470K78227l37344K56340
$$ plain form
14532 2091280 2280334 2197785 2149993 1903019 2020547 2306279 2455971 2063863 2072800 2470014
14522 2470014 2259004 2209793 2434796 2256624 2287965 2843197 2425406 2462095 2438999 2436100
14512 2436100 2758800 2397157 2641042 2558263 3060272 2409360 2722101 2769277 3034499 2722050
14502 2722050 2796045 3099776 3450182 3269090 3145990 3340981 3434260 3432404 3180562 3660767
14492 3660767 3345645 3347497 3259609 3233941 3546367 3817851 3381903 3542690 3910741 3498046
14482 3498046 3964397 3947908 3837966 3536350 3706056 3932645 3711204 3625465 3941445 4067875
14472 4067875 4024379 4183902 4011562 4174373 4041410 4147122 4394558 4359408 4359401 4466090 4469439
14461 4469439 4667551 4523635 4656642 4840606 4556744 4754951 4814931 4554949 5071384 4977555
$$ packed form
14532B091280J89054q2549m7792k46974J17528K85732J49692l92108Q937L97214
14522B470014k11010m9211K25003j78172L1341N55232m17791L6689k3096k899
14512B436100L22700l61643K43885q2779N02009o50912L12741M7176K65222l12449
14502B722050P3995L03731L50406j81092j23100J94991R3279j856k51842M80205
14492C660767l15122J852q7888k5668L12426K71484m35948J60787L68051m12695
14482C498046M66351j6489j09942l01616J69706K26589k21441q5739L15980J26430
14472D067875m3496J59523j72340J62811j32963J05712K47436l5150pJ06689L349
14461D469439J98112j43916J33007J83964k83862J98207N9980k59982N16435r3829
$$ plain form
14451 4977555 5091796 5397207 5248594 5128409 5279559 5362241 5257900 5342422 5504681 5512043
14441 5512043 5658405 5655304 5943780 5783359 6052004 5844830 6303082 6086053 6397175 6507218
14431 6507218 6244333 6307230 6781067 6550783 7045045 6823302 7174421 7465646 7083603 7462157
14421 7462157 7352596 7582833 7629084 7889055 7722563 7686981 7860150 8039057 8159503 8444474
14411 8444474 8479650 8492755 8265803 8646817 8978902 9001271 9307606 9473323 9503491 9484375
14401 9484375 9978834 9840395 10492749 10076387 10235976 10511629 10935479 11181709 11045020
14392 11045020 11143307 11703570 11672100 11900154 12491279 12248994 12512550 12924756 13248773 13234156
14382 13234156 13786812 13737682 14238897 14438861 14749510 15034931 14924708 15342761 15953921
$$ packed form
14451D977555J14241L05411j48613j20185J51150Q2682j04341Q4522J62259P362
14441E512043J46362l101K88476j60421K68645k07174M58252k17029L11122J10043
14431F507218k62885O2897M73837k30284M94262k21743L51119K91225l82043L78554
14421G462157j09561K30237M6251K59971j66492l5582J73169J78907J20446K84971
14411H444474L5176J3105k26952L81014L32085K2369L06335J65717L0168j9116
14401I484375M94459j38439O52354m16362J59589K75653M23850K46230j36689
14392A1045020R8287N60263l1470K28054N91125k42285K63556M12206L24017j4617
14382A3234156N52656m9130N01215J99964L10649K85421j10223M18053O11160
$$ plain form
14373 15953921 16163971 16303948 16701496 17204378 17650185 17636934 18346833 18669096 18832695
14364 18832695 19588588 20026420 20143981 21111936 21310865 21536278 21850028 22563316 22730454
14355 22730454 23576892 24221735 24748854 25267634 26122287 26710986 27224036 28090446 28816567
14346 28816567 29119439 29851342 30883526 31818074 32520905 33404045 34264515 35497463 36623213
14337 36623213 37663408 38569031 39562892 40966938 41724791 43578299 44440092 45980473 47506037
14328 47506037 48676389 50714746 52331724 53869433 56246987 57676858 59924685 62219486
14320 62219486 64452571 66954236 69369578 72088221 74592806 77309092 80441097 83371152
14312 83371152 86780481 90354440 93690701 98110599 101900350 105751673 110714286 115390282
$$ packed form
14373A5953921K10050J39977L97548N02882M45807j3251P09899L22263J63599
14364A8832695P55893M37832J17561R67955J98929K25413L13750P13288J67138
14355B2730454Q46438O44843N27119N18780Q54653N88699N13050Q66410P26121
14346B8816567L02872P31903J032184R34548P02831Q83140Q60470J232948J125750
14337C6623213J040195R05623R93861J404046P57853J853508Q61793J540381J525564
14328D7506037J170352K038357J616978J537709K377554J429871K247827K294801
14320F2219486K233085K501665K415342K718643K504585K716286L132005K930055
14312H3371152L409329L573959L336261M419898L789751L851323M962613M675996
$$ plain form
14304 115390282 120160451 125874626 131521073 137501691 144040603 150727447 158003412 165064318
14296 165064318 173409988 181964411 190518487 200017621 209898073 220286407 231287574 242534742
14288 242534742 254713301 267501126 280761438 294210020 308214938 322719241 337505360
14281 337505360 352162349 367381244 382204836 396622661 410326056 422899762 433363221
14274 433363221 440085487 442921707 442639764 442148185 444251995 446661698 446981147 445298779
14266 445298779 440919354 433303216 422384288 410380983 396965580 381960157 366802302
14259 366802302 350810172 334758278 318963376 303886942 289051683 274665521 260723886
14252 260723886 247335300 234761363 222516261 211229514 200495281 190320120 180569556
$$ packed form
14304A15390282M770169N714175N646447N980618O538912O686844P275965P060906
14296A65064318Q345670Q554423Q554076R499134R880452J0388334J1001167J1247168
14288B42534742J2178559J2787825J3260312J3448582J4004918J4504303J4786119
14281C37505360J4656989J5218895J4823592J4417825J3703395J2573706J0463459
14274D33363221O722266K836220k81943m91579K103810K409703L19449j682368
14266D45298779m379425p616138j0918928j2003305j3415403j5005423j5157855
14259C66802302j5992130j6051894j5794902j5076434j4835259j4386162j3941635
14252B60723886j3388586j2573937j2245102j1286747j0734233j0175161r750564
$$ plain form
14245 180569556 172022129 163806212 155962645 148492491 141275670 134571370 128355835 122979031
14237 122979031 117736902 112373886 107435882 103015675 98683328 94821187 91324522 87291064
14229 87291064 83768168 80551857 77874223 74719538 71867631 69442645 66374156 64306563
14221 64306563 62042173 60112427 58235993 56082449 54234142 52359256 50702572 49469783
14213 49469783 47723610 46258432 44823185 43652336 42213631 41258163 40346848 39497591
14205 39497591 37780725 36710428 35717658 34797980 34192701 33367447 32528692 31369393 30607504
14196 30607504 30074406 29304779 28386233 27759429 26917522 26675320 25532227 25378004 24670997
14187 24670997 23929148 23373092 22718979 22537336 21882331 21319935 20701079 20623874 20137023
$$ packed form
14245A80569556q547427q215917p843567p470154p216821o704300o215535n376804
14237A22979031n242129n363016m938004m420207m332347l862141l496665m033458
14229H7291064l522896l216311k677634l154685k851907k424986l068489k067593
14221F4306563k264390j929746j876434k153544j848307j874886j656684j232789
14213D9469783j746173j465178j435247j170849j438705r55468r11315q49257
14205C9497591j716866j070297r92770r19678o05279q25254q38755j159299p61889
14196C0607504n33098p69627r18546o26804q41907k42202j143093j54223p07007
14187B4670997p41849n56056o54113j81643o55005n62396o18856p7205m86851
$$ plain form
14178 20137023 19514271 19335220 18899976 18851874 18658741 17918769 17549137 17438444 17249560
14169 17249560 17010162 16479765 16110140 16101331 16004483 15031577 14919027 14735666 14714175 14435140
14159 14435140 13867376 13936336 13855636 13342331 13359469 12690734 12910259 12549524 12288018 12228954
14149 12228954 11971857 11866848 11650562 11480997 11195436 11288055 10965316 10691124 11157571
14140 11157571 10464182 10404177 10287028 9843078 9926857 9778913 9227459 9319997 9303151 9094539
14130 9094539 8704817 9185495 8545497 8218084 8029170 8384345 7713863 8412669 7627036
14121 7627036 7741496 7244173 7569830 7527304 7290043 7352130 7299315 7202254 7276552 7086871
14111 7086871 6835601 6627852 6605667 6801141 6627892 6272131 6315457 6223598 6073796 5859125
$$ packed form
14178B0137023o22752j79051m35244m8102j93133p39972l69632j10693j88884
14169A7249560k39398n30397l69625q809r6848r72906j12550j83361k1491k79035
14159A4435140n67764O8960q0700n13305J7138o68735K19525l60735k61506n9064
14149A2228954k57097j05009k16286j69565k85561R2619l22739k74192M66447
14140A1157571o93389o0005j17149m43950Q3779j47944n51454R2538j6846k08612
14130I094539l89722M80678o39998l27413j88914L55175o70482O98806p85633
14121G627036J14460m97323L25657m2526k37261O2087n2815r7061P4298j89681
14111G086871k51270k07749k2185J95474j73249l55761M3326r1859j49802k14671
$$ plain form
14101 5859125 6107771 6140904 5808520 5889330 5477937 6016191 5583060 5438858 5654594 5017589
14091 5017589 5406001 5257397 5296074 5312567 5192989 5121481 5183334 5059614 4774015 4765457
14081 4765457 4919106 4922043 4773617 4499633 4410547 4567015 4429343 4371677 4709647 4236964
14071 4236964 4353245 4388157 4179275 4358315 4071518 3855560 3839995 4178161 4220185 4073164
14061 4073164 4103151 3873279 3827169 3942794 3761113 3462682 3395783 3546293 3529475 3355696
14051 3355696 3199540 3448341 3389438 3428536 3458336 3354427 3307574 3251948 3331669 3406567 3078051
14040 3078051 3123140 3040258 3189867 3069643 2939249 2957304 3001719 3151096 2893437 3101136
14030 3101136 3236824 3010117 2533083 3304687 2862725 3170168 2926901 2756230 2875299
$$ packed form
14101E859125K48646L3133l32384Q0810m11393N38254m33131j44202K15736o37005
14091E017589L88412j48604L8677J6493j19578p1508O1853j23720k85599q558
14081D765457J53649K937j48426k73984q9086J56468j37672n7666L37970m72683
14071D236964J16281L4912k08882J79040k86797k15958j5565L38166M2024j47021
14061D073164K9987k29872m6110J15625j81681k98431o6899J50510j6818j73779
14051C355696j56156K48801n8903L9098K9800j03909m6853n5626P9721P4898l28516
14040C078051M5089q2882J49609j20224j30394J8055M4415J49377k57659K07699
14030C101136J35688k26707m77034P71604m41962L07443k43267j70671J19069
$$ plain form
14021 2875299 2287871 2582701 2898376 2507703 2774835 2852150 2497154 2360446 2366820 2246171
14011 2246171 2164643 2555707 2713769 2365239 2336530 1994951 2336419 2120694 2170704 2379190
14001 2379190 2423954 2231125 2059475 2017617 2302191 2040545 2314301 2343207 2435531 2686047
13991 2686047 2684568 3968578 6148315 10261347 16079232 24278551 32136956 25963252 15203877
13982 15203877 9084707 6204912 4826797 4379940 3716609 3035834 3232715 2848355 2525125
13973 2525125 2813599 2689276 2796064 2386578 2540291 2444217 2391963 2487456 2523439 2091997
13963 2091997 2266498 2240018 2125796 2257893 2304582 2123620 2130921 1940019 1753762 1898977
13953 1898977 2014570 1831497 1696788 1815248 1967634 2160474 2011838 2070347 2019703 1746821
$$ packed form
14021B875299n87428K94830L15675l90673K67132P7315l54996j36708O374j20649
14011B246171q1528L91064J58062l48530k8709l41579L41468k15725N0010K08486
14001B379190M4764j92829j71650m1858K84574k61646K73756K8906R2324K50516
13991B686047j479J284010K179737M113032N817885Q199319P858405o173704j0759375
13982A5203877o119170k879795j378115m46857o63331o80775J96881l84360l23230
13973B525125K88474j24323J06788m09486J53713r6074n2254R5493L5983m31442
13963B091997J74501k6480j14222J32097M6689j80962P301j90902j86257J45215
13953A898977J15593j83073j34709J18460J52386J92840j48636N8509n0644k72882
$$ plain form
13943 1746821 2243252 1419112 1773465 1821808 1495330 1863479 1598741 1766562 1583794 1230836
13933 1230836 1779841 1607327 1842010 1625850 1680458 1348312 1695631 1754030 1698198 1516858
13923 1516858 1731191 1532567 1504353 1399557 1424190 1934256 1624217 1306186 1817858 1855384
13913 1855384 1635104 1692416 1614206 1426307 1494033 1852942 1717937 1273461 1438660 1495377
13903 1495377 1444900 1438379 1368838 1496080 1148563 1303722 1354823 1030689 1407811 1132157
13893 1132157 1066601 1345654 1250157 1272058 1015548 1049138 1369341 1403233 1092813 1206851
13883 1206851 1250477 998461 1355692 933932 1146494 1722787 1273867 1424441 1096664 1151343
13873 1151343 975566 1158737 990721 1240781 1199733 1145954 1000081 1024978 1020150 956393
$$ packed form
13943A746821M96431q24140L54353M8343l26478L68149k64738J67821j82768l52958
13933A230836N49005j72514K34683k16160N4608l32146L47319N8399n5832j81340
13923A516858K14333j98624k8214j04796K4633N10066l10039l18031N11672L7526
13913A855384k20280N7312p8210j87899O7726L58909j35005m44476J65199N6717
13903A495377n0477o521o9541J27242l47517J55159N1101l24134L77122k75654
13893A132157o5556K79053r5497K1901k56510L3590L20203L3892l10420J14038
13883A206851M3626k52016L57231m21760K12562N76293m48920J50574l27777N4679
13873A151343j75777J83171j68016K50060m1048n3779j45873K4897m828o3757
$$ plain form
13863 956393 1280541 1086236 1021839 922050 1002419 1165335 810602 943492 881829 1141142
13853 1141142 1171178 905522 999699 1111534 610644 1088574 1020618 940395 1075500 1167151
13843 1167151 1098208 997782 792356 869867 1186342 756020 1029745 708164 1087732 1121328
13833 1121328 783056 745196 794461 784460 883447 947436 900063 601900 1134023 903211
13823 903211 884488 666972 771891 581083 876594 957173 1003650 745945 1056498 948124
13813 948124 896780 741537 835546 1108712 874256 511701 523131 1100431 554387 549699
13803 549699 494528 635565 1043859 699135 874355 664677 531533 781644 702461 615622
13793 615622 879147 806480 696738 449952 638470 1018537 678214 857627 812457 634239
$$ packed form
13863I56393L24148j94305o4397r9789Q0369J62916l54733J32890o1663K59313
13853A141142L0036k65656R4177J11835n00890M77930o7956q0223J35105R1651
13843A167151o8943j00426k05426P7511L16475m30322K73725l21581L79568L3596
13833A121328l38272l7860M9265j0001R8987O3989m7373k98163N32123k30812
13823I03211j8723k17516J04919j90808K95511Q0579M6477k57705L10553j08374
13813I48124n1344j55243R4009K73166k34456l62555J1430N77300n46044m688
13803E49699n5171J41037M08294l44724J75220k09678j33144K50111p9183q6839
13793F15622K63525p2667j09742k46786J88518L80067l40323J79413m5170j78218
$$ plain form
13783 634239 827327 659750 808372 951400 445410 752329 644637 665119 977560 584518
13773 584518 413675 734343 544156 670902 962395 578913 533438 602820 638458 534843
13763 534843 667308 1127553 764838 455999 639440 631822 590629 725202 988595 548807
13753 548807 930354 426952 447650 792125 476789 654361 879935 734978 488330 776042
13743 776042 908754 406932 329671 820587 519909 659355 220629 537686 681013 581696
13733 581696 498885 688426 701761 621145 296350 475637 664267 122299 517316 664518
13723 664518 257236 691833 820217 739123 868042 502580 491208 644964 631499 308916
13712 730598 386985 302844 323940 210125 622962 755888 226284 650652 554574 137572
$$ packed form
13783F34239J93088j67577J48622J43028D45410L06919j07692K0482L12441l93042
13773E84518j70843L20668j90187J26746K91493l83482m5475O9382L5638j03615
13763E34843J32465M60245l62715l08839J83441p618m1193J34573K63393m39788
13753E48807L81547D26952K0698L44475l15336J77572K25574j44957k46648K87712
13743G76042J32712D06932p7261M90916l00678J39446B20629L17057J43327r9317
13733E81696q2811J89541J3335q0616B96350J79287J88630A22299L95017J47202
13723F64518B57236M34597J28384q1094J28919l65462j1372J53756j3465C08916
13712G30598l43613q4141K1096j13815M12837J32926B26284M24368r6078A37572
$$ plain form
13701 452677 556478 558713 393585 661328 447561 426536 510647 619590 560060 788245
13691 788245 155016 424389 557645 555420 569399 432380 583857 459557 531207 73499
13680 438969 896401 536337 542650 355641 700011 175315 509260 269606 429106 684693
13670 684693 184126 412362 378858 620173 213352 -78525 339426 514685 438816 451541
13660 451541 301281 325489 315530 395258 703593 331664 698122 674144 265488 162747
13650 162747 526695 266455 259702 268064 410452 454209 230565 377433 510984 344854
13640 344854 366075 449564 173007 711002 336241 353037 634202 400552 238224 277795
13630 277795 312708 305846 284535 307243 353270 -50309 476773 295994 381922 471336 244393
$$ packed form
13701D52677J03801K235j65128K67743k13767k1025Q4111J08943n9530K28185
13691G88245A55016K69373J33256k225J3979j37019J51477j24300P1650G3499
13680D38969M57432l60064O313j87009L44370A75315L33945k39654J59500K55587
13670F84693A84126K28236l3504K41315B13352g8525C39426J75259p5869J2725
13660D51541j50260K4208r959P9728L08335C31664L66458k3978B65488j02741
13650A62747L63948k60240o753Q362J42388M3757k23644J46868J33551j66130
13640C44854K1221Q3489A73007N37995C36241J6796K81165k33650j62328L9571
13630B77795L4913o862k1311K2708M6027e0309D76773j80779Q5928Q9414k26943
$$ plain form
13619 244393 595538 551772 414404 284609 316846 469643 251617 272065 160241 357221
13609 357221 227704 266385 300545 222749 -50174 515934 354082 359467 171250 542226 347190
13598 347190 267231 646918 241268 475166 283243 509841 234892 -4894 495732 455459
13588 455459 52187 312717 131663 455950 240315 357982 368991 442501 298767 464335
13578 464335 172982 354239 124641 77238 326498 451931 85077 291852 335952 363454
13568 363454 471710 206085 419264 320717 309303 232147 228790 334986 646286 97858 198117
13557 198117 146678 318232 25592 56171 187707 514499 57806 558796 90371 269230
13547 269230 406815 153742 132620 30717 566683 533681 290181 61022 341364 273798
$$ packed form
13619B44393L51145m3766j37368j29795L2237J52797k18026K0448j11824J96980
13609C57221j29517L8681L4160p7796e0174E15934j61852N385A71250L70976j95036
13598C47190p9959L79687B41268K33898j91923K26598B34892d894D95732m0273
13588D55459E2187K60530A31663L24287k15635J17667J1009P3510j43734J65568
13578D64335A72982J81257A24641m7403K49260J25433H5077K06775M4100K7502
13568C63454J08256B06085K13179r8547j1414p7156l357J06196L11300I7858J00259
13557A98117n1439J71554B5592L0579J31536L26792E7806N00990I0371J78859
13547B69230J37585A53742k1122C0717N35966l3002k43500F1022K80342o7566
$$ plain form
13537 273798 302408 -36692 350831 32362 141390 338159 289812 -63086 537853 238205
13526 468716 270583 282135 227635 65264 335250 290461 375331 401077 289139 171137 149897
13515 149897 24288 165086 398994 241460 157200 252633 239973 366681 -107598 318084
13504 365247 576882 155721 355216 -86597 235515 300954 286722 69881 269951 55192
13493 323974 244533 40434 323404 97886 355930 362059 231381 -853 537457 360476 411508
13482 411508 307479 383977 328810 100489 381007 -24008 279860 245857 196579 403102
13472 403102 452369 686924 330259 446253 316210 54475 297965 318598 115820 402180
13462 402180 85224 104344 105510 289855 -155052 216537 268455 306994 319544 154803 396028
$$ packed form
13537B73798K8610c6692C50831C2362J09028J96769m8347f3086E37853B38205
13526D68716j98133J1552n4500F5264K69986m4789Q4870K5746j11938j18002k1240
13515A49897B4288J40798K33908j57534q4260R5433j2660J26708a07598C18084
13504C65247K11635A55721J99495h6597B35515O5439j4232F9881K00070E5192
13493C23974p9441D0434K82970I7886K58044O129j30678h53E37457j76981N1032
13482D11508j04029P6498n5167A00489K80518b4008B79860l4003m9278K06523
13472D03102M9267K34555C30259J15994j30043E4475K43490K0633A15820K86360
13462D02180H5224J9120J166J84345a55052B16537N1918L8539J2550A54803K41225
$$ plain form
13451 396028 -115491 57649 271394 198435 249702 308439 260719 253943 159179 448675 193143
13439 151485 264692 293679 335062 155932 77482 336750 89757 -100362 253792 742720
13429 742720 -1743 -112046 24735 73221 85530 170979 187369 100847 390324 213985 263430
13418 263430 99552 160016 357514 226511 -142172 418498 129493 -403 12349 104809 185987
13407 185987 263189 173540 7294 243130 83052 -77104 422917 73605 201157 152163 160833
13396 160833 130059 240228 -89787 -16166 127434 240682 -42100 -39124 -114113 489846 383183
13385 383183 180139 161687 238316 77145 319779 212263 177056 -113146 133785 1099 259912
13374 259912 140313 332385 27471 706979 279113 319872 286801 -106260 359796 184103
$$ packed form
13451C96028a15491E7649K13745p2959N1267N8737m7720o776r4764K89496A93143
13439A51485J13207K8987M1383A55932G7482K59268H9757a00362B53792M88928
13429G42720a743j10303B4735M8486J2309Q5449J6390q6522K89477j76339M9445
13418B63430I9552O0464J97498j31003a42172D18498A29493d03A2349R2460Q1178
13407A85987P7202q9649G294K35836H3052g7104D22917G3605J27552m8994Q670
13396A60833l0774J10169h9787a6166A27434J13248d2100K976p4989D89846j06663
13385C83183A80139j8452P6629G7145K42634j07516l5207a13146A33785A099K58813
13374B59912j19599J92072B7471O79508B79113M0759l3071a06260C59796j75693
$$ plain form
13364 184103 343299 156159 213833 379552 411408 247177 290662 80347 255536 408400
13354 408400 389753 214760 -20727 412641 85069 27009 204274 287023 -72038 196483 -177467
13342 311977 135336 235946 516511 243769 678287 342759 172386 393849 347000 268012
13332 268012 526063 409323 7785 579828 256260 410973 -100476 347939 346005 -19417
13321 27691 466947 337655 50669 139756 166840 -14329 493975 44849 347691 169479 -133309
13309 290700 240076 482735 191065 70070 139979 9672 366036 176842 354827 59983 88388
13298 88388 -41403 252040 70177 190427 74236 -20129 145839 197966 4504 87863 29222
13286 -130471 383503 27650 -392447 242299 114521 243404 87043 221842 -242966 292517
$$ packed form
13364A84103J59196A56159N7674J65719L1856j64231M3485H0347J75189J52864
13354D08400j8647j74993b0727D12641H5069B7009J77265Q2749g2038A96483a77467
13342C11977A35336J00610K80565B43769M34518l35528j70373K21463m6849p8988
13332B68012K58051j16740G785N72043B56260J54713a00476C47939j934a9417
13321B7691M39256j29292E0669Q9087K7084a4329D93975D4849L02842A69479a33309
13309B90700n0624K42659A91065G0070O9909I672L56364A76842J77985E9983K8405
13298H8388d1403B52040G0177J20250G4236b0129A45839N2127D504Q3359B9222
13286a30471C83503B7650c92447B42299A14521J28883H7043J34799b42966B92517
$$ plain form
13275 147347 206519 325587 -276626 -24655 250678 310858 148695 215168 -132883 73861
13264 125230 -215280 103238 -310986 -65074 -69994 197468 429151 405186 -88077 50977 87982
13253 87982 81365 212466 153584 263192 22628 489 196865 75853 26313 356126 212321
13242 212321 -153899 -3376 188516 60087 7047 92394 -204385 212168 -31093 -41939 -19959
13230 162659 184425 123217 -166548 127116 -140355 299957 83356 130810 -65040 57708 211263
13219 211263 157553 35042 73323 169241 -45171 -101049 4108 352072 203793 97704 15946
13207 -9042 173034 -135890 19308 177872 -198286 149004 402899 -66892 -68733 289760 72131
13195 61856 -193111 -202140 30977 -174908 34048 104752 29084 198813 -257269 594367 155668
$$ packed form
13275A47347N9172J19068b76626b4655B50678O0180A48695O6473a32883G3861
13264A25230b15280A03238c10986f5074m920A97468K31683k3965h8077E0977L7005
13253H7982o617J31101n8882J09608B2628D89J96376G5853B6313L29813j43805
13242B12321a53899c376A88516F0087G047Q5347b04385B12168c1093j0846a9959
13230A62659K1766o1208a66548A27116a40355B99957H3356M7454f5040E7708J53555
13219B11263n3710C5042L8281R5918d5171n5878D108L47964j48279I7704A5946
13207i042A73034a35890A9308J58564a98286A49004K53895f6892j841B89760G2131
13195F1856a93111r029C0977a74908C4048P0704B9084J69729b57269E94367A55668
$$ plain form
13183 465124 -85862 -89718 23244 -34282 232444 22831 471513 250148 330047 -61876 398966
13171 118497 124501 191851 -336317 -38348 184951 6852 88972 -111304 96498 2477 -38270
13159 142838 -252186 14103 -62500 50535 -245959 -168533 10209 -31418 -26469 102663 -16656
13147 237625 179349 424822 13452 -73204 335333 169694 214329 659 65529 549942 208468
13135 126398 -10990 -36164 -94396 15579 -102483 213865 -147180 430390 -324521 -7312 179063
13123 135898 121708 70387 -8617 -179053 75313 -68601 142644 -259465 126575 -22741 265591
13111 257861 41445 -139580 28568 -228265 52457 30065 120304 233689 527970 -30630 -275049
13100 -275049 103684 462293 -25867 73528 2793 -14238 -98554 -74120 22533 -263579 270264
$$ packed form
13183D65124h5862l856B3244c4282B32444B2831M48682k21365P9899f1876C98966
13171A18497O004O7350c36317c8348A84951F852Q2120a11304I6498B477c8270
13159A42838b52186A4103f2500E0535b45959P7426A0209c1418M949A02663a6656
13147B37625n8276K45473A3452g3204C35333j65639M4635F59O4870M84413B08468
13135A26398a0990k5174n8232A5579a02483B13865a47180D30390c24521g312A79063
13123A35898j4190n1321h617j70436G5313f8601A42644b59465A26575b2741B65591
13111B57861D1445a39580B8568b28265E2457k2392R0239J13385K94281c0630k44419
13100b75049A03684L58609b5867G3528B793a4238q4316K4434B2533b63579B70264
$$ plain form
13088 -103809 8817 171070 26472 62318 318389 119850 20476 247037 266730 -231686 -293544
13077 -293544 38919 -164809 29985 10253 232494 259635 203134 -131153 97722 38755 94257
13066 94257 -150214 145502 490768 -46694 -323927 65489 -130365 248830 81623 304402
13056 304402 -51154 -20165 -102388 75432 66986 201001 278096 -201287 318250 37612 4526
13044 408331 245265 161773 -60444 198982 21068 -5591 241062 222602 38066 114748 -47760
13032 85021 -100808 218135 389103 -77178 -167055 -198155 -53798 96692 -61372 45110 67172
13021 67172 -131359 5378 282938 -66950 121851 -1086 344908 222186 -115131 148601 68708
13009 128028 51396 17614 33443 168521 81854 -157674 160683 51445 205830 87569 163799
$$ packed form
13088a03809H817J62253B6472L5846K56071A19850B0476K26561J9693b31686o1858
13077b93544C8919a64809B9985A0253K22241K7141n6501a31153I7722C8755N5502
13066I4257a50214A45502L45266d6694k77233F5489a30365B48830H1623K22779
13056C04402e1154b0165q2223G5432q446J34015P7095b01287C18250C7612D526
13044D08331j63066q3492f0444A98982B1068e591B41062j8460C8066P6682d7760
13032H5021a00808B18135J70968g7178q9877l1100e3798I6692f1372D5110K2062
13021F7172a31359E378K77560f6950A21851a086C44908j22722a15131A48601F8708
13009A28028E1396A7614J5829J35078H1854a57674A60683E1445J54385H7569P6230
$$ plain form
12998 163799 -4196 125894 57753 -89141 159664 91142 9741 71702 -127056 -46689 150933
12986 147746 98906 96050 -226293 13494 26022 150526 -136751 87431 25842 590 146760
12975 146760 138506 338990 75803 64267 -107763 -12769 41854 -148975 33381 293641 -296363
12963 187134 41693 230442 206925 253297 -7782 17547 263121 -59508 137710 -58667 -20659
12951 -325575 20797 160342 114695 155925 -222364 322296 33927 -209219 -293896 110868
12940 108003 98177 -70093 62913 -252695 -129165 -4612 287562 100618 144233 -6662 110378
12928 222648 -74427 180770 65758 -46318 14728 -55164 121262 -203223 49558 287442 -25039
12916 69430 28039 267514 -92108 -84233 -192297 167216 7201 -98632 92081 75921 32142
$$ packed form
12998A63799d196A25894E7753h9141A59664o8522I741O1961a27056d6689A50933
12986A47746m8840k856b26293A3494J2528J24504a36751H7431B5842E90J46170
12975A46760q254K00484G5803j1536a07763a2769D1854a48975C3381K60260b96363
12963A87134D1693J88749k3517M6372g782A7547K45574e9508A37710e8667b0659
12951c25575B0797J39545m5647M1230b22364C22296C3927b09219q4677A10868
12940A08003r826g0093F2913b52695J23530d612B87562A00618M3615f662A10378
12928B22648g4427A80770F5758d6318A4728e5164A21262b03223D9558K37884b5039
12916F9430B8039K39475i2108P875j08064A67216G201i8632I2081j6160C2142
$$ plain form
12904 188767 -121163 132865 46952 107381 -305888 -29477 -12039 204519 296181 50197 9366
12892 32775 -18758 -121130 -112780 -124622 134784 -8899 -93981 102266 104528 -36657 80457 26293
12879 -80862 -10564 46141 -135738 113773 25290 171 -56263 123528 -232708 -150027 -2584
12867 199388 -89844 71429 -205623 -5657 62457 -344293 -239605 10866 170543 207266 -316380
12855 238625 -377 -70398 83 -198013 -38706 469249 102339 275388 113199 -96406 57885
12843 145042 43337 -198097 80604 -401660 539375 481728 212966 -132951 278876 169402
12833 169402 5273 -160527 -218774 96587 -259578 -37062 3686 -143798 204061 95909 -148228
12821 106679 -9846 81879 103982 82082 -151676 157240 -52545 -53613 -137532 74326 -148677
$$ packed form
12904A88767a21163A32865D6952O0429c05888b9477a2039B04519R1662E0197I366
12892C2775a8758j02372Q350j1842A34784h899q5082A02266K262c6657H0457B6293
12879h0862a0564D6141a35738A13773B5290A71e6263A23528b32708Q2681b584
12867A99388h9844G1429b05623e657F2457c44293J04688A0866J59677L6723c16380
12855B38625c77p0021H3a98013c8706D69249A02339J73049A13199i6406E7885
12843A45042D3337a98097H0604d01660E39375n7647B12966a32951B78876j09474
12833A69402E273a60527n8247I6587b59578c7062C686a43798B04061I5909a48228
12821A06679i846H1879K2103k1900a51676A57240e2545j068q3919G4326a48677
$$ plain form
12809 232952 66892 954 -263454 -68856 144209 -25226 -148338 -326453 -146675 -364788 -81701
12797 254927 -216835 -192904 35733 91033 -96864 -121591 195403 -105636 226820 -275245
12786 214422 197516 -122264 -195434 49948 -269041 74199 2253 -74233 -190285 -244974 122586
12774 269508 299934 19954 -187451 -30414 35204 41532 -349393 85394 -32368 138329 278898
12763 278898 -15724 -11953 154218 -164388 -131097 128349 195583 308207 -61200 -123912 -346938
12752 -346938 -6258 -180542 41747 127965 -421032 -43440 257101 108234 204151 -126829 63108
12740 137209 234168 -141296 -53049 70925 -79382 -141186 -75139 298522 -37059 244230 -54558
12728 -134131 -91381 -157413 -39291 -78457 -10700 356604 -232227 57489 -393925 106491 22438
$$ packed form
12809B32952F6892I54b63454f8856A44209b5226j23112j78115a46675k18113h1701
12797B54927b16835K3931C5733N5300i6864k4727A95403a05636B26820b75245
12786B14422j6906a22264p3170D9948b69041G4199B253g4233j16052n4689A22586
12774B69508L0426A9954a87451c0414C5204O328c49393H5394c2368A38329J40569
12763B78898a5724L771A54218a64388L3291A28349O7234J12624f1200o2712k23026
12752c46938f258j74284D1747Q6218d21032d3440B57101A08234R5917a26829F3108
12740A37209R6959a41296e3049G0925g9382o1804O6047B98522c7059B44230e4558
12728a34131M2750o6032c9291l9166a0700C56604b32227E7489c93925A06491B2438
$$ plain form
12716 -50342 -105483 95255 -107503 400389 165516 -261311 106126 84873 -119412 -82394
12706 -82394 178145 126464 14934 -54149 12557 181568 -22140 -73226 187438 -12780 -149505
12695 -149505 86561 240228 -188909 -111799 58586 -99861 -32994 41254 252275 202163 -178499
12683 399825 -119496 -52665 101274 193386 227847 420702 153684 51475 128343 177033 23370
12671 53662 -25247 178320 83628 224138 289599 869 28579 329995 -30545 17288 136758
12660 136758 -49958 -107414 121591 59083 282538 -86862 15540 114080 -207185 106324 27909
12648 166416 30181 -71665 -243292 40162 -74201 325582 98979 339856 -172368 511562
12637 -320470 -253720 -184901 48570 37690 -36506 283979 2524 475813 65788 176077 -20827
$$ packed form
12716e0342n5141I5255a07503D00389A65516b61311A06126k1253a19412L7018
12706h2394A78145n1681A4934e4149A2557J69011b2140n1086A87438a2780j36725
12695a49505H6561J53667a88909P7110E8586i9861c2994D1254K11021n0112a78499
12683C99825a19496e2665A01274R2112L4461J92855A53684E1475P6868M8690B3370
12671E3662b5247A78320H3628J40510O5461H69K7710L01416c0545A7288J19470
12660A36758d9958n7456A21591E9083K23455h6862A5540R8540b07185A06324B7909
12648A66416C0181g1665j71627D0162g4201C25582I8979K40877a72368E11562
12637c20470O6750O8819D8570j0880c6506B83979B524M73289F5788J10289b0827
$$ plain form
12625 -23279 -152870 113784 299960 227359 -173249 31252 204126 245898 -41906 78178 15202
12613 -3872 -26835 211794 -186380 81676 -211481 308818 148800 231884 107934 242386
12603 242386 -347120 150598 301625 63019 -113076 -122914 83428 -9288 203511 -137332 -180366
12592 -180366 -173648 112006 29756 138166 -25522 -202433 130387 30561 175781 55186 -327704
12580 -264750 -124169 -138362 -29836 -13482 -93156 -19530 167133 45210 -123855 34685 -137140
12568 228992 8065 -215466 -433083 286418 -27801 165080 -57697 209889 -106689 -243398
12558 -243398 -173427 9116 44563 92551 93344 68960 -11643 -180333 58052 162021 52823 -325166
12545 -2222 -133648 -133220 -63112 -19424 -322742 5808 -188072 147281 146595 345976 60071 -176141
$$ packed form
12625b3279j29591A13784J86176p2601a73249C1252J72874M1772d1906G8178A5202
12613c872k2963B11794a86380H1676b11481C08818A48800Q3084A07934J34452
12603B42386c47120A50598J51027F3019a13076r838H3428i288B03511a37332m3034
12592a80366O718A12006B9756J08410b5522j76911A30387C0561J45220E5186c27704
12580b64750a24169j4193b9836a3482p9674a9530A67133D5210a23855C4685a37140
12568B28992H065b15466k17617B86418b7801A65080e7697B09889a06689j36709
12558b43398O9971I116L5447M7988P93k4384a1643j68690E8052J03969E2823c25166
12545b222j31426M28f3112a9424l03318E808a88072A47281o86J99381F0071a76141
$$ plain form
12532 45750 201391 78525 74827 426132 -257817 -151353 121292 86161 16166 174511 -81202
12520 35245 -97702 15515 78985 -221419 -199734 -289253 -524890 -15781 -42076 -51867 -527 -97957
12508 -97957 -100814 -46977 126428 124472 -42457 111962 180750 320224 432751 333842 -62936
12496 112244 233485 -57383 173579 83425 121645 291560 14541 -303061 226819 139352
12486 139352 -247018 18355 -104859 82962 31139 294428 57041 120572 -101046 221549
12475 -44340 151153 -108753 -102988 536512 -36858 -27015 87717 35042 182039 -168538 -265654
12464 -265654 -314194 30559 -88077 -86806 25776 38679 -394806 -118232 -56396 -285681 251173
12452 -63416 -184807 -156349 87229 133002 -80771 -37321 253324 -185956 -333839 -99660 340976
$$ packed form
12532D5750J55641G8525l698L51305b57817J06464A21292l5131A6166J58345h1202
12520C5245i7702A5515O3470b21419K1685q9519k35637a5781k6295r791e27r7430
12508i7957k857d6977A26428j956d2457A11962O8788J39474J12527r8909f2936
12496A12244J21241e7383A73579H3425L8220J69915A4541c03061B26819q7467
12486A39352b47018A8355a04859H2962C1139K63289E7041O3531a01046B21549
12475d4340A51153a08753N765E36512c6858R843H7717C5042J46997a68538r7116
12464b65654m8540C0559h8077J271B5776J2903c94806a18232e6396k29285B51173
12452f3416j21391K8458H7229M5773h0771c7321B53324a85956j47883i9660C40976
$$ plain form
12440 337350 -222279 -66513 227376 -197484 299907 85988 86863 370603 -416393 229224
12429 243639 -103708 25761 -23505 141081 108468 379714 -17322 28835 12540 161343 -234829
12417 94651 -59818 217261 119321 -93597 94455 -179504 -400874 -142860 28138 19347 132259
12406 132259 74473 -58375 -28737 -304819 -27638 305803 -22604 242870 105443 23287 107233
12395 107233 -63514 -16035 -36024 -202071 215911 54198 54148 -41985 193027 -221514 -123106
12384 -123106 -50459 273947 170851 6557 14483 -105154 147111 -148300 -118098 -358682 5239
12372 -308011 16301 -282350 187067 139415 353335 -149724 -71497 145313 -41150 -11139
12361 95007 166340 -340224 138473 16094 -138208 -325973 -252317 12550 -12633 -31942 -205241
$$ packed form
12440C37350b22279f6513B27376a97484B99907H5988Q75K83740d16393B29224
12429B43639a03708B5761b3505A41081l2613K71246a7322B8835A2540J48803b34829
12417I4651e9818B17261r7940i3597I4455a79504k21370a42860B8138q791J12912
12406A32259n7786e8375b8737k76082b7638C05803b2604B42870A05443B3287Q3946
12395A07233f3514a6035j9989j66047B15911E4198n0d1985A93027b21514R8408
12384a23106e0459B73947j03096F557P926a05154A47111a48300L0202k40584E239
12372c08011A6301b82350A87067m7652K13920a49724g1497A45313d1150a1139
12361I5007P1333c40224A38473A6094a38208j87765P3656A2550a2633j9309j73299
$$ plain form
12350 -205241 47435 130222 185235 -21095 49547 162274 182378 15084 -12117 200296 71304
12338 110540 -214969 123769 -17954 27174 215738 46613 -10279 -137001 251329 -81010
12327 196208 117958 -103847 -64754 17574 -48558 -139957 -8897 186178 111855 -397448 77043
12315 -203167 -118588 314492 15581 -78341 116498 93700 -157574 -42065 -48942 72011 7168
12303 241302 -25635 -266304 419128 373944 128188 -113361 -83835 12093 268070 -63536
12292 293760 -354857 24558 77070 109412 119323 142100 223941 239842 -103988 58518 399907
12281 399907 57601 -144805 -9959 -169510 180446 -14749 47769 26901 8540 136716 -175086
12269 201957 -173507 11055 -116344 -21624 244289 -110655 -91095 -73788 -35242 983 273839
$$ packed form
12350b05241D7435Q2787N5013b1095D9547J12727K0104A5084a2117B00296G1304
12338A10540b14969A23769a7954B7174J88564D6613a0279j26722B51329h1010
12327A96208p8250a03847L9093A7574d8558r1399h897A86178p4323c97448G7043
12315b03167Q4579C14492A5581g8341A16498k2798a57574d2065o877G2011G168
12303B41302b5635k40669D19128m5184A28188a13361K9526A2093K55977f3536
12292B93760c54857B4558N2512L2342R911K2777Q1841J5901a03988E8518L41389
12281C99907E7601a44805i959j59551A80446a4749D7769k0868H540J28176a75086
12269B01957a73507A1055a16344b1624B44289a10655J9560J7307c5242I83K72856
$$ plain form
12258 273839 -212646 186080 38559 -262576 49382 -193050 43910 -165575 -191185 128597
12247 195947 -132361 256355 24901 -69949 -41246 137286 -148047 293095 432584 38710
12236 9295 131200 76763 188003 12458 163733 -56922 358553 88096 117204 55301 -115803
12224 59159 75475 144105 168790 141731 153974 162689 305067 387383 -64642 84597 347262
12213 347262 480806 216912 -1894 181834 390139 236506 7820 92843 -19064 206531 -107260
12201 -23615 286961 47872 105416 266674 -50985 -200913 -7237 261919 81814 69619 468648
12190 468648 554560 128238 -33995 171881 -20950 187619 47404 -146836 -47318 -43662 326366
12178 -252820 -136293 159668 7801 -5324 119673 -68279 -25859 -71739 -165662 32777 -192793
$$ packed form
12258B73839b12646A86080C8559b62576D9382a93050D3910a65575k5610A28597
12247A95947a32361B56355B4901f9949K8703A37286a48047B93095J39489C8710
12236I295J21905n4437J11240A2458J51275e6922C58553H8096K9108E5301a15803
12224E9159J6316O8630K4685k7059J2243Q715J42378Q2316f4642H4597K62665
12213C47262J33544B16912a894A81834K08305j53633G820Q5023a9064B06531a07260
12201b3615B86961D7872N7544J61258e0985j49928g237B61919H1814j2195L99029
12190D68648Q5912A28238c3995A71881b0950A87619D7404a46836d7318L656C26366
12178b52820J16527A59668G801e324A19673f8279b5859m5880r3923C2777a92793
$$ plain form
12166 -160618 189603 53858 -10683 -41285 22542 114232 343056 25330 -73098 311456 -395418
12154 421918 183053 101782 -130421 329433 -190374 142466 220430 135609 6737 58223 278731
12143 278731 155497 -117046 143133 286095 -164660 78204 -151758 99749 -80922 -304302
12133 -304302 3781 106948 -185911 -7578 217186 -8985 114655 -59753 29973 -72645 -180962
12122 -180962 -23716 -232975 -109714 -23330 -148912 134462 -38006 45337 -105026 114292
12111 39692 312672 -154359 40919 111925 49078 247313 -88321 14075 -355831 -6163 -81954
12100 -81954 -167099 -62643 -69382 129580 -82446 -211768 -210575 -160934 -83991 -273826 270913
12088 -228783 74980 -96686 1061 162732 -113486 43110 -12154 -87771 -84134 155786 13104
$$ packed form
12166a60618A89603E3858a0683l0602B2542R1690K28824B5330g3098C11456c95418
12154D21918A83053q1271a30421C29433a90374A42466P7964q4821F737N1486K20508
12143B78731j23234a17046A43133J42962a64660G8204a51758I9749h0922k23380
12133c04302C781J03167a85911g578B17186h985A14655e9753B9973g2645j08317
12122a80962b3716k09259a09714b3330j25582A34462c8006D5337a05026A14292
12111C9692K72980a54359D0919P1006D9078J98235h8321A4075c55831f163p5791
12100h1954q5145f2643o739A29580h2446j29322J193M9641P6943j89835B70913
12088b28783G4980i6686A061J61671a13486D3110a2154p5617L637A55786A3104
$$ plain form
12076 339209 -367858 -275415 -360966 486733 37433 47591 40453 -133327 9669 241571 -91348
12064 -218375 -105606 36201 180506 21348 -375664 -1623 -87018 -91684 314429 186006 105114
12053 105114 -91193 92474 -233735 -44225 -243526 -279615 11013 -22090 -61500 1984 395196
12042 395196 583607 504792 562090 522920 202881 79002 21517 -213467 199415 1730 33859
12031 33859 -162833 -151163 -326436 -23020 -226629 187203 -15873 256896 -462928 -248133
12021 -248133 -65959 -82404 -249606 84539 -88032 205698 4915 -182719 -116378 50469 23783
12009 51200 119104 143016 -84419 -111954 -7428 -107683 133591 284178 -8463 44930 -111600
11997 -262397 -325592 54907 -37592 195831 17159 150886 -28459 21931 277447 -11327 -117943
$$ packed form
12076C39209c67858R2443q5551D86733C7433J0158p138a33327I669K31902i1348
12064b18375a05606C6201J44305B1348c75664a623q5395m666C14429j28423q0892
12053A05114i1193I2474b33735d4225j99301l6089A1013b2090l9410A984L93212
12042C95196J88411p8815N7298l9170B02881G9002B1517b13467A99415A730L2129
12031C3859a62833J1670j75273b3020k03609A87203a5873B56896d62928K14795
12021b48133f5959j6445j67202H4539h8032B05698D915a82719O6341E0469B3783
12009E1200O7904K3912h4419k7535g428j00255A33591J50587h463D4930a11600
11997b62397o3195E4907c7592A95831A7159J33727b8459B1931K55516a1327j06616
$$ plain form
11986 -117943 245049 -175374 -294291 -87506 -2759 -41672 -52505 -97218 -85971 -129181 172588
11974 78335 -53782 -56513 -32642 -51595 102614 91809 60325 59916 59333 -201998 143423 -98743
11961 -196116 -193535 -151428 181215 -30995 110511 90943 -107762 86730 124216 -59682 70004
11949 52974 79582 -139384 79852 434216 52554 -362950 -45499 152604 -57969 -199469 -41067
11937 294015 -395572 -185759 -249631 24409 153714 30135 139055 70855 -2936 195749 370376
11926 370376 153859 -80414 177839 -574288 213544 364661 -162621 -47332 231839 -193577
11915 -79877 -163361 -206080 -244705 -301425 -21847 53770 -227582 -118920 -178366 -63731 -161421
11904 -161421 -63078 -130480 304981 4453 -154027 -246940 -482696 -76828 97498 -14511 -372599
$$ packed form
11986a17943B45049a75374j18917h7506b759l8913j0833m4713J1247m3210A72588
11974G8335e3782k731K3871j8953A02614j0805l1484m09n83b01998A43423i8743
11961a96116K581M2107A81215c0995A10511j9568a07762H6730L7486e9682G0004
11949E2974K6608a39384G9852L54364E2554c62950d5499A52604e7969j41500d1067
11937B94015c95572a85759o3872B4409J29305C0135J08920o8200b936A95749J74627
11926C70376A53859h0414A77839e74288B13544J51117a62621d7332B31839a93577
11915g9877q3484m2719l8625n6720b1847E3770b27582J08662n9446f3731r7690
11904a61421f3078o7402C04981D453a54027r2913k35756g6828I7498a4511l58088
$$ plain form
11893 -372599 -296535 -191272 -14318 -81240 92717 52502 -296020 186554 -247873 103178
11882 -221711 -139847 90740 49364 135466 -46654 -158202 -120195 -406987 6241 -5960 -58622
11871 -58622 -56050 178510 -53486 -484485 -134646 -12929 166246 -167333 198004 117091 -139655
11859 149193 -59460 -125612 45408 -96681 131079 -110813 -69195 -215664 28676 128775 9873
11847 165296 9013 -121456 -59093 31463 -109903 -244932 -241974 81375 -170081 12691 72471
11836 72471 229031 83254 47858 352573 -56834 -2949 -121088 -71096 -149190 18904 -298614
11824 55976 14087 -33567 167444 -121944 -207629 -17830 -347579 479347 -164978 -109528 -7459
11812 89478 49305 -57558 191055 -159090 -75204 42441 142473 -113259 -180304 -241954 -108610
$$ packed form
11893c72599P6064J05263a4318o6922I2717m0215b96020A86554b47873A03178
11882b21711Q1864I0740m1376Q6102d6654j11548L8007k86792F241e960n2662
11871e8622K572A78510e3486m30999a34646a2929A66246a67333A98004q0913a39655
11859A49193e9460o6152D5408i6681A31079a10813M1618j46469B8676J00099I873
11847A65296I013a21456e9093C1463a09903j35029K958H1375a70081A2691N9780
11836G2471J56560H3254l5396L04715e6834b949j18139M9992p8094A8904b98614
11824E5976A4087c3567A67444a21944q5685a7830l29749D79347a64978N5450g459
11812H9478m0173e7558A91055a59090g5204D2441J00032a13259o7045o1650a08610
$$ plain form
11800 86203 -152830 123587 146016 -267887 -148190 -82655 51212 -193386 -145716 -195784 114240
11788 -118358 -16656 -179084 290068 -180514 168148 -63470 67684 95913 -97513 -217902
11778 -217902 29436 300930 -108176 -118594 -81573 -254393 -99122 8359 96792 -247678 -233000
11767 -233000 21490 96593 52600 37079 100799 -325792 64554 83328 -109170 70652 72597
11756 72597 130850 -269758 -159092 101518 44760 -44178 -158235 103347 -325846 -211276
11746 -211276 167054 -56126 -161913 -249949 -347195 135416 150798 182 -164501 175368 196404
11735 196404 83377 309718 -260666 323389 -137736 -120906 176631 -230871 -277320 -377139
11725 -377139 108297 -242164 46671 85769 -38850 278928 -82747 65872 -294530 -171773
$$ packed form
11800H6203a52830A23587K2429b67887J19697O5535E1212a93386M7670n0068A14240
11788a18358a6656j62428B90068a80514A68148f3470F7684K8229i7513j20389
11778b17902B9436K71494a08176j0418L7021j72820i9122H359Q8433b47678J4678
11767b33000B1490P5103m3993j5521O3720c25792F4554J8774a09170G0652J945
11756G2597N8253b69758J10666A01518D4760d4178j14057A03347c25846J14570
11746b11276A67054e6126j05787q8036r7246A35416J5382A82a64501A75368K1036
11735A96404H3377K26341b60666C23389a37736J6830A76631b30871m6449r9819
11725c77139A08297b42164D6671L9098c8850B78928h2747F5872b94530J22757
$$ plain form
11715 -171773 -39577 -99725 221713 -99192 96935 -351566 -145363 288235 -6447 -158383 -279278
11704 -279278 -100910 10461 -288655 -182882 167615 298342 186108 -178813 -221819 53058
11693 237626 100627 -202509 -162827 108313 -3087 -23521 64149 -170965 109808 189404 125982
11682 125982 116512 -11433 195333 -206249 -248817 -115203 -93772 -152261 -18702 216106 -295624
11670 -7835 118719 305684 -84810 271850 25038 -96476 -87543 -19229 -56802 -12267 -222568
11659 -222568 -170327 -27821 -231255 -91096 -42829 7844 -229889 -137168 -76417 105713 -438063
11647 280752 251430 -50546 -192196 -72742 -177320 -1750 51051 171212 -60338 -65887 -196208
11636 -196208 -232918 48860 235782 203679 -290350 306515 -68585 -1892 179844 -210500 136292
$$ packed form
11715a71773c9577o0148B21713i9192I6935c51566a45363B88235f447j51936j20895
11704b79278a00910A0461b88655J05773A67615J30727j12234a78813m3006E3058
11693B37626A00627b02509L9682A08313c087k0434F4149a70965A09808P9596o3422
11682A25982r470a1433A95333b06249m2568a15203K1431n8489a8702B16106b95624
11670g835A18719J86965h4810B71850B5038i6476Q933a9229l7573a2267k10301
11659b22568N2241b7821k03434i1096d2829G844b29889R2721O0751A05713d38063
11647B80752k9322e0546j41650g2742j04578a750E1051J20161f0338n549j30321
11636a96208l6710D8860J86922l2103b90350C06515f8585a892A79844b10500A36292
$$ plain form
11624 130114 49739 -85085 -82278 58716 -78986 84049 74087 115853 -49117 24742 -340255 -63619
11611 17350 151311 922 -206164 -56270 136664 -21660 -77390 -27729 -85012 162974 -70045
11599 3295 353420 64 62118 136469 126867 -194918 212860 -77746 -253070 -265409 82776 -100143
11586 168304 -269555 112483 122341 -175513 19006 135646 10052 102420 -45049 -116608 -203718
11575 -203718 43682 76990 81720 270294 83471 32094 -223325 -198617 -138487 -72319 357567
11563 182350 387789 389059 -106960 -71060 -46921 -113836 82234 -394321 -110482 -151088 182230
11551 -250322 115412 -40077 413577 12142 -157381 242937 114309 173627 -210733 -274734
11541 -274734 316080 214249 6315 82286 186080 280549 -7605 182172 -205243 186343 -39574
$$ packed form
11624A30114D9739h5085K807E8716g8986H4049r962M1766d9117B4742c40255f3619
11611A7350J33961I22b06164e6270A36664b1660n5730b7729n7283A62974g0045
11599C295L50125F4O2054P4351r602a94918B12860g7746j75324j2339H2776a00143
11586A68304b69555A12483R858a75513A9006J16640A0052R2368d5049p1559q7110
11575b03718D3682L3308M730J88574H3471C2094b23325K4708O0130O6168C57567
11563A82350K05439J270a06960L5900K4139o6915H2234c94321a10482m0606A82230
11551b50322A15412d0077D13577A2142a57381B42937A14309N9318b10733o4001
11541b74734C16080j01831F315P5971J03794R4469g605A82172b05243A86343c9574
$$ plain form
11529 148893 465225 24409 342454 -82810 414564 148959 -93340 -127671 -158049 -220888 365962
11517 41811 169554 -117598 434656 -24130 58639 -203098 289059 -83098 131225 133844 85098
11506 85098 -43638 -16116 141215 266281 254373 242369 32280 7872 83150 60734 55133 -6178
11493 12777 -113694 233850 -137036 80564 58604 132685 293679 -73919 43809 449811 437284
11482 437284 -30291 81231 74841 299561 20157 275146 -16696 141825 271441 -310258 509268
11470 135775 83506 221075 -187568 51334 102785 5090 -44200 157377 267352 295792 30056
11458 -59213 8791 324662 -120334 294016 201116 21040 400454 -169864 -174566 -141195 194196
11446 -281908 -91365 133096 58042 14307 121349 -14860 332224 122932 4029 -114793 231597
$$ packed form
11529A48893L16332B4409L18045h2810D14564A48959i3340l4331l0378o2839C65962
11517D1811J27743a17598D34656b4130E8639b03098B89059h3098A31225K619m8746
11506H5098d3638a6116A41215J25066j1908j2004C2280G872P5278k2416n601f178
11493A2777a13694B33850a37036H0564k1960P4081J60994g3919D3809M06002j2527
11482D37284c0291H1231o390K24720B0157K54989a6696A41825J29616c10258E09268
11470A35775n2269J37569a87568E1334N1451E090d4200A57377J09975K8440C0056
11458e9213H791L15871a20334B94016r2900B1040L79414a69864m702L3371A94196
11446b81908i1365A33096E8042A4307J07042a4860C32224A22932D029a14793B31597
$$ plain form
11434 -421284 54636 400313 -247602 120011 -53124 37762 72870 -644058 23205 66465 40897
11423 40897 342916 99674 91775 -289919 -42968 -11032 41002 309526 84114 93183 -87653
11411 -93149 135660 -228395 -218903 -206681 -50764 -112937 159805 -88579 -149667 353020 -10616
11399 -91971 144476 -65363 -333331 -183552 -151734 348716 -187464 39793 -72108 -187357
11389 -187357 -14870 169016 -445236 -41166 -142582 -180239 -3253 50713 60766 352251 -240085
11377 278861 234319 116948 258433 -285011 -169786 209882 -43435 56220 196214 169193
11367 169193 229399 -39824 269967 292463 101272 219337 -362166 78698 -164634 -172418 101897
11355 -103568 -19401 195488 -354434 156691 105453 -149064 114346 -149021 -99824 201439
$$ packed form
11434d21284E4636L45677b47602A20011e3124C7762L5108f44058B3205M3260k5568
11423D0897L02019I9674p899b89919d2968a1032D1002K68524H4114R069h7653
11411i3149A35660b28395R492J2222e0764o2173A59805h8579o1088C53020a0616
11399i1971A44476f5363k67968J49779L1818C48716a87464C9793g2108j15249
11389a87357a4870A69016d45236d1166j01416l7657c253E0713J0053K91485b40085
11377B78861m4542A16948J41485b85011J15225B09882d3435E6220J39994k7021
11367A69193O0206c9824B69967K2496A01272J18065c62166G8698a64634p784A01897
11355a03568a9401A95488c54434A56691n1238a49064A14346a49021M9197B01439
$$ plain form
11344 -6873 8522 202394 -201741 -254476 -46776 45353 48536 158348 -216323 -23838 -440393
11333 -440393 -320888 8096 178578 -141673 -223750 239417 -248453 214310 -53446 -325988
11323 -325988 -22313 -8162 -49146 -174226 -78174 33569 63126 -212874 78433 -16853 -158155
11312 -158155 150843 151308 -263177 -40617 310963 -203040 35476 -60276 -10975 -67868 95703
11300 109500 -65287 248482 -87351 130202 125019 15290 -389350 -67113 -64476 -303980 112090
11288 -53323 -64196 -153065 -65044 -6078 -315107 -386376 -71138 91064 -18254 -151946 -457517
11277 -457517 228166 -23685 105564 -23685 83374 216731 199914 -40003 -168746 80705 335157
11266 335157 -179712 -48300 -206933 -62586 131760 -209222 -261790 -308295 58916 261436
$$ packed form
11344f873H522J93872b01741n2735d6776D5353L183J09812b16323b3838m16555
11333d40393J19505H096J70482a41673q2077B39417b48453B14310e3446k72542
11323c25988b2313h162m0984j25080g8174C3569K9557b12874G8433a6853j41302
11312a58155A50843M65b63177d0617C10963b03040C5476f0276a0975n6893I5703
11300A09500f5287B48482h7351A30202n183A5290c89350f7113K637k39504A12090
11288e3323j0873q8869f5044f078l09029p1269g1138I1064a8254j33692l05571
11277d57517B28166b3685A05564b3685H3374J33357j6817d0003j28743H0705K54452
11266C35157a79712d8300j58633f2586A31760b09222n2568m6505E8916K02520
$$ plain form
11256 261436 87937 -55632 -55836 -79610 -123981 -224238 -167412 -2530 36054 -120121 -196831 -211231
11244 -211231 -67455 -184829 -141146 -210598 -221329 264607 -66467 72789 -67571 -25361 -130756
11233 -130756 69620 55890 130975 -38942 129456 -91150 -122386 12872 -44015 156393 -368745
11221 -29277 -73876 309158 173733 -576858 -136475 -29773 -42628 26772 -330722 -172805
11211 -172805 20405 -248265 -152556 80768 85624 -298248 23454 196502 -192620 -138377 -74980
11200 -74980 50516 -323861 -41542 -2327 -269294 -14511 -69945 24935 94510 -30320 -51793
11189 -51793 -224778 -336740 -109119 -126808 -270602 194078 39396 -231884 -5656 -78374 -397895
11178 -397895 90253 -14350 180631 132049 -246753 -143235 97847 -66211 -232870 -387305
$$ packed form
11256B61436H7937e5632k04k3774m4371j00257N6826b530C6054a20121p6710j4400
11244b11231f7455j17374M3683o9452j0731B64607f6467G2789f7571b5361j05395
11233a30756F9620j3730P5085c8942A29456i1150l1236A2872d4015A56393c68745
11221b9277m4599C09158j35425e76858a36475b9773j2855B6772c30722J57917
11211a72805B0405b48265R5709H0768M856b98248B3454J73048a92620N4243O3397
11200g4980E0516c23861d1542b327k66967a4511n5434B4935O9575c0320k1473
11189e1793j72985j11962a09119j7689j43794A94078C9396b31884e656p2718l19521
11178c97895I0253a4350A80631m8582b46753J03518I7847f6211j66659j54435
$$ plain form
11168 -387305 -126622 -196820 -8811 -243351 195674 -135169 -201944 -133495 4523 274 -111233
11156 -150638 130491 -130062 -217217 29552 156853 16333 -214061 -153639 204965 -3283 -32308
11145 -32308 -112627 -561781 127024 25340 -195051 462375 54933 534733 83480 180364 377374
11134 377374 -109453 211761 14512 -37531 26796 57980 -119144 -190807 24729 193814 -215754
11122 106135 -56388 -73557 53217 -191498 -153979 49948 -83187 -234074 320560 118715 -71224
11110 294245 356694 98078 146997 16303 297865 -242987 73244 -224134 -6312 -35191 -240304
11099 -240304 97543 51620 34833 211457 80859 -56088 253563 122807 297399 39250 17137
11087 214465 204332 19653 54167 123405 160928 149037 -221314 442355 -124882 413777 56877
$$ packed form
11168c87305a26622p0198h811k34540A95674a35169o6775O8449D523B74a11233
11156a50638A30491a30062q7155B9552J27301A6333b14061O0422B04965c283k9025
11145c2308q0319m49154A27024B5340a95051D62375E4933M79800H3480R6884J97010
11134C77374a09453B11761A4512c7531B6796L1184a19144p1663B4729J69085b15754
11122A06135e6388j7169E3217a91498L7519D9948h3187j50887C20560A18715g1224
11110B94245O2449I8078M8919A6303K81562b42987G3244b24134f312k8879k05113
11099b40304I7543m5923j6787J76624H0859e6088B53563A22807J74592C9250A7137
11087B14465j0133A9653L4514O9238L7523j1891b21314D42355a24882D13777E6877
$$ plain form
11075 209150 49864 103784 -14821 36034 41649 270195 173014 -23186 414739 -19417 286451
11063 59521 223927 316902 542144 224086 499266 710074 551664 405642 474015 121163
11052 620607 455795 610831 369940 175777 912707 750388 677335 367980 673290 509067
11042 509067 518436 591908 825685 591428 703729 926243 781782 568607 419244 471373
11032 471373 401601 438532 658567 366601 444529 823627 690481 576153 474572 247976
11022 247976 312560 582476 408385 565944 658681 480443 263345 356555 453774 241550
11012 241550 606391 643276 774199 458292 572575 413026 537869 568984 753494 244231
11001 527340 660830 797238 663461 296045 204195 467072 319207 250471 356636 60912
$$ packed form
11075B09150D9864N3920a4821C6034N615K28546r7181b3186D14739a9417B86451
11063E9521J64406R2975K25242B24086K75180K10808j58410j46022O8373A21163
11052F20607j64812J55036k40891A75777P36930j62319p3053l09355L05310j64223
11042E09067R369P3472K33777k34257J12301K22514j44461k13175j49363N2129
11032D71373o9772L6931K20035k91966P7928L79098j33146j14328j01581k26596
11022B47976O4584K69916j74091J57559R2737j78238k17098R3210R7219k12224
11012B41550L64841L6885J30923l15907J14283j59549J24843L1115J84510B44231
11001E27340J33490J36408j33777B96045r1850K62877j47865o8736J06165F0912
$$ plain form
10990 523120 659449 394205 168340 584876 306515 800328 800199 559907 474563 1183141
10980 1183141 850484 1011911 774062 977693 1459711 1183275 1240156 1082559 1649654 1673001
10970 1673001 2077695 2423204 2302220 2479318 2731637 2592124 2597457 2282627 2297435 1982796
10960 1982796 1223321 1308338 1348128 1202429 1251513 1029879 1521751 850253 1207694 869988
10950 869988 910126 854221 253691 582495 532402 168822 419815 480710 280364 366869
10940 366869 151656 -151914 123085 48631 158594 256607 -7827 33250 169190 222149 541234
10929 541234 420142 149367 331148 -261701 114866 -63326 -47369 -77918 -186021 73562
10918 24583 -525305 187749 -76084 -203294 -101117 -295402 196999 37967 168884 71255
$$ packed form
10990E23120J36329k65244A68340M16536k78361M93813j29k40292q5344P08578
10980A183141l32657J61427k37849K03631M82018k76436N6881j57597N67095K3347
10970A673001M04694L45509j20984J77098K52319j39513N333l14830J4808l14639
10960A982796p59475Q5017L9790j45699M9084k21634M91872o71498L57441l37706
10950H69988M0138n5905B53691L28804n0093A68822K50993O0895k00346Q6505
10940C66869A51656a51914A23085D8631J09963R8013g827C3250J35940N2959L19085
10929E41234j21092A49367J81781b61701A14866f3326J5957l0549j08103G3562
10918B4583e25305A87749g6084j27210a01117j94285A96999C7967J30917G1255
$$ plain form
10907 79112 360426 -437084 71914 -137530 -40891 -419509 -226034 5973 -231396 25916 304855
10896 304855 386398 -167360 83916 52310 -4941 -397766 -201742 -162489 157972 -115620 -7199
10884 -43433 305246 -250609 442822 173682 234222 -286165 -113903 -46543 -328213 -10856
10873 -42506 36808 -270235 36289 -32853 -91971 -31366 273540 -105832 136725 159695 -37638
10861 -109923 -289267 -302628 -381158 -41233 -185192 48534 -151569 -142185 -116372 -72649 206372
10849 163405 164579 298504 600972 33749 -51507 -30568 -365101 -147657 183408 77490 -85392
10837 322076 118039 -41445 -47002 -163732 159663 356299 -64560 -176947 90303 -322876
10826 3981 -11098 -39280 -59525 85568 -260248 151093 183580 -81889 -108379 -27507 -68566
$$ packed form
10907G9112K81314d37084G1914a37530d0891l78618J93475E973b31396B5916K78939
10896C04855Q1543a67360H3916l1606d941l92825J96024L9253A57972a15620g199
10884d3433C05246b50609D42822A73682O0540b86165a13903d6543k81670a0856
10873d2506C6808b70235C6289c2853n9118c1366B73540a05832A36725K2970c7638
10861a09923j79344j3361p8530d1233j43959D8534a51569R384K5813M3723B06372
10849A63405J174J33925L02468C3749e1507K0939l34533a47657A83408G7490h5392
10837C22076A18039d1445n557j16730A59663J96636f4560j12387I0303c22876
10826C981a1098k8182k0245H5568b60248A51093L2487h1889k6490b7507m1059
$$ plain form
10815 -68566 -86143 153118 14589 -35830 12290 -115875 -195555 43856 90612 -55485 5164
10803 -114362 -14445 -298012 105510 -254811 -254058 66431 149222 207485 31985 -78018 -351958
10792 -351958 -21019 -271294 29183 -102715 -221519 164278 -41726 -29099 -175405 190164
10781 -106980 -42536 -45368 -230442 -183690 -286316 -290303 -3007 -202899 295421 134095 -350654
10769 -159743 102627 -44120 35229 -128974 -108873 -89151 90685 62861 -241016 -7701 152298
10757 -102516 -631 -236543 -103195 -129493 -184622 -198454 26749 -103243 9677 444318 196728
10745 -135578 -106106 -30603 -222285 15911 -132937 200174 -59752 53254 108731 -91662 20881
10733 -96922 116442 -104955 144295 -38757 182903 31799 37417 -185301 -306029 -270471 10407
$$ packed form
10815f8566j7577A53118A4589c5830A2290a15875p9680D3856M6756e5485E164
10803a14362a4445k83567A05510b54811P53F6431Q2791N8263C1985g8018k73940
10792c51958b1019k50275B9183a02715j18804A64278d1726J2627j46306A90164
10781a06980d2536k832j85074M6752j02626l987c007j99892B95421A34095c50654
10769a59743A02627d4120C5229a28974K0101J9722I0685k7824b41016g701A52298
10757a02516f31k35912a03195k6298n5129j3832B6749a03243I677M34641A96728
10745a35578K9472c0603j91682A5911a32937B00174e9752E3254N5477i1662B0881
10733i6922A16442a04955A44295c8757A82903C1799N618a85301j20728L5558A0407
$$ plain form
10721 -78021 90662 -142576 -180784 204849 34487 -424650 -95230 -253668 -32574 -153179 -340062
10710 -340062 -90419 -25794 64514 72140 -176559 -42544 68463 -385967 -554893 -21589 -257999
10699 -257999 -194966 80698 -87790 106185 -124883 38999 176119 124346 -241100 -224030 289629
10687 125543 -33143 212776 -108860 10680 -102587 -172232 265483 -63190 43514 -31524 129480
10675 -24123 -48822 -53043 -284354 -136233 403280 254331 77787 -288702 64674 -353385 -58522
10663 -39081 -34055 377100 96445 -239384 -278624 133065 184792 -24367 14249 -34514 -445871
10652 -445871 -168554 -269870 -30110 -6281 -256092 -169559 -217216 -153286 73196 -174689 -99681
10641 -99681 126097 -151047 249343 -103002 133377 -168271 -80266 183729 -227376 -242399
$$ packed form
10721g8021I0662a42576l8208B04849C4487d24650i5230j58438c2574j20605j86883
10710c40062i0419b5794F4514P626a76559d2544F8463c85967j68926b1589k36410
10699b57999O3033H0698h7790A06185a24883C8999J37120n1773b41100J7070B89629
10687A25543c3143B12776a08860A0680a02587o9645B65483f3190D3514c1524A29480
10675b4123k4699m221k31311a36233D03280j48949G7787b88702F4674c53385e8522
10663c9081N026C77100I6445b39384l9240A33065N1727b4367A4249c4514m11357
10652d45871a68554j01316c0110f281k49811Q6533m7657O3930G3196a74689P5008
10641i9681A26097a51047B49343a03002A33377a68271h0266A83729b27376j5023
$$ plain form
10631 -242399 -70636 107526 -323646 -29802 -445799 -137613 -36582 -128600 -264221 -27761
10620 208498 127103 -191130 -176694 -120215 -94495 80474 172733 -16730 -185257 -39360 -17867
10608 -236237 156841 -244790 -241635 -337135 -16801 -229246 -279608 94224 31173 -195975 -44102
10596 -25909 -198839 -420158 66890 121681 -97912 -95590 -46731 157577 -264024 191362 -213792
10584 -330824 -128666 208400 -210598 -98188 113554 -57623 -240927 -170010 -176192 -92492 -30691
10572 -236826 42634 21702 -206810 -159359 -1462 -24752 -316258 -40568 -554052 -261900 111017
10560 136336 133816 55394 314844 49278 -221683 -178749 -112704 77740 -450454 148902 120575
10549 120575 -62141 -295137 -136735 33614 91271 7367 -374548 -94392 -322039 -148647 45630
$$ packed form
10631b42399g0636A07526c23646b9802m15997a37613c6582r2018j35621b7761
10620B08498q1395a91130J4436N6479K5720H0474R2259a6730j68527c9360a7867
10608b36237A56841b44790L155r5500a6801k12445n0362I4224C1173a95975d4102
10596b5909j72930k21319F6890N4791i7912K322d6731A57577b64024A91362b13792
10584c30824a28666B08400b10598i8188A13554e7623j83304P0917o182Q3700c0691
10572b36826D2634k0932b06810M7451a462k3290k91506d0568n13484b61900A11017
10560A36336k520E5394K59450D9278b21683M2934O6045G7740d50454A48902k8327
10549A20575f2141k32996a36735C3614N7657G367c74548i4392k27647a48647D5630
$$ plain form
10537 121160 -256642 231245 246445 146956 -78154 -16492 -44963 -415985 -144169 -79843 -13793
10525 121537 -13595 -33644 -283697 79006 -120508 -56113 -173612 -162371 -159118 189125 -79129
10513 -232247 37845 -298462 -118709 -197574 -98578 30730 135073 -406354 26261 -27949 169060
10501 -82124 -62380 6627 -479716 -138743 377959 270305 -54741 -10575 -363794 -257001 -132777
10490 -132777 193616 -162209 -8890 -236960 75228 189100 -52271 406684 144411 41120
10479 106361 175390 467226 60577 92533 -12794 -45242 -170633 -74925 146658 -126751 -140387
10468 -140387 121545 -138141 -113841 551489 -101265 -344102 -173467 435628 -163531 13327
10457 8317 158121 42829 88097 -175863 -3234 -23838 -167443 335582 180585 -79825 -58986
$$ packed form
10537A21160b56642B31245J5200r9489g8154a6492k8471l71022a44169O4326a3793
10525A21537a3595k0049k50053G9006a20508e6113j17499J1241L253A89125g9129
10513b32247C7845b98462a18709p8865i8578C0730J04343d06354B6261b7949A69060
10501h2124J9744F627d79716a38743C77959j07654e4741a0575l53219J06793J24224
10490a32777A93616a62209h890k28070G5228J13872e2271D06684A44411D1120
10479A06361O9029K91836F0577L1956a2794l2448j25391g4925A46658a26751j3636
10468a40387A21545a38141K4300E51489a01265k42837J70635D35628a63531A3327
10457H317J49804D2829M5268a75863c234k0604j43605C35582j54997g9825K0839
$$ plain form
10446 -58986 -18916 254627 -199395 -192628 25563 117109 -193143 5486 160553 291712 -19581
10434 53370 -141552 -321245 18208 -64287 -259770 -446849 -223608 91066 -297070 121860
10423 -288668 475961 -223537 -60833 164216 -52203 -242196 -162298 -109914 -3505 -170356 -35255
10411 8629 -46911 -9503 -106218 -81231 274328 -92062 -174970 -205336 -65326 -113756 10704 -21026
10398 -108527 23739 -181365 -29676 6801 22210 -40600 72688 56797 209684 425335 105399
10386 190552 -38639 313888 -119871 15946 -59265 199496 -196460 356713 206046 252394
10376 252394 60297 241338 74968 95245 425319 78990 56698 -14175 216568 -12990 258868
10364 314242 286139 270779 371861 280235 464500 516812 267539 234678 17023 328981 219000
$$ packed form
10446e8986a8916B54627a99395O767B5563R1546a93143E486J55067J31159a9581
10434E3370a41552j79693A8208f4287j95483j87079K23241I1066b97070A21860
10423b88668D75961b23537f0833A64216e2203j89993P9898N2384c505j66851c5255
10411H629d6911i503r6715K4987B74328i2062q2908l0366f5326m8430A0704b1026
10398a08527B3739a81365b9676F801J5409d0600G2688j5891J52887K15651A05399
10386A90552c8639C13888a19871A5946e9265A99496a96460C56713j50667M6348
10376B52394F0297J81041G4968K0277L30074G8990k2292a4175B16568a2990B58868
10364C14242k8103j5360J01082r1626J84265N2312k49273l2861A7023L11958j09981
$$ plain form
10353 219000 19921 87300 149802 213834 574002 343537 380921 704710 396851 -76120 486900
10341 18438 55199 130521 213993 288568 254973 185276 147949 309139 128527 147671 5637
10329 -60920 -139889 -1826 121632 -17016 62877 -164640 -15992 157057 -65120 215067 -276189
10317 229406 187048 88434 -89769 -274290 122289 504833 -22834 -98457 163985 193608 -114420
10305 11094 -15788 154682 -389745 -426950 -58899 -294903 100154 180717 103508 160827 123388
10294 123388 -101496 130766 -158072 263888 -188630 -200821 -113108 92710 30922 -130007
10283 204386 -199899 -146743 -90497 83894 137604 -89700 23518 42263 182666 -14559 -16234
10272 -16234 31400 67916 -310335 88867 -16866 -293166 -78234 -145867 -517584 -183603 89072
$$ packed form
10353B19000A9921O7379O2502O4032L60168k30465L7384L23789l07859g6120D86900
10341A8438L6761P5322Q3472P4575l3595o9697l7327J61190A28527J9144E637
10329f0920p8969a826A21632a7016F2877a64640a5992A57057f5120B15067b76189
10317B29406m2358H8434h9769j84521A22289L82544b2834p5623A63985K9623a14420
10305A1094a5788A54682c89745l7205e8899k36004A00154Q0563p7209N7319l7439
10294A23388a01496A30766a58072B63888a88630j2191Q7713I2710C0922a30007
10283B04386a99899N3156N6246H3894N3710h9700B3518J8745J40403a4559j675
10272a6234C1400L6516c10335H8867a6866k76300g8234o7633l71717a83603H9072
$$ plain form
10260 48630 -161375 482144 81577 -2632 205299 261952 163995 374180 92261 91231 144335
10249 144335 372637 174636 -111451 -161075 105732 -45475 -179248 278660 51304 20545
10238 -82648 -246602 53874 -52772 -159897 -74973 -55947 171729 -49729 126866 -42929 51159
10226 -114111 78359 211147 -34042 46907 90079 -143125 -46772 -144965 -36142 29597 -535716
10214 -51957 -63762 -77205 82003 -24954 -142867 -284696 -344764 -326017 -308966 -92232 398357
10202 79916 27579 141798 31855 10264 77868 -95029 38145 -347126 -124110 -198014 -133187
10191 -133187 -62818 91377 -118225 -252913 -664539 -204862 -51913 180523 -367207 189842
10180 58950 -22235 -43449 -86320 -265211 -378534 -275739 -392982 -228135 -50758 -207874
$$ packed form
10260D8630a61375D82144H1577b632B05299N6653r7957K10185I2261j030N3104
10249A44335K28302A74636a11451m9624A05732d5475j33773B78660E1304B0545
10238h2648j63954E3874e2772j07125g4973J9026A71729d9729A26866d2929E1159
10226a14111G8359J32788c4042D6907M3172a43125d6772r8193c6142B9597e35716
10214e1957j1805j3443H2003b4954j17913j41829o0068J8747J7051i2232C98357
10202G9916B7579J14219C1855A0264O7604i5029C8145c47126a24110p3904O4827
10191a33187f2818I1377a18225j34688m11626b04862e1913A80523c67207A89842
10180E8950b2235k1214m2871j78891j13323J02795j17243J64847e0758j57116
$$ plain form
10170 -207874 36992 96468 101606 -317815 -233776 -253546 -41398 -68972 201684 -137750 -49999
10158 -104738 4561 223227 -200358 -465385 -352205 166723 -70108 304576 32007 -65077
10147 -220678 -92442 1880 -180788 1578 -274518 166495 157491 215522 -86682 -197209 -318026
10136 -318026 -155468 -299937 94082 -283848 75298 -112346 42104 176284 -274402 -281962
10126 -281962 -182456 -102231 -98690 -251123 -46833 -57588 43080 -189768 -98974 153515 72494
10114 -459373 151386 80827 168087 -328034 257554 -100980 -127374 -73209 72858 -127203
10103 -54258 -5262 24179 212910 -145997 37492 -52444 272822 51608 303373 -228663 -258980
10092 -258980 -184888 -29537 -177932 -53967 -111435 -222464 -279595 -217821 66917 191724 26907
$$ packed form
10170b07874C6992N9476N138c17815Q4039j9770d1398k7574B01684a37750d9999
10158a04738D561K18666b00358k65027J13180A66723g0108C04576C2007f5077
10147b20678i2442A880a80788A578b74518A66495r004N8031h6682j10527j20817
10136c18026a55468j44469I4082b83848G5298a12346D2104J34180b74402p560
10126b81962R9506Q0225L541j52433d6833j0755D3080a89768R0794A53515G2494
10114d59373A51386p0559Q7260c28034B57554a00980k6394N4165G2858a27203
10103e4258e262B4179J88731a45997C7492e2444B72822E1608K51765b28663l0317
10092b58980P4092b9537j48395e3967n7468j11029n7131O1774F6917J24807B6907
$$ plain form
10080 -136691 152576 158239 -11121 -37123 -203549 9415 -200986 -10945 -397203 -46928 247533
10068 -110567 -58438 -96316 -223999 165370 -74042 346484 -5444 294033 60784 72366 282796
10057 282796 -379430 -88542 -132422 192581 -109149 122051 -239711 -265178 -3108 59411 -58256
10045 -502165 -235324 137354 -77045 -310988 -189475 -268362 95102 -286469 337327 -39299
10034 -335658 60007 179960 60055 -307216 -261446 57292 26049 209118 -95214 -321530 56415
10022 15654 -267745 -312256 135621 8708 -39709 -150591 220214 -6805 210160 65094 -351906
10010 -203850 131352 -22194 -231585 -101089 -79120 29717 -188597 18772 -136468 -139239 183344
9998 12459 -33621 4964 -256094 -102021 63994 -178274 11048 3225 -236204 -139906 -3839 -76500
$$ packed form
10080a36691A52576N663a1121k6002j66426I415b00986a0945l86258d6928B47533
10068a10567N2129l7878j27683A65370g4042C46484e444B94033F0784J1582K10430
10057B82796c79430h8542m3880A92581a09149A22051b39711k5467c108E9411e8256
10045e02165b35324A37354g7045k33943J21513p8887I5102b86469C37327c9299
10034c35658F0007J19953F0055c07216M5770E7292B6049J83069i5214k26316E6415
10022A5654b67745m4511A35621H708c9709j10882B20214f805B10160F5094c51906
10010b03850A31352b2194k09391a01089K1969B9717a88597A8772a36468k771A83344
9998A2459c3621D964b56094a02021F3994a78274A1048C225b36204R6298c839p2661
$$ plain form
9986 -76500 -330759 -84044 -176081 131729 182674 -48131 -77352 -262088 -212182 -51953 -253080
9975 -253080 177876 -164347 -216747 -75813 46410 -86311 -228291 -41908 -257400 -38708 -81252
9964 -81252 83714 -4809 -144070 210925 -412799 90398 73048 9523 7669 100633 -383397 137834
9951 -17349 156499 338547 -77594 -56537 -115301 145984 -198321 -60424 -236467 127604 -294154
9939 90494 -340965 260428 -40885 -74324 -193761 -134173 -19957 40493 51678 -70221 -140640
9928 -140640 156530 -2649 -497299 -127991 52627 -232893 -241103 -468832 -374774 -40109 174371
9916 -355126 213304 -252389 -223640 97200 -245536 -363769 -356607 -188624 -256 -32621 -94636
9905 -94636 -165583 -1911 -127140 -162258 -197754 208990 -92414 -256805 243090 -405325 -30382
$$ packed form
9986g6500k54259h4044r2037A31729N0945d8131k9221j84736M9906e1953k01127
9975b53080A77876a64347n2400g5813D6410h6311j41980d1908k15492c8708m2544
9964h1252H3714d809j39261B10925d12799I0398j7350I523j854R2964c83397A37834
9951a7349A56499J82048g7594K1057n8764A45984a98321f0424j76043A27604b94154
9939I0494c40965B60428d0885l3439j19437N9588a9957D0493J1185g0221p0419
9928a40640A56530b649m94650a27991E2627b32893q210k27729R4058d0109A74371
9916c55126B13304b52389K8749I7200b45536j18233P162J67983b56l2365o2015
9905i4636p0947a911j25229l5118l5496B08990i2414j64391B43090d05325c0382
$$ plain form
9893 -229278 -408730 -23791 -62438 -370779 321557 116366 -267993 -369263 -154008 -7609
9882 195161 -122862 27789 109831 -319756 -37691 178891 92351 -6548 -103790 -82105 -42621
9871 -42621 236246 170922 83541 -303521 -247859 -85008 41177 -26436 -24162 58529 -60444 -111727
9859 -111727 65162 230746 -531494 -284613 -182899 -118597 -338389 270912 -1314 -43602 -45854
9848 -45854 90038 6829 -255240 -152071 -626319 -237461 -259236 -144297 235414 -129943 -231019
9837 -231019 -15531 90988 -217531 27582 -12600 -106006 136273 143182 -84536 54648 152521
9826 152521 97187 317584 -88769 -28496 -133007 53176 -38847 -253912 -226792 -244474 -40482
9814 -205008 -94281 6921 72354 -157345 -140461 56829 -411493 -42848 307153 105976 45527
$$ packed form
9893b29278j79452b3791l8647l08341C21557A16366b67993j01270a54008g609
9882A95161a22862B7789Q2042c19756c7691A78891q6540f548r7242K1685L9484
9871d2621B36246o5324H3541c03521N5662h5008D1177b6436K274E8529f0444n1283
9859a11727F5162J65584e31494K46881J01714O4302k19792B70912a314m2288k252
9848d5854I0038F829b55240J03169m74248b37461k1775J14939B35414a29943j01076
9837b31019a5531I0988b17531B7582a2600r3406A36273O909h4536E4648R7873
9826A52521n5334K20397h8769b8496j04511E3176c8847k15065K7120j7682d0482
9814b05008i4281F921O5433a57345J6884E6829d11493d2848C07153A05976D5527
$$ plain form
9802 -40836 165185 -62709 -215346 -52157 -134819 -33645 -313751 199089 -208644 -246243 -259848
9791 -259848 -21802 327051 -151802 48059 -73579 -100898 -30923 392608 -267019 81586 -179271
9779 181174 27551 -202101 39242 -102184 -65267 -248842 -312873 -297865 -301041 -227854 109980
9767 -182325 -462754 -253215 -164151 27823 -47491 90746 -173547 33929 212047 -389509 -39402
9755 -239407 -119675 -25697 44517 69575 -97591 22670 -60311 -107559 -209101 109658 -1876
9743 -410577 -332955 101435 -222702 -134969 8744 -226820 -7086 318905 135416 -74388 -1635
9731 -162004 -184572 144614 -300723 171949 -332392 28103 -180029 203042 -57755 -138722
9721 -138722 -141633 67899 165780 4389 -126869 -361282 -423764 -291543 -1251 -91919 -250991
$$ packed form
9802d0836A65185f2709j52637e2157q2662c3645k80106A99089b08644l7599j3605
9791b59848b1802C27051a51802D8059g3579k7319c0923C92608b67019H1586a79271
9779A81174B7551b02101C9242a02184L6917j83575o4031J5008l176P3187A09980
9767a82325k80429K09539Q9064B7823d7491I0746a73547C3929J78118c89509c9402
9755b39407a19675b5697D4517K5058i7591B2670f0311m7248j01542A09658a876
9743d10577P7622A01435b22702Q7733H744b26820g086C18905A35416g4388a635
9731a62004k2568A44614c00723A71949c32392B8103a80029B03042e7755q0967
9721a38722k911F7899R7881D389a26869k34413o2482J32221a251r0668j59072
$$ plain form
9710 -250991 -42834 92053 -118017 -262364 -398366 107553 49633 38890 259503 -91655 -286483
9699 -286483 387247 141394 -219845 10217 -176198 -285223 172861 -217608 -449533 346506
9688 -109048 11001 -144083 -264965 -3092 -168141 193556 83602 25109 -227653 -148705 -120831
9677 -120831 -54818 -246274 -27022 -170174 204895 -67210 -386500 -150562 113500 -34662
9666 -166172 24630 -339237 165421 -168673 -252463 -70704 -60807 -262629 -99253 57435 294059
9655 294059 -32498 -128867 -85110 205074 -137761 -42851 -359569 -240591 -146868 -233632 -356600
9644 -356600 -108368 -76233 117699 -261332 46474 293447 -211954 -22165 -227732 -46519
9633 -233447 -83508 92827 -428513 -108719 -312388 -84921 -116889 -119166 -346354 -67159 24753
$$ packed form
9710b50991d2834I2053a18017j44347j36002A07553D9633j0743K20613i1655j94828
9699b86483C87247A41394b19845A0217a76198j09025A72861b17608k31925C46506
9688a09048A1001a44083j20882c092j65049A93556H3602B5109b27653P8948K7874
9677a20831e4818j91456b7022j43152B04895f7210l19290a50562A13500c4662
9666a66172B4630c39237A65421a68673q3790g0704R897k01822i9253E7435K36624
9655B94059c2498r6369M3757B05074a37761d2851l16718J18978R3723q6764j22968
9644c56600a08368L2135A17699b61332D6474K46973b11954b2165k05567d6519
9633b33447h3508I2827d28513a08719k03669h4921l1968k277k27188f7159B4753
$$ plain form
9621 220178 185152 -327284 74949 -49497 -32887 -154974 74027 -159583 -318463 175635 -67794
9609 69699 228143 -84860 -107636 27915 207860 -69080 -76072 54605 -5318 -99454 252063 311958
9597 311958 -28894 354962 98414 -203143 -205104 -93252 30421 -505496 -144112 -114914 -73289
9586 -73289 -510666 -51405 8413 -222618 62139 -53859 -74822 141461 -61291 288487 -55578
9574 -113885 -203059 -136760 -235618 63882 -133153 102368 -349441 -255519 220761 -219140 -123201
9563 -123201 -62639 -142996 -143270 -121497 -125078 299732 -128940 -30717 -155182 359726 90101
9551 -122454 -39722 -50891 -135046 -606623 66002 346663 -360325 -139551 13899 -308545 144472
9539 -118610 208886 -292828 -49288 -21077 -365479 18253 -512773 58857 -17279 93460 232000
$$ packed form
9621B20178l5026c27284G4949d9497J6610j22087G4027a59583j58880A75635f7794
9609F9699J58444h4860k2776B7915J79945f9080o992E4605e318r4136B52063N9895
9597C11958b8894C54962I8414b03143j961i3252C0421e05496a44112K9198M1625
9586g3289m37377e1405H413b22618F2139e3859k0963A41461f1291B88487e5578
9574a13885q9174O6299r8858F3882a33153A02368c49441R3922B20761b19140R5939
9563a23201O0562q0357k74K1773l581B99732a28940c0717j24465C59726I0101
9551a22454c9722j1169q4155m71577F6002K80661c60325a39551A3899c08545A44472
9539a18610B08886b92828d9288b1077l44402A8253e12773E8857a7279I3460J38540
$$ plain form
9528 232000 -193219 -63321 3334 88065 51701 -179533 -290648 4685 39605 -28031 -206862
9517 -206862 -134220 -161301 -167143 183358 -25656 -317328 -338134 208462 109154 -277917 -215050
9506 -215050 -298165 6803 -98194 37463 175584 114694 -194520 -326611 -102212 78553 75902
9495 75902 -193968 -44640 -175913 245287 120225 5364 -83469 -310247 -101677 96889 -356361
9483 -98168 -55999 -345633 -31342 154198 -114018 88134 205934 61410 -66947 203957 -136540
9471 -179625 -270591 -353296 -316605 -23793 -254410 -176570 92580 56142 -111596 -122004 45730
9459 -460176 -79207 -212232 -147865 -4679 177757 -302876 -192965 -202217 -206675 34796 147208
9448 147208 207940 -194724 -42078 28356 -225688 -375577 98754 38785 -234869 166712 141850
$$ packed form
9528B32000a93219f3321C334Q4731l6364a79533j11115D685L4920b8031j78831
9517b06862P2642k7081n842A83358b5656k91672k0806B08462r9308b77917O2867
9506b15050q3115F803i8194C7463J38121o0890a94520j32091a02212G8553k651
9495G5902a93968d4640j31273B45287A20225E364h3469k26778a01677I6889c56361
9483i8168M2169k89634c1342A54198a14018H8134J17800F1410f6947B03957a36540
9471a79625r0966q2705L6691b3793k30617P7840I2580l6438a11596j0408D5730
9459d60176g9207j33025O4367d679A77757c02876J09911r252m458C4796J12412
9448A47208O0732a94724d2078B8356b25688j49889I8754C8785b34869A66712k4862
$$ plain form
9437 141850 -177223 -18728 128583 144135 -111570 -22685 -15777 79787 -161339 337017 -69056
9425 62632 56979 70992 -26254 -156357 -136459 -1680 153865 -26371 63434 48797 -123398 -119451
9413 -119451 -277913 136669 -172468 -158846 -89717 -500824 -77948 242785 -237436 140240
9402 -266298 -52626 -76489 -199371 -161583 -174616 48180 -246159 -34894 -253561 22608 72873
9391 72873 -127219 62119 245980 -37258 34072 -50538 -171444 79942 -187482 -228821 -128449
9380 -128449 -249040 -118756 -274619 234246 -60116 -467042 -531351 -9983 104844 -354775
9369 167900 -267261 17891 84103 -296126 31199 -138284 -315384 -101412 -28103 -116814 321335
9357 234067 -404025 6233 -214828 174725 -129966 -156433 -79818 150050 88566 -51315 18991
$$ packed form
9437A41850a77223a8728A28583J5552a11570b2685O908G9787a61339C37017f9056
9425F2632n653J4013b6254j30103J9898a680A53865b6371F3434j4637a23398L947
9413a19451j58462A36669a72468J3622O9129m11107g7948B42785b37436A40240
9402b66298e2626k3863j22882L7788j3033D8180b46159c4894k18667B2608N0265
9391G2873a27219F2119J83861c7258C4072e0538j20906G9942a87482m1339J00372
9380a28449j20591a18756j55863B34246f0116m06926o4309i983A04844c54775
9369A67900b67261A7891O6212b96126C1199a38284j77100a01412b8103q8711C21335
9357B34067d04025F233b14828A74725a29966k6467P6615A50050o1484e1315A8991
$$ plain form
9345 56014 -66762 32046 -190289 -160142 -8368 -213270 -254238 214305 -250834 -103109 -35456
9333 -108690 120473 -107391 -79475 26037 -456097 140681 -174006 105745 -144241 -305108
9323 -305108 -221494 -37562 -22032 -14637 152260 -229377 -204357 -62377 272542 -130633 -240103
9312 -240103 -57499 43079 -179029 223390 141611 98089 -370660 46516 -112328 -239536 304223
9300 -120871 88853 -86460 -168163 12329 -451988 12903 -855335 128088 -286718 -69246 -53838
9289 -53838 -108436 -240870 -129174 -16981 -315841 -280773 -4077 -80260 -80808 75656 258638 111662
9276 -182049 5570 124305 118692 -46384 116396 17368 -213797 -233596 -113422 -172826 53825
9264 -37565 -17249 17846 -263661 112504 68265 -155723 79787 -60227 -136750 128520 75876
$$ packed form
9345E6014f6762C2046a90289L0147h368k04902m0968B14305b50834a03109c5456
9333a08690A20473a07391K7916B6037d56097A40681a74006A05745a44241j60867
9323c05108Q3614c7562J5530P395A52260b29377K5020f2377B72542a30633j09470
9312b40103e7499D3079a79029B23390q1779m3522c70660D6516a12328j27208C04223
9300a20871H8853h6460q1703A2329d51988A2903h55335A28088b86718f9246J5408
9289e3838n4598j32434J11696a6981k98860L5068d077p6183n48G5656J82982A11662
9276a82049E570J18735n613d6384A16396A7368b13797j9799a13422n9404E3825
9264c7565a7249A7846b63661A12504m4239a55723G9787f0227p6523A28520n2644
$$ plain form
9253 75876 26288 -18760 -89675 68502 -24221 253769 -161028 -95643 91928 62428 -238417
9241 156062 -181763 -245323 -50366 87583 -178721 -184416 -106734 123688 -32125 -67180 -280072
9230 -280072 -467265 199433 2409 -145711 101219 239570 -52376 -188290 86055 155886 -228696
9218 -75766 194759 -168901 258545 70915 -275793 -31197 -289146 -174429 -202479 13975 -13611
9206 266055 65418 80382 34222 -120091 -175990 -136251 -405882 -37354 -305628 -379922 78646
9194 -115748 -210426 50368 9528 142271 31886 -83292 76057 86676 -327902 98727 -51622
9182 -23734 48042 -250987 -7622 -754 55506 175112 -10519 191784 15440 -276604 174064
9170 33567 -453206 -72453 -98189 -178563 96230 -117908 28609 -8056 89 -87589 -389150 -234397
$$ packed form
9253G5876B6288a8760p0915F8502b4221B53769a61028O5385I1928k9500b38417
9241A56062a81763o3560e0366H7583a78721n695P7682A23688c2125l5055k12892
9230b80072j87193A99433B409a45711A01219J38351e2376j35914H6055O9831b28696
9218g5766A94759a68901B58545G0915b75793c1197k57949J14717k8050A3975a3611
9206B66055F5418J4964C4222a20091n5899L9739k69631c7354k68274p4294G8646
9194a15748r4678E0368I528J32743C1886h3292G6057J0619c27902I8727e1622
9182b3734D8042b50987g622g54E5506J19606a0519A91784A5440b76604A74064
9170C3567d53206g2453k5736q0374I6230a17908B8609h056H9h7589l01561J54753
$$ plain form
9158 -234397 -97130 112378 -153472 238905 144374 -201141 -189815 129095 -259049 -197045
9148 -197045 112733 -163458 -31300 205321 -13187 -69455 40152 -273666 -1968 286106 -71122
9136 -8566 -47104 -59328 -106634 156149 183037 275967 89251 -341150 -1 -361 -248136 208375
9123 98487 -139083 242110 -251473 251407 -300813 128499 243864 -185621 184125 -219285
9112 66524 -86030 -241630 -362107 -134441 -117016 -143277 -446918 -244576 -64897 -322438 -265254
9101 -265254 -363276 128252 -172827 -238187 -243624 -125621 8362 41656 107559 292827 -51137
9089 -197030 -21869 -128231 15487 -224421 -330390 -168114 -86121 -47180 -244645 -65128 248649
9077 -174324 -88590 -109028 -199298 -30007 124107 -23989 -225590 -264123 -160033 74815 177451
$$ packed form
9158b34397i7130A12378a53472B38905r4531b01141J1326A29095b59049O2004
9148a97045A12733a63458c1300B05321a3187n6268D0152b73666a968B86106g1122
9136h566l8538j2224m7306A56149K6888R2930H9251c41150al60k47775B08375
9123I8487a39083B42110b51473B51407c00813A28499J15365a85621A84125b19285
9112F6524h6030j55600j20477a34441J7425k6261l03641K02342f4897k57541N7184
9101b65254r8022A28252a72827o5360n437J18003H362L3294O5903J85268e1137
9089a97030b1869j06362A5487b24421j05969J62276Q1993L8941j97465f5128B48649
9077a74324Q5734k0438r0270c0007A24107b3989k01601l8533J04090G4815J02636
$$ plain form
9066 177451 -124263 -168054 20651 112030 -120542 -367221 -221272 154890 46041 -52555 10398
9054 -431713 -39980 40318 -161404 -51949 -158036 -48841 49435 -33341 -71378 60222 -271767
9042 -199384 -215835 -59040 62328 -165914 -138086 -22316 185104 -72069 -72810 -331719 -13855
9030 60223 60802 -221956 -136883 -42114 -86867 -129088 94151 -15189 57276 89609 122175 -234771
9017 104697 -88030 -53255 -113849 -13346 -96636 42243 201560 51387 68469 -127365 -136585
9006 -136585 453522 -368413 -65606 108072 305879 -18538 180905 -113226 -986 1532 -433709
8994 -19706 225769 -347481 81035 -374176 -212845 -121812 -209690 201611 -106719 -430946
8984 -430946 -186334 99141 -253095 75429 128826 -57729 -213337 -140868 180843 -218447 124706
$$ packed form
9066A77451a24263m3791B0651R1379a20542k46679J45949A54890D6041e2555A0398
9054d31713c9980D0318a61404e1949j06087d8841D9435c3341l8037F0222b71767
9042a99384j6451e9040F2328a65914K7828b2316A85104g2069p41k58909a3855
9030F0223N79b21956Q5073d2114m4753m2221I4151a5189E7276L2333L2566b34771
9017A04697h8030L4775o0594a3346q3290D2243J59317E1387J7082a27365r220
9006a36585D53522c68413f5606A08072J97807a8538A80905a13226i86A532d33709
8994a9706B25769c47481H1035c74176J61331R1033q7878B01611a06719l24227
8984d30946a86334I9141b53095G5429N3397e7729j55608P2469A80843b18447A24706
$$ plain form
8972 -146823 94741 290355 -14787 -7686 -135222 9833 89489 -367824 -318894 -136313 -172572
8961 -172572 94019 -233598 106671 -182103 -452681 -72054 -319837 108438 206393 190415
8951 190415 -206557 273428 -425322 169698 62860 113842 206059 -8151 -43607 -94352 -251963
8940 -251963 149304 -196882 -48113 -111437 -346473 95736 181015 10213 81689 -233147 191790
8928 -210267 219463 -38230 -353037 147240 311340 359396 618337 1491917 2399919 4171995
8918 4171995 2239005 871689 276030 191064 73816 92263 79488 222528 159863 -8003 -126985
8907 -126985 174637 384238 -293043 21181 -228894 207585 -90477 -312446 123557 -91128
8896 -495652 -121927 -150536 -106519 91814 -148770 -272456 80881 148971 -55108 141206 263916
$$ packed form
8972a46823I4741J95614a4787P101j27536I833P9656c67824M8930a36313l6259
8961a72572I4019b33598A06671a82103k70578g2054k47783A08438R7955j5978
8951A90415b06557B73428d25322A69698F2860N0982R2217h151l5456n0745j57611
8940b51963A49304a96882d8113o3324k35036I5736Q5279A0213P1476b33147A91790
8928b10267B19463c8230l14807A47240J64100M8056K58941Q73580R08002J772076
8918D171995j932990H71689B76030q4966G3816J8447j2775J43040o2665h003j18982
8907a26985A74637K09601b93043B1181b28894B07585i0477k21969A23557i1128
8896d95652a21927k8609M4017I1814a48770j23686H0881O8090e5108A41206J22710
$$ plain form
8885 263916 -250313 -157861 -51841 1173 28058 -32306 -347839 82992 -231523 -328120 146009
8873 -404333 178894 -180662 -50783 -210353 -224903 222070 -62238 28435 -15462 -101054 79088
8861 120031 -254630 -16004 -173505 157901 157680 174590 -38662 102734 -61917 -84492 -146485
8850 -146485 -90552 -340498 5723 17919 -25916 -60084 26534 -198870 -66107 -1585 -302385
$$ packed form
8885B63916b50313R2452e1841A173K6885c2306l15533H2992b31523r6597A46009
8873d04333A78894a80662e0783j59570j4550B22070f2238B8435a5462q5592G9088
8861A20031b54630a6004j57501A57901k21J6910c8662A02734f1917k2575o1993
8850a46485N5933k49946E723J2196b5916l4168B6534a98870f6107a585l00800
$$ [...]
##END NTUPLES=NMR SPECTRUM
##END=
