##TITLE=AC1682_2981_8571508_A8kTSi5g7l
##JCAMPDX= 6.0         $$ Bruker NMR JCAMP-DX V2.0
##DATA TYPE= NMR SPECTRUM
##DATA CLASS= NTUPLES
##ORIGIN= BRUKER
##OWNER= Administrator
$$ 1.72 TOPSPIN		Version 2.1
$$ 2014-04-11 21:52:42.875 -0700  Administrator@X
$$ Compression mode = diff/dup
##.OBSERVE FREQUENCY= 400.02188249412
##.OBSERVE NUCLEUS= ^1H
##.ACQUISITION MODE= SIMULTANEOUS (DQD)
##.ACQUISITION SCHEME= undefined
##.AVERAGES= 64
##.DIGITISER RES= 22
##SPECTROMETER/DATA SYSTEM= spect
##.PULSE SEQUENCE= noesygpps1d.comp
##.SOLVENT NAME= COFFEE_meoh
##.SHIFT REFERENCE= INTERNAL, COFFEE_meoh, 1, 14.96279
##AUDIT TRAIL= $$ (NUMBER, WHEN, WHO, WHERE, PROCESS, VERSION, WHAT)
$$ ##TITLE= Audit trail, TOPSPIN		Version 2.1
$$ ##JCAMPDX= 5.01
$$ ##ORIGIN= Bruker BioSpin GmbH
$$ ##OWNER= Administrator
$$ $$ E:\/data/COFFEE/nmr/AC1682_2981_8571508_A8kTSi5g7l/32/pdata/1/auditp.txt
$$ ##AUDIT TRAIL=  $$ (NUMBER, WHEN, WHO, WHERE, PROCESS, VERSION, WHAT)
(   1,<2014-04-11 21:52:37.375 -0700>,<Administrator>,<X>,<go>,<TOPSPIN 2.1>,
      <created by zg
	started at 2014-04-11 21:41:07.607 -0700,
	POWCHK enabled, PULCHK disabled,
       configuration hash MD5:
       C8 4E 4E 5D D3 5C D8 9E 9F 52 82 E0 59 8A DE 15
       data hash MD5: 64K
       DE DE F6 4A B1 64 B8 C0 4D 0D 4D 9A C9 F5 5E 13>)
(   2,<2014-04-11 21:52:40.484 -0700>,<Administrator>,<X>,<proc1d>,<TOPSPIN 2.1>,
      <Start of raw data processing
       efp LB = 0.3 FT_mod = 6 PKNL = 1 PHC0 = 0 PHC1 = 0 SI = 128K 
       data hash MD5: 128K
       A9 4E 1A 73 4A A6 82 12 4F 02 F3 29 88 A1 20 8E>)
(   3,<2014-04-11 21:52:41.640 -0700>,<Administrator>,<X>,<proc1d>,<TOPSPIN 2.1>,
      <pk PHC0 = -81.65039 PHC1 = 0 
       data hash MD5: 128K
       EE CE 2C D0 48 EF 37 54 A7 36 AA 4D 91 9B 0E EA>)
(   4,<2014-04-11 21:52:42.171 -0700>,<Administrator>,<X>,<proc1d>,<TOPSPIN 2.1>,
      <abs ABSG = 1 
       data hash MD5: 128K
       E2 EB CC 21 8E 55 DC B8 A7 39 D9 55 82 AF C8 4E>)
(   5,<2014-04-11 21:52:42.312 -0700>,<Administrator>,<X>,<proc1d>,<TOPSPIN 2.1>,
      <abs ABSG = 2 
       data hash MD5: 128K
       82 C8 49 3E E3 01 7E 65 92 B6 7B 64 4C 50 0F 4A>)
(   6,<2014-04-11 21:52:42.453 -0700>,<Administrator>,<X>,<proc1d>,<TOPSPIN 2.1>,
      <abs ABSG = 3 
       data hash MD5: 128K
       33 E2 07 6C BE 6D A4 CD C5 31 87 60 72 8E DF 8C>)
(   7,<2014-04-11 21:52:42.546 -0700>,<Administrator>,<X>,<proc1d>,<TOPSPIN 2.1>,
      <abs ABSG = 4 
       data hash MD5: 128K
       69 EE D6 DC 2C ED 14 61 B7 A4 06 2C 42 47 CD A3>)
(   8,<2014-04-11 21:52:42.687 -0700>,<Administrator>,<X>,<proc1d>,<TOPSPIN 2.1>,
      <abs ABSG = 5 
       data hash MD5: 128K
       8A BD C4 66 CC BE 3C 69 80 10 61 E2 8B EC 76 6C>)
$$ ##END=
$$ 
$$ $$ hash MD5
$$ $$ 5F 76 00 02 93 FA 91 A5 3D D2 BD 16 3A 9F 38 B9
##$RELAX= 
##$RELAX= 
##$RELAX= 
##$RELAX= 
##$RELAX= 
##$RELAX= 
##$RELAX= 
##$RELAX= 
$$ Bruker specific parameters
$$ --------------------------
##$DU= <E:\>
##$EXPNO= 32
$$ [...]
##$TP07= 0
##$TPNAME0= <>
##$TPNAME1= <>
##$TPNAME2= <>
##$TPNAME3= <>
##$TPNAME4= <>
##$TPNAME5= <>
##$TPNAME6= <>
##$TPNAME7= <>
##$TPOAL= (0..7)
0.5 0.5 0.5 0.5 0.5 0.5 0.5 0.5
##$TPOFFS= (0..7)
0 0 0 0 0 0 0 0
##$TUNHIN= 0
##$TUNHOUT= 0
##$TUNXOUT= 0
##$USERA1= <user>
##$USERA2= <user>
##$USERA3= <user>
##$USERA4= <user>
##$USERA5= <user>
##$V9= 5
##$VALIST= <valist>
##$VCLIST= <CCCCCCCCCCCCCCC>
##$VD= 0
##$VDLIST= <DDDDDDDDDDDDDDD>
##$VPLIST= <PPPPPPPPPPPPPPP>
##$VTLIST= <TTTTTTTTTTTTTTT>
##$WBST= 1024
##$WBSW= 4
##$XGAIN= (0..3)
0 0 0 0
##$XL= 0
##$YL= 0
##$YMAX_a= 10449935
##$YMIN_a= -23831929
##$ZGOPTNS= <>
##$ZL1= 120
##$ZL2= 120
##$ZL3= 120
##$ZL4= 120
##$ABSF1= 14.96279
##$ABSF2= -5.595392
##$ABSG= 5
##$ABSL= 3
##$ALPHA= 0
##$AQORDER= 0
##$ASSFAC= 0
##$ASSFACI= 0
##$ASSFACX= 0
##$ASSWID= 0
##$AUNMP= <proc_prof1d_extract.lims>
##$AXLEFT= 0
##$AXNAME= <>
##$AXNUC= <1H>
##$AXRIGHT= 0
##$AXTYPE= 0
##$AXUNIT= <>
##$AZFE= 0.1
##$AZFW= 0.1
##$BCFW= 0
##$BC_mod= 0
##$BYTORDP= 0
##$COROFFS= 0
##$CY= 15
##$DATMOD= 1
##$DC= 0
##$DFILT= <>
##$DTYPP= 0
##$F1P= 0
##$F2P= 0
##$FCOR= 0.5
##$FTSIZE= 131072
##$FT_mod= 6
##$GAMMA= 0
##$GB= 0
##$INTBC= 1
##$INTSCL= 1
##$ISEN= 128
##$LB= 0.3
##$LEV0= 0
##$LPBIN= 0
##$MAXI= 10000
##$MC2= 0
##$MEAN= 0
##$ME_mod= 0
##$MI= 0
##$NCOEF= 0
##$NC_proc= -3
##$NLEV= 6
##$NOISF1= 0
##$NOISF2= 0
##$NSP= 0
##$NTH_PI= 0
##$NZP= 0
##$OFFSET= 14.96279
##$PC= 1
##$PHC0= -81.65039
##$PHC1= 0
##$PH_mod= 1
##$PKNL= yes
##$PPARMOD= 0
##$PPDIAG= 0
##$PPIPTYP= 0
##$PPMPNUM= 2147483647
##$PPRESOL= 1
##$PSCAL= 4
##$PSIGN= 0
##$PYNMP= <proc.py>
##$REVERSE= no
##$SF= 400.020008921576
##$SI= 131072
##$SIGF1= 0
##$SIGF2= 0
##$SINO= 400
##$SIOLD= 131072
##$SPECTYP= <>
##$SREGLST= <1H.CDCl3>
##$SSB= 0
##$STSI= 131072
##$STSR= 0
##$SW_p= 8223.68421052631
##$SYMM= 0
##$S_DEV= 0
##$TDeff= 65536
##$TDoff= 0
##$TI= <>
##$TILT= no
##$TM1= 0
##$TM2= 0
##$TOPLEV= 0
##$USERP1= <user>
##$USERP2= <user>
##$USERP3= <user>
##$USERP4= <user>
##$USERP5= <user>
##$WDW= 1
##$XDIM= 131072
##$YMAX_p= 535643534
##$YMIN_p= -23327
##$CURPLOT= <Network HP LaserJet P1505>
##$CURPRIN= <$Network HP LaserJet P1505>
##$DFORMAT= <normdp>
##$LAYOUT= <+/1D_H.xwp>
##$LFORMAT= <normlp>
##$PFORMAT= <normpl>
##$SURQMSG= 1
$$ End of Bruker specific parameters
$$ ---------------------------------
##NTUPLES= NMR SPECTRUM
##VAR_NAME=  FREQUENCY,     SPECTRUM/REAL,   SPECTRUM/IMAG
##SYMBOL=    X,             R,               I
##VAR_TYPE=  INDEPENDENT,   DEPENDENT,       DEPENDENT
##VAR_FORM=  AFFN,          ASDF,            ASDF
##VAR_DIM=   131072,        131072,          131072
##UNITS=     HZ,            ARBITRARY UNITS, ARBITRARY UNITS
##FACTOR=    0.0627417313425164, 1,          1
##FIRST=     8223.62146879497, 7391,         -134410
##LAST=      0,             13240,           -132908
##MIN=       0,             -23327,          0
##MAX=       8223.62146879497, 535643534,    0
$$ Real data points
##PAGE= N=1
##DATA TABLE= (X++(R..R)), XYDATA
$$ [...]
$$ plain form
62697 7071754 7052679 7031655 7009698 6986936 6963958 6942822 6925169 6910059 6895210 6879993 6865758
62686 6865758 6853325 6841576 6828609 6813024 6793760 6769796 6740520 6705818 6665644 6620168 6570268
62675 6570268 6516896 6459889 6398297 6332126 6262780 6191497 6118341 6043266 5967339 5892268 5819271
62664 5819271 5748991 5682037 5619011 5560228 5505759 5455585 5409630 5368087 5331690 5300975 5275150
62653 5275150 5252559 5232556 5215956 5203140 5192774 5183502 5176072 5172334 5172328 5173797 5174914 5176310 5179717
62640 5179717 5185450 5192143 5198549 5204565 5210365 5215405 5218987 5221440 5223946 5226976 5229376 5229465 5226842 5222684
62626 5222684 5218294 5213802 5208460 5201871 5194580 5187518 5181081 5174822 5167891 5159682 5150168 5139958 5130212 5122296
62612 5122296 5117193 5115270 5116858 5122692 5133173 5147338 5163593 5181785 5203701 5230965 5263343 5299820
$$ packed form
62697G071754j9075k1024k1957k2762k2978k1136j7653j5110j4849j5217j4235
62686F865758j2433j1749j2967j5585j9264k3964k9276l4702m0174m5476m9900
62675F570268n3372n7007o1592o6171o9346p1283p3156p5075p5927p5071p2997
62664E819271p0280o6954o3026n8783n4469n0174m5955m1543l6397l0715k5825
62653E275150k2591k0003j6600j2816j0366r272p430l738oJ469J117J396L407
62640E179717N733O693O406O016N800N040L582K453K506L030K400Q9k623m158
62626E222684m390m492n342o589p291p062o437o259o931q209r514j0210r746p916
62612E122296n103j923J588N834J0481J4165J6255J8192K1916K7264L2378L6477
$$ plain form
62600 5299820 5340428 5385806 5435524 5488297 5543749 5602721 5665775 5732633 5803319 5878706 5959558
62589 5959558 6045974 6138211 6237019 6342603 6454027 6570217 6691044 6817158 6949523 7089355
62579 7089355 7237459 7392966 7553538 7717370 7884146 8053497 8223798 8393573 8563137
62570 8563137 8733417 8903664 9071675 9235988 9396507 9552994 9704149 9848358 9984237
62561 9984237 10109945 10222487 10317579 10389354 10430191 10432083 10389162 10299072 10162402 9981939 9763002
62550 9763002 9513657 9243599 8962311 8677869 8396756 8124295 7865111 7623029 7400362
62541 7400362 7197630 7014340 6849719 6702386 6570175 6451524 6346919 6257794 6184020 6123744
62531 6123744 6075885 6041341 6020900 6013278 6016374 6029541 6053166 6086460 6127238 6174000 6226955 6286534
$$ packed form
62600E299820M0608M5378M9718N2773N5452N8972O3054O6858P0686P5387Q0852
62589E959558Q6416R2237R8808J05584J11424J16190J20827J26114J32365J39832
62579G089355J48104J55507J60572J63832J66776J69351J70301J69775J69564
62570H563137J70280J70247J68011J64313J60519J56487J51155J44209J35879
62561I984237J25708J12542R5092P1775M0837J892m2921r0090j36670j80463k18937
62550I763002k49345k70058k81288k84442k81113k72461k59184k42082k22667
62541G400362k02732j83290j64621j47333j32211j18651j04605q9125p3774o0276
62531F123744m7859l4544k0441p622L096J3167K3625L3294M0778M6762N2955N9579
$$ plain form
62519 6286534 6351995 6422106 6496420 6574894 6656498 6738949 6819910 6898006 6972600 7042864 7107209
62508 7107209 7163510 7210015 7246372 7273696 7293048 7303509 7302023 7285575 7253502 7207534 7149873
62497 7149873 7081769 7003780 6916665 6821659 6720392 6615000 6507960 6401304 6296161 6193449
62487 6193449 6094771 6002183 5917201 5840476 5772311 5712948 5662309 5619907 5585027 5556654 5533334
62476 5533334 5513837 5498201 5487571 5482660 5482573 5485313 5489041 5492736 5496154 5499625 5503624 5508132 5512554 5516485
62462 5516485 5520304 5524724 5530058 5536335 5543807 5552660 5562205 5570997 5578068 5583712 5588776 5593479 5597200 5599208
62448 5599208 5599232 5597466 5594528 5591494 5589417 5588359 5587167 5584746 5581555 5579382 5579603 5582040 5585668 5589837 5594490
62433 5594490 5599720 5605773 5613284 5622836 5634279 5646892 5660238 5674437 5689710 5706203 5724310 5744655
$$ packed form
62519F286534O5461P0111P4314P8474Q1604Q2451Q0961P8096P4594P0264O4345
62508G107209N6301M6505L6357K7324J9352J0461j486j6448l2073m5968n7661
62497G149873o8104p7989q7115r5006j01267j05392j07040j06656j05143j02712
62487F193449r8678r2588q4982p6725o8165n9363n0639m2402l4880k8373k3320
62476E533334j9497j5636j0630m911q7K740L728L695L418L471L999M508M422L931
62462E516485L819M420N334O277P472Q853R545Q792P071N644N064M703L721K008
62448E599208K4j766k938l034k077j058j192k421l191k173K21K437L628M169M653
62433E594490N230O053P511R552J1443J2613J3346J4199J5273J6493J8107K0345
$$ plain form
62421 5744655 5767484 5792362 5818624 5846034 5875152 5907288 5943810 5984924 6029314 6075509 6123429
62410 6123429 6173892 6226976 6282023 6339295 6400270 6465754 6534952 6607115 6682928 6763242 6847451
62399 6847451 6934400 7024196 7117678 7214712 7314492 7417237 7523866 7633954 7745773 7858859
62389 7858859 7975108 8096703 8224221 8357515 8497081 8643446 8796214 8954912 9119955
62380 9119955 9291353 9466733 9641812 9812730 9977204 10133966 10282555 10423832 10559765
62371 10559765 10692581 10824955 10960803 11104301 11257113 11417110 11580294 11743509 11904957
62362 11904957 12062819 12214135 12354937 12481137 12589633 12679101 12749934 12803550 12841811 12866452
62352 12866452 12877790 12873491 12849026 12799422 12719921 12605195 12449796 12250941 12010650 11734565
$$ packed form
62421E744655K2829K4878K6262K7410K9118L2136L6522M1114M4390M6195M7920
62410F123429N0463N3084N5047N7272O0975O5484O9198P2163P5813Q0314Q4209
62399F847451Q6949Q9796R3482R7034R9780J02745J06629J10088J11819J13086
62389G858859J16249J21595J27518J33294J39566J46365J52768J58698J65043
62380I119955J71398J75380J75079J70918J64474J56762J48589J41277J35933
62371A0559765J32816J32374J35848J43498J52812J59997J63184J63215J61448
62362A1904957J57862J51316J40802J26200J08496Q9468P0833N3616L8261K4641
62352A2866452J1338m299k4465m9604p9501j14726j55399j98855k40291k76085
$$ plain form
62342 11734565 11429466 11102820 10763703 10422011 10086097 9761857 9453901 9166287 8901643
62333 8901643 8660520 8442134 8245214 8068047 7908805 7766490 7640974 7531590 7436282 7352690
62323 7352690 7279620 7216978 7164639 7121722 7086433 7056185 7028562 7002858 6980318 6962199 6947950
62312 6947950 6935785 6924484 6913829 6903674 6893604 6883550 6873889 6864646 6855034 6843960 6830733 6815417
62300 6815417 6798845 6782154 6765910 6749775 6733281 6716636 6700391 6684790 6669977 6656405 6644452
62289 6644452 6634160 6626201 6622491 6624567 6631610 6641396 6653127 6667811 6685747 6705427 6725694 6747414
62277 6747414 6771732 6797859 6824020 6849944 6876965 6905966 6936577 6968353 7001512 7036277 7072451
62266 7072451 7109998 7149378 7190966 7234589 7279817 7326238 7373205 7419728 7464972 7508778 7551519
$$ packed form
62342A1734565l05099l26646l39117l41692l35914l24240l07956k87614k64644
62333H901643k41123k18386j96920j77167j59242j42315j25516j09384r5308q3592
62323G352690p3070o2642n2339m2917l5289l0248k7623k5704k2540j8119j4249
62312F947950j2165j1301j0655j0155j0070j0054r661r243r612j1074j3227j5316
62300F815417j6572j6691j6244j6135j6494j6645j6245j5601j4813j3572j1953
62289F644452j0292p959l710K076P043R786J1731J4684J7936J9680K0267K1720
62277F747414K4318K6127K6161K5924K7021K9001L0611L1776L3159L4765L6174
62266G072451L7547L9380M1588M3623M5228M6421M6967M6523M5244M3806M2741
$$ plain form
62255 7551519 7593380 7633694 7671003 7704095 7732988 7758418 7780102 7796117 7804570 7805432 7800149 7790013
62243 7790013 7775771 7758396 7738920 7717345 7692813 7665212 7635848 7606145 7576496 7546904 7517987
62232 7517987 7490530 7464556 7439641 7416005 7394558 7375744 7358842 7342615 7326542 7311363 7298560
62221 7298560 7289349 7284189 7283260 7287032 7295777 7308560 7323497 7339523 7357479 7378986 7404615 7433675
62209 7433675 7465428 7499743 7536590 7575685 7616969 7660958 7708277 7759125 7813494 7871695 7934371
62198 7934371 8001982 8074426 8151271 8232503 8319294 8413909 8518562 8634215 8760657 8897648
62188 8897648 9045536 9204572 9374091 9552882 9740069 9935080 10136824 10343501 10553398
62179 10553398 10765355 10978201 11190138 11399141 11603688 11802658 11994712 12178345 12352567
$$ packed form
62255G551519M1861M0314L7309L3092K8893K5430K1684J6015Q453Q62n283j0136
62243G790013j4242j7375j9476k1575k4532k7601k9364k9703k9649k9592k8917
62232G517987k7457k5974k4915k3636k1447j8814j6902j6227j6073j5179j2803
62221G298560r211n160r29L772Q745J2783J4937J6026J7956K1507K5629K9060
62209G433675L1753L4315L6847L9095M1284M3989M7319N0848N4369N8201O2676
62198G934371O7611P2444P6845Q1232Q6791R4615J04653J15653J26442J36991
62188H897648J47888J59036J69519J78791J87187J95011K01744K06677K09897
62179A0553398K11957K12846K11937K09003K04547J98970J92054J83633J74222
$$ plain form
62170 12352567 12516892 12670132 12809264 12929726 13026711 13095733 13131714 13127938 13077009 12974009
62160 12974009 12819198 12617466 12375299 12099020 11796134 11477025 11153627 10836094 10531181
62151 10531181 10243197 9974924 9727221 9499182 9289735 9098542 8924835 8766462 8621296
62142 8621296 8489102 8370918 8266837 8175360 8094753 8024006 7962510 7909720 7865249 7828477 7798106
62131 7798106 7773070 7754079 7743198 7741394 7747115 7757617 7771012 7786779 7805127 7826487 7851019 7877971
62119 7877971 7905806 7933318 7960216 7986494 8011991 8037016 8062656 8089795 8118426 8148461 8180401
62108 8180401 8214187 8247938 8279178 8307374 8334347 8362092 8390969 8420203 8449454 8479537 8511972
62097 8511972 8547940 8587309 8628607 8670173 8711306 8752168 8793056 8834197 8875724 8916992 8956321
$$ packed form
62170A2352567J64325J53240J39132J20462R6985O9022L5981l776n0929j03000
62160A2974009j54811k01732k42167k76279l02886l19109l23398l17533l04913
62151A0531181k87984k68273k47703k28039k09447j91193j73707j58373j45166
62142H621296j32194j18184j04081r1477q0607p0747o1496n2790m4471l6772l0371
62131G798106k5036j8991j0881j804N721J0502J3395J5767J8348K1360K4532K6952
62119G877971K7835K7512K6898K6278K5497K5025K5640K7139K8631L0035L1940
62108H180401L3786L3751L1240K8196K6973K7745K8877K9234K9251L0083L2435
62097H511972L5968L9369M1298M1566M1133M0862M0888M1141M1527M1268L9329
$$ plain form
62086 8956321 8992469 9026344 9060224 9095178 9130228 9164268 9197794 9232322 9268950 9307946 9348805
62075 9348805 9390046 9429766 9467293 9503876 9541116 9579241 9617609 9656192 9695341 9734207 9770562
62064 9770562 9802584 9830218 9854573 9876481 9895908 9912351 9925410 9934915 9940557 9941593 9937456 9929030
62052 9929030 9918892 9909628 9901808 9893914 9884126 9871793 9857280 9840991 9822807 9802254 9779060 9753545
62040 9753545 9726395 9698028 9668449 9637690 9605888 9572767 9537804 9501493 9465812 9432695 9402540
62029 9402540 9374985 9350462 9329594 9311273 9292861 9272765 9251890 9232146 9214376 9197913 9181182
62018 9181182 9162388 9140659 9117037 9093529 9070824 9047937 9024421 9001518 8980420 8960875 8942749
62007 8942749 8927584 8916831 8909348 8902544 8895599 8889785 8885730 8882225 8877952 8872686 8866393 8858699 8849954
$$ packed form
62086H956321L6148L3875L3880L4954L5050L4040L3526L4528L6628L8996M0859
62075I348805M1241L9720L7527L6583L7240L8125L8368L8583L9149L8866L6355
62064I770562L2022K7634K4355K1908J9427J6443J3059R505N642J036m137q426
62052I929030j0138r264p820p894r788j2333j4513j6289j8184k0553k3194k5515
62040I753545k7150k8367k9579l0759l1802l3121l4963l6311l5681l3117l0155
62029I402540k7555k4523k0868j8321j8412k0096k0875j9744j7770j6463j6731
62018I181182j8794k1729k3622k3508k2705k2887k3516k2903k1098j9545j8126
62007H942749j5165j0753p483o804o945n814m055l505m273n266o293p694q745
$$ plain form
61994 8849954 8841371 8833295 8824441 8813682 8801512 8788866 8775575 8761178 8746465 8732859 8720588 8708675
61982 8708675 8696656 8685388 8676130 8669544 8665519 8663196 8661080 8657848 8653324 8648478 8644547 8642483 8642859 8645583
61968 8645583 8649705 8654118 8658712 8664428 8672066 8681394 8691597 8702283 8713756 8726372 8739857 8753505
61956 8753505 8767121 8781467 8797365 8814479 8831629 8848445 8866043 8885649 8907039 8928777 8949546
61945 8949546 8968856 8986970 9004768 9023269 9042589 9061637 9079471 9096783 9115476 9136927 9161072
61934 9161072 9186800 9212630 9237433 9261302 9285567 9311272 9337835 9363880 9388993 9413681 9437923
61923 9437923 9460975 9482610 9503356 9523294 9541789 9558864 9575944 9594672 9615644 9638570 9662832
61912 9662832 9687450 9711256 9733655 9754813 9774968 9794227 9813072 9831883 9849446 9862970 9870236
$$ packed form
61994H849954q583q076q854j0759j2170j2646j3291j4397j4713j3606j2271j1913
61982H708675j2019j1268r258o586m025k323k116l232m524m846l931k064L76K724
61968H645583M122M413M594N716P638R328J0203J0686J1473J2616J3485J3648
61956H753505J3616J4346J5898J7114J7150J6816J7598J9606K1390K1738K0769
61945H949546J9310J8114J7798J8501J9320J9048J7834J7312J8693K1451K4145
61934I161072K5728K5830K4803K3869K4265K5705K6563K6045K5113K4688K4242
61923I437923K3052K1635K0746J9938J8495J7075J7080J8728K0972K2926K4262
61912I662832K4618K3806K2399K1158K0155J9259J8845J8811J7563J3524P266
$$ plain form
61901 9870236 9870911 9865216 9852509 9832252 9805434 9773669 9737233 9695231 9647521 9595492 9541058 9485771
61889 9485771 9430886 9377424 9326053 9277350 9231997 9190261 9151657 9115854 9083599 9056058 9033547
61878 9033547 9015740 9002791 8995273 8993181 8996088 9004391 9019419 9041954 9071303 9106042 9145199 9188645
61866 9188645 9236821 9290062 9347737 9408308 9470895 9536375 9605934 9678830 9752824 9826845 9901892
61855 9901892 9979061 10058021 10137920 10218424 10299003 10378248 10454993 10529320 10601484 10670468 10734610
61844 10734610 10793174 10846242 10893265 10932673 10962974 10983703 10995485 10999742 10998050 10991165 10978872 10961206
61832 10961206 10939457 10915336 10889619 10862422 10834251 10805618 10775766 10743114 10707239 10669260 10629811
61821 10629811 10587573 10540585 10488267 10431337 10370249 10304745 10234976 10162257 10088275 10013762 9938247
$$ packed form
61901I870236O75n695j2707k0257k6818l1765l6436m2002m7710n2029n4434n5287
61889I485771n4885n3462n1371m8703m5353m1736l8604l5803l2255k7541k2511
61878I033547j7807j2949p518k092K907Q303J5028K2535K9349L4739L9157M3446
61866I188645M8176N3241N7675O0571O2587O5480O9559P2896P3994P4021P5047
61855I901892P7169P8960P9899Q0504Q0579P9245P6745P4327P2164O8984O4142
61844A0734610N8564N3068M7023L9408L0301K0729J1782M257j692o885j2293j7666
61832A0961206k1749k4121k5717k7197k8171k8633k9852l2652l5875l7979l9449
61821A0629811m2238m6988n2318n6930o1088o5504o9769p2719p3982p4513p5515
$$ plain form
61810 9938247 9861161 9783163 9706273 9632609 9563116 9497768 9436872 9381666 9333391 9292043 9256257
61799 9256257 9224214 9194558 9166908 9141891 9120501 9102970 9088307 9075221 9063342 9053160 9044935
61788 9044935 9038420 9033833 9032340 9034809 9040385 9047110 9053992 9061798 9071520 9082721 9093965 9104505 9114791
61775 9114791 9125307 9135542 9144311 9150599 9153747 9153037 9147583 9136820 9121122 9101772 9080109 9056507
61763 9056507 9030482 9002061 8972797 8944890 8919459 8896231 8874749 8854913 8836144 8817081 8796999
61752 8796999 8776938 8758692 8743054 8729764 8718712 8710043 8703190 8696972 8691043 8686450 8684374 8684995 8688069
61739 8688069 8693940 8703264 8716010 8731390 8748778 8768259 8790318 8815335 8843357 8874007 8906513 8940026
61727 8940026 8974032 9008442 9043327 9078748 9114777 9151568 9189291 9228005 9267479 9307125 9346293
$$ packed form
61810I938247p7086p7998p6890p3664o9493o5348o0896n5206m8275m1348l5786
61799I256257l2043k9656k7650k5017k1390j7531j4663j3086j1879j0182q225
61788I044935o515m587j493K469N576O725O882P806R722J1201J1244J0540J0286
61775I114791J0516J0235Q769O288L148p10n454j0763j5698j9350k1663k3602
61763I056507k6025k8421k9264k7907k5431k3228k1482j9836j8769j9063k0082
61752H796999k0061j8246j5638j3290j1052q669o853o218n929m593k076O21L074
61739H688069N871R324J2746J5380J7388J9481K2059K5017K8022L0650L2506L3513
61727H940026L4006L4410L4885L5421L6029L6791L7723L8714L9474L9646L9168
$$ plain form
61716 9346293 9384824 9423196 9461919 9500761 9538732 9574804 9608441 9639362 9667032 9690736 9710200
61705 9710200 9725917 9738600 9748345 9754526 9756733 9755777 9753691 9752578 9753420 9755927 9759509 9764245 9770771 9779319
61691 9779319 9789275 9799872 9810764 9821417 9830308 9835728 9837481 9836884 9834751 9830362 9823114 9814308 9806208
61678 9806208 9799964 9795612 9793720 9795390 9800455 9807255 9815059 9825707 9841935 9864718 9893026 9925604 9962075
61665 9962075 10002619 10047393 10096323 10149061 10205283 10265149 10328855 10395355 10462331 10528237 10593697
61654 10593697 10659860 10725993 10790115 10851705 10912176 10972398 11031337 11087849 11142459 11196228 11248477
61643 11248477 11296550 11337218 11367474 11384710 11387569 11376775 11354123 11320375 11274764 11216753 11147822
61632 11147822 11071433 10991788 10912800 10837638 10768546 10706559 10650929 10598642 10545217 10487070 10423336
$$ packed form
61716I346293L8531L8372L8723L8842L7971L6072L3637L0921K7670K3704J9464
61705I710200J5717J2683R745O181K207r56k086j113Q42K507L582M736O526Q548
61691I779319R956J0597J0892J0653Q891N420J753n97k133m389p248q806q100
61678I806208o244m352j892J670N065O800P804J0648J6228K2783K8308L2578L6471
61665I962075M0544M4774M8930N2738N6222N9866O3706O6500O6976O5906O5460
61654A0593697O6163O6133O4122O1590O0471O0222N8939N6512N4610N3769N2249
61643A1248477M8073M0668L0256J7236K859j0794k2652l3748m5611n8011o8931
61632A1147822p6389p9645p8988p5162o9092o1987n5630n2287n3425n8147o3734
$$ plain form
61621 10423336 10354903 10281703 10201792 10113436 10017367 9916397 9813407 9710521 9610034 9515173
61611 9515173 9429367 9354653 9290735 9235537 9187015 9144909 9110759 9086087 9070666 9062784 9060755 9063671
61599 9063671 9070900 9081805 9096357 9115499 9140277 9170566 9204876 9241367 9279010 9318042 9359621
61588 9359621 9404993 9454693 9508351 9565146 9624416 9685998 9750292 9818030 9889623 9964560 10041648
61577 10041648 10119997 10199454 10279849 10360146 10438836 10515137 10589440 10662433 10733915 10802395 10865713
61566 10865713 10922184 10971362 11013602 11048826 11076161 11095388 11108556 11119536 11131786 11146862 11164958
61555 11164958 11186142 11210848 11239856 11274195 11314393 11359163 11405287 11449633 11491223 11530627 11567517
61544 11567517 11599854 11625937 11646673 11665288 11685208 11708833 11738123 11775303 11822263 11879445 11945993
$$ packed form
61621A0423336o8433p3200p9911q8356r6069j00970j02990j02886j00487r4861
61611I515173q5806p4714o3918n5198m8522m2106l4150k4672j5421p882k029K916
61599I063671P229J0905J4552J9142K4778L0289L4310L6491L7643L9032M1579
61588I359621M5372M9700N3658N6795N9270O1582O4294O7738P1593P4937P7088
61577A0041648P8349P9457Q0395Q0297P8690P6301P4303P2993P1482O8480O3318
61566A0865713N6471M9178M2240L5224K7335J9227J3168J0980J2250J5076J8096
61555A1164958K1184K4706K9008L4339M0198M4770M6124M4346M1590L9404L6890
61544A1567517L2337K6083K0736J8615J9920K3625K9290L7180M6960N7182O6548
$$ plain form
61533 11945993 12021204 12105471 12199308 12301581 12409112 12518089 12625469 12728993 12826650 12916881
61523 12916881 12999170 13073766 13140761 13199994 13252299 13300711 13350183 13405891 13471299 13547283 13632779
61512 13632779 13726127 13825491 13928003 14029383 14125507 14214523 14296787 14372686 14441369 14501876 14554749
61501 14554749 14601968 14645930 14689090 14733899 14781919 14832850 14884923 14936119 14984279 15026322 15058599
61490 15058599 15078781 15087117 15085591 15076357 15061178 15041610 15018802 14993252 14965345 14935946 14905798 14874288
61478 14874288 14839486 14799706 14754389 14702856 14642577 14569417 14479792 14372320 14247644 14107629
61468 14107629 13955265 13794794 13630979 13467999 13309277 13158068 13017403 12889205 12774102
61459 12774102 12672506 12585454 12513882 12457411 12414413 12383141 12362312 12350744 12347184 12350716 12360864
$$ packed form
61533A1945993P5211Q4267R3837J02273J07531J08977J07380J03524R7657R0231
61523A2916881Q2289P4596O6995N9233N2305M8412M9472N5708O5408P5984Q5496
61512A3632779R3348R9364J02512J01380R6124Q9016Q2264P5899O8683O0507N2873
61501A4554749M7219M3962M3160M4809M8020N0931N2073N1196M8160M2043L2277
61490A5058599K0182Q336j526r234j5179j9568k2808k5550k7907k9399l0148l1510
61478A4874288l4802l9780m5317n1533o0279p3160q9625j07472j24676j40015
61468A4107629j52364j60471j63815j62980j58722j51209j40665j28198j15103
61459A2774102j01596q7052p1572n6471m2998l1272k0829j1568l560L532J0148
$$ plain form
61448 12360864 12376921 12397503 12421144 12447225 12476124 12508559 12545101 12586376 12633400 12687268 12748326
61437 12748326 12815784 12888460 12965788 13047612 13132839 13218799 13302388 13381447 13454390 13518728 13570923
61426 13570923 13608181 13630249 13639458 13639420 13633545 13624026 13611771 13597375 13582097 13567405 13553507 13538866
61414 13538866 13521290 13498962 13470447 13434881 13392818 13345916 13294500 13235672 13164930 13079874 12981944
61403 12981944 12875006 12763439 12651683 12544339 12445704 12359315 12288118 12234572 12200109 12184760
61393 12184760 12187686 12207935 12244563 12296425 12362258 12440868 12531063 12631637 12741724 12861024 12989410
61382 12989410 13126370 13270976 13422256 13579390 13741605 13908142 14078258 14251069 14425301
61373 14425301 14599354 14771737 14941441 15107727 15269509 15425049 15572614 15711487 15842052
$$ packed form
61448A2360864J6057K0582K3641K6081K8899L2435L6542M1275M7024N3868O1058
61437A2748326O7458P2676P7328Q1824Q5227Q5960Q3589P9059P2943O4338N2195
61426A3570923L7258K2068R209l8n875r519j2255j4396j5278j4692j3898j4641
61414A3538866j7576k2328k8515l5566m2063m6902n1416n8828p0742q5056r7930
61403A2981944j06938j11567j11756j07344r8635q6389p1197n3546l4463j5349
61393A2184760K926K0249L6628N1862O5833P8610R0195J00574J10087J19300J28386
61382A2989410J36960J44606J51280J57134J62215J66537J70116J72811J74232
61373A4425301J74053J72383J69704J66286J61782J55540J47565J38873J30565
$$ plain form
61364 15842052 15964687 16078852 16183599 16278726 16365079 16443970 16516773 16584926 16649626 16711417
61354 16711417 16770552 16827802 16884330 16940493 16995127 17046053 17090759 17126550 17150758 17161173 17155647
61343 17155647 17130884 17082425 17006820 16903842 16776295 16628138 16463525 16287270 16104984 15921990
61333 15921990 15742220 15568324 15402558 15247308 15104622 14975323 14858805 14754024 14660611
61324 14660611 14578582 14507107 14444515 14390007 14344742 14310555 14288011 14276300 14274458 14281751 14297198
61313 14297198 14319869 14349788 14387703 14433814 14487401 14547797 14614862 14688176 14766536 14848800 14934754
61302 14934754 15024676 15118271 15214329 15311181 15407249 15501363 15592735 15680507 15763357 15839769 15908376
61291 15908376 15967463 16014268 16045636 16059644 16056106 16035602 15999044 15948584 15888057 15821812 15753617
$$ packed form
61364A5842052J22635J14165J04747R5127Q6353P8891P2803O8153O4700O1791
61354A6711417N9135N7250N6528N6163N4634N0926M4706L5791K4208J0415n526
61343A7155647k4763m8459p5605j02978j27547j48157j64613j76255j82286j82994
61333A5921990j79770j73896j65766j55250j42686j29299j16518j04781r3413
61324A4660611q2029p1475o2592n4508m5265l4187k2544j1711j842P293J5447
61313A4297198K2671K9919L7915M6111N3587O0396O7065P3314P8360Q2264Q5954
61302A4934754Q9922R3595R6058R6852R6068R4114R1372Q7772Q2850P6412O8607
61291A5908376N9087M6805L1368J4008l538k0504l6558n0460o0527o6245o8195
$$ plain form
61280 15753617 15687090 15626407 15575677 15537916 15515108 15508708 15519332 15546417 15589126 15647485 15721844
61269 15721844 15811345 15913634 16026171 16147316 16276220 16412247 16554564 16701850 16852393
61260 16852393 17004703 17157748 17310226 17460116 17605727 17746937 17884589 18018909 18149588
61251 18149588 18277374 18404404 18532557 18662443 18794530 18930498 19072772 19223221 19382821
61242 19382821 19551993 19730373 19916355 20107490 20301515 20496685 20690766 20879274 21054267
61233 21054267 21205065 21320932 21393507 21416805 21386082 21298930 21158622 20975162 20761555 20528928
61223 20528928 20285571 20039328 19798685 19570843 19359548 19165107 18985821 18819240 18662944
61214 18662944 18514663 18371293 18227708 18077147 17913201 17731181 17527843 17301154 17051502
$$ packed form
61280A5753617o6527o0683n0730l7761k2808o400J0624K7085M2709N8359P4359
61269A5721844Q9501J02289J12537J21145J28904J36027J42317J47286J50543
61260A6852393J52310J53045J52478J49890J45611J41210J37652J34320J30679
61251A8149588J27786J27030J28153J29886J32087J35968J42274J50449J59600
61242A9382821J69172J78380J85982J91135J94025J95170J94081J88508J74993
61233B1054267J50798J15867P2575K3298l0723q7152j40308j83460k13607k32627
61223B0528928k43357k46243k40643k27842k11295j94441j79286j66581j56296
61214A8662944j48281j43370j43585j50561j63946j82020k03338k26689k49652
$$ plain form
61205 17051502 16783037 16503175 16220543 15943021 15676620 15425082 15190436 14974199 14777813
61196 14777813 14601611 14443914 14301961 14173618 14057602 13952367 13855732 13765692 13680823 13599859
61186 13599859 13521967 13447919 13380057 13320286 13268658 13224687 13189345 13164645 13151501 13149199 13157127
61175 13157127 13175888 13206316 13248358 13301593 13366162 13442444 13530237 13629010 13738637 13859051 13989291
61164 13989291 14127670 14272923 14424399 14580863 14739814 14898573 15055781 15211316 15364990
61155 15364990 15515961 15663512 15807804 15949164 16086476 16216662 16336121 16442650 16535758
61146 16535758 16615397 16681125 16732876 16772054 16801400 16824045 16842911 16860149 16875921 16887768 16892395
61135 16892395 16888621 16877749 16860579 16834989 16797392 16746026 16681801 16606381 16520873 16426725 16326597
$$ packed form
61205A7051502k68465k79862k82632k77522k66401k51538k34646k16237j96386
61196A4777813j76202j57697j41953j28343j16016j05235r6635r0040q4869q0964
61186A3599859p7892p4048o7862n9771n1628m3971l5342k4700j3144k302P928
61175A3157127J8761L0428M2042N3235O4569P6282Q7793R8773J09627J20414J30240
61164A3989291J38379J45253J51476J56464J58951J58759J57208J55535J53674
61155A5364990J50971J47551J44292J41360J37312J30186J19459J06529R3108
61146A6535758P9639O5728N1751L9178K9346K2645J8866J7238J5772J1847M627
61135A6892395l774j0872j7170k5590l7597n1366o4225p5420q5508r4148j00128
$$ plain form
61124 16326597 16223363 16118668 16013027 15906879 15800896 15695502 15590865 15487319 15385224
61115 15385224 15284407 15184268 15084436 14984663 14883975 14780693 14673835 14564061 14452948 14341879
61105 14341879 14232124 14125330 14023111 13926550 13837000 13756919 13688594 13631992 13585312 13548120
61095 13548120 13522547 13510449 13510499 13519422 13535475 13559271 13591402 13630686 13675081 13723340 13775383 13831710
61083 13831710 13892602 13957124 14022624 14085824 14144748 14199206 14249563 14295885 14338458 14378338 14417117
61072 14417117 14456931 14500828 14551983 14611797 14679457 14753952 14835846 14926505 15026537 15135942 15255103
61061 15255103 15384448 15523466 15671156 15827432 15993332 16169969 16357994 16557749 16769030
61052 16769030 16990767 17221877 17462453 17713387 17975045 18247295 18530652 18826073 19133216
$$ packed form
61124A6326597j03234j04695j05641j06148j05983j05394j04637j03546j02095
61115A5385224j00817j00139r9832r9773j00688j03282j06858j09774j11113j11069
61105A4341879j09755j06794j02219r6561q9550q0081o8325n6602m6680l7192
61095A3548120k5573j2098N0Q923J6053K3796L2131L9284M4395M8259N2043N6327
61083A3831710O0892O4522O5500O3200N8924N4458N0357M6322M2573L9880L8779
61072A4417117L9814M3897N1155N9814O7660P4495Q1894R0659J00032J09405J19161
61061A5255103J29345J39018J47690J56276J65900J76637J88025J99755K11281
61052A6769030K21737K31110K40576K50934K61658K72250K83357K95421L07143
$$ plain form
61043 19133216 19450131 19775260 20108719 20450729 20799511 21151544 21503326 21851878 22193800
61034 22193800 22525027 22842081 23143523 23430519 23706715 23977835 24251116 24534655 24836736
61025 24836736 25165124 25526838 25929110 26380701 26891494 27469756 28119780 28842626 29638598
61016 29638598 30507645 31446865 32448815 33504017 34606064 35754508 36952826 38203067
61008 38203067 39500590 40831497 42174188 43505345 44808068 46077315 47318693 48540243
61000 48540243 49739051 50884639 51904930 52687784 53109621 53084083 52602522 51739251 50620664
60991 50620664 49381031 48126208 46909802 45719904 44482501 43090000 41448793 39522612
60983 39522612 37348586 35020767 32655108 30356330 28200013 26230677 24468230 22915160
$$ packed form
61043A9133216L16915L25129L33459L42010L48782L52033L51782L48552L41922
61034B2193800L31227L17054L01442K86996K76196K71120K73281K83539L02081
61025B4836736L28388L61714M02272M51591N10793N78262O50024P22846P95972
61016B9638598Q69047R39220J001950J055202J102047J148444J198318J250241
61008C8203067J297523J330907J342691J331157J302723J269247J241378J221550
61000D8540243J198808J145588J020291P82854M21837k5538m81561q63271j118587
60991E0620664j239633j254823j216406j189898j237403j392501j641207j926181
60983C9522612k174026k327819k365659k298778k156317j969336j762447j553070
$$ plain form
60975 22915160 21562078 20392591 19387691 18528397 17796386 17173956 16644369 16192317 15804222
60966 15804222 15468560 15176297 14920899 14697632 14502575 14331983 14182298 14050623 13934976
60957 13934976 13833881 13745691 13668660 13601728 13544801 13497807 13459587 13428041 13401318 13378816 13361167
60946 13361167 13349429 13344102 13344757 13350716 13361902 13378385 13398795 13419795 13437737 13450581 13457816 13458901
60934 13458901 13452483 13436809 13410105 13370608 13317162 13250287 13172352 13086545 12995903 12903192 12811036
60923 12811036 12721684 12636825 12557793 12485822 12422037 12367287 12321837 12285013 12255361 12231591 12213268
60912 12213268 12200180 12191414 12185885 12183880 12187081 12196468 12210747 12227532 12245849 12266834 12292033 12321541
60900 12321541 12353974 12387885 12422857 12459290 12497461 12537133 12578094 12620712 12665406 12711513 12756983
$$ packed form
60975B2915160j353082j169487j004900q59294p32011o22430n29587m52052l88095
60966A5804222l35662k92263k55398k23267j95057j70592j49685j31675j15647
60957A3934976j01095q8190p7031o6932n6927m6994l8220l1546k6723k2502j7649
60946A3361167j1738n327O55N959J1186J6483K0410K1000J7942J2844P235J085
60934A3458901o418j5674k6704l9497n3446o6875p7935q5807r0642r2711r2156
60923A2811036q9352q4859p9032p1971o3785n4750m5450l6824k9652k3770j8323
60912A2213268j3088q766n529k005L201R387J4279J6785J8317K0985K5199K9508
60900A2321541L2433L3911L4972L6433L8171L9672M0961M2618M4694M6107M5470
$$ plain form
60889 12756983 12799420 12837361 12870509 12898914 12922092 12938895 12948033 12948491 12939164 12918129 12882843 12831656
60877 12831656 12765199 12686069 12597321 12501614 12401678 12300871 12202770 12110232 12024810 11946747 11875400
60866 11875400 11810008 11750447 11697285 11650844 11610135 11572771 11536248 11499626 11464135 11432037 11404878
60855 11404878 11382753 11364792 11349720 11336102 11323016 11310935 11301310 11294816 11290613 11287748 11286430 11287167
60843 11287167 11289527 11292865 11297505 11303710 11309968 11313917 11314864 11313659 11310048 11302179 11289332 11273129 11254826
60830 11254826 11233042 11205744 11173391 11138443 11102496 11065505 11027405 10988765 10949948 10911079 10873094
60819 10873094 10837629 10805591 10776786 10751065 10728724 10709407 10691696 10674502 10658210 10643728 10630745
60808 10630745 10617641 10603158 10587822 10573518 10561581 10551315 10540563 10527856 10513742 10499827 10486907
$$ packed form
60889A2756983M2437L7941L3148K8405K3178J6803R138M58r327k1035l5286n1187
60877A2831656o6457p9130q8748r5707r9936j00807r8101r2538q5422p8063p1347
60866A1875400o5392n9561n3162m6441m0709l7364l6523l6622l5491l2098k7159
60855A1404878k2125j7961j5072j3618j3086j2081r625o494m203k865j318P37
60843A1287167K360L338M640O205O258L949R47j205l611p869j2847j6203j8303
60830A1254826k1784k7298l2353l4948l5947l6991l8100l8640l8817l8869l7985
60819A0873094l5465l2038k8805k5721k2341j9317j7711j7194j6292j4482j2983
60808A0630745j3104j4483j5336j4304j1937j0266j0752j2707j4114j3915j2920
$$ plain form
60797 10486907 10474485 10461792 10448716 10435849 10424167 10414687 10407999 10404111 10402888 10404377 10408441 10414543
60785 10414543 10422509 10433147 10447474 10465522 10486588 10510461 10537753 10569171 10605089 10645573 10689951
60774 10689951 10736587 10784125 10833097 10885474 10942617 11004560 11071290 11143408 11220984 11302648 11386552
60763 11386552 11471651 11557681 11644657 11732945 11823118 11914939 12006882 12097280 12185785 12273295 12360589
60752 12360589 12447294 12531891 12612625 12688740 12760823 12829317 12892592 12947233 12990470 13021543 13040405
60741 13040405 13046212 13038069 13016848 12985580 12948497 12910209 12875097 12846512 12826481 12816404 12817488 12830141
60729 12830141 12853762 12887901 12933048 12989560 13056554 13132863 13218565 13314381 13419829 13533152 13652965
60718 13652965 13778958 13910935 14048085 14189305 14333484 14479587 14627278 14777318 14930350
$$ packed form
60797A0486907j2422j2693j3076j2867j1682r480o688l888j223J489M064O102
60785A0414543P966J0638J4327J8048K1066K3873K7292L1418L5918M0484M4378
60774A0689951M6636M7538M8972N2377N7143O1943O6730P2118P7576Q1664Q3904
60763A1386552Q5099Q6030Q6976Q8288R0173R1821R1943R0398Q8505Q7510Q7294
60752A2360589Q6705Q4597Q0734P6115P2083O8494O3275N4641M3237L1073J8862
60741A3040405N807q143k1221l1268l7083l8288l5112k8585k0031j0077J084J2653
60729A2830141K3621L4139M5147N6512O6994P6309Q5702R5816J05448J13323J19813
60718A3652965J25993J31977J37150J41220J44179J46103J47691J50040J53032
$$ plain form
60709 14930350 15085391 15240593 15395473 15551074 15707529 15862559 16012992 16156942 16294101
60700 16294101 16424747 16549030 16666521 16775905 16875592 16964825 17043280 17109100 17158257 17186691
60690 17186691 17192718 17177062 17141499 17088425 17021330 16944887 16864666 16786735 16716452 16656727 16608026
60679 16608026 16570661 16546286 16536385 16540332 16556285 16583380 16621506 16669344 16724405 16785336 16852846
60668 16852846 16928093 17011494 17103661 17206352 17321713 17451256 17595917 17755996 17930301 18116191
60658 18116191 18311275 18514525 18725075 18940778 19158760 19376710 19592513 19803156 20005235
60649 20005235 20196543 20376143 20543011 20695633 20832973 20954511 21058611 21141383 21197619 21222569
60639 21222569 21213051 21168109 21089471 20980793 20845754 20687134 20508071 20313378 20108666 19898544
$$ packed form
60709A4930350J55041J55202J54880J55601J56455J55030J50433J43950J37159
60700A6294101J30646J24283J17491J09384R9687Q9233P8455O5820M9157K8434
60690A7186691O027j5656l5563n3074o7095p6443q0221p7931p0283n9725m8701
60679A6608026l7365k4375r901L947J5953K7095L8126M7838N5061O0931O7510
60668A6852846P5247Q3401R2167J02691J15361J29543J44661J60079J74305J85890
60658A8116191J95084K03250K10550K15703K17982K17950K15803K10643K02079
60649B0005235J91308J79600J66868J52622J37340J21538J04100Q2772N6236K4950
60639B1222569r518m4942p8638j08678j35039j58620j79063j94693k04712k10122
$$ plain form
60629 19898544 19686662 19477223 19275049 19083510 18903080 18732232 18568970 18410959 18255003
60620 18255003 18097691 17936686 17770759 17598587 17418282 17228478 17029529 16823264 16611803
60611 16611803 16396867 16180115 15963763 15750635 15543545 15344753 15156322 14980990 14822155
60602 14822155 14682307 14561636 14458800 14373099 14305255 14255958 14224558 14209755 14210902 14227827 14259795
60591 14259795 14305487 14363731 14433375 14512564 14599241 14692694 14793785 14903221 15020256 15143369
60581 15143369 15271359 15403168 15537370 15672757 15808952 15945452 16080233 16210246 16333288
60572 16333288 16448437 16554408 16648359 16726817 16787339 16829006 16851991 16857336 16847013 16823725 16790493
60561 16790493 16750156 16704427 16652926 16593649 16525242 16449081 16369018 16289470 16214119 16146027 16088069
$$ packed form
60629A9898544k11882k09439k02174j91539j80430j70848j63262j58011j55956
60620A8255003j57312j61005j65927j72172j80305j89804j98949k06265k11461
60611A6611803k14936k16752k16352k13128k07090j98792j88431j75332j58835
60602A4822155j39848j20671j02836q5701o7844m9297l1400j4803J147J6925L1968
60591A4259795M5692N8244O9644P9189Q6677R3453J01091J09436J17035J23113
60581A5143369J27990J31809J34202J35387J36195J36500J34781J30013J23042
60572A6333288J15149J05971R3951P8458O0522M1667K2985N345j0323k3288l3232
60561A6790493m0337m5729n1501n9277o8407p6161q0063p9548p5351o8092n7958
$$ plain form
60550 16088069 16042780 16011923 15996065 15994332 16004830 16026045 16057943 16101351 16156311 16221741 16296740
60539 16296740 16381239 16474728 16574948 16678711 16783811 16889272 16993707 17094130 17186636 17267719
60529 17267719 17334744 17385888 17420537 17439972 17447276 17446311 17440698 17433546 17427599 17424912 17426006 17429652 17434309
60516 17434309 17440216 17449888 17466324 17491152 17524840 17568022 17621411 17684293 17754250 17829000 17907988
60505 17907988 17991680 18079961 18171884 18266429 18362609 18459183 18555353 18651695 18749417 18848438 18947043
60494 18947043 19043692 19138320 19231398 19322500 19410470 19494325 19572899 19643655 19702557 19745382 19769097
60483 19769097 19772463 19756097 19722142 19673498 19613089 19543628 19467543 19386657 19302116 19214993 19126700
60472 19126700 19038410 18950261 18861669 18772367 18682800 18593753 18506052 18420504 18337847 18259078 18186292
$$ packed form
60550A6088069m5289l0857j5858j733J0498K1215L1898M3408N4960O5430P4999
60539A6296740Q4499R3489J00220J03763J05100J05461J04435J00423R2506Q1083
60529A7267719O7025N1144L4649J9435P304r65n613p152n947k687J094L646M657
60516A7434309N907R672J6436K4828L3688M3182N3389O2882O9957P4750P8988
60505A7907988Q3692Q8281R1923R4545R6180R6574R6170R6342R7722R9021R8605
60494A8947043R6649R4628R3078R1102Q7970Q3855P8574P0756N8902M2825K3715
60483A9769097L366j6366l3955m8644o0409o9461p6085q0886q4541q7123q8293
60472A9126700q8290q8149q8592q9302q9567q9047q7701q5548q2657p8769p2786
$$ plain form
60461 18186292 18122619 18070507 18030431 18002178 17986895 17986501 18001267 18029723 18071345 18127677 18199821
60450 18199821 18286211 18384198 18492875 18612809 18743521 18882829 19028728 19180545 19337771 19498472
60440 19498472 19659313 19816848 19968768 20114069 20251877 20380041 20495514 20596584 20684088
60431 20684088 20759854 20824863 20879960 20927545 20970972 21012513 21053256 21094658 21138302 21183844 21229038
60420 21229038 21272705 21316586 21363829 21417218 21479757 21555283 21646694 21754157 21876291 22012448
60410 22012448 22162469 22324808 22496564 22675397 22860099 23049176 23240176 23430858 23620092
60401 23620092 23807239 23991434 24171976 24348766 24521935 24691349 24856569 25016529 25168931
60392 25168931 25310447 25437853 25548313 25638092 25701740 25733716 25731209 25695189 25628965 25536408 25421801
$$ packed form
60461A8186292o3673n2112m0076k8253j5283l94J4766K8456M1622N6332P2144
60450A8199821Q6390R7987J08677J19934J30712J39308J45899J51817J57226J60701
60440A9498472J60841J57535J51920J45301J37808J28164J15473J01070Q7504
60431B0684088P5766O5009N5097M7585M3427M1541M0743M1402M3644M5542M5194
60420B1229038M3667M3881M7243N3389O2539P5526R1411J07463J22134J36157
60410B2012448J50021J62339J71756J78833J84702J89077J91000J90682J89234
60401B3620092J87147J84195J80542J76790J73169J69414J65220J59960J52402
60392B5168931J41516J27406J10460Q9779O3648L1976k507l6020o6224r2557j14607
$$ plain form
60381 25421801 25290744 25150089 25006143 24862676 24720849 24581026 24444229 24311587 24182836
60372 24182836 24056026 23928701 23799054 23666341 23531225 23395942 23263192 23134033 23007221
60363 23007221 22881181 22756072 22632876 22510403 22384106 22248382 22099603 21936794 21760345
60354 21760345 21571189 21371177 21163333 20951318 20738966 20530295 20329268 20138950 19961014
60345 19961014 19796053 19643782 19502625 19369883 19243248 19121962 19005858 18893585 18782596
60336 18782596 18670808 18557576 18443277 18329104 18217319 18110443 18009722 17915372 17828698 17752535
60326 17752535 17688615 17635661 17591377 17555404 17528732 17510878 17499684 17494004 17494703 17502327 17515149 17530534
60314 17530534 17547242 17565531 17585728 17607717 17631450 17656969 17683897 17711470 17739152 17767019 17795659
$$ packed form
60381B5421801j31057j40655j43946j43467j41827j39823j36797j32642j28751
60372B4182836j26810j27325j29647j32713j35116j35283j32750j29159j26812
60363B3007221j26040j25109j23196j22473j26297j35724j48779j62809j76449
60354B1760345j89156k00012k07844k12015k12352k08671k01027j90318j77936
60345A9961014j64961j52271j41157j32742j26635j21286j16104j12273j10989
60336A8782596j11788j13232j14299j14173j11785j06876j00721r4350q6674p6163
60326A7752535o3920n2954m4284l5973k6672j7854j1194n680O99P624J2822J5385
60314A7530534J6708J8289K0197K1989K3733K5519K6928K7573K7682K7867K8640
$$ plain form
60303 17795659 17825861 17858106 17892105 17927021 17962220 17997411 18031960 18064700 18094612 18120975 18142217
60292 18142217 18155416 18158003 18149793 18132475 18107209 18073718 18032067 17984491 17934929 17887138 17843497
60281 17843497 17804953 17771382 17742388 17718624 17702387 17696144 17700297 17713083 17733082 17761073 17798601
60270 17798601 17845144 17897735 17953404 18011074 18070964 18133313 18198411 18266998 18339632 18416023 18495673
60259 18495673 18578710 18665325 18754997 18847380 18943590 19045254 19152399 19263637 19378532 19498179
60249 19498179 19622886 19750870 19880446 20012426 20149011 20290970 20437267 20587166 20741372
60240 20741372 20901019 21066569 21237896 21414606 21596091 21782084 21973672 22173326 22383545
60231 22383545 22605694 22840401 23088801 23353143 23636144 23939765 24264449 24609417 24973635
$$ packed form
60303A7795659L0202L2245L3999L4916L5199L5191L4549L2740K9912K6363K1242
60292A8142217J3199K587q210j7318k5266l3491m1651m7576m9562m7791m3641
60281A7843497l8544l3571k8994k3764j6237o243M153J2786J9999K7991L7528
60270A7798601M6543N2591N5669N7670N9890O2349O5098O8587P2634P6391P9650
60259A8495673Q3037Q6615Q9672R2383R6210J01664J07145J11238J14895J19647
60249A9498179J24707J27984J29576J31980J36585J41959J46297J49899J54206
60240B0741372J59647J65550J71327J76710J81485J85993J91588J99654K10219
60231B2383545K22149K34707K48400K64342K83001L03621L24684L44968L64218
$$ plain form
60222 24973635 25356292 25756467 26172737 26603396 27046724 27500768 27962986 28430277 28899306
60213 28899306 29366990 29831276 30291411 30746438 31192824 31624134 32033412 32415071 32763967
60204 32763967 33074166 33340614 33561775 33738937 33872719 33961709 34005012 34004750 33965298 33891195
60194 33891195 33786807 33657074 33507015 33340312 33159208 32965878 32763209 32553922 32339304
60185 32339304 32119215 31893338 31662274 31427328 31189403 30948409 30703854 30455623 30203940
60176 30203940 29949014 29691211 29431116 29168567 28901810 28628499 28347671 28060093 27766735
60167 27766735 27467946 27164476 26858442 26552890 26251285 25957945 25677984 25415501 25171596
60158 25171596 24944397 24730589 24526652 24329451 24136799 23947667 23761442 23577083 23393301
$$ packed form
60222B4973635L82657M00175M16270M30659M43328M54044M62218M67291M69029
60213B8899306M67684M64286M60135M55027M46386M31310M09278L81659L48896
60204C2763967L10199K66448K21161J77162J33782Q8990M3303k62l9452p4103
60194C3891195j04388j29733j50059j66703j81104j93330k02669k09287k14618
60185C2339304k20089k25877k31064k34946k37925k40994k44555k48231k51683
60176C0203940k54926k57803k60095k62549k66757k73311k80828k87578k93358
60167B7766735k98789l03470l06034l05552l01605k93340k79961k62483k43905
60158B5171596k27199k13808k03937j97201j92652j89132j86225j84359j83782
$$ plain form
60149 23393301 23209385 23025695 22843662 22665502 22493199 22327054 22165419 22006200 21848108
60140 21848108 21690079 21530332 21367081 21199845 21029120 20855014 20677254 20496639 20315559
60131 20315559 20136994 19963713 19798516 19644272 19503220 19376668 19265565 19170736 19092286 19029340
60121 19029340 18980804 18946038 18924531 18915150 18915885 18924213 18937827 18955386 18976394 18999801 19022867 19042133
60109 19042133 19055464 19062274 19061524 19050451 19025795 18985764 18930469 18861155 18779588 18687576 18586456
60098 18586456 18477307 18362058 18243832 18125623 18008943 17894303 17782638 17675731 17575559
60089 17575559 17483821 17401827 17330201 17268781 17217287 17175952 17144986 17123549 17109746 17101689 17098353
60078 17098353 17099631 17105965 17117813 17135185 17157856 17186124 17220861 17262550 17310821 17365269 17425827
$$ packed form
60149B3393301j83916j83690j82033j78160j72303j66145j61635j59219j58092
60140B1848108j58029j59747j63251j67236j70725j74106j77760j80615j81080
60131B0315559j78565j73281j65197j54244j41052j26552j11103r4829p8450o2946
60121A9029340m8536l4766k1507r381P35Q328J3614J7559K1008K3407K3066J9266
60109A9042133J3331O810p50j1073k4656m0031n5295o9314q1567r2012j01120
60098A8586456j09149j15249j18226j18209j16680j14640j11665j06907j00172
60089A7575559r1738q1994p1626o1420n1494m1335l0966k1437j3803q057l336
60078A7098353J278O334J1848J7372K2671K8268L4737M1689M8271N4448O0558
$$ plain form
60067 17425827 17491594 17560219 17629737 17700544 17774188 17850429 17926902 18001643 18074267 18144240 18209538
60056 18209538 18267959 18318698 18361730 18396644 18423251 18442743 18457175 18467944 18475543 18480478 18483692 18486246
60044 18486246 18489125 18493082 18498081 18503148 18507347 18510709 18513861 18517208 18521124 18526466 18533971 18543140 18552174 18558811
60030 18558811 18560745 18555844 18542961 18522394 18494718 18459445 18415884 18365343 18311247 18256755 18203092
60019 18203092 18150436 18099302 18050356 18003760 17959675 17919211 17884299 17856757 17837703 17827459 17825652
60008 17825652 17831772 17845991 17869139 17901592 17942583 17990950 18046086 18107760 18175428 18248381 18326486
59997 18326486 18410515 18501897 18602131 18711647 18828659 18949723 19072220 19196048 19322394 19451534
59987 19451534 19582903 19716823 19854633 19996728 20141773 20288493 20437329 20589418 20744500
$$ packed form
60067A7425827O5767O8625O9518P0807P3644P6241P6473P4741P2624O9973O5298
60056A8209538N8421N0739M3032L4914K6607J9492J4432J0769P599M935L214K554
60044A8486246K879L957M999N067M199L362L152L347L916N342P505R169R034O637
60030A8558811J934m901j2883k0567k7676l5273m3561n0541n4096n4492n3663
60019A8203092n2656n1134m8946m6596m4085m0464l4912k7542j9054j0244j807
60008A7825652O120J4219K3148L2453M0991M8367N5136O1674O7668P2953P8105
59997A8326486Q4029R1382J00234J09516J17012J21064J22497J23828J26346J29140
59987A9451534J31369J33920J37810J42095J45045J46720J48836J52089J55082
$$ plain form
59978 20744500 20900794 21056684 21211615 21365156 21515657 21659907 21793654 21912377 22012004
59969 22012004 22089508 22143321 22173649 22182709 22174407 22153364 22124073 22090860 22058215 22030752 22012977
59958 22012977 22009403 22024461 22061498 22121799 22205223 22311989 22443275 22599911 22781167 22985123
59948 22985123 23209498 23451531 23707692 23974372 24248492 24526656 24804083 25075459 25336926
59939 25336926 25586655 25823877 26048482 26261188 26462221 26648961 26815979 26958019 27071678
59930 27071678 27153394 27197509 27198352 27153834 27065536 26935944 26767570 26564817 26334542 26083844
59920 26083844 25818459 25543915 25266633 24992416 24724370 24463427 24210840 23969684 23744416
59911 23744416 23539721 23359466 23206050 23080796 22985408 22922833 22896224 22907039 22954314 23035500
$$ packed form
59978B0744500J56294J55890J54931J53541J50501J44250J33747J18723R9627
59969B2012004P7504N3813L0328R060q302k1043k9291l3213l2645k7463j7775
59958B2012977l574J5058L7037O0301Q3424J06766J31286J56636J81256K03956
59948B2985123K24375K42033K56161K66680K74120K78164K77427K71376K61467
59939B5336926K49729K37222K24605K12706K01033J86740J67018J42040J13659
59930B7071678Q1716M4115Q43m4518q8298j29592j68374k02753k30275k50698
59920B6083844k65385k74544k77282k74217k68046k60943k52587k41156k25268
59911B3744416k04695j80255j53416j25254r5388o2575k6609J0815M7275Q1186
$$ plain form
59901 23035500 23147703 23288419 23455528 23646661 23858606 24087612 24330158 24582843 24841457
59892 24841457 25100866 25356043 25602424 25835051 26048621 26239417 26406563 26550501 26670902
59883 26670902 26767144 26840204 26892393 26925057 26937763 26930044 26902801 26857395 26794244 26713075 26613970
59872 26613970 26497393 26363585 26212992 26047804 25873001 25695869 25524503 25366384 25227342
59863 25227342 25110754 25017240 24945541 24894334 24863305 24852238 24859553 24882655 24919902 24971426 25037911
59852 25037911 25119624 25217278 25332890 25468836 25626446 25806241 26008811 26234341 26481435 26747083
59842 26747083 27027167 27316050 27606360 27890907 28165122 28426736 28673307 28901496 29108799
59833 29108799 29294090 29455402 29588148 29686629 29747125 29769455 29756815 29715210 29652412 29576030
$$ packed form
59901B3035500J12203J40716J67109J91133K11945K29006K42546K52685K58614
59892B4841457K59409K55177K46381K32627K13570J90796J67146J43938J20401
59883B6670902R6242P3060N2189L2664J2706p719k7243m5406o3151q1169r9105
59872B6613970j16577j33808j50593j65188j74803j77132j71366j58119j39042
59863B5227342j16588r3514p1699n1207l1029j1067P315K3102L7247N1524O6485
59852B5037911Q1713R7654J15612J35946J57610J79795K02570K25530K47094K65648
59842B6747083K80084K88883K90310K84547K74215K61614K46571K28189K07303
59833B9108799J85291J61312J32746R8481O0496K2330j2640m1605o2798p6382
$$ plain form
59823 29576030 29491909 29404162 29316065 29230240 29148201 29070410 28997085 28928793 28866109 28808616 28754253
59812 28754253 28700014 28643746 28585428 28526721 28469651 28415771 28365694 28318494 28271871 28223703 28173166
59801 28173166 28119759 28062215 28000053 27935932 27874770 27820396 27774711 27740228 27721176 27720895 27739764
59790 27739764 27776976 27833031 27909117 28005315 28121215 28257612 28415884 28595960 28796177 29014722
59780 29014722 29249693 29497906 29754943 30016435 30278283 30535878 30784512 31020851 31243123
59771 31243123 31450089 31641156 31817553 31981763 32134836 32274798 32397999 32501195 32582149
59762 32582149 32639742 32675069 32692461 32698657 32700597 32703793 32712024 32727702 32752090 32785072 32824596 32866402
59750 32866402 32904487 32931854 32940711 32922344 32867720 32768776 32619409 32415549 32155086 31838312
$$ packed form
59823B9576030q4121q7747q8097q5825q2039p7791p3325o8292o2684n7493n4363
59812B8754253n4239n6268n8318n8707n7070n3880n0077m7200m6623m8168n0537
59801B8173166n3407n7544o2162o4121o1162n4374m5685l4483j9052k81J8869
59790B7739764L7212N6055P6086R6198J15900J36397J58272J80076K00217K18545
59780B9014722K34971K48213K57037K61492K61848K57595K48634K36339K22272
59771C1243123K06966J91067J76397J64210J53073J39962J23201J03196Q0954
59762C2582149N7593L5327J7392O196J940L196Q231J5678K4388L2982L9524M1806
59750C2866402L8085K7367Q857j8367n4624r8944j49367k03860k60463l16774
$$ plain form
59740 31838312 31468401 31050890 30592003 30097057 29570530 29017725 28445714 27861802 27271249
59731 27271249 26677648 26085786 25503029 24937252 24394361 23878543 23393712 22943370 22529680
59722 22529680 22154113 21818695 21525264 21273633 21061800 20887927 20750909 20649125 20580272
59713 20580272 20542970 20537301 20563194 20619297 20703947 20816034 20953959 21114492 21293698 21488646
59703 21488646 21697663 21919323 22151924 22393668 22642718 22897023 23154305 23412125 23667999
59694 23667999 23920001 24167461 24410641 24649478 24882984 25109825 25328683 25537623 25733601
59685 25733601 25912963 26071929 26206408 26312225 26386520 26429091 26442429 26430976 26400480 26357069
59675 26357069 26305858 26250122 26191600 26130913 26067501 26000208 25928867 25855047 25780733 25706677 25632520
$$ packed form
59740C1838312l69911m17511m58887m94946n26527n52805n72011n83912n90553
59731B7271249n93601n91862n82757n65777n42891n15818m84831m50342m13690
59722B2529680l75567l35418k93431k51631k11833j73873j37018j01784o8853
59713B0580272l7302n669K5893N6103Q4650J12087J37925J60533J79206J94948
59703B1488646K09017K21660K32601K41744K49050K54305K57282K57820K55874
59694B3667999K52002K47460K43180K38837K33506K26841K18858K08940J95978
59685B5733601J79362J58966J34479J05817P4295M2571J3338j1453l0496m3411
59675B6357069n1211n5736n8522o0687o3412o7293p1341p3820p4314p4056p4157
$$ plain form
59664 25632520 25557754 25481452 25401259 25313705 25215857 25106198 24984063 24849020 24701285 24542454
59654 24542454 24375676 24205176 24035274 23869218 23708623 23554148 23406409 23265611 23129937
59645 23129937 22994676 22853417 22700433 22532274 22347690 22146722 21930249 21700146 21459063
59636 21459063 21209263 20951593 20686018 20413319 20136017 19857606 19581307 19309758 19045475
59627 19045475 18791114 18549173 18321544 18109275 17912929 17733312 17571675 17428635 17302853
59618 17302853 17191263 17090914 17000551 16920600 16852163 16796047 16752140 16719516 16697502 16686618 16687865
59607 16687865 16701032 16724582 16757346 16799348 16850392 16908768 16972284 17039989 17112028 17188123 17267002
59596 17267002 17346880 17425420 17499277 17564725 17619326 17662730 17695891 17720149 17737243 17749635 17760050
$$ packed form
59664B5632520p4766p6302q0193q7554r7848j09659j22135j35043j47735j58831
59654B4542454j66778j70500j69902j66056j60595j54475j47739j40798j35674
59645B3129937j35261j41259j52984j68159j84584k00968k16473k30103k41083
59636B1459063k49800k57670k65575k72699k77302k78411k76299k71549k64283
59627A9045475k54361k41941k27629k12269j96346j79617j61637j43040j25782
59618A7302853j11590j00349r0363p9951o8437n6116m3907l2624k2014j0884J247
59607A6687865J3167K3550L2764M2002N1044N8376O3516O7705P2039P6095P8879
59596A7267002P9878P8540P3857O5448N4601M3404L3161K4258J7094J2392J0415
$$ plain form
59585 17760050 17770361 17780900 17790886 17799597 17807035 17813614 17819746 17826169 17834090 17844085 17855131 17866015 17877797
59572 17877797 17893506 17914853 17940541 17968744 18000080 18037000 18081172 18132828 18191978 18258722 18332647
59561 18332647 18413258 18500695 18594550 18692090 18789141 18882962 18972992 19058593 19137557 19207301 19266151
59550 19266151 19312618 19344511 19359893 19358411 19340979 19308657 19262555 19204323 19135813 19058217 18971919
59539 18971919 18877028 18773736 18662315 18543144 18416760 18283901 18145680 18003733 17859967
59530 17859967 17716244 17574585 17437320 17306289 17181953 17064000 16952796 16849420 16754307
59521 16754307 16666989 16587552 16517230 16456890 16405936 16363714 16331323 16310905 16303369 16307702 16322305
59510 16322305 16346098 16378258 16417707 16463158 16513283 16566756 16622461 16679732 16738131 16797142 16856394
$$ packed form
59585A7760050J0311J0539R986Q711P438O579O132O423P921R995J1046J0884J1782
59572A7877797J5709K1347K5688K8203L1336L6920M4172N1656N9150O6744P3925
59561A8332647Q0611Q7437R3855R7540R7051R3821R0030Q5601P8964O9744N8850
59550A9266151M6467L1893J5382j482j7432l2322m6102n8232o8510p7596q6298
59539A8971919r4891j03292j11421j19171j26384j32859j38221j41947j43766
59530A7859967j43723j41659j37265j31031j24336j17953j11204j03376r5113
59521A6754307q7318p9437p0322o0340n0954m2222l2391k0418p536M333J4603
59510A6322305K3793L2160L9449M5451N0125N3473N5705N7271N8399N9011N9252
$$ plain form
59499 16856394 16915970 16975958 17035881 17095325 17155292 17218243 17286338 17360016 17438828 17523394 17615830
59488 17615830 17718076 17830378 17951821 18081951 18221135 18369289 18524967 18686092 18851163
59479 18851163 19019416 19190332 19363611 19539250 19716861 19895094 20072459 20248609 20423844
59470 20423844 20597221 20765998 20927089 21078156 21216948 21340576 21446127 21531302 21593901 21631603
59460 21631603 21643328 21630529 21596531 21545236 21481290 21410625 21338942 21269227 21201693 21136320 21074331
59449 21074331 21016737 20962530 20909208 20854611 20797497 20736856 20671797 20602498 20530781 20459358 20390584
59438 20390584 20326111 20267571 20217214 20177538 20150309 20136172 20135196 20147430 20172736 20210604 20260684
59427 20260684 20323183 20397954 20483183 20575967 20674855 20781517 20899408 21030920 21176056 21333366
$$ packed form
59499A6856394N9576N9988N9923N9444N9967O2951O8095P3678P8812Q4566R2436
59488A7615830J02246J12302J21443J30130J39184J48154J55678J61125J65071
59479A8851163J68253J70916J73279J75639J77611J78233J77365J76150J75235
59470B0423844J73377J68777J61091J51067J38792J23628J05551Q5175O2599L7702
59460B1631603J1725j2799l3998n1295o3946p0665p1683o9715o7534o5373o1989
59449B1074331n7594n4207n3322n4597n7114o0641o5059o9299p1717p1423o8774
59438B0390584o4473n8540n0357l9676k7229j4137r76J2234K5306L7868N0080
59427B0260684O2499P4771Q5229R2784R8888J06662J17891J31512J45136J57310
$$ plain form
59417 21333366 21501421 21679430 21867318 22065915 22277021 22502821 22744503 23000347 23264208
59408 23264208 23526088 23775918 24008764 24227321 24439451 24653264 24874233 25105798 25350970
59399 25350970 25612227 25889551 26178105 26467130 26741658 26987550 27197341 27372264 27518676
59390 27518676 27642507 27746524 27831075 27895436 27938148 27957107 27950170 27915794 27853589 27765007 27653499
59379 27653499 27523276 27377767 27219541 27051294 26875885 26695363 26510828 26323343 26134259
59370 26134259 25944862 25757028 25574410 25401324 25239558 25087339 24942312 24804445 24674988
59361 24674988 24553767 24439075 24329591 24224876 24124322 24027209 23933749 23844700 23759942 23678938
59351 23678938 23602870 23534823 23477060 23428999 23388360 23353307 23322963 23296882 23274904 23256837 23241409
$$ packed form
59417B1333366J68055J78009J87888J98597K11106K25800K41682K55844K63861
59408B3264208K61880K49830K32846K18557K12130K13813K20969K31565K45172
59399B5350970K61257K77324K88554K89025K74528K45892K09791J74923J46412
59390B7518676J23831J04017Q4551O4361M2712J8959o937l4376o2205q8582j11508
59379B7653499j30223j45509j58226j68247j75409j80522j84535j87485j89084
59370B6134259j89397j87834j82618j73086j61766j52219j45027j37867j29457
59361B4674988j21221j14692j09484j04715j00554r7113r3460q9049q4758q1004
59351B3678938p6068o8047n7763m8061m0639l5053l0344k6081k1978j8067j5428
$$ plain form
59340 23241409 23226165 23209324 23191468 23174693 23160393 23148540 23138662 23130623 23124672 23121813 23124296 23134902
59328 23134902 23155297 23185584 23225636 23276252 23338534 23412796 23498895 23597581 23710854 23840669 23987703
59317 23987703 24151802 24333515 24534647 24756968 25000334 25262298 25539609 25830033 26132748
59308 26132748 26447219 26772085 27105235 27444638 27788621 28135160 28481227 28823153 29157421
59299 29157421 29480773 29789657 30080281 30349585 30595947 30818710 31017429 31192158 31344467
59290 31344467 31477659 31595670 31701716 31797857 31885494 31965894 32039925 32107036 32164365 32206999
59280 32206999 32229311 32226153 32193172 32126720 32024125 31884153 31707057 31494291 31248387 30972998
59270 30972998 30672903 30354024 30023368 29688444 29356097 29031552 28718239 28417906 28130656
$$ packed form
59340B3241409j5244j6841j7856j6775j4300j1853r878q039n951k859K483J0606
59328B3134902K0395L0287M0052N0616O2282P4262Q6099R8686J13273J29815J47034
59317B3987703J64099J81713K01132K22321K43366K61964K77311K90424L02715
59308B6132748L14471L24866L33150L39403L43983L46539L46067L41926L34268
59299B9157421L23352L08884K90624K69304K46362K22763J98719J74729J52309
59290C1344467J33192J18011J06046R6141Q7637Q0400P4031O7111N7329M2634
59280C2206999K2312l158l2981o6452j02595j39972j77096k12766k45904k75389
59270C0972998l00095l18879l30656l34924l32347l24545l13313l00333k87250
$$ plain form
59261 28130656 27855388 27590887 27336680 27092853 26859516 26636777 26424805 26223368 26031587
59252 26031587 25848627 25674520 25509956 25355563 25211665 25078146 24953920 24837083 24726486
59243 24726486 24622926 24528080 24442797 24367452 24303428 24252594 24215205 24189762 24175338 24172689 24182511
59232 24182511 24203940 24235684 24277647 24330605 24395174 24472009 24562091 24665723 24781842 24909365
59222 24909365 25048613 25200424 25364518 25540047 25727089 25925706 26133323 26344757 26555676
59213 26555676 26765094 26973804 27181343 27385464 27584005 27776082 27961302 28138639 28306528
59204 28306528 28463822 28610240 28745855 28870344 28982720 29081375 29164006 29227740 29270152 29290538
59194 29290538 29289826 29269063 29228447 29168159 29089586 28995254 28888123 28771689 28650437 28529386 28413175
$$ packed form
59261B8130656k75268k64501k54207k43827k33337k22739k11972k01437j91781
59252B6031587j82960j74107j64564j54393j43898j33519j24226j16837j10597
59243B4726486j03560r4846q5283p5345o4024n0834l7389k5443j4424k649R822
59232B4182511K1429L1744M1963N2958O4569P6835R0082J03632J16119J27523
59222B4909365J39248J51811J64094J75529J87042J98617K07617K11434K10919
59213B6555676K09418K08710K07539K04121J98541J92077J85220J77337J67889
59204B8306528J57294J46418J35615J24489J12376R8655Q2631O3734M2412K0386
59194B9290538p12k0763m0616o0288p8573r4332j07131j16434j21252j21051j16211
$$ plain form
59183 28413175 28306031 28212250 28135778 28079205 28043782 28030422 28040087 28073229 28129798 28210173 28315571
59172 28315571 28447077 28604566 28786824 28992468 29220575 29470700 29742567 30035791 30349902
59163 30349902 30684473 31038652 31410088 31794701 32188158 32587456 32990398 33393734 33792775
59154 33792775 34183231 34563026 34932274 35291958 35642687 35984197 36315985 36638983 36956565
59145 36956565 37273221 37592058 37913845 38237849 38561991 38881724 39189979 39479159 39742710
59136 39742710 39974534 40168131 40317637 40419377 40471363 40471385 40416247 40302902 40129971 39898627
59126 39898627 39612760 39278272 38901697 38489378 38047909 37584666 37107219 36622461 36136749
59117 36136749 35656613 35188834 34740081 34316700 33924174 33565773 33241804 32950697 32690686
$$ packed form
59183B8413175j07144r3781p6472n6573l5423j3360R665L3142N6569Q0375J05398
59172B8315571J31506J57489J82258K05644K28107K50125K71867K93224L14111
59163C0349902L34571L54179L71436L84613L93457L99298M02942M03336L99041
59154C3792775L90456L79795L69248L59684L50729L41510L31788L22998L17582
59145C6956565L16656L18837L21787L24004L24142L19733L08255K89180K63551
59136C9742710K31824J93597J49506J01740N1986K2n5138j13345j72931k31344
59126C9898627k85867l34488l76575m12319m41469m63243m77447m84758m85712
59117C6136749m80136m67779m48753m23381l92526l58401l23969k91107k60011
$$ plain form
59108 32690686 32459986 32255867 32074634 31912809 31767895 31637995 31521049 31414446 31315254
59099 31315254 31221427 31133415 31054077 30986108 30929712 30883468 30846959 30821316 30807304 30804227 30811155
59088 30811155 30828159 30855654 30893264 30939873 30994322 31055465 31121830 31191447 31261569 31328193 31386216
59077 31386216 31430406 31456288 31460380 31440345 31395200 31325024 31230406 31112467 30973136 30814556 30638226
59066 30638226 30445653 30239975 30025821 29807047 29585276 29360885 29134082 28904049 28667886
59057 28667886 28421719 28162878 27890736 27606271 27311874 27011149 26707778 26404554 26104086
59048 26104086 25810017 25526428 25255897 24998906 24755160 24524800 24308341 24106355 23919625
59039 23919625 23749104 23595280 23457848 23336221 23230165 23139816 23065283 23006364 22962537 22933140
$$ packed form
59108C2690686k30700k04119j81233j61825j44914j29900j16946j06603r9192
59099C1315254r3827q8012p9338o7969n6396m6244l6509k5643j4012l077O928
59088C0811155J7004K7495L7610M6609N4449O1143O6365O9617P0122O6624N8023
59077C1386216M4190K5882M092k0035m5145p0176r4618j17939j39331j58580j76330
59066C0638226j92573k05678k14154k18774k21771k24391k26803k30033k36163
59057B8667886k46167k58841k72142k84465k94397l00725l03371l03224l00468
59048B6104086k94069k83589k70531k56991k43746k30360k16459k01986j86730
59039B3919625j70521j53824j37432j21627j06056r0349p4533n8919m3827k9397
$$ plain form
59029 22933140 22917438 22914341 22922297 22940128 22968164 23007910 23060143 23123982 23198335 23283533 23380569
59018 23380569 23489162 23607649 23734787 23870880 24017311 24175915 24348826 24538004 24744675
59009 24744675 24969822 25215129 25482566 25772988 26085941 26420677 26776139 27149768 27537683
59000 27537683 27936827 28345925 28763552 29186156 29608946 30028044 30440721 30844059 31234634
58991 31234634 31609529 31966566 32303065 32614627 32894883 33135671 33327448 33460554 33527229
58982 33527229 33523014 33446611 33298680 33080679 32794500 32443169 32032174 31570484 31070512 30547045
58972 30547045 30015538 29490152 28982204 28499764 28048138 27630170 27246051 26893483 26568512
58963 26568512 26266222 25981008 25707506 25442395 25185258 24937170 24698627 24469312 24249481
$$ packed form
59029B2933140j5702l097P956J7831K8036L9746N2233O3839P4353Q5198R7036
59018B3380569J08593J18487J27138J36093J46431J58604J72911J89178K06671
59009B4744675K25147K45307K67437K90422L12953L34736L55462L73629L87915
59000B7537683L99144M09098M17627M22604M22790M19098M12677M03338L90575
58991C1234634L74895L57037L36499L11562K80256K40788J91777J33106O6675
58982C3527229m215p6403j47931k18001k86179l51331m10995m61690m99972n23467
58972C0547045n31507n25386n07948m82440m51626m17968l84119l52568l24971
58963B6568512l02290k85214k73502k65111k57137k48088k38543k29315k19831
$$ plain form
58954 24249481 24040657 23844938 23664437 23501859 23361031 23246019 23159450 23101832 23072464 23070742
58944 23070742 23096176 23147127 23220012 23310314 23414340 23529558 23653337 23782163 23912511 24041938
58934 24041938 24168747 24290962 24406260 24512827 24609865 24697334 24775557 24844805 24904809 24954930
58924 24954930 24995570 25029584 25061927 25097766 25141208 25195666 25264638 25351468 25458276 25585200 25730602
58913 25730602 25892054 26067464 26255568 26455400 26665404 26883289 27106869 27334902 27566823
58904 27566823 27801538 28036576 28268597 28494615 28712173 28918008 29106926 29272566 29409091
58895 29409091 29511837 29577008 29602214 29587774 29536639 29452660 29339577 29201781 29044423 28871391
58885 28871391 28683523 28479734 28259491 28023478 27772709 27508492 27233350 26950980 26665223
$$ packed form
58954B4249481k08824j95719j80501j62578j40828j15012q6569n7618k9368j722
58944B3070742K5434N0951P2885R0302J04026J15218J23779J28826J30348J29427
58934B4041938J26809J22215J15298J06567R7038Q7469P8223O9248O0004N0121
58924B4954930M0640L4014L2343L5839M3442N4458O8972Q6830J06808J26924J45402
58913B5730602J61452J75410J88104J99832K10004K17885K23580K28033K31921
58904B7566823K34715K35038K32021K26018K17558K05835J88918J65640J36525
58895B9409091J02746O5171K5206j4440n1135q3979j13083j37796j57358j73032
58885B8871391j87868k03789k20243k36013k50769k64217k75142k82370k85757
$$ plain form
58876 26665223 26379650 26097697 25821818 25552161 25286782 25023230 24759278 24492587 24221268
58867 24221268 23945299 23666365 23385819 23103665 22819818 22535070 22250075 21964564 21678861
58858 21678861 21395683 21119223 20852602 20597044 20353126 20121567 19902476 19694774 19497028
58849 19497028 19308509 19129082 18958403 18795762 18640648 18493042 18353119 18221116 18097761
58840 18097761 17984516 17882865 17793468 17716420 17652215 17601641 17564507 17539225 17524118 17518447 17521650
58829 17521650 17532416 17549478 17572744 17602444 17637483 17675773 17716073 17758346 17802333 17847172 17892880
58818 17892880 17941223 17994595 18054628 18122010 18196744 18278268 18366090 18460563 18562453 18671781 18788105
58807 18788105 18911862 19044184 19185308 19334574 19492254 19659703 19836978 20021983 20213041
$$ packed form
58876B6665223k85573k81953k75879k69657k65379k63552k63952k66691k71319
58867B4221268k75969k78934k80546k82154k83847k84748k84995k85511k85703
58858B1678861k83178k76460k66621k55558k43918k31559k19091k07702j97746
58849A9497028j88519j79427j70679j62641j55114j47606j39923j32003j23355
58840A8097761j13245j01651q9397p7048o4205n0574l7134k5282j5107n671L203
58829A7521650J0766J7062K3266K9700L5039L8290M0300M2273M3987M4839M5708
58818A7892880M8343N3372O0033O7382P4734Q1524Q7822R4473J01890J09328J16324
58807A8788105J23757J32322J41124J49266J57680J67449J77275J85005J91058
$$ plain form
58798 20213041 20411015 20617791 20833971 21059199 21293322 21535552 21783391 22033826 22284645
58789 22284645 22532986 22773501 22999913 23208071 23396088 23562282 23705023 23824294 23921474
58780 23921474 23997729 24054382 24094557 24122088 24138234 24141168 24129114 24102234 24060890 24003792 23928607
58769 23928607 23833016 23714592 23571179 23402113 23207875 22988040 22741222 22467756 22170699
58760 22170699 21853366 21517814 21167329 20808757 20450426 20098588 19757369 19430997 19123866
58751 19123866 18838699 18576328 18337075 18120827 17926000 17750119 17591627 17450043 17324360
58742 17324360 17212495 17112289 17021943 16939651 16864251 16796414 16737809 16688606 16646738 16609714 16575788
58731 16575788 16542736 16506586 16462619 16407401 16339719 16260387 16171709 16076536 15977182 15875398 15773451
$$ packed form
58798B0213041J97974K06776K16180K25228K34123K42230K47839K50435K50819
58789B2284645K48341K40515K26412K08158J88017J66194J42741J19271R7180
58780B3921474P6255N6653M0175K7531J6146K934j2054k6880m1344n7098p5185
58769B3928607r5591j18424j43413j69066j94238k19835k46818k73466k97057
58760B2170699l17333l35552l50485l58572l58331l51838l41219l26372l07131
58751A9123866k85167k62371k39253k16248j94827j75881j58492j41584j25683
58742A7324360j11865j00206r0346q2292p5400o7837n8605m9203m1868l7024l3926
58731A6575788l3052l6150m3967n5218o7682p9332q8678r5173r9354j01784j01947
$$ plain form
58720 15773451 15674428 15581001 15494248 15413922 15339409 15270148 15205692 15145770 15090089 15038043 14989086
58709 14989086 14943458 14901846 14864243 14829931 14798821 14771886 14749727 14731490 14715755 14701653 14688316
58698 14688316 14673925 14656368 14634628 14608972 14580458 14551311 14525380 14507000 14499243 14503808 14522067
58687 14522067 14554864 14601256 14658658 14724659 14797888 14877006 14959924 15044452 15128658 15210023 15285095
58676 15285095 15350752 15405123 15446644 15473019 15482063 15472981 15445740 15399554 15333179 15246795 15142598
58665 15142598 15023350 14891117 14747726 14595798 14438864 14280592 14123699 13969009 13815613
58656 13815613 13662665 13511066 13362740 13218294 13076525 12936669 12800137 12669149 12544321
58647 12544321 12424582 12309106 12198416 12093706 11995852 11905110 11821094 11742981 11670191 11602735
$$ packed form
58720A5773451r9023r3427q6753q0326p4513o9261o4456n9922n5681n2046m8957
58709A4989086m5628m1612l7603l4312l1110k6935k2159j8237j5735j4102j3337
58698A4688316j4391j7557k1740k5656k8514k9147k5931j8380p757M565J8259
58687A4522067L2797M6392N7402O6001P3229P9118Q2918Q4528Q4206Q1365P5072
58676A5285095O5657N4371M1521K6375R044r082k7241m6186o6375q6384j04197
58665A5142598j19248j32233j43391j51928j56934j58272j56893j54690j53396
58656A3815613j52948j51599j48326j44446j41769j39856j36532j30988j24828
58647A2544321j19739j15476j10690j04710r7854r0742q4016p8113p2790o7456
$$ plain form
58637 11602735 11540305 11481374 11424290 11369417 11319135 11275274 11237498 11204971 11178629 11160539 11151478
58626 11151478 11150597 11157586 11173776 11200391 11236719 11280950 11332239 11390965 11457363 11531035 11611798 11699757
58614 11699757 11794142 11893121 11995586 12102533 12215909 12336519 12463788 12597007 12735654 12878643
58604 12878643 13024441 13172243 13322113 13473572 13624791 13773452 13917701 14056032 14187388
58595 14187388 14312172 14432232 14548736 14660400 14764676 14860248 14947397 15026145 15095100 15152118
58585 15152118 15195370 15223945 15238301 15239956 15229559 15205193 15163756 15104337 15029019 14939800 14835972
58574 14835972 14715692 14579346 14429942 14270215 14100436 13919551 13727921 13528469 13325290
58565 13325290 13121472 12918469 12717454 12520669 12330874 12149686 11977125 11812748 11656320
$$ packed form
58637A1602735o2430n8931n7084n4873n0282m3861l7776l2527k6342j8090r061
58626A1151478q81O989J6190K6615L6328M4231N1289N8726O6398P3672Q0763Q7959
58614A1699757R4385R8979J02465J06947J13376J20610J27269J33219J38647J42989
58604A2878643J45798J47802J49870J51459J51219J48661J44249J38331J31356
58595A4187388J24784J20060J16504J11664J04276R5572Q7149P8748O8955N7018
58585A5152118M3252K8575J4356J655j0397k4366m1437n9419p5318q9219j03828
58574A4835972j20280j36346j49404j59727j69779j80885j91630j99452k03179
58565A3325290k03818k03003k01015j96785j89795j81188j72561j64377j56428
$$ plain form
58556 11656320 11507087 11363309 11223358 11087004 10955177 10828785 10708141 10593110 10483324
58547 10483324 10378653 10279900 10188523 10105082 10028501 9957613 9892980 9836232 9787867 9746717 9711485
58536 9711485 9681621 9656481 9634672 9614892 9596814 9580683 9566438 9553509 9540855 9526828 9509722
58525 9509722 9489147 9466518 9443654 9421358 9400016 9381112 9367017 9359068 9356747 9359168 9366644 9380086
58513 9380086 9399162 9422023 9447123 9474831 9506740 9543571 9584283 9627413 9672921 9722129 9775705
58502 9775705 9832082 9888302 9942372 9994399 10045221 10094431 10140299 10181495 10218163 10251050 10280216
58491 10280216 10305158 10325697 10341878 10352972 10357328 10353507 10341129 10320402 10291292 10253536 10207275
58480 10207275 10153569 10094604 10033324 9972152 9911654 9850818 9788873 9726188 9663114 9598836 9532246
$$ packed form
58556A1656320j49233j43778j39951j36354j31827j26392j20644j15031j09786
58547A0483324j04671r8753r1377q3441p6581p0888o4633n6748m8365m1150l5232
58536I711485k9864k5140k1809j9780j8078j6131j4245j2929j2654j4027j7106
58525I509722k0575k2629k2864k2296k1342j8904j4095p949k321K421P476J3442
58513I380086J9076K2861K5100K7708L1909L6831M0712M3130M5508M9208N3576
58502I775705N6377N6220N4070N2027N0822M9210M5868M1196L6668L2887K9166
58491A0280216K4942K0539J6181J1094M356l821j2378k0727k9110l7756m6261
58480A0207275n3706n8965o1280o1172o0498o0836o1945o2685o3074o4278o6590
$$ plain form
58469 9532246 9463316 9392526 9319277 9241985 9159713 9072600 8980635 8883258 8780666 8674507 8566601
58458 8566601 8457699 8348132 8238930 8131392 8026048 7922959 7822891 7727314 7637261 7552899
58448 7552899 7474159 7400977 7332718 7268206 7206936 7149944 7098890 7054321 7015166 6979941 6948175
58437 6948175 6920496 6897544 6879189 6864909 6854511 6847799 6843508 6839326 6833631 6826924 6820881 6816084 6811346
58424 6811346 6805256 6797569 6788768 6779100 6768833 6759097 6751471 6746536 6743425 6741151 6740111 6741932 6747898 6757711
58410 6757711 6769799 6782834 6796920 6813200 6832192 6852644 6872207 6889189 6903593 6916707 6930135
58399 6930135 6945088 6961904 6979852 6997685 7014661 7030916 7046879 7062659 7078155 7093196 7107179
58388 7107179 7119054 7128189 7134975 7139935 7142401 7140727 7133840 7122043 7106313 7087374 7065628 7041488
$$ packed form
58469I532246o8930p0790p3249p7292q2272q7113r1965r7377j02592j06159j07906
58458H566601j08902j09567j09202j07538j05344j03089j00068r5577r0053q4362
58448G552899p8740p3182o8259o4512o1270n6992n1054m4569l9155l5225l1766
58437F948175k7679k2952j8355j4280j0398o712m291m182n695o707o043m797m738
58424F811346o090p687q801r668j0267r736p626m935l111k274j040J821N966R813
58410F757711J2088J3035J4086J6280J8992K0452J9563J6982J4404J3114J3428
58399F930135J4953J6816J7948J7833J6976J6255J5963J5780J5496J5041J3983
58388G107179J1875R135O786M960K466j674o887j1797j5730j8939k1746k4140
$$ plain form
58376 7041488 7015569 6988822 6962435 6937101 6912441 6887742 6863382 6840785 6820753 6802565 6785155
58365 6785155 6768449 6752943 6738603 6725012 6712300 6701106 6691746 6684258 6679277 6678160 6681942 6690584
58353 6690584 6703417 6720027 6740567 6765466 6794997 6829069 6867383 6909742 6955928 7005232 7056537
58342 7056537 7109119 7163001 7218244 7274417 7331262 7389255 7448584 7507944 7565413 7620442 7673928
58331 7673928 7726116 7775628 7821001 7862138 7899408 7932181 7959344 7980860 7997674 8010049 8017041
58320 8017041 8017995 8013822 8006134 7995361 7980397 7960302 7936011 7909942 7883948 7858040 7831573 7805427
58308 7805427 7782364 7764891 7753240 7745835 7741396 7739922 7741792 7746854 7754901 7766442 7782171 7801757
58296 7801757 7823994 7848553 7877065 7911837 7953604 8000940 8051762 8104915 8160455 8219231 8282496
$$ packed form
58376G041488k5919k6747k6387k5334k4660k4699k4360k2597k0032j8188j7410
58365F785155j6706j5506j4340j3591j2712j1194r360p488m981j117L782Q642
58353F690584J2833J6610K0540K4899K9531L4072L8314M2359M6186M9304N1305
58342G056537N2582N3882N5243N6173N6845N7993N9329N9360N7469N5029N3486
58331G673928N2188M9512M5373M1137L7270L2773K7163K1516J6814J2375O992
58320H017041R54m173p688j0773j4964k0095k4291k6069k5994k5908k6467k6146
58308G805427k3063j7473j1651p405m439j474J870N062Q047J1541J5729J9586
58296G801757K2237K4559K8512L4772M1767M7336N0822N3153N5540N8776O3265
$$ plain form
58285 8282496 8351169 8424695 8500956 8578049 8656167 8737187 8822448 8911542 9003402 9097877 9195704
58274 9195704 9297270 9402064 9509493 9619874 9734348 9853881 9978624 10108330 10243097
58265 10243097 10383305 10528821 10678690 10831963 10988761 11150427 11318607 11494076 11676391
58256 11676391 11864859 12060250 12265394 12483583 12716277 12962747 13221863 13493632 13779083
58247 13779083 14079684 14397208 14733190 15087926 15460913 15853026 16267403 16707286 17173863
58238 17173863 17667396 18189819 18744793 19335736 19965644 20639089 21362834 22143825 22987572
58229 22987572 23899238 24885726 25956269 27121636 28393490 29784785 31311198 32992669
58221 32992669 34853636 36922100 39229984 41816041 44728594 48025314 51771852 56042528
$$ packed form
58285H282496O8673P3526P6261P7093P8118Q1020Q5261Q9094R1860R4475R7827
58274I195704J01566J04794J07429J10381J14474J19533J24743J29706J34767
58265A0243097J40208J45516J49869J53273J56798J61666J68180J75469J82315
58256A1676391J88468J95391K05144K18189K32694K46470K59116K71769K85451
58247A3779083L00601L17524L35982L54736L72987L92113M14377M39883M66577
58238A7173863M93533N22423N54974N90943O29908O73445P23745P80991Q43747
58229B2987572R11666R86488J070543J165367J271854J391295J526413J681471
58221C2992669J860967K068464K307884K586057K912553L296720L746538M270676
$$ plain form
58213 56042528 60921730 66502112 72879566 80148172 88396406 97704726 108146637 119792235
58205 119792235 132704654 146921791 162432712 179167088 197000306 215758236 235214462
58198 235214462 255096920 275121877 295046961 314716253 334077274 353161711 372026243
58191 372026243 390666709 408953639 426648725 443512153 459432074 474476101 488809443
58184 488809443 502496288 515243407 526163640 533670432 535643534 529940288 515125705
58177 515125705 491082238 459151816 421726859 381544140 341060141 302128279 265953896
58170 265953896 233189909 204072089 178555231 156428837 137394972 121112286 107225923
58163 107225923 95392728 85297362 76658942 69235411 62827013 57273033 52441834 48222363
$$ packed form
58213E6042528M879202N580382O377454P268606Q248234R308320J0441911J1645598
58205A19792235J2912419J4217137J5510921J6734376J7833218J8757930J9456226
58198B35214462J9882458K0024957J9925084J9669292J9361021J9084437J8864532
58191C72026243J8640466J8286930J7695086J6863428J5919921J5044027J4333342
58184D88809443J3686845J2747119J0920233P506792J973102n703246j4814583
58177E15125705k4043467l1930422l7424957m0182719m0483999l8931862l6174383
58170B65953896l2763987k9117820k5516858k2126394j9033865j6282686j3886363
58163A07225923j1833195j0095366q638420p423531o408398n553980m831199m219471
$$ plain form
58155 48222363 44521198 41260947 38376961 35814978 33530822 31489006 29659156 28013749
58147 28013749 26528839 25184826 23965293 22855774 21843728 20918278 20069183 19286880
58139 19286880 18563605 17893218 17269414 16685215 16134637 15613691 15119126 14647208 14194335
58130 14194335 13757970 13336307 12927920 12532442 12150848 11784216 11432577 11095529 10773439
58121 10773439 10467331 10177787 9904476 9646626 9403608 9175066 8960598 8759244 8569536
58112 8569536 8390454 8222105 8064855 7917951 7779760 7649303 7526700 7412122 7305289
58103 7305289 7206067 7114363 7029022 6947962 6870086 6796169 6727191 6662662 6601225 6541920 6483956
58092 6483956 6426264 6368508 6311825 6257230 6203765 6149622 6094709 6040541 5987686 5934989 5881617
$$ packed form
58155D8222363l701165l260251k883986k561983k284156k041816j829850j645407
58147B8013749j484910j344013j219533j109519j012046r25450q49095p82303
58139A9286880p23275o70387o23804n84199n50578n20946m94565m71918m52873
58130A4194335m36365m21663m08387l95478l81594l66632l51639l37048l22090
58121A0773439l06108k89544k73311k57850k43018k28542k14468k01354j89708
58112H569536j79082j68349j57250j46904j38191j30457j22603j14578j06833
58103G305289r9222r1704q5341q1060p7876p3917o8978o4529o1437n9305n7964
58092F483956n7692n7756n6683n4595n3465n4143n4913n4168n2855n2697n3372
$$ plain form
58081 5881617 5828236 5775472 5722689 5669311 5616223 5564644 5514438 5464820 5416131 5369658 5326124
58070 5326124 5285769 5249576 5218714 5192508 5168659 5146145 5126463 5110974 5098382 5086286 5074349
58059 5074349 5064284 5057146 5052326 5049134 5047640 5047667 5048595 5050755 5055447 5062684 5070368 5077024 5084232 5094666
58045 5094666 5108431 5123039 5136837 5150697 5166047 5182783 5199851 5216799 5233876 5251179 5268435
58034 5268435 5285389 5302076 5318970 5337032 5357200 5379565 5403370 5427943 5453306 5479937 5508459
58023 5508459 5539619 5574087 5612262 5654770 5702872 5757567 5818425 5884492 5956441 6036538 6126067
58012 6126067 6224249 6330567 6446735 6574936 6715055 6865286 7024910 7194794 7375243 7564974
58002 7564974 7762458 7966923 8177602 8393091 8611922 8832824 9053897 9272472 9486484
$$ packed form
58081E881617n3381n2764n2783n3378n3088n1579n0206m9618m8689m6473m3534
58070E326124m0355l6193l0862k6206k3849k2514j9682j5489j2592j2096j1937
58059E074349j0065p138m820l192j494K7R28K160M692P237P684O656P208J0434
58045E094666J3765J4608J3798J3860J5350J6736J7068J6948J7077J7303J7256
58034E268435J6954J6687J6894J8062K0168K2365K3805K4573K5363K6631K8522
58023E508459L1160L4468L8175M2508M8102N4695O0858O6067P1949Q0097Q9529
58012F126067R8182J06318J16168J28201J40119J50231J59624J69884J80449J89731
58002G564974J97484K04465K10679K15489K18831K20902K21073K18575K14012
$$ plain form
57993 9486484 9695364 9898953 10096097 10284845 10463390 10630036 10782459 10917553 11031758
57984 11031758 11121068 11181094 11207711 11197618 11148114 11057243 10925483 10757637 10562560 10350626
57974 10350626 10131350 9912651 9700938 9501049 9316323 9149150 9001318 8873644 8765508
57965 8765508 8675186 8600738 8540577 8493445 8458263 8434096 8420104 8415355 8418744 8429162 8445752 8467958
57953 8467958 8495344 8527318 8562923 8600817 8639460 8677378 8713195 8745423 8772527 8793702 8809715
57942 8809715 8822640 8834463 8846082 8857849 8870636 8885734 8903671 8923634 8944204 8964277 8983123
57931 8983123 9000045 9014373 9025618 9033214 9035952 9031520 9016367 8986250 8937658 8869182 8781355 8675215
57919 8675215 8551721 8412885 8262650 8105899 7947054 7790323 7640564 7502436 7378561
$$ packed form
57993I486484K08880K03589J97144J88748J78545J66646J52423J35094J14205
57984A1031758Q9310O0026K6617j0093m9504r0871j31760j67846j95077k11934
57974A0350626k19276k18699k11713j99889j84726j67173j47832j27674j08136
57965H765508r0322p4448o0161m7132l5182k4167j3992m749L389J0418J6590K2206
57953H467958K7386L1974L5605L7894L8643L7918L5817L2228K7104K1175J6013
57942H809715J2925J1823J1619J1767J2787J5098J7937J9963K0570K0073J8846
57931H983123J6922J4328J1245P596K738m432j5153l0117m8592o8476q7827j06140
57919H675215j23494j38836j50235j56751j58845j56731j49759j38128j23875
$$ plain form
57910 7378561 7269519 7175692 7097876 7035903 6988137 6953368 6932150 6925118 6930651 6945460 6967118
57899 6967118 6994798 7027823 7065064 7106130 7151772 7202288 7256148 7310696 7363509 7412601 7456198
57888 7456198 7493331 7524147 7548547 7564574 7568999 7559547 7535958 7498967 7449211 7387309 7314040 7229679
57876 7229679 7133670 7025697 6907009 6780241 6648132 6512848 6376357 6240586 6106859 5975555
57866 5975555 5846692 5720713 5598508 5480979 5368994 5263666 5166135 5076807 4995061 4920013
57856 4920013 4851477 4789903 4735533 4688042 4647095 4612736 4584810 4562251 4543503 4527666 4514863
57845 4514863 4505469 4499564 4497317 4499271 4505585 4515257 4526775 4539563 4554251 4571516 4591334 4613652
57833 4613652 4639142 4668673 4702305 4739288 4778868 4820669 4864548 4910756 4960201 5013845 5071567
$$ packed form
57910G378561j09042r3827p7816o1973m7766l4769k1218p032N533J4809K1658
57899F967118K7680L3025L7241M1066M5642N0516N3860N4548N2813M9092M3597
57888G456198L7133L0816K4400J6027M425r452k3589l6991m9756o1902p3269q4361
57876G229679r6009j07973j18688j26768j32109j35284j36491j35771j33727j31304
57866E975555j28863j25979j22205j17529j11985j05328r7531q9328q1746p5048
57856D920013o8536o1574n4370m7491m0947l4359k7926k2559j8748j5837j2803
57845D514863r394n905k247J954O314R672J1518J2788J4688J7265J9818K2318
57833D613652K5490K9531L3632L6983L9580M1801M3879M6208M9445N3644N7722
$$ plain form
57822 5071567 5132042 5193996 5257152 5321741 5387503 5453478 5518464 5581400 5641706 5699673 5756170
57811 5756170 5811388 5864104 5912726 5956800 5996535 6030489 6054334 6062460 6050844 6018491 5966827
57800 5966827 5898479 5816662 5725054 5627518 5527590 5428244 5332207 5242191 5160255 5086798 5020771
57789 5020771 4961362 4909022 4864316 4826165 4792179 4760661 4731450 4704733 4680070 4656965 4635489
57778 4635489 4615622 4596655 4577933 4559632 4542098 4524941 4507615 4490439 4474030 4457983 4441153
57767 4441153 4423095 4404143 4384084 4362213 4339167 4317356 4298509 4281644 4264610 4247054 4230597
57756 4230597 4216362 4203611 4191042 4178281 4165692 4153870 4144040 4138007 4136459 4137554 4138313 4137538 4136527
57743 4136527 4136790 4137980 4138504 4137349 4134575 4130570 4125627 4119833 4112515 4102124 4087840 4071508 4056977
$$ packed form
57822E071567O0475O1954O3156O4589O5762O5975O4986O2936O0306N7967N6497
57811E756170N5218N2716M8622M4074L9735L3954K3845Q126j1616l2353n1664
57800E966827o8348q1817r1608r7536r9928r9346r6037r0016q1936p3457o6027
57789E020771n9409n2340m4706l8151l3986l1518k9211k6717k4663k3105k1476
57778D635489j9867j8967j8722j8301j7534j7157j7326j7176j6409j6047j6830
57767D441153j8058j8952k0059k1871k3046k1811j8847j6865j7034j7556j6457
57756D230597j4235j2751j2569j2761j2589j1822r830o033j548J095P59p75j011
57743D136527K63J190N24j155k774m005m943n794p318j0391j4284j6332j4531
$$ plain form
57730 4056977 4047116 4042248 4041827 4046588 4058128 4077088 4102928 4135389 4175279 4223649 4280711 4345531
57718 4345531 4416397 4491666 4570814 4654471 4742849 4834395 4926776 5019061 5111943 5205727 5299213
57707 5299213 5391027 5480973 5568989 5653202 5729973 5796016 5850023 5892329 5923472 5943232 5950672
57696 5950672 5944912 5925942 5894886 5853570 5803784 5746729 5682929 5612876 5538067 5461233 5385144
57685 5385144 5311214 5239604 5170568 5105178 5044803 4990560 4943232 4902798 4867583 4834554 4801204
57674 4801204 4766980 4732789 4699522 4667395 4636121 4605020 4572790 4536969 4493290 4435986 4360260
57663 4360260 4265434 4155441 4036116 3912838 3790777 3675316 3570298 3476376 3392528 3318753
57653 3318753 3255728 3202116 3154167 3108652 3065018 3024246 2986725 2951871 2918863 2886934 2855588
$$ packed form
57730D056977r861m868m21M761J1540J8960K5840L2461L9890M8370N7062O4820
57718D345531P0866P5269P9148Q3657Q8378R1546R2381R2285R2882R3784R3486
57707E299213R1814Q9946Q8016Q4213P6771O6043N4007M2306L1143J9760P440
57696E950672n760j8970l1056m1316m9786n7055o3800p0053p4809p6834p6089
57685E385144p3930p1610o9036o5390o0375n4243m7328m0434l5215l3029l3350
57674D801204l4224l4191l3267l2127l1274l1101l2230l5821m3679n7304p5726
57663D360260r4826j09993j19325j23278j22061j15461j05018r3922q3848p3775
57653C318753o3025n3612m7949m5515m3634m0772l7521l4854l3008l1929l1346
$$ plain form
57642 2855588 2825161 2796755 2771094 2747861 2726469 2706910 2689379 2673696 2659708 2647804 2638389
57631 2638389 2631061 2624816 2618902 2613106 2607433 2602029 2597334 2593912 2591989 2591331 2591591 2592861 2595826 2601062
57617 2601062 2607732 2613358 2615734 2615230 2614464 2615422 2617617 2619317 2619874 2620309 2622174 2626307 2632077 2637258 2639304
57602 2639304 2637684 2634748 2633632 2635409 2638655 2641414 2642916 2643677 2644681 2646500 2648716 2650268 2650697 2650735 2651218
57587 2651218 2651751 2651186 2649158 2646456 2643983 2642075 2640864 2640671 2641932 2645149 2650820 2658780 2667646 2675576 2681847
57572 2681847 2687314 2693327 2700436 2707987 2714542 2718948 2721553 2724097 2727707 2731254 2732571 2731168 2728781 2727233
57558 2727233 2726917 2727552 2729201 2731769 2734420 2736394 2737921 2739554 2740975 2741121 2739384 2736251 2732958 2730828 2730642
57543 2730642 2732234 2734774 2737542 2740245 2742742 2745198 2748598 2754145 2761510 2768273 2771713 2770803 2766116 2758601
$$ packed form
57642B855588l0427k8406k5661k3233k1392j9559j7531j5683j3988j1904r415
57631B638389p328o245n914n796n673n404m695l422j923o58K60J270K965N236
57617B601062O670N626K376n04p66R58K195J700N57M35J865M133N770N181K046
57602B639304j620k936j116J777L246K759J502P61J004J819K216J552M29L8M83
57587B651218N33n65k028k702k473j908j211j93J261L217N671P960Q866P930O271
57572B681847N467O013P109P551O555M406K605K544L610L547J317j403k387j548
57558B727233l16O35J649K568K651J974J527J633J421J46j737l133l293k130j86
57543B730642J592K540K768K703K497K456L400N547P365O763L440r10m687p515
$$ plain form
57529 2758601 2749372 2740168 2732828 2728110 2725534 2724350 2724162 2724756 2725971 2727864 2730675 2734797 2740997 2750269
57515 2750269 2762834 2777533 2792849 2808451 2825156 2843472 2862878 2882567 2902281 2922093 2941811
57504 2941811 2960977 2979521 2998416 3019439 3043664 3069935 3095535 3119001 3141705 3165828 3191287
57493 3191287 3215835 3238056 3259033 3280842 3304469 3329601 3355369 3380488 3403366 3423019 3439869
57482 3439869 3455226 3470030 3484226 3496998 3507355 3514822 3519856 3523436 3526077 3527536 3527531 3526381 3524755
57469 3524755 3523146 3521747 3520520 3519145 3517252 3514921 3512871 3512151 3513809 3518504 3525649 3532933 3537527 3538200
57455 3538200 3535875 3532073 3527547 3522619 3517851 3513684 3510106 3507429 3506903 3509737 3515732 3523523 3531870 3540147
57441 3540147 3547970 3555239 3562451 3569982 3576763 3580244 3578136 3570037 3557423 3542468 3527014 3512350 3499556
$$ packed form
57529B758601r229r204p340m718k576j184j88N94J215J893K811M122O200R272
57515B750269J2565J4699J5316J5602J6705J8316J9406J9689J9714J9812J9718
57504B941811J9166J8544J8895K1023K4225K6271K5600K3466K2704K4123K5459
57493C191287K4548K2221K0977K1809K3627K5132K5768K5119K2878J9653J6850
57482C439869J5357J4804J4196J2772J0357P467N034L580K641J459nj150j626
57469C524755j609j399j227j375j893k331k050p20J658M695P145P284M594O73
57455C538200k325l802m526m928m768m167l578k677n26K834N995P791Q347Q277
57441C540147P823P269P212P531O781L481k108q099j2614j4955j5454j4664j2794
$$ plain form
57428 3499556 3489842 3484258 3482878 3484535 3487805 3492415 3499439 3510015 3524006 3540028 3556785 3574246 3593421
57415 3593421 3615099 3639118 3664830 3691658 3718816 3745192 3770316 3794889 3819110 3840668 3855709
57404 3855709 3861938 3859418 3848273 3827706 3798509 3764889 3731933 3701955 3674729 3650423 3630359 3615227
57392 3615227 3604460 3597560 3594520 3594696 3596758 3600266 3606155 3615146 3626641 3639504 3652942 3666232 3678681
57379 3678681 3690420 3702312 3714500 3725877 3735614 3744414 3753592 3763527 3773756 3784095 3794988 3807063
57367 3807063 3820783 3836212 3852703 3869140 3884833 3899932 3914975 3930572 3947638 3967173 3989352
57356 3989352 4013412 4038750 4065625 4094556 4125660 4158823 4193723 4229440 4264926 4300251 4336471
57345 4336471 4373704 4410364 4445065 4478359 4511682 4545451 4579290 4613412 4648410 4684023 4719369
$$ packed form
57428C499556r714n584j380J657L270M610P024J0576J3991J6022J6757J7461J9175
57415C593421K1678K4019K5712K6828K7158K6376K5124K4573K4221K1558J5041
57404C855709O229k520j1145k0567k9197l3620l2956k9978k7226k4306k0064j5132
57392C615227j0767o900l040J76K062L508N889Q991J1495J2863J3438J3290J2449
57379C678681J1739J1892J2188J1377R737Q800R178R935J0229J0339J0893J2075
57367C807063J3720J5429J6491J6437J5693J5099J5043J5597J7066J9535K2179
57356C989352K4060K5338K6875K8931L1104L3163L4900L5717L5486L5325L6220
57345D336471L7233L6660L4701L3294L3323L3769L3839L4122L4998L5613L5346
$$ plain form
57334 4719369 4754345 4789819 4826375 4863750 4901466 4939344 4977426 5016041 5055829 5097103 5139462
57323 5139462 5182650 5227412 5274624 5323855 5373850 5424288 5476048 5529742 5585110 5642134 5701650
57312 5701650 5764275 5829417 5895895 5963076 6030872 6098942 6166474 6232835 6298165 6363011 6427310
57301 6427310 6490187 6551288 6612036 6674377 6738049 6800396 6859618 6916917 6974257 7031314 7086493
57290 7086493 7140216 7195120 7253093 7314050 7377717 7444643 7515038 7588591 7666313 7750900 7844120
57279 7844120 7945004 8051489 8162602 8277951 8396232 8515553 8634647 8752945 8870424
57270 8870424 8988391 9109506 9235736 9366766 9501266 9638790 9779166 9920867 10061621
57261 10061621 10200390 10337293 10471772 10602276 10727807 10848530 10964742 11076489 11184473
$$ packed form
57334D719369L4976L5474L6556L7375L7716L7878L8082L8615L9788M1274M2359
57323E139462M3188M4762M7212M9231M9995N0438N1760N3694N5368N7024N9516
57312E701650O2625O5142O6478O7181O7796O8070O7532O6361O5330O4846O4299
57301F427310O2877O1101O0748O2341O3672O2347N9222N7299N7340N7057N5179
57290G086493N3723N4904N7973O0957O3667O6926P0395P3553P7722Q4587R3220
57279G844120J00884J06485J11113J15349J18281J19321J19094J18298J17479
57270H870424J17967J21115J26230J31030J34500J37524J40376J41701J40754
57261A0061621J38769J36903J34479J30504J25531J20723J16212J11747J07984
$$ plain form
57252 11184473 11290115 11394155 11495964 11594618 11689938 11782212 11871732 11959054 12044997 12129899
57242 12129899 12213493 12296090 12379444 12465762 12555874 12648632 12741958 12834323 12925461 13015907 13105841
57231 13105841 13194367 13280120 13362550 13442387 13520881 13598890 13676657 13753984 13830478 13905962 13980901
57220 13980901 14056304 14133104 14211658 14291711 14372548 14453123 14532245 14608825 14682277 14753265 14824141
57209 14824141 14897836 14975598 15056169 15137856 15220954 15307118 15396563 15487184 15576807 15665274 15753707
57198 15753707 15842533 15931145 16019056 16106541 16194113 16281864 16369355 16455887 16540948 16624488 16706606
57187 16706606 16786922 16864626 16939303 17011206 17080388 17146084 17207470 17264601 17317752 17365945 17407006
57176 17407006 17439511 17464122 17482609 17495841 17503209 17503816 17497680 17485672 17468697 17447272 17421680 17392129
$$ packed form
57252A1184473J05642J04040J01809R8654R5320R2274Q9520Q7322Q5943Q4902
57242A2129899Q3594Q2597Q3354Q6318R0112R2758R3326R2365R1138R0446Q9934
57231A3105841Q8526Q5753Q2430P9837P8494P8009P7767P7327P6494P5484P4939
57220A3980901P5403P6800P8554Q0053Q0837Q0575P9122P6580P3452P0988P0876
57209A4824141P3695P7762Q0571Q1687Q3098Q6164Q9445R0621Q9623Q8467Q8433
57198A5753707Q8826Q8612Q7911Q7485Q7572Q7751Q7491Q6532Q5061Q3540Q2118
57187A6706606Q0316P7704P4677P1903O9182O5696O1386N7131N3151M8193M1061
57176A7407006L2505K4611J8487J3232P368O07o136j2008j6975k1425k5592k9551
$$ plain form
57164 17392129 17358746 17321572 17280524 17235060 17183901 17125591 17059775 16987943 16912865 16837306 16763074
57153 16763074 16690665 16619365 16547991 16476032 16404134 16333409 16264525 16197591 16132450 16068587 16005086
57142 16005086 15941199 15876588 15810370 15740328 15664073 15581039 15492561 15400039 15304065 15205561 15106632
57131 15106632 15009553 14915685 14826183 14743086 14668703 14604070 14548735 14501844 14462669 14430183 14403309
57120 14403309 14382391 14370510 14373287 14397538 14449940 14536313 14661575 14830172 15046719 15316768
57110 15316768 15647791 16049958 16535625 17116826 17801884 18593219 19487460 20477177 21552485
57101 21552485 22700988 23905866 25143578 26383339 27588962 28721192 29738068 30593168
57093 30593168 31234852 31610747 31679779 31429590 30892528 30151808 29331964 28573637 28000091
$$ packed form
57164A7392129l3383l7174m1048m5464n1159n8310o5816p1832p5078p5559p4232
57153A6763074p2409p1300p1374p1959p1898p0725o8884o6934o5141o3863o3501
57142A6005086o3887o4611o6218p0042p6255q3034q8478r2522r5974r8504r8929
57131A5106632r7079r3868q9502q3097p4383o4633n5335m6891l9175l2486k6874
57120A4403309k0918j1881K777K4251N2402Q6373J25262J68597K16547K70049
57110A5316768L31023M02167M85667N81201O85058P91335Q94241R89717J075308
57101B1552485J148503J204878J237712J239761J205623J132230J016876Q55100
57093C0593168O41684L75895O9032k50189n37062p40720q19844p58327n73546
$$ plain form
57084 28000091 27689815 27670425 27937164 28478862 29284267 30318168 31488944 32644313 33610726
57075 33610726 34252695 34509918 34389606 33928613 33159361 32101477 30774058 29209097 27453756
57066 27453756 25564226 23599366 21616663 19668055 17795393 16028894 14389894 12894270
57058 12894270 11552564 10367419 9332223 8433115 7652968 6974736 6383047 5864562 5408014
57049 5408014 5004137 4645330 4325101 4037861 3779186 3545968 3335870 3146640 2976043
57040 2976043 2822278 2684097 2560530 2450813 2354541 2271484 2201067 2142284 2094080 2055513
57030 2055513 2025490 2002858 1986910 1977328 1973331 1973354 1975945 1980143 1983942 1982610 1969968 1942207 1900292
57017 1900292 1848595 1791963 1734368 1679035 1628142 1582172 1540522 1503051 1470321 1442278 1417750
$$ packed form
57084B8000091l10276j9390K66739N41698Q05405J033901J170776J155369R66413
57075C3610726O41969K57223j20312m60993p69252j057884j327419j564961j755341
57066B7453756j889530j964860j982703j948608j872662j766499j639000j495624
57058A2894270j341706j185145j035196q99108p80147o78232n91689n18485m56548
57049E408014m03877l58807l20229k87240k58675k33218k10098j89230j70597
57040B976043j53765j38181j23567j09717r6272q3057p0417n8783m8204l8567
57030B055513l0023k2632j5948r582l997K3K591M198L799j332j2642k7761m1915
57017A900292n1697n6632n7595n5333n0893m5970m1650l7471l2730k8043k4528
$$ plain form
57006 1417750 1395836 1376904 1361354 1348054 1335113 1321971 1309649 1298998 1289902 1282434 1277571 1275891
56994 1275891 1276327 1277201 1278236 1280742 1285894 1293506 1302531 1312228 1322618 1334187 1347330 1361880 1377076
56981 1377076 1392109 1406782 1421578 1437164 1453880 1471474 1489043 1505350 1519541 1531750 1543011
56970 1543011 1554631 1567668 1582811 1600500 1621022 1644427 1670206 1697219 1724417 1751744 1779991
56959 1779991 1809527 1839742 1870146 1901585 1935578 1972447 2010595 2047674 2082054 2113136 2140840
56948 2140840 2165232 2186575 2205430 2222595 2238903 2255195 2272512 2292062 2314575 2339781 2367126
56937 2367126 2397011 2430383 2466638 2502859 2536162 2566350 2595262 2623727 2650171 2672039 2687416
56926 2687416 2695196 2694865 2686620 2670746 2646475 2612415 2568938 2519515 2469024 2421071 2377313 2338431
$$ packed form
57006A417750k1914j8932j5550j3300j2941j3142j2322j0651r096p468m863j680
56994A275891M36Q74J035K506N152P612R025R697J0390J1569J3143J4550J5196
56981A377076J5033J4673J4796J5586J6716J7594J7569J6307J4191J2209J1261
56970A543011J1620J3037J5143J7689K0522K3405K5779K7013K7198K7327K8247
56959A779991K9536L0215L0404L1439L3993L6869L8148L7079L4380L1082K7704
56948B140840K4392K1343J8855J7165J6308J6292J7317J9550K2513K5206K7345
56937B367126K9885L3372L6255L6221L3303L0188K8912K8465K6444K1868J5377
56926B687416P780l31q245j5874k4271l4060m3477m9423n0491m7953m3758l8882
$$ plain form
56914 2338431 2304710 2275963 2251870 2232450 2217626 2206345 2196551 2185877 2172059 2153260 2129106
56903 2129106 2101427 2073068 2045483 2017928 1989248 1959950 1932129 1907794 1887712 1871555 1858495
56892 1858495 1847627 1838444 1831318 1827203 1826406 1827757 1829613 1831907 1836616 1845648 1858567 1872972 1886825
56879 1886825 1899575 1911064 1920544 1927538 1932999 1938696 1945625 1953678 1962703 1973072 1985109 1998569 2013165
56866 2013165 2029335 2048114 2070192 2095236 2122261 2150681 2180831 2213229 2247482 2282414 2317430
56855 2317430 2353176 2390297 2427641 2462100 2490384 2511039 2525209 2535820 2545933 2557555 2571899
56844 2571899 2590404 2614756 2645692 2682473 2724109 2770561 2822124 2878111 2936951 2997369 3058760
56833 3058760 3120783 3183628 3248601 3317201 3388993 3460781 3527940 3586071 3631679 3662755 3679713
$$ packed form
56914B338431l3721k8747k4093j9420j4824j1281r794j0674j3818j8799k4154
56903B129106k7679k8359k7585k7555k8680k9298k7821k4335k0082j6157j3060
56892A858495j0868r183p126m115p97J351J856K294M709R032J2919J4405J3853
56879A886825J2750J1489R480O994N461N697O929Q053R025J0369J2037J3460J4596
56866B013165J6170J8779K2078K5044K7025K8420L0150L2398L4253L4932L5016
56855B317430L5746L7121L7344L4459K8284K0655J4170J0611J0113J1622J4344
56844B571899J8505K4352L0936L6781M1636M6452N1563N5987N8840O0418O1391
56833C058760O2023O2845O4973O8600P1792P1788O7159N8131M5608L1076J6958
$$ plain form
56822 3679713 3685307 3683141 3676484 3668452 3662261 3660453 3664385 3674994 3693361 3719580 3751497 3785685 3819886
56809 3819886 3854018 3889009 3925397 3963062 4001520 4040116 4078225 4115215 4149624 4178343 4197448
56798 4197448 4204549 4200230 4187091 4167865 4144879 4120828 4098915 4081562 4069161 4060550 4054757 4051885
56786 4051885 4052154 4054568 4057158 4058380 4057524 4053716 4045612 4032813 4016797 3999245 3979522 3954755 3922394
56773 3922394 3881631 3832179 3772973 3703140 3623657 3537219 3446778 3354859 3263926 3176354 3093787
56762 3093787 3016986 2946410 2882548 2825622 2775370 2731248 2692679 2659224 2630790 2607404 2588437
56751 2588437 2572498 2558690 2547589 2539946 2534664 2529429 2523663 2519431 2518519 2519853 2521127 2522240 2525495
56738 2525495 2532561 2542771 2554650 2567773 2582533 2599153 2617748 2638765 2662614 2689301 2718968
$$ packed form
56822C679713N594k166o657q032o191j808L932J0609J8367K6219L1917L4188L4201
56809C819886L4132L4991L6388L7665L8458L8596L8109L6990L4409K8719J9105
56798D197448P101m319j3139j9226k2986k4051k1913j7353j2401q611n793k872
56786D051885K69K414K590J222q56l808q104j2799j6016j7552j9723k4767l2361
56773C922394m0763m9452n9206o9833p9483q6438r0441r1919r0933q7572q2567
56762C093787p6801p0576o3862n6926n0252m4122l8569l3455k8434k3386j8967
56751B588437j5939j3808j1101p643n282n235n766m232r12J334J274J113L255
56738B525495P066J0210J1879J3123J4760J6620J8595K1017K3849K6687K9667
$$ plain form
56727 2718968 2752403 2790429 2833163 2880369 2932221 2989116 3051133 3118403 3191865 3272856 3361832
56716 3361832 3458077 3560727 3669497 3784323 3904981 4031413 4163878 4302193 4445141 4591243
56706 4591243 4740206 4893128 5051044 5213427 5378286 5543446 5707390 5868890 6026293
56697 6026293 6177496 6320338 6452535 6571450 6674624 6760919 6830837 6885589 6926305 6954493
56687 6954493 6972770 6984392 6992017 6997098 7000161 7001012 6998771 6992390 6981614 6967250 6950331 6931046 6908409
56674 6908409 6880797 6846747 6805409 6756298 6698738 6631942 6555830 6471427 6380055 6282389 6178710
56663 6178710 6069868 5957713 5844942 5735050 5631904 5538277 5454661 5380186 5314832 5260047
56653 5260047 5217163 5185909 5164615 5151035 5142859 5138467 5137720 5141192 5148035 5155526 5161707 5167950 5177879
$$ packed form
56727B718968L3435L8026M2734M7206N1852N6895O2017O7270P3462Q0991Q8976
56716C361832R6245J02650J08770J14826J20658J26432J32465J38315J42948J46102
56706D591243J48963J52922J57916J62383J64859J65160J63944J61500J57403
56697F026293J51203J42842J32197J18915J03174Q6295O9918N4752M0716K8188
56687F954493J8277J1622P625N081L063Q51k241o381j0776j4364j6919j9285k2637
56674F908409k7612l4050m1338m9111n7560o6796p6112q4403r1372r7666j03679
56663F178710j08842j12155j12771j09892j03146r3627q3616p4475o5354n4785
56653E260047m2884l1254k1294j3580q176m392p47L472O843P491O181O243R929
$$ plain form
56640 5177879 5193885 5215302 5239579 5264277 5288036 5310587 5332133 5352187 5368835 5379404 5381806
56629 5381806 5375089 5359295 5335625 5306527 5274647 5241612 5208525 5177376 5150620 5128870 5110105
56618 5110105 5091922 5074006 5057774 5044433 5034432 5028499 5028182 5035197 5050719 5075134 5107799 5147009
56606 5147009 5190816 5237964 5287640 5338482 5388580 5436504 5481554 5522656 5557789 5585104 5604265
56595 5604265 5616243 5622213 5623260 5620753 5616102 5609869 5601520 5590242 5575908 5559488 5542779 5527298
56583 5527298 5512766 5496850 5477166 5453334 5426204 5395218 5358057 5313520 5263476 5210871 5156776
56572 5156776 5100649 5042665 4983965 4924630 4863094 4798059 4729796 4658974 4585265 4507796 4426102
56561 4426102 4339913 4248603 4151638 4049196 3941934 3830751 3717227 3603449 3490545 3377973
$$ packed form
56640E177879J6006K1417K4277K4698K3759K2551K1546K0054J6648J0569K402
56629E381806o717j5794k3670k9098l1880l3035l3087l1149k6756k1750j8765
56618E110105j8183j7916j6232j3341j0001n933l17P015J5522K4415L2665L9210
56606E147009M3807M7148M9676N0842N0098M7924M5050M1102L5133K7315J9161
56595E604265J1978N970J047k507m651o233q349j1278j4334j6420j6709j5481
56583E527298j4532j5916j9684k3832k7130l0986l7161m4537n0044n2605n4095
56572E156776n6127n7984n8700n9335o1536o5035o8263p0822p3709p7469q1694
56561D426102q6189r1310r6965j02442j07262j11183j13524j13778j12904j12572
$$ plain form
56551 3377973 3265206 3153712 3046315 2944860 2849447 2759759 2676001 2598341 2526331 2459261
56541 2459261 2396632 2338139 2283707 2233634 2188185 2146933 2108909 2073410 2040305 2009693 1981874
56530 1981874 1957382 1936182 1916794 1897146 1876657 1856766 1839173 1824199 1811199 1799736 1789625
56519 1789625 1780278 1770698 1760148 1748709 1737412 1727689 1720012 1712899 1704102 1693208 1682353 1673790 1667440
56506 1667440 1661463 1654594 1647034 1639581 1632944 1627739 1624127 1621350 1618407 1615302 1612995 1612087 1612246 1613041 1614573
56491 1614573 1616979 1619919 1623002 1626245 1629686 1632841 1635053 1636258 1637041 1637948 1639020 1640094 1641351 1643291
56477 1643291 1646040 1648886 1650930 1652305 1654370 1658317 1663891 1669827 1675366 1680857 1687022 1694139 1701937 1709849
56463 1709849 1717415 1724908 1733449 1743894 1755564 1766784 1776822 1786515 1796662 1806589 1814931 1821255 1826178
$$ packed form
56551C377973j12767j11494j07397j01455r5413q9688q3758p7660p2010o7070
56541B459261o2629n8493n4432n0073m5449m1252l8024l5499l3105l0612k7819
56530A981874k4492k1200j9388j9648k0489j9891j7593j4974j3000j1463j0111
56519A789625r347r580j0550j1439j1297r723p677p113q797j0894j0855q563o350
56506A667440n977o869p560p453o637n205l612k777k943l105k307r08J59P95J532
56491A614573K406K940L083L243L441L155K212J205P83R07J072J074J257J940
56477A643291K749K846K044J375K065L947N574N936N539N491O165P117P798P912
56463A709849P566P493Q541J0445J1670J1220J0038R693J0147R927Q342O324M923
$$ plain form
56450 1826178 1830222 1833279 1835001 1835110 1833467 1830524 1827641 1826221 1826396 1826990 1826872 1825771 1823863 1821328 1818776
56435 1818776 1817344 1817580 1818423 1818030 1815778 1813045 1811806 1812650 1814338 1815133 1814281 1812090 1808861 1804356 1798599
56420 1798599 1792701 1788025 1784397 1779890 1772918 1764077 1755387 1748040 1741621 1735382 1729348 1723700 1717740 1710284
56406 1710284 1701076 1691378 1682873 1676172 1670564 1665115 1659719 1654929 1651035 1647703 1644492 1641155 1637266 1632187
56392 1632187 1626065 1620467 1617228 1616708 1617826 1619553 1621440 1622723 1622369 1620750 1620172 1622589 1627486 1633077 1638954
56377 1638954 1646099 1654523 1662661 1669580 1676319 1684136 1692383 1699221 1703954 1707725 1712069 1717516 1723463 1728813
56363 1728813 1732818 1735835 1739146 1743624 1748631 1752644 1754782 1755291 1754819 1753897 1753064 1752756 1752793 1752349 1750619 1747285
56347 1747285 1742528 1737087 1732290 1729390 1728665 1729532 1731500 1734396 1737687 1740478 1742687 1745565 1750459 1757496
$$ packed form
56450A826178M044L057J722J09j643k943k883j420J75N94j18j101j908k535k552
56435A818776j432K36Q43l93k252k733j239Q44J688P95q52k191l229m505n757
56420A798599n898m676l628m507o972q841q690p347o419o239o034n648n960p456
56406A710284r208r698q505o701n608n449n396m790l894l332l211l337l889n079
56392A632187o122n598l239n20J118J727J887J283l54j619n78K417M897N591N877
56377A638954P145Q424Q138O919O739P817Q247O838M733L771M344N447N947N350
56363A728813M005L017L311M478N007M013K138N09m72r22q33l08L7m44j730l334
56347A747285m757n441m797k900p25Q67J968K896L291K791K209K878M894P037
$$ plain form
56333 1757496 1765901 1775031 1784401 1793215 1800834 1807602 1814442 1821796 1829705 1838724 1849546 1861534 1872737
56320 1872737 1882009 1890174 1898345 1905892 1911229 1914244 1916771 1920559 1925701 1931282 1936741 1942212 1948163 1955192
56306 1955192 1963738 1973529 1983678 1993699 2004013 2014975 2025785 2035185 2043204 2051598 2062273 2075517
56294 2075517 2089688 2102267 2111316 2116593 2119681 2122784 2127154 2132770 2139298 2146597 2154078 2160434 2164950
56281 2164950 2168713 2173481 2179334 2184432 2187480 2189498 2192443 2196757 2201375 2205908 2211618 2219841 2230401 2242197
56267 2242197 2254764 2268455 2283405 2299141 2315181 2331331 2347280 2362630 2377618 2393326 2410667
56256 2410667 2429380 2448298 2466473 2483777 2500549 2516845 2532019 2545069 2555597 2564298 2572025 2578283
56244 2578283 2581273 2579727 2574159 2565873 2555359 2542313 2526754 2509129 2489472 2467424 2443328 2418565
$$ packed form
56333A757496Q405R130R370Q814P619O768O840P354P909R019J0822J1988J1203
56320A872737R272Q165Q171P547N337L015K527L788N142N581N459N471N951P029
56306A955192Q546R791J0149J0021J0314J0962J0810R400Q019Q394J0675J3244
56294B075517J4171J2579R049N277L088L103M370N616O528P299P481O356M516
56281B164950L763M768N853N098L048K018K945M314M618M533N710Q223J0560J1796
56267B242197J2567J3691J4950J5736J6040J6150J5949J5350J4988J5708J7341
56256B410667J8713J8918J8175J7304J6772J6296J5174J3050J0528Q701P727O258
56244B578283K990j546n568q286j0514j3046j5559j7625j9657k2048k4096k4763
$$ plain form
56232 2418565 2394512 2371598 2349539 2327935 2306412 2284715 2263064 2242118 2222393 2203994 2187060
56221 2187060 2172064 2159468 2149376 2141517 2135119 2128810 2121481 2113671 2107451 2104346 2103776 2103927 2103605 2102630
56207 2102630 2101001 2098716 2096389 2095092 2095231 2095991 2096209 2095577 2094841 2094871 2095630 2096139 2095732 2095197 2096064 2098570 2101097
56190 2101097 2102184 2102292 2102663 2103035 2101916 2099064 2096343 2095652 2097100 2099777 2103344 2108004 2113581 2119618 2126028
56175 2126028 2132800 2139297 2144721 2149332 2154491 2161378 2170268 2181055 2193777 2208398 2224821 2243551 2265695
56162 2265695 2291575 2319757 2348308 2376993 2407513 2441588 2479669 2521822 2568909 2621827 2679920
56151 2679920 2741179 2804308 2870050 2940295 3016325 3098133 3184893 3275589 3369410 3465962 3565134
56140 3565134 3666673 3770009 3874613 3980286 4086806 4193305 4298017 4398355 4491150 4573279
$$ packed form
56232B418565k4053k2914k2059k1604k1523k1697k1651k0946j9725j8399j6934
56221B187060j4996j2596j0092p859o398o309p329p810o220l105n70J51l22r75
56207B102630j629k285k327j297J39P60K18o32p36L0P59N09m07n35Q67K506K527
56190B101097J087J08L71L72j119k852k721o91J448K677L567M660N577O037O410
56175B126028O772O497N424M611N159O887Q890J0787J2722J4621J6423J8730K2144
56162B265695K5880K8182K8551K8685L0520L4075L8081M2153M7087N2918N8093
56151B679920O1259O3129O5742P0245P6030Q1808Q6760R0696R3821R6552R9172
56140C565134J01539J03336J04604J05673J06520J06499J04712J00338R2795Q2129
$$ plain form
56130 4573279 4642673 4698860 4742391 4773823 4793394 4801490 4798977 4786796 4765181 4733358 4690355 4636431
56118 4636431 4573603 4504433 4430371 4351697 4268875 4183038 4094777 4003296 3907540 3807954 3706715
56107 3706715 3606758 3511110 3422570 3342918 3272267 3209790 3155135 3108561 3069770 3037442 3010298
56096 3010298 2988133 2971260 2959112 2949878 2941728 2934291 2928681 2925987 2926027 2927922 2931434 2936950 2944246 2952416
56082 2952416 2961389 2972374 2986009 3001053 3015973 3031161 3048361 3068309 3090269 3113718 3139124
56071 3139124 3166835 3196294 3226665 3257504 3288670 3320357 3353332 3388304 3424959 3462378 3500353
56060 3500353 3539412 3579656 3620792 3663391 3708684 3756614 3805385 3853765 3902808 3954337 4008536
56049 4008536 4063996 4119479 4174612 4229274 4283481 4338011 4394393 4453967 4517091 4583243 4651868
$$ packed form
56130D573279O9394N6187M3531L1432J9571Q096k513j2181k1615l1823m3003n3924
56118D636431o2828o9170p4062p8674q2822q5837q8261r1481r5756r9586j01239
56107C706715r9957r5648q8540p9652p0651o2477n4655m6574l8791l2328k7144
56096C010298k2165j6873j2148r234q150p437n610k694M0J895L512N516P296Q170
56082B952416Q973J0985J3635J5044J4920J5188J7200J9948K1960K3449K5406
56071C139124K7711K9459L0371L0839L1166L1687L2975L4972L6655L7419L7975
56060C500353L9059M0244M1136M2599M5293M7930M8771M8380M9043N1529N4199
56049D008536N5460N5483N5133N4662N4207N4530N6382N9574O3124O6152O8625
$$ plain form
56038 4651868 4723289 4798758 4879260 4964340 5052666 5143747 5238358 5337166 5439794 5545654 5655137
56027 5655137 5769570 5890374 6018305 6152869 6292411 6435613 6583102 6736833 6897845
56018 6897845 7065647 7239884 7421158 7609651 7804334 8004664 8212155 8429249 8657340
56009 8657340 8896789 9148199 9412672 9691247 9984833 10294237 10619768 10961524 11320516
56000 11320516 11698722 12097554 12517544 12960399 13430068 13930462 14463181 15029006 15631054
55991 15631054 16275037 16966934 17711864 18514986 19382199 20320071 21336404 22441244 23647065
55982 23647065 24968504 26422894 28031078 29817649 31811426 34046834 36565044 39414479
55974 39414479 42652086 46344935 50569012 55405035 60934857 67239074 74392599 82460184
$$ packed form
56038D651868P1421P5469Q0502Q5080Q8326R1081R4611R8808J02628J05860J09483
56027E655137J14433J20804J27931J34564J39542J43202J47489J53731J61012
56018F897845J67802J74237J81274J88493J94683K00330K07491K17094K28091
56009H657340K39449K51410K64473K78575K93586L09404L25531L41756L58992
56000A1320516L78206L98832M19990M42855M69669N00394N32719N65825O02048
55991A5631054O43983O91897P44930Q03122Q67213R37872J016333J104840J205821
55982B3647065J321439J454390J608184J786571J993777K235408K518210K849435
55974C9414479L237607L692849M224077M836023N529822O304217P153525Q067585
$$ plain form
55966 82460184 91499333 101568551 112725300 125006172 138405223 152869181 168303607
55959 168303607 184570572 201478298 218785306 236232252 253590698 270710910 287553600
55952 287553600 304183113 320701247 337141685 353396555 369241233 384448776 398912122
55945 398912122 412686938 425917727 438657439 450618019 460928146 468035432 469908850
55938 469908850 464584965 450874357 428871537 399978985 366450630 330742072 294994089
55931 294994089 260791105 229140644 200562404 175215991 153030530 133806312 117275228
55924 117275228 103133962 91069676 80781689 71994407 64463661 57981446 52377336
55917 52377336 47513455 43276576 39572526 36322567 33459695 30926347 28674602 26665762
$$ packed form
55966H2460184R039149J0069218J1156749J2280872J3399051J4463958J5434426
55959A68303607J6266965J6907726J7307008J7446946J7358446J7120212J6842690
55952B87553600J6629513J6518134J6440438J6254870J5844678J5207543J4463346
55945C98912122J3774816J3230789J2739712J1960580J0310127P107286J873418
55938D69908850n323885j3710608k2002820k8892552l3528355l5708558l5747983
55931B94994089l4202984l1650461k8578240k5346413k2185461j9224218j6531084
55924A17275228j4141266j2064286j0287987q787282p530746o482215n604110
55917E2377336m863881m236879l704050l249959k862872k533348k251745k008840
$$ plain form
55909 26665762 24867386 23250889 21792077 20471709 19273644 18183338 17189034 16282555
55901 16282555 15456845 14703257 14012623 13378145 12795604 12261095 11769860 11317193 10899481
55892 10899481 10514368 10160437 9836347 9539727 9267235 9016011 8784428 8571113 8374176
55883 8374176 8191968 8023623 7868023 7723017 7586398 7456799 7332801 7212179 7093268
55874 7093268 6976513 6863615 6755598 6652571 6554403 6459945 6365639 6266289 6157593 6037392
55864 6037392 5905018 5761025 5607984 5450254 5291898 5135047 4980612 4830099 4686055
55855 4686055 4550808 4425230 4308978 4201759 4104011 4016206 3937749 3867028 3802575 3743819
55845 3743819 3690626 3642504 3598456 3557396 3518546 3481620 3446645 3413453 3381534 3350725 3321771
$$ packed form
55909B6665762j798376j616497j458812j320368j198065j090306r94304r06479
55901A6282555q25710p53588o90634o34478n82541n34509m91235m52667m17712
55892A0899481l85113l53931l24090k96620k72492k51224k31583k13315j96937
55883H374176j82208j68345j55600j45006j36619j29599j23998j20622j18911
55874G093268j16755j12898j08017j03027r8168r4458r4306r9350j08696j20201
55864F037392j32374j43993j53041j57730j58356j56851j54435j50513j44044
55855D686055j35247j25578j16252j07219r7748q7805p8457p0721o4453n8756
55845C743819n3193m8122m4048m1060l8850l6926l4975l3192l1919l0809k8954
$$ plain form
55834 3321771 3295648 3272391 3251241 3231798 3214287 3198722 3184752 3172553 3162996 3156587 3152955 3151697
55822 3151697 3153026 3157321 3164803 3175972 3191533 3211547 3235473 3263401 3296360 3335043 3379267 3429284
55810 3429284 3486549 3552427 3627139 3710876 3804981 3910895 4028845 4158854 4302425 4461662
55800 4461662 4636860 4826229 5028061 5242110 5468611 5706653 5953643 6206098 6461245
55791 6461245 6718303 6977717 7238657 7497926 7752101 7999925 8241462 8475552 8699503
55782 8699503 8910876 9107685 9286270 9439916 9559804 9636374 9659843 9621223 9514502 9338449
55772 9338449 9096753 8797223 8450898 8070865 7670763 7263414 6859655 6467438 6092179
55763 6092179 5738414 5410504 5110881 4838319 4589389 4361582 4154033 3965802 3795357
$$ packed form
55834C321771k6123k3257k1150j9443j7511j5565j3970j2199r557o409l632j258
55822C151697J329M295P482J1169J5561K0014K3926K7928L2959L8683M4224N0017
55810C429284N7265O5878P4712Q3737R4105J05914J17950J30009J43571J59237
55800D461662J75198J89369K01832K14049K26501K38042K46990K52455K55147
55791F461245K57058K59414K60940K59269K54175K47824K41537K34090K23951
55782H699503K11373J96809J78585J53646J19888P6570K3469l8620j06721j76053
55772I338449k41696k99530l46325l80033m00102m07349m03759l92217l75259
55763F092179l53765l27910k99623k72562k48930k27807k07549j88231j70445
$$ plain form
55754 3795357 3642013 3506016 3386379 3279883 3183068 3094262 3013030 2938799 2870924 2809086
55744 2809086 2752466 2699111 2647180 2596473 2547969 2502240 2459055 2418165 2379685 2343851 2310933
55733 2310933 2281124 2254019 2228579 2204098 2180854 2159337 2139369 2120597 2103301 2087809 2073518
55722 2073518 2059476 2045839 2033796 2023939 2015560 2007801 2000885 1995852 1993569 1994241 1997472 2002425 2008251
55709 2008251 2014770 2022744 2033373 2047547 2065539 2087081 2111493 2137863 2165403 2193789 2223186 2253975
55697 2253975 2286515 2321119 2358063 2397448 2439179 2483402 2531022 2583504 2642018 2707052 2779062
55686 2779062 2859098 2948434 3047887 3157968 3279421 3413052 3559294 3718572 3892032 4081154
55676 4081154 4286550 4507770 4744357 4996402 5263895 5546035 5841296 6147553 6462182
$$ packed form
55754C795357j53344j35997j19637j06496r6815q8806q1232p4231o7875o1838
55744B809086n6620n3355n1931n0707m8504m5729m3185m0890l8480l5834l2918
55733B310933k9809k7105k5440k4481k3244k1517j9968j8772j7296j5492j4291
55722B073518j4042j3637j2043r857q379p759o916n033k283O72L231M953N826
55709B008251O519P974J0629J4174J7992K1542K4412K6370K7540K8386K9397L0789
55697B253975L2540L4604L6944L9385M1731M4223M7620N2482N8514O5034P2010
55686B779062Q0036Q9336R9453J10081J21453J33631J46242J59278J73460J89122
55676D081154K05396K21220K36587K52045K67493K82140K95261L06257L14629
$$ plain form
55667 6462182 6782929 7109066 7441018 7778624 8120586 8465944 8815044 9168127 9523386
55658 9523386 9877006 10224553 10561607 10883245 11183214 11453099 11682002 11858381 11974023
55649 11974023 12027039 12021283 11963617 11862248 11726599 11566993 11393607 11215495 11039733 10870439
55639 10870439 10708595 10553274 10402713 10253709 10100645 9936084 9752044 9540078 9291211
55630 9291211 8998082 8658288 8275557 7858163 7417084 6964826 6513601 6073155 5650531
55621 5650531 5251684 4881849 4543861 4237455 3961186 3714184 3495207 3300992 3126974
55612 3126974 2969599 2827193 2698851 2583364 2479282 2385345 2300544 2223903 2154145 2089600
55602 2089600 2028863 1971826 1919617 1873023 1831185 1792163 1754567 1718337 1684156 1652386 1622468
$$ packed form
55667F462182L20747L26137L31952L37606L41962L45358L49100L53083L55259
55658I523386L53620L47547L37054L21638K99969K69885K28903J76379J15642
55649A1974023N3016n756n7666j01369j35649j59606j73386j78112j75762j69294
55639A0870439j61844j55321j50561j49004j53064j64561j84040k11966k48867
55630I291211k93129l39794l82731m17394m41079m52258m51225m40446m22624
55621E650531l98847l69835l37988l06406k76269k47002k18977j94215j74018
55612C126974j57375j42406j28342j15487j04082r3937q4801p6641o9758o4545
55602B089600o0737n7037n2209m6594m1838l9022l7596l6230l4181l1770k9918
$$ plain form
55591 1622468 1593352 1564832 1538338 1515586 1496281 1478052 1459067 1439731 1421237 1403709 1387034
55580 1387034 1372521 1361803 1354321 1347661 1340593 1334151 1329362 1325627 1322309 1320408 1321239 1324324 1328135 1332383
55566 1332383 1338041 1345203 1352417 1358618 1364646 1372256 1382324 1394480 1407848 1421548 1434946 1448147
55554 1448147 1462162 1478212 1496916 1518389 1542815 1570523 1601735 1636742 1676287 1721340 1772510
55543 1772510 1830127 1894914 1968003 2050046 2140763 2239997 2349064 2470565 2606457 2756433
55533 2756433 2918413 3090708 3273410 3467391 3671989 3884274 4100959 4320656 4543571
55524 4543571 4769175 4995027 5218167 5436807 5650028 5856331 6053399 6239107 6411858
55515 6411858 6569638 6709277 6826801 6917939 6977909 7001117 6981589 6913781 6793221 6617325
$$ packed form
55591A622468k9116k8520k6494k2752j9305j8229j8985j9336j8494j7528j6675
55580A387034j4513j0718p482o660p068o442m789l735l318j901Q31L085L811M248
55566A332383N658P162P214O201O028P610J0068J2156J3368J3700J3398J3201
55554A448147J4015J6050J8704K1473K4426K7708L1212L5007L9545M5053N1170
55543A772510N7617O4787P3089Q2043R0717R9234J09067J21501J35892J49976
55533B756433J61980J72295J82702J93981K04598K12285K16685K19697K22915
55524D543571K25604K25852K23140K18640K13221K06303J97068J85708J72751
55515F411858J57780J39639J17524R1138N9970K3208j9528o7808j20560j75896
$$ plain form
55505 6617325 6386718 6106259 5784745 5433604 5065548 4693361 4328445 3979599 3652864
55496 3652864 3352097 3079076 2833263 2612589 2415299 2240745 2088105 1955037 1838439
55487 1838439 1736145 1646857 1568654 1498840 1435522 1378157 1326098 1277927 1233138 1193229 1159601
55476 1159601 1131012 1104628 1079190 1055406 1033430 1011994 990532 970256 952131 935400 919179
55465 919179 903962 889993 875505 858557 839891 821953 805565 789562 773706 759619 748232
55454 748232 738151 727522 716170 704942 694110 683476 673171 663353 653752 644290 635572 628011
55442 628011 621140 614481 608354 603073 598037 592679 587693 584227 582113 579904 576433 571621 566103 560974
55428 560974 557524 556181 555834 555070 553807 552736 551604 549468 546664 544930 545055 545632 544825 542481 539835
$$ packed form
55505F617325k30607k80459l21514l51141l68056l72187l64916l48846l26735
55496C652864l00767k73021k45813k20674j97290j74554j52640j33068j16598
55487A838439j02294q9288p8203o9814o3318n7365n2059m8171m4789l9909l3628
55476A159601k8589k6384k5438k3784k1976k1436k1462k0276j8125j6731j6221
55465I19179j5217j3969j4488j6948j8666j7938j6388j6003j5856j4087j1387
55454G48232j0081j0629j1352j1228j0832j0634j0305r818r601r462q718p561
55442F28011o871o659o127n281n036n358m986l466k114k209l471m812n518n129
55428E60974l450j343l47p64j263j071j132k136k804j734J25N77q07k344k646
$$ plain form
55413 539835 537959 537117 536978 536826 536106 535231 535233 536127 536343 534344 530091 524350 517572 510424 504485 500818 498165
55396 498165 494122 488238 482629 479223 477698 476734 476083 476382 477538 478367 477692 475178 471327 467225 464077
55381 464077 462387 461647 461114 460515 459516 457074 452409 446549 441858 439696 439394 439834 440958 442981 444973 445488
55365 445488 444337 442692 441456 440503 439611 439095 439164 439607 440672 443311 447690 452089 454360 454164 452805 451092
55349 451092 448612 445297 442474 441594 442619 444438 446326 448212 449854 450758 451045 451678 453414 455881 457933
55334 457933 458711 458257 457379 457043 457613 458441 458472 457458 456285 455883 456168 456527 456945 457865 458973 459085 457666 455751
55316 455751 454637 454215 453356 451690 450001 448896 448065 447162 446595 446813 447448 447833 447984 448443 449337 450207 450711
55299 450711 450845 450452 449036 446355 442951 439903 438090 437669 438143 438864 439419 439431 438263 435543 432079 429509
$$ packed form
55413E39835j876q42j39j52p20q75KQ94K16j999m253n741o778p148n939l667k653
55396D98165m043n884n609l406j525r64o51K99J156Q29o75k514l851m102l148
55381D64077j690p40n33n99r99k442m665n860m691k162l02M40J124K023J992N15
55365D45488j151j645j236r53q92n16O9M43J065K639M379M399K271j96j359j713
55349D51092k480l315k823q80J025J819J888J886J642R04K87O33J736K467K052
55334D57933P78m54q78l36N70Q28L1j014j173m02K85L59M18R20J108J12j419j915
55316D55751j114m22q59j666j689j105q31r03n67K18O35L85J51M59Q94Q70N04
55299D50711J34l93j416k681l404l048j813m21M74P21N55J2j168k720l464k570
$$ plain form
55283 429509 428518 427936 426254 423578 421264 419951 418806 416778 413764 410499 407876 406410 405722 404590 402271
55268 402271 399774 398953 400228 402052 402791 402182 400673 398499 396094 394441 394110 394569 395197 396321 398425 400972
55252 400972 402973 404198 404781 404160 401647 397903 394522 392094 389851 387471 385946 386050 386926 387114 386455 386075
55236 386075 386737 387903 388553 388403 388154 388624 389790 390801 390953 390449 389921 389492 388874 388285 388490 389585 390388
55219 390388 389624 387451 385327 384540 385293 387126 389605 392401 395022 396875 397594 397132 395576 393164 390554
55204 390554 388700 387952 387499 386310 384762 384557 386603 389674 391956 393445 395743 399600 403701 406245 406867
55189 406867 406547 406225 406108 405953 405484 404697 404007 403878 404175 404321 404328 405113 407301 410110 412055 412561 412311 412066
55171 412066 411746 410827 409314 408131 408585 411287 415364 418970 420982 422081 423816 426682 429560 431074 430975
$$ packed form
55283D29509r91n82j682k676k314j313j145k028l014l265k623j466o88j132k319
55268D02271k497q21J275J824P39o09j509k174k405j653l31M59O28J124K104K547
55252D00972K001J225N83o21k513l744l381k428k243k380j525J04Q76J88o59l80
55236C86075O62J166O50j50k49M70J166J011J52n04n28m29o18n89K05J095Q03
55219C90388p64k173k124p87P53J833K479K796K621J853P19m62j556k412k610
55204C90554j854p48m53j189j548k05K046L071K282J489K298L857M101K544O22
55189D06867l20l22j17j55m69p87o90j29K97J46PP85K188K809J945N06k50k45
55171D12066l20r19j513j183M54K702M077L606K012J099J735K866K878J514r9
$$ plain form
55156 430975 429981 428728 427324 425734 424068 422318 420163 417345 414217 411677 410405 410280 410588 410678 410344 409695
55140 409695 408875 407795 406033 403214 399769 397087 396340 397134 397772 396991 394968 392616 390598 389421 389727 391658
55124 391658 394185 395937 396703 397441 398704 399800 399870 399157 398535 398118 397114 395182 393186 392096 391573 390402
55108 390402 388362 386863 387257 389062 390580 391209 392306 395355 399690 402583 401736 397599 393133 391196 392105
55093 392105 393837 394464 393943 393439 393683 394660 396284 398399 400340 401521 402367 403589 404563 403756 401061 398312
55077 398312 396843 395908 394417 392939 392631 393162 393298 392950 392954 393123 392274 390356 389026 389676 392011 394934 397683
55060 397683 399598 399931 398647 396705 394931 393331 392068 392266 394840 398840 401855 402180 400185 397625 395970
55045 395970 395449 395489 395812 396768 398511 400360 401516 402042 402403 402440 401878 401684 403548 407554 411467 412933 411586
$$ packed form
55156D30975r94j253j404j590j666j750k155k818l128k540j272j25L08R0l34o49
55140D09695q20j080j762k819l445k682p47P94O38p81k023k352k018j177L06J931
55124C91658K527J752P66P38J263J096P0p13o22m17j004j932j996j090n23j171
55108C90402k040j499L94J805J518O29J097L049M335K893q47m137m466j937R09
55093C92105J732O27n21n04K44R77J624K115J941J181Q46J222R74q07k695k749
55077C98312j469r35j491j478l08N31J36l48MJ69q49j918j330O50K335K923K749
55060C97683J915L33j284j942j774j600j263J98K574M000L015L25j995k560j655
55045C95970n21M0L23R56J743J849J156N26L61L7n62j94J864M006L913J466j347
$$ plain form
55028 411586 408557 405091 402432 401970 404101 407387 409908 411222 412125 412974 413390 413409 413708 414466 414949 414578 413682
55011 413682 412811 411884 410539 409056 408457 409567 412019 414327 415249 415146 415622 417571 420033 421393 421365 421245
54995 421245 422401 425050 428349 431152 432711 433070 432790 432163 431001 429525 428903 430152 432740 435019 436082
54980 436082 436631 438032 441103 445763 451229 456369 460392 463535 466929 471766 478538 486671 494638 500978
54966 500978 505753 510574 516623 523230 529189 534772 541095 547861 553386 557107 560520 564970 569799 573538
54952 573538 575949 577732 578846 578242 575193 570148 564202 558036 551244 542585 531402 519035 508275 500935
54938 500935 496298 492348 488060 484084 481656 481389 482781 484482 485393 485866 487298 490105 492830 494075 494698
54923 494698 496979 501835 508012 514112 520206 526897 533634 538889 541834 543214 544446 546195 548096 549707
$$ packed form
55028D11586l029l466k659m62K131L286K521J314R03Q49M16J9K99P58M83l71q96
55011D13682q71r27j345j483n99J110K452K308R22j03M76J949K462J360k8j20
54995D21245J156K649L299K803J559L59k80o27j162j476o22J249K588K279J063
54980D36082N49J401L071M660N466N140M023L143L394M837O772Q133P967O340
54966E00978M775M821O049O607N959N583O323O766N525L721L413M450M829L739
54952E73538K411J783J114o04l049n045n946o166o792q659j1183j2367j0760p340
54938E00935m637l950m288l976k428k67J392J701R11M73J432K807K725J245O23
54923D94698K281M856O177O100O094O691O737N255K945J380J232J749J901J611
$$ plain form
54909 549707 551337 553549 555974 557061 555165 549649 540955 530185 518781 507884 497472 486634 475250
54896 475250 464881 457212 452045 447741 443427 439710 437190 435428 433812 432511 431804 431055 429201 426185
54882 426185 423362 422397 423959 427227 430293 431200 429203 425329 421508 418923 417222 415432 413474 412391 413027
54867 413027 414810 416282 416603 416103 415386 414552 413545 412749 412730 413669 415391 417675 420139 422090 422972 422849 422122
54850 422122 421004 419662 418571 418185 418458 419238 420863 423663 426982 429532 430769 431229 431397 431090 430297 429859
54834 429859 430685 432642 434661 435648 435008 432739 429602 427016 426314 427989 431803 437384 444382 452104 459504
54819 459504 465823 471271 476867 483399 490535 497164 502622 507201 511292 514658 517052 519017 521251 523544
54805 523544 525474 528055 533328 541762 551034 558109 561889 563246 563255 562351 560779 558876 556737 554069 550372
$$ packed form
54909E49707J630K212K425J087j896n516q694j0770j1404j0897j0412j0838j1384
54896D75250j0369p669n167m304m314l717k520j762j616j301p07p49j854l016
54882D26185k823r65J562L268L066R07j997l874l821k585j701j790j958j083O36
54867D13027J783J472L21n00p17q34j007p96j9R39J722K284K464J951Q82j23p27
54850D22122j118j342j091l86K73P80J625K800L319K550J237M60J68l07p93m38
54834D29859Q26J957K019R87o40k269l137k586p02J675L814N581O998P722P400
54819D59504O319N448N596O532P136O629N458M579M091L366K394J965K234K293
54805E23544J930K581N273Q434R272P075L780J357Rr04j572j903k139k668l697
$$ plain form
54790 550372 545104 538104 530225 523148 518035 514633 512023 509696 507395 504586 501063 497829 496419 497315
54776 497315 499656 502389 505065 507698 510656 514574 519569 524591 528424 531353 534853 539505 544253 548132
54762 548132 551657 555824 560496 564667 567838 570335 572483 574112 574823 574392 573040 571455 570091 568091 563488
54747 563488 555159 544263 533104 522868 513211 503813 495336 488616 483645 479762 476360 473016 469342
54734 469342 465176 460859 457090 454465 453147 452771 452655 452417 452485 453679 455970 457952 457909 455447 451846 448883
54718 448883 447555 447841 449195 450894 452171 452520 452059 451369 450828 450277 449439 448400 447399 446417 445395 444640
54702 444640 444366 443821 441686 437852 434172 432725 433604 435208 436550 438282 441077 443888 444712 442958 440313
54687 440313 438992 439417 439928 438674 435487 431823 429106 427539 426459 425296 423840 422102 420530 420088 421305
$$ packed form
54790E50372n268p000p879p077n113l402k610k327k301k809l523l234j410Q96
54776D97315K341K733K676K633K958L918M995N022L833K929L500M652M748L879
54762E48132L525M167M672M171L171K497K148J629P11m31j352j585j364k000m603
54747E63488q329j0896j1159j0236r657r398q477o720m971l883l402l344l674
54734D69342m166m317l769k625j318l76j16k38O8J194K291J982m3k462l601k963
54718D48883j328K86J354J699J277L49m61o90n41n51q38j039j001r82j022p55
54702D44640k74n45k135l834l680j447Q79J604J342J732K795K811Q24j754k645
54687D40313j321M25N11j254l187l664k717j567j080j163j456j738j572m42J217
$$ plain form
54672 421305 423341 424832 425763 427487 430438 432898 433044 431508 430677 431682 433296 433887 433299 432424 431986 432438
54656 432438 434211 437130 439935 441227 440854 439874 439252 439102 438997 438488 437457 436548 437161 440325 445422 450549
54640 450549 454313 456867 459165 461820 464910 468250 471453 474085 476141 477891 478984 478377 475857 473067
54626 473067 472000 472617 472979 471913 470488 470429 471974 474082 476153 478488 481156 483314 483868 482284 478655
54611 478655 473587 468298 464248 462125 461351 460894 460335 459815 459295 458453 457273 456154 455299 454497 453772 453768 454994
54594 454994 456867 458040 457768 456628 455852 456262 457870 459998 461502 461327 459472 457347 456600 457475 458762 459490
54578 459490 459991 460921 461903 462036 461483 461524 462865 464815 466419 467523 468162 467832 466393 465115 465565 467584 469496
54561 469496 470311 470561 470744 470301 468882 467612 468033 470292 473157 475405 476490 476434 475963 476323 477880 479179
$$ packed form
54672D21305K036J491R31J724K951K460J46j536q31J005J614N91n88q75m38M52
54656D32438J773K919K805J292l73r80o22j50j05n09j031r09O13L164N097N127
54640D50549L764K554K298K655L090L340L203K632K056J750J093o07k520k790
54626D73067j067O17L62j066j425n9J545K108K071K335K668K158N54j584l629
54611D78655n068n289m050k123p74m57n59n20n20q42j180j119q55q02p25mJ226
54594D54994J873J173k72j140p76M10J608K128J504j75j855k125p47Q75J287P28
54578D59490N01R30R82J33n53M1J341J950J604J104O39l30j439j278M50K019J912
54561D69496Q15K50J83m43j419j270M21K259K865K248J085n6m71L60J557J299
$$ plain form
54545 479179 478565 476674 476062 478039 481022 482615 482417 481982 482570 483761 484185 483042 480874 479005 478217 478068
54529 478068 477802 477615 478370 480154 482066 483508 484636 485185 484103 481316 478858 479039 481979 486035 490101
54514 490101 494127 497724 499886 500507 500845 501951 503604 505358 507622 510923 514846 518610 522225 526228 530596
54499 530596 534793 538758 542934 547111 550037 550639 549347 547805 547337 547940 548708 548951 548734 548498 548510 548805 549357
54482 549357 549902 549788 548501 546438 544620 543503 542572 541346 540128 539105 537282 533327 527526 521964 518404
54467 518404 516665 515508 514391 513582 513008 512078 510783 510062 510575 511679 512169 511642 510563 509327 508006 506959
54451 506959 506793 507338 507281 505374 501791 497868 494760 492754 491628 491073 490700 490133 489385 488915 489131 489981 491180
54434 491180 492666 494628 497011 499187 500286 499958 498687 497166 495539 493591 491646 490697 491336 492926 494288
$$ packed form
54545D79179o14j891o12J977K983J593j98m35N88J191M24j143k168j869p88j49
54529D78068k66j87P55J784J912J442J128N49j082k787k458J81K940M056M066
54514D90101M026L597K162O21L38J106J653J754K264L301L923L764L615M003M368
54499E30596M197L965M176M177K926O02j292j542m68O03P68K43k17k36J2K95N52
54482E49357N45j14j287k063j818j117r31j226j218j023j823l955n801n562l560
54467E18404j739j157j117q09n74r30j295p21N13J104M90n27j079j236j321j047
54451E06959j66N45n7j907l583l923l108k006j126n55l73n67p48m70K16Q50J199
54434D91180J486J962K383K176J099l28j271j521j627j948j945r49O39J590J362
$$ plain form
54419 494288 494929 495152 495182 494832 494065 493388 493439 494338 495460 495718 494332 491762 489812 490271 493286 497372 501008
54402 501008 503752 505782 506971 506855 505243 502529 499402 496355 493366 490204 487286 486066 487954 492671
54388 492671 498133 502178 504147 504708 504749 504830 505220 505871 506485 506918 507402 508109 508713 508744 508310 508196 509226 511586
54370 511586 514669 517611 520219 523270 527399 531665 533938 533187 530803 529080 528826 529164 529330 529670 530763
54355 530763 532432 534028 535193 536005 536687 537470 538378 538810 537655 534397 530092 526806 525827 526551 527161 526231
54339 526231 523576 519918 516174 513033 510706 508825 506831 504718 503155 502652 502923 503384 503895 504496 504749 504082
54323 504082 502732 501567 500901 500134 498680 496588 494166 491832 490608 491754 495303 499523 502469 503672 503976
54308 503976 504329 505170 506253 506397 504203 499829 495520 493428 493351 493451 492648 491318 490089 489297 489511 491319
$$ packed form
54419D94288O41K23L0l50p67o77N1Q99J122K58j386k570j950M59L015M086L636
54402E01008K744K030J189j16j612k714l127l047k989l162k918j220J888M717
54388D92671N462M045J969N61M1Q1L90O51O14M33M84P07O04L1m34j14J030K360
54370E11586L083K942K608L051M129M266K273p51k384j723k54L38J66L40J093
54355E30763J669J596J165Q12O82P83R08M32j155l258m305l286r79P24O10r30
54339E26231k655l658l744l141k327j881j994k113j563n03K71M61N11O01K53o67
54323E04082j350j165o66p67j454k092k422k334j224J146L549M220K946J203L04
54308E03976L53Q41J083J44k194m374m309k092p7J00q03j330j229p92K14J808
$$ plain form
54292 491319 494295 496982 498044 496920 493745 489626 486701 486573 488545 490455 491183 491143 490475 488564 485777
54277 485777 483858 483660 483901 483245 482345 482583 483940 485407 486545 487209 486696 484872 483441 484152 486029 486410
54261 486410 484827 483884 485684 489165 491891 492994 493265 493549 494322 495965 498132 499367 498582 496505 494474
54246 494474 492248 488477 483338 479182 478037 479574 482017 483990 484793 484014 482053 480431 480371 481307 481692 480985
54230 480985 479729 478001 475300 472250 470879 472346 475342 477589 478147 477416 475788 473579 471824 471783 473545
54215 473545 476019 478212 479677 479969 478828 476963 475522 474626 473441 471978 471499 472651 474281 474929 474522
54200 474522 473782 472865 471660 470819 471218 472587 473617 473328 471568 468491 464602 461260 460044 461178 463200
54185 463200 464447 464334 463121 461236 459385 458710 459965 462478 464415 464431 462913 461423 460984 461261 461492 461683
$$ packed form
54292D91319K976K687J062j124l175m119k925j28J972J910P28m0o68j911k787
54277D85777j919j98K41o56r00K38J357J467J138O64n13j824j431P11J877L81
54261D86410j583r43J800L481K726J103K71K84P73J643K167J235p85k077k031
54246D94474k226l771n139m156j145J537K443J973Q03p79j961j622o0R36L85p07
54230D80985j256j728k701l050j371J467K996K247N58p31j628k209j755m1J762
54215D73545K474K193J465K92j141j865j441q96j185j463m79J152J630O48m07
54200D74522p40r17j205q41L99J369J030k89j760l077l889l342j216J134K022
54185D63200J247j13j213j885j851o75J255K513J937J6j518j490m39K77K31J91
$$ plain form
54169 461683 462316 463197 463471 462871 462137 461971 462348 463228 464952 467342 469326 470401 471685 474444 478174 481366
54153 481366 483704 486058 488518 490085 490483 490740 491455 491909 491639 491685 493229 495827 497981 498846 498614 497844 497336
54136 497336 498017 499954 501790 502141 501212 500037 498513 495521 491111 487203 485574 486010 487111 488173 489455
54121 489455 491002 492136 492252 491620 491169 491650 493041 494608 495492 495291 494169 492566 490986 489925 489592 489533
54105 489533 488901 487397 485699 484666 484385 484468 485005 486471 488512 489581 488428 485722 483657 483898 486082 488147
54089 488147 487957 484995 480996 478604 478748 479496 478331 475444 473649 474689 476879 477386 475952 475006 476392
54074 476392 479379 482014 483204 482995 481803 480182 478899 478603 479517 481646 484868 488552 491638 493648 495340
54059 495340 497803 501039 503919 505502 506066 506810 508790 512024 515410 517545 517888 517183 516759 517529 519629 522658
$$ packed form
54169D61683O33Q81K74o00p34j66L77Q80J724K390J984J075J284K759L730L192
54153D81366K338K354K460J567L98K57P15M54k70M6J544K598K154Q65k32p70n08
54136D97336O81J937J836L51r29j175j524k992m410l908j629M36J101J062J282
54121D89455J547J134J16o32m51M81J391J567Q84k01j122j603j580j061l33n9
54105D89533o32j504j698j033k81Q3N37J466K041J069j153k706k065K41K184K065
54089D88147j90k962l999k392J44P48j165k887j795J040K190N07j434r46J386
54074D76392K987K635J190k09j192j621j283k96R14K129L222L684L086K010J692
54059D95340K463L236K880J583N64P44J980L234L386K135L43p05m24P70K100L029
$$ plain form
54043 522658 525949 528900 531436 534082 537323 541033 544783 548548 552602 556703 559861 561264 561308 561490 563224
54028 563224 566663 570614 573574 574922 575223 575576 576876 579569 583541 587907 591264 592728 592677 592102 591298 589776
54012 589776 587484 585355 584107 583050 580903 577686 574918 573602 572813 570947 568004 565693 565228 565816 565723
53997 565723 564237 561925 559251 555830 551340 546689 543642 543146 544273 545143 544936 544630 545464 547046 547689 546615
53981 546615 544992 544430 545223 546641 548254 549993 551307 551395 550343 549180 548638 548642 549118 550426 552610 554940
53965 554940 556755 558318 560398 563354 566964 570866 574853 579018 583753 589217 594727 599197 602432 605423
53951 605423 609057 613040 616584 619667 623055 627236 631725 635376 637242 637399 636890 636712 637062 638075 640789
53936 640789 646162 653196 659489 664140 668846 675535 684286 694372 705845 718743 731965 744569 757249
$$ packed form
54043E22658L291K951K536K646L241L710L750L765M054M101L158J403M4J82J734
54028E63224L439L951K960J348L01L53J300K693L972M366L357J464n1n75q04j522
54012E89776k292k129j248j057k147l217k768j316p89j866k943k311m65N88r3
53997E65723j486k312k674l421m490m651l047m96J127Q70k07l06Q34J582O43j074
53981E46615j623n62P93J418J613J739J314Q8j052j163n42MM76J308K184K330
53965E54940J815J563K080K956L610L902L987M165M735N464N510M470L235K991
53951F05423L634L983L544L083L388M181M489L651J866J57n09j78L50J013K714
53936F40789N373P034O293M651M706O689Q751J0086J1473J2898J3222J2604J2680
$$ plain form
53923 757249 770922 784769 797487 809647 822556 835283 845381 852831 860812 871822 884921 897391
53911 897391 907140 912730 913345 910222 906234 902356 895890 883912 867228 849233 832037 815758 800702
53898 800702 787730 776566 765887 755421 746218 738499 730872 722333 713702 706252 699903 693550 686547
53885 686547 679221 672269 665993 659826 652690 644333 636202 630169 626373 623155 619175 614598 609949 604929
53871 604929 599088 592933 587658 584138 582547 582450 582797 582342 580563 577961 575281 572858 570831 569343 568163
53856 568163 566646 564389 561483 558081 554438 551464 550156 550109 549725 548493 547881 549092 551179 552685 554106
53841 554106 557015 561236 564673 565921 565587 565048 565224 566564 568741 570202 569514 567481 566421 566980 567369 566399
53825 566399 565458 566176 567751 568336 567974 568217 569506 570913 572336 574959 579172 583680 587297 590315 593335
$$ packed form
53923G57249J3673J3847J2718J2160J2909J2727J0098P450P981J1010J3099J2470
53911H97391R749N590O15l123l988l878o466j1978j6684j7995j7196j6279j5056
53898H00702j2972j1164j0679j0466r203p719p627q539q631p450o349o353p003
53885F86547p326o952o276o167p136q357q131o033l796l218l980m577m649n020
53871F04929n841o155n275l520j591r7L47m55j779k602k680k423k027j488j180
53856E68163j517k257k906l402l643k974j308m7l84j232o12J211K087J506J421
53841E54106K909M221L437J248l34n39J76J340K177J461o88k033j060N59L89r70
53825E66399r41P18J575N85l62K43J289J407J423K623M213M508L617L018L020
$$ plain form
53810 593335 595864 597059 597208 597561 599041 601721 605230 609005 612375 615014 617398 620405 624436 629100 633631
53795 633631 637436 640299 642311 643711 644856 646320 648703 652003 655340 657865 659898 662510 665768 668043
53781 668043 667631 664781 661620 660220 660991 662806 664232 664625 664289 663787 663155 661860 659430 655896 651747 647798
53765 647798 645013 643952 644218 644889 645656 647103 649722 653285 657563 663031 670193 678507 686663 693813 700099
53750 700099 706245 713210 721989 732843 744527 754922 762914 769456 776565 785414 795456 805168 813434
53737 813434 820263 826319 831884 836406 838958 838843 835670 829274 819899 808288 795232 781167 766352
53724 766352 751171 736014 721212 707481 696073 687851 682292 677858 673283 668203 662819 657569 653047
53711 653047 649667 647368 645993 645763 646854 648705 650473 652060 653988 656317 658554 660682 663300 666481
$$ packed form
53810E93335K529J195J49L53J480K680L509L775L370K639K384L007M031M664M531
53795F33631L805K863K012J400J145J464K383L300L337K525K033K612L258K275
53781F68043m12k850l161j400P71J815J426L93l36n02o32j295k430l534m149l949
53765F47798k785j061K66O71P67J447K619L563M278N468P162Q314Q156P150O286
53750G00099O146O965Q779J0854J1684J0395P992O542P109Q849J0042R712Q266
53737H13434O829O056N565M522K552j15l173o396r375j1611j3056j4065j4815
53724G66352j5181j5157j4802j3731j1408q222n559m434m575n080n384n250m522
53711F53047l380k299j375k30J091J851J768J587J928K329K237K128K618L181
$$ plain form
53697 666481 669461 671971 674967 679291 684339 688923 692977 697454 702809 708411 713337 716905 718489 717806
53683 717806 715797 714627 716263 721117 728120 735728 742692 748361 752731 756163 758714 759838 759060 756965
53669 756965 755158 754950 756203 757658 758295 758066 757434 756675 755895 755261 754814 754273 753509 753019 753337 754040 753983 752764
53651 752764 751412 751291 752624 754485 756000 757188 758667 760764 762936 763992 762960 759832 755513 751197
53637 751197 747897 746139 745584 744939 742913 739546 736340 734946 735863 738320 740899 742333 742324 741926 742777 745732
53621 745732 750507 756509 763283 770057 775772 780197 784360 789326 795050 801086 807854 816205 825872 835189
53607 835189 842503 847411 850677 853519 857070 861960 868018 874420 880273 885077 888829 891798 894096 895537
53593 895537 896169 896792 898280 900304 901596 901835 902347 904245 906790 908700 910283 912737 915566 916479 914391
$$ packed form
53697F66481K980K510K996M324N048M584M054M477N355N602M926L568J584o83
53683G17806k009j170J636M854P003P608O964N669M370L432K551J124p78k095
53669G56965j807k08J253J455O37k29o32p59p80o34m47n41p64m90L18P03n7j219
53651G52764j352j21J333J861J515J188J479K097K172J056j032l128m319m316
53637G51197l300j758n55o45k026l367l206j394R17K457K579J434rl98Q51K955
53621G45732M775O002O774O774N715M425M163M966N724O036O768Q351R667R317
53607H35189P314M908L266K842L551M890O058O402N853M804L752K969K298J441
53593H95537O32O23J488K024J292K39N12J898K545J910J583K454K829R13k088
$$ plain form
53578 914391 911163 909500 910005 911195 911697 911328 910327 908728 906869 905651 905570 905711 904484 901622 898913 898294
53562 898294 899360 899531 896976 892715 889336 888081 887858 886913 884804 882597 881481 881345 880772 878646 875643
53547 875643 873483 872639 871751 869803 867771 867087 867496 867878 868459 870392 873394 875824 877402 879857 884075 888297
53531 888297 890480 891227 893033 897392 903891 911499 919443 927125 934369 941777 950025 959070 968850 980392
53517 980392 995009 1012238 1029651 1045144 1058924 1072966 1089047 1107573 1127965 1149778 1173467
53506 1173467 1199944 1229236 1259866 1290065 1319544 1349638 1381651 1415463 1449873 1483933 1517845
53495 1517845 1552810 1590050 1629657 1670322 1710412 1749478 1788414 1828112 1868236 1907595 1945601
53484 1945601 1983029 2021195 2060530 2100124 2138678 2175635 2211296 2246174 2280658 2315022 2349173
$$ packed form
53578I14391l228j663N05J190N02l69j001j599j859j218q1J41j227k862k709o19
53562H98294J066J71k555m261l379j255k23r45k109k207j116j36n73k126l003
53547H75643k160q44q88j948k032o84M09L82N81J933L002K430J578K455M218M222
53531H88297K183P47J806M359O499P608P944P682P244P408Q248R045R780J1542
53517I80392J4617J7229J7413J5493J3780J4042J6081J8526K0392K1813K3689
53506A173467K6477K9292L0630L0199K9479L0094L2013L3812L4410L4060L3912
53495A517845L4965L7240L9607M0665M0090L9066L8936L9698M0124L9359L8006
53484A945601L7428L8166L9335L9594L8554L6957L5661L4878L4484L4364L4151
$$ plain form
53473 2349173 2382291 2413292 2441830 2468367 2493119 2515590 2535578 2554016 2572105 2589876 2606384
53462 2606384 2621301 2635609 2650227 2664236 2674964 2680236 2680553 2678770 2677329 2676049 2672986 2667035 2658780
53449 2658780 2648902 2636987 2622437 2605628 2587326 2567498 2545507 2521138 2494830 2467202 2438809
53438 2438809 2409887 2379872 2347872 2314278 2281164 2250056 2220023 2189178 2157548 2126998 2098618
53427 2098618 2071844 2046285 2022648 2001321 1981563 1962970 1946501 1933026 1921880 1911979 1903635 1898091
53415 1898091 1895759 1896110 1899032 1905113 1914609 1927247 1943296 1963802 1989187 2018128 2048461 2078993
53403 2078993 2110053 2142540 2177039 2214054 2254566 2299605 2348969 2400843 2453287 2506137 2561099
53392 2561099 2619967 2683080 2749422 2817665 2886965 2957299 3029371 3103889 3180734 3259052 3338224
$$ packed form
53473B349173L3118L1001K8538K6537K4752K2471J9988J8438J8089J7771J6508
53462B606384J4917J4308J4618J4009J0728N272L17j783j441j280l063n951q255
53449B658780r878j1915j4550j6809j8302j9828k1991k4369k6308k7628k8393
53438B438809k8922l0015l2000l3594l3114l1108l0033l0845l1630l0550k8380
53427B098618k6774k5559k3637k1327j9758j8593j6469j3475j1146r901q344n544
53415A898091k332L51K922O081R496J2638J6049K0506K5385K8941L0333L0532
53403B078993L1060L2487L4499L7015M0512M5039M9364N1874N2444N2850N4962
53392B561099N8868O3113O6342O8243O9300P0334P2072P4518P6845P8318P9172
$$ plain form
53381 3338224 3418176 3498597 3578630 3657997 3737997 3820561 3906183 3993145 4078721 4160893 4239174
53370 4239174 4314226 4386732 4456374 4522013 4582935 4639564 4692493 4741083 4783625 4818862 4846940
53359 4846940 4868772 4884908 4895150 4899026 4896501 4888281 4875281 4857639 4834445 4804721 4768472 4726413
53347 4726413 4678842 4625393 4565934 4501129 4431804 4358036 4279190 4194790 4105267 4012047 3917025
53336 3917025 3821855 3727658 3635327 3545743 3459289 3375186 3291999 3209215 3128108 3050597 2977290
53325 2977290 2906974 2838092 2770322 2704392 2640661 2578635 2518175 2460568 2407547 2359333 2314506
53314 2314506 2272010 2232498 2197134 2165826 2137595 2112297 2090831 2073495 2059037 2045751 2032966
53303 2032966 2021171 2011256 2004000 1999777 1998208 1998391 1999906 2003354 2009465 2017923 2027536 2037533 2048327 2061060
$$ packed form
53381C338224P9952Q0421Q0033P9367Q0000Q2564Q5622Q6962Q5576Q2172P8281
53370D239174P5052P2506O9642O5639O0922N6629N2929M8590M2542L5237K8078
53359D846940K1832J6136J0242L876k525q220j3000j7642k3194k9724l6249m2059
53347D726413m7571n3449n9459o4805o9325p3768p8846q4400q9523r3220r5022
53336C917025r5170r4197r2331q9584q6454q4103q3187q2784q1107p7511p3307
53325B977290p0316o8882o7770o5930o3731o2026o0460n7607n3021m8214m4827
53314B314506m2496l9512l5364l1308k8231k5298k1466j7336j4458j3286j2785
53303B032966j1795r915p256m223j569J83J515L448O111Q458R613R997J0794J2733
$$ plain form
53289 2061060 2076764 2095914 2118423 2143881 2171836 2201753 2232710 2263508 2293544 2323356 2353900
53278 2353900 2385452 2417672 2450578 2484691 2520093 2555960 2591291 2625585 2658427 2689066 2717010
53267 2717010 2742656 2766723 2789289 2809918 2828365 2844343 2856815 2864661 2868244 2869324 2868820 2865487
53255 2865487 2857501 2844688 2828321 2809332 2787864 2764275 2739114 2711741 2680182 2643186 2601784
53244 2601784 2558109 2513173 2466560 2417934 2367925 2317511 2267191 2216911 2166350 2115131 2063156
53233 2063156 2010921 1959302 1908974 1860235 1813215 1767907 1723957 1680921 1638836 1598200 1559312
53222 1559312 1521938 1485675 1450231 1415206 1380122 1345086 1311129 1279455 1250421 1223455 1197792
53211 1197792 1173032 1149205 1126688 1105931 1086967 1069247 1052226 1036016 1021029 1007108 993455
$$ packed form
53289B061060J5704J9150K2509K5458K7955K9917L0957L0798L0036K9812L0544
53278B353900L1552L2220L2906L4113L5402L5867L5331L4294L2842L0639K7944
53267B717010K5646K4067K2566K0629J8447J5978J2472P846L583J080n04l333
53255B865487p986j2813j6367j8989k1468k3589k5161k7373l1559l6996m1402
53244B601784m3675m4936m6613m8626n0009n0414n0320n0280n0561n1219n1975
53233B063156n2235n1619n0328m8739m7020m5308m3950m3036m2085m0636l8888
53222A559312l7374l6263l5444l5025l5084l5036l3957l1674k9034k6966k5663
53211A197792k4760k3827k2517k0757j8964j7720j7021j6210j4987j3921j3653
$$ plain form
53200 993455 979551 965737 952654 940386 928327 915650 901849 887214 873015 860792 850950 842293
53188 842293 833351 823984 815179 807442 800177 792750 785426 778774 772736 766892 761276 756248 751722 747246
53174 747246 742866 739223 736558 734188 731311 727956 724765 722149 719982 717963 715881 713680 711541 709817
53160 709817 708706 708097 707870 708041 708385 708315 707577 706789 706749 707385 707953 708161 708494 709474 711304 714244 718400 722880
53142 722880 726106 727683 729197 732167 735613 736811 734580 730928 729065 730391 733820 737534 740782 744040
53128 744040 747869 751928 755182 757037 757944 758609 758946 758447 757537 757655 759421 761316 760983 757835 753791 751315
53112 751315 751083 751699 751304 749225 746185 743261 740772 738239 735174 731597 727650 723124 717759 711886 706385
53097 706385 702031 699123 697643 697184 696697 694857 691142 686395 682058 678884 676442 673653 669778 665230 661534
$$ packed form
53200I93455j3904j3814j3083j2268j2059j2677j3801j4635j4199j2223r842q657
53188H42293q942r367q805p737p265p427p324o652o038n844n616n028m526m476
53174G47246m380l643k665k370k877l355l191k616k167k019k082k201k139j724
53160G09817j111o09k27J71L44p0p38p88m0O36N68K08L33R80J830K940M156M480
53142G22880L226J577J514K970L446J198k231l652j863J326L429L714L248L258
53128G44040L829M059L254J855R07O65L37m99r10J18J766J895l33l148m044k476
53112G51315k32O16l95k079l040k924k489k533l065l577l947m526n365n873n501
53097G06385m354k908j480m59m87j840l715m747m337l174k442k789l875m548l696
$$ plain form
53082 661534 660151 660984 662309 662433 661207 659683 658712 658345 658288 658258 657908 656913 655303 653343 651232 649237 647919
53065 647919 647550 647352 646047 643365 640376 638204 637189 637530 639770 643844 648303 651363 652493 652341 651568
53050 651568 650646 650464 651949 654845 657700 659343 659775 659474 658651 657600 657105 657864 659828 662488 665492 668618
53034 668618 671428 673406 674315 674161 673044 671342 669744 668750 668289 668105 668298 669088 670191 670848 670555 669615 668987
53017 668987 669644 671839 674800 677299 678726 679482 680184 680772 680612 679236 676707 673474 670119 667041 664137
53002 664137 661040 657903 655579 654675 654793 655157 655620 656440 657403 657890 657682 657047 656169 655247 655058 656520 659496
52985 659496 662791 665548 667871 669908 671294 672082 673381 676177 679931 683051 684461 684137 682545 680337 678429
52970 678429 677414 676754 675251 672669 670439 670383 672906 676723 680194 682645 684351 685525 685819 684937 683341
$$ packed form
53082F61534j383Q33J325J24j226j524r71l67n7l0l50r95j610j960k111j995j318
53065F47919l69j98j305k682k989k172j015L41K240M074M459L060J130j52p73
53050F51568r22j82J485K896K855J643M32l01q23j051m95P59J964K660L004L126
53034F68618K810J978R09j54j117j702j598r94m61j84J93P90J103O57k93r40o28
53017F68987O57K195K961K499J427P56P02N88j60j376k529l233l355l078k904
53002F64137l097l137k324r04J18L64M63Q20R63M87k08o35q78r22j89J462K976
52985F59496L295K757K323K037J386P88J299K796L754L120J410l24j592k208j908
52970F78429j015o60j503k582k230n6K523L817L471K451J706J174K94q82j596
$$ plain form
52955 683341 681715 679902 677059 673051 669032 666286 664927 664118 663103 661652 659943 658498 657821 657763 657715 657756
52939 657756 658839 661186 663303 663568 662197 660597 659360 658281 657910 659301 662088 664486 665673 666647 668076
52924 668076 668893 668068 666425 665337 664655 663430 662015 661739 662783 664045 665230 667467 671182 674576 675226
52909 675226 672756 669183 666856 666552 667482 668555 669378 670116 670726 670724 669741 667970 665916 664110 663180 663546 664533
52892 664533 664462 662461 659841 658772 659763 661399 662469 663191 664095 664829 664738 663867 662659 661146 659214 657370
52876 657370 656498 656834 657651 658053 657855 657689 658382 660101 661982 662765 661929 660095 658346 657395 657336 657604 657056 654862
52858 654862 651861 650481 652422 656541 659767 660212 658834 657964 658793 660679 662371 663227 663251 662526 661103 659367
52842 659367 658116 658006 659014 660589 662264 663889 665446 667031 669088 672125 675866 678977 680090 679087
$$ packed form
52955F83341j626j813k843m008m019k746j359q09j015j451j709j445o77n8m8M1
52939F57756J083K347K117K65j371j600j237j079l71J391K787K398J187R74J429
52924F68076Q17q25j643j088o82j225j415k76J044J262J185K237L715L394O50
52909F75226k470l573k327l04R30J073Q23P38O10kr83j771k054j806r30L66R87
52892F64533p1k001k620j069R91J636J070P22R04P34r1q71j208j513j932j844
52876F57370q72L36Q17M02j98j66O93J719J881P83q36j834j749r51n9K68n48k194
52858F54862l001j380J941M119L226M45j378q70Q29J886J692Q56K4p25j423j736
52842F59367j251j10J008J575J675J625J557J585K057L037L741L111J113j003
$$ plain form
52828 679087 677051 674944 672570 669060 664307 659686 656923 655952 654297 649285 640978 632305 626057 622353
52814 622353 619472 616324 613163 610298 607439 604527 602198 600898 600332 600413 602031 605865 610683 613891 613994
52799 613994 611833 609149 606741 604606 603163 603232 604846 606992 608749 609999 610747 610601 609542 608542 608549 609165
52783 609165 609206 608353 607368 606814 606688 607398 609774 613456 616378 616897 615715 614593 613773 612051 609312 607444
52767 607444 608131 610702 612987 613778 613734 614113 615340 616947 618364 619393 620000 620088 619734 619494 620024 621270 622488
52750 622488 623326 624346 625934 627159 626637 624510 622670 622747 624501 626508 627787 628358 628736 629431 630528 631294
52734 631294 630567 628185 625758 625274 626879 628644 628685 627145 625855 626380 628587 630903 631769 630915 629310 627926
52718 627926 626728 625142 623314 622284 622676 623689 623952 623176 622430 622735 623906 625022 625592 625852 626109 626358
$$ packed form
52828F79087k036k107k374l510m753m621k763r71j655n012q307q673o248l704
52814F22353k881l148l161k865k859k912k329j300n66Q1J618L834M818L208J03
52799F13994k161k684k408k135j443O9J614K146J757J250P48j46j059j000PO16
52783F09165M1q53r85n54j26P10K376L682K922N19j182j122q20j722k739j868
52767F07444O87K571K285P91m4L79J227J607J417J029O07Q8l54k40N30J246J218
52750F22488Q38J020J588J225n22k127j840P7J754K007J279N71L78O95J097P66
52734F31294p27k382k427m84J605J765M1j540j290N25K207K316Q66q54j605j384
52718F27926j198j586j828j030L92J013K63p76p46L05J171J116N70K60K57K49
$$ plain form
52702 626358 626613 627174 628253 629509 630218 629944 628988 628165 628151 628918 629819 630331 630687 631588 633345 635563 637661
52685 637661 639326 640455 641131 641863 643279 645194 646490 646520 646219 647053 649169 651488 653527 656045 659574 663243
52669 663243 665808 667230 668514 670290 672252 673880 675123 676338 677956 680264 683143 685901 687654 688102
$$ packed form
52702F26358K55N61J079J256P09k74r56q23j4P67R01N12L56R01J757K218K098
52685F37661J665J129O76P32J416J915J296L0l01Q34K116K319K039K518L529L669
52669F63243K565J422J284J776J962J628J243J215J618K308K879K758J753M48
$$ [...]
##END NTUPLES=NMR SPECTRUM
##END=
