##TITLE=AC1683_2985_8571279_yJtKDicOSf
##JCAMPDX= 6.0         $$ Bruker NMR JCAMP-DX V2.0
##DATA TYPE= NMR SPECTRUM
##DATA CLASS= NTUPLES
##ORIGIN= BRUKER
##OWNER= Administrator
$$ 1.72 TOPSPIN		Version 2.1
$$ 2014-04-10 14:33:30.411 -0700  Administrator@X
$$ Compression mode = diff/dup
##.OBSERVE FREQUENCY= 400.02188249412
##.OBSERVE NUCLEUS= ^1H
##.ACQUISITION MODE= SIMULTANEOUS (DQD)
##.ACQUISITION SCHEME= undefined
##.AVERAGES= 8
##.DIGITISER RES= 22
##SPECTROMETER/DATA SYSTEM= spect
##.PULSE SEQUENCE= zg30
##.SOLVENT NAME= COFFEE_meoh
##.SHIFT REFERENCE= INTERNAL, COFFEE_meoh, 1, 14.98509
##AUDIT TRAIL= $$ (NUMBER, WHEN, WHO, WHERE, PROCESS, VERSION, WHAT)
$$ ##TITLE= Audit trail, TOPSPIN		Version 2.1
$$ ##JCAMPDX= 5.01
$$ ##ORIGIN= Bruker BioSpin GmbH
$$ ##OWNER= Administrator
$$ $$ E:\/data/COFFEE/nmr/AC1683_2985_8571279_yJtKDicOSf/10/pdata/1/auditp.txt
$$ ##AUDIT TRAIL=  $$ (NUMBER, WHEN, WHO, WHERE, PROCESS, VERSION, WHAT)
(   1,<2014-04-10 14:33:23.754 -0700>,<Administrator>,<X>,<go>,<TOPSPIN 2.1>,
      <created by zg
	started at 2014-04-10 14:32:17.348 -0700,
	POWCHK enabled, PULCHK disabled,
       configuration hash MD5:
       C8 4E 4E 5D D3 5C D8 9E 9F 52 82 E0 59 8A DE 15
       data hash MD5: 64K
       AB 2E 21 09 0F E0 06 3D 16 7B EA 1F 90 E5 B4 5E>)
(   2,<2014-04-10 14:33:26.661 -0700>,<Administrator>,<X>,<proc1d>,<TOPSPIN 2.1>,
      <Start of raw data processing
       efp LB = 0 FT_mod = 6 PKNL = 1 PHC0 = 0 PHC1 = 0 SI = 32K 
       data hash MD5: 32K
       93 5B B8 CB D5 AC 45 C9 D9 6A 9E 75 4C FE 72 D6>)
(   3,<2014-04-10 14:33:27.004 -0700>,<Administrator>,<X>,<proc1d>,<TOPSPIN 2.1>,
      <pk PHC0 = 94.43848 PHC1 = 0 
       data hash MD5: 32K
       AE 6F DE 26 00 51 D5 8D 80 35 6E 07 0A 6A 40 C4>)
(   4,<2014-04-10 14:33:27.161 -0700>,<Administrator>,<X>,<proc1d>,<TOPSPIN 2.1>,
      <abs ABSG = 1 
       data hash MD5: 32K
       06 90 5A E8 96 A8 9D 66 98 10 47 53 16 C6 B1 A7>)
(   5,<2014-04-10 14:33:27.223 -0700>,<Administrator>,<X>,<proc1d>,<TOPSPIN 2.1>,
      <abs ABSG = 2 
       data hash MD5: 32K
       B8 22 05 65 13 6E EA F7 32 47 6E EE 64 28 18 58>)
(   6,<2014-04-10 14:33:27.301 -0700>,<Administrator>,<X>,<proc1d>,<TOPSPIN 2.1>,
      <abs ABSG = 3 
       data hash MD5: 32K
       24 15 67 04 36 F2 B0 40 69 55 A0 F4 CF 22 D3 A2>)
(   7,<2014-04-10 14:33:27.348 -0700>,<Administrator>,<X>,<proc1d>,<TOPSPIN 2.1>,
      <abs ABSG = 4 
       data hash MD5: 32K
       65 C1 69 99 07 1A 8D A3 FD A8 24 93 0A 40 40 1C>)
(   8,<2014-04-10 14:33:27.395 -0700>,<Administrator>,<X>,<proc1d>,<TOPSPIN 2.1>,
      <abs ABSG = 5 
       data hash MD5: 32K
       9B 31 D4 35 67 AD 57 58 E3 04 EC 0A AA FD 3C 97>)
$$ ##END=
$$ 
$$ $$ hash MD5
$$ $$ F5 01 4F BB 97 C9 55 DD DE 8C 21 66 E7 F6 31 51
##$RELAX= 
##$RELAX= 
##$RELAX= 
##$RELAX= 
##$RELAX= 
##$RELAX= 
##$RELAX= 
$$ Bruker specific parameters
$$ --------------------------
##$DU= <E:\>
##$EXPNO= 10
##$NAME= <AC1683_2985_8571279_yJtKDicOSf>
##$PROCNO= 1
$$ [...]
##$TP= (0..7)
150 150 150 150 150 150 150 150
##$TP07= 0
##$TPNAME0= <>
##$TPNAME1= <>
##$TPNAME2= <>
##$TPNAME3= <>
##$TPNAME4= <>
##$TPNAME5= <>
##$TPNAME6= <>
##$TPNAME7= <>
##$TPOAL= (0..7)
0.5 0.5 0.5 0.5 0.5 0.5 0.5 0.5
##$TPOFFS= (0..7)
0 0 0 0 0 0 0 0
##$TUNHIN= 0
##$TUNHOUT= 0
##$TUNXOUT= 0
##$USERA1= <user>
##$USERA2= <user>
##$USERA3= <user>
##$USERA4= <user>
##$USERA5= <user>
##$V9= 5
##$VALIST= <valist>
##$VCLIST= <CCCCCCCCCCCCCCC>
##$VD= 0
##$VDLIST= <DDDDDDDDDDDDDDD>
##$VPLIST= <PPPPPPPPPPPPPPP>
##$VTLIST= <TTTTTTTTTTTTTTT>
##$WBST= 1024
##$WBSW= 4
##$XGAIN= (0..3)
0 0 0 0
##$XL= 0
##$YL= 0
##$YMAX_a= 637525
##$YMIN_a= -538681
##$ZGOPTNS= <>
##$ZL1= 120
##$ZL2= 120
##$ZL3= 120
##$ZL4= 120
##$ABSF1= 14.98509
##$ABSF2= -5.573092
##$ABSG= 5
##$ABSL= 3
##$ALPHA= 0
##$AQORDER= 0
##$ASSFAC= 0
##$ASSFACI= 0
##$ASSFACX= 0
##$ASSWID= 0
##$AUNMP= <proc_prof1d_extract_pilot.lims>
##$AXLEFT= 0
##$AXNAME= <>
##$AXNUC= <1H>
##$AXRIGHT= 0
##$AXTYPE= 0
##$AXUNIT= <>
##$AZFE= 0.1
##$AZFW= 0.1
##$BCFW= 0
##$BC_mod= 0
##$BYTORDP= 0
##$COROFFS= 0
##$CY= 15
##$DATMOD= 1
##$DC= 0
##$DFILT= <>
##$DTYPP= 0
##$F1P= 0
##$F2P= 0
##$FCOR= 0.5
##$FTSIZE= 32768
##$FT_mod= 6
##$GAMMA= 0
##$GB= 0
##$INTBC= 1
##$INTSCL= 1
##$ISEN= 128
##$LB= 0
##$LEV0= 0
##$LPBIN= 0
##$MAXI= 10000
##$MC2= 0
##$MEAN= 0
##$ME_mod= 0
##$MI= 0
##$NCOEF= 0
##$NC_proc= -8
##$NLEV= 6
##$NOISF1= 0
##$NOISF2= 0
##$NSP= 0
##$NTH_PI= 0
##$NZP= 0
##$OFFSET= 14.98509
##$PC= 1
##$PHC0= 94.43848
##$PHC1= 0
##$PH_mod= 1
##$PKNL= yes
##$PPARMOD= 0
##$PPDIAG= 0
##$PPIPTYP= 0
##$PPMPNUM= 2147483647
##$PPRESOL= 1
##$PSCAL= 4
##$PSIGN= 0
##$PYNMP= <proc.py>
##$REVERSE= no
##$SF= 400.02
##$SI= 32768
##$SIGF1= 0
##$SIGF2= 0
##$SINO= 400
##$SIOLD= 32768
##$SPECTYP= <>
##$SREGLST= <1H.CDCl3>
##$SSB= 0
##$STSI= 32768
##$STSR= 0
##$SW_p= 8223.68421052631
##$SYMM= 0
##$S_DEV= 0
##$TDeff= 65536
##$TDoff= 0
##$TI= <>
##$TILT= no
##$TM1= 0
##$TM2= 0
##$TOPLEV= 0
##$USERP1= <user>
##$USERP2= <user>
##$USERP3= <user>
##$USERP4= <user>
##$USERP5= <user>
##$WDW= 1
##$XDIM= 32768
##$YMAX_p= 460301478
##$YMIN_p= -697592
##$CURPLOT= <Network HP LaserJet P1505>
##$CURPRIN= <$Network HP LaserJet P1505>
##$DFORMAT= <normdp>
##$LAYOUT= <+/1D_H.xwp>
##$LFORMAT= <normlp>
##$PFORMAT= <normpl>
##$SURQMSG= 1
$$ End of Bruker specific parameters
$$ ---------------------------------
##NTUPLES= NMR SPECTRUM
##VAR_NAME=  FREQUENCY,     SPECTRUM/REAL,   SPECTRUM/IMAG
##SYMBOL=    X,             R,               I
##VAR_TYPE=  INDEPENDENT,   DEPENDENT,       DEPENDENT
##VAR_FORM=  AFFN,          ASDF,            ASDF
##VAR_DIM=   32768,         32768,           32768
##UNITS=     HZ,            ARBITRARY UNITS, ARBITRARY UNITS
##FACTOR=    0.250966925370066, 1,           1
##FIRST=     8223.43324360094, 171411,       58902
##LAST=      0,             -159630,         -76819
##MIN=       0,             -697592,         0
##MAX=       8223.43324360094, 460301478,    0
$$ Real data points
##PAGE= N=1
##DATA TABLE= (X++(R..R)), XYDATA
$$ [...]
19547A0215a30066K1383M2344B72500a89381C5570h0333G5090a05969l57993b13326
19535h0907n726j36047L7173D9578a70751l36315A07583d2157Q838j19418A46464
19523b41602M196B57774c06562A08316a32743A70378G859Q735a38386e0288A12774
19511a33550C70054f413E3551f6441k7717E3738a4990k36616J14357D7007d5209
19499A93849C0865a16292l0277n4006A37170a73260d6335B6199K18354G2157J53542
19488B25699a3150I6387a70000A90125D4517I144c7147H5630J48635l9042q3840
19477A11383e8955B02748D5087a88135g4334A75424B8288c4019B44609i1242B1642
19465d7027A91071n1947B813a19626c8878A98848a65215A07258a71595L4239F5617
$$ y = [10215, -130066, -108683, -66339, 272500, -189381, 35570, -80333, 75090, -105969, -463962, -213326, -80907, -86633, -222680, -185507, 49578, -170751, -507066, 107583, -42157, -33319, -152737, 146464, -241602, -237406, 257774, -306562, 108316, -132743, 170378, 7859, 16594, -138386, -50288, 112774, -133550, 370054, -6413, 53551, -66441, -94158, 53738, -14990, -251606, -137249, 47007, -45209, 193849, 30865, -116292, -146569, -200575, 137170, -173260, -46335, 26199, 244553, 72157, 225699, -13150, 96387, -170000, 190125, 44517, 9144, -37147, 85630, 234265, 195223, 111383, -58955, 202748, 45087, -188135, -74334, 175424, 28288, -34019, 244609, -91242, 21642, -47027, 191071, 139124, 2813, -119626, -38878, 198848, -165215, 107258, -171595, -137356, 65617]
19453B82915e9765m4540A65494f7216C519J52523h5678A55911a09782j02050R0611
19442a21221C4611E178d7273k35816A30264d3329j42741B08230J6340c69625P517
19431c62108f5088D3454b51072A72530c13071a31370A37736d70794B3116b53616
19420h1286k93067a36157j82459G1118o365a61783d5066j03192j88550A68247
19409A06030b68584A93690b37862l3886G676J1621a18552r2101b593k17617d8299
19397C8599J07888b74213h5297j14439a1554D4667b5485j02205A3868L16638a94000
19385B04284f716j52652l633g883A4253a15468j96775A04842e7680m00280A60452
19373b34605M4383P5702d2927k01733a8731k8945l5023m7365M6519r7675E2098
$$ y = [282915, -59765, -104305, 165494, -67216, 3519, 156042, -85678, 155911, -109782, -211832, -121221, 34611, 5178, -47273, -283089, 130264, -43329, -186070, 208230, 224570, -369625, -362108, -65088, 43454, -251072, 172530, -313071, -131370, 137736, -470794, 23116, -253616, -81286, -374353, -136157, -318616, 71118, 64753, -161783, -45066, -148258, -336808, 168247, 106030, -268584, 193690, -237862, -271748, 7676, 19297, -118552, -210653, -2593, -220210, -48299, 38599, 146487, -274213, -85297, -199736, -11554, 44667, -25485, -127690, 13868, 330506, -194000, 204284, -6716, -159368, -163001, -7883, 14253, -115468, -312243, 104842, -57680, -457960, 160452, -234605, -190222, -114520, -42927, -244660, -18731, -47676, -82699, -130064, -83545, -181220, 52098]
19361e0793j10469c8726D2050a97673k4858M8603C9011b01564G0449a7343o7098
19350h4441l1216l2214N1631o3620p8886a13921j75325k6194A29487J55125F8194
19338a28844m8917G55b59572h0159j44217J10303B19234b64946D4517c5019I1375
19326B01069d7311a34I976g0247k76187a56872A21321B4541a61701A71318b76842
19314b036m53258K22114f525k45488A47877a17667E2846L3677c11149J00666a2957
19302D2028b15252k7974i1868r7387d3373j2330p015A51071r236b66379F7306
19290D3223J71863B0261c4946A64985p9372c1322m5583j4361q9485e5562k053
19279e7615D00085A39345f9921j890B22059a9349l45241A09595a84564C09113
$$ y = [-50793, -161262, -38726, 42050, -197673, -222531, -173928, 39011, -201564, 70449, -17343, -84441, -115657, -147871, -96240, -159860, -238746, -113921, -289246, -315440, 129487, 284612, 68194, -128844, -177761, 755, -259572, -80159, -224376, -114073, 219234, -264946, 44517, -35019, 91375, 201069, -47311, -134, 9976, -70247, -346434, -156872, 121321, 24541, -161701, 171318, -276842, -2036, -455294, -233180, -6525, -252013, 147877, -117667, 52846, 86523, -311149, -210483, -12957, 42028, -215252, -243226, -91868, -189255, -43373, -55703, -62718, 151071, 141835, -266379, 67306, 43223, 215086, 20261, -34946, 164985, 85613, -31322, -76905, -91266, -180751, -55562, -57615, 400085, 139345, -69921, -71811, 222059, -19349, -364590, 109595, -184564, 309113]
19268a67849e7102j74681J03806k4598C6661a60973e2433B6773R7707d0504A58406
19256c5628l4483k28134J11006j90288a20827p8917q6242B9331b69548K8952A9382
19244A09807a04188A77839c1425j95973K2196l9993J21847E4022R8969b17120
19233b1639C52033c91124a01429G2305h2678D3169d4118j33606k80255A81639
19222I8344K01475j37954K2306b03404c0816A05387c67154r862j6006a82091I9615
19210e7791A50530r280A0786b91469g7995c6187j54776F1482L7524b35030g4440
19198A3986e1647A93273c72625a0726A35115a31755J0556j39200g805j68508e2545
19186a37250I4457b56939g3770C20692c55053R3967J18707E2317f1409j5002o8054
$$ y = [-167849, -57102, -231783, -127977, -152575, 36661, -160973, -52433, 26773, 124480, -40504, 158406, -35628, -70111, -298245, -187239, -377527, -120827, -199744, -285986, 29331, -269548, -240596, 19382, 109807, -104188, 177839, -31425, -227398, -205202, -245195, -123348, 54022, 152991, -217120, -21639, 352033, -391124, -101429, 72305, -82678, 43169, -44118, -177724, -457979, 181639, 98344, 299819, 161865, 184171, -203404, -30816, 105387, -367154, -377016, -393022, -182091, 99615, -57791, 150530, 141250, 10786, -291469, -77995, -36187, -190963, 61482, 99006, -235030, -74440, 13986, -51647, 193273, -372625, -10726, 135115, -131755, -121199, -260399, -7805, -176313, -52545, -137250, 94457, -256939, -73770, 320692, -355053, -261086, -142379, 52317, -61409, -76411, -144465]
19175a44465e3772A07636a02296A07476h224j22051l25842H9129b18764e6707
19164f4121j95558j20867J31418R8860E5306J39148E1343c3225p4641H0321b15047
19152h3588N346B20770a54287B27844a67794I1814g7418K9266I2675g807A03986
19140B49580e0277k18805A40838a98183Q6571k24174h2709a3221m6226A63677
19129a56376k60445i2124A05411K55065a9315j80141I1839a96521h7748l9979
19119a27727I7813c70996A76963D5105d0788k75730b0664k16882E02148A6911
19108a5431j54221p8154f9582l1563G9690b52176A35392p113n6745a09268A70838
19096c17682f1785j64404E334c22181f8414A27455L2445n6351B3068h5091o6207
$$ y = [-144465, -53772, 107636, -102296, 107476, -8224, -130275, -456117, 89129, -218764, -56707, -64121, -259679, -380546, -249128, -150268, 55306, 194454, 51343, -33225, -107866, 80321, -215047, -83588, -78242, 220770, -154287, 227844, -167794, 91814, -77418, -48152, 92675, -7807, 103986, 249580, -50277, -269082, 140838, -198183, -111612, -335786, -82709, -13221, -59447, 163677, -156376, -416821, -92124, 105411, 360476, -19315, -199456, 91839, -196521, -87748, -127727, 97813, -370996, 176963, 45105, -40788, -316518, -20664, -237546, 502148, 16911, -15431, -169652, -247806, -69582, -101145, 79690, -252176, 135392, 128279, 71534, -109268, 170838, -317682, -61785, -226189, 5334, -322181, -68414, 127455, 159900, 103549, 23068, -85091, -151298]
19085a51298j560f890k40020f2604A17566L18337a50905E652J16491b14240L3973
19074a80267j16724m0608j4680G7453M8953a68458g6796A16548b43330J16840
19064a26490k90280A33902c04131a00031D5748Q6126K42228a44331B55725b22782
19053a30603L6307j57017C09142a52761f1870f770o3131A13177a62191A3380g1913
19041b3212p3737k7855o3231A82437d5050r0902N666k3507A7921N2276b31542
19029c76251f5036j01482A55733b6389A40474c0401G2917b71189A69310D5702
19018c0449B97022a77368F1265c49452I3292J66584a53928j35824A30356l7471
19008I2885K8695a25260L0940B82243b7846e907j6022A29516b07782B41209J24454
$$ y = [-151298, -152858, -6890, -246910, -62604, 117566, 435903, -150905, 5652, 122143, -214240, -180267, -296991, -337599, -352279, 77453, 126406, -168458, -76796, 116548, -243330, -126490, -416770, 133902, -304131, -100031, 45748, 131874, 374102, -144331, 255725, -222782, -130603, -94296, -251313, 309142, -152761, -61870, -6770, -69901, 113177, -162191, 13380, -71913, -23212, -96949, -124804, -188035, 182437, -45050, -135952, -130286, -153793, 17921, 70197, -231542, -376251, -65036, -166518, 155733, -26389, 140474, -30401, 72917, -271189, 169310, 45702, -30449, 297022, -177368, 61265, -349452, 93292, 259876, -153928, -289752, 130356, 92885, 121580, -125260, -94320, 282243, -27846, -5907, -21929, 129516, -207782, 241209, 365663]
18997C65663g1904J4382K3954m29716A56558a81431M4706c19l14982Q6869o2178
18986b90610R1894P8696A85044m8086a12601c1389A22254b5629j80388N4999p4772
18975b25790B39528a05321P94L3839K5321B25508b61504A07882a14543G793K8664
18964C6457n756b29060j78573h0175a7084h194C18210c0051o5479j32098b5140
18952A25280b57743f3296k9096B04482o8939a58116F4981M1515n0038a34464D05348
18940a21856A8566b00635B32955e6716E4215e6969j28321k2254E3913b44464A37436
18928a81446N1228A06951C5532b14403A52963l8574q699d6378j26861j04033k29532
18917e06804B0375J65635B0690b4071o5670p7381E1073d50597A10511L32650A21609
$$ y = [365663, -71904, -57522, -33568, -463284, 156558, -181431, -136725, -319, -315301, -228432, -290610, -198716, -120020, 185044, 136958, -112601, -31389, 122254, -25629, -206017, -151018, -225790, 239528, -105321, -104527, -70688, -45367, 225508, -261504, 107882, -114543, 7793, 36457, 30701, -229060, -407633, -80175, -17084, -8194, 318210, -30051, -95530, -227628, -25140, 125280, -257743, -63296, -92392, 204482, 135543, -158116, 64981, 106496, 56458, -134464, 405348, -121856, 18566, -200635, 232955, -56716, 54215, -56969, -185290, -207544, 53913, -244464, 137436, -181446, -130218, 106951, 35532, -214403, 152963, 114389, 105690, -46378, -173239, -277272, -506804, 20375, 186010, 20690, -24071, -89741, -167122, 51073, -450597, 110511, 443161, 121609]
18905b34597J14394B02401e8476k78021c3549A63975J9716l8713l7900h4420J8062
18894f6358p316A22892a39172L1529c8914j14224I5288A7749b03949A65230o7069
18883I8161A4955a22538C2493b46502q5116J24815j42603G244J87745g1536j87433
18872b58969A53492g9233b9432j5780i108A01387M576a57649J5359b288l34821
18861c37109A56819a82305j24249J02651b240H4565K6928K87941H7006i4871B70771
18849B62072b50121C32957n4961c71463D9712e9997B18389A3174J68972K7028
18839B09174r5796M8280o5148b54984N4836E3273a53699K4590m18122K62215M7708
18828b37308A05000d01608a03571I5980a6748F8877g1491B01581K5570c77127
$$ y = [-234597, -120203, 202401, -58476, -336497, -33549, 163975, 183691, 144978, 107078, -84420, -66358, -73674, 122892, -139172, -107643, -38914, -153138, 95288, 17749, -203949, 165230, 98161, 14955, -122538, 32493, -246502, -331618, -206803, -349406, 7244, 194989, -71536, -258969, 153492, -79233, -29432, -45212, -9108, 101387, 105963, -157649, -142290, -2288, -337109, 156819, -182305, -306554, -203903, -2240, 84565, 111493, 399434, 87006, -94871, 270771, 262072, -250121, 332957, 277996, -371463, 49712, -59997, 218389, 13174, 182146, 209174, 113378, 161658, 96510, -254984, -200148, 53273, -153699, -129109, -547231, -285016, -237308, 105000, -401608, -103571, 95980, -16748, 68877, -71491, 201581, 227151, -377127]
18817e6585A29457a85879b3932A59265a21236n5742j42972B38956A2381J70122
18807A82503K25337a00152C05170i4182D9g5574F6895b38409L5414E5752J26339
18796A82091a04527o7124m8250N0293B2791a15335l08150B57864C2378c46314
18785a15783m3662B0449a17543k14672B28374a67588q9667B4772b48056A82753
18774a67932F7788i090B35764b2485j03873j11022f4678j20329P5010j19733B79634
18762g1615B07341e43l39875A0108b79965i9462C30314j61683a96781D7421K24208
18751B71629e6162A39994a07610I3397a82354j85428J73853a9059A5837a42559
18740H9622B4020a59534p2859d2679C23661l5571i8626j72047j2715J24324m4936
$$ y = [-56585, 129457, -185879, -23932, 159265, -121236, -176978, -319950, 238956, 12381, 182503, 407840, -100152, 305170, -94182, 49, -75574, 66895, -238409, -202995, 55752, 182091, -104527, -171651, -219901, -169608, 22791, -115335, -423485, 257864, 32378, -346314, -115783, -159445, 20449, -117543, -332215, 228374, -167588, -257255, 24772, -248056, 182753, -167932, 67788, -9090, 235764, -22485, -126358, -237380, -64678, -185007, -109997, -229730, 279634, -71615, 207341, -543, -340418, 10108, -279965, -99462, 330314, 168631, -196781, 47421, 271629, -56162, 139994, -107610, 93397, -182354, -367782, -193929, -19059, 15837, -142559, 89622, 24020, -159534, -232393, -42679, 323661, 288090, -98626, -270673, -283388, -159064, -204000]
18729b04000j05080Q2090J3688D95402c26890p3383J67299B0607R9414J09313
18719B29334a28643p5275c2497k64624g2322j30410A14034a46082O0213C9726
18708a49659M051k01461a01755d7845I8464b44952a10344m47760g4825j6071F208
18696d9332B2342b08573c0915A01769a06132j03432h394o1354a609A18897a49859
18684C0213a96934o2548B02672a12305G591a44327M8426F860b40591d9509j00561
18673a50070n1465A8932f0884C3398b02664N5556E7578b91765B02640g1679j92696
18662b64375A05017b24040A30145c9874I1023h1098a124H9875J15224b02702H5495
18650b45237n9943H2417b85663M529M6911M9938h5206B1118a93865i1524l8400
$$ y = [-204000, -309080, -226990, -213302, 495402, -326890, -400273, -232974, 20607, 120021, 229334, -128643, -203918, -32497, -297121, -72322, -202732, 114034, -146082, -85869, 39726, -149659, -145608, -347069, -101755, -47845, 98464, -244952, -110344, -558104, -74825, -90896, 6208, -49332, 22342, -208573, -30915, 101769, -106132, -209564, -8394, -69748, -1609, 118897, -149859, 30213, -196934, -259482, 202672, -112305, 7591, -144327, -95901, 6860, -240591, -49509, -150070, -201535, 18932, -60884, 33398, -202664, -147108, 57578, -291765, 202640, -71679, -264375, 105017, -224040, 130145, -39874, 91023, -81098, -1124, 89875, 205099, -202702, 85495, -245237, -305180, 82417, -285663, -281134, -234223, -184285, -85206, 21118, -193865, -91524, -129924]
18639a29924d5475H7001e3034q2349I7061a29259e2366j66423g2028A34421b39487
18627a66717q8102m671L5535h6585G2396a78412A977b3207A70277J13217r4771
18616A88723J01370j18420a91457b4924q3524A06281a56435e4990k16663B60781
18605a10023q626N7694A59309A2723b82061J33608j15843N8954d7492j17888J3829
18594a51551L9761M6076b4981j23540m2901F8127c51569K0338a02416J8857A2680
18582C04341j17096H5442J34651c9618A04196m2636a97319g8067A63567a75319
18571b66705E7572d5067l18446A61952k2809a60042A87745A3985b56907B092R5438
18560I7530a45980B5103J88308a5147C4232q827N1255c67618g9092p8801E1263
$$ y = [-129924, -45475, 87001, -53034, -135383, 97061, -129259, -52366, -218789, -72028, 134421, -239487, -166717, -254819, -259490, -223955, -86585, 72396, -178412, 1977, -23207, 170277, 283494, 188723, 290093, 171673, -191457, -24924, -108448, 106281, -156435, -54990, -271653, 260781, -110023, -118649, -60955, 159309, 12723, -282061, -148453, -264296, -205342, -47492, -165380, -151551, -111790, -65714, -24981, -148521, -191422, 68127, -351569, -331231, -102416, -83559, 12680, 304341, 187245, 85442, 220093, -39618, 104196, 61560, -197319, -78067, 163567, -175319, -266705, 57572, -45067, -363513, 161952, 139143, -160042, 187745, 13985, -256907, 2092, 97530, -145980, 25103, 213411, -15147, 34232, 25405, 76660, -367618, -79092, -157893, 51263]
18548A75669g5234j35605j2294I8771P2714d85261a86092e8345k21842j49079
18538d29266d8187A25555A0227b24545B05430b36097B1042H473J22207k9816c1683
18526A1283a63303d6228f478k80841j5997Q7440j71801A48047d19025i4126B07096
18514H1527a70943F4970K97042J47284a53109C1777a24350j20353b6653A53079
18503i6994j08280B27197B032N5341L2504m2145b77383J8521D7244c20585P7442
18492b43143A50794b56377J11551j2051a9663A13095K06882h712k90713e8260
18481A89407H2526e5506a0960A24573b0535j58503d1315K179j02373k34633a12917
18469f4233j17741M1278e2671H6946C1821b36474e3977I671e7518l61219b9799
$$ y = [175669, -75234, -210839, -223133, 98771, 171485, -485261, -186092, -58345, -280187, -429266, -48187, 125555, 10227, -224545, 205430, -236097, 21042, 8473, 130680, 100864, -31683, 11283, -163303, -46228, -6478, -287319, -303316, -215876, -387677, 148047, -419025, -94126, 207096, 81527, -170943, 64970, 362012, 509296, -153109, 31777, -124350, -244703, -26653, 153079, -96994, -205274, 227197, 2032, 57373, 89877, 47732, -277383, -258862, 47244, -320585, -243143, 150794, -256377, -144826, -156877, -19663, 113095, 319977, -8712, -299425, -58260, 189407, 82526, -55506, -10960, 124573, -20535, -179038, -41315, -39136, -141509, -376142, -112917, -64233, -181974, -140696, -52671, 86946, 31821, -236474, -53977, 9671, -57518, -418737, -29799]
18457a23370F9907K1158k8161a579r977A51280a23712G8002c9872j55927Q2185
18446a13614H6034b27591i0844C4728P0433J45746h623B13720d5896J0013o7554
18435a03437P182o4563k91356B6107f9967j19383f3264k54750A82983a12203n0384
18424a62587C23873A42714b25276a5061D4074d9708j17969O4137A6488b00056
18413a27264j46416B0077f8355I6742m4601O5745d4332G4520f6760j4151q5266
18402a66177A79454E0676c23960G7467c8248B03749l3230G1860j5638f4275A52223
18390a52297b1844k65844g9126k02925e1307d738B7281a52840a0582l56482i6528
18378a75355d8747J4088E4052h3654k97915a4418k4797o8979a3813k06904p2033
$$ y = [-123370, 69907, 91065, 62904, -1579, -11556, 151280, -123712, 78002, -39872, -195799, -113614, 86034, -227591, -90844, 34728, 105161, 250907, -8623, 213720, -45896, -35883, -103437, -96255, -160818, -452174, 26107, -69967, -189350, -63264, -318014, 182983, -112203, -162587, 323873, 142714, -225276, -15061, 44074, -49708, -167677, -103540, 16488, -200056, -127264, -273680, 20077, -68355, 96742, 52141, 117886, -44332, 74520, -66760, -80911, -166177, 179454, 50676, -323960, 77467, -38248, 203749, 170519, 71860, 56222, -64275, 152223, -152297, -21844, -287688, -79126, -282051, -51307, -4738, 27281, -152840, -10582, -367064, -96528, -175355, -48747, -34659, 54052, -83654, -381569, -14418, -39215, -108194, -13813, -220717, -292750]
18367b92750m1706d7259J7519j36009N5638j87592E4153c79922f2612a6853A54051
18355A00238K8070b8538m2783D3459a95905A43804C0672b60211A46677k0593d8745
18343A16722a18155A3955a55148f3356K6285k13914A3909d65093B8750c50449
18332c41183a407F8006O8003C8805N7108k5149K4935a37964J0875B04649a53738
18320E2463K82989A4002J74873c89964J17138A08957P1350b24581b6401p1945
18310i8346l36687i1783k53866A51109M0010b3448q7321j5149A48639P9243b5581
18298B0123e6583D6514R6453A7760a62507Q0974m26932a46974G4893b91972b8099
18286G7712b28703a01751q1171h480L15k36946e4276K2082A25070G478N5821B6495
$$ y = [-292750, -334456, -47259, -29740, -165749, -110111, -297703, 54153, -379922, -62612, -16853, 154051, 100238, 128308, -28538, -71321, 43459, -195905, 143804, 30672, -260211, 146677, 126084, -48745, 116722, -118155, 13955, -155148, -63356, -37071, -250985, 13909, -465093, 28750, -350449, -341183, -1407, 68006, 136009, 38805, 95913, 70764, 95699, -137964, -127089, 204649, -153738, 52463, 335452, 14002, 188875, -389964, -272826, 108957, 180307, -224581, -26401, -98346, -435033, -91783, -345649, 151109, 191119, -23448, -110769, -125918, 148639, 227882, -25581, 20123, -56583, 46514, 142967, 17760, -162507, -81533, -508465, -146974, 74893, -291972, -28099, 77712, -228703, -101751, -182922, -8480, -8165, -245111, -54276, -32194, 125070, 7478, 63299, 26495]
18273b23510r921h6816j42173L5965C9929d61762a53753A9296L20555a89977h716
18261a10124K121e1959A43842c12632B25060F5437a68349J2895d717j82423B06318
18249C046f1534B61428l4399a10212H9953J5935k5278b44616k5422a17978K2851
18238i5127m5988k5421a7012k59484j06425J71073A13687a64006E5222a50991
18227g6281A38323a43617b1279p7049A07660C0333M4573i6530A35707F572b33220
18215d20511A64836m5580O717b78817g7558Q783A36366c46790Q8822E52177b81010
18203C81975H4159d7800C1810a83724P9709k11264J27819h5742q3251N7189m0727
18192a52531G8550L43070A49004a3940I3243d6878C4504a14287B21171C8814a54865
$$ y = [-223510, -233431, -86816, -228989, -193024, 39929, -461762, -153753, 19296, 339851, -189977, -8716, -110124, -108003, -51959, 143842, -312632, 225060, 65437, -168349, -155454, -4717, -187140, 206318, 3046, -61534, 261428, 227029, -110212, 89953, 105888, 80610, -244616, -270038, -117978, -95127, -141115, -166536, -17012, -276496, -382921, -211848, 113687, -164006, 55222, -150991, -76281, 138323, -143617, -21279, -98328, 107660, 30333, 74906, -96530, 135707, 6572, -233220, -420511, 164836, 119256, 125973, -278817, -77558, -68775, 136366, -346790, -257968, 552177, -281010, 381975, 84159, -47800, 31810, -183724, -104015, -315279, -187460, -85742, -168993, -111804, -152531, 78550, 421620, 149004, -13940, 93243, -46878, 34504, -114287, 221171, 38814, -154865]
18180A45229a96679A3305J63359d33278I4051f927o8404A16934E5082J5835e5873
18168b36156l7147a36089A22944a16796e206I1714a9215p1438b1261e726A18116
18156A16166l520n585f4628m88400K20804F6654a13892I7283c1632m8362C6280
18144F388b07364d9698E24298c077k45733B98527r6989b08591F8307e3013e182
18132C99671C5306c6785l1670K1655l07538a73115A90338a8152A19357a12281
18121i2963G1968N5913n8821a69257A47221a23727j65600j9725A86172c8896k38021
18110b76917a10120b5240L495G4514c70728F3692O9441A0480K4819K17475A08786
18098b14345H0657L69929A14396c9580A84956a55449B5093a86426M9343j06782
$$ y = [145229, -196679, 13305, 176664, -433278, 94051, -6927, -75331, 116934, 55082, 70917, -55873, -236156, -273303, -136089, 122944, -116796, -5206, 91714, -19215, -90653, -21261, -5726, 118116, 116166, 112646, 107061, -64628, -553028, -332224, 66654, -113892, 97283, -31632, -79994, 36280, 6388, -207364, -49698, 524298, -3077, -248810, 298527, 201538, -208591, 68307, -53013, -5182, 399671, 35306, -36785, -68455, -46800, -354338, -173115, 190338, -18152, 119357, -112281, -92963, 71968, 127881, 69060, -169257, 147221, -123727, -289327, -309052, 186172, -38896, -276917, -110120, -25240, -21745, 74514, -370728, 63692, 133133, 10480, 35299, 252774, 108786, -214345, 80657, 450586, 114396, -39580, 184956, -155449, 25093, -186426, -137083, -243865]
18088b43865B13716c35469j24917a18655d6143A28194a49661I7319a35620J0523
18078a25097C5192b23491j00257F1405i2648j60894h9633m9896D3285K18585d20822
18066f5770B5202c87133A03797b93010q3717b0655j178r7133k08205j60134A4867
18054i898j053n2720l79928A37758d7935j24748L166q910A02234l6850a70622
18042e1571j53145B46956c723d57j37681c8411F5775L4088J49800O7758A29604
18030B22332a95977C26046a59316K0002D207b67838B605R9847c4112A25971E1788
18018A0849J56480c19943g7879E8068b07192O2048j4311f4122k62443G0354j2713
18007E7641c71937A33552g5075j29825j33864A54904h273C2262G253a85311a5696
$$ y = [-243865, 213716, -335469, -460386, -118655, -46143, 128194, -149661, 97319, -135620, -125097, 35192, -223491, -323748, 61405, -92648, -253542, -89633, -139529, 43285, 261870, -420822, -65770, 25202, -387133, 103797, -293010, -376727, -20655, -21833, -118966, -327171, -487305, 14867, -9898, -10951, -63671, -443599, 137758, -47935, -172683, -169517, -178427, 102234, 65384, -170622, -51571, -204716, 246956, -3723, -457, -138138, -38411, 65775, 99863, 249663, 317421, 129604, 222332, -195977, 326046, -159316, -139314, 4207, -267838, 2605, 102452, -34112, 125971, 51788, 10849, 167329, -319943, -77879, 58068, -207192, -145144, -159455, -64122, -326565, 70354, 57641, -371937, 133552, -75075, -204900, -338764, 154904, -8273, 32262, 7253, -185311, -15696]
17995c14947R5318a4502A15009A8233L42562d6198j620A32776d11622A26262F60
17983a97976R4816N0663D8244e8435B23518g1293c2451B20448q3803K7151f7516
17971a39379d8368D4575K8202B9978a39715A79249a94014A68728H0107k4592h4475
17959D4384f7644I6868a96812K4530N4257n0016O1734B0084c1979k24812j33595
17948c90386B33526b73680H2974Q8889G2172b87505d7556B7844a87582b8904l11712
17937c40616C58694C4519b99345f7984j98786A25622a09896A46035N033a45073
17926a72118L9621j4358B49922a5095C73634j63645a59996B82083a31292b7634
17915f2625A188g676l555k75972a40301A92083J53027A44828k2046Q7645o1694
$$ y = [-314947, -219629, -14502, 115009, 18233, 360795, -46198, -47818, 132776, -411622, 126262, 660, -197976, -103160, -52497, 48244, -58435, 223518, -71293, -32451, 220448, 136645, 163796, -67516, -139379, -48368, 44575, 72777, 29978, -139715, 179249, -194014, 168728, 80107, 55515, -84475, 44384, -67644, 96868, -196812, -172282, -118025, -168041, -106307, 20084, -31979, -256791, -390386, 233526, -273680, 82974, 171863, 72172, -287505, -47556, 27844, -187582, -28904, -340616, 358694, 34519, -299345, -67984, -266770, 125622, -109896, 146035, 151068, -145073, -172118, -132497, -146855, 249922, -15095, 373634, 209989, -159996, 282083, -131292, -27634, -62625, 1188, -7676, -11231, -287203, -140301, 192083, 345110, 144828, 122782, 210427, 148733]
17904A48733J21311R060a80217A21492J81073a37305b2912A91441H6806K42910
17894C29716j56974a28774d6174j9543a5856m3445r692j59441I0159c17767J56259
17883a61508G3821b67054a31501B33069B2188b25778B9898h0543j3927k18382
17873c12852A62288B1669e5671j48588a8004J609j13189j80312F1351K04753A3334
17861B8292h4738D6717J60919b6653A14713b20292K7727r921h4836A20305c48695
17849a46842k44753J80414C11139A09352b32121l8168a08327n1402C27993e0772
17838a58840A46449n4575q921Q41L03851r4721e3891m3049A72278a80761A20698
17826B07140g2095c4382q6452j93590J01918A95306i6218c5155C77482N4948C5276
$$ y = [148733, 270044, 279104, -180217, 121492, 302565, -137305, -22912, 191441, 86806, 329716, 172742, -128774, -46174, -65717, -15856, -59301, -68993, -228434, 90159, -317767, -161508, 73821, -267054, -131501, 233069, 22188, -225778, 29898, -80543, -94470, -312852, 162288, 21669, -55671, -204259, -18004, -16395, -129584, -309896, 61351, 266104, 13334, 28292, -84738, 46717, 207636, -26653, 114713, -220292, -192565, -202486, -84836, 120305, -348695, -146842, -391595, -211181, 311139, 109352, -232121, -270289, -108327, -159729, 327993, -50772, -158840, 146449, 91874, 82953, 83794, 387645, 292924, -53891, -96940, 172278, -180761, 120698, 207140, -72095, -34382, -120834, -314424, -212506, 195306, -96218, -35155, 377482, 432430, 35276]
17814A78234e5603i464j32699E1962d788I7514d7026l65178A83506c28660a12666
17802a67737A73451J77655c1305m118j97829F3118N3926b60202e7286B00904r4224
17791A06680d8848A01010a01583d5534o680b793k80559A10892E3638J65434a65451
17779a7680D3176L27572e7117F9837g1489A77385h659k3067H0294c2537k02866
17768b35403H5855f5988C421Q3180L3104c642r1567l976A13712B4120d01918H7675
17755c1871p1800A40658b59690Q2869A51237f2649b9408C77874A07554f3524A8897
17743f6029G9764A6711L2186g4936K7143j12610M642j65833I3260C0358a97339
17731a65939I6800B6167a00383J548k0238j60865I8679c2181F3693a53148I2102
$$ y = [178234, -55603, -9464, -142163, 51962, -4788, 97514, -47026, -412204, 183506, -328660, -112666, -167737, 173451, 351106, -31305, -35423, -233252, 63118, 117044, -260202, -57286, 200904, 106680, -48848, 101010, -101583, -45534, -52214, -2793, -283352, 110892, 53638, 219072, -165451, -17680, 43176, 370748, -57117, 69837, -71489, 177385, -8659, -31726, 80294, -32537, -235403, 85855, -65988, 3421, 86601, 119705, -3642, -95209, -99185, 113712, 24120, -401918, 87675, -31871, -103671, 140658, -259690, -176821, 151237, -62649, -29408, 377874, 107554, -63524, 18897, -66029, 79764, 16711, 48897, -74936, -47793, -160403, -155761, -321594, 93260, 30358, -197339, -165939, 96800, 26167, -100383, -98835, -119073, -279938, 98679, -32181, 63693, -153148, 92102]
17719F9664L0086J1333c0220p9911B39798p8756a27411A38246a14492p8816J3274
17708a80034A3322M5121M2553M474M3514a33478B25542A3186a81153H4057C5837
17696b12656L3476A17230A1273J73982A6628f0239p5209F3987e7680j5898c5163
17684d4635j28374G9201J53318b2699B21992a89658j28649B82062H6773O3522
17674A50295D6954R6849a46933D8228K11558C342P8946K60856A0144J45227c95264
17662B8248c7992B808O2456a61384A35965i854C2717R3341M896q350a48162L4120
17650a14042B163J97224b98878c0371Q085k50537A2046h0954j3439B34542a4726
17638A83766J38181A4937J91598M2130d58721B09912D8480Q3304P2604O0721b3448
$$ y = [69664, 99750, 111083, -30220, -110131, 239798, 161042, -127411, 138246, -114492, -193308, -180034, 13322, 58443, 100996, 105470, 148984, -133478, 225542, 13186, -181153, 84057, 35837, -212656, -179180, 117230, 11273, 185255, 16628, -60239, -135448, 63987, -57680, -73578, -35163, -44635, -173009, 79201, 232519, -22699, 221992, -189658, -318307, 282062, 86773, 150295, 46954, 143803, -146933, 48228, 259786, 3342, 82288, 343144, 10144, 155371, -395264, 28248, -37992, 2808, 65264, -161384, 135965, -9854, 32717, 126058, 130954, 122604, -148162, -114042, 2163, 199387, -298878, -30371, -22286, -272823, 12046, -80954, -94393, 234542, -14726, 183766, 321947, 14937, 206535, 248665, -458721, 209912, 48480, 131784, 204388, 265109, -23448]
17626g7313E5466b80893A59750a23009j073j00190f4271A16582b8129A04953g0560
17614A1916a5551l3837c06E5442a96495l2432E6991a55951A46000a93905H1516
17602C67965E640J08579j610a04178A12917K1402G868e0508A35774J51248d6630
17590h3761J5497G6814b6031p6991A81558o0905A0756L8885L46962C2800b26266
17578C27988F0517J6448a67367I4408g1540n2174H9750R4006o3086a2477B44031
17566b25413B5255P5060C2388K1250k5162O154i5337g609A80719b1267B03810
17554a88230A64685R0608a48067b940o8179I9308K5307k4647K63370A47518a80674
17542g1137C06330c7077A15739a48100E2314J75271G4606P6000l729B7100a71450
$$ y = [-77313, 55466, -280893, 159750, -123009, -124082, -224272, -64271, 116582, -28129, 104953, -70560, 11916, -15551, -49388, -306, 55442, -196495, -228927, 56991, -155951, 146000, -193905, 81516, 367965, 5640, 114219, 112609, -104178, 112917, 134319, 7868, -50508, 135774, 287022, -46630, -83761, -68264, 76814, -26031, -103022, 181558, 120653, 10756, 49641, 396603, 32800, -226266, 327988, 60517, 76965, -167367, 94408, -71540, -123714, 89750, 183756, 120670, -12477, 244031, -225413, 25255, 100315, 32388, 53638, 28476, 34630, -95337, -7609, 180719, -21267, 203810, -188230, 164685, 255293, -148067, -2940, -71119, 99308, 124615, 99968, 363338, 147518, -180674, -71137, 306330, -37077, 115739, -148100, 52314, 227585, 74606, 150606, 146877, 27100, -171450]
17530E7863H68N147P5847i493j95455K2031D62137D99K98349j2030A22090R828
17518A31918E7464k6042M95424E5924L59391f3586B01846n0976a71253C66543
17507i7082A1857a43224A52392M3411e9576E1330K00754K29446j68561E5745a27544
17495A52922J2054N4472P683D7680b60009f5873D08680E1907K29067j02293f6332
17483a8731R096A40669N1064b10225E49877b7692A45870K18019O7300j86881M4420
17472B88728K22751A98681J15374j18597J49370a451B75045g7942l04027A66275
17461A63497L4434d0068B18985Q9526A0237N0126Q6304b2376B62056l8992O5019
17450B88083O7405J45631M5095B47177J86567N3682L77229d9039o3573A92426
$$ y = [57863, 868, 6015, 81862, -9493, -204948, -182917, 462137, 499, 298848, 286818, 122090, 131918, 57464, 31422, 526846, 55924, 415315, -63586, 201846, 150870, -171253, 366543, -97082, 11857, -143224, 152392, 195803, -59576, 51330, 252084, 481530, 312969, 55745, -127544, 152922, 164976, 219448, 227131, 47680, -260009, -65873, 408680, 51907, 280974, 178681, -66332, -18731, -9635, 140669, 191733, -210225, 549877, -27692, 145870, 363889, 431189, 244308, 288728, 511479, 198681, 314055, 195458, 344828, -1451, 275045, -77942, -381969, 166275, 163497, 197931, -40068, 218985, 308511, 10237, 60363, 146667, -22376, 262056, 223064, 288083, 355488, 501119, 546214, 247177, 433744, 487426, 864655, -49039, -112612, 192426]
17439D48844B4413L08837j47440k8037l0352K42514A78533J13459J93386B30502
17428D41358j27288J18470b01535d8270A10901J48390o3354m1284J74820B5652
17417C48937A29245k370M35020j46381M8204j10859M3310G1328L05042E1986c281
17405B43165L02624b45668A14164Q9502N0111j17397K33413D5776N4016h2124
17394i4127A11164a332B26378a56453B85514J20330K16241A08589a62516B67839
17383B21890L18J64416j33843K13942E3099J29489J6164I7881a95744A01520k4290
17372G7230C4197R0938J59838k1814k9688H1433P2607J26123A1804b1450D1437
17360A42973n0488J93052E5085R9623L56470k37590r1645q3503J91149k477o3811
$$ y = [448844, 24413, 333250, 185810, 157773, 127421, 369935, 178533, 291992, 485378, 230502, 441358, 314070, 432540, -201535, -48270, 110901, 259291, 195937, 154653, 329473, 25652, 348937, 129245, 126875, 561895, 415514, 463718, 352859, 396169, 71328, 376370, 51986, -3281, 243165, 545789, -245668, 114164, 203666, 253777, 136380, 369793, 45776, 99792, -82124, -94127, 111164, -1332, 226378, -156453, 285514, 405844, 622085, 108589, -162516, 267839, 221890, 222208, 386624, 252781, 466723, 53099, 182588, 198752, 97881, -195744, 101520, 77230, 34197, 125135, 284973, 263159, 233471, 81433, 154040, 280163, 11804, -21450, 41437, 142973, 92485, 285537, 55085, 154708, 511178, 273588, 181943, 98440, 289589, 287112, 223301]
17349B23301B1929L49221B0140K6042J8007L8264K0380a4930j08795C32751K43656
17338E76407k76537m843d8243F51554h1636F7415a04275K7101A23951J21462E9787
17326A64741J93676d7741l6117D35114A11105a73609A6594M99077k41231J46806
17316D21246A80701i444d190C84970A53761a78458B50458a49353G5155M8334n992
17305A17497a21065B56109p0891o3754K03720b9608A30564L35211j92265b98236
17294C35033j17601J75323A28003a09514o076A6983K62748A24155C0886K30622
17284B61508r4579l5761O9214N031g4436b8365A49419J08937L19819A43797l3678
17273A10119m7614a12282e4721E71847j27909A16786a2483j82789A24442Q8099
$$ y = [223301, 21929, 371150, 20140, 46182, 64189, 102453, 122833, -14930, -123725, 332751, 576407, 299870, 295027, -48243, 651554, -81636, 67415, -104275, -77174, 123951, 245413, 59787, 164741, 358417, -47741, -83858, 435114, 111105, -173609, 16594, 515671, 274440, 421246, 180701, -9444, -4190, 384970, 153761, -178458, 250458, -149353, 75155, 123489, 117497, -121065, 256109, 185218, 121464, 325184, -29608, 130564, 465775, 273510, -298236, 335033, 217432, 392755, 128003, -109514, -115590, 16983, 279731, 124155, 30886, 261508, 166929, 131168, 200382, 205413, -74436, -28365, 149419, 258356, 578175, 143797, 110119, 62505, -112282, -54721, 571847, 443938, 116786, -12483, -195272, 124442, 212541]
17263B12541K76101k30947F8254K06795A04582l9701M71705j91754j38998L16868
17253E22702F877K41710m344F3302K56555J40915j85736H8884P7446L35200A15230
17241C89813k6886d0952C21067j39502M3273l725J20199j20932I0908J96060H2813
17229E74716c5400j2780C87602j57002K21487A74034J28904K6439K15j26845b5296
17217D11574E9683M4349K76341F365K55921d0554F0623K02868A0215M02822j60465
17206B52572K6623K62859j41696L2496A46759R0088Q6780c9240C76551l5600H7182
17194B39501K32986A56002J53638q8260j613F1191K83389K01230j41594A16036
17183C96525r2379R8573D7122L21621M1541O0146l0919j71216J67607B8499J38066
$$ y = [212541, 488642, 257695, 68254, 275049, 104582, 64881, 536586, 344832, 205834, 522702, 6877, 248587, 244243, 63302, 319857, 460772, 275036, 88884, 166330, 501530, 115230, 389813, 362927, -40952, 321067, 181565, 224838, 221113, 341312, 220380, 90908, 286968, 82813, 574716, -35400, -48180, 387602, 230600, 452087, 174034, 302938, 329377, 329592, 202747, -25296, 411574, 59683, 104032, 380373, 6365, 262286, -40554, 60623, 263491, 10215, 413037, 252572, 279195, 542054, 400358, 432854, 146759, 236847, 323627, -39240, 376551, 340951, 87182, 239501, 472487, 156002, 309640, 221380, 219767, 61191, 344580, 545810, 404216, 116036, 396525, 304146, 402719, 47122, 368743, 410284, 470430, 439511, 268295, 435902, 28499, 166565]
17172A66565k8010Q9334J56212M4154j87331a23902C32422j66036L20776A12518
17161E19395J63686k44245M9188J13692k29894A16716L37533K9669A60309M46681
17151F06990k24278A45386a36384B77682Q0080K46725A86114J33097r1352M52083
17141F79942j61269D0979K54910K66394j64927k7483J64017j55253K18852A30737
17130D82579j62914k1359K72802p2876A05688J95627P0841N0236j13439l8764
17120B70189K67617B20880N35562k75522k14310L04632k69260A46562N07314j95260
17110D58616n4966j71540m0962J90656N8291K32590k16131j93211O36J27125J04307
17099D95411J16762k47441j11894K49765O9418K12222j89613k36948J54207j13521
$$ y = [166565, 138555, 227889, 384101, 428255, 240924, -123902, 332422, 166386, 487162, 112518, 519395, 683081, 438836, 488024, 601716, 371822, 116716, 454249, 483918, 160309, 606990, 382712, 145386, -136384, 277682, 357762, 604487, 186114, 319211, 227859, 679942, 518673, 40979, 295889, 562283, 397356, 369873, 533890, 378637, 597489, 130737, 482579, 319665, 298306, 571108, 498232, 105688, 301315, 372156, 422392, 308953, 270189, 537806, 220880, 756442, 480920, 266610, 571242, 301982, 146562, 653876, 458616, 403650, 232110, 191148, 381804, 440095, 672685, 456554, 263343, 263979, 391104, 495411, 612173, 364732, 252838, 502603, 572021, 784243, 594630, 357682, 511889, 398368]
17089C98368J09206N6697k02050J13798r3285K35322k60432j08593K68575L22282
17079H39888D05868L51952j30817A90779L08856n0304L2671J40052k68161j40232
17069B13661O08437k30337B95279n4386K54579M1487k33555M04323j00155J87504
17059G95076p0807j94725H0267K83241M1315K92670n8802J13971B92895N34142
17049H27037j17253j99218j51124M053L29104j23927r2769K28503k59165J42781
17039E88022j40359N46781m12047j43905N206O44380D84737j88705N94586j87878
17029G02740j94547K73434K47497P5669m31276J05648P5806l73928J12283k22777
17019C70549K52518J05025J4570K32119l57770P41O4311J50259J72384l86080
$$ y = [398368, 507574, 564271, 362221, 476019, 382734, 618056, 357624, 249031, 517606, 839888, 405868, 757820, 627003, 190779, 499635, 449331, 482002, 622054, 353893, 213661, 822098, 591761, 295279, 240893, 495472, 536959, 303404, 707727, 607572, 795076, 724269, 529544, 80267, 363508, 404823, 697493, 638691, 752662, 292895, 827037, 709784, 510566, 359442, 363495, 692599, 568672, 475903, 704406, 445241, 588022, 447663, 994444, 582397, 438492, 443698, 1088078, 484737, 296032, 890618, 702740, 508193, 781627, 1029124, 1104793, 673517, 779165, 854971, 481043, 593326, 370549, 623067, 728092, 742662, 974781, 617011, 617752, 682063, 832322, 1004706, 618626]
17009F18626J12865L54106j58955K43942m42013N05444j06293k61025J29129m79062
16999E16764L51850j24308K56900k52324J71971j35614R6975l51075P61594k39630
16989A053103m32734L31670k32388J31822N0751L37689j97866n7412P4328l8493
16979A020470J50696j73913j0567k19691M50068j19919J00232k38011L5925k20629
16969G74661K82663J93833j77549n7403K50932j60096N3142l11394M30374k14631
16959A064532J02048j42523j02077L64284r1424J50015J72292k90957k50170N9213
16949A035233j5264J51285P3109j2933J07437K33222j43463j85213L58606j82123
16939A419896n54584K75867O20842k98486j279N6198K73116n79905L65682j0705
$$ y = [618626, 731491, 1085597, 926642, 1170584, 728571, 1234015, 1127722, 866697, 995826, 516764, 868614, 744306, 1001206, 748882, 920853, 785239, 882214, 531139, 1292733, 1053103, 620369, 952039, 719651, 851473, 902224, 1239913, 1042047, 984635, 1058963, 1020470, 1171166, 997253, 986686, 766995, 1217063, 1097144, 1197376, 959365, 995290, 774661, 1057324, 1251157, 1073608, 1016205, 1267137, 1107041, 1160183, 848789, 1279163, 1064532, 1166580, 1024057, 921980, 1286264, 1194840, 1344855, 1517147, 1226190, 976020, 1035233, 1019969, 1171254, 1244363, 1231430, 1338867, 1572089, 1428626, 1243413, 1602019, 1419896, 865312, 1141179, 1762021, 1463535, 1462256, 1518454, 1791570, 1211665, 1577347, 1566642]
16929A566642J85135P9182j23860k77941M48859l03568K01489Q6310k48079j19430
16919A494739K58446l44454J90948O9042L94823k49736p9058J97195k67063O2312
16909A727194m24425K31845K6770J02184J75117L3163P0458K09755m50251J87915
16899A889725J79192M8522l54885K89537K80904k52151j42583L34976k7956K18162
16889B463443j91044j34295K39922j47419l2366O0251k21750M30249J60228k25379
16879B401840K27332K38948l15274j46956K79983J11354j36546j9214J64930M2842
16869B849239K732K3124j6473M7503J84092r8044K52938j39032k06729L94607
16859C293957n0899L68873o58602L55022J33608j40270K64306J98347j01940J74770
$$ y = [1566642, 1751777, 1830959, 1707099, 1429158, 1878017, 1574449, 1775938, 1862248, 1614169, 1494739, 1753185, 1408731, 1599679, 1668721, 2063544, 1813808, 1734750, 1931945, 1664882, 1727194, 1302769, 1534614, 1561384, 1663568, 1838685, 1871848, 1942306, 2152061, 1701810, 1889725, 2068917, 2117439, 1762554, 2052091, 2332995, 2080844, 1938261, 2273237, 2245281, 2463443, 2272399, 2138104, 2378026, 2230607, 2198241, 2258492, 2036742, 2466991, 2627219, 2401840, 2629172, 2868120, 2552846, 2405890, 2685873, 2797227, 2660681, 2641467, 2806397, 2849239, 2851971, 2875095, 2858622, 2906125, 3090217, 2992173, 3245111, 3106079, 2899350, 3293957, 3243058, 3611931, 2953329, 3308351, 3441959, 3301689, 3565995, 3764342, 3662402, 3837172]
16849C837172m1338K1502J44735J65729n02886L05964J4456J68307J87065q5308
16839D215398J21524k25379L40121P2736j39241M79629j77914K02442K00379j71912
16829D917783m4261P4427K26569K12000r0916J57248K11897m3646J48511j94687
16819E574925N5632N94882L04320k53458K47223J1953J69795K18106K17903k98233
16809F843048P77217K6039m8027K62839l4607O95830K09152j42583L16632j10231
16799H795309N7062L11259N02335n5243J53402L93832O4517P13739K1167M88933
16789A1446312M63109j78206M45158P8290M60601M46160P77135k3960M73415L28597
16779A4716611O66458K84508M33426O25978M32947N59174N90497N01922P11576
$$ y = [3837172, 3795834, 3817336, 3962071, 4127800, 3624914, 3930878, 3945334, 4113641, 4300706, 4215398, 4336922, 4111543, 4451664, 4524400, 4385159, 4864788, 4686874, 4889316, 5089695, 4917783, 4873522, 4947949, 5174518, 5386518, 5295602, 5452850, 5664747, 5621101, 5769612, 5574925, 5630557, 6225439, 6529759, 6276301, 6523524, 6535477, 6705272, 6923378, 7141281, 6843048, 7620265, 7646304, 7598277, 7861116, 7826509, 8522339, 8731491, 8588908, 8905540, 8795309, 8852371, 9163630, 9665965, 9610722, 9764124, 10157956, 10222473, 10936212, 10957379, 11446312, 11909421, 11731215, 12176373, 12254663, 12715264, 13161424, 13938559, 13914599, 14388014, 14716611, 15383069, 15667577, 16101003, 16726981, 17159928, 17719102, 18309599, 18811521, 19523097]
16770A9523097M82977O40717P87342N45500R45171Q37141P76550J053282P66281
16761B6358058J308548Q16915J497825J131780J058742J236933J595714J474309
16753C6478824J439283J545052K220026J827748J905392J618123K448064K672688
16745E2155200K362491K571379K940303L091344K940572L509448L754783L900342
16737G7225862L883852M330852M508076M705395N036827N241509N568735N190273
16729A15691381N883392N610419N775453N670475N673181N321861N007318M664293
16721A59297773L742830L371414K487515J553051J052426j83847p63799k338823
16713A68218540k429260l108059m140783m823154n220488n694018n512081n397059
$$ y = [19523097, 20006074, 20646791, 21434133, 21979633, 22924804, 23761945, 24538495, 25591777, 26358058, 27666606, 28483521, 29981346, 31113126, 32171868, 33408801, 35004515, 36478824, 37918107, 39463159, 41683185, 43510933, 45416325, 47034448, 49482512, 52155200, 54517691, 57089070, 60029373, 63120717, 66061289, 69570737, 73325520, 77225862, 81109714, 85440566, 89948642, 94654037, 99690864, 104932373, 110501108, 115691381, 121574773, 127185192, 132960645, 138631120, 144304301, 149626162, 154633480, 159297773, 163040603, 166412017, 168899532, 170452583, 171505009, 171321162, 170557363, 168218540, 165789280, 162681221, 158540438, 153717284, 148496796, 142802778, 137290697, 131893638]
16705A31893638o357088n752696n630028n908326n459798n104673n251993m686889
16697H7742147m872476m164395m251830l807020l456229m019468k969258k889207
16689E7312264k721059l027359k277317k295447k346672k159604j921148j611469
16681C8952189k120628j463078j383995j767623j248369j366560j176818j337907
16673B7087211o62383j123490j042114q85669o52601o16157j254541n59276p39499
16664A9551481q14528n82420j97283j374753j02720m75590m38943q28005k04145
16655A4533094l38486j003834k56218l5985n45477n04278j46688k02746k4985
16646A1474397p03957k71196k58830j62174l15617j84031o59561j91146L23370
$$ y = [131893638, 125536550, 119783854, 114153826, 108245500, 102785702, 97681029, 92429036, 87742147, 82869671, 78705276, 74453446, 70646426, 67190197, 63170729, 60201471, 57312264, 54591205, 51563846, 49286529, 46991082, 44644410, 42484806, 40563658, 38952189, 36831561, 35368483, 33984488, 32216865, 30968496, 29601936, 28425118, 27087211, 26424828, 25301338, 24259224, 23373555, 22720954, 22104797, 20850256, 20290980, 19551481, 18736953, 18154533, 17957250, 16582497, 16479777, 16004187, 15565244, 14737239, 14533094, 14194608, 13190774, 12934556, 12898571, 12353094, 11848816, 11702128, 11499382, 11474397, 10770440, 10499244, 10240414, 10078240, 9762623, 9578592, 8919031, 8727885, 9051255]
16637I051255m27289n58036P1344J86500o02768j73694n44085L32799l37361l05178
16627F693487K01777m51381j97317K87568l93026k17215j0544j24750l32025Q0187
16617E536761n7176R9820j58148m54143j858j63214K37624j78963m79982J13947
16607D494668J02445j12123k36910k58601M4789M73356n14012j69010r0140j31084
16597C603378J21734q5694n6152P8124m37311K54285j5976l62158k291j13970
16587B983969N13463o14421K62015j14223l84201L88002j27931J88933n04824
16578B590782P2412l32198K77733L03575l22207Q380R4629m01959J21151j86311
16568B225987O5876M41260r15388N28694q8079k21099N794k17407O88509p32715
$$ y = [9051255, 8623966, 8065930, 8137274, 8323774, 7721006, 7547312, 7003227, 7336026, 6998665, 6693487, 6895264, 6443883, 6246566, 6534134, 6141108, 5923893, 5913349, 5788599, 5456574, 5536761, 5479585, 5579405, 5421257, 4967114, 4965256, 4802042, 5039666, 4860703, 4380721, 4494668, 4597113, 4484990, 4248080, 3989479, 4034268, 4507624, 3993612, 3824602, 3734462, 3603378, 3725112, 3639418, 3583266, 3661390, 3224079, 3478364, 3462388, 3100230, 3097939, 2983969, 3497432, 2883011, 3145026, 3030803, 2646602, 3034604, 2906673, 3095606, 2590782, 2663194, 2330996, 2608729, 2912304, 2590097, 2598477, 2693106, 2291147, 2412298, 2225987, 2291863, 2733123, 1817735, 2346429, 2258350, 2037251, 2043045, 1825638, 2514147, 1781432]
16558A781432K8230L0028J82401j15328O699k49213K78583k27234j38051K90092
16548A867639n462l93699R5176p0763J1499L15156k78922J2842R7490k23505j81278
16537A246173N42659l39027l7582n6716J17074P2218j48860L91108k12227j07825
16527A466995k7399o0036P181p1154j00054k7091j68063M6964K63468l58051M47361
16516A420121k83802K60674k31974m5240l59309j04563O22424k91939P6573l959
16506A059006j43491J45422l82270J79405q9550L01016j04295J44961m19404N0071
16496G40871J49728K48082k76988p4324k8779J77374Q795k85370M53849l04417
16486H08821K15792m00488j33004Q7312K27034K83650k74154L8254l36113K82404
$$ y = [1781432, 1809662, 1839690, 2022091, 1906763, 1913462, 1664249, 1942832, 1715598, 1577547, 1867639, 1862177, 1468478, 1563654, 1492891, 1504390, 1819546, 1540624, 1553466, 1650956, 1427451, 1246173, 1788832, 1449805, 1412223, 1355507, 1472581, 1544799, 1395939, 1787047, 1574820, 1466995, 1439596, 1379560, 1386741, 1315587, 1215533, 1188442, 1020379, 1067343, 1330811, 972760, 1420121, 1136319, 1396993, 1165019, 1119779, 760470, 655907, 1278331, 986392, 1062965, 1059006, 915515, 1060937, 678667, 858072, 768522, 1069538, 965243, 1110204, 690800, 740871, 890599, 1138681, 861693, 787369, 758590, 935964, 944759, 659389, 1113238, 808821, 1024613, 624125, 491121, 578433, 805467, 1089117, 814963, 853217, 517104, 799508]
16476G99508K61126D83601K38066K24190j84636q813j04165J65646k77322K36478
16466G73045k07178M95312k16073j80391J26419m2695k06951R9317j42697k13914
16456B84194N51462l09265m3908L12440k73987L45851D23473J94439j11542j50632
16446C55738K54729k97332M47256k52206J48698J37004B49236M33907J40748j1228
16436H12663k07613O6813j89097J27978R9237B60237L47756k04784l5904k2714
16426C44591L86230r5260k77944L32120j51943m4400K33604l54109m7408J1732
16416C37213R1183j983j05574O5285p8067J07666n2935j37350J480L38643j31843
16405D33718n9271m4033J10189A41625K14257Q6239o5079m266K46533j27645o3344
$$ y = [799508, 1060634, 483601, 721667, 945857, 761221, 752408, 648243, 813889, 536567, 773045, 565867, 1061179, 845106, 664715, 791134, 748439, 541488, 640805, 498108, 284194, 835656, 526391, 482483, 794923, 520936, 866787, 423473, 617912, 506370, 355738, 610467, 313135, 760391, 508185, 656883, 793887, 249236, 683143, 823891, 812663, 605050, 671863, 482766, 610744, 709981, 260237, 607993, 403209, 367305, 344591, 730821, 635561, 357617, 689737, 537794, 493394, 726998, 372889, 325481, 337213, 428396, 426413, 320839, 386124, 308057, 415723, 362788, 225438, 226918, 565561, 433718, 374447, 330414, 440603, 141625, 355882, 442121, 377042, 372776, 619309, 491664, 428320]
16394D28320L5145j24214A49593L37266m2256k2564j73150M6896J57974j20996
16384C32763N7560r1178K93466k47806J18737R89o3848K396j04748K45109R854
16373E53294K36546B93299J50550A26693K75480r445j77136A07406R3350L4385
16363B35141j9115L16193A70516M1999Q6648L3712r6483J18924L3241J32841A19201
16351A00001N7960p3976J91596J99747A87050j9131a26015D91555i9356B61981
16340C70472A9954M21783L469B03440D4730M46962A79799J86450A61474B2911
16329A03711L538K35513j20090L81736g7819A69516J35798J77825A51686C5618
16318A62545p8578M85274B82252E2100Q2470d6577A6218L15181a4656D66898B16744
$$ y = [428320, 463465, 339251, 149593, 486859, 444603, 422039, 248889, 295785, 453759, 332763, 390323, 299145, 592611, 344805, 463542, 464531, 400683, 403079, 298331, 543440, 553294, 789840, 293299, 443849, 126693, 402173, 392728, 215592, 107406, 200756, 235141, 216026, 532219, 170516, 212515, 299163, 332875, 236392, 355316, 388557, 521398, 119201, 100001, 157961, 83985, 275581, 475328, 187050, 167919, -126015, 491555, -99356, 261981, 370472, 19954, 441737, 445206, 203440, 44730, 491692, 179799, 366249, 161474, 22911, 103711, 107249, 342762, 222672, 604408, -77819, 169516, 305314, 483139, 151686, 35618, 162545, 83967, 569241, 282252, 52100, 134570, -46577, 16218, 331399, -14656, 466898, 216744]
16306A83075c6813j2830B0871K28425e8205F14876c0072D5070O7209j3726M48988
16295E47541F1326J37636H0242c811A76472J64259A45186R4162J27386j34896
16285B31838o9833d382C55655a0488C20963L9084q4137B0325K31664I2972K51779
16274C44751C0925P1968K16524F4599M25195k36948A8298f6241I8930J27861O455
16263B33246i5303B95460A33930a32494B32286a58581a2654A71827E5457R5103
16253A50560b6078A33923J87185P0263l3533L3471N9002A56982l5188L32934h7333
16241F8506J00680J27956a17984B08434l1039c3028A22267a21387A10621a03797
16230A43885J82953d5211J6362B04395D7995K78824b8712A05982M2289D74K35838
$$ y = [183075, -36813, -49643, 20871, 249296, -58205, 614876, -30072, 45070, 112279, 98553, 547541, 61326, 198962, 80242, -3811, 176472, 340731, 145186, 239348, 366734, 231838, 162005, -4382, 355655, -10488, 320963, 360047, 275910, 20325, 251989, 92972, 344751, 30925, 102893, 319417, 64599, 489794, 252846, 18298, -66241, 98930, 226791, 233246, -95303, 295460, 133930, -132494, 232286, -158581, -12654, 171827, 55457, 150560, -26078, 133923, 321108, 391371, 357838, 391309, 450311, 156982, 121794, 454728, -87333, 68506, 169186, 297142, -117984, 208434, 177395, -33028, 122267, -121387, 110621, -103797, 143885, 326838, -45211, -28849, 204395, 47995, 326819, -28712, 105982, 148271, 474, 236312]
16219B36312j15668b84239a30001j41590d3141a8378B81575i8240F7188b5808
16208b13458A94968a45938F6392a60987g2545K3738B09504a62347A42331h8568
16197I0271J91124a67874A1681l13P3375a49027C15463j55403K01620A68664d7067
16185d4569C78679a43152I0334j7867P65L7414K2133c619j28779A09016j332L173
16173A10857O2725j9680a58771j24004C04784p3431b51574B92956a68242M9741
16163a18501N1862B31761a61477E9929K0742a10519A82850a87692B63653g5646
16152B75515B7761a38454E5440J93320l5481o1911P5514a31681E9222e969B27523
16140e3123B3549b08650a03320j8354j947D20138h6074F9049b02541E0405a47001
$$ y = [236312, 120644, -284239, -130001, -271591, -43141, -18378, 281575, -98240, 67188, -25808, -213458, 194968, -145938, 66392, -160987, -72545, -48807, 209504, -162347, 142331, -88568, 90271, 281395, -167874, 11681, 11368, 84743, -149027, 315463, 160060, 361680, 168664, -47067, -44569, 378679, -143152, 90334, 72467, 73232, 110646, 132779, -3619, -132398, 109016, 107684, 110857, 173582, 153902, -158771, -282775, 304784, 231353, -251574, 292956, -168242, -118501, -66639, 231761, -161477, 59929, 80671, -110519, 182850, -187692, 263653, -75646, 275515, 27761, -138454, 55440, 248760, 213279, 151368, 226882, -131681, 59222, -5969, 227523, -53123, 23549, -208650, -103320, -121674, -123621, 420138, -86074, 69049, -202541, 50405, -147001]
16128d2744k42736D5408i3480B6350J99981e2546I7173h2405q3057A22838e7159
16116a43872l7619A3844L9408M4217K33675I6722L13580a0442k70430B71775F1157
16104B21564c26721J40161A96497I7343c8990A64298R6655I2762b9873E4427c628
16092A87526a63738a2422B7824J7021a68300B2326e8665A6680a68727B06541e6826
16080a06116e2100B08757j6995J29586h0025k88073i042j55635l47476K33420
16070b78733J03622P532g69B82835c16710A88442c0498B51302a43340k17307a9777
16058H0430e7759B95417g8002j6194A1102L36635a33621A94267a73288H004d9244
16046b45204E1150e6559k9156Q290L633A01526J79078g2143F3015J04441n8771
$$ y = [-42744, -285480, 45408, -93480, 26350, 226331, -52546, 97173, -82405, -165462, 122838, -57159, -143872, -181491, 13844, 53252, 97469, 331144, 96722, 410302, -10442, -280872, 271775, 61157, 221564, -326721, -186560, 196497, 97343, -38990, 164298, 260953, 92762, -29873, 54427, -3628, 187526, -163738, -12422, 27824, 44845, -168300, 22326, -58665, 16680, -168727, 206541, -56826, -106116, -52100, 208757, 191762, 321348, -80025, -368098, -9042, -164677, -512153, -278733, -175111, -167579, -769, 282835, -316710, 188442, -30498, 251302, -143340, -360647, -19777, 80430, -57759, 295417, -78002, -94196, 11102, 347737, -133621, 194267, -173288, 8004, -49244, -245204, 51150, -56559, -85715, -77425, -73792, 101526, 280604, -72143, 63015, 167456, 108685]
16035A08685b41527P090A49461J71831c31562c5317B23765i2256a4185k3364Q075
16024b9474j48346c2780j45712A35972D5655e3831J6892j15702F8023a56784j23513
16013b80297E6497a68031A54830O0934e4001B1981a31165A55166g0505q4729D56110
16001B44860R8800B2465a61971C1201d4786q9102k36728A65211i9344E3468a46918
15989a33775A73157J2063d27655F9207a09764B33170j03551a06871C99879j86344
15979B13535O4033b99584A51240J31181a9694A00873i6497a3438o0065j55432
15969b28935C7313O7160b31080e3679j93700h147o4777e777q335C84213A72940
15957B00255L21834G9723L1723g0456L983A42129o7942b12225m1775I425d0435
$$ y = [108685, -241527, -234437, 149461, 321292, -331562, -35317, 223765, -92256, -14185, -37549, -29474, -177820, -32780, -178492, 135972, 45655, -53831, -36939, -152641, 68023, -156784, -280297, 56497, -168031, 154830, 215764, -54001, 21981, -131165, 155166, -70505, -155234, 456110, 244860, 343660, 22465, -161971, 31201, -44786, -133888, -370616, 165211, -99344, 53468, -146918, -133775, 173157, 185220, -427655, 69207, -109764, 233170, 129619, -106871, 399879, 213535, 277568, -299584, 151240, 282421, -19694, 100873, -96497, -13438, -73503, -228935, 37313, 104473, -231080, -53679, -247379, -8147, -72924, -5777, -14112, 384213, 172940, 200255, 522089, 79723, 111446, -70456, -66473, 142129, 74187, -212225, -254000, 9425, -40435]
15945c42265A21470a23438A97224a48961B56656c7046j30214A24982N2006H8425
15934C1541h6045j57838A13203a91551A01261m5545J44374b17053j28339J69092
15924a76300f3733l34989J80953f179C3765a53149B14273b413E8757B1391M3786
15913F5177c9845j26844A40L5464M3419d9863A57912p2202a64423B68712F6082
15901a33521o9915A46747a28411A4721J08681b40367A61283k8989K7030P0344
15891B29668e2324j60487A58298o778a51512h830n59130a18179B66204a33697
15880c79806R2284Q8544m1638J3310a07275c3484j33345r1213A40040c89226D1651
15868A02099g3620p6237c942k42778h4198r9770G849L2267Q6314R628d441q7548
$$ y = [-342265, 121470, -123438, 197224, -148961, 256656, -37046, -167260, 124982, 176988, 88425, 31541, -86045, -243883, 113203, -191551, 101261, 55716, 200090, -217053, -345392, -176300, -63733, -398722, -217769, -6179, 33765, -153149, 214273, -2413, 58757, 21391, 65177, -39845, -166689, 140, 35604, 79023, -49863, 157912, 85710, -164423, 268712, 66082, -133521, -203436, 146747, -128411, 14721, 123402, -240367, 161283, 132294, 159324, 229668, -52324, -212811, 158298, 151520, -151512, -8830, -567960, -118179, 266204, -133697, -379806, -287522, -198978, -240616, -227306, -107275, -33484, -166829, -258042, 140040, -389226, 41651, 102099, -73620, -149857, -3942, -246720, -84198, -183968, 7849, 40116, 126430, 136058, -4441, -91989]
15856i1989A13121g75k82320i3762n4211A8193a37285F4558J72225a66128I7627
15844B71420C6592A2515a7867j79297p4450A19248c05882a0904j21787c7755B11637
15832f8259C0464b31044A85123p7647b63486Q0726F5904D604a05153m2514B72014
15820i4793c8983j24906c0061m04859b09680i9474l5261j4694j21502A07067a03527
15808d4587a2155j59351j14453j37794a49363i834A64313l4187A5579c7238H205
15796a63205b6973C4353j2726b2171B73890I5676c0158k8072A96073a14902A59910
15784D279J52921a90726Q3451A68082b72779Q6750j57166A64322a23363m2710
15774a66073j31932Q1194B0104A783R307d22975g2023k32209C12041c17890J35523
$$ y = [-91989, 113121, -775, -283095, -93762, -147973, 18193, -137285, 64558, 236783, -166128, 97627, 271420, 36592, 12515, -17867, -197164, -271614, 119248, -305882, -10904, -132691, -37755, 211637, -68259, 30464, -231044, 185123, 107476, -263486, -182760, 65904, 4604, -105153, -147667, 272014, -94793, -38983, -163889, -30061, -434920, -209680, -99474, -134735, -149429, -270931, 107067, -103527, -44587, -12155, -171506, -285959, -423753, -149363, -9834, 164313, 130126, 15579, -37238, 8205, -163205, -26973, 34353, 21627, -22171, 273890, 95676, -30158, -58230, 196073, -114902, 159910, 4279, 157200, -190726, -107275, 168082, -272779, -186029, -343195, 164322, -123363, -166073, -298005, -216811, 20104, 1783, 11090, -422975, -72023, -304232, 312041, -317890, -182367]
15763a82367A36206J62819a95021e3581q942q0178f9155o4841b3670A09467l1364
15752G8103a23275f205E3891a27733B01232l6301a45054k62061I3163M3397d6796
15740A20134E2205j3554M473J54969H9099a78515E29010a62238h937A15987J43334
15729B59321D0516c22517O5498C5094a6100j94125A97445a6836B19a67217A27391
15717g4358D1356J5791i7460j42315a09388q021M8321I8758l733b5767A46509
15705e5068j94905A04318c11137P2954J04520N7679A87065J02935A1568L22376
15695C33944a43175e2451j19857A2965J85547m2756B7238b2867D1209b55034D5569
15683e7969H5621a57009F5486K2563J91277C5761P1541J40795A05839m4790N5366
$$ y = [-182367, 136206, 299025, -195021, -53581, -62523, -142701, -69155, -133996, -23670, 109467, 78103, -123275, -6205, 53891, -127733, 201232, 164931, -145054, -407115, 93163, 136560, -46796, 120134, 52205, 38651, 43124, 198093, 89099, -178515, 529010, -162238, -8937, 115987, 259321, 40516, -322517, -257019, 35094, -16100, -210225, 197445, -16836, 219, -167217, 127391, -74358, 41356, 57147, -97460, -239775, -109388, -117409, -69088, 98758, 95025, -25767, 146509, -55068, -249973, 104318, -311137, -238183, -133663, -75984, 187065, 290000, 11568, 333944, -143175, -52451, -172308, 12965, 198512, 155756, 27238, -22867, 41209, -255034, 45569, -57969, 85621, -157009, 65486, 88049, 279326, 35761, 107302, 248097, 105839, 61049, 116415]
15672A16415a37792k4661N2173A49924h6356M0612l05340c6352l0724B99198b7534
15660e9273k49081A95470J2961b91453a00729g093A4598a90093A55578k7417b62070
15648H3290a99738L32l380L321E810d193j31612J2871H5937k3744b17943A33227
15635C38620d5836A2252a89520I0137O6308a89000g2738e598A4315c46637C7357
15623h4428j38287Q066B1065a54135j6952c2453H5654J40609C0055b28925A12603
15611a68522d2264D1860h5355k6167L9017H936Q049a46761F2594J4764a30957
15599a69922Q3641j54622i0763C40991I9119b53888B22481G0982k0488b13038
15588D9963B3006a56917A78279J8351R1082J28449a50488M2681k1025b7302B83671
$$ y = [116415, -137792, -162453, -110280, 149924, -86356, -45744, -351084, -36352, -67076, 299198, -27534, -59273, -308354, 195470, 208431, -291453, -100729, -7093, 14598, -190093, 155578, 128161, -262070, 83290, -199738, -199406, -202786, -199465, 5810, -4193, -135805, -122934, 85937, 62193, -217943, 133227, 338620, -45836, 12252, -189520, 90137, 156445, -189000, -72738, -5598, 14315, -346637, 37357, -84428, -222715, -214649, 21065, -154135, -171087, -32453, 85654, 226263, 30055, -228925, 112603, -168522, -42264, 41860, -85355, -111522, -72505, 8936, 16985, -146761, 62594, 77358, -130957, -169922, -86281, -240903, -90763, 340991, 99119, -253888, 222481, 70982, 50494, -213038, 49963, 23006, -156917, 178279, 196630, 287712, 416161, -150488, -107807, -128832, -27302, 283671]
15576E6489a57936G2851F3f2911B0183a00836B34696C2071J41364b37648E7300
15564c05240f5620j5920E1907b2714j8815p8674B51944a59057A85365a60078j45131
15553c05209A18927B4467i7652j4483e5390B52770b34144A59467a98188A70413
15542I7194g3652k36690B51166c9633G1907d8142B35248j0590C5020a1440m26686
15531d38126B54585b54847J11893B32645i0664j64577A78651d13384a37210B92652
15520I9747J55750p7048k8053J61510b39690a782G3273a06379C15394r0878c3146
15508E6306c42033F6472b9410k1849J9459r647j35525a2670B00814o8163b07648
15496d01085P6549G3441b45083G3504j6777c13776J55491k03560J78905B53173
$$ y = [56489, -157936, 72851, 63, -62911, 20183, -100836, 234696, 32071, 173435, -237648, 57300, -305240, -65620, -81540, 51907, -22714, -41529, -120203, 251944, -159057, 185365, -160078, -305209, 118927, 24467, -97652, -112135, -55390, 252770, -234144, 159467, -198188, 170413, 97194, -73652, -310342, 251166, -39633, 71907, -48142, 235248, 224658, 35020, -11440, -438126, 254585, -254847, -142954, 232645, -90664, -255241, 178651, -413384, -137210, 292652, 99747, 255497, 178449, 150396, 311906, -239690, -1782, 73273, -106379, 315394, 224516, -33146, 56306, -342033, 66472, -29410, -51259, -31800, -41447, -176972, -12670, 200814, 132651, -207648, -401085, -324536, 73441, -245083, 73504, 56727, -313776, -158285, -361845, -182940, 253173]
15485B28217d79715A55364A6027L15399e9391j91687A50176f5241a0721E01934
15474C33482h0388H9097N3794c13115N264D3174J29253J76861f188j46836M7732
15463a05292E1878k4656b7980G7664J41330G0578a9302n110A94093A7730M02469
15452D20199C9901d179C7403L2852D678a14809B58267d35167A31852F4764a06404
15440B65544J9427g3641i472A56826a68859e5570r4994C17775b43986o6896B01192
15428A63830c11108a4200B38043O8424q1845a01089j6994L6833A33558A46e296
15416d89017h8043C21557M8653A81443J51849A10924h0515l22860a04853A93016
15405a4125B36674a51837B61326G9597h1701A79861a16641K0719G733i8074J9540
$$ y = [228217, -479715, 155364, 16027, 331426, -59391, -251078, 150176, -65241, -10721, 501934, 333482, -80388, 89097, 142891, -313115, -307851, 43174, 172427, 349288, -6188, -153024, -105292, 51878, 27222, -27980, 77664, 218994, 70578, -19302, -24412, 194093, 17730, 420199, 39901, -4179, 37403, 70255, 4678, -114809, 258267, -435167, 131852, 64764, -106404, 265544, 284971, -73641, -9472, 156826, -168859, -55570, -150564, 317775, -243986, -310882, 201192, 163830, -311108, -14200, 238043, 306467, 224622, -101089, -118083, -81250, 133558, 146, -5296, -489017, -88043, 321557, 370210, 181443, 333292, 110924, -80515, -403375, -104853, 193016, -14125, 236674, -151837, 261326, 79597, -81701, 179861, -116641, -95922, 7733, -98074, -78534]
15394g8534J2628j9618D3061O1594c02094E1052e43208a18087B03396j00002h6623
15382E9831b26983c6566J0991A06261b35336C1691i9057j42575g6063I3766c0941
15370E7792d7886A35418a11687a8198m2324B88732b23942A29514M679A6495a49828
15358g4674B2273a28956e7850A82090l5701A1378K99736g7572H0142a13457C78491
15346e27991A1176O057b07745E2778a34750F6386d8420G6679L66653b3179k15957
15335b39136C71155a99882e7690A66726b43660F9070a42810A51002J18306h3171
15324C09769a20993A92892J26337B8984r532N8251N2583c4260I5269e1273G0353
15312B80338A0142a24080C03820g470j3259A29921D0579a35976A93660B3016g854
$$ y = [-78534, -65906, -85524, 43061, 104655, -302094, 51052, -543208, -118087, 203396, 103394, -86623, 59831, -226983, -36566, -25575, 106261, -235336, 31691, -99057, -241632, -76063, 93766, -30941, 57792, -47886, 135418, -111687, -18198, -60522, 288732, -223942, 129514, 134193, 16495, -149828, -74674, 22273, -128956, -57850, 182090, 146389, 11378, 311114, -77572, 80142, -113457, 378491, -527991, 11176, 17233, -207745, 52778, -134750, 66386, -48420, 76679, 443332, -23179, -239136, 371155, -199882, -57690, 166726, -243660, 69070, -142810, 151002, 269308, -83171, 309769, -120993, 192892, 319229, 28984, 19452, 77703, 130286, -34260, 95269, -51273, 70353, 280338, 10142, -124080, 303820, -7470, -20729, 129921, 40579, -135976, 193660, 23016, -7854]
15300A28300B9865a56661B23419D6105J85719q4032L3699k5355a38818A88883
15289A00122L01268b09555p279C6408b51382J22446C50822j69384b42521A99059
15278a48165H623K56246G0383B3232L8077J07537M134C4751K39218A23122l3634
15267H9488C2553a84268B86645F350J45702J59989d7915A69490F1406k5061N9615
15256I5960l5794J26294C2939a02264B93213A17932L8353F011a05024B01318K39071
15245D40389M77805Q18760l37216m0238L95439E83247G3718J69825I7837b07883
15234F3122J2602h6047C59221A68210l4420a13161r3985A87657a61241c2294k4459
15223e6753A71150j1768Q840a87828f9436C5777g7329H1308B7411b22696a08324
$$ y = [128300, 29865, -156661, 223419, 46105, 231824, 147792, 181491, 156136, -138818, 188883, 100122, 401390, -209555, -216834, 36408, -251382, -128936, 350822, 181438, -242521, 199059, -148165, 8623, 264869, 70383, 23232, 61309, 168846, 172980, 34751, 273969, 123122, 89488, 32553, -184268, 286645, 6350, 152052, 312041, -47915, 169490, 61406, 36345, 95960, 60166, 186460, 32939, -102264, 293213, 117932, 156285, 6011, -105024, 201318, 440389, 918194, 1736954, 1399738, 1359500, 1754939, 583247, 73718, 243543, 97837, -207883, 63122, 75724, -86047, 359221, 168210, 133790, -113161, -207146, 187657, -161241, -32294, -56753, 171150, 159382, 168222, -187828, -69436, 35777, -77329, 81308, 27411, -222696, -108324]
15211e4325l96167A37976a11957a1961A29347O8569D1897L27202c46481A5335
15200A131J62951j9780n6183C6225J29628O3905H2200K81661b8276Q812k77972
15189b97436B4447K53457j14926C9848j5035L63702G6473K73172p2789j16167
15179A60689d3637k4699A53922J62868r3410E5465J12429a90752G4558J22742
15169A97300L5548b00441B87206j6915k339G5644K10175c281k50626A63023C1566
15157A82422b593q5745c0835A54535K47960A55795J35290G4646l3983J10981N2122
15146B03766j5955J84021C6363b7565A42687C4960b7352k9602F7199K80707p0101
15135B77805b9770D3789a04507A70759D0714R1598L8695b53920E46973H3933b9879
$$ y = [-54325, -450492, 137976, -111957, -11961, 129347, 197916, 41897, 369099, -346481, 15335, 1131, 164082, 144302, 88119, 36225, 165853, 229758, 82200, 363861, -28276, -19464, -297436, 24447, 277904, 162978, 39848, 24813, 388515, 76473, 349645, 276856, 160689, -43637, -68336, 153922, 316790, 223380, 55465, 167894, -190752, 74558, 197300, 232848, -200441, 287206, 270291, 267952, 75644, 285819, -3281, -253907, 163023, 31566, 182422, -2593, -88338, -30835, 154535, 402495, 155795, 291085, 74646, 40663, 151644, 203766, 187811, 371832, 36363, -27565, 142687, 34960, -27352, -56954, 67199, 347906, 277805, -29770, 43789, -104507, 170759, 40714, 132312, 171007, -253920, 546973, 83933, -29879]
15123g6494I0761l0906J81141m9472B9052K21949J5364k0366H3391g8828K2220
15112e6608A90057b94774F2363J96143K56023f3143A81425R1162b14508D4193
15101E2608K06369n9735I1234L3604J38405J24935A21347n1633M7003L56796j12871
15090C60642G5296o117R2436C08J87203I2567L15218F8633L76411A72302K92224
15079D64526A02237P9561M826b10800B44446m9745P1242j15432J10828a6839A59174
15067a1671C15214p5176J53669l4101d7687C96662j20196m4324p3029J43431j6122
15056B86422O5047F1400a13066c2863A03880N3767J04858D4940N9754k0870K10085
15045B93909j18090b09924A05485A7803R8537a4395A90228H6453K59287i1777
$$ y = [-76494, 90761, 59855, 240996, 191524, 29052, 251001, 266365, 245999, 83391, -78828, -56608, 190057, -294774, 62363, 258506, 514529, -63143, 181425, 272587, -214508, 44193, 52608, 258977, 199242, 91234, 124838, 263243, 388178, 121347, 69714, 116717, 473513, 360642, 75296, 69179, 161615, 308, 187511, 92567, 407785, 68633, 445044, 172302, 464526, 102237, 181798, 186624, -210800, 244446, 194701, 265943, 150511, 261339, -16839, 159174, -11671, 315214, 240038, 393707, 359606, -47687, 396662, 276466, 232142, 159113, 302544, 286422, 351469, 61400, -113066, -32863, 103880, 157647, 262505, 44940, 104694, 83824, 293909, 175819, -209924, 105485, 17803, 116340, -14395, 190228, 86453, 345740, -91777]
15034B41835P1993A28019J71233G6128O9204K5885J92255R0168k21287M6227k9498
15023B49082j00523J38552H9840K94969o5727f8717B60000n9485k9865j1073J7790
15012A77367P191a17494b6241I1929K08121j16987J94301c30718B36129Q1531
15002C17660o4707J47948e2181B63215k5714A07962n3146M05477j82400p7571
14992B00322a26745D03461A18231D4322J7920P2727l4912K43721j42720B7988
14981C99595A16979k7021L98055E5318K07866N5393K1629I4307b8471B97641J97967
14970D95608k12520Q0598C8562K41950A29682D0982j4505J77791r8884N046L33559
14959D43989q0488F0941L31353o0840O733R5080j83549J22184A71130J09326L606
$$ y = [241835, 313828, 128019, 299252, 76128, 145332, 171217, 363472, 453640, 232353, 278580, 249082, 148559, 287111, 89840, 384809, 319082, -68717, 260000, 200515, 170650, 159577, 177367, 184558, -117494, -26241, 91929, 300050, 183063, 377364, -330718, 236129, 317660, 252953, 400901, -52181, 263215, 237501, 107962, 54816, 460293, 277893, 200322, -126745, 403461, 118231, 44322, 62242, 134969, 100057, 343778, 201058, 27988, 399595, 116979, 89958, 488013, 55318, 263184, 318577, 340206, 94307, -28471, 297641, 495608, 283088, 363686, 38562, 280512, 129682, 40982, 26477, 204268, 105384, 110430, 443989, 363501, 60941, 392294, 331454, 338187, 433267, 249718, 371902, 171130, 280456, 284062]
14948B84062K10213j82242m1110A01004J35836j06772K67152J5123A11150J31213
14938B42363M6336k178k7707Q0317c9923C97509K40740B50250J65001A21798L09615
14927D31413R1922J6564B23093J18275r9635J26832L48992C36713O3966N8398
14917D59077D3741J01536J09364j10826L81173Q590B29907j00956c4929B55255
14906C00931b9987A51723J55195J95371A38458J70608M35702C05936j05020M56125
14896F57041l06769K5245R4695J4200J10453B56583M1131r1619k8312M6862Q1642
14885C06287K4706p3493o6729J13536N4686K05429j40028K03545k72314A61219
14874B24346l7065K79611p9617j78187J22824j53778K15483m1448f3443B29500
$$ y = [284062, 494275, 312033, 270923, 101004, 236840, 130068, 397220, 412343, 111150, 242363, 288699, 286521, 258814, 339131, -39923, 397509, 638249, 250250, 415251, 121798, 431413, 523335, 539899, 223093, 341368, 241733, 368565, 717557, 336713, 400679, 459077, 43741, 145277, 254641, 143815, 524988, 533578, 229907, 128951, -34929, 255255, 300931, -29987, 151723, 306918, 502289, 138458, 309066, 744768, 305936, 200916, 657041, 350272, 375517, 470212, 484412, 594865, 256583, 297714, 206095, 177783, 224645, 306287, 330993, 257500, 190771, 304307, 358993, 564422, 424394, 627939, 355625, 161219, 224346, 187281, 466892, 387275, 209088, 331912, 178134, 393617, 352169, -63443, 229500]
14863C08266j00239M27147j06817j56306j33522K86N29011c4678B03067A6551
14852C11453A19383K06011J21919G8461N79336k97092K91555J71623j62167j90017
14842D71699K5110r3133j04625K98857R144k95970O7635J87636R4242k93332M76504
14831H43767m12719J72271o5298l9905k37802Q6914K940k0016l2485Q6059I9439
14819D69750K21082j96631J36896B74012J93294p7675J31948n7771j20595J61389
14809E04602P9214M055j94004K40644n2895R3445N1186k00794B57343K11305M7521
14798E16169K65468q5110k01445R553K29132j51381J38976j25779J63136B75885
14787G76671j48968J2720p1771O0044j66101K53949j43417K7127J70024k61337
$$ y = [308266, 208027, 635174, 528357, 372051, 238529, 238815, 767826, -34678, 203067, 16551, 311453, 119383, 325394, 447313, 78461, 657797, 360705, 652260, 823883, 661716, 471699, 496809, 403676, 299051, 597908, 607052, 311082, 378717, 566353, 660595, 367263, 843767, 431048, 603319, 538021, 498116, 260314, 347228, 350168, 330152, 297667, 383726, 99439, 469750, 690832, 494201, 631097, 274012, 467306, 389631, 521579, 463808, 343213, 504602, 583816, 587871, 393867, 634511, 581616, 675061, 726247, 525453, 257343, 468648, 516169, 781637, 696527, 495082, 504635, 733767, 582386, 721362, 595583, 758719, 275885, 776671, 627703, 640423, 568652, 628696, 462595, 716544, 573127, 600254, 770278, 508941]
14777E08941J83021l34264O8231L43028l55315J04526K31344C19581M50919C65748
14766D37858j68213K79207j04218L8362r4188J32490J52863n2245r5068K66467
14756G93315j33036j71004O89122E13772q993j04673K65434N1931r218O1520J17196
14745H86969J96557E31479L27221C73712M71475l42665L00808N1333k11941j62915
14735D79807J54190j9170J86651k07250q7669J20941M19968m67704L19366k03668
14725F95462K29791Q230j65825j39847J14800O2443j00742j08880J06707J47822
14715H49961j00894m2635J5683K02504D53612N03387q2237k00186L37180j33157
14705H78599J45782l52931K00880j6564L61279n55389j15716L34096k89358L94697
$$ y = [508941, 691962, 357698, 425929, 768957, 413642, 518168, 749512, 319581, 770500, 365748, 437858, 269645, 548852, 444634, 482996, 388808, 521298, 674161, 621916, 526848, 793315, 660279, 489275, 1178397, 513772, 504779, 400106, 665540, 717471, 708253, 769773, 886969, 1083526, 531479, 858700, 373712, 845187, 502522, 803330, 854663, 642722, 479807, 633997, 614827, 801478, 594228, 506559, 627500, 1047468, 579764, 899130, 695462, 925253, 933483, 767658, 627811, 742611, 805054, 704312, 595432, 702139, 849961, 749067, 706432, 722115, 924619, 453612, 956999, 874762, 674576, 1011756, 878599, 1024381, 671450, 872330, 855766, 1217045, 661656, 545940, 880036, 590678, 985375]
14695I85375j04786j37856J07686j88941K27738J36403j63695p9188q4501L58374
14685A056609k65142P8070J99310n6907j89890j09600r4895K84889K49938M60545
14675A612927n14099J72973l9711n15581L31199K8698k6253l51673k2660L76855
14665A052675K0180J08777m42006O29201n54246P787M9086L0643J257N11872m48597
14654I66629J82917M4424J31002m26360N98K38175J1041j09766L45966m64664
14644I19962J33400J24836K05135l12953L40373J17038n32154K35139N1915J52084
14634A434775j71373m9192q6399L40370j94325q8609K26260J11514l36254J44917
14624A331684J4989N962l3210K85861l58426K77986j35481k7206K15218O982P4684
$$ y = [985375, 880589, 742733, 850419, 661478, 889216, 1025619, 861924, 782736, 698235, 1056609, 791467, 869537, 1068847, 1011940, 822050, 712450, 617555, 902444, 1152382, 1612927, 1098828, 1271801, 1232090, 716509, 1047708, 1076406, 1050153, 698480, 675820, 1052675, 1072855, 1181632, 739626, 1368827, 814581, 822368, 871454, 902097, 903354, 1415226, 966629, 1149546, 1193970, 1324972, 898612, 899210, 1137385, 1148426, 1038660, 1384626, 919962, 1053362, 1178198, 1383333, 1070380, 1410753, 1527791, 995637, 1230776, 1282691, 1434775, 1263402, 1214210, 1127811, 1468181, 1273856, 1185247, 1411507, 1523021, 1186767, 1331684, 1346673, 1352635, 1319425, 1605286, 1246860, 1524846, 1389365, 1362159, 1577377, 1584359, 1659043]
14613A659043j28348M5884k65176q9403J11444J22596l86980O80574l00592j15316
14603A333726J27920L5881J39140J8478k70891j104K54601K68384l68905K79078
14593A816308k16151Q5724L06386l49995K49627m49099J14740N2950M07909K11373
14583B229772m37170J01312K956M956k44818K27087M10559n63539L50849J71031
14573B252995l85708R8841O5987L19119k86418J23895K38836m66497N08111l74548
14563B094613K32365J4318K33007k2603j04357L04793k24834j52673L68020N34664
14553C277313J78400K99797N68998P16927J817609L697799Q985451J9361897J2600965
14544E1505156A8809768H009885l665425J24733J675630k757172j105462l48946
$$ y = [1659043, 1530695, 1576579, 1311403, 1222000, 1333444, 1456040, 1069060, 1749634, 1449042, 1333726, 1461646, 1497527, 1636667, 1655145, 1384254, 1383150, 1637751, 1906135, 1537230, 1816308, 1600157, 1685881, 1992267, 1642272, 1891899, 1442800, 1557540, 1610490, 2018399, 2229772, 1792602, 1893914, 1896870, 1901826, 1657008, 1884095, 2294654, 1731115, 2081964, 2252995, 1867287, 1966128, 2032115, 2351234, 2064816, 2188711, 2427547, 1961050, 2469161, 2094613, 2326978, 2341296, 2574303, 2551700, 2447343, 2752136, 2527302, 2374629, 2742649, 3277313, 3455713, 3755510, 4324508, 5041435, 6859044, 10556843, 19542294, 38904191, 51505156, 18809768, 8009885, 4344460, 4469193, 6144823, 3387651, 2282189, 1933243]
14536A933243n3571j17399M83116K19509o46772N4025n7828J60793K66316J37161
14526B378593q1090l2496j4098K29329J37936l02430J37107j07029r091M08620
14516B745351k56344K76456k11226K33084K74160m52756K07356o057r1125L7614
14506B756513j02028o4626K03339L68952j10253m42289J95822K13496L488N3801
14496C076215M142L95287k89271O8496L20460k42068k3067q6900K12961L04183
14486C740438k72003L91687m5885k14086j06454J09389R2125N53818n75270J09257
14476C783016M13070k63439J49249j03939J44691n0807j08625k1182J77703J72546
14466D292283j86240O4734K68635M55614n71396J98821K87377l86102R8161L88407
$$ y = [1933243, 1879672, 1762273, 2245389, 2464898, 1818126, 1872151, 1814323, 1975116, 2241432, 2378593, 2297503, 2265007, 2250909, 2480238, 2618174, 2315744, 2452851, 2345822, 2336731, 2745351, 2489007, 2765463, 2554237, 2787321, 3061481, 2608725, 2816081, 2810024, 2718899, 2756513, 2654485, 2589859, 2793198, 3162150, 3051897, 2609608, 2805430, 3018926, 3022414, 3076215, 3080357, 3475644, 3186373, 3254869, 3575329, 3333261, 3310194, 3223294, 3436255, 3740438, 3468435, 3860122, 3814237, 3600151, 3493697, 3603086, 3695211, 4249029, 3673759, 3783016, 4196086, 3932647, 4081896, 3977957, 4122648, 4071841, 3963216, 3942034, 4119737, 4292283, 4106043, 4170777, 4439412, 4895026, 4323630, 4522451, 4809828, 4423726, 4521887, 4910294]
14456D910294J1710J47967n9063J57489p7017j07820K89611m9601J20745J46381
14446E490696j13679P9159j3259L33664j40217O1260J8076J04163L1179Q2006
14436E933048K29572L24397N3261l44117M20585J57861R3766J27904q2472J22131
14426G035936J30298J59861k96505N1517L05421J84517k6619K98871J97047N41890
14416H582234j55471j58221J90492n2634j43444O11376q7164M25797N2122l49677
14406H915410M90724N0315N7803L93855K46954L5525j8026M06515j340K94422
14396A0872157K07745M18417j39633j67415M82223r7637L79076L16541K5396l7093
14386A2259777K97209N89394o550K03431N60738N6626N04384j08796N20369r2574
$$ y = [4910294, 4922004, 5069971, 5010908, 5168397, 5091380, 4983560, 5273171, 5223570, 5344315, 5490696, 5377017, 5456176, 5442917, 5776581, 5636364, 5697624, 5715700, 5819863, 5851042, 5933048, 6162620, 6487017, 6540278, 6196161, 6616746, 6774607, 6868373, 6996277, 6913805, 7035936, 7166234, 7326095, 7029590, 7081107, 7386528, 7571045, 7544426, 7843297, 8040344, 8582234, 8426763, 8268542, 8459034, 8406400, 8262956, 8874332, 8787168, 9212965, 9265087, 8915410, 9406134, 9456449, 9514252, 9908107, 10155061, 10190586, 10172560, 10579075, 10577735, 10872157, 11079902, 11498319, 11358686, 11191271, 11673494, 11575857, 11954933, 12271474, 12296870, 12259777, 12556986, 13146380, 13139830, 13343261, 13903999, 13960625, 14465009, 14356213, 14876582, 14784008]
14376A4784008N04562L54109L27431M47895O7085J80677N71109K00230J89952
14367A7627058O78609M72141J53121M22000L78714N46215L48601L52541N47868
14358B1526868L75298N24343O84758O20457M19154Q48587O2396R97870K93868
14349B6353599Q93177O73933N51786R18715P84260P06555J042934N51731R74126
14340C3450816Q36352P87385R66412J091026R17547J308037J302989J146538J239263
14331D3046365J025961K043156J132868J503212J558281J378308K112729J693845
14323E5494725J925081K181881J749396K249289K058803K552614K772740K885624
14315G3870153K662725K997568L029921L604083L208585L796640M005220M125824
$$ y = [14784008, 15288570, 15642679, 15970110, 16418005, 16485090, 16665767, 17236876, 17437106, 17627058, 18305667, 18777808, 18930929, 19352929, 19731643, 20277858, 20626459, 20979000, 21526868, 21902166, 22426509, 23111267, 23731724, 24150878, 24999465, 25061861, 26059731, 26353599, 27246776, 27920709, 28472495, 29391210, 30175470, 30882025, 31924959, 32476690, 33450816, 34287168, 35074553, 36040965, 37131991, 38049538, 39357575, 40660564, 41807102, 43046365, 44072326, 46115482, 47248350, 48751562, 50309843, 51688151, 53800880, 55494725, 57419806, 59601687, 61351083, 63600372, 65659175, 68211789, 70984529, 73870153, 76532878, 79530446, 82560367, 86164450, 89373035, 93169675, 97174895, 101300719]
14307A01300719M539551M781315M682960N783225N198678O296482N820060P152502
14299A45555492O681787P447817P638444Q742210Q375047R484513R674082J0561038
14291B14160430J1264136J1674722J2298965J2706446J3681205J3483188J4965399
14284C04234491J4826398J5232543J5027032J5723817J5341468J5083341J4202346
14277D09671436J3392377J2297044J0751944Q639587L996487M64081M37543p84278
14269D58866221J435257m746935m192432n696276q602063j1249896j2388408j3380426
14261D00045042j4739569j5450790j6028828j5696082j5928769j5366498j5174227
14254B91660279j4330119j3932657j3571826j1528850j1708234j1621648j0706537
$$ y = [101300719, 105840270, 110621585, 115304545, 121087770, 126286448, 132582930, 138402990, 145555492, 152237279, 159685096, 167323540, 176065750, 184440797, 193925310, 203599392, 214160430, 225424566, 237099288, 249398253, 262104699, 275785904, 289269092, 304234491, 319060889, 334293432, 349320464, 365044281, 380385749, 395469090, 409671436, 423063813, 435360857, 446112801, 454752388, 458748875, 459212956, 459650499, 458866221, 460301478, 455554543, 451362111, 445665835, 437063772, 425813876, 413425468, 400045042, 385305473, 369854683, 353825855, 338129773, 322201004, 306834506, 291660279, 277330160, 263397503, 249825677, 238296827, 226588593, 214966945, 204260408]
14247B04260408j0513334r892226q733234p985005p915100p857803o940119p322877
14239A37100710o355947n228577n469772n077151n186877m648184m922007l832568
14231I6379627l070327l969014l452421l532925l325793k743320l275228k293310
14223G0717289k412136k639845k254724k322544j863812j887207k385750j642699
14215E3308572j544518j711275p67948j734234j691390j409743j283601j450357
14207D1715506k67939j414109j154956j318427r33183j032800j057389k52248
14199C4284455j793088n97857n69311j391608j38810p96212m55110p56065q87923
14190B6898471o17241l06045p67667n60676q89258k46114l90102p34651n07431
$$ y = [204260408, 193747074, 183854848, 175121614, 167136609, 159221509, 151363706, 144423587, 137100710, 130744763, 125516186, 120046414, 114969263, 109782386, 105134202, 100212195, 96379627, 93309300, 89340286, 85887865, 82354940, 79029147, 76285827, 73010599, 70717289, 68305153, 65665308, 63410584, 61088040, 59224228, 57337021, 54951271, 53308572, 51764054, 50052779, 49284831, 47550597, 45859207, 44449464, 43165863, 41715506, 41447567, 40033458, 38878502, 37560075, 36626892, 35594092, 34536703, 34284455, 32491367, 31893510, 31324199, 29932591, 29793781, 28997569, 28542459, 27786394, 26898471, 26281230, 25975185, 25207518, 24646842, 23757584, 23511470, 23121368, 22386717, 21879286]
14181B1879286j43104j006747r4328m95435n32886l74945n52138j19925n04259
14172A8055519l06010o20417j44096l43547k37146n9547k14070o89157Q5573k37164
14162A5289938j84176n90222l02099k47810k61479j43470l43179l02855R7434
14153A3012082l39563k38512r0428o34510M18212o71411K23135m12481m09185
14144A0857339J23459k84447j65754l06799m7545N1652l02126m14131J05089r6471
14134I520266K05280o05002j44556k40006L52356m87279P3844m07862L51447m51775
14124H166713J44228m83238L32307l58158n0421l67135j46481L558R489k2329
14114G228533l01970j16359k20693L83195j15951p7011l29129k23184Q8916K63218
$$ y = [21879286, 21736182, 20729435, 20635107, 20139672, 19606786, 19231841, 18679703, 18559778, 18055519, 17749509, 17129092, 16984996, 16641449, 16404303, 16344756, 16130686, 15441529, 15527102, 15289938, 15105762, 14515540, 14213441, 13965631, 13704152, 13560682, 13217503, 12914648, 13012082, 12672519, 12434007, 12343579, 11709069, 12127281, 11455870, 11679005, 11266524, 10857339, 10980798, 10696351, 10530597, 10223798, 10176253, 10227905, 9925779, 9511648, 9616737, 9520266, 9725546, 9120544, 8975988, 8735982, 9088338, 8601059, 8674903, 8267041, 8618488, 8166713, 8310941, 7827703, 8160010, 7801852, 7751431, 7384296, 7237815, 7241373, 7250862, 7228533, 6926563, 6810204, 6589511, 6972706, 6856755, 6779744, 6450615, 6227431, 6316347, 6579565]
14104F579565m75185P293M1856k59963j52451J36130m8148j24005j42481k46555
14094E316056K64991l1638k97754O8378k30294L72523l56366K74419n03690J2237
14084D888862R7730p1583l5156J00360j87820n08073M61570j46911j40241m6455
14074D412283j88888L16675p1733k42575m3976r3805m3151j11817J34905j43243
14064C924675q7234J36314Q0734k4157j47534k92587j07173R5225J80908L35971
14054D095142o97163J28718O7923J3993j13149K25428k78229L6059j4652k741
14044C461329m11669J69752j00821M9577K26509m20365M37591o71568K54040J57780
14034C152155J7009j58652j69712J78505L02785l28512o0996J98984l64525j28785
$$ y = [6579565, 6104380, 6111673, 6153529, 5893566, 5741115, 5877245, 5829097, 5705092, 5562611, 5316056, 5581047, 5549409, 5251655, 5320033, 5089739, 5462262, 5105896, 5380315, 4876625, 4888862, 4986592, 4915009, 4879853, 4980213, 4792393, 4284320, 4745890, 4598979, 4458738, 4412283, 4223395, 4540070, 4468337, 4225762, 4181786, 4087981, 4044830, 3933013, 4067918, 3924675, 3837441, 3973755, 4054489, 4030332, 3882798, 3590211, 3483038, 3578263, 3759171, 4095142, 3397979, 3526697, 3594620, 3608613, 3495464, 3720892, 3442663, 3478722, 3464070, 3461329, 3049660, 3219412, 3118591, 3168168, 3394677, 2974312, 3411903, 2740335, 2994375, 3152155, 3169164, 3010512, 2840800, 3019305, 3322090, 2993578, 2932582, 3131566, 2767041, 2638256]
14024B638256K83855j48709J17817n04718J33651M69954m83840j97557p547K0847
14014B322009n9068N11443m54104K87235q2135j19310j54420k41546J99285j36802
14004B072587M0310j88787L75817n32770M08998k02267j49077L10764j27386k27732
13994A780457K37349k73759j53360J99104L52174N56993K772107O080824J8240962
13985B9792851K5163956B6665380j3254377n175221k416960j068155o27623l16002
13977C807042o31135m9154n8420l58162r895l5649l31587K38734J25019k85331
13967B411462J10286k42912J53980m3037k22986o9242K08828q1676J05100m45672
13957A884131j90716K24699O5416q9923n3673K49068j80885j93543M1362r7214
$$ y = [2638256, 2922111, 2773402, 2891219, 2386501, 2520152, 2990106, 2506266, 2308709, 2301162, 2322009, 2262941, 2774384, 2320280, 2607515, 2525380, 2406070, 2251650, 2010104, 2209389, 2072587, 2112897, 1924110, 2299927, 1767157, 2176155, 1973888, 1824811, 2135575, 2008189, 1780457, 2017806, 1744047, 1590687, 1789791, 2141965, 2698958, 5471065, 11551889, 29792851, 54956807, 26665380, 13411003, 8235782, 5818822, 4750667, 4123044, 3807042, 3175907, 3126753, 3068333, 2710171, 2700276, 2664627, 2333040, 2571774, 2696793, 2411462, 2521748, 2278836, 2432816, 2389779, 2166793, 2097551, 2306379, 2224703, 2329803, 1884131, 1693415, 1918114, 1983530, 1893607, 1839934, 2089002, 1908117, 1714574, 1755936, 1658722]
13947A658722O0881J30510k93401m472K85603r3370J09121m87609M7911K73201
13937A687097K54992k98333R8210J28078k93397n3670J70638L7021J05067K26260
13927B061963m36005k7450J00297l56387N54452k11580j78953j03523L79266o1272
13917A720808l15934J03060k67419K87301k11398K79109k16932R6736k58820J61118
13907A377629j56559K93602n8746o9125O247K6186J92717m05024L62647m58354
13897A111220K60613K11342k84465m4155q1829K73198k82475J49979j16815j11030
13887A085583N2661O1516m6716M7929m52941O20280k4051j72937k28337P2692
13877A015679N1891r2874L18632k82378J86112K37921k04350m5420j11283M6135
$$ y = [1658722, 1719603, 1850113, 1556712, 1552240, 1837843, 1744473, 1853594, 1365985, 1413896, 1687097, 1942089, 1643756, 1741966, 1870044, 1576647, 1522977, 1693615, 1730636, 1835703, 2061963, 1625958, 1598508, 1698805, 1342418, 1896870, 1685290, 1506337, 1402814, 1782080, 1720808, 1404874, 1507934, 1240515, 1527816, 1316418, 1595527, 1378595, 1475331, 1216511, 1377629, 1221070, 1514672, 1455926, 1386801, 1393048, 1419234, 1611951, 1206927, 1569574, 1111220, 1371833, 1583175, 1298710, 1254555, 1172726, 1445924, 1163449, 1313428, 1196613, 1085583, 1138244, 1199760, 1153044, 1200973, 748032, 1368312, 1344261, 1171324, 942987, 1015679, 1067570, 974696, 1293328, 1010950, 1197062, 1434983, 1230633, 1185213, 1073930, 1120065]
13867A120065R4298K6239q5430p5779J90208k88774P0768j1752J42916k78282
13857I04477J29565N8185K19655n08928K60765l47150L12767R9140j45433J06673
13847A089716J64701l2999l85020l16908N66628j03513P1501j25345k0756m3016
13837H64989j7059j66640K47200l8256K28057J91051n37779O2193N9310L33983
13827A227049m78220k38654N67404j21941m33762J41528L58361j06303J2454n9272
13817H68644J57734J19701m30456k19332L99690l7906o3107r1749n1837K28326
13807H79708k85934J40052R79O9055J37017P0459j67874l2633j20872L69947l55325
13796G04579J32671J11227j80718j37045J96425R2800q807O1666l80579J23596
$$ y = [1120065, 1214363, 1240602, 1155172, 1079393, 1269601, 980827, 1051595, 1039843, 1182759, 904477, 1034042, 1092227, 1311882, 802954, 1063719, 716569, 1029336, 1128476, 983043, 1089716, 1254417, 1221418, 836398, 519490, 1086118, 982605, 1054106, 928761, 908005, 864989, 847930, 681290, 928490, 890234, 1118291, 1309342, 771563, 833756, 893066, 1227049, 748829, 510175, 1077579, 955638, 521876, 663404, 1021765, 915462, 927916, 868644, 1026378, 1146079, 715623, 496291, 895981, 858075, 794968, 703219, 651382, 879708, 593774, 733826, 734805, 803860, 940877, 1011336, 843462, 810829, 689957, 1059904, 704579, 837250, 948477, 767759, 630714, 827139, 919939, 911132, 972798, 592219, 715815]
13786G15815l6243R5876k7530K00739r4986M55847B82898K84449L3835J37942
13776G39124m6709j799k23869K00225l9797o2847K18121j19126R1459L41789m61941
13765F34630K25222C88284J09493j2961K72930J28441k62076J3248J10440j78040
13755E69759K96761k06914L17885M0635n04157K93536m7880j57949J71760j44205
13745F29231J17787k87669J55013L11673m24323J3754K44279B94402L31064q0183
13735E45283B33584J51453L58174j23893J33355J56786D44001J33560K90825C83919
13724D91570m6826R1800p1027J21351j87641J65264r2513n9731o1119K37281m4582
13713E43827K988K39915q322B13908J80931N53853D35344r4850K3510n0822K23216
$$ y = [715815, 679572, 775448, 747918, 948657, 853671, 1309518, 282898, 567347, 601182, 739124, 692415, 690616, 466747, 666972, 627175, 564328, 782449, 663323, 754782, 1096571, 634630, 859852, 388284, 497777, 484816, 757746, 886187, 624111, 637359, 747799, 569759, 866520, 659606, 977491, 1018126, 513969, 807505, 759625, 601676, 773436, 629231, 747018, 459349, 614362, 926035, 501712, 515466, 759745, 294402, 625466, 545283, 233584, 385037, 743211, 619318, 752673, 909459, 444001, 577561, 868386, 383919, 491570, 444744, 536544, 465517, 586868, 399227, 564491, 471978, 412247, 351128, 588409, 543827, 546815, 786730, 778408, 213908, 394839, 948692, 435344, 340494, 364004, 313182, 536398]
13702E36398P2617k3577o3453K00211P2655j89975A53097L81589J32975j76669
13692D90992N1768j1161J43002p4377N2161k18135M1272J88496J25729q6309J51584
13681H55022l92377J84454j56927j62917P9233R5476j86054J39348j28679r1773
13671B34806K44616l7822O4741J720j17967A60042M56539j17288J51921j92037
13661D59177L4869Q7311j64990j08819K00713j93880L17338r1693B05817M64176
13651F69993A56433B8406L31465A46495P04866l83842j12300A71762O24855n3284
13641G43333l39980A36948K21905O3368F7190K50040K98344j81350J10054k44399
13631B99879O790J70590A31479M98640L7931k60910j86376I2779M23475A67704
$$ y = [536398, 609015, 585438, 521985, 722196, 794851, 604876, 153097, 534686, 667661, 490992, 542760, 531599, 674601, 600224, 652385, 434250, 475522, 664018, 789747, 703438, 855022, 462645, 647099, 490172, 327255, 406488, 501964, 315910, 455258, 326579, 234806, 479422, 441600, 506341, 508061, 390094, 160042, 616581, 499293, 651214, 459177, 494046, 581357, 416367, 307548, 508261, 314381, 631719, 540026, 205817, 669993, 156433, 28406, 359871, 146495, 851361, 467519, 355219, 171762, 796617, 743333, 403353, 136948, 358853, 422221, 67190, 317230, 615574, 434224, 544278, 299879, 306669, 477259, 131479, 630119, 668050, 407140, 220764, 92779, 516254, 167704]
13620C12637J47509P2681M5150N885A97743L30366J7481D9184N31351j63138j99223
13609B18174M2059r803K98595A53229d4574C87112O4533j32048J49541j87292
13599B81846d4635E51609j48806R8541B28498l3953K69306j07400B3643L45580
13589C69223A83058R3504R4027L84658A36694J47339L11539I4545K89909a00829
13578C62372K02149B0997L04026K7530J23496B00632J65700R594r5648L13093
13568E93371K26979B45829K0291q3931M2663J63711j89648L5024k3006J08153
13558C19086A25071M7387J71327o6585p554j7053A21445k965K18565J97574r3811
13547D40808j03197A44441N6560L43620j78786O5082j1616j89239L21935B23108
$$ y = [312637, 460146, 532827, 577977, 583862, 197743, 528109, 545590, 49184, 580535, 417397, 218174, 260233, 250430, 549025, 153229, -44574, 387112, 451645, 319597, 469138, 281846, -44635, 551609, 402803, 501344, 228498, 194545, 463851, 356451, 23643, 369223, 183058, 276562, 370589, 755247, 136694, 284033, 595572, 94545, 384454, -100829, 362372, 564521, 20997, 325023, 352553, 476049, 200632, 366332, 375926, 280278, 593371, 820350, 245829, 266120, 182189, 224852, 388563, 198915, 233939, 210933, 319086, 125071, 172458, 343785, 277200, 269646, 252593, 121445, 118480, 337045, 534619, 440808, 337611, 144441, 201001, 544621, 365835, 430917, 419301, 230062, 551997, 223108]
13536A76003J17785J9538O7692j88662N1732J63603m9462k9340M4264A70929p2481
13525I8448O4712k9894K99000l3849j21087j1393q8824g019E73150j52300j12140
13514C08710M4065r3233j03225J35513J74257p7705A33J54680K18064j66160K82593
13503D89310B08249d813B63367r5047A0914M26366H7261J55808L8962f1811D8787
13491D13998m8881j52304a13937E75852q899f567D13848Q9155E7678k7888L29528
13480C59318Q749A58870J01394F9193Q7021a60427D60069B24550J85222r2877
13470C16895q3981J00830A44934n213M8373A810N12302k47227O6573a76949B75784
13458C11468J86083j15639A35268a86840A91201r2060k5424k5867J08285P1027
$$ y = [176003, 293788, 313326, 381018, 192356, 244088, 407691, 358229, 328889, 373153, 170929, 98448, 163160, 133266, 432266, 398417, 277330, 265937, 177113, -7019, 573150, 420850, 308710, 352775, 259542, 156317, 291830, 466087, 388382, 133, 154813, 372877, 206717, 489310, 208249, -4813, 263367, 168320, 10914, 437280, 87261, 243069, 282031, -61811, 48787, 413998, 365117, 212813, -113937, 575852, 566953, -6567, 413848, 503003, 57678, 29790, 359318, 368067, 158870, 260264, 69193, 156214, -160427, 460069, 224550, 409772, 316895, 232914, 333744, 144934, 139721, 188094, 1810, 514112, 266885, 333458, -176949, 275784, 311468, 497551, 381912, 135268, -186840, 191201, 99141, 73717, 47850, 156135, 227162]
13448B27162l3853c09562C55317H0297K58827K59209B40480K35352k32044J49769
13438C93557O4258R9296A90136n8691a13460B82016F1898L13102j53696A06351
13427E32153B58516A15308h0295A06194G069J58963J54714j49763L74490e8659
13416D4261R7302K102R087a5564D46076A50270M2098a1239C89687R2568J68368
13405F50623B19299l6764L7857p5082R8596r2799K21031A69472R1360e9311B00233
13393A94625F9957c6251A59566J6237J18924A14030K11392j53205J16925m3943
13383B45199J2630j7586K131h4616C54767l1394A03805J12228j3892K42950k04523
13372B40568j15912J67087j32138F3312J14248p8866J25770p8768N0862Q933K55911
$$ y = [227162, 193309, -309562, 355317, 80297, 339124, 598333, 240480, 475832, 243788, 393557, 457815, 557111, 190136, 131445, -113460, 282016, 61898, 375000, 221304, 106351, 532153, 258516, 115308, -80295, 106194, 7069, 166032, 320746, 170983, 545473, -58659, 44261, 141563, 143665, 152752, -15564, 446076, 150270, 192368, -11239, 389687, 482255, 650623, 219299, 182535, 220392, 145310, 243906, 151107, 372138, 169472, 260832, -59311, 200233, 194625, 69957, -36251, 159566, 175803, 294727, 114030, 325422, 172217, 289142, 245199, 257829, 240243, 242374, -84616, 354767, 323373, 103805, 216033, 202141, 445091, 240568, 124656, 291743, 159605, 63312, 177560, 98694, 224464, 145696, 196558, 205491, 461402]
13361D61402j46392E0982k73L78520k04840C7143J62383J23827P1409A73173a32859
13349C91728o2905A45016J5821K18623I3896K23567N0768D2169L26416j72744
13339A95841J13935K9362Q3933L4343B03164j8605K31378C1576K22177L3197A03165
13327C5053K18033a7440A85546q3379P8809D4591K25456J13716j4804a81915K2616
13316a59299A69264K20172K98811B36606N1337D0575d7082D69783D9298d2865
13305D5784L09892n5714B5683p379c257C06435n1188M7663A36787g5742B80300
13293A03385L28508o2371E6200g1597F5100M2144J24896J61198c4960B62712b49317
13281B49872B6939K13911A08348a0757D8672A1709L84748G0505K84777j58466
$$ y = [461402, 315010, 50982, 50709, 429229, 224389, 37143, 199526, 323353, 394762, 173173, -132859, 391728, 328823, 145016, 160837, 379460, 93896, 317463, 368231, 42169, 368585, 195841, 309776, 339138, 423071, 457414, 203164, 184559, 415937, 31576, 253753, 286950, 103165, 35053, 253086, -17440, 185546, 102167, 180976, 44591, 270047, 383763, 368959, -181915, -159299, 169264, 389436, 688247, 236606, 287943, 40575, -47082, 469783, 49298, -42865, 45784, 355676, 299962, 25683, 18304, -3257, 306435, 255247, 302910, 136787, -75742, 280300, 103385, 431893, 369522, 56200, -71597, 65100, 107244, 232140, 393338, -34960, 262712, -249317, 249872, 26939, 240850, 108348, -10757, 48672, 11709, 396457, 70505, 355282, 196816]
13271A96816E0607K37657n5427N0027q9117a03636A38501k2577L131c06450C41659
13259B61278h7890H0535C9461L10970b4164E0509a0020A81221O6388P2699a0893
13247E762M25136A4639K00771n4577A8118o686N3095J61238J20941j68071K61994
13236D40629C3658e3345j7050D62129A43034J51939F9635L64060b27577f7624
13225B22086n2807A7684b28755b6977j16020A98910K82029a01232H8221J04381
13215A92602i4260I4091d9043B5142O3350J4724K047J78770G0725g9783A36530
13203A26052J88621a66404B97309H5045c28661c9295i073C85085R521A9313J23476
13192A42789K06206I9244h3299B20990a9315G0315Q8349J4923O8605O6301j22779
$$ y = [196816, 50607, 288264, 232837, 282864, 193747, -103636, 138501, 115924, 119055, -306450, 341659, 261278, -87890, 80535, 39461, 350431, -24164, 50509, -10020, 181221, 247609, 320308, -10893, 5762, 430898, 14639, 215410, 160833, 18118, 11432, 64527, 225765, 346706, 178635, 440629, 33658, -53345, -70395, 462129, 143034, 294973, 69635, 433695, -227577, -67624, 222086, 169279, 17684, -228755, -26977, -142997, 198910, 480939, -101232, 88221, 192602, -94260, 94091, -49043, 25142, 88492, 103216, 105263, 284033, 70725, -79783, 136530, 126052, 314673, -166404, 297309, 85045, -328661, -39295, -9073, 385085, 394606, 19313, 142789, 348995, 99244, -83299, 220990, -19315, 70315, 158664, 173587, 242192, 308493, 185714]
13181A85714M4551E7180b97339G7098B9617K45634j19268j967F9984e4796q047
13170f2843D7303J51306m1577P841F2348a62950F3774J74791J46452d8413a6516
13158A13819A6616K34615e3595A28049J4649b79l5860m1255A45754b817C83167
13146C05427a29655H9452M0459c8435A63909K8416J615r0799g0222l1334B53087
13134a45910j5169B17922h53p3527B32567j09342J8383E7041c8556o1420A91732
13122A43029b7730b689I4499e2625j25902A52545a4149D51582d2846k1887G319
13110G9307A8488a42456C21978c5254A04321e4269A05701b0122G9602L7727a48271
13098A56687K42330G4896J46300Q6238h3219A78692c09403A71451K7856K9465
$$ y = [185714, 230265, 57180, -297339, 77098, 29617, 275251, 155983, 154016, 69984, -54796, -62843, 47303, 198609, 157032, 164873, 62348, -162950, 63774, 238565, 385017, -48413, -16516, 113819, 16616, 251231, -53595, 128049, 142698, -279, -36139, -77394, 145754, -2817, 383167, 305427, -129655, 89452, 129911, -38435, 163909, 192325, 193940, 103141, -70222, -101556, 253087, -145910, -161079, 217922, -853, -74380, 232567, 123225, 141608, 57041, -38556, -99976, 191732, 143029, -27730, -2689, 94499, -52625, -178527, 152545, -14149, 451582, -42846, -64733, 7319, 79307, 18488, -142456, 321978, -35254, 104321, -54269, 105701, -20122, 79602, 117329, -148271, 156687, 399017, 74896, 221196, 307434, -83219, 178692, -309403, 171451, 199307, 228772]
13088B28772b0108j47608A51121k0491E8274a46459A93558P7605b7319B2605o105
13077A6500f6926A03314Q8A6110J20381b52275A3373a4437E0606K69283A36390
13065A93630K3058E3508P3431C3510i4486g991D1168J28266a53703d4867A95591
13053a10426D30351a00536J0417F21744E7236J14996M0028C3997b2191F5477K36633
13042C02110A29516O3361H487J05542D6720I335c68133B82449C6090J31417a84236
13030a26419r795O7973C46941j44288F8347a25513J1776j18302d9723A64784P6265
13019B41049L192I8194M65052k00800o2862J0236a53611C65K66778p3316N0054
13008B43881P1953p7045b8992I0115K03807a05770A21223E3958K23263E3287N5259
$$ y = [228772, -20108, -167716, 151121, 130630, 58274, -146459, 193558, 271163, -27319, 22605, 16500, -66926, 103314, 103402, 16110, 136491, -252275, 13373, -14437, 50606, 319889, 136390, 193630, 216688, 53508, 126939, 33510, -94486, -7991, 41168, 169434, -153703, -44867, 195591, -110426, 430351, -100536, -90119, 621744, 57236, 172232, 212260, 33997, -22191, 65477, 302110, 129516, 192877, 8487, 114029, 46720, 9335, -368133, 282449, 36090, 167507, -184236, -126419, -136214, -68241, 346941, 202653, 68347, -125513, -113737, -232039, -49723, 164784, 241049, 244241, 98194, 563246, 362446, 299584, 309820, -153611, 365, 267143, 193827, 243881, 315834, 238789, -28992, 90115, 293922, -105770, 121223, 53958, 277221, 53287, 108546]
12997A08546K17323a61367B57716a50288C93399A29625O1235e7986B2014K48307
12987B70321J33119g1261A71667m8021M0617N2080a63049B061K34504p3596f405
12975a36227O7495A39363p877K80379D2696j7954a86086g4757r3580B6037M7498
12964G3535A6242f8639j21340D6996P8829d3271m0611F2184O3084J92761B298
12952a93720P0612A50326m6221c1370j07438d5960I1564K73255j58030f9056J1993
12941e7063k42486O7710i0237B66459r1133c34055b3669A26024l8062K50915b50970
12929A04691R8908p3766d2046I4666L8811N3229N1960H6284J72891j07367a56182
12917A08413m3253b04731C0380J24054O20K07412b07606A66280g0777A85177F5718
$$ y = [108546, 325869, -161367, 257716, -150288, 393399, 129625, 190860, -57986, 22014, 270321, 403440, -71261, 171667, 123646, 164263, 216343, -163049, 2061, 236565, 162969, -6405, -136227, -68732, 139363, 131486, 411865, 42696, 24742, -186086, -74757, -168337, 26037, 73535, 16242, -68639, -189979, 46996, 125825, -43271, -83882, 62184, 125268, 318029, 2298, -193720, -123108, 150326, 104105, -31370, -138808, -45960, 91564, 364819, 206789, -69056, -57063, -299549, -231839, -90237, 266459, 175326, -334055, -23669, 126024, 87962, 338877, -250970, 104691, 203599, 129833, -42046, 94666, 133477, 186706, 238666, 86284, 259175, 151808, -156182, 108413, 65160, -204731, 30380, 154434, 155054, 362466, -207606, 166280, -70777, 185177, 65718]
12905a864C98360a56492C16229J31670i7601b626m4916D8787c9672A93604a70193
12893A11096a35823C52974f2640j13847A04726b18367C37629e5109l7319I4965
12882A24660J12212G4396K51562j31244D6101O0581a61890a3708C55494j72150
12872A83344J6498o6213b2284A22180k2536K72371A1121a72296D5812a90251j3652
12861b03903a3448E2800L574O00288a07982D4778a73954j35467e5685j22278F2929
12849a65197A07490M3405c9477A81006c7494B76711p1026j5163a71508A29409
12838G7314a45204B39097H7941a4907q5609k62648C75664B4319J30589a55836
12827A7912i630B39241m6330J44032e4095k65029A71306o3601b39089P9439N9446
$$ y = [-1864, 398360, -156492, 316229, 447899, -97601, -2626, -47542, 48787, -39672, 193604, -170193, 111096, -135823, 352974, -62640, -176487, 104726, -218367, 337629, -55109, -92428, 94965, 124660, 236872, 74396, 325958, 194714, 46101, 106682, -161890, -13708, 355494, 183344, 199842, 133629, -22284, 122180, 99644, 372015, 11121, -172296, 45812, -190251, -203903, -13448, 52800, 56374, 656662, -107982, 44778, -173954, -309421, -55685, -177963, 62929, -165197, 107490, 150895, -39477, 181006, -37494, 276711, 205685, 190522, -171508, 129409, 77314, -145204, 239097, 87941, -14907, -100516, -363164, 375664, 24319, 154908, -155836, 17912, -9630, 239241, 192911, 336943, -54095, -319124, 171306, 107705, -239089, -159650, -100204]
12816a00204J7795C10892a42975G2683K6601a46882B61560c5100A22010J5801
12806A37811C3929J19169c05488C39134c34060A86709e3445J0409A19118J9471
12796A38589o4263D473J63286c21634A27059R9124E8978b14333f9207j19822A09489
12784a08546A47025M8329J79981g227E5614I872b16686o097D1508d0476A23662
12772a28704M7415b8035B87856g23H8161P3924J87415F6684J34969g5652D3872
12760a04062A37571i9181J0580j8541B3991M8363a29791j04301A42329l6390f3487
12748C50013b96265D74934b00425i1122A37527a02304A19374d4811A61595e5183
12737A97269d3261A23609A1803J14293J09789a05371E5376A4485b89761M5618
$$ y = [-100204, -82409, 310892, -142975, 72683, 99284, -146882, 261560, -35100, 122010, 137811, 33929, 153098, -305488, 339134, -334060, 186709, -53445, -43036, 119118, 138589, 74326, 4473, 167759, -321634, 127059, 226183, 58978, -214333, -69207, -189029, 109489, -108546, 147025, 195354, 375335, -7227, 55614, 9872, -216686, -222783, 41508, -40476, 123662, -128704, -81289, -28035, 287856, -723, 88161, 162085, 349500, 66684, 201653, -75652, 43872, -104062, 137571, -99181, -88601, -107142, 23991, 72354, -129791, -234092, 142329, 105939, -63487, 350013, -296265, 474934, -200425, -91122, 137527, -102304, 119374, -44811, 161595, -55183, 197269, -43261, 123609, 11803, 126096, 235885, -105371, 55376, 14485, -289761, -244143]
12727b44143D4371L882J664N227b10071Q7229j19878M5250g0792j76506D27203
12715H6191a21329B73891p0232E2288K4252J01826J05520m6366J59376n3126j3978
12704C29792j05697j01991a35510P932C57536e9464A21251Q8111a8264E5162K10219
12693B65381D8517h7173I6612A5526J42336E0618B2404f2839C7173L33209D3848
12681H8489M3136K57514G8732J47271g469G5285K7110L25716b65932B23821a20722
12669b6243B20129J73161Q4882d6267k5467O789B78467b7987Q306B8933J29829
12658A58762G176M1696A200K02002r468E7731J53293D9012L6798J57975A19742
12646A96187h8686B32367H7531b82393H2861K8311a85524D9965O7721g114o8055
$$ y = [-244143, 44371, 48253, 49917, 55144, -210071, -122842, -242720, -197470, -70792, -247298, 427203, 86191, -121329, 273891, 203659, 52288, 76540, 178366, 283886, 237520, 396896, 343770, 329792, 224095, 122104, -135510, -127578, 357536, -59464, 121251, 209362, -18264, 55162, 265381, 48517, -87173, 96612, 15526, 157862, 50618, 22404, -62839, 37173, 370382, 43848, 88489, 131625, 389139, 78732, 226003, -7469, 75285, 102395, 428111, -265932, 223821, -120722, -26243, 220129, 393290, 478172, -46267, -71734, -64945, 278467, -27987, -19681, 28933, 158762, 7176, 48872, 1200, 203202, 193734, 57731, 211024, 49012, 85810, 243785, 119742, 196187, -88686, 232367, 87531, -282393, 82861, 111172, -185524, 49965, 117686, -7114, -75169]
12635g5169c359p6670A02727b41222F863c5184H4785D2114d3602A29184L85763
12624E14947i6723B28000A4248g9149D9093f035m18A58J65837J03112a31986K3407
12612a08579F6892J86657A25549M04046e4201A12164a63540k8885G5184a89576
12601b3448F1894c12900g9281I3568N1170o0533h5235B89197o0161c1459A65315
12589f3508A85220R5431E8699J18050C9774O6232K99652c4411C4956J20809A690
12577a64732j69424J44388B27438P5129f3982B61915C7645b26170B20601A7988
12566f7221j20405e4396j41888A93552G048a17248A41529j9261b88309H0062J12033
12555A92095a77924k8732g2216A159b32011a02568A90504I1928C234K65085h7643
$$ y = [-75169, -3359, -80029, 102727, -241222, 6863, -35184, 84785, 42114, -43602, 129184, 514947, -96723, 228000, 14248, -79149, 49093, -6035, -6453, 158, 165995, 269107, -131986, -108579, 66892, 253549, 125549, 529595, -54201, 112164, -163540, -192425, 75184, -189576, -23448, 61894, -312900, -79281, 93568, 144738, 84205, -85235, 289197, 229036, -31459, 165315, -63508, 185220, 280651, 58699, 176749, 39774, 106006, 405658, -34411, 34956, 155765, 1690, -164732, -334156, -189768, 227438, 302567, -63982, 261915, 37645, -226170, 220601, 17988, -67221, -187626, -54396, -196284, 193552, 7048, -117248, 141529, 122268, -288309, 80062, 192095, -177924, -206656, -72216, 1159, -232011, -102568, 190504, 91928, 3234, 268319, -87643]
12543A30402o604L5163k1487b9477o7111B46884j1728H1709R0053b4074A7951
12531A74941R7859R5193a43642A98710J47831L4243j71590a6858B80499A33555
12520D1905a01689A91490J09r4088h6324A12398O4667i0998D51426P3890A55566
12508I5458N9639B622R5817l370b36512f4441A06942a43230C4875c81014B81275
12496B10493b1503A07115L1859k3131n5628a41680B64068j07228K31543A16985
12485B71102J18150D1211K74546K03448h8760q307M786c3791D2032g087k7298
12474c4385A90238J23426f8387k03379H5460a6685H0825b22964A10115c63194
12463c39737B9048N9096L3802P0029E3459K61935b41567A11018D0231c32329A26475
$$ y = [130402, 123798, 158961, 137474, -29477, -96588, 246884, 235156, 81709, 171762, -24074, 17951, 174941, 272800, 367993, -143642, 198710, 346541, 380784, 209194, -16858, 280499, 133555, 41905, -101689, 191490, 191599, 97511, -86324, 112398, 177065, -90998, 451426, 525316, 155566, 95458, 155097, 2622, 98439, 95069, -236512, -64441, 106942, -143230, 34875, -381014, 281275, 210493, -21503, 107115, 138974, 115843, 60215, -141680, 264068, 156840, 388383, 116985, 271102, 389252, 41211, 315757, 519205, -88760, -97067, -92281, -33791, 42032, -7087, -34385, 190238, 313664, -68387, -271766, 85460, -16685, 80825, -222964, 110115, -363194, -339737, 29048, 88144, 121946, 191975, 53459, 315394, -241567, 111018, 40231, -332329, 126475]
12451G9909A4981o616J99557H5287K3728K03284D9851a93725C02478j5889F2850
12439b7149A57460d8066A55647f7040l3137k40332F4565G855a3514p4509A5697
12427a71462d6439B05205a0649A85859a85747K2350g5718g729j5265C41668A20972
12415H7203R3780h1526J0197A4067J27911g5760D304c17667a33211C41908E1668
12403a90844b1540D11998h4361M1732j28557I0643m1090B1855M2872d99579B2969
12391B70669c11612i1256A13556A4342a46716C17920c0688B7778c46244A9000
12380b27170B44857r9456J46731G202b3999l61022f3583k70990Q633e9313J9213
12369d0100j3285A04434Q8632C9610J03750g1503A48030d4767B26914D2549o20
$$ y = [79909, 14981, 8365, 207922, 85287, 109015, 312299, 49851, -193725, 302478, 286589, 62850, -27149, 157460, -48066, 155647, -67040, -100177, -340509, 64565, 7855, -13514, -88023, 15697, -171462, -46439, 205205, -10649, 185859, -185747, -163397, -75718, -7729, -22994, 341668, 120972, 87203, 180983, -81526, -71329, 14067, 141978, -75760, 4304, -317667, -133211, 341908, 51668, -190844, -21540, 411998, -84361, -42629, -171186, 90643, 49553, 21855, 64727, -499579, 22969, 270669, -311612, -91256, 113556, 14342, -146716, 317920, -30688, 27778, -346244, 19000, -227170, 244857, 145401, 292132, 7202, -23999, -385021, -63583, -334573, -325940, -59313, -40100, -53385, 104434, 193066, 39610, 143360, -71503, 148030, -44767, 226914, 42549, 41929]
12358D1929b13721B74299a79309G9056K93872c1585j64877d4902J9547A21770
12347a43435f7897l03822C23645i7448B1759K54509r6301K0528A9243b82583d2146
12335F3511b10713g1483D11982a07694j32758A40081d9793j65839A03809h1224
12324A281a33151j03420f4065p8634A31897l2663N1801A8171J59948o7638i2352
12312a92935P7218A647J02427a28119A3739b91251A19767a16433r8319E7100K76108
12301C33208c84097h6144A20245h0628L1681l7533B30841p9161J66329a92172
12290A30714a06110E0980G085b17748e29r7261d5948B27491n6743g6377j18387
12279a94764A06805m8773R4242a41355A98374J08094L509h4228C01378E6261K5474
$$ y = [41929, -213721, 274299, -179309, 79056, 372928, -31585, -196462, -44902, -25355, 121770, -143435, -67897, -371719, 323645, -97448, 21759, 276268, 179967, 200495, 19243, -282583, -42146, 63511, -210713, -71483, 411982, -107694, -240452, 140081, -49793, -215632, 103809, -81224, 1281, -133151, -236571, -64065, -142699, 131897, 99234, 151035, 18171, 178119, 110481, -92352, -192935, -115717, 1647, 104074, -128119, 13739, -291251, 119767, -116433, -214752, 57100, 333208, -384097, -86144, 120245, -80628, -48947, -86480, 230841, 151680, 318009, -192172, 130714, -106110, 50980, 7085, -217748, -529, -97790, -45948, 227491, 170748, -76377, -194764, 106805, 58032, 152274, -141355, 198374, 306468, 309977, -84228, 301378, 56261, 81735]
12268H1735M3508i1283G984L8037i637H4163J24317r4412J19902q2295b13920
12256D007J8302a86741C16395j10051D860R9955c13715A83126k2726i6479c1640
12244B90576E5670N15414j66100j77647I6906A1650a1431B24964I1974C050a3505
12232E2315K04846K7051Q5340f1707A40635K04048A39357K1256L06021E2440L56129
12221D08569q998a81843O8172B38279O750o7382l417K37398l0769B9466O6249
12210I5715J52669K84239A86211o8377l5759J65263f3205A58610B9420K52567
12200B81987J31222J17211j80970b18086D89181D9034M23864j85735J27769A17920
12189I8297J15812K0311j02442C4826J32255P8483G4629H665J65326g5617E9128
$$ y = [81735, 125243, -91283, 7984, 46021, -9637, 84163, 208480, 114068, 233970, 151675, -213920, 4007, 22309, -186741, 316395, 206344, 4860, 104815, -313715, 183126, 160400, -96479, -31640, 290576, 55670, 571084, 404984, 227337, 96906, 11650, -11431, 224964, 91974, 3050, -13505, 52315, 257161, 284212, 369552, -61707, 140635, 344683, 139357, 160613, 466634, 52440, 408569, 399571, -181843, -113671, 238279, 245029, 177647, 174230, 411628, 380859, 29466, 95715, 248384, 532623, 186211, 117834, 82075, 247338, -63205, 158610, 29420, 281987, 413209, 530420, 349450, -218086, 489181, 49034, 472898, 287163, 414932, 117920, 98297, 214109, 234420, 131978, 34826, 167081, 245564, 74629, 8665, 173991, -75617, 59128]
12177i6901H4100M0158l8356J96094I243M7300R5491a5148A10065P8828J73413
12166C62306a54174D8967L18740A10623N2841J93137a33864B44207o9184o1144
12156A13879J16235r7773B51K20857r401Q4343H2720M0262J30776L4219G4275
12144C86391j12540C8626J6722L1370a66085G456R2537a4564K063B90066J4299
12133C04365b31657B68062C0728a23953k1655A28877D5408E07K51601L04972i4817
12121a44209B24979D196a82304A11609b33881H9437A9433K8258a0187A37280b39796
12109e3001I6847E559J09694l9575h2855b9687A34599b14648L4532B63026E1855
12097B997a22952B8017J41789m7744j2321N1331A9837K82528E0889J14652C8879
$$ y = [-96901, 84100, 124258, 85902, 281996, 9243, 56543, 152034, -15148, 110065, 188893, 362306, -154174, 48967, 367707, 110623, 163464, 356601, -133864, 244207, 175023, 113879, 230114, 132341, 251, 221108, 211707, 296050, 82720, 122982, 253758, 287977, 74275, 386391, 273851, 38626, 55348, 86718, -166085, 7456, 99993, -14564, -12501, 290066, 304365, -231657, 268062, 30728, -123953, -145608, 128877, 45408, 507, 252108, 557080, -94817, -144209, 224979, 4196, -182304, 111609, -233881, 89437, 19433, 47691, -10187, 137280, -239796, -53001, 96847, 5559, 115253, 75678, -82855, -29687, 134599, -214648, -180116, 263026, 51855, 2997, -122952, 28017, 169806, 122062, 109741, 161072, 19837, 302365, 50889, 165541, 38879]
12085a80978A22069N3448j1801h4256B66528a32359A35186c38423a22229a6241
12074A08645d3340k0465A8345a76976j5170f8066G1121d11018a57624B32008a38850
12062G4728L2280M8355j4638J88162H014J033275J157693r20189E80598h9333
12051C82790j73338C4921N3001f182k51724Q1118I0380a76638J9376C29772A15883
12039b21826B8382h2962m8913o9251e2119a1242l40814A23800b17180D0869J43950
12028A84819O7597a30900A91774h1384E561f7241K3225k78294B9194M1413O3499
12017A34106E8323a05505A48572a06936E2694J33248b53455F0633a54874f7885
12006a9099j73585E0336d5346A3462J23714b41039A68613B8206a47830k4006A75248
$$ y = [-180978, 122069, 175517, 163716, -84256, 266528, -132359, 135186, -338423, -122229, -16241, 108645, -43340, -63805, 18345, -176976, -192146, -68066, 71121, -411018, -157624, 232008, -138850, 74728, 107008, 155363, 140725, 328887, 8014, 1041289, 2198982, 1278793, 580598, -89333, 382790, 209452, 34921, 87922, -6182, -257906, -176788, 90380, -176638, -157262, 329772, 115883, -221826, 28382, -82962, -131875, -201126, -52119, -11242, -352056, 123800, -217180, 40869, 184819, 252416, -130900, 191774, -81384, 5561, -67241, -44016, -322310, 29194, 70607, 134106, 58323, -105505, 148572, -106936, 52694, 185942, -253455, 60633, -154874, -67885, -19099, -192684, 50336, -45346, 13462, 137176, -241039, 168613, 28206, -147830, -171836, 175248]
11994e9299j72108Q1185l3120h0592G4809k9974b4711n564F0272c02353B53572
11982f8747m7720j771A52354b2643D7983a05030h007k5777C81999I4587O9972
11971A64559A8518J08933D7564J4777g995A5812a31412A4647K44065i761A2291
11959A00965C0601a22375j09839N1829A54688D4258i225p9263J5504o9067A49167
11947F5702J77483M7616c73056e4064A16802C0077J08606Q2690m1825H2399c26187
11935b5576c451G7385c15606R3000B96762c37265B19109q2660a6940l8085p6477
11924a31502M4906j08638B00179r7330a61991B64345r8450D8939N2626f9461n6325
11913a25786E16892A09570D3351K77687j29835b97817E6154H571N3988a03468
$$ y = [-59299, -231407, -150222, -183342, -80592, 74809, 44835, -24711, -30275, 60272, -302353, 253572, -68747, -116467, -118238, 152354, -22643, 47983, -105030, -8007, -33784, 381999, 94587, 164559, 18518, 127451, 47564, 62341, -7995, 15812, -131412, 14647, 258712, -9761, 12291, 100965, 30601, -122375, -232214, -180385, 154688, 44258, -9225, -88488, -72984, -142051, 149167, 65702, 243185, 290801, -373056, -54064, 116802, 30077, 138683, 221373, 179548, 82399, -326187, -25576, -3451, 77385, -315606, -222606, 296762, -337265, 219109, 136449, -16940, -55025, -131502, -86596, -195234, 200179, 102849, -161991, 264345, 165895, 48939, 101565, -69461, -125786, 516892, 109570, 43351, 321038, 191203, -297817, 56154, 8571, 62559, -103468]
11902d574r8029B05598q7380B4301G128J6552G379h8942E9600c01589h5512C2205
11889a54008B87496C3979K84215O3703J77393a89390h2530A62423l1829n3566
11879G7028b52815A19936d327B19170a06990m0957P0895o3203M7339M424l29588
11868d18080A27564h8258k64615J68075b1043n69892A05384a37047C0866c7973
11857A798K072K730c826o3165j05055I3551a57023L4377A30109a61960o2992B60829
11844A7450P8098d53015D0328R9791e6623q2460A4304L0910g033m359j05967j08556
11832b25915B03230p4241J658o2284e592A26208d52588C633a95676R0738c356
11820B21953a03273j69407A2286K57819a52209f611k05434D9737e1859I6524R1492
$$ y = [-4574, -102603, 205598, 118218, 24301, 7128, 23680, 7379, -88942, 59600, -301589, -85512, 32205, -154008, 287496, 33979, 318194, 381897, 559290, -189390, -82530, 162423, 130594, 77028, -252815, 119936, -4327, 219170, -106990, -147947, -77052, -140255, -92916, -88492, -418080, 127564, -88258, -352873, -184798, -21043, -590935, 105384, -137047, 30866, -37973, 1798, 3870, 6600, -3826, -66991, -172046, 93551, -157023, -122646, 130109, -161960, -224952, 260829, 17450, 95548, -453015, 40328, 140119, -56623, -139083, 14304, 45214, -7033, -11392, -117359, -225915, 203230, 128989, 130647, 68363, -5592, 126208, -452588, 3633, -195676, -104938, -3356, 221953, -103273, -272680, 12286, 270105, -152209, -6611, -212045, 49737, -51859, 96524, 188016]
11809A88016h268j96060A64446M0706R7279A45797a48998A58279J9183a21947
11798a8616B15499b43448F4808e4202j07247C66469A26618m6749J2802f169r9837
11787a06006p214B3720c11816A26168L2192c6114B09526j1765P1788b04117b0201
11775a98348o5849a8944G8621c60497a29619L6233A65450a38126j07797B433R6049
11764I8482b21304i7232F0192a9028j42860H54J82705g8125j0284B05372a45018
11752I8836a97123A9292M1975b1046B45517m4417a98379O7168m0087A47643i2363
11740H359J25443M1269F206Q6403J03751a64687A95704j7251q7646b33330L2180
11729b01150B42699q3549a24188l71868b02161P3659A6558P0937l3192g6179a299
$$ y = [188016, -8268, -204328, 164446, 205152, 302431, 145797, -148998, 158279, 177462, -121947, -18616, 215499, -243448, 64808, -54202, -161449, 366469, 126618, 79869, 92671, -6169, -106006, -113220, 23720, -311816, 126168, 158360, -36114, 209526, 197761, 269549, -204117, -20201, -198348, -264197, -18944, 78621, -360497, -129619, -93386, 165450, -138126, -245923, 2433, 98482, -221304, -97232, 60192, -19028, -161888, 854, 183559, -78125, -88409, 205372, -145018, 98836, -197123, 19292, 61267, -21046, 245517, 201100, -198379, -131211, -171298, 147643, -92363, 8359, 133802, 175071, 6206, 92609, 196360, -164687, 195704, 178453, 90807, -233330, -201150, 242699, 159150, -124188, -496056, -202161, -128502, 16558, 87495, 54303, -76179, -1299]
11717C49362j25888J27435j64175l8431J61753Q6025I7234L5585b6925C1668h6364
11705A0375J49349K5905J0330J31578I909J94102k3350a73277g3622c0346A92840
11693A23307J28184q1824J04867a56905A98861B8668j4309h8681B09944m5022
11683A64922k623F6644a87828B08372h4634C8477c88076A69047a30569G9935J22087
11672B02022d6585B4401j413b1026k97652A09625l6235K20259E0192b35818E9727
11660A2954a23826p8040i1794K8575r4407e4534k09099b776B01068g6550B08865
11648B5984n749e629j92882k05316C7471a62303L949n3274c6298C2669K05518
11637B38187B8463J31405J51186A2802J88011F7195e4034i65F9209F602M4477
$$ y = [349362, 223474, 350909, 186734, 148303, 310056, 396081, 97234, 132819, -26925, 31668, -86364, 10375, 159724, 185629, 195959, 327537, 9909, 204011, 180661, -173277, -73622, -30346, 192840, 123307, 251491, 169667, 274534, -156905, 198861, 28668, 14359, -88681, 209944, 164922, 162299, 66644, -187828, 208372, -84634, 38477, -388076, 169047, -130569, 79935, 202022, -46585, 24401, 22988, -21026, -318678, 109625, 73390, 293649, 50192, -235818, 59727, 12954, -123826, -201866, -91794, -63219, -157626, -54534, -263633, -2776, 201068, -76550, 208865, 25984, 20235, -5629, -198511, -403827, 37471, -162303, -158354, -211628, -36298, 32669, 238187, 28463, 159868, 311054, 12802, 200813, 67195, -54034, -965, 69209, 6602, 51079]
11626E1079J2787k2554J30543d7787M649A99601F2406K08192d0077A57645j3239
11615A44406c35861A20113c76996C5864K1729M3462b35192J6529d0022A64726
11604A38826c4325B45982b4245e318G7215a26564B14273C6350J91428a03957C76273
11592a65948k24622A63721k9424O6800g0452A63172D8310J52908c25587A95480
11581f4141A71703M13096G2824h1277F1016c2471j41563E7079J015b9366A1J82831
11569A82842a64988L2404I6028J28386n3552F1218K70058b7587C45911A61849
11558B2952P4486J76700I8056L83882B23454q9763C1416M45891A07487l567a7311
11546B27863E5542c5550A71537b10952D4643J00577J37232h7034j1508A50160
$$ y = [51079, 63866, 41312, 171855, -47787, -43138, 199601, 62406, 270598, -40077, 157645, 144406, -335861, 120113, -376996, 35864, 57593, 101055, -235192, -218663, -40022, 164726, 138826, -34325, 245982, -24245, -5318, 77215, -126564, 214273, 36350, 227778, -103957, 376273, -165948, -390570, 163721, 134297, 201097, -70452, 163172, 48310, 201218, -325587, 195480, -64141, 171703, 584799, 72824, -81277, 61016, -32471, -174034, 57079, 58094, -29366, 11, 182842, -164988, -132584, 96028, 224414, 170862, 61218, 331276, -27587, 345911, 161849, 22952, 97438, 274138, 98056, 481938, 223454, 133691, 31416, 477307, 107487, 103920, -17311, 227863, 55542, -35550, 171537, -210952, 44643, 145220, 282452, -87034, -98542, 150160]
11535H9297a3759A16700R3136F4498J12890p4544K31387j10231J69345o4189J88099
11524E17255I6314k723L5464l351K2117J82078j42176o1075i5314A11100a09795
11512C1007K56802O9037j72553P2415J03947n8285n6821L72697l04069E1030d0872
11500b43370B2137L05456A14198B0686c3462C7935K31428P3755j02266d9979A36053
11488c4934D24680C5346M3270L6998K64089r2547h6904C72058A52736J00796J48259
11477D01791F8341J213L1147K62680j19908J28255j75614J9868I5946C6332K44354
11466B80686i7201G16850A62285a28646D08542A56788l777n3270B710J69480j1273
11455A60917l3049F1497k4562O3108h6648k5316d3081A47707R0059d60272A62159
$$ y = [89297, -13759, 116700, 209836, 64498, 177388, 102844, 334231, 224000, 393345, 329156, 517255, 96314, 93591, 129055, 125704, 147821, 329899, 187723, 126648, -95314, 111100, -109795, 31007, 287809, 356846, 184293, 256708, 360655, 302370, 245549, 618246, 314177, 51030, -40872, -243370, 22137, 327593, 114198, 20686, -33462, 37935, 269363, 343118, 240852, -49979, 136053, -34934, 424680, 35346, 78616, 115614, 379703, 287156, -86904, 372058, 152736, 253532, 401791, 68341, 69554, 100701, 363381, 243473, 371728, 196114, 215982, 95946, 36332, 280686, -97201, 716850, 162285, -128646, 408542, 156788, 153011, 99741, 2710, 172190, 160917, 127868, 61497, 36935, 100043, -86648, -111964, -43081, 147707, 237766, -460272, 162159]
11443B46558P6339o519K796j08848H0085K604f9102J3526J1597B33748J37304
11432C71052j63013D999J38130K00026j09606D8188e8451Q965C81482a60107A16382
11420D7603k693g1445B24353n8335a11189J4032K0876A24281d7325k80211H6090
11408B0055c04547h4828C95394H380i275A8237a9945k87328A91958i8164A08290
11396c5073p6551A9021b21662A96533a3350n8556k71575B61386h5374J9928B77100
11384b92398d070A10387J4509c75584C32198H4759N1411E7766K8811Q3387e3339
11372e0571j24755E2924g7948C2075Q3216b4562C4241P7710m7170A4470K9522
11361D3992b06516B29196a44041A34681a88566A60797c4673A59268c7749o5785
$$ y = [246558, 322897, 316378, 319174, 210326, 80085, 82689, -69102, -55576, -43979, 233748, 371052, 208039, 4999, 143129, 343155, 233549, 48188, -58451, -49486, 381482, -160107, 116382, 47603, 44910, -71445, 224353, 166018, -111189, -97157, -76281, 124281, -47325, -327536, 86090, 20055, -304547, -84828, 395394, 8380, -9275, 18237, -19945, -307273, 191958, -98164, 108290, -35073, -111624, 19021, -221662, 196533, -13350, -71906, -343481, 261386, -85374, -65446, 277100, -292398, -4070, 110387, 124896, -375584, 332198, 84759, 136170, 57766, 86577, 169964, -53339, -50571, -175326, 52924, -77948, 32075, 115291, -24562, 34241, 111951, 64781, 14470, 43992, -206516, 229196, -144041, 134681, -188566, 160797, -34673, 159268, -37749, -103534]
11351a03534J7399j20572B7294K63707j03916a04567B94451E6975b67189A39648
11340d7394F8504O0071J52689b09805A26490K54596A5280a40336d2659n135A29361
11328b6501k1375j91345c2179A27904i4808a9687H313a92496C41469b40533K1537
11317b18996a987j36991k36470H7848i160m9181D0702L232A4219a61936c650k4356
11305b8006p4342C1127A767f0474B9550K8823a26097k68236c6714j75208f6969
11293e78370a75268r5219C2953f2112q8379A85183e2524h346E4113a91126j9955
11282b11081N3806A6300i8489J493i737l3293E8421J21880H9027i8559q373o3626
11270a70558C16119l5535D9147a21139b0932D7532J17033a06434C68582K6714
$$ y = [-103534, -86135, -206707, 27294, 291001, 187085, -104567, 294451, 56975, -267189, 139648, -47394, 68504, 128575, 281264, -209805, 126490, 381086, 15280, -140336, -42659, -47794, 129361, -26501, -47876, -239221, -32179, 127904, -94808, -19687, 8313, -192496, 341469, -240533, -218996, -1987, -138978, -375448, 87848, -9160, -58341, 40702, 43934, 14219, -161936, -3650, -28006, -102348, 31127, 1767, -60474, 29550, 58373, -126097, -394333, -36714, -211922, -66969, -578370, -175268, -270487, 32953, -62112, -150491, 185183, -52524, -8346, 54113, -191126, -211081, -157275, 16300, -98489, -96996, -9737, -43030, 58421, 180301, 89027, -98559, -106932, -170558, 316119, 280584, 49147, -121139, -20932, 47532, 164565, -106434, 368582, 395296]
11260C95296A82549j2540c48198M8801A79272e0359k17558J24513B60125d54239
11249B52192h1261I782e5856m2612J8776j31323j34131A05766m8896K09502h9889
11237B9042J70567F3124d2342A21073e6628D3887J42472D4289c62681i6008K9428
11226f6580I7540a54695b9282L919o7627A23141a02399L6914A10943M06d3670
11214B1076a93660A5264Q9109a56795O287B7614A1495b11426A1555J51554a16652
11202h0333j68606Q7773A8775b62360G9995g9100k43834A84633G1883g5987r8705
11191a74692J9552e7283j36199c7503a7289A81688R105b6918F2240R9650g4337
11179a78138g8587F4013E624P2466e5661k91192h2158k9466A98852g9737j35239
$$ y = [395296, 182549, 170009, -348198, -299397, 179272, -50359, -267917, -143404, 260125, -454239, 252192, -81261, 9782, -55856, -98468, -79692, -211015, -345146, 105766, 56870, 266372, -89889, 29042, 199609, 63124, -42342, 121073, -56628, 43887, 186359, 44289, -362681, -96008, -66580, 97540, -154695, -29282, -25363, -92990, 123141, -102399, -65485, 110943, 111349, -43670, 21076, -193660, 15264, 104373, -156795, -150508, 27614, 11495, -211426, 11555, 163109, -116652, -80333, -248939, -161166, 18775, -262360, 79995, -79100, -322934, 184633, 71883, -75987, -174692, -155140, -57283, -193482, -37503, -17289, 181688, 190793, -26918, 62240, 161890, -74337, -178138, -78587, 64013, 5624, 78090, -55661, -346853, -82158, -111624, 198852, -79737, -214976]
11168b14976c8298m252k1519B12880d8361o5588F7946a52274A96571b71645A31254
11156e2666A25104b942j21750B62951h6409B2159h5827E1836d06063a72935A54945
11144A61367E8464a55547A19422J95739G9502L8714b46593C99103A0860d3853
11133B15937d3139A61256o1479J00712l535M1383b51389D188J36398A7149N4674
11122G1823a24476A79940H5658b19180a00944D13628A01082J30844J60830j27488
11112B65268A23064m2368J06720G6656a24949J6082C28668j53290K28263A58260
11101b85420D3061a34529A43396J28394k5854N63604k14990q1285A40022J31968
11091B71990j15252K06791A60495n7083J16494A08799L17005g474D14775E5037
$$ y = [-214976, -38298, -42550, -64069, 212880, -48361, -113949, 67946, -152274, 196571, -271645, 131254, -52666, 125104, -2942, -124692, 262951, -86409, 22159, -85827, 51836, -406063, -172935, 154945, 161367, 58464, -155547, 119422, 315161, 79502, 118216, -246593, 399103, 10860, -43853, 215937, -43139, 161256, 99777, 200489, 196954, 238337, -251389, 4188, 140586, 17149, 71823, -124476, 179940, 85658, -219180, -100944, 413628, 101082, 231926, 392756, 265268, 123064, 80696, 187416, 76656, -124949, -108867, 328668, 175378, 403641, 158260, -285420, 43061, -134529, 143396, 271790, 245936, 809540, 594550, 513265, 140022, 271990, 156738, 363529, 160495, 103412, 219906, 108799, 425804, -7474, 414775, 55037]
11080a3655j7725B71424q5284r217K00047A79555P1016P1554K15996j52987K7306
11069D12440r1098K22092B26901J00131M01267q8296j45564K56331B19594K19501
11059D39095o4899J37850K56571l26448O20377j23760p4235l20154O7334M32639
11049A044370J0627l85759M70266j64855J5988K2719J04435j75088J61205j17312
11039I86596J11086M5643k83969N04118m84470K73587m627j44431O0190l32951
11029G30772Q1234K35122j71651k86602L46809N1566J6350R0473k58885j66535
11019F68653K93539N6403j53176J64449O7315m56503j49281K05209L00898j32160
11009H65346l07191N5838L65378k13393J0795P2513R5798l65393N02087k80660
$$ y = [-13655, -31380, 271424, 186140, 176923, 376970, 179555, 250571, 322125, 538121, 385134, 412440, 321342, 543434, 226901, 327032, 728299, 640003, 494439, 750770, 219594, 439095, 374196, 512046, 768617, 442169, 1062546, 938786, 864551, 544397, 611731, 1044370, 1054997, 669238, 1139504, 974649, 990637, 1013356, 1117791, 942703, 1103908, 986596, 1097682, 1143325, 859356, 1363474, 879004, 1152591, 1147964, 1003533, 1063723, 730772, 812006, 1047128, 875477, 588875, 935684, 987250, 1003600, 1094073, 835188, 668653, 962192, 1018595, 865419, 1029868, 1097183, 640680, 491399, 696608, 997506, 865346, 558155, 613993, 979371, 765978, 776773, 849286, 945084, 579691, 1081778, 801118]
10999H01118j8099q8649P0184J54901o8080J4360K07262j58887J17822j00484
10989I31448j46443J7710K80143M2884k4409J01832q4392K58806K08763k08004
10979A378338o9646J20895J83471L90722K30278M9974P2785Q55571p1232M44106
10969C585262L05259O04989j09288p0879m18933q80766J22104n80791j92090K7795
10959B392662m22418K73514j53065m0049j3618J2420l08430j53160j13929K15679
10949A689606n75345l19378J30830l95917K42220j34034j42452o1479I3501h1400
10938C90381A3819N1421J80833h7694C7237M09264j5027A00587f6964C5536a7228
10926A13237l1946d7375p2292A06265L11401r2452j60289p773c85528E4869a76253
$$ y = [801118, 783019, 694370, 764554, 919455, 851375, 865735, 1072997, 914110, 1031932, 931448, 785005, 802715, 1082858, 1125742, 1101333, 1203165, 1118773, 1377579, 1586342, 1378338, 1308692, 1429587, 1613058, 2003780, 2234058, 2284032, 2356817, 3212388, 3141156, 3585262, 3890521, 4495510, 4386222, 4315343, 3896410, 3015644, 3137748, 2556957, 2364867, 2392662, 1970244, 2243758, 2090693, 2050644, 2037026, 2049446, 1741016, 1587856, 1473927, 1689606, 1114261, 794883, 925713, 529796, 772016, 637982, 495530, 434051, 93501, -81400, 390381, 13819, 65240, 246073, -87694, 37237, 446501, 431474, 100587, -66964, 35536, -17228, 113237, 81291, -47375, -119667, 106265, 417666, 325214, 164925, 157152, -385528, 54869, -176253]
10914A43070O00j6203A2831J15244D2532J56136e8142A42173m5060J47383e4076
10902b1800A19513J88388d7201G3594D683J85712d4433H4593A966L0705J8216
10891E0887a31610A77590b1606A49747J20216A9244a39782C41407a9585I599M2872
10880E2471a50068B2323D759K6225L24804a74173g8882k85526H2820a24183G5191
10868I9200j3328i6273a6866k89701C4887b49760C54385C0994J1372J2390b32264
10856F3515b69533J12522c0679j04217F0347A0113O9893b46228h8280E7483b04316
10844B56309i9606B246c24479A21373J96065c67954A08942K73341D1422b5282
10833E0214K37820d12601D2992b08827o7308h5791C13412q2787R2009a86067f3314
$$ y = [143070, 143670, 127467, 12831, 128075, 42532, 198668, -58142, 142173, 97113, 244496, -54076, -21800, 119513, 307901, -47201, 73594, 4683, 190395, -44433, 84593, 1966, 32671, 50887, -131610, 177590, -21606, 149747, 269963, 19244, -139782, 341407, -19585, 9599, 52471, -150068, 22323, 4759, 30984, 355788, -174173, -78882, -364408, 82820, -124183, 75191, 99200, 85872, -96273, -16866, -306567, 34887, -249760, 354385, 30994, 42366, 54756, -232264, 63515, -269533, -157011, -30679, -134896, 60347, 10113, 80006, -246228, -88280, 57483, -204316, 256309, -99606, 2246, -324479, 121373, 317438, -367954, 108942, 382283, 41422, -25282, 50214, 288034, -412601, 42992, -208827, -276135, -85791, 313412, 230625, 322634, -186067, -63314]
10821d0483l8843G6238J06307Q9276E5037b3403o2653D01381b72530A04400a87252
10809a14948j51016F2987K04741g7759j17379r1930I5016P685K0738l5248e6820
10797a63928c2797m937H9994a19026A89866d30885a16856j63354a8307B01585
10786f4118I2016e4755j47316D3874h78l1945j9190j56848D4339J57410q7654
10775A14095e3931m4642b1388B49824a68410k5497k13424f8990j19349I6647M6358
10764A43005K4030i4037A01423f7911B67453F3327O2179J32512a28114E2953m97
10753E2456b31459f2217b3103M585B01701P9852A04819O7715E4323A0226J7146
10742B7372H897b8626C86713j42551A0105K5894K9257i4498A27504m1677a01345
$$ y = [-40483, -79326, 76238, 182545, 271821, 55037, -23403, -86056, 401381, -272530, 104400, -187252, -114948, -265964, 62987, 267728, -77759, -195138, -287068, 95016, 102701, 123439, 88191, -56820, -163928, -32797, -37734, 89994, -119026, 189866, -430885, -116856, -280210, -18307, 201585, -64118, 92016, -54755, -202071, 43874, -878, -32823, -52013, -208861, 44339, 201749, 114095, -53931, -98573, -21388, 249824, -168410, -193907, -407331, -68990, -188339, 96647, 143005, 167035, -94037, 101423, -67911, 267453, 63327, 125506, 258018, -128114, 52953, 52456, -231459, -62217, -23103, -18518, 201701, 281553, 104819, 172534, 54323, 10226, 27372, 8897, -28626, 386713, 244162, 10105, 35999, 65256, -94498, 127504, 85827, -101345]
10730a09815B62773F9991l3290c52k55505F3305b34186a16309A80265h7024C11656
10718a29609A35009F1838e936C33472A4459J7861a08194k09687J33027H8282d28888
10706G5848J92364b17285c1687m9646b7626j05479p973F8299a11608K1185j2690
10695a03113F7341i8513b9192a1146o935r6965D43492A67752a11228j6769m3325
10684a71322A33539P1056b93020C47110j32361f3370I737c5293k74478J34678
10674a75093j05500i4145j43209e6199k04088D9421a84586N8M3826B61251C764
10662a054j43834m51830c3363j57894D5384a57915e3146I8441c37029h6162M2746
10651d3416A30048M8664b43112q8713a41226o6217K6512j03001A9695M2372e8708
$$ y = [-109815, 262773, 69991, 36701, -352, -255857, 63305, -234186, -116309, 180265, -87024, 311656, -129609, 135009, 61838, -5936, 333472, 14459, 32320, -108194, -317881, -184854, 88282, -428888, 75848, 268212, -217285, -31687, -81333, -27626, -133105, -141078, 68299, -111608, -90423, -103113, 67341, -98513, -29192, -11146, -18081, -115046, 443492, 167752, -111228, -127997, -171322, 133539, 204595, -293020, 347110, 214749, -63370, 9737, -35293, -309771, -175093, -280593, -94145, -237354, -56199, -260287, 49421, -184586, -184528, -140702, 261251, 3764, -1054, -144888, -596718, -33363, -191257, 45384, -157915, -53146, 98441, -337029, -86162, -43416, 130048, 178712, -243112, -331825, -141226, -207443, -180931, -283932, 19695, 62067, -58708]
10639a92831g8138H44J63757E0450d6875j00734B324f8945F5796R710a90036A18757
10626A00641d8410j79644C38160A96g3543B81133a69940A63664a89070B4857K28591
10615B53448a41957f7711G8171K1550d6174A78734b03944L1215g6548J1918a2745
10603b60793J20876p3587i0858l53860a94660B61694a23032k20752a08854C4677
10592b61892d5215K1894l61224B297J41513K8424K26615j26495j26942a96773
10581A37683P3287b10411Q0507E8609f4095D9975c35243J56101m127A95291d764
10569B61983j00636a33664m4524l4673N7855B34485h5438r8235A83189b57096
10558i7952r2410B19761e057l09764B00380a86616L9054r4314O6114I3127f0531
$$ y = [-192831, -78138, 844, 164601, 50450, -46875, -147609, 2324, -68945, 65796, 75506, -190036, 118757, 100641, -48410, -228054, 338160, 196, -73543, 281133, -169940, 163664, -189070, 24857, 253448, -141957, -67711, 78171, 99721, -46174, 178734, -203944, -172729, -76548, -64630, -12745, -260793, -139917, -213504, -90858, -444718, -194660, 261694, -123032, -343784, -108854, 34677, -261892, -45215, -23321, -384545, 2297, 143810, 172234, 398849, 272354, 145412, -196773, 137683, 210970, -210411, -129904, 58609, -64095, 49975, -335243, -179142, -183269, 195291, -4764, 261983, 161347, -133664, -178188, -212861, -155006, 234485, -85438, -183673, 183189, -257096, -97952, -190362, 219761, -5057, -314821, 200380, -186616, -147562, -241876, -175762, 93127, -60531]
10546a79823b8935k56415a5791A9361h9501j04072I8563d1515j60936G9793c03236
10534i1379D4971L68055f442B27617b56911J1736B16157n3461J32295g7586A0860
10522e3836n037C24589c85018e8909B41498d6442A03853l8927K46532j21442F2797
10510b0737B85185e8319E6406e1099D6115e0847C72631a96602F8443a62071P3770
10499h8301B14151a76223L6341f2382I8786j8892P5762b56947A45484a3360B4344
10487a01612B7804a38595f3819L136C77274A74791K688q7712M23145o8367L19150
10476G63695C77519A52153J49510B3247g496j8589B33243b12899P862a1628D118
10464A8776b29014C7909c07787H1446R263a1678j44420I0687E286c13573c8699
$$ y = [-179823, -28935, -285350, -15791, 19361, -89501, -193573, 98563, -41515, -202451, 79793, -303236, -91379, 44971, 413026, -6442, 227617, -256911, -245175, 216157, 162696, 294991, -77586, 10860, -53836, -58873, 324589, -385018, -58909, 241498, -46442, 103853, 64926, 311458, 190016, 62797, -20737, 285185, -58319, 56406, -51099, 46115, -50847, 372631, -196602, 68443, -162071, -88301, 214151, -176223, -139882, -62382, 98786, 79894, 155656, -256947, 145484, -13360, 24344, -101612, 27804, -138595, -63819, -60683, 377274, 174791, 177479, 89767, 512912, 444545, 763695, 377519, 152153, 301663, 23247, -7496, -26085, 233243, -212899, -205037, -11628, 4118, 18776, -229014, 37909, -307787, 81446, 90709, -11678, -156098, 90687, 5286, -313573, -38699]
10452I4806b8272A59449a27626N9043j5754A99161i2321L061F3637h9625A44779
10440C4193L9058a39313C4525a55914B82747j21702f5678C13382b60912G9683
10429H5000f1265l33843e5916n925B01720N7623h0944a2052m4409A1451P7752
10418H9203N3578c1601A48964b74488J01867g5088A80428G2130b12407C6852b1443
10406B89815a02177K26A61288a14815a1650l7255B45664a15360B98666h7008A26408
10394b38534B27932L5833j28640c014B00968j6119K5553K83089D5652N10212a80160
10382A72253J76113A73035J6892e3604A80586N375J62450I5946K84527r6277P2867
10371C57063l5965k6960M76303l83345A66201J24182K35335J0177K57915k29148
$$ y = [94806, -28272, 159449, -127626, -68583, -84337, 199161, -92321, -89260, 63637, -89625, 144779, 34193, 73251, -139313, 34525, -155914, 282747, 161045, -65678, 313382, -260912, 79683, 85000, -61265, -395108, -55916, -61841, 201720, 259343, -80944, -12052, -56461, 11451, 89203, 142781, -31601, 148964, -274488, -172621, -75088, 180428, 72130, -212407, 36852, -21443, 289815, -102177, -101951, 161288, -114815, -11650, -48905, 245664, -115360, 298666, -87008, 126408, -238534, 227932, 263765, 135125, -3014, 200968, 184849, 210402, 493491, 45652, 555864, -180160, 172253, 348366, 173035, 189927, -53604, 180586, 185961, 348411, 95946, 380473, 284196, 357063, 321098, 294138, 770441, 387096, 166201, 290383, 525718, 535895, 793810, 564662]
10361E64662r6655m0425q1337A36293P4665J82937D7153L89388E5018J35091L8364
10350B28473J12892L74526J72137k42289O0207k61317Q078j09255K05918p2669
10340D76701n3336K37308A46187B2098M07338a18431E58729j46810c7104C25778
10329a49113A49293K47372M066H3169l5358J45694o6355J56586P9805P2226p5654
10318C60113C0517L02871d0367C84340b08072L0354B67139H4987d7451A82170
10307g295j46842a8992B38526h2238A47540g9100A91583I812d6261a3741m3620
10296e7361m5588A75796a8194j3733C98078d8790p336A49789p4429d1698D5411
10284A51986a42498A47569a55746E7300a31843H2043c01145I8756b9992k77851
$$ y = [564662, 468007, 427582, 346245, 136293, 210958, 393895, 47153, 436541, 55018, 190109, 228473, 341365, 715891, 888028, 645739, 705946, 444629, 452707, 343452, 549370, 476701, 423365, 660673, 146187, 22098, 429436, -118431, 558729, 411919, -37104, 325778, -149113, 149293, 396665, 400731, 83169, 47811, 193505, 127150, 283736, 363541, 435767, 360113, 30517, 333388, -40367, 384340, -208072, -177718, 267139, 84987, -47451, 182170, -7295, -154137, -18992, 238526, -82238, 147540, -79100, 191583, 9812, -46261, -13741, -57361, -102949, 175796, -18194, -31927, 398078, -48790, -56126, 149789, 75360, -41698, 45411, 151986, -142498, 147569, -155746, 57300, -131843, 82043, -301145, 98756, -29992, -307843]
10274c07843b577k0939k26303a00223o2751a882m35411F2790A806J72071c0617
10262C9094a22089n4733A5127J49590J1796L03113j05036j26172K2646h5151C19375
10250B50581I9271f7046k71486B29182c8249q1769F0831b77426b5824B9981K9617
10239E9598d5072q810A48378j1110D1775b01365f6967m0530B7155O1059a34743
10227B04342a26598j24009d9615j68671A29113O3358a29804M2783c5501j3399
10217d8900j51147Q9845D3290N303c6032m55894c662B44558a24695o9500D8783
10205b22139J6415Q5376A70018e6755B6069a08821p462b4563C1787b14577A66451
10193A07214b20398j59617H1870b65296A82632a83143l4964O2784o9122D6240
$$ y = [-307843, -2577, -23516, -249819, -100223, -162974, -1882, -437293, 62790, 1806, 173877, -30617, 39094, -122089, -176822, 15127, 164717, 176513, 479626, 374590, 248418, 271064, -85151, 319375, 250581, 99271, -67046, -338532, 229182, -38249, -120018, 60831, -277426, -25824, 29981, 59598, -45072, -53882, 148378, 137268, 41775, -201365, -66967, -107497, 27155, 88214, -134743, 204342, -126598, -250607, -49615, -218286, 129113, 192471, -129804, -87021, -35501, -48900, -200047, -110202, 43290, 48593, -36032, -491926, -3662, 244558, -124695, -194195, 48783, -222139, -205724, -120348, 170018, -56755, 26069, -108821, -116283, -24563, 31787, -214577, 166451, 107214, -220398, -380015, 81870, -265296, 182632, -183143, -218107, -155323, -224445, 46240]
10182G9791b02676R123j1967j75717a9235G3318l5076b02579A20443D6225c776
10170A26368a48905B1082i2214k61337A7174d27309f2413B7761N5830J633K62069
10159C47293b76631h0154L6428B10488c46336J13791M1305A87820i8940j05145
10149b04085B687R9414k5347P3940c23016D0746a97968D95J44034E9587a89535
10137A55968d6760a8990p8647F9576B8522J9930c3180F469a04237L5059A70891
10125a72219c6105l92459a79717F4670a76699B82864g653I7286a01050M075A79963
10113e9609B93834a82387k56017i6917o8225P6578j84470a7625k51751c3225j91443
10102b24668a06288k18481a10373C0768K04352E8179a9008k09377f2760M053j69995
$$ y = [79791, -202676, -193553, -205520, -381237, -19235, 73318, 38242, -202579, 120443, 46225, -3776, 126368, -148905, 21082, -92214, -353551, 17174, -427309, -62413, 27761, 83591, 85224, 347293, -276631, -80154, -43726, 210488, -346336, -232545, -191240, 187820, -98940, -204085, 2687, 102101, 76754, 150694, -323016, 40746, -197968, 495, 144529, 59587, -189535, 155968, -46760, -18990, -97637, 69576, 28522, 48452, -33180, 6469, -104237, -69178, 170891, -172219, -36105, -428564, -179717, 64670, -176699, 282864, -7653, 97286, -101050, -96975, 179963, -59609, 293834, -182387, -438404, -96917, -165142, -88564, -273034, -17625, -269376, -33225, -224668, -106288, -324769, -110373, 30768, 235120, 58179, -19008, -228385, -62760, -58707, -228702]
10091b28702n3887E1112P1069b6640l05132d3611A26501B3184d4854j9349j94108
10080b58311b3081j07653j93196k5591J17619i4293A29998b81367A19389a66827
10069b08857N8388B30791e6940o9956d3316l7653k99884G6716d25557H8971a83959
10057G5320h712j32179H9001a87581m7301g3894k975D9115A2500b81982m8917
10046c30899a24122d7221j3967B02339c59334E2608c28110O1923F6623e897p0529
10035g6426p1858c282o1495k90739d8591n0839j03736e2340q7665q5462D9086
10023b29159J4452G6397c7510k86042a00709a2132H0457h0483j26502k7793M2732
10012a92046A09546i9869A8934a2514f016I873J28478d1597k037A59031D6032
$$ y = [-228702, -282589, 51112, 122181, -26640, -331772, -43611, 126501, 23184, -44854, -64203, -258311, -23081, -130734, -323930, -349521, -231902, -94293, 129998, -281367, 119389, -166827, -208857, -150469, 230791, -56940, -126896, -43316, -80969, -380853, 76716, -425557, 88971, -183959, 75320, -8712, -140891, 89001, -187581, -234882, -73894, -76869, 49115, 12500, -281982, -330899, -124122, -47221, -61188, 202339, -359334, 52608, -328110, -266187, 66623, -5897, -76426, -148284, -3282, -64777, -355516, -48591, -99430, -203166, -52340, -140005, -225467, 49086, -229159, -214707, 76397, -37510, -323552, -100709, -12132, 80457, -80483, -206985, -234778, -192046, 109546, -99869, 18934, -12514, -6016, 9873, 138351, -41597, -43634, 159031, 46032]
10000b5654o8743C216R2575l9159K8962B6143a76564b3099k06872A60853e9318
9988a08691o8561B20681G6543h0436G0410a55010j01051O5369F2089N0766c32503
9976A10473n0203b66209A05475j0251O8813D9967a92208o7728e8532F9288j5069
9965E4219b23842O1995j4142n4284R0796f6955n8393k8207c7415k46950b9516
9953A3356a24789k90280A57221c3145l6274C8156R2866l5055P661l8291b30164
9941f7477n3139A04773a04473I1238B2108a45157A9124a31967r3018A4236L84686
9930C98922j30793a23002q2866a1189A87673b47244C01583c0383q1318H8589a9
9918f7760C5994h5706k22578f7643a259m10199a37850f8663j96658R6472A5173
$$ y = [-25654, -94397, 3216, 95791, 56632, 85594, 26143, -176564, -23099, -229971, 160853, -59318, -108691, -177252, 220681, 76543, -80436, 70410, -155010, -256061, -190692, 62089, 112855, -332503, 110473, 60270, -266209, 105475, 95224, 164037, 49967, -192208, -259936, -58532, 69288, 54219, -223842, -161847, -175989, -230273, -139477, -66955, -125348, -153555, -37415, -284365, -29516, 13356, -124789, -415069, 157221, -33145, -69419, 38156, 131022, 95967, 103628, 65337, -230164, -67477, -120616, 104773, -104473, 91238, 22108, -145157, 19124, -131967, -224985, 14236, 398922, 268129, -123002, -205868, -11189, 187673, -247244, 301583, -30383, -111701, 88589, -19, -67760, 35994, -85706, -308284, -67643, -1259, -411458, -137850, -68663, -265321, -168849, 15173]
9906C24770p8844m7992b50320B3752R0377l1017a75754B3022k745a11961k8385
9895a40346m4165c0006j92472A72615b93502H5654b8473I6331b9569j36780D8486
9883A6426c5629j11504G3946b11713c6644E2932a08236k04062e6048q6229g415
9871h9193j61984B4711b43673h8506j531m1207m5541Q6414E8241h0228p0870J2082
9859a39016r642N5624F8965h6497j11106E1430K61419a95207O9534L0907A43715
9847C3788K2729K87485B1352a64107o9459a16212L4759r4863C94403f4747j47210
9836b11957i266E2605A1571J61892B1347R3292a26270F4551a09890B6754c16735
9824D5251e66595b26124f2153B81700a42142A64445b88508c3264k5662C6307P028
$$ y = [324770, 245926, 197934, -250320, 23752, 114129, 83112, -175754, 23022, 20277, -111961, -140346, -184511, -30006, -222478, 172615, -293502, 85654, -28473, 96331, -29569, -166349, 48486, 16426, -35629, -147133, 73946, -211713, -36644, 52932, -108236, -312298, -56048, -142277, -7415, -89193, -251177, 24711, -243673, -88506, -90037, -131244, -176785, -90371, 58241, -80228, -151098, -139016, -148658, -93034, 68965, -86497, -197603, 51430, 312849, -195207, -125673, -94766, 143715, 33788, 56517, 344002, 21352, -164107, -233566, -116212, -81453, -176316, 394403, -64747, -211957, -9266, 52605, 11571, 173463, 21347, 114639, -126270, 64551, -109890, 26754, -316735, 45251, -566595, -226124, -62153, 281700, -142142, 164445, -288508, -33264, -58926, 36307, 43335]
9813D3335a01954r0374i3182c6079A01740d553l29277d7462o4393N0501j01441
9802a62795A36669D9360e5757j45591o9666L8572n5670P1991J9970a6052m6144
9791f2196o0764n6781p6771B88130b2717k07256O7644A6070o976K6116J47004
9780A82214p6715g3351a061p3252H0947a41528E2606b59673P3754A25578c75878
9768F2242b51084q1088R3473J03506F7781b2280j95743A49008j3784a7394k21436
9757b38830A80631M0956r5068a3123C5449b98996M3257G3716K873b86775A41452
9745i1684H4216k9225b32530d5098j18360J2393k8774j36882b7522j89291A82979
9733b37368P9246B11151c16883h820m3066j59781A01824C9774c99089a72479g2882
$$ y = [43335, -101954, -192328, -93182, -36079, 101740, -4553, -333830, -47462, -111855, -61354, -162795, 136669, 49360, -55757, -201348, -271014, -232442, -288112, -216121, -196151, -16052, -62196, -122960, -179741, -256512, 288130, -22717, -229973, -162329, 16070, 9094, 35210, 182214, 105499, -73351, -1061, -74313, 80947, -141528, 52606, -259673, -185919, 125578, -375878, 62242, -251084, -332172, -238699, -135193, 67781, -22280, -218023, 149008, 135224, -17394, -238830, 180631, 221587, 126519, -13123, 35449, -298996, -255739, 73716, 76589, -286775, 141452, -91684, 84216, 54991, -232530, -45098, -163458, -151065, -179839, -316721, -27522, -216813, 182979, -237368, -158122, 211151, -316883, -8820, -51886, -211667, 101824, 39774, -399089, -172479, -72882]
9721a61561f1041l9753H713e5904I8033b92846J31849P1946l01346H5585J20548
9710B06133a98933d0022k13547h2648j8236d7673F1009d16352a8754A75792o4349
9699A11443l9267L8271f8487A57397E394a94289B86964A09536b21560B47756b7466
9687a67671d3434B27895b71866b8011Q941m994H4436a16497B27782a58334j55073
9676c13407A02256i3263q4213D6343b37770k6253f9648k4591k73827G9447i9234
9664a56741A35628a18302o0971j0827A86515I1235b70578C7142J12465K5635a68334
9652b44931C2017j1144a25388N0589k44177A54224b82328O0074B0533i0441n3145
9641a43586K149N3537j23836i1197A39353E9062a17717j81757a37543f0354A56094
$$ y = [-161561, -61041, -100794, 8713, -55904, 98033, -292846, -160997, -89051, -390397, 85585, 206133, -198933, -40022, -253569, -82648, -100884, -47673, 61009, -416352, -18754, 175792, 111443, 72176, 110447, -68487, 157397, 5394, -194289, 286964, 109536, -221560, 247756, -27466, -167671, -43434, 227895, -271866, -28011, -19070, -24064, 84436, -116497, 227782, -158334, -313407, 102256, -93263, -177476, 46343, -237770, -264023, -69648, -94239, -368066, 79447, -99234, -156741, 135628, -118302, -179273, -190100, 186515, 91235, -270578, 37142, 149607, 175242, -168334, -244931, 32017, 20873, -125388, -74799, -318976, 154224, -282328, -222254, 20533, -90441, -143586, -141437, -87900, -211736, -91197, 139353, 59062, -117717, -299474, -137543, -60354, 156094]
9629b18397B22257a08995r4585H3888a67380f9949M453C4723a07642l2412M6115
9618i3939R241C8737f9901k70691H6571g9944j52044B23597N729a92664m2071
9607b34735E1334c18539B84674c3807E6438b39257A52464g7080C8721c34498a13193
9595g3278C7730b63931J26817e5093a0466D4543a22115m1210O2967A17509c31547
9583B44212h3111A13818A7723G116b13982R2850j74699C2623n991g8254a5501
9571B64332b25582a1784H343b78414A43744a5257l43598g820A31616b84852l2971
9560c17823a25641j88439D2958e5179B6511d17589f974k03702J1361A00876e8803
9548B00394P7820a824l3384p9289L986A37717p379M3816i0272j14778j6489G9911
$$ y = [-218397, 222257, -108995, -203580, 83888, -167380, -69949, -65496, 34723, -107642, -140054, -93939, -84698, 38737, -69901, -340592, 86571, -79944, -231988, 223597, 229326, -192664, -234735, 51334, -318539, 284674, -33807, 56438, -239257, 152464, -77080, 38721, -334498, -113193, -73278, 37730, -263931, -137114, -55093, -10466, 44543, -122115, -163325, -100358, 117509, -331547, 244212, -83111, 113818, 17723, 7116, -213982, -121132, -295831, 32623, 26632, -78254, -15501, 264332, -225582, -11784, 8343, -278414, 143744, -15257, -358855, -7820, 131616, -284852, -317823, -125641, -314080, 42958, -55179, 26511, -417589, -6974, -210676, -199315, 100876, -58803, 200394, 278214, -1824, -35208, -114497, -110511, 137717, 130338, 174154, -90272, -205050, -221539, 79911]
9535b53770O1650g1094A46935K6711i4563j08649j03508a10683e1520C70R0085
9524I0455a27003J2218d7122j74618h0041k62945k8274O6750b8914F0719d16339
9512G249d088k19213B21367a95418j89878B7802f17j87483B52944a14929j57682
9501b72611E9739a76239f5794o9005I9153e1589H906b8243D6178b95980J04649
9490a91331K1010J2052c338n0490A14174i3961j15483i8003j51750P0831F465
9478h1570j51564k712p7817h9746m2602j13876H3134b14417A44516b29262c6793
9466e23272a1957D5676b20542f4253A61301b09945E6863a35816l64881a88910
9455d32875C78755b05667B43414f8952E0921g3282b8220j43093m6934R4393I9347
$$ y = [-253770, -192120, -71094, 146935, 173646, -94563, -203212, -306720, -110683, -51520, 370, 90455, -127003, -114785, -47122, -221740, -80041, -342986, -371260, -304510, -28914, 60719, -416339, 7249, -4088, -223301, 221367, -195418, -385296, 27802, -617, -188100, 252944, -114929, -272611, 59739, -176239, -65794, -134799, 99153, -51589, 8906, -28243, 46178, -295980, -191331, -170321, -158269, -3338, -53828, 114174, -93961, -209444, -98003, -249753, -178922, 6465, -81570, -233134, -235846, -313663, -89746, -132348, -246224, 83134, -214417, 144516, -229262, -36793, -523272, -11957, 45676, -220542, -64253, 161301, -209945, 56863, -135816, -500697, -188910, -432875, 378755, -205667, 243414, -68952, 50921, -73282, -28220, -171313, -218247, -123854, 99347]
9443b31892Q1639H7538M5001J10635j03974B9794d9396i099k40445h1331j29199
9432b10530b3627A10764l8937B3261b00041k7040G5607a92249A51285K08398a93071
9420c2016G1951b03862B57768A07229a56140p7688h0440j46066a3322B44881A17782
9408G2585n036M3767b11371b6537l40254a00868j78933f5590A34962B6469K5573
9397E2042Q4565c88399R4930G6095a83482A77561a01841C3534h5715K5717D7026
9385i0082A50370K7025O251o9523m4734O5826A4407J64740F2265R0459b01464
9373a47757I2610h8432l6239O1099C42233a54029g1021p0600A72109n8478m8356
9362F5275a27213G4173a40257G6022c1446j49945L2475e7563B09927b45961a06576
$$ y = [-231892, -150253, 87538, 132539, 243174, 139200, 29794, -49396, -9099, -249544, -81331, -210530, -23627, 110764, 71827, 23261, -200041, -227081, 75607, -192249, 151285, 359683, -193071, -32016, 71951, -203862, 257768, 107229, -156140, -233828, -80440, -226506, -13322, 244881, 117782, 72585, 67549, 111316, -211371, -26537, -366791, -100868, -279801, -65590, 134962, 26469, 52042, 136607, -388399, -293469, 76095, -183482, 177561, -101841, 33534, -85715, -59998, 47026, -90082, 150370, 177395, 183646, 114123, 69389, 135215, 14407, 179147, 62265, 152724, -201464, -147757, 92610, -88432, -124671, -63572, 342233, -154029, -71021, -141621, 172109, 113631, 65275, -127213, 74173, -140257, 76022, -31446, -181391, -148916, -57563, 209927, -245961, -106576]
9350c65345G6153b70828A16616f8631H4092B2110K10098a17955J175A96184b7681
9338A85274m3677Q9375J8450I0820g2406B13566d8773q1191A04590D6477b50067
9326i3013K9683A7436e0023H745b16840J0073M8827j81655J63456d5657A72698
9314f8596B6566b9875r9047M6118j97475C16014A35466g5313A67002A8723d32637
9302B4180a5565p7717o4073j40351I6805a59683P9812B60407b56417M3164K1629
9291a91624A26684A4392N6167j6778J17259a26126j30159l4224l0809Q6784I6854
9279a88708i0025l0535I3340J7814J13966b89673a2200j6546p5383E8969c1l14999
9267c15030a11758j05635k05221a23247C7352a15482A96116h3597G61J86738E2945
$$ y = [-365345, 76153, -270828, 116616, -68631, 84092, 22110, 232208, -117955, -116780, 196184, -27681, 185274, 141597, 230972, 249422, 90820, -72406, 213566, -48773, -129964, 104590, 46477, -250067, -93013, -63330, 17436, -50023, 8745, -216840, -206767, -157940, -339595, -176139, -45657, 172698, -68596, 26566, -29875, -128922, -82804, -280279, 316014, 135466, -75313, 167002, 18723, -432637, 24180, -15565, -93282, -157355, -297706, 96805, -159683, -79871, 260407, -256417, -213253, -191624, 126684, 14392, 70559, 53781, 171040, -126126, -256285, -290509, -321318, -234534, 96854, -188708, -90025, -120560, 93340, 111154, 225120, -289673, -12200, -28746, -104129, 58969, -31, -315030, -111758, -217393, -422614, -123247, 37352, -115482, 196116, -83597, 761, 187499, 52945]
9255c9163k11461P1703b1892A09781a9437E6919b18818a5279A2988b83554C6062
9243c28407R6727F0702b89525d4181j88373A6521L0776a27996j48408B0859f9018
9231B76872o0193d08426A27094a21275B25353C6412a95892D5425J97624a01672
9220a36715k29339h3030m4604C3302c81351J33942j7089h6644k10909H6855P4714
9209A61569B7087c41011B03472b91612Q588m3778O9717A6578b12428a00085D0872
9197b35636q9745H4655f8693r2906j18123A2004c13259a9878j23551k7926D4782
9185A48734m7323k9753K93732A36665M2399p9063e2263j65998h8138j05481j29692
9174c23311B9061g7451c2159k48735m0453i0543j47662e9539C1950b11088j14455
$$ y = [-39163, -250624, -178921, -21892, 109781, -19437, 56919, -218818, -15279, 12988, -283554, 36062, -328407, -231680, 60702, -289525, -44181, -232554, 16521, 47297, -127996, -276404, 20859, -69018, 276872, 216679, -408426, 127094, -121275, 225353, 36412, -195892, 45425, 243049, -101672, -136715, -366054, -83030, -127634, 33302, -381351, -247409, -264498, -86644, -297553, 86855, 161569, 27087, -341011, 203472, -291612, -283024, -326802, -257085, 16578, -212428, -100085, 40872, -235636, -325381, 84655, -68693, -161599, -279722, 12004, -313259, -19878, -143429, -171355, 44782, 148734, 101411, 71658, 365390, 136665, 179064, 100001, -52263, -218261, -88138, -193619, -323311, 29061, -77451, -32159, -280894, -321347, -90543, -238205, -59539, 31950, -211088, -325543]
9163c25543J16307K3563b987A09835k329f8636F519e9433B74137A6796a024H6519
9150A61789c38385A91188a93502A69397k9015a17075k40795A24380c61289d1963
9139f1201j35226I090j90N7118c28410B15190a44410D088b29139R1544n8078H4018
9126a16750a4087n0788D5142c1244A18806a87196O2340k36887B70904b4770k2040
9115d6810A60077m9693a20477a8522m9393Q611j63513P5876D2214a58745G9636
9103a56865r4212g3120M813A97110R973a28810p3835P17A24061J90092A15633
9091a50195b6453j4034C03541c48026c1667l878H9442a13822d8320a4515m7517
9080f2032q1667f1258a6794A50720C4364c26499C8622i9323o198E8976a0368j21800
$$ y = [-325543, -209236, -185673, -2987, 109835, 107506, -68636, 6519, -59433, 274137, 16796, -1024, 86519, 161789, -338385, 191188, -193502, 169397, 140382, -117075, -357870, 124380, -361289, -41963, -61201, -196427, 9090, 8900, 66018, -328410, 215190, -144410, 4088, -229139, -137595, -195673, 84018, -116750, -14087, -64875, 45142, -31244, 118806, -187196, -124856, -361743, 270904, -24770, -46810, 160077, 110384, -120477, -18522, -67915, -59304, -222817, -146941, 42214, -158745, 79636, -156865, -251077, -73120, -68307, 197110, 207083, -128810, -202645, -201928, 124061, 314153, 115633, -150195, -26453, -40487, 303541, -348026, -31667, -35545, 89442, -113822, -48320, -14515, -62032, -143699, -61258, -16794, 150720, 34364, -326499, 38622, -99323, -105521, 58976, -10368, -132168]
9068a32168A58677m2664a33047d2259o8751j40857i9111F2058K60639c80778d6204
9056a57229f9539D1553J04089E5595d0439k08188B25176A2319J9100N5092d0544
9044B30028i5400B17464d15521a5546A46925o6109j2427d729F7011d3928H1010
9032c08693B13475j05136B2756b07389h8180j84029a24910j0313n3683A28496
9021a32902A61533b73473a00001m3286A20670J8370a1375o3403a0813j371j63352
9010a75536e0282K1074k66954B5148H888K2581P721e1382k7641A87829c32648
8998A10991a70451L2016c6855B3010a44584D21894F6841Q5014c96680A33507n6149
8987G7358J53497c73124a58288A24368E0646c31311i5030l06421P3582a18182
$$ y = [-132168, 158677, 116013, -133047, -42259, -111010, -251867, -99111, 62058, 322697, -380778, -46204, -157229, -69539, 41553, 145642, 55595, -40439, -248627, 225176, 12319, 31419, 86511, -40544, 230028, -95400, 217464, -415521, -15546, 146925, 80816, 68389, -4729, 67011, -43928, 81010, -308693, 213475, 108339, 22756, -207389, -88180, -272209, -124910, -135223, -188906, 128496, -132902, 161533, -273473, -100001, -143287, 120670, 139040, -11375, -74778, -10813, -12184, -175536, -50282, -29208, -296162, 25148, 8888, 31469, 39190, -51382, -79023, 187829, -332648, 110991, -170451, -138435, -36855, 23010, -144584, 421894, 66841, 151855, -396680, 133507, 77358, 230855, -373124, -158288, 124368, 50646, -331311, -95030, -401451, -327869, -118182]
8976b05032E0924J92613a6257B10220b15660H1047a09567r2844C14185A7045K23564
8965B40609a89804K9394A26037b25569A03185a65969C7842g2958A98292Q2542
8955B80834b55698j07495A05117b15626A03434j4087G689J20906g1933A8806J2629
8944C1435a35147A66422c21024h4297B12339j2083a46895f3807b5024j28233A13101
8932a39162j30652F5580G715a12965M6506n9318A52387E0655K13760N40533J246779
8921B051727L979553j544954A284989B35012Q3015I3113b08848i1020k39191J13746
8911b16465R1110j06742C2142q137J02422d6086j67526p621R8676D53646H2342
8899a22475m1576b675j07920o1440B33097D7927a37041I2841b40213a19476j37599
$$ y = [-205032, 50924, 243537, -16257, 210220, -215660, 81047, -109567, -202411, 314185, 17045, 240609, -189804, -160410, 126037, -225569, 103185, -165969, 37842, -72958, 198292, 280834, -255698, -363193, 105117, -215626, 103434, 89347, 7689, 128595, -71933, 18806, 31435, -135147, 166422, -321024, -84297, 212339, 200256, -146895, -63807, -25024, -153257, 113101, -139162, -269814, 65580, 7715, -112965, -66459, -125777, 152387, 50655, 264415, 804948, 2051727, 6031280, 4486326, 1284989, 235012, 318027, 93113, -208848, -91020, -330211, -216465, -125355, -232097, 32142, 24005, 126427, -46086, -213612, -221233, -122557, 453646, 82342, -122475, -164051, -2675, -110595, -172035, 233097, 47927, -137041, 92841, -240213, -119476, -257075]
8888b57075B0185a54788A72561l3681k1636m5301b01694Q4391A29477a0466E8081
8876a90871c266p2180L0772j71083a6448j16511J9593E2954K25327A4020O3937
8865G7957O4401b09587f7073q7386A04906N5391b42928B62532a34384j32959a17364
8853d20025A63971F2962a89223A85326k3937a54052L8196K0414j50214g9837J9634
$$ y = [-257075, 20185, -154788, 172561, 138880, 117244, 71943, -201694, -117303, 129477, -10466, 58081, -190871, -3266, -75446, -44674, -215757, -16448, -132959, -113366, 52954, 278281, 14020, 77957, 142358, -209587, -67073, -154459, 104906, 160297, -242928, 262532, -134384, -267343, -117364, -420025, 163971, 62962, -189223, 185326, 161389, -154052, -115856, -95442, -245656, -79837, -60203]
$$ [...]
##END NTUPLES=NMR SPECTRUM
##END=
