##TITLE=AC1683_2985_8571279_yJtKDicOSf
##JCAMPDX= 6.0         $$ Bruker NMR JCAMP-DX V2.0
##DATA TYPE= NMR SPECTRUM
##DATA CLASS= NTUPLES
##ORIGIN= BRUKER
##OWNER= Administrator
$$ 1.72 TOPSPIN		Version 2.1
$$ 2014-04-10 14:46:29.371 -0700  Administrator@X
$$ Compression mode = diff/dup
##.OBSERVE FREQUENCY= 400.02188249412
##.OBSERVE NUCLEUS= ^1H
##.ACQUISITION MODE= SIMULTANEOUS (DQD)
##.ACQUISITION SCHEME= undefined
##.AVERAGES= 64
##.DIGITISER RES= 22
##SPECTROMETER/DATA SYSTEM= spect
##.PULSE SEQUENCE= noesygpps1d.comp
##.SOLVENT NAME= COFFEE_meoh
##.SHIFT REFERENCE= INTERNAL, COFFEE_meoh, 1, 14.96145
##AUDIT TRAIL= $$ (NUMBER, WHEN, WHO, WHERE, PROCESS, VERSION, WHAT)
$$ ##TITLE= Audit trail, TOPSPIN		Version 2.1
$$ ##JCAMPDX= 5.01
$$ ##ORIGIN= Bruker BioSpin GmbH
$$ ##OWNER= Administrator
$$ $$ E:\/data/COFFEE/nmr/AC1683_2985_8571279_yJtKDicOSf/12/pdata/1/auditp.txt
$$ ##AUDIT TRAIL=  $$ (NUMBER, WHEN, WHO, WHERE, PROCESS, VERSION, WHAT)
(   1,<2014-04-10 14:46:24.168 -0700>,<Administrator>,<X>,<go>,<TOPSPIN 2.1>,
      <created by zg
	started at 2014-04-10 14:34:54.364 -0700,
	POWCHK enabled, PULCHK disabled,
       configuration hash MD5:
       C8 4E 4E 5D D3 5C D8 9E 9F 52 82 E0 59 8A DE 15
       data hash MD5: 64K
       CB E6 F3 FC 8C E3 A5 E0 04 1A E9 79 DE 1E 2D AD>)
(   2,<2014-04-10 14:46:27.152 -0700>,<Administrator>,<X>,<proc1d>,<TOPSPIN 2.1>,
      <Start of raw data processing
       efp LB = 0.3 FT_mod = 6 PKNL = 1 PHC0 = 0 PHC1 = 0 SI = 128K 
       data hash MD5: 128K
       01 B6 94 9D A6 E1 2A 95 F5 8C 96 8D 56 12 E2 72>)
(   3,<2014-04-10 14:46:28.168 -0700>,<Administrator>,<X>,<proc1d>,<TOPSPIN 2.1>,
      <pk PHC0 = -83.95752 PHC1 = 0 
       data hash MD5: 128K
       60 E7 3F 54 A5 94 02 D1 B6 91 44 29 A1 48 9F 38>)
(   4,<2014-04-10 14:46:28.668 -0700>,<Administrator>,<X>,<proc1d>,<TOPSPIN 2.1>,
      <abs ABSG = 1 
       data hash MD5: 128K
       0C 6D 92 9B 1D 45 73 9A BE A1 6B 54 7D 95 06 6D>)
(   5,<2014-04-10 14:46:28.793 -0700>,<Administrator>,<X>,<proc1d>,<TOPSPIN 2.1>,
      <abs ABSG = 2 
       data hash MD5: 128K
       03 26 4F C7 1D 85 D3 A0 00 FA F3 9C 05 81 D3 BD>)
(   6,<2014-04-10 14:46:28.918 -0700>,<Administrator>,<X>,<proc1d>,<TOPSPIN 2.1>,
      <abs ABSG = 3 
       data hash MD5: 128K
       85 A1 CB 79 A3 04 B6 73 8C BF EA 62 91 54 C5 02>)
(   7,<2014-04-10 14:46:29.027 -0700>,<Administrator>,<X>,<proc1d>,<TOPSPIN 2.1>,
      <abs ABSG = 4 
       data hash MD5: 128K
       2A 5B 5D B9 57 52 E2 BD 56 BC 37 14 AB E6 4F F5>)
(   8,<2014-04-10 14:46:29.121 -0700>,<Administrator>,<X>,<proc1d>,<TOPSPIN 2.1>,
      <abs ABSG = 5 
       data hash MD5: 128K
       87 D3 81 95 2E D5 CA 4A 9D 2F 86 1E 55 50 5E B1>)
$$ ##END=
$$ 
$$ $$ hash MD5
$$ $$ F2 E6 19 14 78 B3 18 F0 9A B2 BC AC 96 07 17 34
##$RELAX= 
##$RELAX= 
##$RELAX= 
##$RELAX= 
##$RELAX= 
##$RELAX= 
##$RELAX= 
##$RELAX= 
$$ Bruker specific parameters
$$ --------------------------
##$DU= <E:\>
##$EXPNO= 12
$$ [...]
##$TP07= 0
##$TPNAME0= <>
##$TPNAME1= <>
##$TPNAME2= <>
##$TPNAME3= <>
##$TPNAME4= <>
##$TPNAME5= <>
##$TPNAME6= <>
##$TPNAME7= <>
##$TPOAL= (0..7)
0.5 0.5 0.5 0.5 0.5 0.5 0.5 0.5
##$TPOFFS= (0..7)
0 0 0 0 0 0 0 0
##$TUNHIN= 0
##$TUNHOUT= 0
##$TUNXOUT= 0
##$USERA1= <user>
##$USERA2= <user>
##$USERA3= <user>
##$USERA4= <user>
##$USERA5= <user>
##$V9= 5
##$VALIST= <valist>
##$VCLIST= <CCCCCCCCCCCCCCC>
##$VD= 0
##$VDLIST= <DDDDDDDDDDDDDDD>
##$VPLIST= <PPPPPPPPPPPPPPP>
##$VTLIST= <TTTTTTTTTTTTTTT>
##$WBST= 1024
##$WBSW= 4
##$XGAIN= (0..3)
0 0 0 0
##$XL= 0
##$YL= 0
##$YMAX_a= 7068851
##$YMIN_a= -15452490
##$ZGOPTNS= <>
##$ZL1= 120
##$ZL2= 120
##$ZL3= 120
##$ZL4= 120
##$ABSF1= 14.96145
##$ABSF2= -5.596732
##$ABSG= 5
##$ABSL= 3
##$ALPHA= 0
##$AQORDER= 0
##$ASSFAC= 0
##$ASSFACI= 0
##$ASSFACX= 0
##$ASSWID= 0
##$AUNMP= <proc_prof1d_extract.lims>
##$AXLEFT= 0
##$AXNAME= <>
##$AXNUC= <1H>
##$AXRIGHT= 0
##$AXTYPE= 0
##$AXUNIT= <>
##$AZFE= 0.1
##$AZFW= 0.1
##$BCFW= 0
##$BC_mod= 0
##$BYTORDP= 0
##$COROFFS= 0
##$CY= 15
##$DATMOD= 1
##$DC= 0
##$DFILT= <>
##$DTYPP= 0
##$F1P= 0
##$F2P= 0
##$FCOR= 0.5
##$FTSIZE= 131072
##$FT_mod= 6
##$GAMMA= 0
##$GB= 0
##$INTBC= 1
##$INTSCL= 1
##$ISEN= 128
##$LB= 0.3
##$LEV0= 0
##$LPBIN= 0
##$MAXI= 10000
##$MC2= 0
##$MEAN= 0
##$ME_mod= 0
##$MI= 0
##$NCOEF= 0
##$NC_proc= -2
##$NLEV= 6
##$NOISF1= 0
##$NOISF2= 0
##$NSP= 0
##$NTH_PI= 0
##$NZP= 0
##$OFFSET= 14.96145
##$PC= 1
##$PHC0= -83.95752
##$PHC1= 0
##$PH_mod= 1
##$PKNL= yes
##$PPARMOD= 0
##$PPDIAG= 0
##$PPIPTYP= 0
##$PPMPNUM= 2147483647
##$PPRESOL= 1
##$PSCAL= 4
##$PSIGN= 0
##$PYNMP= <proc.py>
##$REVERSE= no
##$SF= 400.020009455371
##$SI= 131072
##$SIGF1= 0
##$SIGF2= 0
##$SINO= 400
##$SIOLD= 131072
##$SPECTYP= <>
##$SREGLST= <1H.CDCl3>
##$SSB= 0
##$STSI= 131072
##$STSR= 0
##$SW_p= 8223.68421052631
##$SYMM= 0
##$S_DEV= 0
##$TDeff= 65536
##$TDoff= 0
##$TI= <>
##$TILT= no
##$TM1= 0
##$TM2= 0
##$TOPLEV= 0
##$USERP1= <user>
##$USERP2= <user>
##$USERP3= <user>
##$USERP4= <user>
##$USERP5= <user>
##$WDW= 1
##$XDIM= 131072
##$YMAX_p= 412424442
##$YMIN_p= -12564
##$CURPLOT= <Network HP LaserJet P1505>
##$CURPRIN= <$Network HP LaserJet P1505>
##$DFORMAT= <normdp>
##$LAYOUT= <+/1D_H.xwp>
##$LFORMAT= <normlp>
##$PFORMAT= <normpl>
##$SURQMSG= 1
$$ End of Bruker specific parameters
$$ ---------------------------------
##NTUPLES= NMR SPECTRUM
##VAR_NAME=  FREQUENCY,     SPECTRUM/REAL,   SPECTRUM/IMAG
##SYMBOL=    X,             R,               I
##VAR_TYPE=  INDEPENDENT,   DEPENDENT,       DEPENDENT
##VAR_FORM=  AFFN,          ASDF,            ASDF
##VAR_DIM=   131072,        131072,          131072
##UNITS=     HZ,            ARBITRARY UNITS, ARBITRARY UNITS
##FACTOR=    0.0627417313425164, 1,          1
##FIRST=     8223.62146879497, 1872,         -73508
##LAST=      0,             3808,            -73713
##MIN=       0,             -12564,          0
##MAX=       8223.62146879497, 412424442,    0
$$ Real data points
##PAGE= N=1
##DATA TABLE= (X++(R..R)), XYDATA
$$ [...]
$$ plain form
63609 699332 724402 750799 777520 803986 830283 856329 881225 903633 922572 937562 948225
63598 948225 954161 955419 952880 947991 942122 936152 930408 924720 918562 911426 903155 893765 882984 870228
63584 870228 855166 838113 819833 801172 782951 765805 749932 735270 722175 711542 703894 698654
63572 698654 694765 691739 689631 688260 687210 686518 686606 687349 687831 687295 685997 684935 685191 687613 692628 700025
63556 700025 709286 720343 733683 749601 767906 788619 812440 840074 871427 905866 942890 982184
63544 982184 1023405 1066380 1110894 1155292 1195245 1224844 1239691 1239266 1226704 1206873 1184448 1162810
63532 1162810 1143682 1127382 1113443 1101164 1089883 1079004 1067775 1054993 1039159 1019333 995822
63521 995822 969765 942038 912921 882864 853090 825016 799211 775245 752565 731257 711880
$$ packed form
63609F99332K5070K6397K6721K6466K6297K6046K4896K2408J8939J4990J0663
63598I48225N936J258k539m889n869n970n744n688o158p136q271r390j0781j2756
63584H70228j5062j7053j8280j8661j8221j7146j5873j4662j3095j0633p648n240
63572F98654l889l026k108j371j050o92Q8P43M82n36j298j062K56K422N015P397
63556G00025R261J1057J3340J5918J8305K0713K3821K7634L1353L4439L7024L9294
63544I82184M1221M2975M4514M4398L9953K9599J4847m25j2562j9831k2425k1638
63532A162810j9128j6300j3939j2279j1281j0879j1229j2782j5834j9826k3511
63521I95822k6057k7727k9117l0057k9774k8074k5805k3966k2680k1308j9377
$$ plain form
63510 711880 694782 679831 666725 655385 645919 638293 632080 626542 621024 615331 609731 604521 599680
63497 599680 595065 590786 587048 583670 580217 576755 573960 572153 570690 568833 566843 565594 565327 565528 565952
63482 565952 566980 568835 571181 573804 577090 581457 586770 592652 598866 604952 609900 612708 613177 611822
63468 611822 609211 605654 601321 596310 590651 584451 577931 571268 564595 558238 552649 547994 544151 541154
63454 541154 539195 538081 537291 536889 537769 540562 544787 549607 554962 561386 569128 578135 588622 600981
63440 600981 615331 631796 651036 673808 700115 729461 761863 797941 837991 881504 927301
63429 927301 973134 1015107 1048599 1070632 1081169 1082157 1076051 1065517 1053605 1043176 1036111 1033360
63417 1033360 1035436 1042479 1054068 1069437 1087721 1107676 1127311 1144301 1156905 1164430 1166960 1164905
$$ packed form
63510G11880j7098j4951j3106j1340r466p626o213n538n518n693n600n210m841
63497E99680m615m279l738l378l453l462k795j807j463j857j990j249k67K01M24
63482E65952J028J855K346K623L286M367N313N882O214O086M948K808M69j355
63468F11822k611l557m333n011n659o200o520o663o673o357n589m655l843k997
63454E41154j959j114p90m02Q80K793M225M820N355O424P742R007J0487J2359
63440F00981J4350J6465J9240K2772K6307K9346L2402L6078M0050M3513M5797
63429I27301M5833M1973L3492K2033J0537R88o106j0534j1912j0429p065k751
63417A033360K076P043J1589J5369J8284J9955J9635J6990J2604P525K530k055
$$ plain form
63405 1164905 1158842 1149639 1138667 1127643 1117788 1108861 1099347 1087896 1074339 1059029 1041570 1020853
63393 1020853 996411 969178 940706 912044 883627 855877 829399 804678 781935 761364 743163
63382 743163 727263 713307 701109 690904 682910 676827 672161 668976 667892 669225 672463 676789 681892
63369 681892 688043 695651 705103 716859 731228 747894 765907 784368 803189 823193 845532 870888
63357 870888 899047 929109 960049 991033 1021334 1050189 1076880 1100761 1121053 1136738 1146925
63346 1146925 1151401 1150881 1146794 1140719 1133680 1125800 1116715 1106386 1095335 1084068 1072508 1060002 1045608
63333 1045608 1028428 1008224 985988 963413 941519 920217 899522 880551 864649 851971 841761
63322 841761 833781 828597 826517 827237 830708 837298 846249 854310 856656 849495 832056 806635 777069 746847
$$ packed form
63405A164905o063r203j0972j1024r855q927r514j1451j3557j5310j7459k0717
63393A020853k4442k7233k8472k8662k8417k7750k6478k4721k2743k0571j8201
63382G43163j5900j3956j2198j0205p994o083m666l185j084J333L238M326N103
63369F81892O151P608R452J1756J4369J6666J8013J8461J8821K0004K2339K5356
63357H70888K8159L0062L0940L0984L0301K8855K6691K3881K0292J5685J0187
63346A146925M476n20m087o075p039p880r085j0329j1051j1267j1560j2506j4394
63333A045608j7180k0204k2236k2575k1894k1302k0695j8971j5902j2678j0210
63322H41761p980n184k080P20L471O590Q951Q061K346p161j7439k5421k9566l0222
$$ plain form
63308 746847 718051 691627 668185 648196 631544 617455 605132 594251 584809 576711 569621 562954
63296 562954 556081 548833 541842 535978 531421 527634 524231 521321 518891 516462 513731 511016 508687 506525
63282 506525 504107 501494 499057 496879 494842 493078 491799 490778 489568 488293 487698 488244 489507 490711 491547
63267 491547 492234 493013 493896 494878 496053 497377 498506 499152 499616 500710 502961 506013 509090 511915 514832 518056
63251 518056 521270 524137 526826 529725 532911 536238 539746 543632 547917 552492 557395 562753 568491 574483
63237 574483 581031 588861 598528 610033 623045 637210 652206 667819 684129 701371 719453 737949
63225 737949 756796 776672 798213 821036 844011 866506 888832 911400 934036 956468 979022
63214 979022 1002253 1026136 1050208 1074386 1098918 1123332 1146064 1165560 1181416 1193979 1203011 1207210
$$ packed form
63308G46847k8796k6424k3442j9989j6652j4089j2323j0881r442q098p090o667
63296E62954o873p248o991n864m557l787l403k910k430k429k731k715k329k162
63282E06525k418k613k437k178k037j764j279j021j210j275n95N46J263J204Q36
63267D91547O87P79Q83R82J175J324J129O46M64J094K251L052L077K825K917L224
63251E18056L214K867K689K899L186L327L508L886M285M575M903N358N738N992
63237E74483O548P830R667J1505J3012J4165J4996J5613J6310J7242J8082J8496
63225G37949J8847J9876K1541K2823K2975K2495K2326K2568K2636K2432K2554
63214I79022K3231K3883K4072K4178K4532K4414K2732J9496J5856J2563R032M199
$$ plain form
63202 1207210 1205118 1196326 1181837 1163416 1142506 1119519 1094120 1066248 1036789 1007317 979497 954743
63190 954743 933918 916869 902549 890159 880143 873641 871078 871742 874727 879771 887099 896975 909619
63177 909619 925080 942867 961999 981736 1002058 1023200 1044945 1066669 1087943 1108761 1129230
63166 1129230 1149251 1168481 1186505 1203027 1217930 1231006 1241587 1248634 1251365 1249730 1244121 1234704
63154 1234704 1221097 1202681 1179211 1151284 1120289 1087742 1054620 1021382 988593 957132 927650
63143 927650 900153 874485 851024 830469 812952 797754 784073 771788 761279 752737 745975 740780
63131 740780 737037 734440 732454 730778 729585 729009 728646 727976 727191 727122 728252 730174 732105 733528 734230 734216
63115 734216 733934 734141 735105 736194 736615 736276 735526 734402 732747 730956 729906 730045 730900 731531 731215 729770 727609
$$ packed form
63202A207210k092q792j4489j8421k0910k2987k5399k7872k9459k9472k7820k4754
63190I54743k0825j7049j4320j2390j0016o502k563O64K985N044P328R876J2644
63177I09619J5461J7787J9132J9737K0322K1142K1745K1724K1274K0818K0469
63166A129230K0021J9230J8024J6522J4903J3076J0581P047K731j635n609r417
63154A234704j3607j8416k3470k7927l0995l2547l3122l3238l2789l1461k9482
63143I27650k7497k5668k3461k0555j7517j5198j3681j2285j0509q542o762n195
63131G40780l743k597j986j676j193n76l63o70p85o9J130J922J931J423P02j4
63115G34216k82K07R64J089M21l39p50j124j655j791j050J39Q55O31l16j445k161
$$ plain form
63098 727609 725418 723465 721414 719172 717633 717882 719794 722101 723891 725396 727277 729872 733323 737737
63084 737737 742825 747952 752842 757811 763065 768305 773208 777741 781707 784645 786601 788379 790581 792995
63070 792995 795458 798700 803521 809586 815852 822013 828697 836368 844855 854125 864841 877862 893542
63057 893542 911689 931907 953844 977339 1002439 1029252 1057849 1088428 1121391 1157051 1195373
63046 1195373 1236209 1279512 1325031 1372001 1419584 1467533 1516108 1565446 1615318 1665362 1715152
63035 1715152 1764139 1811914 1858560 1904432 1949627 1993868 2036820 2078149 2117368 2153872 2186982
63024 2186982 2215584 2237820 2251602 2255579 2249454 2233531 2208358 2174649 2133029 2083798 2027431 1965474
63012 1965474 1900585 1835508 1772170 1711687 1654730 1601748 1553298 1510498 1474878 1447450 1428058
$$ packed form
63098G27609k191j953k051k242j539K49J912K307J790J505J881K595L451M414
63084G37737N088N127M890M969N254N240M903M533L966K938J956J778K202K414
63070G92995K463L242M821O065O266O161O684P671Q487R270J0716J3021J5680
63057H93542J8147K0218K1937K3495K5100K6813K8597L0579L2963L5660L8322
63046A195373M0836M3303M5519M6970M7583M7949M8575M9338M9872N0044M9790
63035A715152M8987M7775M6646M5872M5195M4241M2952M1329L9219L6504L3110
63024B186982K8602K2236J3782L977o125j5923k5173l3709m1620m9231n6367o1957
63012A965474o4889o5077o3338o0483n6957n2982m8450m2800l5620k7428j9392
$$ plain form
63001 1428058 1415777 1409772 1409590 1414928 1425508 1441189 1461866 1487143 1516315 1548752 1584192 1622452
62989 1622452 1662909 1704505 1746346 1788084 1829509 1869992 1908730 1945505 1980685 2014262 2045219
62978 2045219 2072071 2093608 2108821 2116510 2115491 2105117 2085205 2055699 2016891 1969908 1916455 1857977
62966 1857977 1795364 1729417 1661198 1591951 1523107 1456319 1392978 1333492 1277435 1224565 1175289
62955 1175289 1129975 1088298 1049657 1013902 981253 951640 924538 899479 876468 855806 837563
62944 837563 821239 805937 790960 776273 762298 749259 736904 724929 713468 703045 694132 686857
62932 686857 680957 675879 671058 666314 661917 658163 654992 652171 649748 647959 646630 645024 642609 639834
62918 639834 637704 636610 635986 635255 634596 634368 634250 633675 632933 633022 634246 635700 636484 636833 637642 639409 642074
$$ packed form
63001A428058j2281o005j82N338J0580J5681K0677K5277K9172L2437L5440L8260
62989A622452M0457M1596M1841M1738M1425M0483L8738L6775L5180L3577L0957
62978B045219K6852K1537J5213P689j019j0374j9912k9506l8808m6983n3453n8478
62966A857977o2613o5947o8219o9247o8844o6788o3341n9486n6057n2870m9276
62955A175289m5314m1677l8641l5755l2649k9613k7102k5059k3011k0662j8243
62944H37563j6324j5302j4977j4687j3975j3039j2355j1975j1461j0423q913p275
62932F86857n900n078m821m744m397l754l171k821k423j789j329j606k415k775
62918F39834k130j094o24p31o59k28j18n75p42Q9J224J454P84L49Q09J767K665
$$ plain form
62901 642074 645313 648404 650258 650302 649073 647384 645300 642690 640342 639453 640007 640732 640884 641225 642876 646011
62885 646011 650040 654332 658263 661256 663409 665567 668147 670306 670928 670085 668841 667780 666502 664518 661934
62870 661934 659082 656010 652588 648798 644733 640560 636525 632751 628966 624781 620373 616559 613935 612189
62856 612189 610544 608739 607204 606294 605690 604781 603428 602098 601262 600892 600650 600365 600172 600242 600548 600904 601160
62839 601160 601383 601873 602898 604319 605624 606505 607272 608472 610179 611954 613432 614619 615610 616408 617198 618472
62823 618472 620607 623518 626929 630761 634944 639020 642320 644637 646472 648484 650874 653428 656020 658840
62809 658840 662115 665791 669726 674072 679216 685215 691550 697719 703938 710911 718965 727710 736631 745712
62795 745712 755305 765636 776661 788312 800698 814203 829498 847287 867829 890807 915806 942768
$$ packed form
62901F42074L239L091J854M4j229j689k084k610k348q89N54P25J52L41J651L135
62885F46011M029M292L931K993K153K158K580K159O22q43j244j061j278j984k584
62870F61934k852l072l422l790m065m173m035l774l785m185m408l814k624j746
62856F12189j645j805j535r10o04r09j353j330q36l70k42k85j93P0L06L56K56
62839F01160K23M90J025J421J305Q81P67J200J707J775J478J187R91P98P90J274
62823F18472K135K911L411L832M183M076L300K317J835K012K390K554K592K820
62809F58840L275L676L935M346N144N999O335O169O219O973Q054Q745Q921R081
62795G45712R593J0331J1025J1651J2386J3505J5295J7789K0542K2978K4999K6962
$$ plain form
62783 942768 971741 1002381 1034134 1066992 1101758 1139388 1180258 1224208 1271113 1321266 1375446
62772 1375446 1434763 1500041 1570811 1644983 1720053 1794754 1869019 1942122 2011435 2073495 2125894
62761 2125894 2167570 2197603 2214635 2217596 2206350 2181529 2144316 2096602 2040584 1977806 1908999
62750 1908999 1835220 1758598 1681456 1605196 1530575 1458570 1390174 1325614 1264617 1207454 1154959
62739 1154959 1107407 1064071 1024152 987657 955087 926591 901653 879365 858916 840089 823294
62728 823294 808882 796439 785142 774808 766112 759662 755273 752333 750548 750113 751401 754581 759299
62715 759299 764668 769937 775295 781745 790147 800715 813401 828158 844573 861788 879315 897756
62703 897756 918415 942322 969717 1000233 1033379 1069065 1107861 1150553 1197431 1248381 1303661
$$ packed form
62783I42768K8973L0640L1753L2858L4766L7630M0870M3950M6905N0153N4180
62772A375446N9317O5278P0770P4172P5070P4701P4265P3103O9313O2060N2399
62761B125894M1676L0033J7032K961j1246k4821l7213m7714n6018o2778o8807
62750A908999p3779p6622p7142p6260p4621p2005o8396o4560o0997n7163n2495
62739A154959m7552m3336l9919l6495l2570k8496k4938k2288k0449j8827j6795
62728H23294j4412j2443j1297j0334q696o450m389k940j785m35J288L180M718
62715G59299N369N269N358O450Q402J0568J2686J4757J6415J7215J7527J8441
62703H97756K0659K3907K7395L0516L3146L5686L8796M2692M6878N0950N5280
$$ plain form
62692 1303661 1363916 1429065 1497695 1568136 1639706 1712232 1784587 1854489 1919780 1979154 2031424
62681 2031424 2074750 2107106 2127212 2134570 2128812 2109559 2077053 2032589 1978139 1915781 1847619 1775867
62669 1775867 1702487 1628715 1555296 1483212 1413776 1347933 1285893 1227661 1173428 1123153 1076289
62658 1076289 1032537 992539 957153 926274 899016 874839 853708 835140 817999 801555 786126
62647 786126 772412 760717 750917 742537 734631 726283 717674 710048 704250 699817 695932 692676 690686 690024
62633 690024 689963 689631 688390 685905 682406 678628 675027 671277 667011 662684 659105 656363 653874 651330 648956
62618 648956 646884 645002 643496 642911 643378 644262 644863 645203 645861 647262 649360 651905 654803 658160 662073 666520
62602 666520 671555 677482 684617 692940 702296 712978 725726 741002 758582 778050 799324 822571
$$ packed form
62692A303661O0255O5149O8630P0441P1570P2526P2355O9902O5291N9374N2270
62681B031424M3326L2356K0106P358n758j9253l2506m4464n4450o2358o8162p1752
62669A775867p3380p3772p3419p2084o9436o5843o2040n8232n4233n0275m6864
62658A076289m3752l9998l5386l0879k7258k4177k1131j8568j7141j6444j5429
62647G86126j3714j1695r800q380p906q348q609p626n798m433l885l256j990o62
62633F90024o1l32j241k485l499l778l601l750m266m327l579k742k489k544k374
62618F48956k072j882j506n85M67Q84O01L40O58J401K098K545K898L357L913M447
62602F66520N035N927P135Q323R356J0682J2748J5276J7580J9468K1274K3247
$$ plain form
62590 822571 847962 875736 906111 938887 973459 1009356 1046283 1083491 1119752 1154284 1186928
62579 1186928 1216902 1242196 1260970 1272910 1278374 1276937 1268012 1252502 1232449 1209036 1182087 1151668
62567 1151668 1118935 1085045 1050327 1015088 980422 947554 916959 888614 862640 839173 817990
62556 817990 798722 781189 765283 750786 737489 725170 713486 702333 692344 684378 678369 673321
62544 673321 668596 664424 660925 657620 654502 652615 652664 653712 654224 653937 653655 653561 652951 651733 651048 651992 654502
62527 654502 657982 662412 668270 675748 684578 694513 705547 717715 730983 745430 761385 779325 799634
62514 799634 822509 848104 876726 908726 944158 982721 1024235 1068945 1117027 1167856 1220143
62503 1220143 1272926 1326102 1379838 1433739 1486923 1538680 1588619 1636123 1680118 1719804 1755489
$$ packed form
62590H22571K5391K7774L0375L2776L4572L5897L6927L7208L6261L4532L2644
62579A186928K9974K5294J8774J1940N464j437q925j5510k0053k3413k6949l0419
62567A151668l2733l3890l4718l5239l4666l2868l0595k8345k5974k3467k1183
62556H17990j9268j7533j5906j4497j3297j2319j1684j1153r989p966o009n048
62544F73321m725m172l499l305l118j887M9J048N12k87k82r4o10j218o85R44K510
62527F54502L480M430N858P478Q830R935J1034J2168J3268J4447J5955J7940K0309
62514G99634K2875K5595K8622L2000L5432L8563M1514M4710M8082N0829N2287
62503A220143N2783N3176N3736N3901N3184N1757M9939M7504M3995L9686L5685
$$ plain form
62492 1755489 1788242 1818583 1845833 1869075 1888499 1905331 1920199 1931677 1936588 1931815 1916205 1891175
62480 1891175 1859594 1823653 1783376 1737034 1682991 1621204 1553299 1481782 1409226 1337657 1268123
62469 1268123 1200856 1136125 1074843 1018196 966838 920714 879567 843264 811656 784445 761305
62458 761305 741903 725681 711840 699669 688831 679183 670444 662227 654366 647107 640933 636255 633195
62445 633195 631466 630387 629223 627742 626405 625818 625996 626379 626551 626635 626826 626940 626712 626284 625906 625271 623675
62428 623675 620923 617685 614746 612198 609525 606258 602416 598570 595586 594024 593559 593155 591952 589802 586986
62413 586986 583814 580741 578424 577171 576575 576015 575410 575123 575410 576371 578253 581239 585052 589296 594205 600500
62397 600500 608427 617462 627041 637017 647210 657191 666938 677140 688292 699857 710880 721086 730796
$$ packed form
62492A755489L2753L0341K7250K3242J9424J6832J4868J1478M911m773j5610k5030
62480A891175l1581l5941m0277m6342n4043o1787o7905p1517p2556p1569o9534
62469A268123o7267o4731o1282n6647n1358m6124m1147l6303l1608k7211k3140
62458G61305j9402j6222j3841j2171j0838r648q739q217p861p259o174m678l060
62445F33195j729j079j164j481j337n87J78L83J72Q4J91J14k28m28l78o35j596
62428F23675k752l238k939k548k673l267l842l846k984j562m65m04j203k150k816
62413E86986l172l073k317j253n96n60o05k87K87R61J882K986L813M244M909O295
62397F00500P927R035R579R976J0193R981R747J0202J1152J1565J1023J0206R710
$$ plain form
62384 730796 740099 748906 757642 766882 776120 783776 788884 792109 794627 796657 797805 798357 799286 801116 803613
62369 803613 806743 811247 817997 827305 839215 854059 872342 894259 919646 948263 979985 1014831
62357 1014831 1052981 1094586 1139470 1187182 1237428 1290139 1344897 1400487 1455170 1507182 1554834
62346 1554834 1596649 1631816 1660293 1682008 1696246 1702366 1700955 1693546 1681009 1662793 1637934 1606270
62334 1606270 1568344 1524706 1476017 1423673 1369650 1315577 1262270 1210264 1160369 1113464 1070022
62323 1070022 1030139 993911 961426 932394 906109 881934 859700 839571 821688 806083 792714
62312 792714 781364 771619 763159 756021 750410 746390 743996 743474 744982 748114 752129 756666 761832 767521
62298 767521 773170 778344 783045 787207 790455 792723 794591 796456 797782 797763 796330 793838 790128 784818 778463
$$ packed form
62384G30796R303Q807Q736R240R238P656N108L225K518K030J148N52R29J830K497
62369H03613L130M504O750R308J1910J4844J8283K1917K5387K8617L1722L4846
62357A014831L8150M1605M4884M7712N0246N2711N4758N5590N4683N2012M7652
62346A554834M1815L5167K8477K1715J4238O120j411p409j2537j8216k4859l1664
62334A606270l7926m3638m8689n2344n4023n4073n3307n2006m9895m6905m3442
62323A070022l9883l6228l2485k9032k6285k4175k2234k0129j7883j5605j3369
62312G92714j1350r745q460p138n611m020k394n22J508L132M015M537N166N689
62298G67521N649N174M701M162L248K268J868J865J326j9j433k492l710n310o355
$$ plain form
62283 778463 772452 767531 763153 758573 753854 749410 745186 740903 736775 733444 731366 730628 731173 732949 736023
62268 736023 740874 748311 758779 771917 787152 804514 824535 847544 873560 902781 935634 972223
62256 972223 1012118 1054843 1100303 1148532 1199219 1251531 1304107 1355046 1402131 1443358 1477288
62245 1477288 1502913 1519467 1526744 1525488 1517159 1503143 1484215 1460603 1432255 1399033 1361030 1319095
62233 1319095 1274890 1230156 1185868 1142253 1099512 1058309 1019596 984260 952854 925327 900943
62222 900943 878801 858598 840653 825093 811399 798962 787724 777957 769652 762405 755700 749069
62210 749069 742305 735881 730832 727720 725921 724410 723024 722384 722809 723991 725692 727932 730398 732498 734407
62195 734407 737377 742532 749805 758504 768354 779371 791164 803109 815119 827530 840277 852773
$$ packed form
62283G78463o011m921m378m580m719m444m224m283m128l331k078p38N45J776L074
62268G36023M851P437J0468J3138J5235J7362K0021K3009K6016K9221L2853L6589
62256I72223L9895M2725M5460M8229N0687N2312N2576N0939M7085M1227L3930
62245A477288K5625J6554P277j256q329j4016j8928k3612k8348l3222l8003m1935
62233A319095m4205m4734m4288m3615m2741m1203l8713l5336l1406k7527k4384
62222I00943k2142k0203j7945j5560j3694j2437j1238r767q305p247o705o631
62210G49069o764o424n049l112j799j511j386o40M25J182J701K240K466K100J909
62195G34407K970N155P273Q699R850J1017J1793J1945J2010J2411J2747J2496
$$ plain form
62183 852773 864710 876396 888035 899100 908763 916653 922922 927781 931390 934202 937034 940647 945459
62170 945459 951864 960693 973045 989552 1010007 1033840 1060813 1091012 1124247 1159719 1196370 1233330
62158 1233330 1269898 1305209 1338081 1367166 1391206 1409286 1421049 1426823 1427503 1424158 1417568 1408031
62146 1408031 1395587 1380377 1362758 1343223 1322459 1301431 1281052 1261667 1243193 1225897 1210607
62135 1210607 1197862 1187201 1177769 1169318 1162075 1155877 1150173 1144967 1141053 1139044 1138710 1139648 1142213 1147343
62121 1147343 1155594 1166617 1179444 1193067 1206822 1220431 1233753 1246532 1258448 1269294 1278853 1286625
62109 1286625 1291986 1294653 1294855 1293144 1290294 1287254 1284705 1282672 1281068 1280634 1282744 1288025 1295672 1304458
62095 1304458 1314027 1324895 1337677 1352815 1370734 1391575 1414698 1438742 1462151 1483532 1501853
$$ packed form
62183H52773J1937J1686J1639J1065R663P890O269M859L609K812K832L613M812
62170I45459O405Q829J2352J6507K0455K3833K6973L0199L3235L5472L6651L6960
62158A233330L6568L5311L2872K9085K4040J8080J1763N774O80l345o590r537
62146A408031j2444j5210j7619j9535k0764k1028k0379j9385j8474j7296j5290
62135A210607j2745j0661r432q451p243o198n704n206l914k009l34R38K565N130
62121A147343Q251J1023J2827J3623J3755J3609J3322J2779J1916J0846R559P772
62109A286625N361K667K02j711k850l040k549k033j604m34K110N281P647Q786
62095A304458R569J0868J2782J5138J7919K0841K3123K4044K3409K1381J8321
$$ plain form
62084 1501853 1516848 1529237 1540188 1550432 1560085 1569331 1579063 1590700 1605387 1623307 1643734 1665812
62072 1665812 1689257 1714180 1740232 1766172 1790430 1811942 1830363 1845656 1857681 1866186 1871176 1873306
62060 1873306 1873792 1873698 1873330 1872453 1870894 1868524 1864843 1859245 1851828 1843479 1835013 1826709 1818720 1811079 1802830
62045 1802830 1791850 1776344 1756164 1732112 1704297 1672007 1635089 1594627 1552035 1507975 1462346
62034 1462346 1415001 1366339 1317501 1270050 1225222 1183427 1144621 1108957 1076668 1047448 1020486
62023 1020486 995308 972180 951482 932999 916040 900003 884575 869604 855033 840943 827559
62012 827559 815284 804787 796763 791326 787768 785273 783910 784538 787612 792467 798151 804636 812639 822234
61998 822234 832252 841269 848711 854601 858670 860268 858982 854899 848397 840015 830349 819593 807363
$$ packed form
62084A501853J4995J2389J0951J0244R653R246R732J1637J4687J7920K0427K2078
62072A665812K3445K4923K6052K5940K4258K1512J8421J5293J2025Q505M990K130
62060A873306M86r4l68q77j559k370l681n598p417q349q466q304p989p641q249
62045A802830j0980j5506k0180k4052k7815l2290l6918m0462m2592m4060m5629
62034A462346m7345m8662m8838m7451m4828m1795l8806l5664l2289k9220k6962
62023A020486k5178k3128k0698j8483j6959j6037j5428j4971j4571j4090j3384
62012H27559j2275j0497q024n437l558k495j363O28L074M855N684O485Q003R595
61998H22234J0018R017P442N890M069J598j286m083o502q382r666j0756j2230
$$ plain form
61985 807363 793412 778376 763289 748613 734297 720655 708426 698014 689337 682335 676848 672047
61973 672047 667007 662009 658315 656362 655183 653949 652992 652719 652635 652343 652574 654130 656486 658590 660554 663412
61957 663412 667526 672405 677988 684992 693871 704294 715828 728412 742090 757027 773938 793890
61945 793890 817435 844339 874137 906499 941090 977611 1015994 1056129 1097554 1139856 1183076
61934 1183076 1226961 1270034 1310301 1347019 1381006 1413069 1442823 1469227 1491525 1509306 1522192
61923 1522192 1529922 1532440 1529850 1522687 1512266 1500172 1487263 1473681 1460035 1447984 1439397 1435411
61911 1435411 1436516 1442911 1454340 1469935 1488638 1509541 1531600 1553360 1573304 1590188 1602806 1609760
61899 1609760 1609851 1602622 1588344 1567650 1541409 1510812 1477284 1442156 1406320 1370151 1333906 1298352
$$ packed form
61985H07363j3951j5036j5087j4676j4316j3642j2229j0412q677p002n487m801
61973F72047n040m998l694j953j179j234r57k73q4k92K31J556K356K104J964K858
61957F63412M114M879N583P004Q879J0423J1534J2584J3678J4937J6911J9952
61945G93890K3545K6904K9798L2362L4591L6521L8383M0135M1425M2302M3220
61934A183076M3885M3073M0267L6718L3987L2063K9754K6404K2298J7781J2886
61923A522192P730K518k590p163j0421j2094j2909j3582j3646j2051q587l986
61911A435411J105O395J1429J5595J8703K0903K2059K1760J9944J6884J2618O954
61899A609760R1p229j4278k0694k6241l0597l3528l5128l5836l6169l6245l5554
$$ plain form
61887 1298352 1264686 1233584 1204583 1176850 1150303 1125415 1102111 1079647 1057588 1036270 1016156
61876 1016156 997436 980410 965629 953305 943151 935125 929859 927998 929483 933791 940517 949467 960572
61863 960572 973997 990074 1008990 1030940 1056588 1086742 1121383 1159740 1201710 1248433 1300800
61852 1300800 1358040 1418596 1481935 1548497 1617970 1688584 1758269 1825814 1890599 1951750 2007985
61841 2007985 2057923 2100193 2133453 2156698 2169729 2173301 2168877 2158190 2142906 2124588 2104982 2086308
61829 2086308 2070992 2060852 2056419 2057132 2062274 2071569 2084626 2099830 2114166 2124342 2127915 2123361 2109663
61816 2109663 2086460 2054308 2014133 1966472 1911847 1851872 1789231 1726288 1664229 1603752 1545924
61805 1545924 1491810 1441655 1395044 1351771 1312184 1276800 1245913 1219460 1196917 1177392 1160150
$$ packed form
61887A298352l3666l1102k9001k7733k6547k4888k3304k2464k2059k1318k0114
61876A016156j8720j7026j4781j2324j0154q026n266j861J485M308O726Q950J1105
61863I60572J3425J6077J8916K1950K5648L0154L4641L8357M1970M6723N2367
61852A300800N7240O0556O3339O6562O9473P0614O9685O7545O4785O1151N6235
61841B007985M9938M2270L3260K3245J3031L572m424j0687j5284j8318j9606j8674
61829B086308j5316j0140m433P13N142R295J3057J5204J4336J0176L573m554j3698
61816B109663k3203l2152m0175m7661n4625n9975o2641o2943o2059o0477n7828
61805A545924n4114n0155m6611m3273l9587l5384l0887k6453k2543j9525j7242
$$ plain form
61794 1160150 1145097 1132519 1122297 1113589 1105398 1097362 1089859 1083306 1077415 1071316 1064453 1057185 1050404
61781 1050404 1044769 1040473 1037456 1035422 1033757 1031859 1029640 1027452 1025580 1024032 1022691 1021261 1019278 1016658
61767 1016658 1014197 1012902 1012759 1012748 1012199 1011489 1011149 1010949 1010333 1009325 1008392 1007689 1006895 1005695 1004003 1001786 999008
61750 999008 995755 992231 988586 984870 981083 977219 973344 969662 966368 963448 960772 958316 956157 954313
61736 954313 952854 952076 952307 953610 955964 959554 964497 970427 976840 983712 991189 998753 1005458 1011096 1016464
61721 1016464 1022266 1028431 1034752 1041474 1048794 1056270 1063189 1069159 1073966 1077264 1078756 1078398 1076186 1072131
61707 1072131 1066725 1060921 1055317 1049728 1043829 1037800 1032038 1026692 1021842 1017719 1014349 1011402 1008685 1006334
61693 1006334 1004155 1001365 997509 993146 989019 984914 979984 974025 967800 962193 957466 953307 949261 945173
$$ packed form
61794A160150j5053j2578j0222q708q191q036p503o553n891o099o863p268o781
61781A050404n635m296l017k034j665j898k219k188j872j548j341j430j983k620
61767A016658k461j295j43j1n49p10l40k00o16j008r33p03p94j200j692k217k778
61750I99008l253l524l645l716l787l864l875l682l294k920k676k456k159j844
61736I54313j459p78K31J303K354L590M943N930O413O872P477P564O705N638N368
61721A016464N802O165O321O722P320P476O919N970M807L298J492l58k212m055
61707A072131n406n804n604n589n899o029n762n346m850m123l370k947k717k351
61693A006334k179k790l856m363m127m105m930n959o225n607m727m159m046m088
$$ plain form
61679 945173 941355 938137 935210 931815 927692 923297 918841 913834 907974 901778 895741 889511 882711 876044
61665 876044 870649 866574 862768 858528 854279 850896 848881 848197 848438 849043 849666 850275 850745 850731 850226 849761 849614
61648 849614 849361 848824 848889 850557 853559 856787 859803 862952 866208 868911 870722 871839 872116 870867 867815
61633 867815 863499 858450 852611 845828 838362 830613 822883 815602 809290 804084 799767 796382 794242 793197
61619 793197 792532 791885 791652 792046 792221 790757 786725 779976 770790 759655 747204 734017 720607 707724
61605 707724 696301 686758 678496 670397 661790 652853 644354 637206 632031 628742 626497 624188 621080 616995
61591 616995 612065 606479 600502 594591 589297 584816 580700 576337 571874 568314 566359 565372 563926 561307
61577 561307 558106 555352 553495 552323 551464 550689 549865 548878 547715 546588 545834 545521 545222 544474 543462 542865
$$ packed form
61679I45173l818l218k927l395m123m395m456n007n860o196o037o230o800o667
61665H76044n395m075l806m240m249l383k015o84K41O05O23O09M70j4n05m65j47
61648H49614k53n37O5J668L002L228L016L149L256K703J811J117K77j249l052
61633H67815m316n049n839o783p466p749p730p281o312n206m317l385k140j045
61619G93197o65o47k33L94J75j464m032o749r186j1135j2451j3187j3410j2883
61605G07724j1423r543q262q099q607q937q499p148n175l289k245k309l108m085
61591F16995m930n586n977n911n294m481m116m363m463l560j955r87j446k619
61577E61307l201k754j857j172q59p75q24r87j163j127p54l13k99p48j012n97
$$ plain form
61561 542865 542924 543112 542974 542808 543197 544291 545951 548105 550457 552327 553451 554582 556505 558768 560254 560872
61545 560872 561737 563595 565979 568176 570237 572676 575795 579669 584245 588983 592831 595022 595731 595659 595198
61530 595198 594184 592278 589336 585576 581464 577311 572987 568327 563760 560125 557791 556307 555077 554033
61516 554033 553425 553202 552883 551969 550362 548383 546342 544069 541140 537695 534697 532949 532116 531199 529792 528323
61500 528323 527193 526369 525861 525965 526806 528098 529493 530796 531746 532129 532282 533041 534885 537427 539925 542024
61484 542024 543871 545813 548136 550800 553329 555210 556467 557605 558922 560154 560815 560628 559660 558330 557186
61469 557186 556364 555344 553654 551712 550463 550265 550642 551083 551487 551806 551887 551844 552023 552414 552622 552576 552731 553372
61451 553372 554205 554856 555366 555923 556546 557234 558143 559472 561504 564735 569458 575185 581034 586812 593074 599986
$$ packed form
61561E42865N9J88j38j66L89J094J660K154K352J870J124J131J923K263J486O18
61545E60872Q65J858K384K197K061K439L119L874M576M738L848K191P09p2m61
61530E95198j014j906k942l760m112m153m324m660m567l635k334j484j230j044
61516E54033o08k23l19r14j607j979k041k273k929l445k998j748q33r17j407j469
61500E28323j130q24n08J04Q41J292J395J303R50L83J53P59J844K542K498K099
61484E42024J847J942K323K664K529J881J257J138J317J232O61j87r68j330j144
61469E57186q22j020j690j942j249j98L77M41M04L19Q1m3J79L91K08m6J55O41
61451E53372Q33O51N10N57O23O88R09J329K032L231M723N727N849N778O262O912
$$ plain form
61435 599986 606794 612731 617831 622506 626865 630859 634585 638048 641082 643957 647529 652319 657789 663001
61421 663001 667678 672138 676402 679878 681871 682069 680606 677896 674334 670132 665519 660978 656880 652864
61407 652864 648136 642526 636777 631610 627017 622693 618606 614711 610671 606327 602068 598280 594730 590987
61393 590987 587212 584118 582243 581567 581654 581936 582029 582026 582354 583269 584711 586638 589012 591430 593305 594678 596293
61376 596293 598587 601183 603742 606730 610730 615378 619607 622760 625013 626903 628928 631494 634860 639081
61362 639081 644061 649531 654997 660239 665991 673574 683479 694786 706341 718060 730678 744693 760124
61349 760124 776928 795082 814401 834682 855895 877914 900280 922414 943707 963171 979506
61338 979506 991818 999833 1003187 1001317 994634 984997 974200 962504 949519 935939 923239 911951
$$ packed form
61435E99986O808N937N100M675M359L994L726L463L034K875L572M790N470N212
61421F63001M677M460M264L476J993J98j463k710l562m202m613m541m098m016
61407F52864m728n610n749n167m593m324m087l895m040m344m259l788l550l743
61393E90987l775l094j875o76Q7K82R3lL28R15J442J927K374K418J875J373J615
61376E96293K294K596K559K988M000M648M229L153K253J890K025K566L366M221
61362F39081M980N470N466N242N752P583R905J1307J1555J1719J2618J4015J5431
61349G60124J6804J8154J9319K0281K1213K2019K2366K2134K1293J9464J6335
61338I79506J2312Q015L354j870o683r637j0797j1696j2985j3580j2700j1288
$$ plain form
61326 911951 901466 891546 882845 875696 869416 863342 857741 853130 849311 845744 842530 840339 839460 839416 839577
61311 839577 839878 840797 842828 846095 850431 855675 861777 868697 876401 884979 894545 905039 916269 928075
61297 928075 940100 951425 960908 967955 972518 974180 971984 965599 956189 945589 934967 924722 915249
61284 915249 907128 900721 896228 894045 894518 897318 901460 905945 910175 913937 917507 921696 927395 934997
61270 934997 944456 955769 969079 984378 1001423 1019965 1039915 1061396 1084728 1110044 1136751 1163679
61258 1163679 1190078 1216173 1242446 1268647 1293799 1316719 1336107 1350556 1359101 1361573 1357989 1347952
61246 1347952 1331296 1309125 1283575 1256576 1229315 1202688 1177577 1154613 1134163 1116600 1102088
61235 1102088 1090171 1080124 1071887 1066273 1064072 1065177 1068586 1072978 1077389 1081644 1086190 1091296 1096534
$$ packed form
61326I11951j0485r920q701p149o280o074n601m611l819l567l214k191q79m4J61
61311H39577L01R19K031L267M336N244O102O920P704Q578R566J0494J1230J1806
61297I28075J2025J1325R483P047M563J662k196o385r410j0600j0622j0245r473
61284I15249q121o407m493k183M73K800M142M485M230L762L570M189N699P602
61270I34997R459J1313J3310J5299J7045J8542J9950K1481K3332K5316K6707K6928
61258A163679K6399K6095K6273K6201K5152K2920J9388J4449Q545K472l584j0037
61246A347952j6656k2171k5550k6999k7261k6627k5111k2964k0450j7563j4512
61235A102088j1917j0047q237n614k201J105L409M392M411M255M546N106N238
$$ plain form
61222 1096534 1101280 1105484 1109544 1113513 1116929 1119413 1121036 1122038 1122516 1122547 1122503 1123134 1125314 1129496 1135426
61207 1135426 1142631 1151293 1162225 1175873 1191827 1209549 1228990 1250032 1271894 1293809 1316077 1339830
61195 1339830 1365884 1394262 1424613 1456533 1489533 1523076 1556600 1589378 1620744 1650682 1679546
61184 1679546 1706701 1729963 1747084 1757361 1761253 1759117 1751322 1739107 1724065 1706783 1686897 1664421
61172 1664421 1639943 1613432 1583913 1550760 1514576 1476512 1437386 1397849 1358776 1321064 1285344
61161 1285344 1252115 1221857 1194808 1170894 1149980 1131969 1116703 1104044 1093972 1086329 1080679 1076795
61149 1076795 1075044 1075805 1078690 1082843 1087856 1093939 1101457 1110861 1122727 1137091 1152811 1168205 1182250
61136 1182250 1194710 1205534 1215023 1224440 1235560 1249645 1267403 1289534 1316273 1346594 1379050 1413465
$$ packed form
61222A096534M746M204M060L969L416K484J623J002M78L1m4O31K180M182N930
61207A135426P205Q662J0932J3648J5954J7722J9441K1042K1862K1915K2268K3753
61195A339830K6054K8378L0351L1920L3000L3543L3524L2778L1366K9938K8864
61184A679546K7155K3262J7121J0277L892k136p795j2215j5042j7282j9886k2476
61172A664421k4478k6511k9519l3153l6184l8064l9126l9537l9073l7712l5720
61161A285344l3229l0258k7049k3914k0914j8011j5266j2659j0072p643n650l884
61149A076795j751P61K885M153N013O083P518R404J1866J4364J5720J5394J4045
61136A182250J2460J0824R489R417J1120J4085J7758K2131K6739L0321L2456L4415
$$ plain form
61124 1413465 1450741 1490950 1532777 1575103 1617947 1661380 1704593 1746649 1787278 1826178 1862191
61113 1862191 1893891 1920551 1942067 1958348 1969302 1975056 1975773 1971494 1962412 1948956 1931388 1909613
61101 1909613 1883537 1853360 1819511 1782706 1743934 1703864 1662251 1618477 1572615 1525350 1477053
61090 1477053 1427718 1377823 1328471 1280678 1235290 1193418 1155893 1122223 1091160 1062531 1037411
61079 1037411 1016320 998423 982909 969956 959748 951681 945214 940555 937755 936099 935182 935708 938332
61066 938332 942477 947168 952397 958794 966535 975430 985606 997271 1010304 1024825 1041719 1061763 1084583
61053 1084583 1109194 1135210 1162851 1192147 1222874 1254931 1288058 1321482 1354490 1387021 1419126
61042 1419126 1450195 1479394 1506513 1531629 1554252 1573550 1589327 1602122 1612423 1620231 1625351 1627691
$$ packed form
61124A413465L7276M0209M1827M2326M2844M3433M3213M2056M0629L8900L6013
61113A862191L1700K6660K1516J6281J0954N754P17m279r082j3456j7568k1775
61101A909613k6076l0177l3849l6805l8772m0070m1613m3774m5862m7265m8297
61090A477053m9335m9895m9352m7793m5388m1872l7525l3670l1063k8629k5120
61079A037411k1091j7897j5514j2953j0208q067o467m659k800j656r17N26K624
61066I38332M145M691N229O397P741Q895J0176J1665J3033J4521J6894K0044K2820
61053A084583K4611K6016K7641K9296L0727L2057L3127L3424L3008L2531L2105
61042A419126L1069K9199K7119K5116K2623J9298J5777J2795J0301P808N120K340
$$ plain form
61030 1627691 1627426 1625116 1621386 1616331 1609675 1601782 1593876 1586874 1580671 1575148 1571243 1570334 1573094 1579696
61016 1579696 1590703 1607035 1629300 1657722 1692399 1733232 1780050 1833159 1893074 1959282 2030274
61005 2030274 2105643 2187406 2278450 2380582 2495159 2624697 2772491 2941298 3134042 3355591
60995 3355591 3612629 3912152 4261583 4670347 5150452 5716182 6384575 7175223 8106946
60986 8106946 9193758 10444249 11862769 13449013 15200102 17119283 19217093 21480169
60978 21480169 23813082 26007992 27798178 28980178 29515444 29534240 29254241 28891660 28614591
60969 28614591 28517578 28582768 28649682 28453117 27740760 26398998 24498304 22238593 19851083
60960 19851083 17523507 15372675 13450932 11766462 10304957 9045204 7965701 7045626
$$ packed form
61030A627691k65k310l730n055o656p893p906p002o203n523l905r09K760O602
61016A579696J1007J6332K2265K8422L4677M0833M6818N3109N9915O6208P0992
61005B030274P5369Q1763R1044J02132J14577J29538J47794J68807J92744K21549
60995C355591K57038K99523L49431M08764M80105N65730O68393P90648R31723
60986H106946J086812J250491J418520J586244J751089J919181K097810K263076
60978B1480169K332913K194910J790186J182000N35266J8796k79999l62581k77069
60969B8614591r7013O5190O6914j96565p12357j341762j900694k259711k387510
60960A9851083k327576k150832j921743j684470j461505j259753j079503r20075
$$ plain form
60952 7045626 6265054 5605510 5049719 4581158 4184484 3846132 3554205 3298678 3072397
60943 3072397 2871061 2691408 2529871 2383519 2251231 2132717 2026811 1931628 1845892 1768906
60933 1768906 1699363 1635239 1574869 1517428 1462571 1410534 1362474 1319597 1281706 1247473 1216357
60922 1216357 1189320 1167134 1148808 1132540 1117737 1105236 1095640 1088289 1082056 1076540 1072082 1068947
60910 1068947 1066874 1065251 1063375 1060618 1056718 1051875 1046242 1039303 1030204 1018842 1006214 993437 980820
60897 980820 968170 955518 942997 930283 916856 902807 888906 875837 863870 853191 843947 835818
60885 835818 828102 820439 813096 806380 800231 794594 789715 785782 782666 780328 779114 779222 780158 781157 782062
60870 782062 783430 785784 789021 792568 795929 799109 802610 807038 812661 819397 827155 835959 845667 855811
$$ packed form
60952G045626p80572o59544n55791m68561l96674l38352k91927k55527k26281
60943C072397k01336j79653j61537j46352j32288j18514j05906r5183q5736p6986
60933A768906o9543o4124o0370n7441n4857n2037m8060m2877l7891l4233l1116
60922A216357k7037k2186j8326j6268j4803j2501r596p351o233n516m458l135
60910A068947k073j623j876k757l900m843n633o939r099j1362j2628j2777j2617
60897I80820j2650j2652j2521j2714j3427j4049j3901j3069j1967j0679r244q129
60885H35818p716p663p343o716o149n637m879l933l116k338j214J08R36R99R05
60870G82062J368K354L237L547L361L180L501M428N623O736P758Q804R708J0144
$$ plain form
60856 855811 865895 875742 885443 895088 904654 914053 923128 931771 940126 948628 957707 967405 977251 986378
60842 986378 993853 999082 1001996 1002827 1001840 999417 996208 992743 988814 983577 976355 967116 956161 943770
60828 943770 930407 916843 903708 891049 878606 866369 854581 843356 832637 822467 813001 804220
60816 804220 795931 788091 780839 774124 767599 761136 755219 750549 747266 744807 742527 740260 738238 736755
60802 736755 736061 736315 737386 738822 740264 741848 743982 746840 750311 754342 758999 764194 769736 775655 782165
60787 782165 789218 796504 803910 811588 819380 826693 833295 839855 847245 855485 863767 871390 878417 885455
60773 885455 892997 900866 908219 914277 919147 923655 928313 932933 937413 942281 947980 954054 959666 964630
60759 964630 969409 974249 978891 983011 986417 988965 990776 992460 994609 997196 999910 1002964 1006884 1011529
$$ packed form
60856H55811J0084R847R701R645R566R399R075Q643Q355Q502R079R698R846R127
60842I86378P475N229K914Q31r87k423l209l465l929n237p222r239j0955j2391
60828I43770j3363j3564j3135j2659j2443j2237j1788j1225j0719j0170r466q781
60816H04220q289p840p252o715o525o463n917m670l283k459k280k267k022j483
60802G36755o94K54J071J436J442J584K134K858L471M031M657N195N542N919O510
60787G82165P053P286P406P678P792P313O602O560P390Q240Q282P623P027P038
60773H85455P542P869P353O058M870M508M658M620M480M868N699O074N612M964
60759I64630M779M840M642M120L406K548J811J684K149K587K714L054L920M645
$$ plain form
60745 1011529 1016007 1019754 1023208 1027177 1031959 1037288 1042884 1048818 1055497 1063315 1072204 1081675 1091570 1102597
60731 1102597 1115716 1131099 1148116 1166221 1185357 1205559 1226740 1248897 1271966 1295371 1318244
60720 1318244 1340269 1361813 1383032 1403316 1421868 1438377 1452813 1464998 1474739 1482089 1487004 1488890
60708 1488890 1486885 1480645 1470679 1457851 1442644 1424946 1404479 1381430 1356569 1330780 1304642 1278494
60696 1278494 1252603 1227021 1201564 1176219 1151336 1127102 1103151 1079198 1055811 1033939 1013758
60685 1013758 994664 976420 959582 944533 930679 917017 903188 889704 877415 866995 858638
60674 858638 851905 845994 840362 835056 830417 826607 823457 820614 817710 814513 811019 807434 804169 801769
60660 801769 800491 799829 798829 797148 795477 794625 794660 795337 796856 799480 802823 806398 810629 816339 823224
$$ packed form
60745A011529M478L747L454L969M782N329N596N934O679P818Q889R471R895J1027
60731A102597J3119J5383J7017J8105J9136K0202K1181K2157K3069K3405K2873
60720A318244K2025K1544K1219K0284J8552J6509J4436J2185R741P350M915J886
60708A488890k005o240r966j2828j5207j7698k0467k3049k4861k5789k6138k6148
60696A278494k5891k5582k5457k5345k4883k4234k3951k3953k3387k1872k0181
60685A013758j9094j8244j6838j5049j3854j3662j3829j3484j2289j0420q357
60674H58638o733n911n632n306m639l810l150k843k904l197l494l585l265k400
60660H01769j278o62j000j681j671q52L5O77J519K624L343L575M231N710O885
$$ plain form
60645 823224 829745 834755 838424 841350 843594 845025 845975 847040 848609 850888 853969 857522 860820 863306
60631 863306 864870 865455 864881 863295 861296 859239 856737 853178 848521 843360 838364 833765 829192 823959 817721
60616 817721 810801 803722 796641 789627 783046 777029 770838 763646 755864 748793 742950 737712 732714 728448
60602 728448 725111 721939 718303 714586 711323 708300 705257 702674 701026 699860 698532 697393 697291 698178 699161
60587 699161 699807 700613 702104 704104 705898 706718 706144 704506 702863 702192 702653 703856 705534 707555 709614 711516
60571 711516 713692 716902 721389 726733 732558 739044 746717 755906 766445 777851 789976 803455 819066
60558 819066 836463 854042 870456 885834 901062 916264 930477 942498 951369 956274 956715 953010
60546 953010 946232 937545 927799 917731 908185 900084 894281 891337 891263 893683 898400 905687 915883 928949
$$ packed form
60645H23224O521N010L669K926K244J431R50J065J569K279L081L553L298K486
60631H63306J564N85n74j586j999k057k502l559m657n161m996m599m573n233o238
60616H17721o920p079p081p014o581o017o191p192p782p071n843n238m998m266
60602G28448l337l172l636l717l263l023l043k583j648j166j328j139j02Q87R83
60587F99161O46Q06J491K000J794Q20n74j638j643o71M61J203J678K021K059J902
60571G11516K176L210M487N344N825O486P673R189J0539J1406J2125J3479J5611
60558H19066J7397J7579J6414J5378J5228J5202J4213J2021Q871M905M41l705
60546I53010o778q687r746j0068r546q101n803k944p4K420M717P287J0196J3066
$$ plain form
60532 928949 944592 962503 982213 1003039 1024384 1045733 1066051 1083609 1096878 1105271 1108715 1106991
60520 1106991 1100131 1089173 1075878 1061799 1048077 1035793 1025660 1017412 1010216 1003820 998694 994982
60508 994982 992107 989735 988566 989602 992996 998110 1004581 1012785 1023203 1035774 1050168 1066485 1085317
60495 1085317 1107092 1131765 1159421 1190953 1227733 1270659 1319756 1374575 1434514 1498670 1565730
60484 1565730 1634094 1701667 1765432 1821661 1866871 1898509 1914878 1915034 1899021 1867781 1822654 1765341
60472 1765341 1698533 1625907 1550962 1476136 1403232 1334127 1270460 1212854 1161005 1114461 1072949
60461 1072949 1036107 1003310 973815 946969 922466 900527 881573 865563 851842 839726 828856
60450 828856 818882 809349 800210 792037 785288 779677 774567 769630 764812 760004 755201 750698 746767 743355
$$ packed form
60532I28949J5643J7911J9710K0826K1345K1349K0318J7558J3269Q393L444j724
60520A106991o860j0958j3295j4079j3722j2284j0133q248p196o396n126l712
60508I94982k875k372j169J036L394N114O471Q204J0418J2571J4394J6317J8832
60495A085317K1775K4673K7656L1532L6780M2926M9097N4819N9939O4156O7060
60484A565730O8364O7573O3765N6229M5210L1638J6369J56j6013l1240m5127n7313
60472A765341o6808p2626p4945p4826p2904o9105o3667n7606n1849m6544m1512
60461A072949l6842l2797k9495k6846k4503k1939j8954j6010j3721j2116j0870
60450H28856r974r533r139q173o749n611n110m937m818m808m803m503l931l412
$$ plain form
60436 743355 740302 737608 735254 733088 731028 729035 726788 724008 721215 719382 718479 717205 714771 712240
60422 712240 711350 712592 715176 718295 721492 724249 726184 727594 728995 730267 730883 730795 730414 730026 729911 730720
60406 730720 732810 735333 736935 737444 738042 739662 741972 744137 745910 747648 749736 752290 755184 758211 761374
60391 761374 764896 768738 772353 775309 777991 781194 785145 789323 793104 796159 798447 800254 802141 804386
60377 804386 806618 808400 809938 811804 814152 816682 819160 821521 823700 825766 827987 830317 832226 833503
60363 833503 834788 836694 838870 840637 842130 843949 846051 847898 849451 851181 853272 855723 858991 863528
60349 863528 868769 873532 877420 880976 884641 888616 893684 900949 910449 920982 931523 941874 951785
60336 951785 960572 968025 974726 980863 985470 987312 985894 981240 973456 963060 951180 938932 926997
$$ packed form
60436G43355l053k694k354k166k060j993k247k780k793j833r03j274k434k531
60422G12240q90J242K584L119L197K757J935J410J401J272O16q8l81l88j15Q09
60406G30720K090K523J602N09N98J620K310K165J773J738K088K554K894L027L163
60391G61374L522L842L615K956K682L203L951M178L781L055K288J807J887K245
60377H04386K232J782J538J866K348K530K478K361K179K066K221K330J909J277
60363H33503J285J906K176J767J493J819K102J847J553J730K091K451L268M537
60349H63528N241M763L888L556L665L975N068P265R500J0533J0541J0351R911
60336I51785Q787P453O701O137M607J842j418m654p784j0396j1880j2248j1935
$$ plain form
60323 926997 915980 906535 898772 892188 886578 882494 880385 879824 880015 880626 881708 883232 885193 887930 891996
60308 891996 897841 905688 915439 926598 938622 951457 965435 980794 997728 1016745 1038344 1062411
60296 1062411 1088532 1116620 1146236 1175306 1200634 1219967 1232636 1238050 1234987 1223130 1204258 1181028
60284 1181028 1155350 1128762 1103465 1081575 1063564 1048392 1035045 1023132 1012147 1001171 989635
60273 989635 977729 965768 953577 940865 928013 916130 906155 897946 890442 882830 875340 868738 863363
60260 863363 859093 855983 854225 853514 853082 852451 851632 850586 849171 847661 846613 846036 845371 844378 843304 841986
60244 841986 839725 836480 833358 831335 830189 829335 829067 830227 832975 836562 840135 843365 846556 850487 855791
60229 855791 862140 868341 873528 877882 882038 886394 891337 897458 904901 912932 920673 927980 935197 942470
$$ packed form
60323I26997j1017r445p763o584n610m084k109n61J91O11J082J524J961K737M066
60308H91996N845P847R751J1159J2024J2835J3978J5359J6934J9017K1599K4067
60296A062411K6121K8088K9616K9070K5328J9333J2669N414l063j1857j8872k3230
60284A181028k5678k6588k5297k1890j8011j5172j3347j1913j0985j0976j1536
60273I89635j1906j1961j2191j2712j2852j1883r975q209p504p612p490o602n375
60260H63363m270l110j758p11m32o31q19j046j415j510j048n77o65r93j074j318
60244H41986k261l245l122k023j146q54k68J160K748L587L573L230L191L931N304
60229H55791O349O201N187M354M156M356M943O121P443Q031P741P307P217P273
$$ plain form
60215 942470 949691 956664 962971 968188 972680 977568 983399 989350 994403 998709 1003066 1007484 1011179 1013686
60201 1013686 1015163 1015668 1014941 1013009 1010463 1008008 1005982 1004167 1001785 997982 992768 987298 982824 979574
60187 979574 976918 974258 971308 967994 964766 962757 962864 964736 967178 969475 971779 974378 977202 980102
60173 980102 983127 986453 990342 995027 1000272 1005207 1009045 1011863 1014228 1016248 1017532 1018022 1018234 1018583 1018997
60158 1018997 1019375 1020026 1021385 1023524 1026173 1029107 1032417 1036377 1041071 1046216 1051473 1056865 1062672 1068924
60144 1068924 1075351 1081817 1088371 1094774 1100582 1105932 1111650 1118195 1125056 1131723 1138727 1147049 1156823 1167303
60130 1167303 1177832 1188081 1197437 1204928 1209848 1212014 1211416 1208124 1202563 1195327 1186618 1176332 1164866
60117 1164866 1153422 1143228 1134617 1126978 1119341 1110941 1101490 1091244 1080918 1071403 1063352 1056879 1051690
$$ packed form
60215I42470P221O973O307N217M492M888N831N951N053M306M357M418L695K507
60201A013686J477N05p27j932k546k455k026j815k382l803n214n470m474l250
60187I79574k656k660k950l314l228k009J07J872K442K297K304K599K824K900
60173I80102L025L326L889M685N245M935L838K818K365K020J284M90K12L49M14
60158A018997L78O51J359K139K649K934L310L960M694N145N257N392N807O252
60144A068924O427O466O554O403N808N350N718O545O861O667P004Q322R774J0480
60130A167303J0529J0249R356P491M920K166n98l292n561p236q709j0286j1466
60117A164866j1444j0194q611p639p637q400r451j0246j0326r515q051o473n189
$$ plain form
60104 1051690 1047653 1045164 1044752 1046461 1049884 1054666 1060579 1067281 1074619 1083096 1093288 1104651 1115721
60091 1115721 1125730 1135343 1145478 1156324 1167993 1181132 1195941 1211228 1225444 1238251 1250130
60080 1250130 1260779 1268863 1273253 1273619 1269837 1261652 1249021 1232231 1211685 1188129 1162917 1137355
60068 1137355 1111906 1086692 1062648 1041239 1022993 1007211 993378 981929 973183 966287 959951 953854
60056 953854 948691 945017 942597 940862 939531 938585 937940 937478 937372 938135 940109 943051 946423 949958 953523
60041 953523 956494 957894 957411 955833 954091 952228 949649 946004 941413 936172 930677 925361 920204 914516
60027 914516 907657 899786 891530 883199 874826 866671 859118 852222 845936 840645 836844 834258 831806 828616
60013 828616 824827 821393 819288 818765 819151 819517 819694 820319 821770 823560 825168 826826 828914 831121 833025
$$ packed form
60104A051690m037k489m12J709L423M782N913O702P338Q477J0192J1363J1070
60091A115721J0009R613J0135J0846J1669J3139J4809J5287J4216J2807J1879
60080A250130J0649Q084M390L66l782q185j2631j6790k0546k3556k5212k5562
60068A137355k5449k5214k4044k1409j8246j5782j3833j1449q746o896o336o097
60056I53854n163l674k420j735j331r46o45m62j06P63J974K942L372L535L565
60041I53523K971J400m83j578j742j863k579l645m591n241n495n316n157n688
60027I14516o859p871q256q331q373q155p553o896o286n291l801k586k452l190
60013H28616l789l434k105n23L86L66J77O25J451J790J608J658K088K207J904
$$ plain form
59998 833025 835116 838304 842669 847588 852972 859386 866855 874481 881508 888018 894288 900147 905328 909870
59984 909870 913714 916313 917074 916020 913773 911032 908202 905372 902529 899869 897815 896579 895883 895365 895149
59969 895149 895747 897548 900663 905075 910592 916862 923748 931451 939866 948139 955352 961334 966254 969698
59955 969698 970923 969873 967130 962819 956343 947488 937255 927305 918804 911833 905552 898938 891672 884329
59941 884329 877535 871263 865302 859939 855528 851754 848119 844938 842882 841649 840113 837990 836380 836332 837695
59926 837695 839802 842528 846081 850349 855046 860260 866297 873165 880530 888065 895646 903398 911748 921255
59912 921255 932213 944446 957408 970261 981947 991610 999064 1004719 1009074 1012389 1014663 1015610 1014886
59899 1014886 1012740 1010224 1008337 1007153 1006317 1006160 1007643 1011214 1016366 1022373 1028902 1035876 1043359 1051744
$$ packed form
59998H33025K091L188M365M919N384O414P469P626P027O510O270N859N181M542
59984I09870L844K599P61j054k247k741k830k830k843k660k054j236o96n18k16
59969H95149N98J801L115M412N517O270O886P703Q415Q273P213N982M920L444
59955I69698J225j050k743m311o476q855j0233r950q501o971o281o614p266p343
59941H84329o794o272n961n363m411l774l635l181k056j233j536k123j610m8J363
59926H37695K107K726L553M268M697N214O037O868P365P535P581P752Q350R507
59912I21255J0958J2233J2962J2853J1686R663P454N655M355L315K274R47p24
59899A014886k146k516j887j184q36j57J483L571N152O007O529O974P483Q385
$$ plain form
59885 1051744 1061535 1072727 1084673 1096576 1107819 1117942 1126834 1134893 1142501 1149384 1154882 1158734 1161097
59872 1161097 1161982 1161190 1158644 1154150 1147140 1137435 1126035 1114204 1101941 1088449 1074055 1060388 1048256
59859 1048256 1036552 1023918 1010656 998255 987681 978836 971232 964569 958878 954518 951825 950618 950399
59846 950399 951075 952870 955442 957823 959559 961201 963285 965562 967760 970519 974913 981384 989599 999065
59832 999065 1009533 1021102 1034181 1048934 1064401 1078536 1089405 1096053 1098209 1095903 1089831 1081451
59820 1081451 1072087 1062161 1051573 1040336 1028376 1015242 1000632 984968 969006 953178 937758 923425
59808 923425 911178 901755 895307 891353 888861 886778 884809 883365 882529 881524 879553 876675 873354 869615
59794 869615 865225 860467 855967 851834 847557 842929 838633 835660 834341 834119 834240 834474 835013 835767 836186 836076
$$ packed form
59885A051744R791J1192J1946J1903J1243J0123Q892Q059P608O883N498L852K363
59872A161097Q85p92k546m494p010r705j1400j1831j2263j3492j4394j3667j2132
59859A048256j1704j2634j3262j2401j0574q845p604o663n691m360k693j207k19
59846I50399O76J795K572K381J736J642K084K277K198K759M394O471Q215R466
59832I99065J0468J1569J3079J4753J5467J4135J0869O648K156k306o072q380
59820A081451r364r926j0588j1237j1960j3134j4610j5664j5962j5828j5420j4333
59808I23425j2247r423o448l954k492k083j969j444q36j005j971k878l321l739
59794H69615m390m758m500m133m277m628m296k973j319k22J21K34N39P54M19j10
$$ plain form
59778 836076 836273 837947 841321 845558 849833 853995 858184 862487 867186 872808 879664 887630 896437 905755
59764 905755 915044 923933 932875 942851 954264 966642 979462 992562 1005625 1018046 1029719 1041271
59752 1041271 1053173 1065144 1076706 1087616 1097435 1105399 1111200 1115226 1117610 1117702 1115061 1110262 1104131
59739 1104131 1096829 1088475 1080083 1072945 1067360 1062712 1058491 1054456 1050067 1044692 1038489 1032395 1027151 1022824
59725 1022824 1019334 1016837 1015396 1014674 1014257 1014110 1014561 1015877 1017925 1020288 1022732 1025493 1028967 1033237 1038123
59710 1038123 1043573 1049579 1055799 1061736 1067339 1072959 1078687 1084287 1089819 1095663 1101711 1107151 1111355 1114458
59696 1114458 1116836 1118586 1119807 1120704 1121006 1119865 1116801 1112266 1106892 1100740 1093815 1086838 1080856 1076355
59682 1076355 1073137 1070736 1068538 1065848 1062238 1057639 1051924 1044895 1036939 1029097 1022030 1015411 1008728 1002144
$$ packed form
59778H36076J97J674L374M237M275M162M189M303M699N622O856P966Q807R318
59764I05755R289Q889Q942R976J1413J2378J2820J3100J3063J2421J1673J1552
59752A041271J1902J1971J1562J0910R819P964N801M026K384R2k641m799o131
59739A104131p302q354q392p138n585m648m221m035m389n375o203o094n244m327
59725A022824l490k497j441p22m17j47M51J316K048K363K444K761L474M270M886
59710A038123N450O006O220N937N603N620N728N600N532N844O048N440M204L103
59696A114458K378J750J221Q97L02j141l064m535n374o152o925o977n982m501
59682A076355l218k401k198k690l610m599n715p029p956p842p067o619o683o584
$$ plain form
59668 1002144 996064 990356 984670 979181 974474 970899 968452 966974 966010 964876 963316 961884 961344 961996 963818
59653 963818 966670 969947 972532 973721 973923 973976 974068 973632 971894 968184 962236 954674 946809 939523 932756 926376
59637 926376 920860 916587 913137 910027 907632 906582 906553 906395 905268 903033 899828 895929 891883 888202 884994
59622 884994 882252 880250 879239 879000 879155 879674 880784 882650 885421 889155 893353 897059 899849 902315 905223
59607 905223 908744 912873 917847 923483 928741 932685 935467 937683 939232 939545 938605 937011 935252 933504 931908
59592 931908 930578 929560 929064 929304 929814 929663 928770 928356 929476 931802 934391 936823 938887 939982 939762 938683
59576 938683 937055 934238 929766 924516 919679 915232 910552 905928 902164 899206 896441 893999 892406 891300
59562 891300 889892 888565 888585 890211 892334 894050 895385 896424 896967 897285 898122 899681 901513 903538 906188
$$ packed form
59668A002144o080n708n686n489m707l575k447j478r64j134j560j432n40O52J822
59653I63818K852L277K585J189K02N3R2m36j738l710n948p562p865p286o767o380
59637I26376n516m273l450l110k395j050k9j58j127k235l205l899m046l681l208
59622H84994k742k002j011k39J55N19J110J866K771L734M198L706K790K466K908
59607I05223L521M129M974N636N258L944K782K216J549L13r40j594j759j748j596
59592I31908j330j018m96K40N10j51q93m14J120K326K589K432K064J095k20j079
59576I38683j628k817m472n250m837m447m680m624l764k958k765k442j593j106
59562H91300j408j327K0J626K123J716J335J039N43L18Q37J559J832K025K650
$$ plain form
59547 906188 909427 912707 916138 920769 927376 935811 945823 957702 971802 988099 1006532 1027293 1050699
59534 1050699 1077161 1106878 1138619 1168970 1194028 1212352 1225696 1236860 1247522 1257930 1267421
59523 1267421 1274808 1279110 1280359 1279152 1275332 1267841 1256042 1240416 1221798 1200770 1178090 1154879
59511 1154879 1131907 1109231 1086939 1065748 1046541 1029606 1014572 1000854 988123 976614 966935
59500 966935 959362 953538 949117 946181 944535 943187 941345 939449 938339 937785 936891 935602 934670 934369 934445 935240
59484 935240 937548 941203 945053 948586 952490 957357 962927 968925 975587 982857 990033 996717 1003416 1010715
59470 1010715 1018479 1026222 1033687 1040811 1047674 1054676 1062269 1070496 1079335 1089404 1101575 1115984 1132173
59457 1132173 1149970 1169270 1189051 1207700 1224368 1239024 1251239 1260134 1265609 1268347 1268413 1265092 1258446
$$ packed form
59547I06188L239L280L431M631O607Q435J0012J1879J4100J6297J8433K0761K3406
59534A050699K6462K9717L1741L0351K5058J8324J3344J1164J0662J0408R491
59523A267421P387M302J249j207l820p491j1799j5626j8618k1028k2680k3211
59511A154879k2972k2676k2292k1191j9207j6935j5034j3718j2731j1509r679
59500I66935p573n824m421k936j646j348j842j896j110n54q94j289r32l01P6P95
59484I35240K308L655L850L533L904M867N570N998O662P270P176O684O699P299
59470A010715P764P743P465P124O863P002P593Q227Q839J0069J2171J4409J6189
59457A132173J7797J9300J9781J8649J6668J4656J2215Q895N475K738O6l321o646
$$ plain form
59444 1258446 1249749 1239840 1228232 1214434 1199051 1182958 1166377 1149522 1133370 1119078 1107268 1098354
59432 1098354 1092877 1090941 1091907 1095077 1100208 1107250 1116276 1127822 1142473 1159965 1179451 1200567 1223166
59419 1223166 1245944 1266734 1284548 1300131 1314021 1325309 1332836 1336481 1336775 1334468 1330975 1327626 1323414
59406 1323414 1314757 1298844 1276623 1251752 1227569 1205981 1188150 1174750 1165848 1161420 1161381 1164207 1166090
59393 1166090 1162610 1151276 1132323 1107955 1081533 1056516 1034860 1016522 1000990 988689 980178 974780
59381 974780 971014 968028 965891 964880 965168 966777 969215 971649 974015 977361 982420 988519 994542 1000349
59367 1000349 1006500 1013329 1021262 1031417 1044792 1061083 1079138 1098336 1118969 1141721 1167478 1197108
59355 1197108 1230581 1266680 1304218 1343115 1383592 1424865 1465514 1504657 1541894 1576416 1607032
$$ packed form
59444A258446q697r909j1608j3798j5383j6093j6581j6855j6152j4292j1810q914
59432A098354n477j936R66L170N131P042R026J1546J4651J7492J9486K1116K2599
59419A223166K2778K0790J7814J5583J3890J1288P527L645K94k307l493l349m212
59406A323414q657j5913k2221k4871k4183k1588j7831j3400q902m428l9K826J883
59393A166090l480j1334j8953k4368k6422k5017k1656j8338j5532j2301q511n398
59381I74780l766k986k137j011K88J609K438K434K366L346N059O099O023N807
59367A000349O151O829P933J0155J3375J6291J8055J9198K0633K2752K5757K9630
59355A197108L3473L6099L7538L8897M0477M1273M0649L9143L7237L4522L0616
$$ plain form
59344 1607032 1632759 1652637 1665288 1669459 1664896 1652166 1632102 1605966 1575501 1541843 1504796 1464132
59332 1464132 1421274 1378744 1338166 1299731 1263455 1229937 1199818 1173290 1150318 1130794 1114428
59321 1114428 1100898 1090053 1081631 1074945 1069325 1064679 1061285 1059240 1058408 1058545 1059115 1059504 1059873 1061261 1064317
59306 1064317 1068342 1072126 1075241 1077967 1080503 1082899 1085323 1087737 1089816 1091741 1094546 1098949 1104353 1109735
59292 1109735 1115061 1121123 1128569 1137900 1149861 1164838 1182201 1201098 1221642 1244550 1270095 1298179
59280 1298179 1328749 1360922 1392035 1418848 1439870 1455741 1467616 1476253 1482496 1487423 1491594 1494794
59268 1494794 1496615 1496669 1494253 1488543 1479210 1466383 1450175 1430920 1409688 1387812 1365891 1343825 1321643
59255 1321643 1299629 1277856 1256427 1236161 1218263 1203274 1190965 1181210 1174312 1170443 1169425 1171144
$$ packed form
59344A607032K5727J9878J2651M171m563j2730k0064k6136l0465l3658l7047m0664
59332A464132m2858m2530m0578l8435l6276l3518l0119k6528k2972j9524j6366
59321A114428j3530j0845q422o686n620m646l394k045q32J37N70L89L69J388L056
59306A064317M025L784L115K726K536K396K424K414K079J925K805M403N404N382
59292A109735N326O062P446R331J1961J4977J7363J8897K0544K2908K5545K8084
59280A298179L0570L2173L1113K6813K1022J5871J1875Q637O243M927M171L200
59268A494794J821N4k416n710r333j2827j6208j9255k1232k1876k1921k2066k2182
59255A321643k2014k1773k1429k0266j7898j4989j2309r755o898l869j018J719
$$ plain form
59243 1171144 1175576 1182378 1190934 1200828 1211735 1222885 1233090 1241314 1246912 1249443 1248626 1244273 1235974
59230 1235974 1223200 1206157 1186090 1164245 1140992 1116627 1092388 1069668 1048528 1028094 1008411
59219 1008411 990949 977088 966849 959298 953471 948691 944545 940983 938279 936826 936971 938769 941639
59206 941639 944600 947259 950236 954216 958935 963653 968236 973222 979042 985689 992915 1000286 1007385 1014385
59192 1014385 1022070 1030793 1039920 1048808 1057795 1067527 1077809 1087883 1097430 1106563 1115265 1123675 1132578
59179 1132578 1142714 1153827 1165124 1176453 1188302 1200931 1214295 1228657 1244555 1262269 1281720
59168 1281720 1302470 1323248 1342058 1357493 1369490 1378192 1382761 1382241 1376934 1367844 1355319 1339298
59156 1339298 1320422 1299738 1277761 1254985 1232845 1212772 1194597 1177234 1160667 1145830 1132710
$$ packed form
59243A171144M432O802Q556R894J0907J1150J0205Q224N598K531q17m353q299
59230A235974j2774j7043k0067k1845k3253k4365k4239k2720k1140k0434j9683
59219A008411j7462j3861j0239p551n827m780m146l562k704j453J45J798K870
59206I41639K961K659K977L980M719M718M583M986N820O647P226P371P099P000
59192A014385P685Q723R127Q888Q987R732J0282J0074R547R133Q702Q410Q903
59179A132578J0136J1113J1297J1329J1849J2629J3364J4362J5898J7714J9451
59168A281720K0750K0778J8810J5435J1997Q702M569n20n307r090j2525j6021
59156A339298j8876k0684k1977k2776k2140k0073j8175j7363j6567j4837j3120
$$ plain form
59145 1132710 1120191 1107913 1096815 1087573 1079813 1073213 1068063 1064267 1060967 1057749 1055242 1054033 1053849
59132 1053849 1054328 1055819 1058850 1063385 1069020 1075481 1082630 1090475 1099339 1109644 1121471 1134707 1149490
59119 1149490 1166047 1184334 1204438 1226989 1252392 1279900 1308210 1336679 1365072 1392445 1417457
59108 1417457 1439641 1459325 1476316 1489877 1500028 1507709 1513345 1516178 1515218 1510029 1500546 1487113 1470949
59095 1470949 1453725 1436491 1419663 1403987 1390466 1379274 1369653 1361002 1353154 1345524 1336974 1326724
59083 1326724 1314609 1300505 1284448 1267343 1250477 1234221 1218243 1203020 1189890 1179291 1170142
59072 1170142 1161405 1153283 1146407 1140702 1135523 1130259 1124531 1118407 1112546 1107398 1102307 1096240 1089323 1082600
59058 1082600 1076283 1069450 1061635 1053564 1046022 1039141 1033095 1028371 1024920 1022081 1019806 1018971 1020031 1022326
$$ packed form
59145A132710j2519j2278j1098r242p760o600n150l796l300l218k507j209j84
59132A053849M79J491L031M535N635O461P149P845Q864J0305J1827J3236J4783
59119A149490J6557J8287K0104K2551K5403K7508K8310K8469K8393K7373K5012
59108A417457K2184J9684J6991J3561J0151P681N636K833r60n189r483j3433j6164
59095A470949j7224j7234j6828j5676j3521j1192r621q651p848p630q550j0250
59083A326724j2115j4104j6057j7105j6866j6256j5978j5223j3130j0599r149
59072A170142q737q122o876n705n179n264n728o124n861n148n091o067o917o723
59058A082600o317o833p815q071p542o881o046m724l451k839k275q35J060K295
$$ plain form
59044 1022326 1025115 1028379 1032239 1036578 1041698 1048347 1056641 1065880 1075947 1087938 1102879 1120653 1140698
59031 1140698 1162892 1187130 1212771 1239020 1265193 1290247 1312876 1332539 1349703 1364625 1376645
59020 1376645 1385059 1389929 1391566 1390003 1385466 1378751 1370759 1362250 1354276 1347990 1343665 1340684 1338934 1339475
59006 1339475 1343352 1350403 1359653 1370313 1382054 1394885 1409043 1424493 1440336 1455202 1468242 1479208
58994 1479208 1487795 1493757 1497486 1499398 1498747 1494055 1484738 1471251 1453825 1432504 1408583 1384554 1362158
58981 1362158 1341637 1323175 1307677 1295664 1286728 1280618 1277771 1278263 1281466 1287229 1296191 1308499 1323468
58968 1323468 1341034 1362112 1386872 1413946 1442090 1471258 1501143 1529867 1555124 1575670 1590843
58957 1590843 1599625 1601116 1595122 1581576 1560372 1532480 1500288 1466148 1431477 1397722 1366860 1340063
$$ packed form
59044A022326K789L264L860M339N120O649Q294R239J0067J1991J4941J7774K0045
59031A140698K2194K4238K5641K6249K6173K5054K2629J9663J7164J4922J2020
59020A376645Q414M870J637j563m537o715p992q509p974o286m325k981j750N41
59006A339475L877P051R250J0660J1741J2831J4158J5450J5843J4866J3040J0966
58994A479208Q587N962L729J912o51m692r317j3487j7426k1321k3921k4029k2396
58981A362158k0521j8462j5498j2013q936o110k847M92L203N763Q962J2308J4969
58968A323468J7566K1078K4760K7074K8144K9168K9885K8724K5257K0546J5173
58957A590843Q782J491n994j3546k1204k7892l2192l4140l4671l3755l0862k6797
$$ plain form
58945 1340063 1317007 1297370 1281868 1270974 1263800 1259359 1257829 1259495 1263318 1267573 1270968 1272162 1269292
58932 1269292 1261250 1248745 1233085 1214739 1194094 1172695 1152450 1134133 1117695 1103367 1091412
58921 1091412 1081426 1072888 1065917 1060673 1056665 1053529 1051822 1052145 1054166 1057320 1061800 1068031 1075911 1085356
58907 1085356 1096806 1110359 1125311 1141422 1159736 1181170 1205280 1231537 1260861 1294570 1332636
58896 1332636 1374285 1419653 1469349 1522854 1578771 1636472 1696266 1758062 1820823 1883073 1942974
58885 1942974 1997957 2045091 2081879 2106576 2118470 2118419 2108257 2088898 2059715 2020470 1972958 1919923
58873 1919923 1863364 1805017 1747560 1693844 1645334 1602338 1565142 1533697 1506719 1482409 1459890
58862 1459890 1439011 1419220 1399783 1380843 1363197 1347128 1332219 1318030 1304147 1289791 1274122
$$ packed form
58945A340063k3056j9637j5502j0894p174m441j530J666L823M255L395J194k870
58932A269292q042j2505j5660j8346k0645k1399k0245j8317j6438j4328j1955
58921A091412r986q538o971n244m008l136j707L23K021L154M480O231P880R445
58907A085356J1450J3553J4952J6111J8314K1434K4110K6257K9324L3709L8066
58896A332636M1649M5368M9696N3505N5917N7701N9794O1796O2761O2250N9901
58885A942974N4983M7134L6788K4697J1894n1j0162j9359k9183l9245m7512n3035
58873A919923n6559n8347n7457n3716m8510m2996l7196l1445k6978k4310k2519
58862A459890k0879j9791j9437j8940j7646j6069j4909j4189j3883j4356j5669
$$ plain form
58851 1274122 1256728 1237403 1216036 1193221 1170315 1148233 1126834 1106052 1086798 1069962 1055383
58840 1055383 1042617 1031845 1023132 1015670 1008841 1003223 999516 997156 995081 993194 992036 991694 992061 993479
58826 993479 996043 998898 1001299 1003713 1006825 1010097 1012350 1013200 1012893 1011403 1008733 1005404 1001581 996410 989373
58811 989373 981656 975026 969950 965885 962718 960662 959297 957987 956822 956131 955527 954517 953624 953898 955715
58796 955715 958777 962708 966907 970618 973902 977772 982695 988109 994142 1002352 1013487 1025866 1037394
58783 1037394 1048014 1058684 1069180 1078633 1087184 1095278 1102166 1106959 1110476 1114292 1118483 1121868 1123933
58770 1123933 1124907 1124629 1122948 1120745 1119082 1117877 1116720 1116151 1116710 1117640 1118100 1118662 1119941 1120835 1120109 1118810
58754 1118810 1119012 1120885 1123160 1125825 1130185 1136692 1144774 1154433 1166026 1178923 1192361 1207186 1224808
$$ packed form
58851A274122j7394j9325k1367k2815k2906k2082k1399k0782j9254j6836j4579
58840A055383j2766j0772q713p462o829n618l707k360k075j887j158l42L67J418
58826I93479K564K855K401K414L112L272K253Q50l07j490k670l329l823n171p037
58811I89373p717o630n076m065l167k056j365j310j165o91o04j010q93K74J817
58796I55715L062L931M199L711L284L870M923N414O033Q210J1135J2379J1528
58783A037394J0620J0670J0496R453Q551Q094O888M793L517L816M191L385K065
58770A123933R74k78j681k203j663j205j157n69N59R30M60N62J279Q94p26j299
58754A118810K02J873K275K665M360O507Q082R659J1593J2897J3438J4825J7622
$$ plain form
58741 1224808 1244972 1266572 1289942 1316049 1343984 1371829 1399722 1429551 1461528 1493428 1523260
58730 1523260 1550335 1573604 1591350 1603099 1610052 1613319 1613425 1611472 1608786 1605294 1600064 1593377 1586381
58717 1586381 1578889 1569639 1558595 1546801 1534030 1518917 1501440 1482907 1463297 1441074 1416032 1389903
58705 1389903 1363585 1336031 1306555 1276035 1245125 1213298 1180524 1148086 1117014 1087386 1059731
58694 1059731 1035364 1014739 997073 981983 969763 959724 950116 940259 931022 922817 914908 907140
58682 907140 900516 895573 891852 889351 888791 890154 892799 897304 905271 916947 930965 946745 965132
58669 965132 986273 1009024 1032920 1058592 1085545 1111497 1134510 1153797 1167927 1174530 1172698 1163888
58657 1163888 1149785 1131213 1109703 1087902 1067433 1048167 1030310 1015248 1003579 994349 987046 982388
$$ packed form
58741A224808K0164K1600K3370K6107K7935K7845K7893K9829L1977L1900K9832
58730A523260K7075K3269J7746J1749O953L267J06j953k686l492n230o687o996
58717A586381p492r250j1044j1794j2771j5113j7477j8533j9610k2223k5042k6129
58705A389903k6318k7554k9476l0520l0910l1827l2774l2438l1072k9628k7655
58694A059731k4367k0625j7666j5090j2220j0039r608r857r237q205p909p768
58682I07140o624m943l721k501n60J363K645M505P967J1676J4018J5780J8387
58669I65132K1141K2751K3896K5672K6953K5952K3013J9287J4130O603j832q810
58657A163888j4103j8572k1510k1801k0469j9266j7857j5062j1669r230p303m658
$$ plain form
58645 982388 980289 979106 977850 977270 977832 978552 978734 978958 979356 978777 976664 973984 971399 968329 964650 961407
58629 961407 959014 956764 955015 955768 960019 966618 974908 986369 1002178 1021071 1041142 1062204 1084962
58616 1084962 1109302 1134619 1160445 1185561 1207824 1225841 1239541 1248430 1251010 1246824 1237506 1224968
58604 1224968 1210136 1194136 1178818 1165160 1152762 1141580 1132434 1125364 1119628 1115927 1116309 1121082 1128318
58591 1128318 1137335 1150053 1167648 1188443 1210593 1234324 1259875 1285601 1309949 1333144 1355115
58580 1355115 1373900 1388010 1398452 1406607 1412123 1414822 1416804 1420630 1427079 1436530 1450734 1471170 1497143
58567 1497143 1527385 1561975 1600908 1642273 1683663 1723953 1762086 1795802 1823386 1845083 1861036
58556 1861036 1869561 1869363 1861870 1849311 1831966 1809273 1782294 1752936 1721850 1688987 1655201 1621579
$$ packed form
58645I82388k099j183j256n80N62P20J82K24L98n79k113k680k585l070l679l243
58629I61407k393k250j749P53M251O599Q290J1461J5809J8893K0071K1062K2758
58616A084962K4340K5317K5826K5116K2263J8017J3700Q889K580m186r318j2538
58604A224968j4832j6000j5318j3658j2398j1182r146p070n736l701L82M773P236
58591A128318R017J2718J7595K0795K2150K3731K5551K5726K4348K3195K1971
58580A355115J8785J4110J0442Q155N516K699J982L826O449R451J4204K0436K5973
58567A497143L0242L4590L8933M1365M1390M0290L8133L3716K7584K1697J5953
58556A861036Q525j98p493j2559j7345k2693k6979k9358l1086l2863l3786l3622
$$ plain form
58544 1621579 1588143 1554700 1521874 1490047 1458632 1427731 1398994 1373479 1350223 1328347 1308897
58533 1308897 1293066 1280290 1269715 1261888 1257404 1255609 1256219 1260419 1268633 1279016 1289989 1302458 1317620
58520 1317620 1334366 1350782 1366472 1381363 1393916 1402681 1408170 1411305 1411645 1409036 1405230 1401738 1397628
58507 1397628 1391550 1384299 1377265 1369918 1360942 1350411 1338857 1325777 1311101 1296511 1283282 1270467
58495 1270467 1257242 1245278 1236639 1231074 1227566 1226757 1229532 1235059 1242584 1253481 1269052 1287934 1307978
58482 1307978 1328956 1351005 1372275 1390717 1406430 1419598 1427911 1428824 1422789 1411538 1394953 1372555
58470 1372555 1346472 1319829 1293456 1267024 1241953 1220216 1201563 1184888 1171152 1162059 1157117 1154855
58458 1154855 1155673 1160544 1168132 1176171 1184517 1193941 1203049 1209352 1212302 1212509 1209276 1201983 1192791 1184877
$$ packed form
58544A621579l3436l3443l2826l1827l1415l0901k8737k5515k3256k1876j9450
58533A308897j5831j2776j0575p827m484j795O10M200Q214J0383J0973J2469J5162
58520A317620J6746J6416J5690J4891J2553Q765N489L135L40k609l806l492m110
58507A397628o078p251p034p347q976j0531j1554j3080j4676j4590j3229j2815
58495A270467j3225j1964q639n565l508q09K775N527P525J0897J5571J8882K0044
58482A307978K0978K2049K1270J8442J5713J3168Q313R13o035j1251j6585k2398
58470A372555k6083k6643k6373k6432k5071k1737j8653j6675j3736r093m942k262
58458A154855Q18M871P588Q039Q346R424R108O303K950K07l233p293r192p914
$$ plain form
58444 1184877 1178843 1173577 1169453 1167791 1168324 1170130 1173880 1180304 1187753 1194303 1201000 1209943 1220488 1230636
58430 1230636 1240947 1253687 1269059 1285480 1302546 1320506 1337802 1352346 1364358 1374942 1383051
58419 1383051 1387067 1388205 1389054 1389804 1389093 1387357 1385911 1383867 1379484 1373539 1367961 1362159 1354101 1343950
58405 1343950 1333176 1321316 1307172 1292112 1278560 1266294 1253805 1242063 1233076 1225906 1217992 1209409
58393 1209409 1201908 1194833 1186045 1176009 1166964 1158936 1150499 1142466 1136715 1132339 1127153 1122119 1119993 1120423
58379 1120423 1120662 1120418 1121683 1124558 1127638 1131877 1139630 1150419 1161907 1174461 1190363 1209203 1228459
58366 1228459 1248012 1269565 1292276 1313520 1333361 1353565 1372761 1387338 1396702 1402977 1406051 1403854
58354 1403854 1397192 1389440 1381657 1372703 1363797 1358121 1356134 1355996 1358180 1364861 1375255 1386573 1399206
$$ packed form
58444A184877o034n266m124j662N33J806L750O424P449O550O697Q943J0545J0148
58430A230636J0311J2740J5372J6421J7066J7960J7296J4544J2012J0584Q109
58419A383051M016J138Q49P50p11j736j446k044m383n945n578n802q058j0151
58405A343950j0774j1860j4144j5060j3552j2266j2489j1742q987p170p914q583
58393A209409p501p075q788j0036r045q028q437q033n751m376n186n034k126M30
58379A120423K39k44J265K875L080M239P753J0789J1488J2554J5902J8840J9256
58366A228459J9553K1553K2711K1244J9841K0204J9196J4577R364O275L074k197
58354A403854o662p752p783q954q906n676j987j38K184O681J0394J1318J2633
$$ plain form
58341 1399206 1415909 1436269 1456988 1477248 1498622 1520086 1538391 1553088 1566114 1576886 1583029
58330 1583029 1585379 1586953 1587670 1585481 1581802 1580067 1579806 1578209 1576578 1578845 1584470 1589443 1593637 1600313
58316 1600313 1608931 1615645 1620746 1628348 1638739 1648279 1656924 1668399 1682693 1695870 1707712 1721953
58304 1721953 1738476 1752918 1764659 1777522 1791833 1803561 1812181 1821623 1832662 1842206 1850836 1862869
58292 1862869 1878055 1891519 1902909 1917149 1935075 1952065 1967223 1985133 2007127 2029732 2053185
58281 2053185 2082194 2116531 2150257 2182345 2218908 2262984 2311436 2363765 2423950 2491093 2557991
58270 2557991 2621678 2685960 2751471 2813290 2870693 2928945 2988967 3045696 3098900 3154539 3212663
58259 3212663 3265202 3308635 3347667 3383938 3413441 3438206 3467837 3505628 3545505 3586109 3634709
$$ packed form
58341A399206J6703K0360K0719K0260K1374K1464J8305J4697J3026J0772O143
58330A583029K350J574P17k189l679j735k61j597j631K267N625M973M194O676
58316A600313Q618O714N101P602J0391R540Q645J1475J4294J3177J1842J4241
58304A721953J6523J4442J1741J2863J4311J1728Q620R442J1039R544Q630J2033
58292A862869J5186J3464J1390J4240J7926J6990J5158J7910K1994K2605K3453
58281B053185K9009L4337L3726L2088L6563M4076M8452N2329O0185O7143O6898
58270B557991O3687O4282O5511O1819N7403N8252O0022N6729N3204N5639N8124
58259C212663N2539M3433L9032L6271K9503K4765K9631L7791L9877M0604M8600
$$ plain form
58248 3634709 3693367 3755026 3817782 3889197 3971737 4058117 4146061 4243212 4352197 4465642 4581478
58237 4581478 4707894 4847487 4992292 5140420 5301213 5477690 5661117 5849687 6054755
58228 6054755 6281399 6521205 6771864 7044609 7344332 7662594 7999028 8368553 8778220
58219 8778220 9218991 9690155 10208447 10782691 11404617 12076501 12821740 13655806 14575086
58210 14575086 15588683 16732194 18036338 19515458 21205239 23180031 25518911 28295804
58202 28295804 31622898 35657302 40535849 46348007 53205670 61299276 70864792 82159227
58194 82159227 95503149 111264606 129717774 150934323 174813545 201125413 229534192
58187 229534192 259796974 291986905 326006095 360135722 389900697 409023554 412424442
$$ packed form
58248C634709N8658O1659O2756P1415Q2540Q6380Q7944R7151J08985J13445J15836
58237D581478J26416J39593J44805J48128J60793J76477J83427J88570K05068
58228F054755K26644K39806K50659K72745K99723L18262L36434L69525M09667
58219H778220M40771M71164N18292N74244O21926O71884P45239Q34066R19280
58210A4575086J013597J143511J304144J479120J689781J974792K338880K776893
58202B8295804L327094M034404M878547N812158O857663Q093606R565516J1294435
58194H2159227J3343922J5761457J8453168K1216549K3879222K6311868K8408779
58187B29534192L0262782L2189931L4019190L4129627K9764975J9122857L400888
$$ plain form
58180 412424442 398968771 371775439 336238271 297661682 259948640 225374465 194888478
58173 194888478 168602715 146278299 127602873 112231073 99778031 89870953 82178336
58166 82178336 76389396 72225146 69448033 67738506 66515096 64980493 62460896 58728332
58158 58728332 54012576 48770877 43464224 38442101 33896815 29875099 26349179 23283438
58150 23283438 20640282 18364826 16402171 14718858 13287296 12065542 11012802 10109239
58142 10109239 9341111 8680782 8099292 7584600 7130298 6719612 6336666 5980857 5654649
58133 5654649 5349239 5056452 4782455 4535247 4309836 4098903 3906344 3736741 3582602
58124 3582602 3435496 3299449 3180081 3070084 2958349 2844691 2733764 2623321 2510447
$$ packed form
58180D12424442j3455671k7193332l5537168l8576589l7713042l4574175l0485987
58173A94888478k6285763k2324416j8675426j5371800j2453042r907078p692617
58166H2178336n788940m164250k777113j709527j223410j534603k519597l732564
58158E8728332m715756n241699n306653n022123m545286m021716l525920l065741
58150B3283438k643156k275456j962655j683313j431562j221754j052740r03563
58142A0109239p68128o60329n81490n14692m54302m10686l82946l55809l26208
58133E654649l05410k92787k73997k47208k25411k10933j92559j69603j54139
58124C582602j47106j36047j19368j09997j11735j13658j10927j10443j12874
$$ plain form
58115 2510447 2401110 2301952 2209928 2120308 2036897 1964050 1896610 1828303 1762615 1705269 1653222
58104 1653222 1601069 1551082 1506892 1464155 1417498 1370561 1329833 1294810 1263355 1240303 1231097
58093 1231097 1232431 1238088 1248361 1265013 1282829 1295262 1303375 1310619 1314039 1309246 1298933 1287633
58081 1287633 1272744 1249371 1219803 1189819 1159690 1126916 1093896 1064774 1038267 1011233 985845
58070 985845 965923 949709 933459 918576 908069 899510 888631 876589 866871 858376 848352 838783
58058 838783 832988 829002 823008 816199 811675 807686 800644 792013 785724 781460 776652 772238 770192 768167
58044 768167 762764 755496 749589 743710 734862 724533 715800 707157 695518 682725 672766 664927 655917
58031 655917 646463 639611 634574 628322 621337 615961 611079 604289 597355 593669 592120 589113 584860 582052
$$ packed form
58115B510447j09337r9158r2024q9620q3411p2847o7440o8307o5688n7346n2047
58104A653222n2153m9987m4190m2737m6657m6937m0728l5023l1455k3052r206
58093A231097J334N657J0273J6652J7816J2433Q113P244L420m793j0313j1300
58081A287633j4889k3373k9568k9984l0129l2774l3020k9122k6507k7034k5388
58070I85845j9922j6214j6250j4883j0507q559j0879j2042r718q495j0024r569
58058H38783n795l986n994o809m524l989p042q631o289m264m808m414k046k025
58044G68167n403p268n907n879q848j0329q733q643j1639j2793r959p839r010
58031F55917r454o852n037o252o985n376m882o790o934l686j549l007m253k808
$$ plain form
58017 582052 580215 577047 573622 572660 573245 572620 571550 572553 574768 576051 578247 584589 593531 600941 606965
58002 606965 614998 625205 634823 643772 654276 665825 676020 685629 697467 711015 723189 733540
57990 733540 743585 752043 755986 756023 755219 753660 749160 742503 736768 732040 725875 718483 712469 707935 702792
57975 702792 697489 694472 693360 691487 688960 688399 689940 691187 691800 693522 695885 696549 695676 695445 695564 693778
57959 693778 690478 688120 686349 682443 676394 670846 666018 659526 651351 644303 639204 634106 628662 624887
57945 624887 623196 621958 621374 623623 628757 634472 640318 648163 658272 668893 679896 692785 706972
57932 706972 720195 732860 747757 765082 781779 796206 809398 821384 830414 836376 840995 844071
57920 844071 843400 838858 832678 825348 815267 802814 790530 778618 764508 747656 730654 714732
$$ packed form
58017E82052j837l168l425r62N85o25j070J003K215J283K196O342Q942P410O024
58002F06965Q033J0207R618Q949J0504J1549J0195R609J1838J3548J2174J0351
57990G33540J0045Q458L943L7q04j559m500o657n735m728o165p392o014m534n143
57975G02792n303l017j112j873k527n61J541J247O13J722K363O64q73k31J19j786
57959F93778l300k358j771l906o049n548m828o492q175p048n099n098n444l775
57945F24887j691j238n84K249N134N715N846P845J0109J0621J1003J2889J4187
57932G06972J3223J2665J4897J7325J6697J4427J3192J1986R030N962M619L076
57920H44071o71m542o180p330j0081j2453j2284j1912j4110j6852j7002j5922
$$ plain form
57908 714732 698255 680695 664076 649291 634757 619876 606225 594182 581971 569068 557162
57897 557162 546835 536788 527096 519510 513657 506813 498518 491659 487762 485022 482271 481122 482571 485024
57883 485024 487311 490375 494438 497777 499821 502257 505620 507981 508435 508643 509411 508955 506234 502884 500157
57868 500157 496941 492538 488507 486026 484203 482594 482688 485214 488684 492170 496963 503927 511849 519901 529120
57853 529120 540006 551292 562610 575666 591157 607084 621691 635546 649195 661359 671137 679500
57841 679500 686949 692115 694216 694484 693598 690202 683529 675010 665631 654303 640614 626726 614573 603485
57827 603485 592452 582464 574598 567953 561542 556281 553176 551362 549803 549203 550423 552683 554989 557744
57813 557744 561395 565083 568110 571177 574877 578570 581880 585461 589173 591504 592028 592441 593921 595476 596008
$$ packed form
57908G14732j6477j7560j6619j4785j4534j4881j3651j2043j2211j2903j1906
57897E57162j0327j0047r692p586n853o844q295o859l897k740k751j149J449K453
57883D85024K287L064M063L339K044K436L363K361M54K08P68m56k721l350k727
57868E00157l216m403m031k481j823j609R4K526L470L486M793O964P922Q052R219
57853E29120J0886J1286J1318J3056J5491J5927J4607J3855J3649J2164R778Q363
57841F79500P449N166K101K68q86l396o673q519r379j1328j3689j3888j2153j1088
57827F03485j1033r988p866o645o411n261l105j814j559o00J220K260K306K755
57813E57744L651L688L027L067L700L693L310L581L712K331N24M13J480J555N32
$$ plain form
57798 596008 595736 594265 589716 581501 571860 562954 554496 545758 537642 530921 524486 517279 510120 503923
57784 503923 497981 491799 486706 483726 481703 479394 477708 477925 479358 480747 482480 485588 489873 494648
57770 494648 499944 505443 509725 512069 513481 514528 513908 510654 505908 500824 494497 485802 475623 465433
57756 465433 455221 444551 434088 424364 414615 404587 395815 389297 383553 376941 370304 365349 361944
57743 361944 359122 357297 357217 357855 357462 355768 353372 350089 345796 341838 339643 338713 337651 336267 335178
57728 335178 334334 333504 333270 334083 335284 336256 337348 338545 338764 337819 337501 339135 341585 343209 344144 344959 344849
57711 344849 343161 341188 340373 340049 338989 337794 337616 337771 336887 335420 334883 335417 336119 336964 338532 340552
57695 340552 342445 344526 347153 349632 351426 353348 356056 358683 360550 362813 366712 371740 377466 385595
$$ packed form
57798E96008k72j471m549q215r641q906q458q738q116o721o435p207p159o197
57784E03923n942o182n093k980k023k309j686K17J433J389J733L108M285M775
57770D94648N296N499M282K344J412J047o20l254m746n084o327q695j0179j0190
57756D65433j0212j0670j0463r724r749j0028q772o518n744o612o637m955l405
57743C61944k822j825q0O38l93j694k396l283m293l958k195r30j062j384j089
57728C35178q44q30k34Q13J201R72J092J197K19r45l18J634K450J624R35Q15j10
57711C44849j688j973q15l24j060j195j78J55q84j467n37N34P02Q45J568K020
57695C40552J893K081K627K479J794J922K708K627J867K263L899N028N726Q129
$$ plain form
57681 385595 397947 413851 431930 453245 480184 513408 552598 599374 656671 725531 804901
57670 804901 894247 994065 1104057 1223079 1350701 1486222 1624859 1755158 1859781 1919249
57660 1919249 1918712 1855777 1742880 1600481 1447184 1295579 1153800 1026797 915951 820186
57650 820186 738328 669468 611864 563409 522927 489502 461186 436051 413947 395571 380442
57639 380442 367380 356200 347127 339321 331816 325206 320533 317211 313882 310597 308234 306529 304689 303221
57625 303221 302998 303129 301863 299170 296461 294312 292450 291287 291199 290806 288292 284196 280743 278697 276960
57610 276960 274974 273298 271947 270333 268862 268593 269330 269869 270047 270680 271642 271873 271211 270452 269764 268808 268149
57593 268149 268679 269826 270168 269598 269058 268354 266199 262324 257807 253422 249280 245779 243197 240721 237568
$$ packed form
57681C85595J2352J5904J8079K1315K6939L3224L9190M6776N7297O8860P9370
57670H04901Q9346R9818J09992J19022J27622J35521J38637J30299J04623N9468
57660A919249n37o2935j12897j42399j53297j51605j41779j27003j10846r5765
57650H20186q1858o8860n7604m8455m0482l3425k8316k5135k2104j8376j5129
57639C80442j3062j1180r073p806p505o610m673l322l329l285k363j705j840j468
57625C03221k23J31j266k693k709k149j862j163q8l93k514m096l453k046j737
57610B76960j986j676j351j614j471k69P37N39J78O33R62K31o62p59o88r56o59
57593B68149N30J147L42n70n40p04k155l875m517m385m142l501k582k476l153
$$ plain form
57578 237568 234536 232640 230947 227833 223745 220399 217799 214562 210841 208288 207147 205899 203924 202093
57564 202093 200620 198712 196559 195332 194886 193774 191857 190680 190916 191665 192638 194693 197644 199801 200447
57549 200447 200902 202403 204677 207120 209656 211949 213502 214940 217550 221219 224498 226844 229011 231103
57535 231103 232205 232150 231637 230420 227513 223482 220339 218693 217158 214999 213104 211760 209866 207261 205609
57520 205609 205866 206823 207167 207218 207580 207853 207795 208192 209423 210583 211008 211416 212675 214643 216899 219375 221672
57503 221672 223064 223751 224814 226496 227814 228227 228196 227747 226120 223339 220569 218369 216106 213477 210990
57488 210990 208491 204978 200464 196389 193621 191596 189982 189370 189667 189566 188465 187356 187039 186956 186502 186028
57472 186028 185758 185151 184003 182914 182147 181409 181044 181883 183514 184457 184451 184746 185648 185761 184402 182853 182370 182679
$$ packed form
57578B37568l032j896j693l114m088l346k600l237l721k553j141j248j975j831
57564B02093j473j908k153j227m46j112j917j177K36P49R73K055K951K157O46
57549B00447M55J501K274K443K536K293J553J438K610L669L279K346K167K092
57535B31103J102n5n13j217k907m031l143j646j535k159j895j344j894k605j652
57520B05609K57R57L44N1L62K73n8L97J231J160M25M08J259J968K256K476K297
57503B21672J392O87J063J682J318M13l1m49j627k781k770k200k263k629k487
57488B10990k499l513m514m075k768k025j614o12K97j01j101j109l17q3m54m74
57472A86028k70o07j148j089p67p38l65Q39J631R43oK95R02J13j359j549m83L09
$$ plain form
57454 182679 183298 184557 186457 188208 189754 192034 194930 196737 196624 195873 195723 195776 195571 195916 197396 199142
57438 199142 200293 201259 202366 202708 201522 199428 197287 195124 193091 192066 192288 192707 192623 192656 193268 193725 193395
57421 193395 192678 191876 190576 188865 187600 186780 185337 183283 182222 182803 183594 183467 183161 183321 183026 181667
57405 181667 180446 180436 180765 180217 179098 178090 176834 175114 173877 173512 172652 170370 168126 167819 169142 170534
57389 170534 171557 172646 173636 174325 175632 178539 182537 186408 189805 192909 195442 197248 198994 201147 203100
57374 203100 204308 205330 206766 208133 208742 208634 207872 206206 204251 203520 204297 204873 203960 202427 201564 201200
57358 201200 200721 200378 200291 199666 198330 197553 198046 198747 198938 199881 202664 206029 208080 208807 209224 209395 209060 208919
57340 208919 209463 209701 208742 207554 207467 208113 208500 208963 210283 211899 212741 212923 213122 213235 213100 213400 214410 215038
$$ packed form
57454A82679O19J259J900J751J546K280K896J807j13p51j50N3k05L45J480J746
57438A99142J151R66J107L42j186k094k141k163k033j025K22M19q4L3O12M57l30
57421A93395p17q02j300j711j265q20j443k054j061N81P91j27l06J60k95j359
57405A81667j221j0L29n48j119j008j256j720j237l65q60k282k244l07J323J392
57389A70534J023J089R90O89J307K907L998L871L397L104K533J806J746K153J953
57374B03100J208J022J436J367O09j08p62j666j955p31P77N76r13j533q63l64
57358B01200m79l43q7o25j336p77M93P01J91R43K783L365K051P27M17J71l35j41
57340B08919N44K38r59j188q7O46L87M63J320J616Q42J82J99J13j35L00J010O28
$$ plain form
57322 215038 214554 213952 214134 214151 212967 211492 211048 211120 210626 210122 210721 211940 212617 212948 213674 214295 214056 213783
57304 213783 214788 216794 218705 220421 222193 223398 223920 225511 229596 234752 238510 240760 243210 246403
57290 246403 249561 252697 256557 260865 264666 268078 272027 276738 282002 288125 295002 301194 305699 309671
57276 309671 314661 320254 325365 330658 337492 345462 353239 360903 369200 377430 384424 390913 398568 407259
57262 407259 415466 422798 429891 436450 441724 446443 452067 458473 464404 469795 475667 482161 488614 495054
57248 495054 501853 508473 514339 520221 527077 534459 541833 550218 560485 571375 581499 592017 604852
57235 604852 619473 634189 649540 667487 688064 709743 732483 757529 784718 812792 841854
57224 841854 872787 904727 935936 966754 998995 1032879 1067302 1102617 1140290 1180168 1220888
$$ packed form
57322B15038m84o02J82J7j184j475m44P2m94n04N99J219O77L31P26O21k39k73
57304B13783J005K006J911J716J772J205N22J591M085N156L758K250K450L193
57290B46403L158L136L860M308L801L412L949M711N264O123O877O192M505L972
57276C09671M990N593N111N293O834P970P777P664Q297Q230O994O489P655Q691
57262D07259Q207P332P093O559N274M719N624O406N931N391N872O494O453O440
57248D95054O799O620N866N882O856P382P374Q385J0267J0890J0124J0518J2835
57235F04852J4621J4716J5351J7947K0577K1679K2740K5046K7189K8074K9062
57224H41854L0933L1940L1209L0818L2241L3884L4423L5315L7673L9878M0720
$$ plain form
57213 1220888 1262532 1306043 1350486 1393905 1436681 1481086 1527818 1575834 1625206 1677012 1730584
57202 1730584 1784011 1837168 1891158 1944836 1995160 2041051 2083847 2123950 2160389 2193894 2227095
57191 2227095 2261044 2294467 2326764 2358688 2389588 2416936 2439317 2457407 2471659 2481708 2488296
57180 2488296 2493241 2497218 2499967 2502438 2505958 2509553 2511086 2510868 2511036 2511639 2510740 2508305 2506430 2505608 2504469
57165 2504469 2503671 2506436 2514453 2526403 2540994 2558216 2577083 2595428 2612619 2629623 2646109 2660564
57153 2660564 2673383 2686603 2700486 2713679 2726729 2741893 2759486 2778065 2798183 2822015 2849193
57142 2849193 2877038 2905052 2935089 2966910 2997890 3027409 3057108 3086436 3112441 3134388 3154059
57131 3154059 3171099 3182845 3189288 3193354 3195675 3194114 3189115 3184507 3182344 3182109 3185642 3197429 3219198
$$ packed form
57213A220888M1644M3511M4443M3419M2776M4405M6732M8016M9372N1806N3572
57202A730584N3427N3157N3990N3678N0324M5891M2796M0103L6439L3505L3201
57191B227095L3949L3423L2297L1924L0900K7348K2381J8090J4252J0049O588
57180B488296M945L977K749K471L520L595J533k18J68O03q99k435j875q22j139
57165B504469p98K765Q017J1950J4591J7222J8867J8345J7191J7004J6486J4455
57153B660564J2819J3220J3883J3193J3050J5164J7593J8579K0118K3832K7178
57142B849193K7845K8014L0037L1821L0980K9519K9699K9328K6005K1947J9671
57131C154059J7040J1746O443M066K321j561m999m608k163k35L533J1787K1769
$$ plain form
57118 3219198 3249597 3289668 3342825 3408995 3485097 3572025 3674570 3793679 3925593 4069354
57108 4069354 4228023 4401992 4589303 4793760 5024513 5286768 5582282 5921121 6324915
57099 6324915 6818987 7431964 8202062 9168368 10351712 11755448 13384063 15243563 17323467
57090 17323467 19600137 22054748 24644881 27234297 29587327 31481616 32833377 33712036
57082 33712036 34280001 34767883 35467636 36633760 38313851 40284492 42179793 43680915
57074 43680915 44599050 44852029 44438186 43436568 41981708 40202496 38178936 35946757
57066 35946757 33523843 30932070 28214739 25445992 22718869 20119106 17709624 15531669
57058 15531669 13606656 11933689 10494059 9263304 8217615 7332021 6581130 5944149
$$ packed form
57118C219198L0399M0071N3157O6170P6102Q6928J02545J19109J31914J43761
57108D069354J58669J73969J87311K04457K30753K62255K95514L38839M03794
57099F324915M94072O12977P70098R66306J183344J403736J628615J859500K079904
57090A7323467K276670K454611K590133K589416K353030J894289J351761Q78659
57082C3712036N67965M87882O99753J166124J680091J970641J895301J501122
57074D3680915R18135K52979m13843j001618j454860j779212k023560k232179
57066C5946757k422914k591773k717331k768747k727123k599763k409482k177955
57058A5531669j925013j672967j439630j230755j045689q85594p50891o36981
$$ plain form
57050 5944149 5404620 4944770 4544824 4188637 3866056 3569978 3295408 3041365 2809217
57041 2809217 2598187 2405377 2229698 2071993 1931468 1805632 1693764 1596857 1513802 1440800
57031 1440800 1374791 1314688 1259232 1206654 1156813 1111063 1069541 1030661 993388 958072 925185
57020 925185 895248 869832 850785 838547 832758 833916 842781 858778 880831 909240 945280 989645
57008 989645 1042020 1099536 1152559 1183756 1175974 1122950 1031823 916518 790769 665580 548409
56997 548409 442433 347848 264660 193492 134392 86891 51342 28541 17898 17471 25761 42084
56985 42084 65321 93859 126807 163811 203344 242168 276583 303587 321454 330476 333012 331825
56973 331825 328452 323675 318613 314212 310415 307108 305337 306344 309968 315272 322310 332116 345439 362497
$$ packed form
57050E944149n39529m59850l99946l56187l22581k96078k74570k54043k32148
57041B809217k11030j92810j75679j57705j40525j25836j11868r6907q3055p3002
57031A440800o6009o0103n5456n2578m9841m5750m1522l8880l7273l5316l2887
57020I25185k9937k5416j9047j2238n789J158Q865J5997K2053K8409L6040M4365
57008I89645N2375N7516N3023L1197p782n3024r1127j15305j25749j25189j17171
56997E48409j05976r4585q3188p1168n9100m7501l5549k2801j0643m27Q290J6323
56985D2084K3237K8538L2948L7004L9533L8824L4415K7004J7867R022K536j187
56973C31825l373m777n062m401l797l307j771J007L624N304P038R806J3323J7058
$$ plain form
56959 362497 383354 407415 433239 459855 487223 513915 535257 545664 542646 527476 502981 472532
56947 472532 440411 410619 384733 362167 342545 326497 314473 306430 302867 304594 311206 321135
56935 321135 333624 349526 369737 393808 420544 449166 479208 509281 535856 553274 555964 541940
56923 541940 514237 478527 439622 400536 363569 330514 301788 276627 254417 235189 218904
56912 218904 205135 193468 183597 175105 167696 161526 156747 153039 150127 148415 148400 149754 151693 153999
56898 153999 157017 160891 165519 171153 178450 187999 200143 214947 231954 250243 269154 288673 309019
56885 309019 330378 353076 376869 399373 416102 423151 419658 407496 389518 368819 348574 331155
56873 331155 317477 307787 302609 302291 306437 314782 328184 347818 373753 405124 441344 482364 528097
$$ packed form
56959C62497K0857K4061K5824K6616K7368K6692K1342J0407l018j5170k4495l0449
56947D72532l2121k9792k5886k2566j9622j6048j2024q043l563J727O612R929
56935C21135J2489J5902K0211K4071K6736K8622L0042L0073K6575J7418K690j4024
56923E41940k7703l5710l8905l9086l6967l3055k8726k5161k2210j9228j6285
56912B18904j3769j1667r871q492p409o170m779l708k912j712j5J354J939K306
56898A53999L018L874M628N634P297R549J2144J4804J7007J8289J8911J9519K0346
56885C09019K1359K2698K3793K2504J6729P049l493j2162j7978k0699k0245j7419
56873C31155j3678r690n178l18M146Q345J3402J9634K5935L1371L6220M1020M5733
$$ plain form
56860 528097 578377 633168 691864 752003 808502 853749 879063 878294 851896 807368 754825 702104
56848 702104 653666 612185 579405 555968 541923 537521 542967 557970 582396 617036 662923 720149
56836 720149 787784 864369 948135 1037616 1132340 1230884 1326158 1403392 1445455 1441922 1393978 1312331
56824 1312331 1211799 1106410 1006126 915801 836852 769848 715403 673548 643663 625372 618910
56813 618910 624616 642614 672751 714104 764579 821717 884039 951010 1020986 1088587 1143782 1174375
56801 1174375 1171468 1134233 1069863 989113 902003 816446 738097 669734 611478 562655 523119
56790 523119 492643 470422 456079 450158 452712 462443 478142 499789 527138 558407 591755 626700
56778 626700 661941 692288 709841 708739 688070 650940 602469 548623 494985 445299 401139 362714
$$ packed form
56860E28097N0280N4791N8696O0139N6499M5247K5314p69k6398m4528n2543n2721
56848G02104m8438m1481l2780k3437j4045m402N446J5003K4426L4640M5887N7226
56836G20149O7635P6585Q3766Q9481R4724R8544R5274P7234M2063l533m7944q1647
56824A312331j00532j05389j00284r0325p8949o7004n4445m1855k9885j8291o462
56813F18910N706J7998L0137M1353N0475N7138O2322O6971O9976O7601N5195L0593
56801A174375k907l7235o4370q0750q7110q5557p8349o8363n8256m8823l9536
56790E23119l0476k2221j4343n921K554R731J5699K1647K7349L1269L3348L4945
56778F26700L5241L0347J7553j102k0669l7130m8471n3846n3638m9686m4160l8425
$$ plain form
56766 362714 329467 300380 274752 252713 234512 219634 207266 197141 189192 182863 177558 173347
56754 173347 170404 168106 165484 162258 158790 155488 152791 151063 149780 147582 143964 140164 137473 135496
56740 135496 133170 130692 129092 128495 128153 127840 127925 128335 128647 129022 130026 131712 133760 136202 139110 141931
56724 141931 144088 145808 147471 148729 149236 149637 150696 151992 152756 153444 155073 157382 159106 159865 160405 161027
56708 161027 161156 160579 159891 159546 159397 159253 159039 158452 157296 156069 155362 154850 153738 152034 150562 149877 149949
56691 149949 150634 151577 151974 151299 150103 149281 148907 148524 148107 147838 147381 146431 145582 145647 146467 147376 148432 150111
56673 150111 152109 153589 154398 155030 155631 156025 156504 157575 159149 160747 162256 163725 164930 165982 167770
56658 167770 170788 174100 176560 178477 180968 184184 187334 190004 192231 193811 194700 195667 197321 199014 199896
$$ packed form
56766C62714l3247k9087k5628k2039j8201j4878j2368j0125p949o329n305m211
56754A73347k943k298k622l226l468l302k697j728j283k198l618l800k691j977
56740A35496k326k478j600n97l42l13Q5M10L12L75J004J686K048K442K908K821
56724A41931K157J720J663J258N07M01J059J296P64O88J629K309J724P59N40O22
56708A61027J29n77o88l45j49j44k14n87j156j227p07n12j112j704j472o85P2
56691A49949O85R43L97o75j196q22l74l83m17k69m57r50q49O5Q20R09J056J679
56673A50111J998J480Q09O32O01L94M79J071J574J598J509J469J205J052J788
56658A67770L018L312K460J917K491L216L150K670K227J580Q89R67J654J693Q82
$$ plain form
56643 199896 200465 201685 203152 203644 203139 202749 202806 202428 200942 198576 195892 193532 192168 191696 191015 189626
56627 189626 188707 189431 191109 192408 193498 195265 197306 198698 200083 202856 206669 209801 211705 213115 213951
56612 213951 213440 212297 212468 214374 216431 217638 218651 219913 220707 220729 220879 221821 223101 224137 224751 224571
56596 224571 223256 221477 220185 218954 216667 213763 211854 211018 209568 206931 204679 204060 204399 204741 205250
56581 205250 206134 206830 207162 207849 209027 209712 209555 209705 211020 212775 214121 215633 218445 222829 228471 235239
56565 235239 242886 250819 258829 267345 276568 286162 296163 307293 320016 334055 348963 364153 378294
56552 378294 389917 398999 406943 414812 422584 430144 437609 444430 449507 452605 454536 455622 455168 452718
56538 452718 448677 443460 437196 430397 423661 416518 407884 397845 387596 377457 366458 354271 342099
$$ packed form
56643A99896N69J220J467M92n05l90N7l78j486k366k684k360j364m72o81j389
56627A89626r19P24J678J299J090J767K041J392J385K773L813L132J904J410Q36
56612B13951n11j143J71J906K057J207J013J262P94K2J50R42J280J036O14j80
56596B24571j315j779j292j231k287k904j909q36j450k637k252o19L39L42N09
56581B05250Q84O96L32O87J178O85j57J50J315J755J346J512K812M384N642O768
56565B35239P647P933Q010Q516R223R594J0001J1130J2723J4039J4908J5190J4141
56552C78294J1623R082P944P869P772P560P465O821N077L098J931J086m54k450
56538D52718m041n217o264o799o736p143q634j0039j0249j0139j0999j2187j2172
$$ plain form
56525 342099 331149 321470 312672 304603 296920 289202 281766 275257 269309 262881 255996 249770 244614 239867
56511 239867 235264 231247 227702 224021 220567 218425 217442 216207 214261 212612 211757 210940 209785 208951 208701
56496 208701 208475 208271 208830 210051 210945 211438 212491 214103 215098 215258 215697 216700 217220 217001 217089 217651 217528 216663
56478 216663 216630 217802 218290 216875 214855 213693 212924 211823 211207 211910 213089 213552 213405 213167 212692 212253 213121
56461 213121 215720 218524 220036 220586 221114 221590 221855 222622 224356 226234 227338 227793 227931 227566 226856 226533 226560
56444 226560 225974 224737 224101 224469 224685 224209 224093 224894 225642 225963 227153 229841 232523 233823 234418 235319 236085
56427 236085 236240 236682 238092 239523 240054 240272 240726 240609 239459 238456 238420 238214 236817 235383 235521 236963 238526
56410 238526 239964 241279 241770 241360 241380 242466 243269 242811 242428 243579 245433 246563 247429 249069 250785 251319
$$ packed form
56525C42099j0950r679q798q069p683p718p436o509n948o428o885o226n156m747
56511B39867m603m017l545l681l454k142r83j235j946j649q55q17j155q34k50
56496B08701k26k04N59J221Q94M93J053J612R95J60M39J003N20k19Q8N62j23q65
56478B16663l3J172M88j415k020j162p69j101o16P03J179M63j47k38m75m39Q68
56461B13121K599K804J512N50N28M76K65P67J734J878J104M55J38l65p10l23K7
56444B26560n86j237o36L68K16m76j16Q01P48L21J190K688K682J300N95R01P66
56427B36085J55M42J410J431N31K18M54j17j150j003l6k06j397j434J38J442J563
56410B38526J438J315M91m10K0J086Q03m58l83J151J854J130Q66J640J716N34
$$ plain form
56394 251319 251144 251493 252170 252278 252118 252501 253132 253432 253922 255141 256272 256516 256712 257929 259649 261024 262679
56377 262679 265483 268643 270821 272085 273155 273885 274134 274841 276479 277700 277344 276500 276797 277937 278766 279445
56361 279445 280592 281540 281472 281139 281498 281849 281221 280407 280582 281140 280909 280346 280463 280781 280442 280187 281069 282331
56343 282331 282672 282550 283083 283866 284022 284223 285413 286706 286953 287274 289507 293140 296326 299039 302591 306725
56327 306725 309852 311806 313956 316854 319904 322948 326124 328563 329186 328395 327265 325799 323718 322023 321751
56312 321751 322014 321301 319941 319287 319365 319366 319590 320813 322532 323838 325169 327319 329723 331640 333843 337042
56296 337042 339942 341086 341405 342618 344485 346033 348079 351746 355707 357799 358416 359515 361276 362581 363823
56281 363823 366280 369503 372225 374997 378984 383014 385053 385956 388512 393155 397740 401289 404881 409034
$$ packed form
56394B51319j75L49O77J08j60L83O31L00M90J219J131K44J96J217J720J375J655
56377B62679K804L160K178J264J070P30K49P07J638J221l56q44K97J140Q29O79
56361B79445J147R48o8l33L59L51o28q14J75N58k31n63J17L18l39k55Q82J262
56343B82331L41j22N33P83J56K01J190J293K47L21K233L633L186K713L552M134
56327C06725L127J954K150K898L050L044L176K439O23p91j130j466k081j695k72
56312C21751K63p13j360o54P8JK24J223J719J306J331K150K404J917K203L199
56296C37042K900J144L19J213J867J548K046L667L961K092O17J099J761J305J242
56281C63823K457L223K722K772L987M030K039R03K556M643M585L549L592M153
$$ plain form
56267 409034 413252 418115 424944 433314 441472 449164 457605 466939 476272 485935 497147 509697 522400
56254 522400 535479 550037 565690 581311 597615 616410 637788 660590 685012 712044 740959
56243 740959 770095 799544 830322 861646 891840 921140 950596 978987 1003983 1025611 1045292
56232 1045292 1062095 1073358 1078592 1079422 1076085 1067387 1053776 1037099 1017605 994545 969319 944495
56220 944495 919987 893816 866484 840935 818198 796642 775579 755998 737618 718789 699669
56209 699669 682171 666494 650941 635255 620916 608111 595671 583991 574765 567914 562023 557404
56197 557404 555273 554303 551830 548195 545988 545236 543436 540302 538181 537629 536811 535558 535722 537064 537076 535505
56181 535505 534851 535739 536037 535296 535822 538357 540811 542329 544680 548519 552082 554696 557986 562618 567309
$$ packed form
56267D09034M218M863O829Q370Q158P692Q441R334R333R663J1212J2550J2703
56254E22400J3079J4558J5653J5621J6304J8795K1378K2802K4422K7032K8915
56243G40959K9136K9449L0778L1324L0194K9300K9456K8391K4996K1628J9681
56232A045292J6803J1263N234Q30l337q698j3611j6677j9494k3060k5226k4824
56220I44495k4508k6171k7332k5549k2737k1556k1063j9581j8380j8829j9120
56209F99669j7498j5677j5553j5686j4339j2805j2440j1680r226o851n891m619
56197E57404k131r70k473l635k207p52j800l134k121n52q18j253J64J342J2j571
56181E35505o54Q88K98p41N26K535K454J518K351L839L563K614L290M632M691
$$ plain form
56166 567309 571824 577487 584156 590251 596109 603563 611921 618450 623200 629160 637220 645297 652908 662049
56152 662049 672854 683011 692412 703955 718734 734799 751517 770751 792874 816186 841132 870535
56140 870535 904785 941477 980706 1025914 1078698 1137803 1204226 1281968 1372513 1473838 1586291
56129 1586291 1713971 1858532 2016746 2185704 2364704 2549737 2731360 2900686 3053344
56120 3053344 3186379 3297000 3386834 3462392 3528562 3585358 3631780 3667268 3687861 3687097 3663668
56109 3663668 3623515 3572502 3512127 3443558 3369146 3286964 3189722 3072417 2936499 2784909 2619283
56098 2619283 2444789 2271492 2107310 1954460 1814921 1693138 1590317 1502132 1425506 1362098
56088 1362098 1312224 1271451 1236707 1209863 1191832 1178957 1168713 1163100 1162884 1164435 1165829 1170107
$$ packed form
56166E67309M515N663O669O095N858P454Q358O529M750N960Q060Q077P611R141
56152F62049J0805J0157R401J1543J4779J6065J6718J9234K2123K3312K4946K9403
56140H70535L4250L6692L9229M5208N2784N9105O6423P7742R0545J01325J12453
56129A586291J27680J44561J58214J68958J79000J85033J81623J69326J52658
56120C053344J33035J10621Q9834P5558O6170N6796M6422L5488K0593p64k3429
56109C663668m0153n1013o0375o8569p4412q2182r7242j17305j35918j51590j65626
56098B619283j74494j73297j64182j52850j39539j21783j02821q8185p6626o3408
56088A362098m9874m0773l4744k6844j8031j2875j0244n613k16J551J394M278
$$ plain form
56076 1170107 1178806 1188212 1195705 1203761 1213947 1223032 1228813 1233658 1238526 1239851 1236194 1231653 1228794 1224751
56062 1224751 1218182 1213160 1211991 1211185 1208889 1209176 1214437 1220795 1225786 1233168 1245152 1257443 1267260 1278713
56048 1278713 1294708 1311080 1324428 1338274 1355657 1373370 1389394 1408239 1432696 1458282 1482250
56037 1482250 1510048 1546086 1586187 1626038 1668825 1717166 1765733 1809535 1851553 1894560 1933632
56026 1933632 1964708 1992643 2022952 2053794 2083812 2119022 2163455 2211488 2257804 2306099 2359657
56015 2359657 2413010 2462043 2512712 2570148 2628956 2684084 2741244 2806245 2874243 2940301 3010236
56004 3010236 3089816 3173807 3257248 3346813 3449028 3558287 3668791 3786908 3918893 4058321
55994 4058321 4199137 4348764 4514165 4687818 4862583 5047290 5251768 5469998 5694811
$$ packed form
56076A170107Q699R406P493Q056J0186R085N781M845M868J325l657m541k859m043
56062A224751o569n022j169q06k296K87N261O358M991P382J1984J2291R817J1453
56048A278713J5995J6372J3348J3846J7383J7713J6024J8845K4457K5586K3968
56037A482250K7798L6038M0101L9851M2787M8341M8567M3802M2018M3007L9072
56026A933632L1076K7935L0309L0842L0018L5210M4433M8033M6316M8295N3558
56015B359657N3353M9033N0669N7436N8808N5128N7160O5001O7998O6058O9935
56004C010236P9580Q3991Q3441Q9565J02215J09259J10504J18117J31985J39428
55994D058321J40816J49627J65401J73653J74765J84707K04478K18230K24813
$$ plain form
55985 5694811 5935372 6202507 6490961 6794578 7124226 7491330 7889257 8311513 8772120
55976 8772120 9286449 9849313 10455346 11122818 11872425 12702316 13611796 14630001 15792685
55967 15792685 17113761 18613649 20355033 22418682 24872287 27803488 31354198 35673357
55959 35673357 40861568 47014762 54300761 62947964 73199861 85343586 99731628 116670090
55951 116670090 136281187 158513028 183210704 210113773 238954820 269749156 302674527
55944 302674527 336880718 368939462 392868540 402617886 395332656 372715796 339664619
55937 339664619 301748276 263422209 227487756 195272638 167068826 142649448 121666145
55930 121666145 103777001 88622477 75844865 65138633 56228883 48824552 42645933
$$ packed form
55985E694811K40561K67135K88454L03617L29648L67104L97927M22256M60607
55976H772120N14329N62864O06033O67472P49607Q29891R09480J018205J162684
55967A5792685J321076J499888J741384K063649K453605K931201L550710M319159
55959C5673357N188211O153194P285999Q647203J0251897J2143725J4388042J6938462
55951A16670090J9611097K2231841K4697676K6903069K8841047L0794336L2925371
55944C02674527L4206191L2058744K3929078R749346p285230k2616860l3051177
55937C39664619l7916343l8326067l5934453l2215118k8203812k4419378k0983303
55930A21666145j7889144j5154524j2777612j0706232q909750p404331o178619
$$ plain form
55923 42645933 37478835 33158227 29521368 26420171 23758787 21475111 19497780 17755353
55915 17755353 16210426 14847485 13637823 12546921 11563231 10688135 9906765 9195947 8550730
55906 8550730 7976405 7463171 6993360 6564939 6184020 5842106 5523423 5227268 4961450
55897 4961450 4720610 4491849 4275258 4078855 3899220 3726376 3562126 3414926 3281762
55888 3281762 3152895 3029618 2920038 2821828 2725926 2633145 2551018 2478033 2406593 2338071 2279893
55877 2279893 2230928 2184194 2140898 2107818 2083737 2061894 2042911 2032058 2026411 2017598 2004770 1992514
55865 1992514 1978510 1955378 1922222 1882544 1833498 1769502 1694573 1619508 1548636 1480278 1417745
55854 1417745 1367922 1330234 1298190 1270774 1251671 1238537 1223723 1204989 1185609 1164951 1138957
$$ packed form
55923D2645933n167098m320608l636859l101197k661384k283676j977331j742427
55915A7755353j544927j362941j209662j090902r83690q75096p81370p10818o45217
55906H550730n74325n13234m69811m28421l80919l41914l18683k96155k65818
55897D961450k40840k28761k16591j96403j79635j72844j64250j47200j33164
55888C281762j28867j23277j09580r8210r5902r2781q2127p2985p1440o8522n8178
55877B279893m8965m6734m3296l3080k4081k1843j8983j0853n647q813j2828j2256
55865A992514j4004k3132l3156l9678m9046o3996p4929p5065p0872o8358o2533
55854A417745m9823l7688l2044k7416j9103j3134j4814j8734j9380k0658k5994
$$ plain form
55843 1138957 1109222 1081796 1057391 1031813 1005271 982086 961910 940323 917590 898081 881618
55832 881618 864060 845925 831829 821799 811498 800647 792980 788263 782580 776288 773545 774050 773214
55819 773214 770526 770076 772723 775395 778215 784770 794965 804815 813568 824040 835723 844553 849711 853841
55805 853841 856274 852926 843266 830856 816743 798829 778007 758328 740611 722107 702728 685377
55793 685377 669908 653118 635165 619834 608073 597323 587574 581863 580287 579612 579453 582946 590641
55780 590641 599431 607999 617468 626107 629361 626183 619955 612462 602286 589640 577153 565065 551103
55767 551103 535892 523162 513763 504639 494451 485044 476753 467616 458038 450961 446486 441414 434994
55754 434994 429974 427036 423215 416969 410072 403589 396606 389652 384627 380717 375122 368260 363296 360191
$$ packed form
55843A138957k9735k7426k4405k5578k6542k3185k0176k1587k2733j9509j6463
55832H81618j7558j8135j4096j0030j0301j0851p667m717n683o292k743N05q36
55819G73214k688m50K647K672K820O555J0195R850Q753J0472J1683Q830N158M130
55805H53841K433l348r660j2410j4113j7914k0822j9679j7717j8504j9379j7351
55793F85377j5469j6790j7953j5331j1761j0750r749n711j576o75j59L493P695
55780E90641Q790Q568R469Q639L254l178o228p493j0176j2646j2487j2088j3962
55767E51103j5211j2730r399r124j0188r407q291r137r578p077m475n072o420
55754D34994n020k938l821o246o897o483o983o954n025l910n595o862m964l105
$$ plain form
55740 360191 355617 349326 344969 343631 342207 339406 337742 338015 337368 334772 333184 334172 335270 334760 334304
55725 334304 334665 333449 329442 325002 321957 319131 315904 314130 314505 314877 314079 313629 313943 312880 309951 308024
55709 308024 308836 310552 311656 313455 316777 319932 321988 324518 328039 330212 329541 327581 325659 322832 318876
55694 318876 315793 314406 312778 309898 307683 307456 307780 307648 308577 311562 315133 318319 322432 328083 333594
55679 333594 338170 343458 350096 355938 359644 362860 366801 369878 370876 371520 373586 376287 378655 381785 386535
55664 386535 391536 395538 399287 403297 406333 407789 408878 409648 407665 401625 393646 385977 378063 368741
55650 368741 358734 348914 338597 327549 317302 308636 300171 291231 283537 278222 273804 269038 265136
55637 265136 263145 261746 259775 258370 258399 258262 256587 254696 254055 253490 251482 249079 248027 247718 246421 244018
$$ packed form
55740C60191m574o291m357j338j424k801j664K73o47k596j588R88J098n10m56
55725C34304L61j216m007m440l045k826l227j774L75L72p98m50L14j063k929j927
55709C08024Q12J716J104J799L322L155K056K530L521K173o71j960j922k827l956
55694C18876l083j387j628k880k215k27L24j32R29K985L571L186M113N651N511
55679C33594M576N288O638N842L706L216L941L077R98O44K066K701K368L130M750
55664C86535N001M002L749M010L036J456J089P70j983o040p979p669p914r322
55650C68741j0007r820j0317j1048j0247q666q465q940p694n315m418m766l902
55637B65136j991j399j971j405K9j37j675j891o41n65k008k403j052l09j297k403
$$ plain form
55621 244018 241350 238380 235025 232391 231239 230566 229256 227784 226929 226451 226227 226932 228299 228706 227730 226976
55605 226976 227094 226352 223649 220578 218800 217646 216061 214655 214037 213317 212066 211563 212293 212459 210862 208981
55589 208981 208261 207639 205859 204020 203594 203924 203906 204229 205774 207639 208842 210154 212257 213971 214320 214489
55573 214489 215755 217401 218606 220318 223158 225633 226642 227689 230353 233608 235977 238165 241048 243223
55559 243223 243381 243154 244614 246649 246796 245170 243608 242283 240168 237735 236254 235289 233624 231856 231497
55544 231497 232280 232779 232873 233251 233345 232243 230884 230978 232409 233757 234580 234996 234020 230664 225940 221586 217586
55527 217586 213055 208605 205559 203571 201363 199016 197336 195731 193063 189980 188114 187496 186920 186249 186244 186735
55511 186735 187112 187980 190071 192106 192050 190079 188156 187060 186041 185044 184916 185502 185637 185153 185087 185858 186849
$$ packed form
55621B44018k668k970l355k634j152o73j310j472q55m78k24P05J367M07r76p54
55605B26976J18p42k703l071j778j154j585j406o18p20j251n03P30J66j597j881
55589B08981p20o22j780j839m26L30j8L23J545J865J203J312K103J714L49J69
55573B14489J266J646J205J712K840K475J009J047K664L255K369K188K883K175
55559B43223J58k27J460K035J47j626j562j325k115k433j481r65j665j768l59
55544B31497P83M99R4L78R4j102j359R4J431J348Q23M16r76l356m724m354m000
55527B17586m531m450l046j988k208k347j680j605k668l083j866o18n76o71nM91
55511A86735L77Q68K091K035n6j971j923j096j019r97j28N86J35m84o6P71R91
$$ plain form
55494 186849 187663 188355 188596 188054 187280 186938 186674 186064 185859 186809 188042 188272 187841 187821 187872 186856 184950 183340
55476 183340 182376 181743 181801 182901 184001 183811 182781 182245 182262 182114 182188 183288 184691 184926 184091 183443 183145 182396
55458 182396 181382 181024 181094 180547 179539 179215 179677 179951 179799 179846 180124 180136 180128 180660 181268 181156 180838 181368 182400
55439 182400 182705 182214 181803 181486 180612 179495 179098 179470 180128 181395 183544 185247 185023 183743 183554 184630 185178
55422 185178 184449 183534 183213 183236 183779 185476 187738 189052 189241 189671 191007 192530 193807 195261 196824 197696
55406 197696 197755 197727 197780 197411 196778 196617 196747 196081 194129 191261 187702 183767 180748 179905 180680 181454 181782 182307
55388 182307 182921 182898 182555 182842 183491 183479 183092 183529 184594 184875 184150 183458 182870 181472 179696 179236 180232 180782
55370 180782 179812 178293 177065 175589 173640 172195 171718 171362 170734 170833 172328 174416 176145 177548 178795 179604
$$ packed form
55494A86849Q14O92K41n42p74l42k64o10k05R50J233K30m31k0N1j016j906j610
55476A83340r64o33N8J100J100j90j030n36J7j48P4J100J403K35q35o48k98p49
55458A82396j014l58P0n47j008l24M62K74j52M7K78J2qN32O08j12l18N30J032
55439A82400L05m91m11l17q74j117l97L72O58J267K149J703k24j280j89J076N48
55422A85178p29r15l21K3N43J697K262J314J89M30J336J523J277J454J563Q72
55406A97696N9k8N3l69o33j61J30o66j952k868l559l935l019q43P75P74L28N25
55388A82307O14k3l43K87O49j2l87M37J065K81p25o92n88j398j776m60R96N50
55370A80782r70j519j228j476j949j445m77l56o28R9J495K088J729J403J247Q09
$$ plain form
55354 179604 180026 180528 180838 180153 178838 178352 179062 179756 179821 180176 181373 182509 182874 183103 183789 184323 184084 183538
55336 183538 183310 183316 183494 184202 185207 185454 184608 183647 183325 183194 182811 182607 182804 182711 182005 181611 182338 183530 184010
55317 184010 183642 183089 182659 182158 181439 180586 179916 179939 180808 181747 181789 181125 180831 181265 181711 181680 181477 181327 181022 180634
55297 180634 180490 180277 179342 178112 177979 179386 181097 181774 181357 180591 180169 180585 181854 183088 183259 182527 181961
55280 181961 182018 182323 182845 183949 185230 185657 185098 184488 184265 183913 183212 182648 182308 181655 180676 180016 179796 179581
55262 179581 179670 180975 183319 185294 186097 186179 185844 184761 183249 182471 182735 183022 182796 182847 183747 184782 185109 184801
55244 184801 184196 183445 183141 184078 185765 186494 185505 183875 182696 181748 180663 180070 180691 182301 184259 186139
55228 186139 187354 187292 186364 185870 186335 187083 187744 188828 190329 191223 191076 190830 191251 191834 191953 191870 191807 191230 189926
$$ packed form
55354A79604M22N02L10o85j315m86P10O94O5L55J197J136L65K29O86N34k39n46
55336A83538k28OJ78P08J005K47q46r61l22j31l83k04J97r3p06l94P27J192M80
55317A84010l68n53m30n01p19q53o70K3Q69R39M2o64k94M34M46l1k03j50l05l88
55297A80634j44k13r35j230j33J407J711O77m17p66m22M16J269J234J71p32n66
55280A81961N7L05N22J104J281M27n59o10k23l52p01n64l40o53r79o60k20k15
55262A79581Q9J305K344J975Q03Q2l35j083j512p78K64K87k26N1R00J035L27l08
55244A84801o05p51l04R37J687P29r89j630j179r48j085n93O21J610J958J880
55228A86139J215o2r28m94M65P48O61J084J501Q94j47k46M21N83J19q3o3n77j304
$$ plain form
55209 189926 188777 188632 189286 190197 191262 192324 192951 193230 193767 194455 194367 193269 192028 191062 189742 187864 186348
55192 186348 185802 185720 185694 186082 186850 187163 186871 186946 187693 187984 187147 186165 186014 186203 186019 185885 186375 187097 187622 188360
55172 188360 189462 190032 189546 188963 189326 190305 191154 192064 193519 195269 196927 198608 200194 201045 201322 202258 204190
55155 204190 205695 205820 205772 207038 209140 210787 212086 213856 215639 216135 215119 213451 211621 209606 207750
55140 207750 206492 205495 204101 202349 200737 199360 198036 196813 195696 194503 193549 193662 194872 195975 196117
55125 196117 195857 195905 195895 195321 194660 194590 195009 195695 196951 198700 200015 200520 201118 202335 203163 202724 201889 201864 202289
55106 202289 202137 201557 201324 201326 201048 200857 201423 202470 203298 203875 204350 204356 203922 204080 205272 206183 205573 204261 203753
55087 203753 203852 203394 202503 202250 202565 202354 201424 200672 200512 200544 200545 200563 200283 199496 198820 198795 198771 197856 196386 195236
$$ packed form
55209A89926j149j45O54R11J065J062O27K79N37O88q8j098j241r66j320j878j516
55192A86348n46q2k6L88P68L13k92P5P47K91q37r82j51J89j84j34M90P22N25P38
55172A88360J102N70m86n83L63R79Q49R10J455J750J658J681J586Q51K77R36J932
55155B04190J505J25m8J266K102J647J299J770J783M96j016j668j830k015j856
55140B07750j258r97j394j752j612j377j324j223j117j193r54J13J210J103J42
55125A96117k60M8j0n74o61p0M19O86J256J749J315N05N98J217Q28m39q35k5M25
55106B02289j52n80k33Kk78j91N66J047Q28N77M75Om34J58J192R11o10j312n08
55087B03753R9m58q91k53L15k11r30p52j60L2JJ8k80p87o76k5k4r15j470j150
$$ plain form
55067 195236 194302 193062 191945 191685 191855 191545 191010 191202 192112 193022 193920 195167 196262 196486 196375 196976 198024
55050 198024 198401 198079 197991 198311 198468 198600 199358 200443 200938 200943 201382 202370 203241 203956 204880 205449 204774 203452 203041
55031 203041 203823 204778 205645 207103 208873 209585 208917 208073 207750 207282 206272 205381 204988 204606 204178 204470 205552
55014 205552 206356 206386 206508 207326 208057 207831 206961 206138 205370 204498 203900 203961 204566 205625 207344 209492 211228 212141
54996 212141 212737 213471 214126 214529 215066 215900 216415 216053 215216 214862 215526 216946 218241 218389 217044 215060 213784
54979 213784 213875 215213 217556 220455 222808 223599 223167 222795 223047 223396 223502 223726 224267 224842 225491 226705 228440
54962 228440 229953 230961 232041 233529 234899 235715 236429 237682 239386 240966 242065 242677 242952 243147 243466 243909
54946 243909 244585 246067 248875 252729 256854 260941 265278 270072 275281 281008 287401 294331 301813 310575
$$ packed form
55067A95236r34j240j117k60J70l10n35J92R10R10Q98J247J095K24j11O01J048
55050A98024L77l22q8L20J57J32P58J085M95NM39R88Q71P15R24N69o75j322m11
55031B03041P82R55Q67J458J770P12o68q44l23m68j010q91l93l82m28K92J082
55014B05552Q04L0J22Q18P31k26q70q23p68q72n98O1O05J059J719K148J736R13
54996B12141N96P34O55M03N37Q34N15l62q37l54O64J420J295J48j345j984j276
54979B13784R1J338K343K899K353P91m32l72K52L49J06K24N41N75O49J214J735
54962B28440J513J008J080J488J370Q16P14J253J704J580J099O12K75J95L19M43
54946B43909O76J482K808L854M125M087M337M794N209N727O393O930P482Q762
$$ plain form
54932 310575 321446 334250 347978 361881 375645 388738 400423 410372 418461 424004 425869 423322
54920 423322 416302 405326 391829 378015 365300 353182 340564 327776 316273 306820 299197 293241
54908 293241 288763 284699 279874 274718 270867 269036 268446 268313 268506 268771 268790 269255 271458 275440 279802 283660
54892 283660 287646 292722 299315 307890 319011 332217 345971 359250 372240 385039 396703 406009
54880 406009 412233 414842 413374 408054 399671 388629 374972 359478 343730 328859 315147 302904
54868 302904 292566 283792 275685 268223 262291 258083 254699 251583 249093 247244 245224 242615 239971 237771
54854 237771 235955 234752 234597 234845 234058 232149 230757 230760 230951 230082 228775 228236 228301 228011 227203 226322 225387 224281
54836 224281 223457 223343 223494 223156 222242 221148 220189 219819 220695 222772 224907 226012 226158 226069 226242 226973 228486
$$ packed form
54932C10575J0871J2804J3728J3903J3764J3093J1685R949Q089N543J865k547
54920D23322p020j0976j3497j3814j2715j2118j2618j2788j1503r453p623n956
54908B93241m478m064m825n156l851j831n90j33J93K65J9M65K203L982M362L858
54892B83660L986N076O593Q575J1121J3206J3754J3279J2990J2799J1664R306
54880D06009O224K609j468n320q383j1042j3657j5494j5748j4871j3712j2243
54868C02904j0338q774q107p462n932m208l384l116k490j849k020k609k644k200
54854B37771j816j203j55K48p87j909j392LJ91q69j307n39O5k90q08q81r35j106
54836B24281q24j14J51l38r14j094r59l70Q76K077K135J105J46q9J73P31J513
$$ plain form
54819 228486 230359 231513 231366 230462 229560 228841 228458 228933 230351 231879 232773 233214 233698 234295 235004 236060 237361
54802 237361 238347 238900 239524 240189 240044 238922 238112 238825 240714 242699 244409 246026 247528 248989 250898 253372
54786 253372 255754 257840 260769 265783 272672 280307 288194 296652 305961 316152 327270 339153 351329
54773 351329 363604 376175 388622 399450 407249 411678 412752 410030 403350 393688 382385 370066 357128
54760 357128 344661 333853 324853 317077 310329 304807 300333 296392 292795 289703 287159 285060 283415 282237
54746 282237 281483 281334 282125 283790 285894 288397 291680 295653 299713 303953 309446 316797 325355 334497 344745
54731 344745 356825 370331 384035 396776 407406 414691 418107 418117 415033 408415 398306 386184 373710
54718 373710 361183 348091 334546 321322 309093 298408 289809 283198 277681 272693 268596 265598 263053
$$ packed form
54819B28486J873J154j47r04r02p19l83M75J418J528Q94M41M84N97P09J056J301
54802B37361R86N53O24O65j45j122q10P13J889J985J710J617J502J461J909K474
54786B53372K382K086K929N014O889P635P887Q458R309J0191J1118J1883J2176
54773C51329J2275J2571J2447J0828P799M429J074k722o680r662j1303j2319j2938
54760C57128j2467j0808r000p776o748n522m474l941l597l092k544k099j645j178
54746B82237p54j49P91J665K104K503L283L973M060M240N493P351Q558R142J0248
54731C44745J2080J3506J3704J2741J0630P285L416J0l084o618j0109j2122j2474
54718C73710j2527j3092j3545j3224j2229j0685q599o611n517m988m097k998k545
$$ plain form
54705 263053 260622 259079 258921 259119 258416 257039 255928 255033 253699 252080 250753 249446 247502 245293 243853
54690 243853 243349 243068 242711 242570 242613 242540 242579 243147 243855 243840 243050 242276 242041 242252 242837 243821 244877 245521 245676 245490
54670 245490 244890 243917 243108 242829 242658 242079 241329 240854 240477 239870 239231 238681 237671 236028 234915 235571 237516
54653 237516 239107 239497 239040 238232 237461 237411 238500 240108 241285 241906 242231 241908 240592 239051 238362 238440 238610
54636 238610 239157 240811 242985 244093 243611 242451 241367 240318 239377 238802 238127 236580 234597 233666 234420 236060
54620 236060 237763 239401 240693 240996 240351 239660 239471 239543 239765 240443 241463 242236 242703 243361 244130 244359 244162 244529
54602 244529 245730 246818 247143 247168 247255 246841 245600 244422 244307 244946 245234 244718 243859 243212 242912 242792 242628 242389
54584 242389 242316 242531 242725 242623 242519 242791 243225 243590 244564 247024 250544 253625 255467 256443 256826 256361 255341
$$ packed form
54705B63053k431j543j58J98p03j377j111q95j334j619j327j307j944k209j440
54690B43853n04k81l57j41M3p3L9N68P08j5p90p74k35K11N85R84J056O44J55j86
54670B45490o00r73q09k79j71n79p50m75l77o07o39n50j010j643j113O56J945
54653B37516J591L90m57q08p71n0J089J608J177O21L25l23j316j541o89P8J70
54636B38610N47J654K174J108m82j160j084j049r41n75o75j547j983r31P54J640
54620B36060J703J638J292L03o45o91j89P2K22O78J020P73M67O58P69K29j97L67
54602B44529J201J088L25K5Q7m14j241j178j15O39K88n16q59o47l00j20j64k39
54584B42389p3K15J94j02j04K72M34L65R74K460L520L081J842R76L83m65j020
$$ plain form
54567 255341 254773 254979 255089 254532 254021 254428 255562 256689 257524 258085 258297 258317 258562 258899 258539 257319 256361 256678
54549 256678 257715 258094 257436 256667 256732 257689 258993 260114 260803 261123 261317 261563 261898 262354 262956 263593 264133 264677
54531 264677 265403 266275 267188 268309 269831 271504 272816 273566 273899 273957 273935 274219 274866 275242 274827 274132 274063 274607
54513 274607 275021 275118 275356 275740 275730 275390 275523 276320 276827 276198 274729 273241 272057 270945 269574 267793 265963
54496 265963 265058 265819 267796 269839 271453 272897 274090 274493 274197 274065 274537 275235 275949 276949 278029 278340
54480 278340 277698 277094 277381 278344 279532 281086 283063 284808 285723 286056 286397 286986 287892 289094 289953 289488 287797
54463 287797 286373 286303 286977 287341 287607 288703 290594 292185 292655 292071 290929 289836 289389 289712 290201 290303 290282
54446 290282 290709 291449 291789 291436 290802 290340 290029 289580 288846 287982 287292 286859 286386 285592 284650 283847 282993 281764
$$ packed form
54567B55341n68K06J10n57n11M07J134J127Q35N61K12K0K45L37l60j220r58L17
54549B56678J037L79o58p69O5R57J304J121O89L20J94K46L35M56O02O37N40N44
54531B64677P26Q72R13J121J522J673J312P50L33N8k2K84O47L76m15o95o9N44
54513B74607M14R7K38L84j0l40J33P97N07o29j469j488j184j112j371j781j830
54496B65963r05P61J977K043J614J444J193M03k96j32M72O98P14J000J080L11
54480B78340o42o04K87R63J188J554J977J745R15L33L41N89R06J202Q59m65j691
54463B87797j424p0O74L64K66J096J891J591M70n84j142j093m47L23M89J02k1
54446B90282M27P40L40l53o34m62l11m49p34q64o90m33m73p94r42q03q54j229
$$ plain form
54428 281764 280582 280333 281093 281943 282260 282359 282509 282255 281342 280499 280569 281428 282446 283500 284791 286120 287111 287868
54410 287868 288645 289106 288605 287119 285376 284095 283521 283607 284197 285062 286069 287266 288566 289502 289533 288605 287310
54393 287310 286603 287219 289004 290806 291488 291115 290703 290822 291099 291172 291309 291657 291633 290657 289067 287719 286978 286538
54375 286538 286000 285278 284633 284534 285180 286049 286333 285966 285683 285891 286065 285610 284759 284196 284213 284644 285244 285760 285962
54356 285962 285960 286173 286797 287664 288729 290139 291625 292425 292174 291375 290721 290373 290179 289978 289450 288261 286758 285943
54338 285943 286399 287706 289163 290434 291213 291051 289996 288748 287730 286679 285604 285315 286294 287707 288364 288169
54322 288169 287885 287872 287831 287553 287280 287495 288738 291246 294300 296403 296699 295947 295664 296604 298439 300388 301705
54305 301705 301988 301628 301651 302697 304456 306353 308178 309652 310079 309084 307203 305158 303035 300693 298427 296562
$$ packed form
54428B81764j182k49P60Q50L17R9J50k54r13q43P0Q59J018J054J291J329R91P57
54410B87868P77M61n01j486j743j281n74Q6N90Q65J007J197J300R36L1r28j295
54393B87310p07O16J785J802O82l73m12J19K77P3J37L48k4r76j590j348p41m40
54375B86538n38p22o45r9O46Q69K84l67k83K08J74m55q51n63J7M31O00N16K02
54356B85962kK13O24Q67J065J410J486Q00k51p99o54l48j94k01n28j189j503q15
54338B85943M56J307J457J271P79j62j055j248j018j051j075k89R79J413O57j95
54322B88169k84j3m1k78k73K15J243K508L054K103K96p52k83R40J835J949J317
54305C01705K83l60K3J046J759J897J825J474M27r95j881k045k123k342k266j865
$$ plain form
54289 296562 294904 293213 291752 290754 289858 288802 288166 288646 289893 290835 290873 290172 289131 288158 287620 287397 286849
54272 286849 285753 284795 284574 284700 284555 284330 284451 284628 284455 284451 285380 286826 287585 287342 286901 286842 286945 286963 286978 286882
54252 286882 286386 285695 285396 285521 285470 285000 284551 284335 283830 282560 280897 279719 279464 279749 279826 279311 278546 278156
54234 278156 278253 278343 278120 277891 277952 278083 278053 278146 278677 279434 280091 280763 281629 282466 283168 284246 286077 288095 289431
54215 289431 290049 290502 290946 291200 291431 291909 292257 291801 290526 289011 287512 285866 284112 282479 280938 279504
54199 279504 278747 279217 280466 281416 281538 280994 279854 278106 276307 275281 275126 275241 275268 275270 275149 274789 274673 275412
54181 275412 276636 277327 277286 277312 277810 278218 278098 277818 277755 277666 277378 277387 278195 279494 280445 280488 279631 278288 277018 276125
54161 276125 275423 274633 273899 273524 273434 273428 273693 274375 274841 274227 272683 271253 270478 270049 269881 270518 272087 273784
$$ packed form
54289B96562j658j691j461r98q96j056o36M80J247R42L8p01j041r73n38k23n48
54272B86849j096r58k21J26j45k25J21J77j73mR29J446P59k43m41n9J03J8J5r6
54252B86882m96o91k99J25n1m70m49k16n05j270j663j178k55K85P7n15p65l90
54234B78156R7R0k23k29O1J31l0R3N31P57O57O72Q66Q37P02J078J831K018J336
54215B89431O18M53M44K54K31M78L48m56j275j515j499j646j754j633j541j434
54199B79504p57M70J249R50J22n44j140j748j799j026j55J15K7Kj21l60j16P39
54181B75412J224O91m1K6M98M08j20k80o3q9k88RQ08J299R51M3q57j343j270q93
54161B76125p02p90p34l75r0oK65O82M66o14j544j430p75m29j68O37J569J697
$$ plain form
54143 273784 274950 275948 277442 279375 281193 282613 283769 284952 286598 289111 292285 295199 297076 297987 298527
54128 298527 299062 299507 299555 298887 297491 295995 295397 296113 297447 298239 297991 297284 297147 298032 299386 300272 300388 300207
54110 300207 300107 299873 299267 298554 297970 297175 295858 294492 293792 293704 293682 293675 294033 294595 294728 294284 293727 293332 292968
54091 292968 292719 292891 293350 293549 293350 293126 292985 292585 291818 291040 290500 290170 290155 290611 291220 291444 291338 291385 291540
54072 291540 291242 290487 290009 290230 290854 291728 293209 295348 297450 298868 299627 300022 300184 300267 300457 300565 300278 299887
54054 299887 300051 300718 301184 301391 302159 303790 305482 306595 307553 308839 310077 310897 311911 313932 316749 319553
54038 319553 322128 324887 328085 331755 336066 340979 345782 349625 352466 355017 357985 361797 366734 372695
54024 372695 378975 384775 389899 394587 398914 402731 406019 408820 410964 412316 413264 414548 416539 418893
$$ packed form
54143B73784J166R98J494J933J818J420J156J183J646K513L174K914J877R11N40
54128B98527N35M45M8o68j396j496n98P16J334P92k48p07j37Q85J354Q86J16j81
54110C00207j00k34o06p13n84p95j317j366p00q8k2pL58N62J33m44n57l95l64
54091B92968k49J72M59J99j99k24j41m00p67p78n40l30j5M56O09K24j06M7J55
54072B91540k98p55m78K21O24Q74J481K139K102J418P59L95J62Q3J90J08k87l91
54054B99887J64O67M66K07P68J631J692J113R58J286J238Q20J014K021K817K804
54038C19553K575K759L198L670M311M913M803L843K841K551K968L812M937N961
54024C72695O280N800N124M688M327L817L288K801K144J352R48J284J991K354
$$ plain form
54010 418893 420934 422320 423479 425447 429089 434332 440393 446826 454134 463235 474599 487999 502890
53997 502890 518977 536642 556809 580026 605600 631710 655986 675417 686175 684929 671067 647318
53985 647318 617914 586504 555618 526886 500875 477179 455352 435691 418907 405377 394998
53974 394998 387290 381301 375857 370360 365111 360602 356828 353512 350534 347841 345321 343113 341590 340745
53960 340745 339994 338970 338138 338187 339104 340190 340773 340633 340063 339771 340456 342176 344363 346542 348711 350915 352943
53943 352943 354704 356535 358918 362186 366577 372079 378155 384185 390334 397377 405488 413828 421475 427998
53929 427998 432894 435463 435860 435491 435628 436145 436212 435633 434837 434110 433602 433696 434643 436107 437621 439188 440965
53912 440965 442854 444962 447917 451994 456440 460517 464748 470147 476465 482292 486786 490268 492947 494152
$$ packed form
54010D18893K041J386J159J968L642N243O061O433P308R101J1364J3400J4891
53997E02890J6087J7665K0167K3217K5574K6110K4276J9431J0758j246j3862k3749
53985F47318k9404l1410l0886k8732k6011k3696k1827j9661j6784j3530j0379
53974C94998p708n989n444n497n249m509l774l316k978k693k520k208j523q45
53960C40745p51j024q32M9R17J086N83j40n70k92O85J720K187K179K169K204K028
53943C52943J761J831K383L268M391N502O076O030O149P043Q111Q340P647O523
53929D27998M896K569L97l69J37N17O7n79p96p27n08R4R47J464J514J567J777
53912D40965J889K108K955M077M446M077M231N399O318N827M494L482K679J205
$$ plain form
53898 494152 493362 491298 489366 488275 487600 486466 484366 481417 478135 474964 471933 468654 464645 459721 454151
53883 454151 448330 442245 435476 428018 420852 415122 410830 406997 403144 399808 397361 395182 392532 389589
53869 389589 386924 384498 381872 379039 376399 374132 372178 370620 369517 368574 367447 366192 364967 363617
53855 363617 362039 360650 359877 359467 358903 358284 358096 358271 358245 357992 358269 359577 361435 362958 363826 364404 365173
53838 365173 366320 367742 369252 370664 371738 372200 372050 371838 372378 374103 376878 380394 384473 389059 394366
53823 394366 401132 410203 421670 434863 449409 465856 485027 507208 532190 559583 588793 619149
53811 619149 650242 681396 710196 732080 742229 738099 720403 692503 659278 625645 594888 567980
53799 567980 544595 524414 507348 493224 481908 473399 467354 462919 459453 457022 455748 455189 454822
$$ packed form
53898D94152p90k064j932j091o75j134k100k949l282l171l031l279m009m924n570
53883D54151n821o085o769p458p166n730m292l833l853l336k447k179k650k943
53869C89589k665k426k626k833k640k267j954j558j103r43j127j255j225j350
53855C63617j578j389p73m10n64o19j88J75k6k53K77J308J858J523Q68N78P69
53838C65173J147J422J510J412J074M62j50k12N40J725K775L516M079M586N307
53823C94366O766R071J1467J3193J4546J6447J9171K2181K4982K7393K9210L0356
53811F19149L1093L1154K8800K1884J0149m130j7696k7900l3225l3633l0757k6908
53799E67980k3385k0181j7066j4124j1316q509o045m435l466k431j274n59l67
$$ plain form
53786 454822 454601 454509 454081 453017 451740 450737 449817 448655 447520 446710 445777 444133 441967 439762 437305 434075
53770 434075 430236 426257 421872 416442 410266 404530 399962 396349 393337 390822 388548 386147 383670 381386
53756 381386 379081 376224 372828 369413 366213 363169 360637 359169 358549 357921 357056 356649 357095 357784 357932 357421
53740 357421 356500 355347 354302 353934 354424 355259 355938 356566 357411 358220 358453 358047 357628 357945 359223 361046 362855
53723 362855 364517 366331 368513 370983 373753 377046 380741 384119 386640 388646 390869 393524 396297 398860
53709 398860 400868 401888 401977 401990 402645 403629 404388 405465 408065 412457 417714 423047 428417 433727 438348 441809
53693 441809 444305 446281 448074 450078 452631 455480 457906 459552 460661 461466 461941 462266 462894 463919 464892
53678 464892 465523 466159 467377 469391 471910 474242 475631 475907 475692 475529 475080 473836 472342 471740 472137 472396
$$ packed form
53786D54822k21r2m28j064j277j003r20j162j135q10r33j644k166k205k457l230
53770D34075l839l979m385n430o176n736m568l613l012k515k274k401k477k284
53756C81386k305k857l396l415l200l044k532j468o20o28q65m07M46O89J48n11
53740C57421r21j153j045l68M90Q35O79O28Q45Q09K33m06m19L17J278J823J809
53723C62855J662J814K182K470K770L293L695L378K521K006K223K655K773K563
53709C98860K008J020Q9J3O55R84P59J077K600M392N257N333N370N310M621L461
53693D41809K496J976J793K004K553K849K426J646J109Q05M75L25O28J025R73
53678D64892O31O36J218K014K519K332J389K76k15j63m49j244j494o02L97K59
$$ plain form
53662 472396 471726 470538 469427 468238 466678 465118 464103 463536 462883 461920 460859 459990 459441 459075 458496 457442
53646 457442 456277 455704 455876 456211 456139 455587 454692 453628 452858 452929 453711 454363 454313 453871 453617 453728 454236 455430 457533
53627 457533 460261 463100 465875 468715 471672 474657 477627 480608 483570 486359 488779 490823 492934 495852
53613 495852 499938 504743 509498 513882 518103 522440 527081 532110 537214 541657 545031 547857 550940 554439
53599 554439 558138 562193 566734 570984 573858 575512 577325 580148 583463 586549 589617 593288 597543 601635
53585 601635 604670 606057 605841 604794 603795 603032 602169 601208 600498 599893 598671 596483 593719 590793 587683 584368
53569 584368 581069 577856 574599 571433 568639 566021 563128 560289 558552 558287 558527 558084 556658 554624 552447
53554 552447 550701 549990 550366 551272 552356 553851 555913 558168 560125 561530 562213 562264 562454 563646 565601 567193
$$ packed form
53662D72396o70j188j111j189j560j560j015n67o53r63j061q69n49l66n79j054
53646D57442j165n73J72L35p2n52q95j064p70P1P82O52n0m42k54J11N08J194K103
53627D57533K728K839K775K840K957K985K970K981K962K789K420K044K111K918
53613D95852M086M805M755M384M221M337M641N029N104M443L374K826L083L499
53599E54439L699M055M541M250K874J654J813K823L315L086L068L671M255M092
53585F01635L035J387k16j047r99p63q63r61p10o05j222k188k764k926l110l315
53569E84368l299l213l257l166k794k618k893k839j737k65K40m43j426k034k177
53554E52447j746p11L76R06J084J495K062K255J957J405O83N1J90J192J955J592
$$ plain form
53538 567193 568065 569129 571130 573706 576386 579459 583240 587398 591793 597152 604036 611832 619620 627453
53524 627453 635963 645292 655244 666044 678054 691133 705122 720673 738745 759387 781650 804515
53512 804515 827446 850394 873896 898906 925854 953998 982164 1009868 1037304 1064598 1091638
53501 1091638 1118336 1144512 1169779 1194035 1217751 1241369 1264833 1288187 1312184 1337646 1364612
53490 1364612 1392729 1422065 1452791 1484339 1515745 1546748 1577898 1609580 1641431 1672629 1702272
53479 1702272 1729677 1754880 1778719 1801927 1824276 1845120 1864603 1883755 1903511 1924129 1945428
53468 1945428 1966861 1987365 2005744 2021533 2035135 2046963 2056696 2063496 2066807 2066853 2064345 2059605 2052090
53455 2052090 2041068 2026784 2010485 1993113 1974381 1953411 1929896 1904372 1877738 1850831 1824045
$$ packed form
53538E67193Q72J064K001K576K680L073L781M158M395N359O884P796P788P833
53524F27453Q510R329R952J0800J2010J3079J3989J5551J8072K0642K2263K2865
53512H04515K2931K2948K3502K5010K6948K8144K8166K7704K7436K7294K7040
53501A091638K6698K6176K5267K4256K3716K3618K3464K3354K3997K5462K6966
53490A364612K8117K9336L0726L1548L1406L1003L1150L1682L1851L1198K9643
53479A702272K7405K5203K3839K3208K2349K0844J9483J9152J9756K0618K1299
53468A945428K1433K0504J8379J5789J3602J1828R733O800L311M6k508m740p515
53455B052090j1022j4284j6299j7372j8732k0970k3515k5524k6634k6907k6786
$$ plain form
53444 1824045 1797025 1769096 1740261 1711408 1683242 1655510 1627637 1599614 1571771 1544185 1516889
53433 1516889 1490334 1465172 1441856 1420790 1402484 1387017 1373760 1362118 1352262 1344709 1339554 1336558
53421 1336558 1335670 1337042 1340900 1347635 1357472 1369656 1382707 1396093 1410983 1428608 1448516 1469324
53409 1469324 1490599 1513029 1537099 1562634 1589466 1617596 1646843 1677186 1709353 1744280 1782058
53398 1782058 1822191 1864764 1910520 1959794 2012166 2067230 2124964 2185355 2248329 2314130 2383108
53387 2383108 2455016 2529011 2604311 2680346 2756499 2832365 2908156 2984120 3059624 3133523 3205292
53376 3205292 3275040 3342470 3406695 3467209 3524232 3578041 3628795 3677118 3723867 3768825 3810434
53365 3810434 3847345 3879670 3908132 3932423 3950981 3962136 3964945 3958938 3943383 3917002 3878621 3828401
$$ packed form
53444A824045k7020k7929k8835k8853k8166k7732k7873k8023k7843k7586k7296
53433A516889k6555k5162k3316k1066j8306j5467j3257j1642r856p553n155k996
53421A336558q88J372L858O735R837J2184J3051J3386J4890J7625J9908K0808
53409A469324K1275K2430K4070K5535K6832K8130K9247L0343L2167L4927L7778
53398A782058M0133M2573M5756M9274N2372N5064N7734O0391O2974O5801O8978
53387B383108P1908P3995P5300P6035P6153P5866P5791P5964P5504P3899P1769
53376C205292O9748O7430O4225O0514N7023N3809N0754M8323M6749M4958M1609
53365C810434L6911L2325K8462K4291J8558J1155K809o007j5555k6381l8381n0220
$$ plain form
53353 3828401 3768451 3701925 3631321 3557777 3481789 3404113 3325787 3247604 3169844 3092495 3015685
53342 3015685 2939901 2865649 2792840 2720753 2648799 2577089 2506078 2435954 2366751 2298763 2232459
53331 2232459 2168234 2106568 2048183 1993581 1942631 1894987 1850698 1810075 1773277 1740387 1711464
53320 1711464 1685943 1662396 1639537 1617273 1596217 1576523 1557918 1540521 1524773 1510667 1497865
53309 1497865 1486518 1477139 1469654 1463355 1457927 1453817 1451456 1450745 1451458 1453565 1456986 1461524 1467219 1474384
53295 1474384 1483307 1494321 1508083 1525182 1545461 1568199 1592940 1619636 1648079 1677847 1708808
53284 1708808 1741061 1774318 1807977 1841850 1876203 1910925 1945186 1978092 2009322 2039034 2067593
53273 2067593 2095349 2122335 2148210 2172828 2196530 2219195 2239325 2254951 2265503 2272106 2276012 2277468
$$ packed form
53353C828401n9950o6526p0604p3544p5988p7676p8326p8183p7760p7349p6810
53342C015685p5784p4252p2809p2087p1954p1710p1011p0124o9203o7988o6304
53331B232459o4225o1666n8385n4602n0950m7644m4289m0623l6798l2890k8923
53320A711464k5521k3547k2859k2264k1056j9694j8605j7397j5748j4106j2802
53309A497865j1347r379p485o299n428m110k361p11P13K107L421M538N695P165
53295A474384Q923J1014J3762J7099K0279K2738K4741K6696K8443K9768L0961
53284A708808L2253L3257L3659L3873L4353L4722L4261L2906L1230K9712K8559
53273B067593K7756K6986K5875K4618K3702K2665K0130J5626J0552O603L906J456
$$ plain form
53261 2277468 2276087 2271377 2262599 2248821 2229592 2205297 2176737 2144729 2110030 2073091 2033905 1992550
53249 1992550 1949729 1906136 1861554 1815465 1768473 1722168 1677514 1634353 1592600 1552826 1515196
53238 1515196 1478752 1442334 1405483 1368035 1329589 1290091 1250400 1211677 1174424 1138512 1103736
53227 1103736 1070005 1037377 1006259 977397 951408 928498 908555 891089 875163 859977 845585
53216 845585 832421 820110 807485 793940 780032 766529 753563 740957 728611 716219 703285
53205 703285 689880 676850 664895 653942 643637 633894 624673 615797 607232 599001 590650 581567 572051
53192 572051 563276 555797 548870 541661 534317 527317 520560 513820 507485 502062 497457 493297 489541 486123
53178 486123 482530 478471 474624 472008 470809 470342 469977 469541 469026 468432 467789 467078 466242 465410 464756 463991 462531
$$ packed form
53261B277468j381m710q778j3778j9229k4295k8560l2008l4699l6939l9186m1355
53249A992550m2821m3593m4582m6089m6992m6305m4654m3161m1753l9774l7630
53238A515196l6444l6418l6851l7448l8446l9498l9691l8723l7253l5912l4776
53227A103736l3731l2628l1118k8862k5989k2910j9943j7466j5926j5186j4392
53216H45585j3164j2311j2625j3545j3908j3503j2966j2606j2346j2392j2934
53205G03285j3405j3030j1955j0953j0305r743r221q876q565q231q351r083r516
53192E72051q775p479o927p209p344p000o757o740o335n423m605m160l756l418
53178D86123l593m059l847k616j199m67l65m36n15n94o43p11q36q32o54p65j460
$$ plain form
53161 462531 460466 458817 458410 458996 459822 460550 461144 461406 461222 460880 460585 460096 459299 458713 458823 459279 459380 459000
53143 459000 458480 457954 457369 456920 456805 456748 456264 455249 453832 451943 449567 447172 445283 443823 442429 441228
53127 441228 440649 440631 440634 440517 440800 441904 443533 444978 445824 446310 447155 448970 451653 454432 456575 457951 458801
53110 458801 459344 459828 460573 461553 462096 461399 459253 456027 452149 447864 443383 438977 434937 431531 428848 426638
53094 426638 424509 422332 420187 417955 415410 412764 410649 409373 408634 408094 407764 407620 407381 406984 406830 407274
53078 407274 408228 409426 410620 411411 411466 411099 411030 411384 411591 411462 411558 412206 413031 413882 415246 417097 418289 417939
53060 417939 416744 416063 416293 416927 417563 417961 417685 416691 415851 415997 416817 417605 418606 420607 423477 426188 428131
53043 428131 429484 430492 431310 432404 434098 435760 436373 435916 435295 434954 434488 433714 433202 433467 434319 435183 435532
$$ packed form
53161D62531k065j649m07N86Q26P28N94K62j84l42k95m89p97n86J10M56J01l80
53143D59000n20n26n85m49j15n7m84j015j417j889k376k395j889j460j394j201
53127D41228n79j8Lj17K83J104J629J445Q46M86Q45J815K683K779K143J376Q50
53110D58801N43M84P45R80N43o97k146l226l878m285m481m406m040l406k683k210
53094D26638k129k177k145k232k545k646k115j276p39n40l30j44k39l97j54M44
53078D07274R54J198J194P91N5l67o9L54K07j29R6O48Q25Q51J364J851J192l50
53060D17939j195o81K30O34O36L98k76r94q40J46Q20P88J001K001K870K711J943
53043D28131J353J008Q18J094J694J662O13m57o21l41m66p74n12K65Q52Q64L49
$$ plain form
53026 435532 435008 433754 432650 432513 433015 432998 431828 429783 427252 424452 421977 420666 420534 420562 419907 418788
53010 418788 417897 417516 417501 417728 418197 418990 420248 421903 423497 424637 425590 426896 428416 429325 429223 428718 428790
52993 428790 429843 431440 432649 432817 432381 432726 434711 437562 439880 441449 443210 445604 447972 449737 451187
52978 451187 452702 454008 454666 454729 454469 453891 452863 451411 449811 448726 449152 451546 454970 457910 460084 462602
52962 462602 466050 469395 471352 472031 472481 473165 473661 473531 472764 471583 470380 469719 469828 470160 469843 468509 466407
52945 466407 463929 461394 459151 457413 456016 454611 453097 451685 450578 449824 449413 449294 449272 449051 448368 447098
52929 447098 445281 443147 441064 439398 438392 438041 437986 437681 436867 435821 434996 434565 434552 435077 436028 436632 436008
52912 436008 434285 432712 432453 433595 435373 436937 437703 437384 436109 434396 432845 431868 431690 432319 433505 434937
$$ packed form
53026D35532n24j254j104j37N02j7j170k045k531k800k475j311j32K8o55j119
53010D18788q91l81j5K27M69P93J258J655J594J140R53J306J520R09j02n05P2
52993D28790J053J597J209J68m36L45J985K851K318J569J761K394K368J765J450
52978D51187J515J306O58O3k60n78j028j452j600j085M26K394L424K940K174K518
52962D62602L448L345J957O79M50O84M96j30p67j181j203o61J09L32l17j334k102
52945D66407k478k535k243j738j397j405j514j412j107p54m11j19k2k21o83j270
52929D47098j817k134k083j666j006l51n5l05q14j046q25m31j3N25R51O04o24
52912D36008j723j573k59J142J778J564P66l19j275j713j551r77j78O29J186J432
$$ plain form
52896 434937 436574 438579 440930 443286 445214 446338 446410 445549 444363 443471 442952 442523 442093 441744 441324 440612 439868
52879 439868 439694 440253 441111 441808 442063 441441 439628 437243 435663 435548 436009 435657 434104 432077 430432 429528 429292
52862 429292 429382 429362 429039 428679 428710 429274 430119 430825 431090 430948 430722 430588 430259 429343 427901 426332 424800 423300
52844 423300 422274 422518 424222 426600 428752 430450 431790 432528 432258 431040 429393 427674 425772 423381 420466
52829 420466 417426 414880 413223 412402 412140 412220 412367 412148 411418 410749 410915 411937 413111 414055 415235 417331 420535
52812 420535 424671 429588 435279 441888 449654 458385 466752 472535 473886 470365 462952 453487 444035 436097
52798 436097 430027 425380 421821 419325 417650 416274 414967 413874 412944 411914 410896 410228 409584 408038 405365
52783 405365 402501 400351 398891 397838 397320 397301 397150 396562 396183 396554 397130 397273 397499 398602 400033 400525 400157
$$ packed form
52896D34937J637K005K351K356J928J124P2q61j186q92n19m29m30l49m20p12p44
52879D39868j74N59Q58O97K55o22j813k385j580j15M61l52j553k027j645r04k36
52862D29292R0k0l23l60L1N64Q45P06K65j42k26j34l29r16j442j569j532j500
52844D23300j026K44J704K378K152J698J340P38k70j218j647j719j902k391k915
52829D20466l040k546j657q21k62Q0J47k19p30o69J66J022J174R44J180K096L204
52812D20535M136M917N691O609P766Q731Q367N783J351l521p413r465r452p938
52798D36097o070m647l559k496j675j376j307j093r30j030j018o68o44j546k673
52783D05365k864k150j460j053n18j9j51n88l79L71N76J43K26J103J431M92l68
$$ plain form
52766 400157 400415 402038 404038 405249 405804 406448 407256 407772 407945 408200 408861 410068 412020 414711 417487 419385
52750 419385 420063 420124 420384 421025 421615 421809 421797 421960 422260 422188 421310 419706 417831 416142 414914 414164 413635 413027
52732 413027 412383 412053 412207 412656 413319 414517 416463 418733 420674 422118 423284 424084 424080 423213 422089 421338 420960
52715 420960 420512 419720 418721 417842 417283 416993 416784 416606 416665 417192 418110 419103 420013 420984 422196 423579 424876 425863
52697 425863 426472 426818 427197 427944 429115 430345 431148 431398 431402 431489 431656 431694 431573 431460 431432 431337 430999 430407 429671 429007
52677 429007 428805 429485 431126 433353 435715 438000 440113 441931 443473 444862 445875 445849 444521 442784 442123
52662 442123 443241 445513 447726 449062 449458 449361 449196 448934 448322 447633 447731 448949 450364 450881 450714 450941 451693
52645 451693 451756 450196 447512 444848 442749 441192 440203 439824 439781 439680 439406 439078 438836 438880 439421 440355 441348 442475
$$ packed form
52766D00157K58J623K000J211N55O44Q08N16J73K55O61J207J952K691K776J898
52750D19385O78O1K60O41N90J94j2J63L00p2q78j604j875j689j228p50n29o08
52732D13027o44l30J54M49O63J198J946K270J941J444J166Q00mq67j124p51l78
52715D20960m48p92r99q79n59k90k09j78N9N27R18R93R10R71J212J383J297R87
52697D25863O09L46L79P47J171J230Q03K50MQ7J67L8j21j13k8r5l38n92p36o64
52677D29007k02O80J641K227K362K285K113J818J542J389J013k6j328j737o61
52662D42123J118K272K213J336L96r7j65k62o12o89R8J218J415N17j67K27P52
52645D51693O3j560k684k664k099j557r89l79m3j01k74l28k42M4N41R34R93J127
$$ plain form
52627 442475 444407 447641 451726 455523 458113 459322 459582 459393 458745 457059 453946 449943 446084 442795 439774
52612 439774 436948 434874 433965 433940 434335 435003 435836 436536 437011 437516 438076 438283 437988 437655 437662 437806 437889 438228 439068
52593 439068 440001 440555 440923 441534 442308 442910 443404 444096 445043 446233 447912 450162 452459 454272 455798 457498
52577 457498 459207 460354 460909 461469 462480 463908 465538 467071 468096 468451 468479 468422 467842 466299 464355 463097
52561 463097 462707 462245 460950 459062 457247 455821 454815 454243 454040 454058 454301 454807 455229 454987 453993 452864 452180
52544 452180 451894 451663 451402 451193 450948 450562 450366 450993 452596 454393 455275 454943 454247 454255 455194 456551 457912 459195
52526 459195 460136 460225 459430 458473 458150 458736 460256 462807 466239 469980 473607 477233 480957 484299 486653 487975
52510 487975 488600 488726 488455 487922 486943 484906 481600 477745 474160 470775 467099 463257 459798 456762 453767
$$ packed form
52627D42475J932L234M085L797K590J209K60j89o48j686l113m003l859l289l021
52612D39774k826k074r09k5L95O68Q33P00M75N05N60K07k95l33PJ44Q3L39Q40
52593D39068R33N54L68O11P74O02M94O92R47J190J679K250K297J813J526J700
52577D57498J709J147N55N60J011J428J630J533J025L55K8n7n80j543j944j258
52561D63097l90m62j295j888j815j426j006n72k03J8K43N06M22k42r94j129o84
52544D52180k86k31k61k09k45l86j96O27J603J797Q82l32o96QR39J357J361J283
52526D59195R41Q9p95r57l23N86J520K551L432L741L627L626L724L342K354J322
52510D87975O25J26k71n33r79k037l306l855l585l385l676l842l459l036k995
$$ plain form
52495 453767 450967 449118 448619 449067 449759 450192 450163 449906 449983 450550 450977 450800 450741 451949 454364 456740 458269 459260
52477 459260 460105 460567 460542 460735 462017 464541 467882 471667 475656 479538 482992 485838 488026 489632 490897
52462 490897 491985 492720 492761 491922 490071 486973 482781 478458 475025 472355 469420 465799 462306 459954 458885
52447 458885 458561 458456 458270 457903 457522 457373 457378 457211 456834 456496 456252 455952 455753 455983 456382 456154 455024 453641 452565
52428 452565 451466 449808 447871 446507 446138 446504 447191 447992 448782 449436 449897 450218 450533 451055 451953 453154 454428
52411 454428 455709 457201 459197 461956 465680 470322 475490 480878 486735 493549 501389 510019 519596 530528
52397 530528 542417 553688 562588 568210 570310 568709 563405 555126 545327 535609 527124 520273 514751 509988
52383 509988 505735 502240 499920 498984 499306 500457 501956 503675 505916 508848 512127 515311 518286 520813 522046
$$ packed form
52495D53767k800j849m99M48O92M33k9k57P7N67M27j77n9J208K415K376J529R91
52477D59260Q45M62k5J93J282K524L341L785L989L882L454K846K188J606J265
52462D90897J088P35M1q39j851l098m192m323l433k670k935l621l493k352j069
52447D58885l24j05j86l67l81j49Nj67l77l38k44l00j99K30L99k28j130j383j076
52428D52565j099j658j937j364l69L66O87Q01P90O54M61L21L15N22Q98J201J274
52411D54428J281J492J996K759L724M642N168N388N857O814P840Q630R577J0932
52397E30528J1889J1271Q900N622K100j601n304q279r799r718q485o851n522m763
52383E09988m253l495k320r36L22J151J499J719K241K932L279L184K975K527J233
$$ plain form
52368 522046 521323 519256 517199 515650 514045 512208 510963 510887 511300 511115 510093 508751 507541 506674 506358 506646
52352 506646 507318 508298 509840 511942 514009 515589 517088 519256 522192 525309 528041 530190 531844 533442 535734
52337 535734 539206 543629 548456 553478 558723 564005 569102 574314 580332 587507 595558 603955 612207 619816
52323 619816 626339 631653 635968 639605 642994 646836 651809 657959 664695 671663 679365 688514 698922 709599
52309 709599 720159 731567 744906 759746 774564 788845 803820 820666 838751 856413 872950
52298 872950 888893 904643 919811 933976 947266 960015 972538 985324 998799 1012726 1026445
52287 1026445 1039805 1053245 1066791 1079752 1091619 1102629 1113142 1123153 1132709 1142106 1151276 1159657
52275 1159657 1167096 1174233 1181485 1188264 1193786 1198163 1202110 1206045 1210117 1214584 1219415 1223813 1226921 1228913
$$ packed form
52368E22046p23k067k057j549j605j837j245p6M13j85j022j342j210q67l16K88
52352E06646O72R80J542K102K067J580J499K168K936L117K732K149J654J598K292
52337E35734L472M423M827N022N245N282N097N212O018P175Q051Q397Q252P609
52323F19816O523N314M315L637L389L842M973O150O736O968P702R149J0408J0677
52309G09599J0560J1408J3339J4840J4818J4281J4975J6846J8085J7662J6537
52298H72950J5943J5750J5168J4165J3290J2749J2523J2786J3475J3927J3719
52287A026445J3360J3440J3546J2961J1867J1010J0513J0011R556R397R170Q381
52275A159657P439P137P252O779N522M377L947L935M072M467M831M398L108J992
$$ plain form
52261 1228913 1230830 1233388 1236434 1239405 1241828 1243530 1244827 1246448 1248788 1251374 1253476 1255100 1256850 1259002
52247 1259002 1261377 1264250 1268680 1275509 1284309 1293680 1302622 1311400 1321065 1332281 1344773 1357853 1371165
52234 1371165 1384675 1398237 1411596 1424730 1437675 1450050 1461314 1471621 1481811 1492289 1502384
52223 1502384 1511085 1518011 1523384 1527518 1530648 1532922 1534218 1534346 1533596 1532671 1531791 1530413 1528189 1525616 1523197
52208 1523197 1520544 1516997 1512832 1509132 1506675 1505531 1505652 1507179 1510069 1513870 1517954 1521822 1525288 1528579
52194 1528579 1532079 1535770 1539187 1542142 1545149 1548754 1552729 1556357 1559298 1561826 1564422 1567469 1571083 1574867
52180 1574867 1578038 1580133 1581407 1582333 1583051 1583605 1584223 1584871 1584945 1583943 1582153 1580137 1577852 1574855 1571186 1567407
52164 1567407 1563851 1560417 1556979 1553494 1549746 1545423 1540459 1534996 1529215 1523524 1518615 1514849 1511812 1509004
$$ packed form
52261A228913J917K558L046K971K423J702J297J621K340K586K102J624J750K152
52247A259002K375K873M430O829Q800R371Q942Q778R665J1216J2492J3080J3312
52234A371165J3510J3562J3359J3134J2945J2375J1264J0307J0190J0478J0095
52223A502384Q701O926N373M134L130K274J296J28p50r25q80j378k224k573k419
52208A523197k653l547m165l700k457j144J21J527K890L801M084L868L466L291
52194A528579L500L691L417K955L007L605L975L628K941K528K596L047L614L784
52180A574867L171K095J274R26P18N54O18O48P4j002j790k016k285k997l669l779
52164A567407l556l434l438l485l748m323m964n463n781n691m909l766l037k808
$$ plain form
52150 1509004 1506734 1505802 1506498 1508468 1511388 1515133 1519425 1523932 1528693 1533803 1538735 1542539 1544847 1546181
52136 1546181 1547254 1548435 1549891 1551715 1553829 1556151 1558923 1562499 1566862 1571762 1577239 1583480 1590091 1596049
$$ packed form
52150A509004k270r32O96J970K920L745M292M507M761N110M932L804K308J334
52136A546181J073J181J456J824K114K322K772L576M363M900N477O241O611N958
$$ [...]
##END NTUPLES=NMR SPECTRUM
##END=
