##TITLE=AC1683_2985_8571279_yJtKDicOSf
##JCAMPDX= 6.0         $$ Bruker NMR JCAMP-DX V2.0
##DATA TYPE= NMR SPECTRUM
##DATA CLASS= NTUPLES
##ORIGIN= BRUKER
##OWNER= Administrator
$$ 1.72 TOPSPIN		Version 2.1
$$ 2014-04-10 22:07:38.943 -0700  Administrator@X
$$ Compression mode = diff/dup
##.OBSERVE FREQUENCY= 400.02188249412
##.OBSERVE NUCLEUS= ^1H
##.ACQUISITION MODE= SIMULTANEOUS (DQD)
##.ACQUISITION SCHEME= undefined
##.AVERAGES= 8
##.DIGITISER RES= 22
##SPECTROMETER/DATA SYSTEM= spect
##.PULSE SEQUENCE= zg30
##.SOLVENT NAME= COFFEE_meoh
##.SHIFT REFERENCE= INTERNAL, COFFEE_meoh, 1, 14.98509
##AUDIT TRAIL= $$ (NUMBER, WHEN, WHO, WHERE, PROCESS, VERSION, WHAT)
$$ ##TITLE= Audit trail, TOPSPIN		Version 2.1
$$ ##JCAMPDX= 5.01
$$ ##ORIGIN= Bruker BioSpin GmbH
$$ ##OWNER= Administrator
$$ $$ E:\/data/COFFEE/nmr/AC1683_2985_8571279_yJtKDicOSf/20/pdata/1/auditp.txt
$$ ##AUDIT TRAIL=  $$ (NUMBER, WHEN, WHO, WHERE, PROCESS, VERSION, WHAT)
(   1,<2014-04-10 22:07:31.763 -0700>,<Administrator>,<X>,<go>,<TOPSPIN 2.1>,
      <created by zg
	started at 2014-04-10 22:06:25.922 -0700,
	POWCHK enabled, PULCHK disabled,
       configuration hash MD5:
       C8 4E 4E 5D D3 5C D8 9E 9F 52 82 E0 59 8A DE 15
       data hash MD5: 64K
       79 FE 6E 92 10 9F 89 F2 49 97 70 09 15 BB BA 73>)
(   2,<2014-04-10 22:07:34.915 -0700>,<Administrator>,<X>,<proc1d>,<TOPSPIN 2.1>,
      <Start of raw data processing
       efp LB = 0 FT_mod = 6 PKNL = 1 PHC0 = 0 PHC1 = 0 SI = 32K 
       data hash MD5: 32K
       09 47 EF 6A 71 DE EA 04 F5 24 7F 5A 1D 36 A4 5C>)
(   3,<2014-04-10 22:07:35.298 -0700>,<Administrator>,<X>,<proc1d>,<TOPSPIN 2.1>,
      <pk PHC0 = 96.16333 PHC1 = 0 
       data hash MD5: 32K
       3C C2 3B 4F 03 12 02 EB 45 9B 9C 25 C4 02 B5 D8>)
(   4,<2014-04-10 22:07:35.574 -0700>,<Administrator>,<X>,<proc1d>,<TOPSPIN 2.1>,
      <abs ABSG = 1 
       data hash MD5: 32K
       1A 15 24 9C 8A 44 3B C1 65 E7 EC 02 BF 63 DF BE>)
(   5,<2014-04-10 22:07:35.665 -0700>,<Administrator>,<X>,<proc1d>,<TOPSPIN 2.1>,
      <abs ABSG = 2 
       data hash MD5: 32K
       00 C4 51 0F 50 2C 93 EF 52 F2 FE E9 A9 84 CE 1D>)
(   6,<2014-04-10 22:07:35.773 -0700>,<Administrator>,<X>,<proc1d>,<TOPSPIN 2.1>,
      <abs ABSG = 3 
       data hash MD5: 32K
       4E E9 37 EA E0 D9 15 E1 31 BD BC 76 C2 5C 31 6B>)
(   7,<2014-04-10 22:07:35.849 -0700>,<Administrator>,<X>,<proc1d>,<TOPSPIN 2.1>,
      <abs ABSG = 4 
       data hash MD5: 32K
       49 10 EE CF CF CC 42 E8 43 65 E7 C2 1D 26 9A 2A>)
(   8,<2014-04-10 22:07:35.910 -0700>,<Administrator>,<X>,<proc1d>,<TOPSPIN 2.1>,
      <abs ABSG = 5 
       data hash MD5: 32K
       09 CB 47 DE E8 E1 2E 9F 29 D7 F8 9C DC D3 77 B7>)
$$ ##END=
$$ 
$$ $$ hash MD5
$$ $$ 5A 50 C1 07 B1 7D A6 44 9E 02 9B CD 9F C3 8F F6
##$RELAX= 
##$RELAX= 
##$RELAX= 
##$RELAX= 
##$RELAX= 
##$RELAX= 
##$RELAX= 
$$ Bruker specific parameters
$$ --------------------------
##$DU= <E:\>
##$EXPNO= 20
##$NAME= <AC1683_2985_8571279_yJtKDicOSf>
##$PROCNO= 1
$$ [...]
##$TP= (0..7)
150 150 150 150 150 150 150 150
##$TP07= 0
##$TPNAME0= <>
##$TPNAME1= <>
##$TPNAME2= <>
##$TPNAME3= <>
##$TPNAME4= <>
##$TPNAME5= <>
##$TPNAME6= <>
##$TPNAME7= <>
##$TPOAL= (0..7)
0.5 0.5 0.5 0.5 0.5 0.5 0.5 0.5
##$TPOFFS= (0..7)
0 0 0 0 0 0 0 0
##$TUNHIN= 0
##$TUNHOUT= 0
##$TUNXOUT= 0
##$USERA1= <user>
##$USERA2= <user>
##$USERA3= <user>
##$USERA4= <user>
##$USERA5= <user>
##$V9= 5
##$VALIST= <valist>
##$VCLIST= <CCCCCCCCCCCCCCC>
##$VD= 0
##$VDLIST= <DDDDDDDDDDDDDDD>
##$VPLIST= <PPPPPPPPPPPPPPP>
##$VTLIST= <TTTTTTTTTTTTTTT>
##$WBST= 1024
##$WBSW= 4
##$XGAIN= (0..3)
0 0 0 0
##$XL= 0
##$YL= 0
##$YMAX_a= 622080
##$YMIN_a= -525773
##$ZGOPTNS= <>
##$ZL1= 120
##$ZL2= 120
##$ZL3= 120
##$ZL4= 120
##$ABSF1= 14.98509
##$ABSF2= -5.573092
##$ABSG= 5
##$ABSL= 3
##$ALPHA= 0
##$AQORDER= 0
##$ASSFAC= 0
##$ASSFACI= 0
##$ASSFACX= 0
##$ASSWID= 0
##$AUNMP= <proc_prof1d_extract_pilot.lims>
##$AXLEFT= 0
##$AXNAME= <>
##$AXNUC= <1H>
##$AXRIGHT= 0
##$AXTYPE= 0
##$AXUNIT= <>
##$AZFE= 0.1
##$AZFW= 0.1
##$BCFW= 0
##$BC_mod= 0
##$BYTORDP= 0
##$COROFFS= 0
##$CY= 15
##$DATMOD= 1
##$DC= 0
##$DFILT= <>
##$DTYPP= 0
##$F1P= 0
##$F2P= 0
##$FCOR= 0.5
##$FTSIZE= 32768
##$FT_mod= 6
##$GAMMA= 0
##$GB= 0
##$INTBC= 1
##$INTSCL= 1
##$ISEN= 128
##$LB= 0
##$LEV0= 0
##$LPBIN= 0
##$MAXI= 10000
##$MC2= 0
##$MEAN= 0
##$ME_mod= 0
##$MI= 0
##$NCOEF= 0
##$NC_proc= -8
##$NLEV= 6
##$NOISF1= 0
##$NOISF2= 0
##$NSP= 0
##$NTH_PI= 0
##$NZP= 0
##$OFFSET= 14.98509
##$PC= 1
##$PHC0= 96.16333
##$PHC1= 0
##$PH_mod= 1
##$PKNL= yes
##$PPARMOD= 0
##$PPDIAG= 0
##$PPIPTYP= 0
##$PPMPNUM= 2147483647
##$PPRESOL= 1
##$PSCAL= 4
##$PSIGN= 0
##$PYNMP= <proc.py>
##$REVERSE= no
##$SF= 400.02
##$SI= 32768
##$SIGF1= 0
##$SIGF2= 0
##$SINO= 400
##$SIOLD= 32768
##$SPECTYP= <>
##$SREGLST= <1H.CDCl3>
##$SSB= 0
##$STSI= 32768
##$STSR= 0
##$SW_p= 8223.68421052631
##$SYMM= 0
##$S_DEV= 0
##$TDeff= 65536
##$TDoff= 0
##$TI= <>
##$TILT= no
##$TM1= 0
##$TM2= 0
##$TOPLEV= 0
##$USERP1= <user>
##$USERP2= <user>
##$USERP3= <user>
##$USERP4= <user>
##$USERP5= <user>
##$WDW= 1
##$XDIM= 32768
##$YMAX_p= 448508422
##$YMIN_p= -651289
##$CURPLOT= <Network HP LaserJet P1505>
##$CURPRIN= <$Network HP LaserJet P1505>
##$DFORMAT= <normdp>
##$LAYOUT= <+/1D_H.xwp>
##$LFORMAT= <normlp>
##$PFORMAT= <normpl>
##$SURQMSG= 1
$$ End of Bruker specific parameters
$$ ---------------------------------
##NTUPLES= NMR SPECTRUM
##VAR_NAME=  FREQUENCY,     SPECTRUM/REAL,   SPECTRUM/IMAG
##SYMBOL=    X,             R,               I
##VAR_TYPE=  INDEPENDENT,   DEPENDENT,       DEPENDENT
##VAR_FORM=  AFFN,          ASDF,            ASDF
##VAR_DIM=   32768,         32768,           32768
##UNITS=     HZ,            ARBITRARY UNITS, ARBITRARY UNITS
##FACTOR=    0.250966925370066, 1,           1
##FIRST=     8223.43324360094, -140431,      -251337
##LAST=      0,             -60201,          59544
##MIN=       0,             -651289,         0
##MAX=       8223.43324360094, 448508422,    0
$$ Real data points
##PAGE= N=1
##DATA TABLE= (X++(R..R)), XYDATA
$$ [...]
19537D924d9926b1345E7552a24390n713D6486k1770k819M9817C2646d1558m4569
$$ 4924 -49926 -21345 57552 -124390 -130103 46486 24716 21897 71714 32646 -41558 -86127
19525h6127k00076H6355b88327p5454A96305c29021d7494j01236d2151r4355d3723
$$ -86127 -286203 86355 -288327 -363781 196305 -329021 -47494 -148730 -42151 -136506 -43723
19513c54377A6087b03295A26768D6560i2646B4910c31346A86906f8669l9723j38969
$$ -354377 16087 -203295 126768 46560 -92646 24910 -331346 186906 -68669 -108392 -247361
19502b47361f331l07054c0014B100K51377A24860c2669j02491A40857J42552A5070
$$ -247361 -6331 -313385 -30014 2100 253477 124860 -32669 -135160 140857 283409 15070
19490B26298C6436a44176m2253c8810p9307j32871J23109E8617N7457a57448b2562
$$ 226298 36436 -144176 -186429 -38810 -118117 -250988 -127879 58617 116074 -157448 -22562
19478a54497m0335n0988A8712f9497K717j20012i2611l17129A10834A865R4623
$$ -154497 -194832 -245820 18712 -69497 -66780 -186792 -92611 -409740 110834 1865 96488
19467I6488n263b5209F2598c0166k16414j2624D8606J37921c14627c3226j79739
$$ 96488 91225 -25209 62598 -30166 -246580 -259204 48606 186527 -314627 -33226 -212965
19456b12965j9571a13310j52100A89021J60539A26998g5717n4759a775j04594
$$ -212965 -232536 -113310 -265410 189021 349560 126998 -75717 -130476 -1775 -106369
19446a06369D5174a00873j6038M3825k3153j64764J24440L0878k10871f4736B4326
$$ -106369 45174 -100873 -116911 -73086 -96239 -261003 -136563 -105685 -316556 -64736 24326
19434A42595c4472j94698N6503A03041a56657L9564C04321a16348C74592b84534
$$ 142595 -34472 -229170 -172667 103041 -156657 -117093 304321 -116348 374592 -284534
19423A16732M2429K3005C1113a27303C7157c90769a732j08936P112B8323f6925
$$ 116732 159161 182166 31113 -127303 37157 -390769 -1732 -110668 -103556 28323 -66925
19411b43931A0443J5498g1510B2942a25723A6567d901n24141b7588j48783c6114
$$ -243931 10443 25941 -71510 22942 -125723 16567 -4901 -529042 -27588 -176371 -36114
19399E36214B45851F8993e4023C39472j65988n6375j0465c2707E0223c37002J28885
$$ 536214 245851 68993 -54023 339472 173484 117109 106644 -32707 50223 -337002 -208117
19388b08117A22481b56504P6323F5909a27885a1948j19435d7371l0644r4956k38650
$$ -208117 122481 -256504 -180181 65909 -127885 -11948 -131383 -47371 -78015 -172971 -411621
19377d11621a10899b5308j04015k67120c8960q0482E1160c46021B31087B9261
$$ -411621 -110899 -25308 -129323 -396443 -38960 -119442 51160 -346021 231087 29261
19366b0920j12354m8163A03735d2053j6133A90032b14260A923K01622n7454j5688
$$ -20920 -133274 -181437 103735 -42053 -58186 190032 -214260 1923 203545 146091 130403
19355A30403a67203A56780a56428j06556k7396B24707c71606E6107L5264b42185
$$ 130403 -167203 156780 -156428 -262984 -290380 224707 -371606 56107 91371 -242185
19344g374H8722P1061N2580a34515K2183B12756c43918f0895R589F4248O810h8654
$$ -7374 88722 159783 212363 -134515 -112332 212756 -343918 -60895 -51306 64248 71058 -88654
19331f6665j30829r6604a42531c7970A07602B7581a49070j08108h9914k36016
$$ -66665 -197494 -294098 -142531 -37970 107602 27581 -149070 -257178 -89914 -325930
19321c25930F7803q310a1089k91703h4918j3321K7578B27326a15434B6161b76907
$$ -325930 67803 59493 -11089 -302792 -84918 -98239 -70661 227326 -115434 26161 -276907
19309g9644D2646a13149d106I2319P9843a86268j08892a28095m0342h1669A38266
$$ -79644 42646 -113149 -4106 92319 172162 -186268 -295160 -128095 -168437 -81669 138266
19297F5613K13069K2621f413j40033m02654A35442a29075D7832N6796O522g2501
$$ 65613 278682 301303 -6413 -146446 -549100 135442 -129075 47832 104628 111150 -72501
19285b23136A93030e144k59337a01722k80B74712r9133g1200q3410B56107i1609
$$ -223136 193030 -5144 -264481 -101722 -102002 274712 175579 -71200 -154610 256107 -91609
19273A07366h0911I0174A1700a91963A81176a32578a550o4331p8996C35868i6252
$$ 107366 -80911 90174 11700 -191963 181176 -132578 -1550 -65881 -144877 335868 -96252
19261A18176e4712j6791j27923j42553j8180B55084b40181E6435J1463J41480
$$ 118176 -54712 -71503 -199426 -341979 -360159 255084 -240181 56435 67898 209378
19251B09378a86282j71632A96504p4920g6390a8225A97237d3597m900A9264M8493
$$ 209378 -186282 -357914 196504 121584 -76390 -18225 197237 -43597 -48497 19264 67757
19240F7757d8306A31622h9183o2134b3038r5011M3963n7634c9741A09665a78596
$$ 67757 -48306 131622 -89183 -151317 -23038 -118049 -74086 -131720 -39741 109665 -178596
19228i9289L2912q664b6463j59486d7327j79285a6323k09143F9196a09056c5761
$$ -99289 -66377 -75041 -26463 -185949 -47327 -226612 -16323 -225466 69196 -109056 -35761
19216a58774M5938r973A61894d5835E2021C589K2072a9445k16331R2566N7935
$$ -158774 -112836 -122809 161894 -45835 52021 3589 25661 -19445 -235776 -143210 -85275
19205h5275F4633J4490A6156O0307d83600J5398c4266j32361a1576j37614A94569
$$ -85275 64633 79123 16156 76463 -483600 -468202 -34266 -166627 -11576 -149190 194569
19193g2838A9731g6055C6317a13832E7140a69287C50914F191a22276a949l50576
$$ -72838 19731 -76055 36317 -113832 57140 -169287 350914 6191 -122276 -1949 -352525
19182c52525F0998a00491D4875K08989b17051Q6511L7028j0711B28820a33466
$$ -352525 60998 -100491 44875 253864 -217051 -130540 -93512 -104223 228820 -133466
19171b16523j44175D9558b52105e9348A75471A4562a51016e2443n0942c293l07305
$$ -216523 -360698 49558 -252105 -59348 175471 14562 -151016 -52443 -103385 -3293 -310598
19160c10598J54301A05796a13598K6831E627d475l34270G808a74217A48242i2325
$$ -310598 -156297 105796 -113598 -86767 5627 -4475 -338745 7808 -174217 148242 -92325
19148e6873k32822G0103K82493a35980b9166k34811a6566k3228n2821j2187d1575
$$ -56873 -289695 70103 352596 -135980 -29166 -263977 -16566 -39794 -92615 -104802 -41575
19136b41726I6731d4638l09343J18776b8571l62099a73693d6437A42867n3052
$$ -241726 96731 -44638 -353981 -235205 -28571 -390670 -173693 -46437 142867 89815
19126H9815N8953l0252a12877K985b743l54720J78211P5026G9791d15925h739
$$ 89815 148768 118516 -112877 -109892 -2743 -357463 -179252 -104226 79791 -415925 -8739
19114a61465A18582j3244K44596b98094J14149d6315j13272m514E506b87186p4748
$$ -161465 118582 105338 349934 -298094 -183945 -46315 -159587 -164101 5506 -287186 -361934
19103c61934A30311A9795J62622d7516l17920B23976I9060a08683L1917j85600
$$ -361934 130311 19795 182417 -47516 -365436 223976 99060 -108683 -76766 -262366
19093b62366L4794H7507b02939Q7729k66716C4103d3126a7340B3260c19530A63026
$$ -262366 -227572 87507 -202939 -115210 -381926 34103 -43126 -17340 23260 -319530 163026
19081a86600A48845b4790o6534o1474A52267a7884j86332A24513a95373I6086
$$ -186600 148845 -24790 -91324 -152798 152267 -17884 -204216 124513 -195373 96086
19070C28162D0961a27527j25048e4648C8674a37974B29440i3235j40057c1248
$$ 328162 40961 -127527 -252575 -54648 38674 -137974 229440 -93235 -233292 -31248
19059c02539g1164A2087b22252h1329j67684o9033a2684l2523A82037J01067n9406
$$ -302539 -71164 12087 -222252 -81329 -249013 -318046 -12684 -45207 182037 283104 223698
19048B23698D2109a20741N8997p1639N7441K93r2655H09M16740a14282j8092O6111
$$ 223698 42109 -120741 -61744 -133383 -75942 -75649 -168304 809 417549 -114282 -132374 -66263
19036f6263I9489J28139N2749c7591F5895b65030i4442n4035B62171n7758J2828
$$ -66263 99489 227628 280377 -37591 65895 -265030 -94442 -148477 262171 204413 217241
19025B17241H764J74631J90034j06182p1481a56170l1166C2778a20088B2792A349
$$ 217241 8764 183395 373429 267247 195766 -156170 -187336 32778 -120088 22792 1349
19013E80153c32675k6647P4233F7382a22499d5229C6375K14565J48076A36412
$$ 580153 -332675 -359322 -285089 67382 -122499 -45229 36375 250940 399016 136412
19002D364h2308q3852L908a0333j44222q9797B21614j5159D135K0651a21825N9538
$$ 4364 -82308 -166160 -162252 -10333 -154555 -244352 221614 206455 4135 24786 -121825 -62287
18990f2287j57412b1629j34814n0346c5086k37133e1026C15510A20606a87192
$$ -62287 -219699 -21629 -156443 -206789 -35086 -272219 -51026 315510 120606 -187192
18979b08339N4751M1506F7153q808b32194B852f1308C4641J16266b18459q1466
$$ -208339 -153588 -112082 67153 58345 -232194 2852 -61308 34641 150907 -218459 -299925
18968b99925F1382f1015n4766m2185r153j28953C5283b28056A30275a20910j10945
$$ -299925 61382 -61015 -115781 -157966 -167119 -296072 35283 -228056 130275 -120910 -231855
18957b31855r7045a34998j3997B53903D6879K85018b0774j47292A57504a89040
$$ -231855 -328900 -134998 -148995 253903 46879 331897 -20774 -168066 157504 -189040
18946f138B07783J7251m2849g7904D8220O5771m2028f5862j21797c9557B5269
$$ -6138 207783 225034 182185 -77904 48220 113991 71963 -65862 -187659 -39557 25269
18934B9074M39254a94388H616a03030m3194b8872j5553C3429K52988A5205i5190
$$ 29074 468328 -194388 8616 -103030 -146224 -28872 -44425 33429 286417 15205 -95190
18922b44191J09255N8242B81511D8762b53611a07266o3399M6258H6313a34487
$$ -244191 -134936 -76694 281511 48762 -253611 -107266 -170665 -124407 86313 -134487
18911a15990c4288k86332J3478i9712q3612B6908c0979k440A57997d661F5319
$$ -115990 -34288 -320620 -307142 -99712 -183324 26908 -30979 -33419 157997 -4661 65319
18899a44864A23233g0554p2782l5435O549G5643M26751a73736K2128O1338I1695
$$ -144864 123233 -70554 -143336 -178771 -172222 75643 502394 -173736 -151608 -90270 91695
18887b76980J16719O2322j41897i6587L3713j38549B61230b32922C4365b89714
$$ -276980 -160261 -97939 -239836 -96587 -62874 -201423 261230 -232922 34365 -289714
18876B6388R4722K16791A51968a29937d3350G2539P468a84438j7687d4151j71703
$$ 26388 121110 337901 151968 -129937 -43350 72539 80007 -184438 -202125 -44151 -215854
18865b15854F5371c37296B22674c12384h0705k1943K600n6665O8844j47697J4461
$$ -215854 65371 -337296 222674 -312384 -80705 -102648 -100048 -156713 -87869 -235566 -221105
18854b21105e1864k10430a15790G1192d8871b180D0297a89752A18051c6827j02948
$$ -221105 -51864 -262294 -115790 71192 -48871 -2180 40297 -189752 118051 -36827 -139775
18843a39775D3131L42532g1243A041J37302O0903b39944f2699A2237N909a35917
$$ -139775 43131 385663 -71243 1041 138343 199246 -239944 -62699 12237 18146 -135917
18831a49824H7228L5536a09223A90106b60004j50641J85809i3482n9226D3687
$$ -149824 87228 122764 -109223 190106 -260004 -410645 -224836 -93482 -152708 43687
18820D44664b30479E2699J05471p6649A5315J85017i5734C35335j45241a20795
$$ 444664 -230479 52699 158170 81521 15315 200332 -95734 335335 190094 -120795
18809A1517J23135h0180A22731a12418I7045d1825j81803Q613I8297d88107f6114
$$ 11517 134652 -80180 122731 -112418 97045 -41825 -223628 -215015 98297 -488107 -66114
18797A0244M7905L7341J49443A6368a12777A46342b21226c7994I879j106a51066
$$ 10244 58149 95490 244933 16368 -112777 146342 -221226 -37994 9879 8773 -151066
18785a62460D79413A05095D0366b40373b8841p261j74573o6817d4814B5745e17734
$$ -162460 479413 105095 40366 -240373 -28841 -36102 -210675 -277492 -44814 25745 -517734
18773A35685b20750J6503j93020G7814L7971a93613q8869J29931B8662j897b40895
$$ 135685 -220750 -204247 -397267 77814 115785 -193613 -282482 -152551 28662 26765 -240895
18761A15656J18223b3142k1249A24028m6962P5354F0944j0274d8678A1609a82286
$$ 115656 233879 -23142 -44391 124028 77066 152420 60944 50670 -48678 11609 -182286
18749a09850l93528a2667F1892k9482P2647a66063F4828R8587a66815g2329j4323
$$ -109850 -503378 -12667 61892 32410 105057 -166063 64828 163415 -166815 -72329 -86652
18738h6652M0428n5618C1568A2145b55950a0305a14k75772D7094K04599a3129
$$ -86652 -46224 -101842 31568 12145 -255950 -10305 -114 -275886 47094 251693 -13129
18726C51995a51993j98648a52789G037K6398a68309J1729A3386a2859k64241B7197
$$ 351995 -151993 -350641 -152789 7037 33435 -168309 -156580 13386 -12859 -277100 27197
18714A75712d8366j13577j3753A88233g2367m5819B3455b72029a33252l3048D0480
$$ 175712 -48366 -161943 -175696 188233 -72367 -118186 23455 -272029 -133252 -166300 40480
18702b84816j78915C0467L6230C0743J78417l2262a48683L332D4824P332J56363
$$ -284816 -463731 30467 66697 30743 209160 176898 -148683 -145351 44824 52156 208519
18691B08519c23671b1653m24821B4766a5132r0860J9610J2980p1147A03426a26452
$$ 208519 -323671 -21653 -446474 24766 -15132 -105992 -86382 -73402 -144549 103426 -126452
18679a31189j70934J20432A34119J02921i2170B0254a1400C47575a63199j8666
$$ -131189 -302123 -181691 134119 237040 -92170 20254 -11400 347575 -163199 -181865
18669a81865A21001D4898h3342b9107o6030j17688R1492a3708A68459h934j76622
$$ -181865 121001 44898 -83342 -29107 -95137 -212825 -121333 -13708 168459 -8934 -185556
18658a85556k75157D9681b53120I4820b48395B84821j37391a28561A66223a94271
$$ -185556 -460713 49681 -253120 94820 -248395 284821 147430 -128561 166223 -194271
18647f9765B6464L1534L5086c00086A08475a45039j3277p8046h1747J4433k82827
$$ -69765 26464 57998 93084 -300086 108475 -145039 -158316 -236362 -81747 -67314 -350141
18636c50141a36306K5695h39A40327E4581J80593F5279b88340B42213d26536E0853
$$ -350141 -136306 -110611 -839 140327 54581 235174 65279 -288340 242213 -426536 50853
18624A51579o2353K9788C5631h1777J8483A1698i4821j11488j0468J9736C19488
$$ 151579 89226 119014 35631 -81777 -63294 11698 -94821 -206309 -216777 -197041 319488
18612B63826j10515a7096o7065k18914f6076J9969p7825k32741A02649b20453
$$ 263826 153311 -17096 -84161 -303075 -66076 -46107 -123932 -356673 102649 -220453
18601B04935b27990R1211D1269c50850q3795c28j36775B48629e5991o0813l2922
$$ 204935 -227990 -136779 41269 -350850 -434645 -328 -137103 248629 -55991 -116804 -149726
18590a49726L9900j90121B8407a35049k12850a19978b7018A50175a33924N5393
$$ -149726 -109826 -299947 28407 -135049 -347899 -119978 -27018 150175 -133924 -78531
18580g8531k48330a55546B8119g3325A7485J50948c1000m0920j8045A81535a17296
$$ -78531 -326861 -155546 28119 -73325 17485 168433 -31000 -71920 -89965 181535 -117296
18568i6920D6203a70812E8770A0727c4046A19983O1750p1510b00670J1880j83038
$$ -96920 46203 -170812 58770 10727 -34046 119983 181733 110223 -200670 -188790 -371828
18557c71828G6574Q3467G7474J19161a97959h6421m11021a28430A39450c7076
$$ -371828 76574 160041 77474 196635 -197959 -86421 -497442 -128430 139450 -37076
18546d21695P7252A06384d7914k20356P1753h8642A57821L2348b90539B6575K90020
$$ -421695 -344443 106384 -47914 -268270 -196517 -88642 157821 190169 -290539 26575 316595
18535C16595a73128C40976b47913a09411n870r6215J03462j02774k19908H3019
$$ 316595 -173128 340976 -247913 -109411 -115281 -211496 -108034 -210808 -430716 83019
18524a1349A90794i6578A3521J57839C5981b5317a0926l3960D9057i1522B5758
$$ -11349 190794 -96578 13521 171360 35981 -25317 -10926 -44886 49057 -91522 25758
18512H2920K17066I6270d36339B10869b49529B38345c14628a16035N6553j1428
$$ 82920 299986 96270 -436339 210869 -249529 238345 -314628 -116035 -59482 -70910
18502g0910j73168c6501r3289H6878c14489A65459c13379f5194q0368B4443d825
$$ -70910 -244078 -36501 -129790 86878 -314489 165459 -313379 -65194 -145562 24443 -4825
18490A52770J80907A34777h0353B4199a00054c6182r7996j12124O9032B8203A1703
$$ 152770 333677 134777 -80353 24199 -100054 -36182 -134178 -246302 -177270 28203 11703
18478B00594a07693I99b72228j2590C8992a19292B77386N1111C4023a86151j40608
$$ 200594 -107693 999 -272228 -284818 38992 -119292 277386 328497 34023 -186151 -326759
18467c26759B23118c07318B14119b83373A04148J04009a03638A36693d9656j737
$$ -326759 223118 -307318 214119 -283373 104148 208157 -103638 136693 -49656 -51393
18457e1393K4073A11799b05661a9358A15627b19325a06387d6114p5968q3569K5671
$$ -51393 -27320 111799 -205661 -19358 115627 -219325 -106387 -46114 -122082 -205651 -179980
18446a79980D4886i9463H4907a34034B43593b40826N9713q3869A3782O9433c48343
$$ -179980 44886 -99463 84907 -134034 243593 -240826 -181113 -264982 13782 83215 -348343
18434a99004n0139A02312D7727j611N1083J32664f626n917A43620c13453Q2226
$$ -199004 -249143 102312 47727 46116 97199 229863 -6626 -12543 143620 -313453 -231227
18423b31227B18798M4470j25684L62127a4186j75860P7185k44280a69269g8671
$$ -231227 218798 263268 137584 499711 -14186 -190046 -112861 -357141 -169269 -78671
18412c78732A87964f7270A7263M6251d7642n6534M2477A14787C0746L9104J71746
$$ -378732 187964 -67270 17263 63514 -47642 -104176 -61699 114787 30746 69850 241596
18401B41596A00999C6462h0986I3307J25148q6920i9243c81p1962A4030d2332
$$ 241596 100999 36462 -80986 93307 218455 131535 -99243 -381 -72343 14030 -42332
18389d6502r1904A97320d3469A74928a78820A45310J30122g3672A90370i3824
$$ -46502 -138406 197320 -43469 174928 -178820 145310 275432 -73672 190370 -93824
18378F900c2048p1814a5301j68010E310a30971r4742A0800c3252o6125J2470k09591
$$ 6900 -32048 -103862 -15301 -183311 5310 -130971 -225713 10800 -33252 -99377 -86907 -296498
18366b96498B11710N8740b11324f4889l13624J81660G3290B7743J35230b9111
$$ -296498 211710 270450 -211324 -64889 -378513 -196853 73290 27743 162973 -29111
18355I1067A132K50996C1506b22132b935k13698E0171b60922B97418J09721i1937
$$ 91067 1132 252128 31506 -222132 -2935 -216633 50171 -260922 297418 407139 -91937
18343B3880a11292C39481c8140A25955J12377b85568B71516b7792A65299E0309
$$ 23880 -111292 339481 -38140 125955 238332 -285568 271516 -27792 165299 50309
18332A8311g4307g278k90459O6224l5444L9688G04K6305J87283a02366A4181b02077
$$ 18311 -74307 -7278 -297737 -231513 -266957 -227269 704 27009 214292 -102366 14181 -202077
18319E7209d69703i6709A43668H253a47059o0609A8631J18527f5486K2912k43458
$$ 57209 -469703 -96709 143668 8253 -147059 -207668 18631 137158 -65486 -42574 -286032
18308b86032c086A91863d714B12683a12000C10250d6595k68401e7189j00427f0103
$$ -286032 -3086 191863 -4714 212683 -112000 310250 -46595 -314996 -57189 -157616 -60103
18296a87467P2966d8864A730L78842I0614b24747B54268a38403o9902A30260a38183
$$ -187467 -114501 -48864 1730 380572 90614 -224747 254268 -138403 -208305 130260 -138183
18284a22121n3462N2215K235e3937A02083a571k59020B38624l4039a11895A20845
$$ -122121 -175583 -123368 -121133 -53937 102083 -1571 -260591 238624 204585 -111895 120845
18272e6910m6959j51252j33363h3578r3799D54a7138p1910D2745c4383k187m1177
$$ -56910 -103869 -255121 -388484 -83578 -177377 454 -17138 -89048 42745 -34383 -36570 -77747
18260g7747o7967D1752c484D47710b47551e3220j85914j6298P8793C04102a14328
$$ -77747 -145714 41752 -3484 447710 -247551 -53220 -239134 -255432 -176639 304102 -114328
18248a47948K984J1923n1627E8733e0609k02264B72233c4609B2176K6386h8511
$$ -147948 -144964 -133041 -184668 58733 -50609 -252873 272233 -34609 22176 48562 -88511
18236I3079J13035a94455e3833B1293p063P1939b34113a05247F9059c2788H8544
$$ 93079 206114 -194455 -53833 21293 14230 86169 -234113 -105247 69059 -32788 88544
18224f280n3007k13801J05191H4769g2429E2952c7064F5210b94729h2035B42760
$$ -6280 -59287 -273088 -167897 84769 -72429 52952 -37064 65210 -294729 -82035 242760
18212c33921P4224Q7106m6874A43092j8696e48180F2221b19693A5755c1696Q204
$$ -333921 -259697 -172591 -219465 143092 124396 -548180 62221 -219693 15755 -31696 -23492
18201b3492j75880G7992R4576a55301a0323A95006G2591i8518B35917H6066c05053
$$ -23492 -199372 77992 172568 -155301 -10323 195006 72591 -98518 235917 86066 -305053
18189a07355j25140a07902r1759D0837e4904k86412J52953k15675a62065c8683
$$ -107355 -232495 -107902 -199661 40837 -54904 -341316 -188363 -404038 -162065 -38683
18178d0604H8721a69606N8585M2959Q615A64429o8218D2122M1530a21781A22903
$$ -40604 88721 -169606 -111021 -68062 -59447 164429 96211 42122 83652 -121781 122903
18166b7295c880k64920G2559a45364A38007e201m8637c628A08594f7155B73320
$$ -27295 -3880 -268800 72559 -145364 138007 -5201 -53838 -3628 108594 -67155 273320
18154a39413l4940h6690A82079c04952a51947j05797g7084B3826J13480B632a06696
$$ -139413 -174353 -86690 182079 -304952 -151947 -257744 -77084 23826 137306 2632 -106696
18142A16048a20013c8971k87742c404q131B28873b32948E9607a10373m0193j58626
$$ 116048 -120013 -38971 -326713 -3404 -11535 228873 -232948 59607 -110373 -150566 -309192
18131c09192N1625E652N5603K60485a11693k6231q985A16147b12606Q7093l6289
$$ -309192 -257567 5652 61255 321740 -111693 -137924 -146909 116147 -212606 -125513 -161802
18120a61802e3561j8816F8596K09104o9530I7081a39180k5389b1312m08013B34112
$$ -161802 -53561 -72377 68596 277700 208170 97081 -139180 -164569 -21312 -429325 234112
18108b3030q4309a3491B02601r7988b7232j28221B13149p2457a21658I8233b15481
$$ -23030 -107339 -13491 202601 104613 -27232 -155453 213149 140692 -121658 98233 -215481
18096D4a00929r2267A23090C0896a1023B34732o5575N7405a72578E2001g846B14322
$$ 44 -100929 -193196 123090 30896 -11023 234732 169157 226562 -172578 52001 -7846 214322
18083A75145F6958P4371c35924A95668b43213k24743a8522H1316J2733k0000a64484
$$ 175145 66958 141329 -335924 195668 -243213 -467956 -18522 81316 94049 74049 -164484
18071A9963a20360B30998d4171k30544L228C06976b3665m6040A86757G4004b46277
$$ 19963 -120360 230998 -44171 -274715 -271487 306976 -23665 -69705 186757 74004 -246277
18059b72353H403b8164B41980B0551b55806C22991b09917j95847F8801e53170
$$ -272353 8403 -28164 241980 20551 -255806 322991 -209917 -405764 68801 -553170
18048G498K63647b00142j7580D6759d6105j26845A15731B959b09713A23066b16396
$$ 7498 271145 -200142 -217722 46759 -46105 -172950 115731 2959 -209713 123066 -216396
18036H4500J58772d4248Q723A26076a21976D8426b44526A79587a26130A0262b23744
$$ 84500 243272 -44248 -35525 126076 -121976 48426 -244526 179587 -126130 10262 -223744
18024A45649b0544b26q3825b442I0971B5446k521b63461A29004a50871B5872N9018
$$ 145649 -20544 -226 -84051 -2442 90971 25446 22925 -263461 129004 -150871 25872 84890
18012H4890a3166j25073a2196A4111J26395b49996g3020j24707A38034e05777
$$ 84890 -13166 -138239 -12196 14111 140506 -249996 -73020 -197727 138034 -505777
18001b77972J23489A72607A3264L53933a44716H232d48668D1511J3195d695A03942
$$ -277972 -154483 172607 13264 367197 -144716 8232 -448668 41511 54706 -4695 103942
17989a06915j24020d148k02629e8915A27794b62721J04808O8248n2333L3892Q149
$$ -106915 -230935 -4148 -206777 -58915 127794 -262721 -157913 -89665 -141998 -108106 -99957
17978i9957a5454B41300i9433A28413J7296n8728a59707D3388K16797f482j41177
$$ -99957 -15454 241300 -99433 128413 145709 86981 -159707 43388 260185 -6482 -147659
17967a47659D6553a13719M7778k15170a10422E3049J41486k0204a18182B98075
$$ -147659 46553 -113719 -65941 -281111 -110422 53049 194535 174331 -118182 298075
17956a14794G5704a08704A8045P2932a18056L5638B1757K6980P4994e8614A13348
$$ -114794 75704 -108704 18045 90977 -118056 -82418 21757 48737 123731 -58614 113348
17944B19302k5678J26270c27627a25868j76398a17392h382D0724N8549e7507C84582
$$ 219302 193624 319894 -327627 -125868 -302266 -117392 -8382 40724 99273 -57507 384582
17932b1360g255r6712B21679b83050K3215G6654C0891L9039n548N1631g6512m5636
$$ -21360 -7255 -103967 221679 -283050 -259835 76654 30891 69930 64382 116013 -76512 -122148
17920a22148B45981J3216C3308f9350G1608J67773b56983A7455b24071C8592a59280
$$ -122148 245981 259197 33308 -69350 71608 239381 -256983 17455 -224071 38592 -159280
17908d9447n8386j0774A35355m507F2071a6561A63784p8133C255L6711f3898j97726
$$ -49447 -107833 -118607 135355 130848 62071 -16561 163784 85651 3255 39966 -63898 -261624
17896b61624N9446p0400A94003c2885D54637f4453D9769f8847j722n2177e2173
$$ -261624 -202178 -272578 194003 -32885 454637 -64453 49769 -68847 -70569 -122746 -52173
17884b91957C5733c30915C35389c2755m1704j9409m42112A17656d7014j78058
$$ -291957 35733 -330915 335389 -32755 -74459 -93868 -535980 117656 -47014 -225072
17874b25072b262j35689q4559a07765D18071j35794A25881C688c6578A29996b03475
$$ -225072 -2262 -137951 -222510 -107765 418071 282277 125881 3688 -36578 129996 -203475
17862E6981F232h652l566j05735H3590a71947E427J84371b03012C596M9654L7687
$$ 56981 6232 -8652 -12218 -117953 83590 -171947 5427 189798 -203012 3596 53250 90937
17850I0937p31a38124A52263c67291j8222a8445o9283j2571B791O0554P9679K1389
$$ 90937 90206 -138124 152263 -367291 -385513 -18445 -87728 -100299 2791 63345 143024 164413
17838A64413a05497C3183a8304B48964e6252A69453O9773c7772D937J01450M891
$$ 164413 -105497 33183 -18304 248964 -56252 169453 239226 -37772 4937 106387 111278
17827A11278B3126K57763a70225A25612d12581A56961m0329j2697O6009G6751
$$ 111278 23126 280889 -170225 125612 -412581 156961 116632 103935 169944 76751
17816b41884b0516p5282A48732F9108L16684a13057A69058N5107K45485a24878
$$ -241884 -20516 -95798 148732 69108 385792 -113057 169058 224165 469650 -124878
17805E0205M72197A81565b07142B4510l640b40863D620J04039a48452D7627g5326
$$ 50205 522402 181565 -207142 24510 20870 -240863 4620 108659 -148452 47627 -75326
17793A10159a55387a6702I3376J81875l2467e5380m3291j17055I4595a29823B93327
$$ 110159 -155387 -16702 93376 275251 242784 -55380 -98671 -215726 94595 -129823 293327
17781b67604D2335e6799A23268c8168k06483f1289A39117C9776K36467b48578
$$ -267604 42335 -56799 123268 -38168 -244651 -61289 139117 39776 276243 -248578
17770A42172g4395C3786d38499a77189A34094b87429H5828a1448H9306b53388
$$ 142172 -74395 33786 -438499 -177189 134094 -287429 85828 -11448 89306 -253388
17759g3814A45136a85915A95044g4546C2251J07837d6719A59624a0714A39819
$$ -73814 145136 -185915 195044 -74546 32251 140088 -46719 159624 -10714 139819
17748B28997a65724a479A62179b15426G1055a63297E8028a72923C15493a88028
$$ 228997 -165724 -1479 162179 -215426 71055 -163297 58028 -172923 315493 -188028
17737a56257A8265L61281b0157l397m7177R194C3933d4407r8086q458L7653B27527
$$ -156257 18265 379546 -20157 -23554 -70731 -61537 33933 -44407 -142493 -150951 -113298 227527
17724B89853d27979d5829j28371B35653c50203a5805l2855j4308A8047L77496
$$ 289853 -427979 -45829 -174200 235653 -350203 -15805 -48660 -62968 18047 395543
17714C95543b1137C14171j9145j38047K14575E3793J33069n4939i6786C3643P7226
$$ 395543 -21137 314171 295026 156979 371554 53793 186862 131923 -96786 33643 110869
17703A10869J90447A05825P0782a86792B28834D3542K41907c4697j8791A5662
$$ 110869 301316 105825 176607 -186792 228834 43542 285449 -34697 -53488 15662
17692C40415A16842K62678G0680P7413a47803A91954d267A22763b27208A27709
$$ 340415 116842 379520 70680 148093 -147803 191954 -4267 122763 -227208 127709
17681a28799k6757E1205N2768J58213p3539l5880l3827h2323n5691O1710j03253
$$ -128799 -155556 51205 103973 262186 188647 152767 118940 -82323 -138014 -76304 -179557
17670a79557M8670A25386m8042K8674C5879K52720d4945B21672D2933h0117j51150
$$ -179557 -130887 125386 77344 106018 35879 288599 -44945 221672 42933 -80117 -231267
17659b31267L688f825A74232a25916d3226j98621A015R4643J34582H6976l5387
$$ -231267 -227579 -6825 174232 -125916 -43226 -241847 1015 95658 230240 86976 51589
17648E1589J23042B7034L8108R746a43342d4211B8046i3167j33668C1294a43929
$$ 51589 174631 27034 65142 74888 -143342 -44211 28046 -93167 -226835 31294 -143929
17636a05953q1453B05668b4890k09954e9275C56602c0096A06744b30209A77243
$$ -105953 -187406 205668 -24890 -234844 -59275 356602 -30096 106744 -230209 177243
17625E58575A09964a50742B4788a91763Q8260c5443k77841F6352K84741b50584
$$ 558575 109964 -150742 24788 -191763 -103503 -35443 -313284 66352 351093 -250584
17614E8065a28921E969a2984k62603B27877l1974C6874a2212k76993A64665a73947
$$ 58065 -128921 5969 -12984 -275587 227877 195903 36874 -12212 -289205 164665 -173947
17602h850D2979A6061J26923n9410r500J46485c8074A06160A0986K03472C6832
$$ -8850 42979 16061 142984 83574 74074 220559 -38074 106160 10986 214458 36832
17590c45663B15396D6552J32639l6837C5917J38201b62824A8596G428a28348A53845
$$ -345663 215396 46552 179191 142354 35917 174118 -262824 18596 7428 -128348 153845
17578I8304i1344G0069a20079c8741B16498c8674A524M69201i5518j79859C16994
$$ 98304 -91344 70069 -120079 -38741 216498 -38674 1524 470725 -95518 -275377 316994
17566e631A25021J69708c9337A32694J5076a0886C57543H3161c0225j67501a6562
$$ -5631 125021 294729 -39337 132694 147770 -10886 357543 83161 -30225 -197726 -16562
17554A76153b06440J03058H6502a2549C57939a51932B13133j3816i9457m1949
$$ 176153 -206440 -103382 86502 -12549 357939 -151932 213133 199317 -99457 -141406
17544a41406I6254j58N0275a53845c7848j07965O7020C8463K4622b7913C60932
$$ -141406 96254 96096 146371 -153845 -37848 -145813 -78793 38463 63085 -27913 360932
17532F9835J48834J0347a80008l9615C1015c0479q5484B03491L45201B72897A20430
$$ 69835 218669 229016 -180008 -219623 31015 -30479 -115963 203491 548692 272897 120430
17520B57216K80148r4081h3637A80819G5364b51065C31672j06298H1843J13508
$$ 257216 537364 443283 -83637 180819 75364 -251065 331672 225374 81843 195351
17510A95351a26700D8287a82862B5756K92769c1953A69280K52121g8586r433j7249
$$ 195351 -126700 48287 -182862 25756 318525 -31953 169280 421401 -78586 -88019 -105268
17499a05268C01725e4469B05667d3541m2391E3011a16955E9952Q9343O724n5684
$$ -105268 301725 -54469 205667 -43541 -85932 53011 -116955 59952 149295 156019 100335
17488A00335K41267N4879a02242B30399K47626j88276j25199D2602J31767M7909
$$ 100335 341602 396481 -102242 230399 478025 289749 164550 42602 174369 222278
17478B22278o8405a09024C53870j5177l9855q6426g0604B92770J0433O4104o0238
$$ 222278 153873 -109024 353870 338693 298838 212412 -70604 292770 303203 367307 307069
17467C07069A32891a84873B71899J7771j33196a81539G897O21006B93097j35256
$$ 307069 132891 -184873 271899 289670 156474 -181539 7897 628903 293097 157841
17457A57841L34451I4099B3764d9736D00692m2416j56124J0439P9489Q4705J01145
$$ 157841 492292 94099 23764 -49736 400692 358276 202152 212591 292080 376785 477930
17446D77930j00314A58425Q2494K53439k37563F7555b14167G7432A2874J82113
$$ 477930 377616 158425 240919 494358 256795 67555 -214167 77432 12874 194987
17436A94987J06001J3061J5555J71361A75603L95953k11474L1605j70955o8946
$$ 194987 300988 314049 329604 500965 175603 571556 360082 391687 220732 151786
17426A51786J50445N31894l85216F1440O6575J38073O4765M8857A33682N31061
$$ 151786 302231 834125 448909 61440 128015 266088 330853 379710 133682 664743
17416F64743k77304r3638J15001A83651N5368A08642K89688A57487a67323A62175
$$ 664743 387439 293801 408802 183651 239019 108642 398330 157487 -167323 162175
17405D9504L06953A39710L180j188R3654j09230f5036B99738I06J76039e1554
$$ 49504 356457 139710 142890 141702 235356 126126 -65036 299738 906 176945 -51554
17393E8211i10E23700h0296B49772P3587Q1813q9156E839g015A43444J35851M9761
$$ 58211 -910 523700 -80296 249772 323359 405172 316016 5839 -7015 143444 279295 329056
17381C29056A10413K41373A67282N0745d8430C09344b99478A52581d5653A31424
$$ 329056 110413 351786 167282 218027 -48430 309344 -299478 152581 -45653 131424
17370A09145c3735A5628J91972N5692J23924g6690K296B52399R0609i3730C26812
$$ 109145 -33735 15628 207600 263292 387216 -76690 -74394 252399 343008 -93730 326812
17358I6277b0065A13308B1335a2404B46433N4296F0222Q9105J08207j13370J85894
$$ 96277 -20065 113308 21335 -12404 246433 300729 60222 149327 257534 144164 330058
17347C30058B4999a8387C47869Q2943d740D16699b06482A81565E0213h265D85045
$$ 330058 24999 -18387 347869 430812 -4740 416699 -206482 181565 50213 -8265 485045
17335A69532J43496j28384e8146I844K17288M08m9787J43508G5437J36976H3862
$$ 169532 313028 184644 -58146 9844 227132 227540 177753 321261 75437 212413 83862
17323I2411b82778A42509J21058L5564A25308L29575j15710c203D24497A97919
$$ 92411 -282778 142509 263567 299131 125308 454883 339173 -3203 424497 197919
17312A11389K68356F7609Q6429J34534B1414a48616O5701a4998A28714A1558P0224
$$ 111389 379745 67609 154038 288572 21414 -148616 -82915 -14998 128714 11558 81782
17301H1782J42375F0158R5439J60227q9995B5188N2731Q035J88165D0558Q0542
$$ 81782 224157 60158 155597 315824 225829 25188 77919 85954 274119 40558 121100
17290A21100c3555C33930E572J78844C9621a05584D67866E2985L5747J0482J2919
$$ 121100 -33555 333930 5572 184416 39621 -105584 467866 52985 88732 99214 112133
17279A12133J03387l9J12187A39769a36625B9457J45381M8603r0901J47572j17401
$$ 112133 215520 215481 327668 139769 -136625 29457 174838 223441 132540 280112 162711
17268A62711C5643L34886A7592K96049L3412n3389J09008A64853B9630J58820
$$ 162711 35643 370529 17592 313641 347053 293664 402672 164853 29630 188450
17258A88450J16591Q6190d1354A54513K7523n1449D8999J88971J65053j50844
$$ 188450 305041 391231 -41354 154513 182036 130587 48999 237970 403023 252179
17248B52179H6812A2728O9736L3964K82237a8183A18354J47620E7853J76039K62386
$$ 252179 86812 12728 82464 116428 398665 -18183 118354 265974 57853 233892 496278
17237D96278k33162J93366m8234p5402j55198L56449j16682A1953Q8301J74248
$$ 496278 263116 456482 408248 332846 177648 534097 417415 11953 100254 274502
17227B74502j30631J00660p0920J14859A37376M82976b96973h2416B64484J04018
$$ 274502 143871 244531 173611 288470 137376 620352 -296973 -82416 264484 368502
17217C68502j10825K12678B21218J67417A89610j1633O7447L30993A85112K25482
$$ 368502 257677 470355 221218 388635 189610 177977 245424 576417 185112 410594
17207D10594O4694o6067K40786C06246b8256B4127J99289Q1853J36735Q5068B56639
$$ 410594 475288 409221 650007 306246 -28256 24127 223416 305269 442004 527072 256639
17195B37736Q7555J8997G9166R5740R5251j09441K38069j69823K100q0902K85492
$$ 237736 325291 344288 79166 174906 270157 160716 398785 228962 231062 150160 435652
17184D35652Q44j47296K92748k38773m8820P9557r9383j05575K71393o6640k4626
$$ 435652 436496 289200 581948 343175 294355 373912 274529 168954 440347 373707 349081
17173C49081A59547K23920A03503L29603j26984E3257M76381k07391J57817q3689
$$ 349081 159547 383467 103503 433106 306122 53257 529638 322247 480064 396375
17163C96375o2856L4837L3876A35265K09455J93727A05828J96772Q043J98009
$$ 396375 333519 368356 402232 135265 344720 538447 105828 302600 310643 508652
17153E08652k07227J54237j74919K09665A83381O836J31777N7659j30143K15895
$$ 508652 301425 455662 280743 490408 183381 190217 321994 379653 249510 465405
17143D65405J13458K08915l10096q0995J55962K5684k79129L59084A07837J38598
$$ 465405 578863 787778 477682 396687 552649 578333 299204 658288 107837 246435
17133B46435L1787L46461A94440L48649B64207O6711P8348A54288J32959K86344
$$ 246435 278222 624683 194440 543089 264207 330918 409266 154288 287247 573591
17123E73591k41705K45128k1920k19970A26898K77204j83094R2229P5903C7000
$$ 573591 331886 577014 555094 335124 126898 404102 221008 313237 389140 37000
17112B15418k4190k6542J77121K6604R3426J61967k31056j85373M48031k50569
$$ 215418 191228 164686 341807 368411 461837 623804 392748 207375 655406 404837
17102D04837j46961r5179o1414J88464J75892A33682c850D66181j15169n8611
$$ 404837 257876 162697 101283 289747 465639 133682 -3850 466181 351012 292401
17092B92401K62519k06971o4729J92045K49296k64373R0907j12016k874N1073
$$ 292401 554920 347949 283220 475265 724561 460188 551095 439079 436205 487278
17082D87278L0930P4808l3239j69394L18405j86495m0738j12366K41366J21902
$$ 487278 518208 593016 559777 390383 708788 522293 481555 369189 610555 732457
17072G32457l06277j72879L51182k5505J39745q7543J61816j86456K20060j0694
$$ 732457 426180 253301 604483 578978 718723 631180 792996 606540 826600 815906
17062H15906C45784K03944k12081M03632k05847j16493L62206j51931q0973j50380
$$ 815906 345784 549728 337647 741279 535432 418939 781145 629214 548241 397861
17052C97861R0153K4033M04556D24561K91244r9255B87532O29712l54630k023
$$ 397861 488014 512047 916603 424561 715805 616550 287532 917244 562614 560591
17042E60591K98873J1097k56011j39179J69639J07417k94366K21818L10595J01872
$$ 560591 859464 870561 614550 475371 645010 752427 458061 679879 990474 1092346
17032A092346n01854K40007N6649R37j69710Q2747O1197C62428L42975o9438L11620
$$ 1092346 590492 830499 887148 888085 718375 801122 862319 362428 705403 635965 947585
17021I47585j57922p0820k00598J14935l7448J89961Q8831j24389j00193L40971
$$ 947585 789663 718843 518245 633180 595732 785693 874524 750135 649942 990913
17011I90913o8390K6967m49727N46781l01177k942J62370m3097l8750J50057k51160
$$ 990913 922523 949490 499763 1046544 745367 742425 904795 861698 822948 973005 721845
17000G21845J97884L2159l75309L48943J0277R7880k70287K59320m7322l15332
$$ 721845 919729 951888 576579 925522 935799 1033679 763392 1022712 975390 660058
16990F60058N58479l84971O8953j04740k20794k0839L84334P2506j61410R8116
$$ 660058 1218537 833566 902519 797779 576985 556146 940480 1012986 851576 949692
16980I49692J60252k57312K3714J20167J66037j10793l7023Q7657K67450m11283
$$ 949692 1109944 852632 876346 996513 1162550 1051757 1014734 1102391 1369841 958558
16970I58558J61400k7584M9448k38566N53936l78879K4862m13325J63191K41680
$$ 958558 1119958 1092374 1141822 903256 1457192 1078313 1103175 689850 853041 1094721
16960A094721L9863k1225Q4359K9653j87683J71293n7608j27951K21639k21926
$$ 1094721 1134584 1113359 1197718 1227371 1039688 1210981 1153373 1025422 1247061 1025135
16950A025135J88360J34576j74982J66557L86424n79800L43367o8379j47649K53205
$$ 1025135 1213495 1348071 1173089 1339646 1726070 1146270 1489637 1421258 1273609 1526814
16940A526814l41839J41143J84583o3710j98267M47605j91210k83915J22818J41778
$$ 1526814 1184975 1326118 1510701 1446991 1248724 1696329 1505119 1221204 1344022 1485800
16930A485800J87750j43203K0894J16003J16540l40598M2551L50942j25921j36183
$$ 1485800 1673550 1530347 1551241 1667244 1783784 1443186 1485737 1836679 1710758 1574575
16920A574575j22870J84765L0796L8949j52836K63791k70968K51065j27992N0250
$$ 1574575 1451705 1636470 1667266 1706215 1553379 1817170 1546202 1797267 1669275 1719525
16910A719525r6101L41774j73792l92507M64479j6105q7883l254J76922J27563
$$ 1719525 1623424 1965198 1791406 1398899 1863378 1847273 1759390 1756136 1933058 2060621
16900B060621k02154K93227k85079J07169j340J75880o4670j1883K37305k12329
$$ 2060621 1858467 2151694 1866615 1973784 1972444 2148324 2083654 2071771 2309076 2096747
16890B096747J68829k30395K22110L9947J46060k02027N5443L1528o242J96289
$$ 2096747 2265576 2035181 2257291 2297238 2443298 2241271 2296714 2328242 2322000 2518289
16880B518289o5879M0433N5623K95117j71056M5855j2753n4590K05454l73820
$$ 2518289 2452410 2492843 2548466 2843583 2672527 2718382 2705629 2651039 2856493 2482673
16870B482673L4722J67572J30524k3858K59907j26229K20514O4112j62234J32366
$$ 2482673 2517395 2684967 2815491 2791633 3051540 2925311 3145825 3209937 3047703 3180069
16860C180069j62853K88734j10618Q6127J82354k4520j6405j8111L31364L44555
$$ 3180069 3017216 3305950 3195332 3281459 3463813 3439293 3422888 3404777 3736141 4080696
16850D080696l18559J40975k2563J42009q0648j11282j45333K79352M07004k18735
$$ 4080696 3762137 3903112 3880549 4022558 3941910 3830628 3685295 3964647 4371651 4152916
16840D152916j25330M20893L1718k1129L24930j88103m7794K5213K19982M12120
$$ 4152916 4027586 4448479 4480197 4459068 4783998 4595895 4548101 4573314 4793296 5205416
16830E205416k31506L888K18746L43840K2360p4682Q8028P271J66076K0938J36552
$$ 5205416 4973910 4977798 5196544 5540384 5562744 5488062 5576090 5583361 5749437 5770375 5906927
16819E906927M29076m22167N12607K30328l5485j0535L08226J92403K15405k42114
$$ 5906927 6336003 5913836 6426443 6656771 6621286 6610751 6918977 7111380 7326785 7084671
16809G084671N5676L81422J51655J07008j49640P42566K25321R5208K02856K67394
$$ 7084671 7140347 7521769 7673424 7780432 7630792 8373358 8598679 8693887 8896743 9164137
16799I164137k04411O59165j4768O76058m12458K27051O11975j42323O64882M2807
$$ 9164137 8959726 9618891 9604123 10280181 9867723 10094774 10706749 10564426 11229308 11272115
16789A1272115M72686L11894J35101N71515L44544J10413M24494L94085O28471
$$ 11272115 11744801 12056695 12191796 12763311 13107855 13218268 13642762 14036847 14665318
16780A4665318N18584J53640M05422K52492N28427N28558P15633M77598N12330
$$ 14665318 15183902 15337542 15742964 15995456 16523883 17052441 17768074 18245672 18758002
16771A8758002P79612L55551R67790N01065Q21743Q78628O62309P04884J297216
$$ 18758002 19537614 19893165 20860955 21362020 22183763 23062391 23724700 24429584 25726800
16762B5726800P44721R22260J170935J291929J002523J340796J097421J421976
$$ 25726800 26471521 27393781 28564716 29856645 30859168 32199964 33297385 34719361
16754C4719361R37828J907440J696771J793949J585690J814273K278630K063904
$$ 34719361 35657189 37564629 39261400 41055349 42641039 44455312 46733942 48797846
16746D8797846K236222K191547K678078K518608K810188L279674L201637L694425
$$ 48797846 51034068 53225615 55903693 58422301 61232489 64512163 67713800 71408225
16738G1408225L485685L982525M047199M155558M407221M357961N015332M987314
$$ 71408225 74893910 78876435 82923634 87079192 91486413 95844374 100859706 105847020
16730A05847020N089392N148286N521511N088372N384026N098846M997609M351400
$$ 105847020 110936412 116084698 121606209 126694581 132078607 137177453 142175062 146526462
16722A46526462M444256L653332K899848K762398J409600J048776j86578m24128
$$ 146526462 150970718 154624050 157523898 160286296 161695896 162744672 162558094 162133966
16714A62133966j782365j885819l122102l743751m154972m807699m821586n362226
$$ 162133966 160351601 158465782 155343680 151599929 147444957 142637258 137815672 132453446
16706A32453446n339050n426426n296258n607817n314431n207960m968876m722032
$$ 132453446 127114396 121687970 116391712 110783895 105469464 100261504 95292628 90570596
16698I0570596m934052m543679m019271l719717m342951k991157l756570k915376
$$ 90570596 85636544 81092865 77073594 73353877 69010926 66019769 62263199 59347823
16690E9347823l156936k776620k584260k420972k286783j977134k307741k111821
$$ 59347823 56190887 53414267 50830007 48409035 46122252 44145118 41837377 39725556
16682C9725556j740537j624870j688266j410715j445346j175883j453135q15898
$$ 39725556 37985019 36360149 34671883 33261168 31815822 30639939 29186804 28370906
16674B8370906j426058j165232r69167p10718j107991p03708p13562r52417q19916
$$ 28370906 26944848 25779616 24810449 24099731 22991740 22288032 21574470 20622053 19802137
16665A9802137n75093j069346l53914m13865o76234m73427q38667k58261m27310
$$ 19802137 19227044 18157698 17803784 17389919 16713685 16240258 15401591 15143330 14716020
16656A4716020j78749q70787o77319P9306o44768m83540N7939m87386j95676j96176
$$ 14716020 14537271 13666484 12989165 13068471 12423703 11940163 11998102 11510716 11315040 11118864
16646A1118864n39629k89355k77833Q5605o28100n48656K7910j02968l57880k71247
$$ 11118864 10579235 10289880 10012047 10097652 9469552 8920896 8948806 8845838 8487958 8216711
16636H216711j17015k85098k9835l04073q8021r9156n54028R4028l41502Q9429
$$ 8216711 8099696 7814598 7784763 7480690 7392669 7293513 6739485 6833513 6492011 6581440
16626F581440k07673j88021J09610m12523l59170J43016m38950M11976m01272
$$ 6581440 6373767 6185746 6295356 5882833 5523663 5666679 5227729 5639705 5238433
16617E238433J91551n12781J15949k7824m21921J48596m06157L06924n10965L14812
$$ 5238433 5429984 4917203 5033152 5005328 4583407 4732003 4325846 4632770 4121805 4436617
16607D436617k41461k60200L33713j71027k54690n8984L83722k16126j15547j62188
$$ 4436617 4195156 3934956 4268669 4097642 3842952 3783968 4167690 3951564 3836017 3673829
16597C673829j21718m01951L16443K989k55622K10057k22121j10958j16282k11426
$$ 3673829 3552111 3150160 3466603 3469592 3213970 3424027 3201906 3090948 2974666 2763240
16587B763240L23764k53584J91133m52097J37491J65685k51224K8996l83066L10524
$$ 2763240 3087004 2833420 3024553 2572456 2709947 2875632 2624408 2653404 2270338 2580862
16577B580862k96820R5639j75041J76709J06635p9554l34392N8144O8413q3704
$$ 2580862 2284042 2379681 2204640 2381349 2487984 2408430 2074038 2132182 2200595 2116891
16567B116891P7077m9477o8575j32075Q7093o671j27320L1433R7146q1377l1011
$$ 2116891 2193968 2144491 2075916 1943841 2030934 2024263 1896943 1928376 2025522 1944145 1913134
16556A913134j74672J02421q1397J85058p4221p4762P5940l25313K53761k95641
$$ 1913134 1738462 1840883 1759486 1944544 1870323 1795561 1871501 1546188 1799949 1504308
16546A504308K92820k32927k22030O126L23192J65371m29213k20620J97886j12354
$$ 1504308 1797128 1564201 1342171 1348297 1671489 1836860 1407647 1187027 1384913 1272559
16536A272559O2309J06606j2768j57970p0052K8662M18930j75858l28117P7846
$$ 1272559 1334868 1441474 1428706 1270736 1200684 1229346 1648276 1472418 1144301 1222147
16526A222147O1002n7560K11259o8633m17534J39730Q8093p6160l74028N24865
$$ 1222147 1283149 1225589 1436848 1368215 950681 1090411 1178504 1102344 728316 1253181
16516A253181j08995p5083K64565n4250j45744m8823K4180J19934j45006l40695
$$ 1253181 1144186 1069103 1333668 1279418 1133674 1084851 1109031 1228965 1083959 743264
16506G43264p0324L72284j57232J07402K133l3842J99656j35048j69491K93165
$$ 743264 672940 1045224 887992 995394 997527 963685 1163341 1028293 858802 1151967
16496A151967l67163K43357j76792P4114J65344K593j07867Q275j16775j42165
$$ 1151967 784804 1028161 851369 925483 1090827 1093420 985553 993828 877053 734888
16486G34888J52055l62828K75403l46075O44177k64559J37784j08845D00689N46392
$$ 734888 886943 524115 799518 453443 1097620 833061 970845 862000 400689 947081
16476I47081j04720j12225l1048j85914L5370K33829J98895D70343K55140R0781
$$ 947081 842361 730136 699088 513174 548544 782373 981268 470343 725483 816264
16466H16264j95389k5733k07895L13518l25717j14897N27223C58791K63857J63998
$$ 816264 620875 595142 387247 700765 375048 260151 787374 358791 622648 786646
16456G86646k58212K50701k73256k2120R5479J39052q7334J7791k7442B83894
$$ 786646 528434 779135 505879 483759 579238 718290 630956 648747 621305 283894
16445F23894k19797J90834B92632L40576k14184j38229K22322J5833M15073C94973
$$ 623894 404097 594931 292632 633208 419024 280795 503117 518950 934023 394973
16434F80477k34010M1633M8173j1247J82557j89336P0131A38648M20681o8873
$$ 680477 446467 488100 536273 525026 707583 518247 588378 138648 559329 490456
16424D90456k26842G5599L80479J17795k42383j6089D0081Q0256L96678J58845
$$ 490456 263614 75599 456078 573873 331490 315401 40081 120337 517015 675860
16414F75860J77068C90372l4041j59560L04158A54766M84152I6219M10943J70005
$$ 675860 852928 390372 356331 196771 500929 154766 638918 96219 507162 677167
16404F77167C23253J71791k01421K06374L6392E7651J05437J11154r0598J72082
$$ 677167 323253 495044 293623 499997 536389 57651 163088 274242 183644 355726
16394C55726P928J30294j71971p3135L16596N7742j84810o7620J14820k25524
$$ 355726 363654 493948 321977 248842 565438 623180 438370 370750 485570 260046
16384B60046A05544K79026M8642J24287E9599L76269J00115A80728r033J69277
$$ 260046 105544 384570 433212 557499 59599 435868 535983 180728 171695 340972
16374C40972d8391C22820j3911j19147J27907r0083j01249L81447j76808o1681
$$ 340972 -48391 322820 308909 189762 317669 227586 126337 507784 330976 269295
16364B69295j22630K10292A20354L42323j29035L5884a6024C93769I8064d2252
$$ 269295 146665 356957 120354 462677 333642 369526 -16024 393769 98064 -42252
16353D74100K38002B82204m5511a59093A74953O7205q0995J94736Q9059j56545
$$ 474100 712102 282204 236693 -159093 174953 242158 161163 355899 444958 288413
16343B88413a01652C51275j64090I792O2546R1746J70620r5639F6365J42526P3930
$$ 288413 -101652 351275 187185 9792 72338 164084 334704 239065 66365 208891 282821
16332B82821A11J59099R6604d2732B03465C617J07259b40776i5704C38417k4798
$$ 282821 111 159210 255814 -42732 203465 3617 110876 -240776 -95704 338417 313619
16321C13619J04636A88532J78108j45870J25708N5355A5572J17878J01676J78545
$$ 313619 418255 188532 366640 220770 346478 401833 15572 133450 235126 413671
16311D13671j48436E1982L14197A52902P1285h3822B83716G0098K46012B981N5000
$$ 413671 265235 51982 366179 152902 224187 -83822 283716 70098 316110 2981 57981
16300E7981K18634N1199b8415A9510J90845j01597K08402E6048J18336B1639L9853
$$ 57981 276615 327814 -28415 19510 210355 108758 317160 56048 174384 21639 61492
16289F1492M56395k35645J4547a6873j59176D49015j81889a2880E5184O2640b9997
$$ 61492 517887 282242 296789 -16873 -176049 449015 267126 -12880 55184 117824 -29997
16277B31260m6485F589M7536M15514k04296H0716J57994A6254L88101D5328J51105
$$ 231260 184775 6589 54125 469639 265343 80716 238710 16254 404355 45328 196433
16266A96433q8585J69116a99566B29105B2421L30075H1784O0610J6433g5480C4123
$$ 196433 107848 276964 -199566 229105 22421 352496 81784 142394 158827 -75480 34123
16254a75157A54R1483B6929a14277p6333A56687m7787J81677g8400A46853K88447
$$ -175157 154 91637 26929 -114277 -190610 156687 108900 290577 -78400 146853 435300
16243D35300j64783a86097d5100B1096K27469D7620b23353A28007K11772b24950
$$ 435300 270517 -186097 -45100 21096 248565 47620 -223353 128007 339779 -224950
16232H3108a62706D5802b66805G4779K6861J7382a23317C89261g2368A68986M4449
$$ 83108 -162706 45802 -266805 74779 101640 119022 -123317 389261 -72368 168986 213435
16221B13435I3042a9840C113M9744O2322Q9407m0718n9060R872b0198q1213A04387
$$ 213435 93042 -19840 3113 52857 115179 204586 163868 104808 114680 -20198 -101411 104387
16208b2026B26388N0536a29915r4230A99239a63184A56240K4424i6571A31736
$$ -22026 226388 276924 -129915 -224145 199239 -163184 156240 180664 -96571 131736
16197b0422D5675J19021h6149A37584o0633P2482l6147Q3905J63996d7451j5457
$$ -20422 45675 164696 -86149 137584 76951 149433 113286 197191 361187 -47451 -62908
16186f2908E0792a7165C7349P9684f7810k1865J2734o8375B19317n481Q676b02203
$$ -62908 50792 -17165 37349 117033 -67810 -89675 -76941 -145316 219317 213836 222512 -202203
16173h424n817D22132B04225J63736F5725a30709E6908a0323k48113A62525K8544
$$ -8424 -14241 422132 204225 367961 65725 -130709 56908 -10323 -258436 162525 191069
16162A91069H2913A01a3200A27166a76592B42867a4558o7203g81A32157Q8940
$$ 191069 82913 101 -13200 127166 -176592 242867 -14558 -81761 -781 132157 221097
16151B21097a34690C4113b39699B67154H3535K5136J38784J4783a58423f6665
$$ 221097 -134690 34113 -239699 267154 83535 108671 247455 262238 -158423 -66665
16140G4695L03490q8809a9956C1015J278Q1604D3516M16222j84696C1888e0307
$$ 74695 378185 289376 -19956 31015 32293 113897 43516 459738 275042 31888 -50307
16128a00388C8504a08094A28287e8413B29624g2662j37560D6147i0152d195j71694
$$ -100388 38504 -108094 128287 -58413 229624 -72662 -210222 46147 -90152 -4195 -175889
16117a75889B2106n971a03385J2618A14535C7578h8071A02320f6180E5528C526
$$ -175889 22106 16135 -103385 -90767 114535 37578 -88071 102320 -66180 55528 3526
16105A97118a51454A07627M03267B35563H1310J86881j1845j05062F1738M12283
$$ 197118 -151454 107627 510894 235563 81310 268191 256346 151284 61738 474021
16095D74021A88881C4354L01350I6466h5509B92436c9978G7720g4035k37943G4042
$$ 474021 188881 34354 335704 96466 -85509 292436 -39978 77720 -74035 -311978 74042
16083d06357a23693L112A49932b77865c0490k24520j41349g2090b4364r5746a2069
$$ -406357 -123693 -120581 149932 -277865 -30490 -255010 -396359 -72090 -24364 -120110 -12069
16071h8007k16528g0044i11m6304I0247a21112I9236l8599a87652j74142G7276
$$ -88007 -304535 -70044 -911 -47215 90247 -121112 99236 60637 -187652 -361794 77276
16059a78904B8954c3636j25287M4596n9339C89189c76611a17227B48777b90624
$$ -178904 28954 -33636 -158923 -114327 -173666 389189 -376611 -117227 248777 -290624
16048a5571I8019a93473A85671j8119c58687f4992A61256a71740B22457r3758
$$ -15571 98019 -193473 185671 167552 -358687 -64992 161256 -171740 222457 128699
16038A28699c75339a07630A2897b24267q6448A41740a29928G6589c85833I7112
$$ 128699 -375339 -107630 12897 -224267 -310715 141740 -129928 76589 -385833 97112
16027h1898D8526A6601b97968H1139B1264J21727R3454a88309A32073n6301L9680
$$ -81898 48526 16601 -297968 81139 21264 142991 236445 -188309 132073 75772 115452
16016A15452J66352j10631F6052J7194l7516c08073a45446a3439r3822l3303A07610
$$ 115452 281804 171173 66052 83246 45730 -308073 -145446 -13439 -107261 -140564 107610
16004i8129o837D80858A15113a4932B4043b32622A33664A4450a07418l7634C1504
$$ -98129 -104966 480858 115113 -14932 24043 -232622 133664 14450 -107418 -145052 31504
15992A30472J92282E9449a28545C613K14190b39863G8992C2589A4389R5863J68329
$$ 130472 322754 59449 -128545 3613 217803 -239863 78992 32589 14389 110252 278581
15981B78581I6963J8862P5918M8426a35319L7118A79649h0539A28556b43551g6122
$$ 278581 96963 115825 191743 240169 -135319 -98201 179649 -80539 128556 -243551 -76122
15969a20217J8348A37963a93090N1160d6358r8081j5659A35069c5862A05998F418
$$ -120217 -101869 137963 -193090 -141930 -46358 -144439 -160098 135069 -35862 105998 6418
15957C11815D356N5843N703M4922N927J29194e9063H0093a52710A04121a12699
$$ 311815 4356 60199 65902 110824 116751 245945 -59063 80093 -152710 104121 -112699
15945E8789J06762h6772q5077A3428c19149a09875H57a4625k30628H8214f9794
$$ 58789 165551 -86772 -171849 13428 -319149 -109875 857 -14625 -245253 88214 -69794
15933B03619M8422d5799e003A48083a02946j75548H8452Q0870Q8963d0427c374
$$ 203619 252041 -45799 -5003 148083 -102946 -278494 88452 169322 258285 -40427 -3374
15921b35307b5205a1177C25569b69821J11962L5587A2594J66176a4522p7722A06250
$$ -235307 -25205 -11177 325569 -269821 -157859 -122272 12594 178770 -14522 -92244 106250
15909b06584f2855D1715f2190m76990b7778j71978i2404C8572J50740B5203c9772
$$ -206584 -62855 41715 -62190 -539180 -27778 -199756 -92404 38572 189312 25203 -39772
15897a85133C20609b34242C6603i9150H6405b47325J03099B8492J61069b8843
$$ -185133 320609 -234242 36603 -99150 86405 -247325 -144226 28492 189561 -28843
15886D2543a97874D48582a918B28630l2818a53748q6425G9826K27177b02545I6190
$$ 42543 -197874 448582 -1918 228630 195812 -153748 -240173 79826 307003 -202545 96190
15874A77792D2635f9235b6822j7160m12474A01105J2799a03513D2755J15473b8257
$$ 177792 42635 -69235 -26822 -43982 -456456 101105 113904 -103513 42755 158228 -28257
15862B33602c99960i698j13941I2312A0889J5475b89208B59471e47758A89085
$$ 233602 -399960 -9698 -123639 92312 10889 26364 -289208 259471 -547758 189085
15851a39829O2439A38912d21k37915A75776E0606a65427k2236f8109A67387a84467
$$ -139829 -77390 138912 -421 -238336 175776 50606 -165427 -187663 -68109 167387 -184467
15839a40730L1760A50072c17157C2604M00990E2895R8802J40936b84607j73553
$$ -140730 -108970 150072 -317157 32604 433594 52895 151697 292633 -284607 -458160
15829d58160a00064K7569A16557A3960a36405J8467B8579M3582f6084A10784m0500
$$ -458160 -100064 -72495 116557 13960 -136405 -117938 28579 72161 -66084 110784 70284
15818G0284f2202I1044B5493J03856d819r4960K6905B30129I2725c52663a2885
$$ 70284 -62202 91044 25493 129349 -4819 -99779 -72874 230129 92725 -352663 -12885
15806H111M0200M3194k9641O7891a11849A43433r13c00146J4664a35177k56235
$$ 8111 48311 91505 61864 129755 -111849 143433 142520 -300146 -285482 -135177 -391412
15795c91412J28935M2231A39303c8412j26886P1595k0868A35984c53729c3168
$$ -391412 -262477 -220246 139303 -38412 -165298 -93703 -114571 135984 -353729 -33168
15784a01700l71148c0377n7492A56265l6176b53624A73127h8537j89999B90191
$$ -101700 -472848 -30377 -87869 156265 120089 -253624 173127 -88537 -278536 290191
15773C51090A61072a04575A1498P4600a23016I7207b03206A70784a38150H3600
$$ 351090 161072 -104575 11498 86098 -123016 97207 -203206 170784 -138150 83600
15762a13916r6148j47958B47763O219a0549B7034L1327K37135a4378l4417l58122
$$ -113916 -210064 -358022 247763 253982 -10549 27034 58361 295496 -14378 -48795 -406917
15751d06917a125B26744f1586j43874B7688J96025e3205j8841I3091g5590D2333
$$ -406917 -1125 226744 -61586 -205460 27688 223713 -53205 -72046 93091 -75590 42333
15739g5299A51989c48064H2686b63531b4695j91646D1697P6500D8604J83164J3675
$$ -75299 151989 -348064 82686 -263531 -24695 -216341 41697 118197 48604 231768 245443
15728B45443Q2982b6506B3201i0739r1425F2145L80611c0944j78081j2234A27576
$$ 245443 328425 -26506 23201 -90739 -182164 62145 442756 -30944 -209025 -221259 127576
15716a12012k27000a45451j07477A30996a2071p5338r8211c3418p1385B53110
$$ -112012 -339012 -145451 -252928 130996 -12071 -87409 -185620 -33418 -104803 253110
15705b5788f089j67328A62858h7092A53971a29633d0073J3332r4977n4023P203
$$ -25788 -6089 -173417 162858 -87092 153971 -129633 -40073 -26741 -121718 -175741 -168538
15694a68538j3741C23057d8478A08933K20748a76314H00a23240p3027C03121e2854
$$ -168538 -182279 323057 -48478 108933 329681 -176314 800 -123240 -196267 303121 -52854
15682C26431C5819J74129C216b17551P9799c828A70809B2311J39550f118j54312
$$ 326431 35819 209948 3216 -217551 -137752 -3828 170809 22311 161861 -6118 -160430
15671a60430N681H9559a26612A93082J22926a96161B78675j36148h645G4117b3382
$$ -160430 -154749 89559 -126612 193082 316008 -196161 278675 142527 -8645 74117 -23382
15659A80788C3233i031D8914a57478D5011a36881b1124m06649B06783k2672b65064
$$ 180788 33233 -9031 48914 -157478 45011 -136881 -21124 -427773 206783 184111 -265064
15647b05633K4119C01821a82471r9563D3789R5578F5091h7309j14839e7574m1696
$$ -205633 -181514 301821 -182471 -282034 43789 139367 65091 -87309 -202148 -57574 -99270
15636i9270A52311b37143A02734I458M6096e7519A50195A8361J25645c34070A0666
$$ -99270 152311 -237143 102734 9458 55554 -57519 150195 18361 144006 -334070 10666
15624a96319B21927N7231i6020A18264a38072A4296e8125n8635L677I495R6403
$$ -196319 221927 279158 -96020 118264 -138072 14296 -58125 -116760 -113083 9495 105898
15613A05898E997b77737a7683I6964k5131e4695k1236G1591g419j97800A1498
$$ 105898 5997 -277737 -17683 96964 71833 -54695 -75931 71591 -7419 -205219 11498
15601A51569c02814B57178b76554D4055J9634a92847B99508f7397L0131A6503
$$ 151569 -302814 257178 -276554 44055 63689 -192847 299508 -67397 -37266 16503
15590d17811a14941A99319J67218i2892L6057k33696J31289A18495a06488C790
$$ -417811 -114941 199319 366537 -92892 -56835 -290531 -159242 118495 -106488 3790
15579h5765E522H23K596e4182q9096C1247O0513a64423B4842d1857A81887h1185
$$ -85765 5522 823 3419 -54182 -143278 31247 91760 -164423 24842 -41857 181887 -81185
15566a63441I3604a1347G2132B4571b39640B27633n1337g6342A60771a4020j36144
$$ -163441 93604 -11347 72132 24571 -239640 227633 176296 -76342 160771 -14020 -150164
15555a50164A39314C4398A0327i2393g209q0516B72560l7220i2526A16932J20744
$$ -150164 139314 34398 10327 -92393 -7209 -87725 272560 235340 -92526 116932 237676
15544B37676a59658J7625k89961D6079B1049a36438M6952k8261B96765g9151A31832
$$ 237676 -159658 -142033 -431994 46079 21049 -136438 -89486 -117747 296765 -79151 131832
15532a8704k59863I5875f6894j94490L8316A55223F4390b89247P5252A19199f7035
$$ -18704 -278567 95875 -66894 -261384 -223068 155223 64390 -289247 -213995 119199 -67035
15520B37205K62894C5523p358J67982F2368b24319H6305Q334R6604K1384d2030
$$ 237205 500099 35523 28165 196147 62368 -224319 86305 94639 191243 212627 -42030
15508A3197e9846R555D1887L52343j07206a93859D12968a88170a1515m0563j10034
$$ 13197 -59846 -50291 41887 394230 287024 -193859 412968 -188170 -11515 -52078 -162112
15497a62112P0180p3672l356k202B5110e4979j84280B53198b04945I2a56327B41281
$$ -162112 -91932 -165604 -168960 -171162 25110 -54979 -239259 253198 -204945 92 -156327 241281
15484d413k7065E8995L867P5579E6123k7619a9091F0161K26668a5094j39174B4043
$$ -4413 -31478 58995 62862 138441 56123 28504 -19091 60161 286829 -15094 -154268 24043
15471a51805g0517I1071L45667a96796j70055B91005H0040J89434I3693a4314
$$ -151805 -70517 91071 436738 -196796 -366851 291005 80040 269474 93693 -14314
15460a65055A3675K64674q7710b75073D52412g1608k095A25785d3081k33406J27333
$$ -165055 13675 278349 190639 -275073 452412 -71608 -73703 125785 -43081 -276487 -149154
15449a49154p6433a07136D0609M3649G27b435l38833F929N4576a80300E079g2155
$$ -149154 -225587 -107136 40609 84258 727 -2435 -341268 6929 61505 -180300 5079 -72155
15436E4143b37190H5624R0640a34199B8411f043k9797B19219a43343A46248a28259
$$ 54143 -237190 85624 176264 -134199 28411 -6043 -35840 219219 -143343 146248 -128259
15424A39627e3209k6779q4341g7295B33677C1475L4494b8473C0652a39432H3449
$$ 139627 -53209 -79988 -164329 -77295 233677 31475 65969 -28473 30652 -139432 83449
15412B58K28694a68976o2099h2992B08104O0979A31208O4478G0214a61934j28527
$$ 258 228952 -168976 -231075 -82992 208104 269083 131208 195686 70214 -161934 -290461
15401b90461C1374J4414a03011I3801A327O5198J68208K1297p7674J65087f5730
$$ -290461 31374 45788 -103011 93801 1327 66525 234733 256030 178356 343443 -65730
15389a61206M7549G8646G584f5402C62153c3620B6947c61813g5923A72445a90586
$$ -161206 -113657 78646 7584 -65402 362153 -33620 26947 -361813 -75923 172445 -190586
15377A24402b43512e8721p2k39689J04284G4740J83213i7101G1841A8291a12909
$$ 124402 -243512 -58721 -58793 -298482 -194198 74740 257953 -97101 71841 18291 -112909
15365B93032b1471m4175j971H7699a59788G4138b38039H8780A8743a17282A98110
$$ 293032 -21471 -65646 -67617 87699 -159788 74138 -238039 88780 18743 -117282 198110
15353e6487D29209b2425l1331k38740C17820a32594d2553A99468C2905a88403
$$ -56487 429209 -22425 -53756 -292496 317820 -132594 -42553 199468 32905 -188403
15342A04821O7222K7601a4827D38628I8124k9386O5901b1042n0132A44491N0823
$$ 104821 172043 199644 -14827 438628 98124 68738 134639 -21042 -71174 144491 195314
15331A95314l3486c31013A77019Q5963F9182O7843M4068a07041K7567j15266Q2090
$$ 195314 161828 -331013 177019 262982 69182 137025 181093 -107041 -79474 -194740 -112650
15320a12650b4264E8917J66477b55909R9817l0812B13749B6312J99077a54811
$$ -112650 -24264 58917 225394 -255909 -156092 -186904 213749 26312 225389 -154811
15309E13557f4634C95920j89725h614B37409F4127c09421D10456a63870A43553
$$ 513557 -64634 395920 206195 -8614 237409 64127 -309421 410456 -163870 143553
15298a6305j13931C27704b7487p6085A60796F1178J90402c25273c139B12355d5922
$$ -16305 -130236 327704 -27487 -103572 160796 61178 251580 -325273 -3139 212355 -45922
15286C61724A10545J85759H4071O5943a64193A07557R8501E6772L35583J05219
$$ 361724 110545 296304 84071 150014 -164193 107557 206058 56772 392355 497574
15276D97574I6897J62969I9166a02252p5541B1925b92526a0924L157A08107J80979
$$ 497574 96897 259866 99166 -102252 -177793 21925 -292526 -10924 -7767 108107 289086
15265B89086b37923B54559a02529B409K74302G3946C988a28851C86277E4634K93736
$$ 289086 -237923 254559 -102529 2409 276711 73946 3988 -128851 386277 54634 348370
15254C48370a85950Q0096A05252J83374K64529A09515J60599J08719K36608K54914
$$ 348370 -185950 -105854 105252 288626 553155 109515 270114 378833 615441 870355
15244H70355O24067L39814l28381j42413n29312C04403m0418P4918j06855a94386
$$ 870355 1494422 1834236 1505855 1363442 834130 304403 263985 338903 232048 -194386
15233a49704A98470P2525A18296k005J61742F3360b51016J03981E6692a09525
$$ -149704 198470 270995 118296 116291 278033 63360 -251016 -147035 56692 -109525
15222A54870C1963K37759q9346o6896m790A9660J24628a44503C9942i5074A06703
$$ 154870 31963 269722 180376 113480 108690 19660 144288 -144503 39942 -95074 106703
15210D8579J5638O5013a23814J1434m28521A13706D78L36641C1584J76011J77561
$$ 48579 64217 129230 -123814 -112380 -540901 113706 478 337119 31584 207595 385156
15199C85156A02247J91632A35711K21254e7919k7791D9742a66208j50059B73065
$$ 385156 102247 293879 135711 356965 -57919 -85710 49742 -166208 -316267 273065
15188C51597I3232J16779E4093K6468K70812I0293J10522p0206a36443O5977A62332
$$ 351597 93232 210011 54093 80561 351373 90293 200815 130609 -136443 -70466 162332
15176B8813K48133b4891D64041b56476C2664K39905j32560a03002B31003L03138
$$ 28813 276946 -24891 464041 -256476 32664 272569 140009 -103002 231003 534141
15166E34141A53933J91471b69044B65411G3043P7175a44415C1485J48486K13082
$$ 534141 153933 345404 -269044 265411 73043 150218 -144415 31485 179971 393053
15156C93053G494K13102p572l2938a37428A14093O2248o8911a09400E03427A68697
$$ 393053 7494 220596 213024 180086 -137428 114093 176341 107430 -109400 503427 168697
15144B7138J491p492N3647M2709J69987a69483A09215J86974D1421L01081E2241
$$ 27138 28629 21137 74784 117493 287480 -169483 109215 296189 41421 342502 52241
15132C32806a49769A90538p9B9561j4521N1602K12248n6560L1744D7774M02614
$$ 332806 -149769 190538 190459 29561 15040 66642 278890 222330 254074 47774 450388
15121D50388c16646A25400R5559J45573n5590A08730c8948A79387K26900A88185
$$ 450388 -316646 125400 220959 366532 310942 108730 -38948 179387 406287 188185
15110D54642k16059M090b75438A06540a10627F4042J41306I2573a8577A61787
$$ 454642 238583 242673 -275438 106540 -110627 64042 205348 92573 -18577 161787
15099D6374M014J23024b32914B52256C4611A310M165J50601N4503A84K24469J04386
$$ 46374 50388 173412 -232914 252256 34611 1310 5475 156076 210579 184 224653 329039
15087C29039f2406A7596K7933i659A60699K0043j7632L0547k2734b4254B25959
$$ 329039 -62406 17596 45529 -9659 160699 180742 163110 193657 170923 -24254 225959
15075B16103r7269b3091B5801K10487L7749l7082K78173e636B87366E0232L42218
$$ 216103 118834 -23091 25801 236288 274037 236955 515128 -5636 287366 50232 392450
15064C92450q4444p6211J8065j0635K12256E7942K33488A38695C0654K51569j15726
$$ 392450 308006 231795 249860 239225 451481 57942 291430 138695 30654 282223 166497
15053A66497m8951Q8461q3815Q8569Q9342j22176R7429J66116A12164J67680p7342
$$ 166497 117546 206007 122192 210761 300103 177927 275356 441472 112164 279844 202502
15042B02502A7396R902e3182A05696a22102B71381L60666b61636A88944K86093
$$ 202502 17396 27298 -53182 105696 -122102 271381 632047 -261636 188944 475037
15032D75037A43436Q7090p910A2280K6338J38317c5748D18523j40821j19764o5552
$$ 475037 143436 230526 222616 12280 38618 176935 -35748 418523 277702 157938 92386
15021I2386O8879m6692J88486H4515M8472O2950P6319H3999K62578j59452l1131
$$ 92386 161265 114573 303059 84515 132987 195937 272256 83999 346577 187125 155994
15010A55994K20556r7074O81g096I6831Q1218b4993j99117A24205O4834K5188
$$ 155994 376550 279476 280157 -7096 96831 178049 -24993 -224110 124205 189039 214227
14999B14227R7306B2469K09252q6638K38998B0734J26071o1859N2872n8908J48686
$$ 214227 311533 22469 231721 145083 384081 20734 146805 84946 137818 78910 227596
14988B27596J78190k8206f8474B83630m214J43592j08788j10287K03723A42899
$$ 227596 405786 377580 -68474 283630 279416 423008 314220 203933 407656 142899
14977d5247A81040J03897m9990j09220N1585G6670K82853E412J20191L00598j82594
$$ -45247 181040 284937 234947 125727 177312 76670 359523 5412 125603 426201 243607
14966B43607J53231j84115O097E5966K26148m4527L744L0403j33390J12463a07503
$$ 243607 396838 212723 218820 55966 282114 237587 241331 271734 138344 250807 -107503
14954D34339k4669B4212L36477B3054a29325E84391B72964j13365O4408P7944
$$ 434339 409670 24212 360689 23054 -129325 584391 272964 159599 224007 301951
14944C01951O8551j00571D7076M02724A01006J87763l655O5439j29091J18697
$$ 301951 370502 269931 47076 449800 101006 288769 285114 350553 221462 340159
14934C40159k0910j44809h4041D89420O0437B01789L86985k77512M8792L5977
$$ 340159 319249 174440 -84041 489420 549857 201789 588774 311262 360054 396031
14924C96031J18798B22442L81636A62006m7532K07639j6681N30843l65247p4828
$$ 396031 514829 222442 604078 162006 114474 322113 305432 836275 471028 396200
14914C96200A90977D115L20225H5767J09886M18337p6456k65950R1195j80277
$$ 396200 190977 4115 324340 85767 195653 613990 537534 271584 362779 182502
14904A82502P7679G4214L41103j74481K14302q4129J40730k05461q5581N0937
$$ 182502 260181 74214 415317 240836 455138 371009 511739 306278 220697 271634
14894B71634n5312J93198q2635A25231L58631J17524G579L42793J33942r1289
$$ 271634 216322 409520 326885 125231 483862 601386 7579 350372 484314 393025
14884C93025A68207J28518L82924C06400J19861K11789B85530O4733J02829j60387
$$ 393025 168207 296725 679649 306400 426261 638050 285530 350263 453092 292705
14874B92705K02731q1982A25925K45300A41881P35733l56714A68148K88178j8427
$$ 292705 495436 413454 125925 371225 141881 877614 520900 168148 456326 437899
14864D37899p0541r8504J71890A96416J34380j40079L4355J72757J69043j02726
$$ 437899 367358 268854 440744 196416 330796 190717 225072 397829 566872 464146
14854D64146K20199j68572m4469k3511o6837F1189O80672B88895K33606A73472
$$ 464146 684345 515773 471304 447793 380956 61189 741861 288895 522501 173472
14843A50567L5720N08496l16223j74509J62621j61053L33660K14666k78376k00735
$$ 150567 186287 694783 378560 204051 366672 205619 539279 753945 475569 274834
14833B74834N10190l23700j2687j33187q2375L51168j14065j32002J79378j54164
$$ 274834 785024 461324 448637 315450 233075 584243 470178 338176 517554 363390
14823C63390j36262K2210M93715B01171K25309m3337L69548p3313n8247j01418
$$ 363390 227128 249338 743053 201171 426480 383143 752691 679378 621131 519713
14813E19713j3366m7730J37700n9184l1898D8827M85899J38592k61268K55436
$$ 519713 506347 458617 596317 537133 505235 48827 534726 673318 412050 667486
14803F67486j03541p1711l2534A90826P6921M63996r1584k1333k26919M1193K87802
$$ 667486 563945 492234 459700 190826 267747 731743 640159 618826 391907 433100 720902
14792G20902j63102n8009B24944M88267j43766R578Q209k19133l315J17669j20310
$$ 720902 557800 499791 224944 713211 569445 579023 587232 368099 364784 482453 362143
14781C62143N0623K97891J88834C63617J73875K09787j04919j7511j22353K18188
$$ 362143 412766 710657 899491 363617 537492 747279 642360 624849 502496 720684
14771G20684j83129j00002L00131k21956n3778m80n2722J72103J03209j08104
$$ 720684 537555 437553 737684 515728 461950 461470 408748 580851 684060 575956
14761E75956K89045j67914C40959m640K69630J75666l08023K13861B95819L86166
$$ 575956 865001 697087 340959 336319 605949 781615 473592 687453 295819 681985
14751F81985j61883J48732j52482K37850j713k13759L14255j92836K27733k87733
$$ 681985 520102 668834 516352 754202 752489 538730 852985 660149 887882 600149
14741F00149Q589j10671O1477l6706k4639K64252j02604J923O79j9765K07807
$$ 600149 608738 498067 559544 522838 498199 762451 659847 661770 662449 642684 850491
14730H50491j68147N6549j12956K21655j33728K65659D62508M93892k93969K88450
$$ 850491 682344 738893 625937 847592 713864 979523 462508 956400 662431 950881
14720I50881J4066r2836D08587L83119R0669j39646J30937k36268K49829j13971
$$ 950881 964947 872111 408587 791706 882375 742729 873666 637398 887227 773256
14710G73256k27826K05096J8778j29332K12573m10783L22370K82008k36355j00918
$$ 773256 545430 750526 769304 639972 852545 441762 764132 1046140 809785 708867
14700G08867L46795j82859q7879M0183q9728K68399n4301j08946k03912K27411
$$ 708867 1055662 872803 784924 825107 735379 1003778 949477 840531 636619 864030
14690H64030R9140K84627n08880J28657j34238K34594j12545K88353q1155j40610
$$ 864030 963170 1247797 738917 867574 733336 967930 855385 1143738 1062583 921973
14680I21973j69569N8525M22529m11586J42293p6941J60040k71516k8682M95290
$$ 921973 752404 810929 1233458 821872 964165 887224 1047264 775748 747066 1242356
14670A242356k65274j09025j02687K82185M1050j89458K47835K5926l78469K19013
$$ 1242356 977082 868057 765370 1047555 1088605 899147 1146982 1172908 794439 1013452
14660A013452k60799K51396m6392j3691K24829n9086k0837L7048R2204j59705
$$ 1013452 752653 1004049 957657 943966 1168795 1109709 1088872 1125920 1218124 1058419
14650A058419p2241M36760l88992j08577J76964j129q531j40933J67603K3676
$$ 1058419 986178 1422938 1033946 925369 1102333 1101204 1092673 951740 1119343 1143019
14640A143019K30832l16732K35029l41868M44J5317J69510R3490R6348K02003
$$ 1143019 1373851 1057119 1292148 950280 950724 966041 1135551 1229041 1325389 1527392
14630A527392k98685J1752r3987L33346k79928J58531j60085K85117l08340K87878
$$ 1527392 1228707 1240459 1146472 1479818 1199890 1358421 1198336 1483453 1175113 1462991
14620A462991j82893j47936R6871J42027K25701l24970j72454N80430k76030K30573
$$ 1462991 1280098 1132162 1229033 1371060 1596761 1271791 1099337 1679767 1403737 1634310
14610A634310j98428J8134q3845j04727J98714k22060j2106K06372K17811j92181
$$ 1634310 1435882 1454016 1370171 1265444 1464158 1242098 1229992 1436364 1654175 1461994
14600A461994J47036j30458k6910K74659k93170j19471K93164R640p4432P0397
$$ 1461994 1609030 1478572 1451662 1726321 1433151 1313680 1606844 1616484 1542052 1612449
14590A612449M0333M1976R7086M1416k9489l6861J7980j10221R568R4097L61230
$$ 1612449 1652782 1694758 1791844 1833260 1803771 1766910 1784890 1674669 1684237 1778334 2139564
14579B139564k73341K52405j12546O5071q6167l02j61036L34332l91157J86786
$$ 2139564 1866223 2118628 2006082 2071153 1984986 1984684 1823648 2157980 1766823 1953609
14569A953609K14995N0341o204j94017L9325N75642k23883J9040K8513R2628j50924
$$ 1953609 2168604 2218945 2212741 2018724 2058049 2633691 2409808 2428848 2457361 2549989 2399065
14558B399065K48127J46341J15084R8113M23430M42896k49195N82161J239817
$$ 2399065 2647192 2793533 2908617 3006730 3430160 3873056 3623861 4206022 5445839
14549E445839K420141O580483R844039Q286923M455199j7141618H833015l485715
$$ 5445839 7865980 14446463 24290502 32577425 37032624 19891006 8833015 5347300
14541E347300j086468L38233q76313j230082p81309M13579k38621j5810k42048
$$ 5347300 4260832 4599065 3722752 2492670 1711361 2124940 1886319 1870509 1628461
14532A628461M74500j51253M2162L3647P0440j4042P7977M9020n36115M82171
$$ 1628461 2102961 1951708 1993870 2027517 2097957 2083915 2161892 2210912 1674797 2156968
14522B156968L27626r4883j65135L03167l85815L96782j23058r8763l7893L48213
$$ 2156968 2484594 2389711 2224576 2527743 2141928 2538710 2415652 2316889 2278996 2627209
14512B627209M2799n9891l5501L05570j80210j44190P7405m9467J93958L5303
$$ 2627209 2670008 2610117 2574616 2880186 2699976 2555786 2633191 2583724 2777682 2812985
14502B812985p0736L06696j58944L47959l16261O2038L9714M9118q263J77850
$$ 2812985 2742249 3048945 2890001 3237960 2921699 2983737 3023451 3072569 3064306 3242156
14492C242156J59199k19277J40542R0032j19126K18226l63382K76207q4583r9322
$$ 3242156 3401355 3182078 3322620 3412652 3293526 3511752 3148370 3424577 3339994 3240672
14482C240672K63409j15096L13925R2303J77323r8664l8613J76521l01414O4800
$$ 3240672 3504081 3388985 3702910 3795213 3972536 3873872 3835259 4011780 3710366 3775166
14472C775166J91756k53227N34672n66304L90517q2475J60324J17507N7653j44630
$$ 3775166 3966922 3713695 4248367 3682063 4072580 3990105 4150429 4267936 4325589 4180959
14462D180959K7329L51242k46420M31964k05066K66199L0569J86477k13349J28302
$$ 4180959 4208288 4559530 4313110 4745074 4540008 4806207 4836776 5023253 4809904 4938206
14452D938206K23904l55219K71602R3672k18333K44509K63415J10008o2529J37385
$$ 4938206 5162110 4806891 5078493 5172165 4953832 5198341 5461756 5571764 5509235 5646620
14442E646620k73876L02205K88620P1168j48869l30351N39626n4131K18986k15762
$$ 5646620 5372744 5674949 5963569 6034737 5885868 5555517 6095143 6041012 6259998 6044236
14432F044236N59953k87666M6739K5795J54743j42046L77809L97931m80655O30965
$$ 6044236 6604189 6316523 6363262 6389057 6543800 6401754 6779563 7177494 6696839 7327804
14422G327804j80591O8640L82827K06515l64498L90587L10892J26503k32759M69213
$$ 7327804 7147213 7215853 7598680 7805195 7440697 7831284 8142176 8268679 8035920 8505133
14412H505133k76639J80205k19075P13192l71601N63475m3190M65634k40164J52290
$$ 8505133 8228494 8408699 8189624 8902816 8531215 9094690 9051500 9517134 9276970 9429260
14402I429260J85053J25402J22662L10577R0637Q0027M25719k16848P51261J28338
$$ 9429260 9614313 9739715 9862377 10172954 10263591 10343618 10769337 10552489 11303750 11432088
14392A1432088M00032j041272R01765L45165q7505M20735J37173J04785N37170
$$ 11432088 11832120 10790848 11692613 12037778 11950273 12371008 12508181 12612966 13150136
14383A3150136K17559K49171Q7519K89599J97338P0477L64570K64664j13697O62342
$$ 13150136 13367695 13616866 13704385 13993984 14191322 14261799 14626369 14891033 14777336 15439678
14373A5439678N78060K75587k3582N70291L17174J42984P54525p1565M10717L46946
$$ 15439678 16017738 16293325 16269743 16840034 17157208 17300192 18054717 17983152 18393869 18740815
14363A8740815M67130N83007L33996O77450K96018L63983M66034R25241j96646
$$ 18740815 19207945 19790952 20124948 20802398 21098416 21462399 21928433 22853674 22657028
14354B2657028Q90041N58391O90843K56943O38719M91720R57254R03216N23110
$$ 22657028 23547069 24105460 24796303 25053246 25691965 26183685 27140939 28044155 28567265
14345B8567265N43569R71501Q51506P32341Q34509Q19383J194637M61266J426167
$$ 28567265 29110834 30082335 30933841 31666182 32500691 33320074 34514711 34975977 36402144
14336C6402144J091909P15129J338239R95960J519734J311555R01308J597915
$$ 36402144 37494053 38209182 39547421 40543381 42063115 43374670 44275978 45873893
14328D5873893J178962J817389J713279J700986J165688K487680J916576J991801
$$ 45873893 47052855 48870244 50583523 52284509 53450197 55937877 57854453 59846254
14320E9846254K046880K607010J747421K739766K372472K964246K870085L020278
$$ 59846254 61893134 64500144 66247565 68987331 71359803 74324049 77194134 80214412
14312H0214412L101356L673518L759445L607138L920940M699264M617330M432829
$$ 80214412 83315768 86989286 90748731 94355869 98276809 102976073 107593403 112026232
14304A12026232N215623N231148N592393N392561O548270O656476P103306P286451
$$ 112026232 117241855 122473003 128065396 133457957 140006227 146662703 153766009 161052460
14296A61052460P855562Q764828Q800257R215344J0205733J0696036J0881810
$$ 161052460 168908022 177672850 186473107 195688451 205894184 216590220 227472030
14289B27472030J1227803J2316232J2825114J3201234J3862137J4238284J4313057
$$ 227472030 238699833 251016065 263841179 277042413 290904550 305142834 319455891
14282C19455891J4597314J5146980J5207367J5201018J4613362J4349894J3410959
$$ 319455891 334053205 349200185 364407552 379608570 394221932 408571826 421982785
14275D21982785J1799784R799357M926496k009041j871612l638999N356825j892719
$$ 421982785 433782569 443581926 448508422 446499381 444627769 440988770 446345595 444452876
14267D44452876j639498k800685n932334r930016j2482016j4197003j5129828
$$ 444452876 442813378 440012693 434080359 424150343 411668327 397471324 382341496
14260C82341496j6058103j6153988j6314155j5974611j5588651j5476755j4554397
$$ 382341496 366283393 350129405 333815250 317840639 302251988 286775233 272220836
14253B72220836j4051167j3456264j2412384j1263147j1041426j1077735j0018426
$$ 272220836 258169669 244713405 232301021 221037874 209996448 198918713 188900287
14246A88900287r584572r108343q273624p725160p598617p153665o511628n952482
$$ 188900287 179315715 170207372 161933748 154208588 146609971 139456306 132944678 126992196
14238A26992196n861518n563497n034044n007638m531891m033544l988477l656329
$$ 126992196 121130678 115567181 110533137 105525499 100993608 96960064 92971587 89315258
14230H9315258l583327l482871l454803k887219l172108k721396k540926k593925
$$ 89315258 85731931 82249060 78794257 75907038 72734930 70013534 67472608 64878683
14222F4878683k382561k038535k071944k077351j881888j686415j880863j582561
$$ 64878683 62496122 60457587 58385643 56308292 54426404 52739989 50859126 49276565
14214D9276565j513935j178890j611974j618477r35884j563350r13243j117702
$$ 49276565 47762630 46583740 44971766 43353289 42417405 40854055 39940812 38823110
14206C8823110j014507j170531j089325j209604n49499j230587j10967j347700
$$ 38823110 37808603 36638072 35548747 34339143 33789644 32559057 32448090 31100390
14198C1100390o70422j112424k45617j209431p85071m58359n99289n69779n85225
$$ 31100390 30429968 29317544 29071927 27862496 27077425 26619066 26019777 25449998 24864773
14189B4864773m73978q31126l60503r17321k15127n44910p6268q55322l05918
$$ 24864773 24390795 23559669 23199166 22281845 22066718 21521808 21445540 20590218 20284300
14180B0284300q68836k02548o24578k33102n52218k72802K22312o33593l77297
$$ 20284300 19415464 19212916 18588338 18355236 17803018 17530216 17752528 17118935 16741638
14171A6741638j44865m56145n04708l52048M6464m55669k13066n39610k49494
$$ 16741638 16596773 16140628 15635920 15283872 15330336 14874667 14661601 14121991 13872497
14162A3872497n40007J17294k6107o57231M84548p83128J7482n30291k53137j5306
$$ 13872497 13332490 13449784 13423677 12766446 13250994 12467866 12485348 11955057 11701920 11686614
14152A1686614n93028K68624k20288n21404K09380l68955j98096j52556l0116
$$ 11686614 11093586 11362210 11141922 10620518 10829898 10460943 10262847 10110291 10080175
14143A0080175k9345m59987Q723l97251K18136l79325k09981m8130k40318L50214
$$ 10080175 10050830 9590843 9599566 9202315 9420451 9041126 8831145 8783015 8542697 8892911
14133H892911n67665K85777l12774o5313p4623m15570J03575n9899l63851J14685
$$ 8892911 8325246 8611023 8298249 8232936 8158313 7742743 7846318 7786419 7422568 7537253
14123G537253k42838l7876L8955j81272k03133j58715j35482k8683L86762n03421
$$ 7537253 7294415 7256539 7295494 7114222 6911089 6752374 6616892 6588209 6974971 6471550
14113F471550k86415J35146K4588M5132j95144N3012j4458j05420k28073j26043
$$ 6471550 6185135 6320281 6344869 6390001 6194857 6247869 6233411 6127991 5899918 5773875
14103E773875K27128k15501j36662j84693J59369m13377l6354J69962J30767j68242
$$ 5773875 6001003 5785502 5648840 5464147 5623516 5210139 5173785 5343747 5474514 5306272
14093E306272p3516J58462n45593j9231m5013J98129l91778K60268j65220k3836
$$ 5306272 5232756 5391218 4845625 4826394 4781381 4979510 4587732 4848000 4682780 4658944
14083D658944p6801m865L9988J71305n06535L4557j6230K57259n18380J0432m01630
$$ 4658944 4582143 4577278 4617266 4788571 4282036 4316593 4300363 4557622 4039242 4049674 3648044
14072C648044K50031K10432j62875K96840l6318o6144n02685J57954j20311J8690
$$ 3648044 3898075 4108507 3945632 4242472 4206154 4140010 3637325 3795279 3674968 3693658
14062C693658J26557r7859j32139K53476r1043l43845q9854J74151L07415m47293
$$ 3693658 3820215 3722356 3590217 3843693 3752650 3408805 3318951 3493102 3800517 3353224
14052C353224o6862L07920n81934j08394P0076L61126k03479N2437j13166l13558
$$ 3353224 3286362 3594282 3012348 2903954 2974030 3335156 3131677 3184114 3070948 2757390
14042B757390O7207L0237J92120j43583k03090J49127q9967L94024j94625o2266
$$ 2757390 2824597 2854834 3046954 2903371 2700281 2849408 2759441 3153465 2958840 2896574
14032B896574J02808q6250o0945K99498l81952R7663r5984J17039k87410J05080
$$ 2896574 2999382 2913132 2852187 3151685 2769733 2867396 2771412 2888451 2601041 2706121
14022B706121l81243M41536k1337k04335P0284k70065o7807J83088k34616J77022
$$ 2706121 2324878 2766414 2745077 2540742 2611026 2340961 2273154 2456242 2221626 2398648
14012B398648k40503q1562J38697r9737r1399N38352k64653j8992R5962m93952
$$ 2398648 2158145 2076583 2215280 2115543 2024144 2562496 2297843 2278851 2374813 1880861
14002A880861K10915m2117k65347J34381R0774l3351j2779J20691l84440L56242
$$ 1880861 2091776 2049659 1784312 1918693 2009467 1976116 1963337 2084028 1699588 2055830
13992B055830l22067J58068O53961J203968N482503R199340J0150036J0275306
$$ 2055830 1733763 1891831 2545792 3749760 9232263 18431603 28581639 38856945
13984C8856945j3026224j1800204n831688k849857j209916l99616n24145k3353
$$ 38856945 25830721 14030517 8198829 5348972 4139056 3739440 3215295 3191942
13976C191942k59017m25099j42396K08694m87766L98426j15549k05635J69143
$$ 3191942 2932925 2507826 2365430 2574124 2086358 2484784 2369235 2163600 2332743
13967B332743k27242J30668j04610j92052R7563K29356n00400N42545j69955k76474
$$ 2332743 2105501 2236169 2131559 1939507 2037070 2266426 1766026 2308571 2138616 1862142
13957A862142m34169L31631K11111j88685R2609j82083K4885j28231K84665m27297
$$ 1862142 1427973 1759604 1970715 1782030 1874639 1692556 1717441 1589210 1873875 1446578
13947A446578j46534P36653l31203J39907n2575K3662m3137k39373K03264k42211
$$ 1446578 1300044 2036697 1705494 1845401 1792826 1816488 1773351 1533978 1737242 1495031
13937A495031L9534j84710K47720m9844r201k38189L13232p6479m2022J31190
$$ 1495031 1534565 1349855 1597575 1547731 1538530 1300341 1613573 1537094 1495072 1626262
13927A626262o1590j2662m90243O77259n6305l20462L86801l01887l12639N6749
$$ 1626262 1564672 1552010 1061767 1739026 1682721 1362259 1749060 1447173 1134534 1191283
13917A191283j40278J56065R1564L2388L1054J17985k7699l7358o3357K66353
$$ 1191283 1051005 1207070 1298634 1331022 1362076 1480061 1452362 1415004 1351647 1618000
13907A618000l41542M25637k44667m861j36057j7393J43069k86417l7360j63702
$$ 1618000 1276458 1702095 1457428 1452567 1316510 1299117 1442186 1155769 1118409 954707
13897I54707L50417j9901Q0758l13485j25705J79781K74101o55158M53213P436
$$ 954707 1305124 1285223 1365981 1052496 926791 1106572 1380673 725515 1178728 1186164
13887A186164j06011K91998k85742p2562j43794M18263K15842p32039L77546O7988
$$ 1186164 1080153 1372151 1086409 1013847 870053 1288316 1504158 772119 1149665 1217653
13877A217653k91802j90234M06593k17981K04782J89872o7942R6915F71355L76855
$$ 1217653 925851 735617 1142210 924229 1129011 1318883 1250941 1347856 671355 1048210
13867A048210n0919m4319J32551Q5334n07199L47173J5113k5897l47509L27645
$$ 1048210 997291 952972 1085523 1170857 663658 1010831 1025944 1000047 652538 980183
13857I80183m2675P26K9509k30262j7187L89544j39377K89897l09998K3517j35929
$$ 980183 937508 938234 967743 737481 720294 1109838 970461 1260358 950360 973877 837948
13846H37948J07362r3415k78917M15302j21675r2944O3542j39957M05193D80651
$$ 837948 945310 851895 572978 988280 866605 773661 837203 697246 1102439 480651
13835A141285k65170L1636L8699o7071J34971j95161l26523L87837K51782k92640
$$ 1141285 876115 907751 946450 879379 1014350 819189 492666 880503 1132285 839645
13825H39645l11632M38052j20137K28391j79677Q0600k46780N9342j65242K1581
$$ 839645 528013 966065 845928 1074319 894642 975242 728462 787804 622562 644143
13815F44143Q4301J20380l03671L63682M1437J47812E28398j69541L84135L3907
$$ 644143 728444 848824 545153 908835 950272 1098084 528398 358857 742992 776899
13805G76899j28915J41546C06546J71981M34931m2333C30448M60688N6536P0798
$$ 776899 647984 789530 306546 478527 913458 871125 330448 791136 847672 918470
13795I18470l63407K13878J24968l67309L36783m04510N34674m29886Q8625Q8978
$$ 918470 555063 768941 893909 526600 863383 458873 993547 563661 652286 741264
13785G41264J4941l8551k8787k08005R2824J84801A88049J93029L03081j1185
$$ 741264 756205 717654 688867 480862 573686 758487 188049 381078 684159 672974
13775F72974m5827j91806J22178j97365L86466k56559K54626j94165j77954R7207
$$ 672974 627147 435341 557519 360154 746620 490061 744687 550522 372568 469775
13765D69775O7064q5047M36815m35152m9041K57390B68255N56501j97353j14450
$$ 469775 536839 451792 888607 453455 404414 661804 268255 824756 627403 512953
13755E12953o1639K09943N4541k71527L7619M32006j51788l17687q4974N19442
$$ 512953 451314 661257 715798 444271 481890 913896 762108 444421 359447 878889
13745H78889C17944K28759q8985J38667o4640J85824R8499J0863m06941m2525
$$ 878889 317944 546703 457718 596385 531745 717569 816068 826931 419990 377465
13735C77465N3092P5082k03489K99632k0978j72180Q2652B28697L27694m9685
$$ 377465 430557 505639 302150 601782 580804 408624 491276 228697 556391 506706
13725E06706P2507j74415R0589q3049L04401o4826l2798R3921k15933M7199J27397
$$ 506706 579213 404798 495387 412338 716739 651913 619115 713036 497103 544302 671699
13714F71699J47776l42914K07153j02796j86971O0148J93069k53970A87163J93085
$$ 671699 819475 476561 683714 580918 393947 454095 647164 393194 187163 380248
13704C80248K9753J16598q1683O143A89580j4529K35440J33582q8007M7593j13158
$$ 380248 410001 526599 444916 451059 189580 175051 410491 544073 456066 503659 390501
13693C90501m3399j35003K01212K93965j53227A2559L72831l2612L1322J79292
$$ 390501 347102 212099 413311 707276 554049 12559 385390 352778 384100 563392
13683E63392j48196J14029Q2817j653m6370A48517J66233A35735K97576J55528
$$ 563392 415196 529225 612042 610389 564019 148517 314750 135735 433311 588839
13673E88839j98426K23148q0241K26919K46078D51354N0442j14730L35816B22222
$$ 588839 390413 613561 533320 760239 1006317 451354 501796 387066 722882 222222
13662D90443J43720p4111B43399K24978j5116J76516A21131L46494J69655j11214
$$ 490443 634163 560052 243399 468377 453261 629777 121131 467625 637280 526066
13652E26066j54317r7816J79093K60404B95126m7644K32209p3031N2064A70787
$$ 526066 371749 273933 453026 713430 295126 247482 479691 406660 458724 170787
13641C13392A17326L75269B23388J87370j8027A79087J12494K7766K18709k02191
$$ 313392 117326 492595 223388 410758 392731 179087 291581 319347 538056 335865
13631C35865M2799N4454j03707J1500K7879l3506J51865k21419J47083G9676J04893
$$ 335865 378664 433118 329411 340911 368790 335284 487149 265730 412813 79676 184569
13620A84569l4752n2114K46224Q8978F1125K77444O2843A00726M42081B21247
$$ 184569 149817 97703 343927 432905 61125 338569 401412 100726 542807 221247
13609D27513P360H6733F022K99138q1431N5174J68623r9856J37093L8075D4594
$$ 427513 434873 86733 6022 305160 223729 278903 447526 347670 484763 522838 44594
13597B77420j04555l1763k4273m1023K08361J43954j72248J16345i7065A01372
$$ 277420 172865 141102 116829 75806 284167 428121 255873 372218 -97065 101372
13586D62524o5965j47796o9662H2879d8070E65948F3684r822J95496I6043K39086
$$ 462524 396559 248763 179101 82879 -48070 565948 63684 53862 249358 96043 335129
13575C35129R2458j38703P924n1737j07380K96239A79052K20598p313N508g4198
$$ 335129 427587 288884 296808 245071 137691 433930 179052 399650 392337 397845 -74198
13563A01210K72486J29408k2132J02341A47033K99096k18934j3221a3956B32220
$$ 101210 373696 503104 480972 583313 147033 446129 227195 213974 -13956 232220
13552F5108K55347O7022p228j09227J84764B08653g8548H1225k820O48714A16268
$$ 65108 320455 387477 380249 271022 455786 208653 -78548 81225 78405 727119 116268
13540A40449l0458O7464J3729Q9219K0467n3134L86671D2690c1024D67474c4935
$$ 140449 109991 177455 191184 280403 300870 247736 634407 42690 -31024 467474 -34935
13528D40220k19463I455g7498C74699q8467m0137j9147A4730P7954J20516l5279
$$ 440220 220757 9455 -77498 374699 286232 246095 226948 14730 92684 213200 177921
13517A77921J28674A31779K91479K5797p1760J17880B23028J21066j00356n0764
$$ 177921 306595 131779 423258 449055 377295 495175 223028 344094 243738 192974
13507A92974K96559A90217J2562J19119m6644G2042M01692F0853J2908J29884
$$ 192974 489533 190217 202779 321898 275254 72042 473734 60853 73761 203645
13497B03645i4253d6706D76459A23017a56306f3041D39817N2287A86228L4956
$$ 203645 -94253 -46706 476459 123017 -156306 -63041 439817 492104 186228 221184
13487B21184A09202P4874p475J96036j76752K36579a28916N2348B69706K8671
$$ 221184 109202 184076 176601 372637 195885 432464 -128916 -76568 269706 298377
13477B98377J58680B07897m3643C0028K30852A19174K535J28833A04923K65298
$$ 298377 457057 207897 164254 30028 260880 119174 121709 250542 104923 370221
13467C70221a95013E44227h456G8138J28206B7831a36604B36339j10927l1068
$$ 370221 -195013 544227 -8456 78138 206344 27831 -136604 236339 125412 94344
13457I4344M04788A25031r098J26895J75861J4688A2288f6727C41879n3233n2580
$$ 94344 499132 125031 115933 242828 418689 433377 12288 -66727 341879 288646 236066
13446B36066J4596L07668f6894C39856A45396O1122A3400K54186k2672a55009
$$ 236066 250662 558330 -66894 339856 145396 206518 13400 267586 244914 -155009
13435e1797a7123A52493J28241H116L10588c08745G8797e1743B93652K21412A86076
$$ -51797 -17123 152493 280734 8116 318704 -308745 78797 -51743 293652 515064 186076
13423A29434K12861n1534p6974i7530A01782M6083J73071B8235a33448A44036
$$ 129434 342295 290761 213787 -97530 101782 147865 320936 28235 -133448 144036
13412A26622K01750m9935K33234H7567J59398k4100o8158D2049N0675J82457m7907
$$ 126622 328372 278437 511671 87567 246965 222865 154707 42049 92724 275181 227274
13401B27274O0801N7284q9051J28364A10933a75468C41271J13999j23617g473
$$ 227274 288075 345359 256308 384672 110933 -175468 341271 455270 331653 -7473
13390a23538C14436I726L23952B9915P5743J84082g3807C31230A04896D2795b21339
$$ -123538 314436 9726 333678 29915 105658 289740 -73807 331230 104896 42795 -221339
13378G9671O0523b59149Q810B18788r9657R7757A8216K24046I6506b2906e702
$$ 79671 140194 -259149 -250339 218788 119131 216888 18216 242262 96506 -22906 -5702
13366G6519O4383K23822I5861J68931N3111m2623K43642g694K629C99301A83021
$$ 76519 140902 364724 95861 264792 317903 275280 518922 -7694 -5065 399301 183021
13354C56892A18780E0563K74883b13520D1535d5577J7907A43282C1891L68890
$$ 356892 118780 50563 325446 -213520 41535 -45577 -27670 143282 31891 400781
13344D00781M5416A33465L541N39220k82183P0162A79253N3603l0863a35087B42363
$$ 400781 446197 133465 137006 676226 394043 464205 179253 232856 201993 -135087 242363
13332A51628l4495N2734F8540i2303C07111f6994B18794J34822j41081F7596J90206
$$ 151628 117133 169867 68540 -92303 307111 -66994 218794 353616 212535 67596 257802
13321B57802n3889q0057K84189j66433R252R4890c7916B22614L9994B0794M3241
$$ 257802 203913 123856 408045 241612 250864 345754 -37916 222614 262608 20794 64035
13310F4035Q0741h0913E14789a16560G2054L39257j14869A07053M8513L42651
$$ 64035 144776 -80913 514789 -116560 72054 411311 296442 107053 155566 498217
13300D98217A80337J11428B4537R1707J67435e6095A76542R3392b2207A31574
$$ 498217 180337 291765 24537 116244 283679 -56095 176542 269934 -22207 131574
13289B39480J6462m7668a38667A01691J82493p6794C2837O9428a66127G7823a73744
$$ 239480 255942 208274 -138667 101691 284184 207390 32837 102265 -166127 77823 -173744
13277D73494b28019C32100l1003k4489b4547C8261a90892C2252J60772P57P469
$$ 473494 -228019 332100 301097 276608 -24547 38261 -190892 32252 193024 193781 201250
13266B01250o9898K09712f476G1603K92448A27427e3130k1531A53138E3028J34368
$$ 201250 131352 341064 -6476 71603 364051 127427 -53130 -74661 153138 53028 187396
13255A87396K29275E3449b02667a0713A73431K6758J54107a64647A07491B1961
$$ 187396 416671 53449 -202667 -10713 173431 200189 354296 -164647 107491 21961
13244B59972A25341K97801A26804a26263C54482j67003p63d443k15411A52594
$$ 259972 125341 423142 126804 -126263 354482 187479 186716 -4443 -219854 152594
13233H0812J91996a50043B76296e8177j32462f4472a1563E3573J79849a31583
$$ 80812 272808 -150043 276296 -58177 -190639 -64472 -11563 53573 233422 -131583
13222F5499j2816L29210a4714k19216b6174A46779J42670q2197c5187F7457J41608
$$ 65499 52683 381893 -14714 -233930 -26174 146779 289449 207252 -35187 67457 209065
13211B09065J699o318J60059j51182A5956N5055L10655a69868C4398A091L11808
$$ 209065 210764 204446 364505 213323 15956 71011 381666 -169868 34398 1091 312899
13200C12899f3827k46871E4292J25898H8832R2857K76023E7366O967p59a12710
$$ 312899 -63827 -310698 54292 180190 88832 181689 457712 57366 64333 63574 -112710
13188C33766o7704G9056b54089A58995a42523A44022N3233a79449A61877J63575
$$ 333766 266062 79056 -254089 158995 -142523 144022 197255 -179449 161877 325452
13178C25452g1076C2641O6882N0494O458a5558A20421b3389B33388D2614r927
$$ 325452 -71076 32641 99523 150017 156475 -15558 120421 -23389 233388 42614 32687
13167C2687L13242A65788a19380A7935b33087B26178b94066B53652p3819G5519
$$ 32687 345929 165788 -119380 17935 -233087 226178 -294066 253652 179833 75519
13156a46524C42022D2783e39842B14521E137a90362A80385a39985A99784i0663
$$ -146524 342022 42783 -539842 214521 5137 -190362 180385 -139985 199784 -90663
13145d7351k0490j2292A07838M3974c8315E4151A8728C329R2315H98J15282a21671
$$ -47351 -67841 -80133 107838 151812 -38315 54151 18728 3329 95644 898 116180 -121671
13132A68153L2410q8367K6010o7874K09016J56240A87916A7298a74009H4407a09269
$$ 168153 200563 112196 138206 70332 279348 435588 187916 17298 -174009 84407 -109269
13120B34834K94219a14642k60281H1633L8192K9201g0799B86745e8413A65015
$$ 234834 529053 -114642 -374923 81633 119825 149026 -70799 286745 -58413 165015
13109A48827a20083C22334K8268j45873b40936B06623L8922b12325A78730j0426
$$ 148827 -120083 322334 350602 204729 -240936 206623 245545 -212325 178730 168304
13099A68304b2638k69662J36929c3386I6181c63327b0088l9819h129H9666j3254
$$ 168304 -22638 -292300 -155371 -33386 96181 -363327 -20088 -59907 -8129 89666 76412
13088G6412R6968Q6585f0993D9390d84939b38813d7068A64712K4834H581J48352
$$ 76412 173380 259965 -60993 49390 -484939 -238813 -47068 164712 189546 8581 156933
13077A56933L3318b77628H7184K2767m6453A4818O908L5708J24266O3251d7820
$$ 156933 190251 -277628 87184 109951 63498 14818 21726 57434 181700 244951 -47820
13065A63094h1643A14106a19460C81682a36630C1340K61199M579q3278l6650a21569
$$ 163094 -81643 114106 -119460 381682 -136630 31340 292539 297118 213840 177190 -121569
13053B06982k7557h3111q527F5809J85678G92O6513B0416Q5670K30369I5528M76158
$$ 206982 179425 -83111 -91638 65809 251487 792 67305 20416 106086 336455 95528 571686
13041E71686a70430M5380A21875J5255o5494J46214P2410A8817J08290J25350
$$ 571686 -170430 -125050 121875 137130 71636 217850 290260 18817 127107 252457
13031B52457a81277j4013B84283r0933q5640C0663P350k807K62260D5109K69688
$$ 252457 -181277 -195290 284283 193350 107710 30663 38013 35206 297466 45109 314797
13020C14797k9370j26065a48132G3123K3720N700m042Q5478b0096k4822A40848
$$ 314797 285427 159362 -148132 73123 96843 102543 98501 183979 -20096 -44918 140848
13008C6090J67662a09923A11251l1854c03704f5810F8962K14557b09517A46598
$$ 36090 203752 -109923 111251 79397 -303704 -65810 68962 283519 -209517 146598
12997B35792I2035b55169A40693a8111m1770A38573h100A71889b81026B06943
$$ 235792 92035 -255169 140693 -18111 -59881 138573 -8100 171889 -281026 206943
12986B80092j30466m682M8400a46669N0590c6785j52076B59469a20607B45122
$$ 280092 149626 144944 193344 -146669 -96079 -36785 -188861 259469 -120607 245122
12975a50258M1345C0598p144J16941b84881B0421J35943A6106b62170A23226a58382
$$ -150258 -108913 30598 23454 140395 -284881 20421 156364 16106 -262170 123226 -158382
12963c6025a4451k0264j4965K0871B31794O9171j27972K97118e7363A9949a36259
$$ -36025 -14451 -34715 -49680 -28809 231794 300965 172993 470111 -57363 19949 -136259
12951a80913A360M2883J32059a62346B48704r7942A9504L31921k9322b40149A86292
$$ -180913 1360 44243 176302 -162346 248704 150762 19504 351425 322103 -240149 186292
12939I1058b86851G733K38135r7086a89061B89891a63467K7809j6230G1589L64907
$$ 91058 -286851 7733 245868 148782 -189061 289891 -163467 -135658 -151888 71589 436496
12928D36496f5726A0942a14561D10642A87987l6713a44320E2399J8601k6299N4691
$$ 436496 -65726 10942 -114561 410642 187987 151274 -144320 52399 71000 44701 99392
12917I9392c2808l60713B23556E5961k6618b4621A05785J38663b0510k0411A28889
$$ 99392 -32808 -393521 223556 55961 29343 -24621 105785 244448 -20510 -40921 128889
12905B89378j12552e1381k10997N9418k6706J11041M005C01915j7009A41350J0794
$$ 289378 176826 -51381 -262378 -202960 -229666 -118625 -114620 301915 284906 141350 152144
12894A52144M2330b95020G2701a09024D3989J54489J29148p7110p6404a51607
$$ 152144 194474 -295020 72701 -109024 43989 198478 327626 250516 174112 -151607
12883C23827C174N479J93967b62891E5178J30148E3022a52540C9336K13210a09816
$$ 323827 3174 8653 202620 -262891 55178 185326 53022 -152540 39336 252546 -109816
12871a0825l12685A66778P5754c9661A929J28620o1808J29516a67491A91598H0429
$$ -10825 -323510 166778 242532 -39661 1929 130549 68741 198257 -167491 191598 80429
12859A75568f8785C99050i224j28684B39524j3093L4380b41212O6201O8474D5844
$$ 175568 -68785 399050 -9224 -137908 239524 226431 260811 -241212 -175011 -106537 45844
12847a12359c1609D3238J09507N3456G5147N6936e8399B01677b8008C25376b00971
$$ -112359 -31609 43238 152745 206201 75147 132083 -58399 201677 -28008 325376 -200971
12835A78520f2240j12272C27721H9798L2875a1725r1605k0073A87364B3698d1401
$$ 178520 -62240 -174512 327721 89798 122673 -11725 -103330 -123403 187364 23698 -41401
12823d2473j0726l8362c1134m4923C14825g2254C24569G9871a66958A21360g2276
$$ -42473 -53199 -91561 -31134 -76057 314825 -72254 324569 79871 -166958 121360 -72276
12811C4567L2501J8308A6181J36363n9440a73721G2275d58412I1380O3440K01519
$$ 34567 67068 85376 16181 152544 93104 -173721 72275 -458412 91380 154820 356339
12800C56339B2871J53881a60824C1085g9041c8058A43239l9181a04488I2867f2949
$$ 356339 22871 176752 -160824 31085 -79041 -38058 143239 104058 -104488 92867 -62949
12788g8326p3483A06351j7690b18369A37622c06678a33288C59923c39583B97252
$$ -78326 -151809 106351 88661 -218369 137622 -306678 -133288 359923 -339583 297252
12777A34586b43483B04710a08920j63346A2704Q2245d05749B58259c34908a66477
$$ 134586 -243483 204710 -108920 -272266 12704 94949 -405749 258259 -334908 -166477
12766H6177d9705M832k6676g304j39598A81859b08701H455J48279a2869B69048
$$ 86177 -49705 -44873 -71549 -7304 -146902 181859 -208701 8455 156734 -12869 269048
12754a27287B08930j2218E3484B6491a71683o4832O1895E1502O9580a1897j35288
$$ -127287 208930 196712 53484 26491 -171683 -236515 -174620 51502 121082 -11897 -147185
12743a47185F5689J59371A6881a94516A4382O8104J1162d8526D1127K58292r4334
$$ -147185 65689 225060 16881 -194516 14382 82486 93648 -48526 41127 299419 205085
12732B05085o5810a09108A30422Q5542r9502f5215j88255e7446H1869C6416f1148
$$ 205085 139275 -109108 130422 215964 116462 -65215 -253470 -57446 81869 36416 -61148
12720a4308A91056c724A37785f7847j90531C03568G7124K16601E9442M3989c0328
$$ -14308 191056 -3724 137785 -67847 -258378 303568 77124 293725 59442 103431 -30328
12708a7000B57487j8559l2029J3636A0640J85493r0508K91096a58278H3876C7967
$$ -17000 257487 238928 206899 220535 10640 196133 105625 396721 -158278 83876 37967
12696A2994K05703E5071h9512A05587q598f9845K8530C16388G5779j109f0541
$$ 12994 218697 55071 -89512 105587 96989 -69845 -41315 316388 75779 74670 -60541
12684H8640j6989J99327D8201a9212l2873C67329j44769e8673k306A35901a70661
$$ 88640 71651 270978 48201 -19212 -52085 367329 222560 -58673 -60979 135901 -170661
12672A67468P420j8289j5281A0711M5155L4850R9299a64839F9690J67365O7676
$$ 167468 174888 156599 141318 10711 55866 90716 190015 -164839 69690 237055 304731
12661C04731k4776G6367Q0838J49823n1587b21123A08176b4205j04376L9145C6437
$$ 304731 279955 76367 157205 307028 255441 -221123 108176 -24205 -128581 -89436 36437
12649D55457i9182o6911O2472A07118a46501L2376B47693r2040m5668O451a27641
$$ 455457 -99182 -166093 -103621 107118 -146501 -114125 247693 155653 109985 116436 -127641
12637c2019A26212L4501M6942A00761a74858D7147L70345E3599J17266f0251A04755
$$ -32019 126212 160713 207655 100761 -174858 47147 417492 53599 170865 -60251 104755
12625B33761k3224J26613A42150E1387K89036j03739A2164a52479A22080a39392
$$ 233761 210537 337150 142150 51387 340423 236684 12164 -152479 122080 -139392
12614c93524A14115b60518A24757m2784a08068B2491b30373e0432j33010A30483
$$ -393524 114115 -260518 124757 81973 -108068 22491 -230373 -50432 -183442 130483
12603B1858J91364n7111k9345K12649K59988H950L58956b2434C02846h7254K0236
$$ 21858 213222 156111 126766 339415 599403 8950 367906 -22434 302846 -87254 -67018
12592f7018f181A17509g0400A59873K15505g7027H7615O035b00021e2918G0815
$$ -67018 -6181 117509 -70400 159873 375378 -77027 87615 93650 -200021 -52918 70815
12580a08387E2688a48773B18144a05253I0722l9828K71952A15270e8390J0032
$$ -108387 52688 -148773 218144 -105253 90722 50894 322846 115270 -58390 -48358
12570d8358k35008E3329B1460a47959A92208f1186k1673j66368G069K02999b70044
$$ -48358 -283366 53329 21460 -147959 192208 -61186 -82859 -249227 7069 210068 -270044
12558C8779J54555n909E2129a7035A64153N4138E9952e5062A44831n722b8184
$$ 38779 193334 187425 52129 -17035 164153 218291 59952 -55062 144831 139109 -28184
12546c0622I0337J94851p1724J23343a01231A70866b91216G732K66458j16556
$$ -30622 90337 285188 213464 336807 -101231 170866 -291216 7732 274190 157634
12536A57634J54132A2063g6511p4659H991a00133B04926E3071a35718C7816b75815
$$ 157634 311766 12063 -76511 -151170 8991 -100133 204926 53071 -135718 37816 -275815
12524A86386C9148J46062A9690L52704A56043L0093J18837A26684f22C39429o6246
$$ 186386 39148 185210 19690 372394 156043 186136 304973 126684 -622 339429 273183
12513B73183A33715j7594K63222n3118g1941k01183b2919j34385L0641G1504J1247
$$ 273183 133715 116121 379343 326225 -71941 -273124 -22919 -157304 -126663 71504 82751
12502H2751a26497A53269B7910f2326k1269H6474J17883b81380g3390j9978A78911
$$ 82751 -126497 153269 27910 -62326 -83595 86474 204357 -281380 -73390 -93368 178911
12490a58549A6503L60489f574F3238Q0775J73091j52833k3955D8173K002J44872
$$ -158549 16503 376992 -6574 63238 144013 317104 164271 140316 48173 50175 195047
12479A95047H6666A3337J99361a90305A72847f7009p3932A0229a42998r0218D0465
$$ 195047 86666 13337 212698 -190305 172847 -67009 -140941 10229 -142998 -233216 40465
12467A4172a11413G7406J03374e7653A75351m1002J26992p5478c06104e6941k36296
$$ 14172 -111413 77406 180780 -57653 175351 134349 261341 185863 -306104 -56941 -293237
12456b93237a5038j3230B57841a1285G5141a4460k78209J02142D7526i9165D7931
$$ -293237 -15038 -28268 257841 -11285 75141 -14460 -292669 -190527 47526 -99165 47931
12444d4590j10101K3916j2063H4292B4602M7709a09166d2308q2560n9824m6547
$$ -44590 -154691 -130775 -142838 84292 24602 72311 -109166 -42308 -124868 -184692 -231239
12433b31239j6803D3731N117a19440B91398I5996M5589A6386b8357p4141D3338
$$ -231239 -248042 43731 48848 -119440 291398 95996 141585 16386 -28357 -102498 43338
12421C24925B0912f4031A47400G3125a01746Q934A0412e0433C61034c39051G4472
$$ 324925 20912 -64031 147400 73125 -101746 -92812 10412 -50433 361034 -339051 74472
12409B946i1598j32614A69041o0247A8988J77965q9701D2198J1241O4940j3577
$$ 2946 -91598 -224212 169041 108794 18988 196953 107252 42198 53439 118379 104802
12398A04802a64301e2067B4130c6807j9531B46230A13880d20244d6418j83126
$$ 104802 -164301 -52067 24130 -36807 -56338 246230 113880 -420244 -46418 -229544
12388b29544A4161a05349M1267A72464G9477c3577h77j59110B48774b93770J10829
$$ -229544 14161 -105349 -64082 172464 79477 -33577 -877 -159987 248774 -293770 -182941
12377a82941G9693c1295a2279A838d620j57413c7646C61987j80188a38912d9093
$$ -182941 79693 -31295 -12279 1838 -4620 -162033 -37646 361987 181799 -138912 -49093
12365b24011A19247b56980J05441j27249A61000o6651J61972b82642A18101k2730
$$ -224011 119247 -256980 -151539 -278788 161000 94349 256321 -282642 118101 95371
12355I5371b04013I9934b54044A73949p8833A1678a05998A05568O1572a74759
$$ 95371 -204013 99934 -254044 173949 95116 11678 -105998 105568 167140 -174759
12344g3238j43509B3701L93469j96045d2681I7588K99547j67324c21151A13473
$$ -73238 -216747 23701 417170 221125 -42681 97588 397135 229811 -321151 113473
12333d9437o1835c5488A01396L3613l5676M7387C6998b09182B66287r8689b34469
$$ -49437 -111272 -35488 101396 135009 99333 146720 36998 -209182 266287 167598 -234469
12321A92303a77664I5108J3485a44282I3119a58327l3232q3373O7404A96747J49881
$$ 192303 -177664 95108 108593 -144282 93119 -158327 -191559 -274932 -207528 196747 346628
12310C46628A64073K003a78293B2332b33357D75966b49754A0626c28841J28324
$$ 346628 164073 166076 -178293 22332 -233357 475966 -249754 10626 -328841 -200517
12300b00517e5360o6556C33729D0624a31115A19102b13056i9362B20333F7779
$$ -200517 -55360 -121916 333729 40624 -131115 119102 -213056 -99362 220333 67779
12289c3028k32727a3032A03532a51811C42033I6666a95911j59044F5885i9341
$$ -33028 -265755 -13032 103532 -151811 342033 96666 -195911 -354955 65885 -99341
12278d1244H8184J10570K84114B35182p9692A3213L06358j19549l9932c8941C02853
$$ -41244 88184 198754 482868 235182 155490 13213 319571 200022 160090 -38941 302853
12266b58642e3080o34A25741E059c1207A06516O3510l573E6480J94866F4908k098
$$ -258642 -53080 -53714 125741 5059 -31207 106516 170026 166453 56480 251346 64908 62810
12254F2810K03428c4465B04839J84491j68536b55011C0501J71957I8848f4262
$$ 62810 266238 -34465 204839 389330 220794 -255011 30501 202458 98848 -64262
12243A69312J49505j10875b80361D5293K38840o2068p1362b5215k4227B23764
$$ 169312 318817 207942 -280361 45293 284133 222065 150703 -25215 -49442 223764
12232H3022l0777N8506m9566P0530J23076l9934K99677r2659K34138B93732r8135
$$ 83022 52245 110751 61185 131715 254791 214857 514534 421875 656013 293732 195597
12221A95597C6248j4563J94579m7179L46223A63396P9551K10164j51914M185n2438
$$ 195597 36248 21685 216264 169085 515308 163396 242947 453111 301197 305382 252944
12210B52944O1752i8705A66564J50504A2374L4361M56595A0084K5487P5081K8459
$$ 252944 314696 -98705 166564 317068 12374 46735 503330 10084 35571 110652 139111
12199A39111J59492j35820n9121J87644o2757L25902g9991A93907r3709K34482
$$ 139111 298603 162783 103662 291306 228549 554451 -79991 193907 100198 334680
12189C34680n5336E8590J25045J45276L7737a47280B1196J38938b982B62262j7941
$$ 334680 279344 58590 183635 328911 366648 -147280 21196 160134 -2982 262262 244321
12178B44321j10639e424G9832K32982j14841b1147r7737A66608F6307K64276A54423
$$ 244321 133682 -5424 79832 312814 197973 -21147 -118884 166608 66307 330583 154423
12166B31459Q0204B6469Q8279K98324b7247A94892G9770J15035b3821C49985j60888
$$ 231459 311663 26469 114748 413072 -27247 194892 79770 194805 -23821 349985 189097
12155A89097e4765B18958d8183B04206l6408O6647B0868M403a26082B58856h3410
$$ 189097 -54765 218958 -48183 204206 167798 234445 20868 25271 -126082 258856 -83410
12143g874F3176a12664c2679A177i504F6104J00876g6038K707A2165J39947g9309
$$ -7874 63176 -112664 -32679 1177 -9504 66104 166980 -76038 -73331 12165 152112 -79309
12130A52295f5388C04610a63130J7029A5955K05956G6671O4810C4939a6610o5797
$$ 152295 -65388 304610 -163130 -146101 15955 221911 76671 141481 34939 -16610 -82407
12119h2407B80484f2126m0679A84593r1677K37315g8999A13209n3787J80877D8622
$$ -82407 280484 -62126 -102805 184593 92916 330231 -78999 113209 59422 240299 48622
12107A80491b99261A03831f1706B35308i7537j52381c6196B87324O819a00756
$$ 180491 -299261 103831 -61706 235308 -97537 -249918 -36196 287324 294143 -100756
12096d7164j60428g038j14375F081J77716q5511J18979A8686K6303h9272K3958
$$ -47164 -207592 -7038 -121413 6081 183797 98286 217265 18686 44989 -89272 -65314
12085f5314r9820L463c2821G7097a23490k6047r5593E8804a61971c8112j00385
$$ -65314 -165134 -161671 -32821 77097 -123490 -149537 -245130 58804 -161971 -38112 -138497
12074a38497j0747c1422m24471d6139j19583M9659G3413b34484l9123k44429C81088
$$ -138497 -149244 -31422 -455893 -46139 -165722 -116063 73413 -234484 -273607 -518036 381088
12062I0172b6747D07712N7695L71705P1386R08379o46054E06412B19526a89697
$$ 90172 -26747 407712 465407 837112 908498 1816877 1170823 506412 219526 -189697
12051C34971A35639l4515a72704h1649j8558j29797A32434i1582j86107b0822
$$ 334971 135639 101124 -172704 -81649 -100207 -230004 132434 -91582 -277689 -20822
12040a32983G6768b4877l21192A53424f1473j0058B57886c8993A64578b95305
$$ -132983 76768 -24877 -346069 153424 -61473 -71531 257886 -38993 164578 -295305
12029E5961a23446J7750I9776O3129j6828a76930b9185A72114F0785K29183i4677
$$ 55961 -123446 -105696 99776 162905 146077 -176930 -29185 172114 60785 289968 -94677
12017a52264A00794a54988B24957C9352d58767b06570B3584a46050B31496C9044
$$ -152264 100794 -154988 224957 39352 -458767 -206570 23584 -146050 231496 39044
12006a59489K2606A55767N2336O8471a18976O896A01517J32258A5391a74498j5570
$$ -159489 -136883 155767 208103 276574 -118976 -112080 101517 233775 15391 -174498 -190068
11995a90068A35547a74608A03847b03988G7358a30243A67237n7518b2525p3987
$$ -190068 135547 -174608 103847 -203988 77358 -130243 167237 109719 -22525 -96512
11985i6512B4873K07310A14289c736P01F8772j7177c00921A27047E279a23036
$$ -96512 24873 232183 114289 -3736 -3035 68772 51595 -300921 127047 5279 -123036
11973e6764B43955n1038O3010G8699A506c6146a451q4593D7177a29071B33386
$$ -56764 243955 192917 255927 78699 1506 -36146 -1451 -86044 47177 -129071 233386
11961H7613R0N4180L30812a3422I8648b55550b8966D18281r6151c13689A27667
$$ 87613 87703 141883 472695 -13422 98648 -255550 -28966 418281 322130 -313689 127667
11949I8773b75220J11124A75103b43865a13535A83003b20850A34869l0256l378
$$ 98773 -275220 -164096 175103 -243865 -113535 183003 -220850 134869 104613 101235
11939A01235Q4538e9633m415j3839C3439e2985B220b13319A53518b383k75984
$$ 101235 185773 -59633 -64048 -77887 33439 -52985 2220 -213319 153518 -2383 -278367
11928b78367e1050H4765J19078b67152b6495A07148a64981A13278b01975Q5007
$$ -278367 -51050 84765 203843 -267152 -26495 107148 -164981 113278 -201975 -116968
11918a16968l2711A00086r67J76400G0069g8072D6629P1319C5550a50090B47072
$$ -116968 -149679 100086 99119 275519 70069 -78072 46629 117948 35550 -150090 247072
11906C5561L07022j59937A0956b63922B51419A7043c53182b5861A18384c83194
$$ 35561 342583 182646 10956 -263922 251419 17043 -353182 -25861 118384 -383194
11895i1964G6357b16645M3927Q4422B9439b49859R244M2119f3338j98587C3738
$$ -91964 76357 -216645 -172718 -88296 29439 -249859 -240615 -198496 -63338 -261925 33738
11883a06524o354e5447B25396a25499j91790a52564B8215K87076a78935C32250
$$ -106524 -112878 -55447 225396 -125499 -317289 -152564 28215 315291 -178935 332250
11872a50298A49844Q0202c6565J0435o0421B80001a03322A58257K78572c3759
$$ -150298 149844 230046 -36565 -26130 -86551 280001 -103322 158257 436829 -33759
11861A35455L24578f3401H5676J0803L4050c4401l6A33648a21885k3198P0207
$$ 135455 460033 -63401 85676 96479 130529 -34401 -34437 133648 -121885 -145083 -74876
11850g4876p981b9834p2939A77998a03765k01898a36789D132a74710g1512C8732
$$ -74876 -82857 -29834 -102773 177998 -103765 -305663 -136789 4132 -174710 -71512 38732
11838D16250c3110A97744a31950j7160B0475a25154A65425c3396k11968A18233
$$ 416250 -33110 197744 -131950 -149110 20475 -125154 165425 -33396 -245364 118233
11827a06658K8106A086b06738g7735A9073d3470G0253c8684j15135B12083h106
$$ -106658 -78552 1086 -206738 -77735 19073 -43470 70253 -38684 -153819 212083 -8106
11815H4822J16420q9081A187g0814K220A57516K1324K03040A1093M19250a79257
$$ 84822 201242 112161 1187 -70814 -68594 157516 178840 381880 11093 430343 -179257
11803C8419b9044A23767O3189e2630j39904B09525L7534I6774a54289j01994a1744
$$ 38419 -29044 123767 186956 -52630 -192534 209525 247059 96774 -154289 -256283 -11744
11791B75971H56b40540B62504L2397F9757c2571H7515o286b73110A61088F2959
$$ 275971 856 -240540 262504 294901 69757 -32571 87515 81229 -273110 161088 62959
11779d38541A22883b00407O8756j62764C66491a46871q1064a10408A06806a80925
$$ -438541 122883 -200407 -131651 -294415 366491 -146871 -227935 -110408 106806 -180925
11768E4848L2616a63588g6331b8466A80882c914d03A04897g0270j81219E377a1370
$$ 54848 87464 -163588 -76331 -28466 180882 -3914 -403 104897 -70270 -251489 5377 -11370
11755f8420k19891J10052I5069K0368a18111N5719j41235j61041D7702K3291q765
$$ -68420 -288311 -178259 95069 115437 -118111 -62392 -203627 -364668 47702 70993 62228
11744F2228a03035B13700d08592B83784c37175l2018E3969c33976M0893g3499
$$ 62228 -103035 213700 -408592 283784 -337175 -369193 53969 -333976 -293083 -73499
11733C321b63170q6807P8838H4054b9100D9585b70954O2755R7422B34h9196A95000
$$ 3321 -263170 -349977 -271139 84054 -29100 49585 -270954 -208199 -110777 234 -89196 195000
11720C1678f2F7369a36676b0396O949f511A63855b37177B35851M0067h3550L88
$$ 31678 -62 67369 -136676 -20396 -13447 -6511 163855 -237177 235851 275918 -83550 -83162
11708h3162A77744a77061A90388a31388B17342a34189G8120Q7585K27451H2901
$$ -83162 177744 -177061 190388 -131388 217342 -134189 78120 165705 393156 82901
11697A20555i182H409L05111j19629L2478i0668a1448q4666K233l967c7951j25372
$$ 120555 -9182 8409 313520 193891 226369 -90668 -11448 -96114 -93881 -97848 -37951 -163323
11685a63323B34361E8469g4019B9237L7528J32909e2840o438C6762J37567l8m0615
$$ -163323 234361 58469 -74019 29237 66765 199674 -52840 -59278 36762 174329 174291 133676
11673A33676M933J71460A37260l5371a22111C31554A59403A5478e471A42111B422
$$ 133676 138609 310069 137260 101889 -122111 331554 159403 15478 -5471 142111 2422
11661a88069d3606A33161a35487j18116C0332K12115L55353b58821B14556J4458
$$ -188069 -43606 133161 -135487 -253603 30332 242447 597800 -258821 214556 229014
11651B29014B6095L00383a27620p4448H89K79425M3689C8238J6260L61110e5498
$$ 229014 26095 326478 -127620 -202068 889 280314 324003 38238 54498 415608 -55498
11639A71601J11631f0091j70905A84483k6507b66230D4120K95347b40545l6715
$$ 171601 283232 -60091 -230996 184483 157976 -266230 44120 339467 -240545 -277260
11629b77260e6609B6110K05512G6315b70703C06647A846K22771R0560m3916F7893
$$ -277260 -56609 26110 231622 76315 -270703 306647 1846 224617 315177 271261 67893
11617B9104N5412L3779I396e2622o5539k02831A81144h9657A63621b98185A59018
$$ 29104 84516 118295 9396 -52622 -118161 -320992 181144 -89657 163621 -298185 159018
11605A49821N5613c02j47933C8442a07426A87971l4009d1633G9466P2647e9223
$$ 149821 205434 -302 -148235 38442 -107426 187971 153962 -41633 79466 152113 -59223
11593i799A19058a65678B85760b52262C47757A3636h7358k803B05223a27847B24054
$$ -9799 119058 -165678 285760 -252262 347757 13636 -87358 -90161 205223 -127847 224054
11581a20408D77976A82547a64842F1295K41286a8862C1568a14189d6759A67619
$$ -120408 477976 182547 -164842 61295 302581 -18862 31568 -114189 -46759 167619
11570B14430a28952B76948B4768N0641h3568D14296H4625M1285a4646G5159J18336
$$ 214430 -128952 276948 24768 75409 -83568 414296 84625 125910 -14646 75159 193495
11559A93495m2144n0552d9795B57465K1987b78233b4342A53723K44265F3810J20160
$$ 193495 151351 100799 -49795 257465 279452 -278233 -24342 153723 397988 63810 183970
11548A83970D4388f1827B44724q028l6830C8820D843O4789K6423c062G859b06958
$$ 183970 44388 -61827 244724 236696 199866 38820 4843 69632 96055 -3062 7859 -206958
11535G8277d0374B8987K24261p9573b2360A693i9651C79035a58735B55214j5779
$$ 78277 -40374 28987 253248 173675 -22360 1693 -99651 379035 -158735 255214 239435
11524B39435K57829a18783A117a0873A18685L01633j07158A53407C4372L70269
$$ 239435 497264 -118783 1117 -10873 118685 420318 313160 153407 34372 404641
11514D04641E8431d7234B6719P8560j009L8073o6424L6566P2156G2705K98343
$$ 404641 58431 -47234 26719 105279 104270 142343 75919 112485 184641 72705 371048
11503C71048j3877K05995B62518F2173L76715B16059m3306L00905k09865A6374
$$ 371048 357171 563166 262518 62173 438888 216059 172753 473658 263793 16374
11492C95592c10661H2109a04356E27902B16695n5246D5848h6378A94068j2719
$$ 395592 -310661 82109 -104356 527902 216695 161449 45848 -86378 194068 181349
11482A81349h7177B45286R8777A64765i8696C32092C636L65484N8020b03735C22108
$$ 181349 -87177 245286 344063 164765 -98696 332092 3636 369120 427140 -203735 322108
11470B45743Q7107l1744F5367J91732k375j2166J52732j52818N3585O1617A17085
$$ 245743 332850 301106 65367 257099 254724 242558 395290 242472 296057 357674 117085
11458B67929i1826C18204K4028A32961K06336E7297J33872O6284d9843C90313
$$ 267929 -91826 318204 342232 132961 339297 57297 191169 257453 -49843 390313
11447a78251D16780D2213l960L71041p434j95641J15617H5582J4414C8041O1659
$$ -178251 416780 42213 38253 409294 401860 206219 321836 85582 99996 38041 99700
11436I9700K70455I9938a21590E6429B7714Q9885m6408a72346A69727e5533A06318
$$ 99700 370155 99938 -121590 56429 27714 117599 71191 -172346 169727 -55533 106318
11424A05339L8789o4378f1632D7405b44594H9293j4826d6425j39429E5071J32708
$$ 105339 144128 79750 -61632 47405 -244594 89293 74467 -46425 -185854 55071 187779
11413A87779j5182D8855K02991p4881Q223e8001E6426b69234A75724R4678R3705
$$ 187779 172597 48855 251846 176965 185188 -58001 56426 -269234 175724 270402 364107
11402C64107I5568O1308j9832a30766B61986J56400a47001B7703i7183C46704
$$ 364107 95568 156876 137044 -130766 261986 418386 -147001 27703 -97183 346704
11391A23099c6663A3138Q2951R0601G0533L953R5666b39522C9047J45675h4562
$$ 123099 -36663 13138 96089 186690 70533 74486 170152 -239522 39047 184722 -84562
11379E1714M77646H836b25184J7476A17229h5701A25033i5497A69872a33920A74938
$$ 51714 529360 8836 -225184 -207708 117229 -85701 125033 -95497 169872 -133920 174938
11367b8673H9886j5228M775P9362g5465q1777a9845k44161A12495a33259E1884
$$ -28673 89886 74658 79433 158795 -75465 -157242 -19845 -264006 112495 -133259 51884
11355F7104g4924F3602B1024d1476D0730K4408a95031G3809J27218h1576C37873
$$ 67104 -74924 63602 21024 -41476 40730 65138 -195031 73809 201027 -81576 337873
11343A58868j2187d999A91315j6481l1823e1109A85005g2731k17669A9673P9131
$$ 158868 146681 -4999 191315 174834 143011 -51109 185005 -72731 -290400 19673 98804
11332I8804J73762a96044A237a55281g47j8269A45122R4836b4151E6166b29675
$$ 98804 272566 -196044 1237 -155281 -747 -19016 145122 239958 -24151 56166 -229675
11320A68203l551m8471i8317A92094E4658a88985C0684b07673A30889m4579m1633
$$ 168203 164652 116181 -98317 192094 54658 -188985 30684 -207673 130889 86310 44677
11309D4677N6318h6203b4557A90629b31796l0433c9168A05079M6653b22611f293
$$ 44677 100995 -86203 -24557 190629 -231796 -262229 -39168 105079 151732 -222611 -6293
11297B40252a46327G4691a20054A19497b63266O2904q9731J05493N5425j46557
$$ 240252 -146327 74691 -120054 119497 -263266 -200362 -290093 -184600 -129175 -275732
11287b75732a4368B2671a41541A6046f1804H1282J03876g3146n0631j19851A8497
$$ -275732 -14368 22671 -141541 16046 -61804 81282 185158 -73146 -123777 -243628 18497
11275A37105h0432J4965Q312B67161b16615B8458P3325N8293m4958c41852C4845
$$ 137105 -80432 -65467 -57155 267161 -216615 28458 101783 160076 115118 -341852 34845
11263a27074G6823a78245g3714a833l16060A43454B1715a66200g543k07991D3686
$$ -127074 76823 -178245 -73714 -1833 -317893 143454 21715 -166200 -7543 -215534 43686
11251A56739g6180r0446j83770c1182k20398a5682G9738b31528D2079J2428b34784
$$ 156739 -76180 -166626 -350396 -31182 -251580 -15682 79738 -231528 42079 54507 -234784
11239a12581m0962j68429k7238B1725b15807k7480c5201j38032J6999A12024J16805
$$ -112581 -153543 -321972 -349210 21725 -215807 -243287 -35201 -173233 -156234 112024 228829
11228B28829a71941B7561O2839f4884C43586e1556g128k58376B1599b90291d486
$$ 228829 -171941 27561 90400 -64884 343586 -51556 -7128 -265504 21599 -290291 -4486
11216a40022B9213a56576B0270M5139b09814O9464c2437j17415O0497E6317a67234
$$ -140022 29213 -156576 20270 65409 -209814 -140350 -32437 -149852 -89355 56317 -167234
11204d257B21N2503c9514G1437c0834j72083J4904n3034d4302q8055j25307N6575
$$ -4257 221 52724 -39514 71437 -30834 -202917 -188013 -241047 -44302 -132357 -257664 -201089
11192b01089A15274j6978b12186A90492a46624A3579c21481B12361a24999N609
$$ -201089 115274 98296 -212186 190492 -146624 13579 -321481 212361 -124999 -119390
11182a19390N4163k800A063M72910B14555a4446k47440H2214d19040J29605A34914
$$ -119390 -65227 -68027 1063 473973 214555 -14446 -261886 82214 -419040 -289435 134914
11170A60694c1792B20157a33738G7880d0884a9363j65157B46974F3011B4407N3309
$$ 160694 -31792 220157 -133738 77880 -40884 -19363 -184520 246974 63011 24407 77716
11159G7716J51837a11898L2791l9113m4800c1835j76969Q3228A04186j3689A2547
$$ 77716 229553 -111898 -79107 -118220 -163020 -31835 -208804 -125576 104186 90497 12547
11147g232j71375A31553R7812r1690J01528a80615q0968L1362j82825A72221D0947
$$ -7232 -178607 131553 229365 137675 239203 -180615 -261583 -230221 -413046 172221 40947
11135c93087B61761A25587d879n0004p6233C4857J18818E3484a56646M3615j1958
$$ -393087 261761 125587 -4879 -54883 -131116 34857 153675 53484 -156646 -113031 -124989
11124a24989A32002f7441b6101D47325G6996N0326J46698D2314j4856g6331B43752
$$ -124989 132002 -67441 -26101 447325 76996 127322 274020 42314 27458 -76331 243752
11112B27003j8294e1528E9859J69971L7901j30648K18885l936j19762H4347P3078
$$ 227003 208709 -51528 59859 229830 267731 137083 355968 352032 232270 84347 157425
11101A57425K41641h8977C30020m0974p6585q7497Q6994M63718l03926D5813L70101
$$ 157425 399066 -88977 330020 289046 212461 124964 211958 675676 371750 45813 415914
11090D15914E7937L95397O0505A82346J41269D7172L16163n1605K57108A61080
$$ 415914 57937 453334 513839 182346 323615 47172 363335 311730 568838 161080
11079D25690B2717K10059d0474E53459A85875J53019A66688K40778K5758j69003
$$ 425690 22717 232776 -40474 553459 185875 338894 166688 407466 433224 264221
11069B64221J18259K73463A77772M25197j04840o6659j94877k8249J1782K21087
$$ 264221 382480 655943 177772 602969 498129 431470 236593 208344 220126 441213
11059D41213L59101k62578J71657p2028J52880K55844l69269M7341J13218j14515
$$ 441213 800314 537736 709393 637365 790245 1046089 676820 724161 837379 722864
11049G22864L73911k18546K66579m6162j82663P0203K05559n62640J72687K71524
$$ 722864 1096775 878229 1144808 1098646 915983 986186 1191745 629105 801792 1073316
11039A073316n1844j04984J31493J9853k06951R9432o6772j11995p1638j64778
$$ 1073316 1021472 916488 1047981 1067834 860883 960315 893543 781548 709910 545132
11029E45132O56561m15319L46060l09302J82287p648j79121q4751K05708J11841
$$ 545132 1201693 786374 1132434 823132 1005419 997771 818650 733899 939607 1051448
11019A051448k35405J70940l04641K39470J93207k30467j35802L39002j04523
$$ 1051448 816043 986983 682342 921812 1115019 884552 748750 1087752 983229
11010I83229l4716k78705J07273j6819J42460l47108L96925l5529J52654k99399
$$ 983229 948513 669808 777081 760262 902722 555614 952539 917010 1069664 770265
11000G70265k37817L99732k76120p2969N36664l74979q9736L54705j03822L22261
$$ 770265 532448 932180 656060 583091 1119755 744776 655040 1009745 905923 1228184
10990A228184m1240R6931k05337J02271J8174j17855o8041M41992j51061K54612
$$ 1228184 1186944 1283875 1078538 1180809 1198983 1081128 1013087 1455079 1304018 1558630
10980A558630k38739J80679M15931q5302L07419K09346K95315N7230J76129N9639
$$ 1558630 1319891 1500570 1916501 1831199 2138618 2347964 2643279 2700509 2876638 2936277
10970B936277N82001O26761m4135L48215k06595l09952m66471m24477n67733j51130
$$ 2936277 3518278 4145039 4100904 4449119 4242524 3932572 3466101 3041624 2473891 2322761
10960B322761j80000J89271q6006J11820k46098N094j50336l64395p067k23041
$$ 2322761 2142761 2332032 2246026 2357846 2111748 2116842 1966506 1602111 1595044 1372003
10950A372003J16041o46796m053l8249J10773l01966l00024A46394K18191J70712
$$ 1372003 1488044 841248 837195 798946 909719 607753 307729 146394 364585 535297
10940E35297J93773k50995I8007g5225C85424F4907R7369a14291I0879D3547J61356
$$ 535297 729070 478075 98007 -75225 385424 64907 162276 -114291 90879 43547 204903
10929B04903J27358I0119M9453B6996d4094F0487d5454E1462J13760m9382d0086
$$ 204903 332261 90119 139572 26996 -44094 60487 -45454 51462 165222 115840 -40086
10917A66380L3951a99394C13615n1661B2834K3651f8276J0760j14223A96305H2453
$$ 166380 200331 -199394 313615 261954 22834 46485 -68276 -57516 -171739 196305 82453
10905b01317B95046h7809A51267e9433G0465M23696A60423M4678G5891c11923
$$ -201317 295046 -87809 151267 -59433 70465 494161 160423 205101 75891 -311923
10894c7956A9694b23482R3255K2337L5880A24108a65621o8487I7382b62003a29300
$$ -37956 19694 -223482 -130227 -107890 -72010 124108 -165621 -234108 97382 -262003 -129300
10882i807o8170A40673i9314p4720C0769J10519a4605p9345j30911A56639b85910
$$ -9807 -77977 140673 -99314 -174034 30769 141288 -14605 -93950 -224861 156639 -285910
10870d6155J0048B74210e3886r6227E9658K1333a4772A48207g0249l00817F8991
$$ -46155 -36107 274210 -53886 -150113 59658 80991 -14772 148207 -70249 -371066 68991
10858A900a12374I6348a66083A88566l4115i8329A25965a77875B64258a01985
$$ 1900 -112374 96348 -166083 188566 154451 -98329 125965 -177875 264258 -101985
10847A01798g2395G1062J31590f3577j9182G0815h6728I0645a92688D4090a39946
$$ 101798 -72395 71062 202652 -63577 -82759 70815 -86728 90645 -192688 44090 -139946
10835c17820C9965K7602B1374J565b86060i9464R292d4088j87800A93119A1423
$$ -317820 39965 67567 21374 22939 -286060 -99464 -90172 -44088 -231888 193119 11423
10823A16131K3871F6575a37286j20901A41919K50694A51764n9119N9342J12817
$$ 116131 140002 66575 -137286 -258187 141919 392613 151764 92645 151987 264804
10813B64804a7523n84525b64336a03866p8342N9140M2059j91170d5278E39822
$$ 264804 -17523 -602048 -264336 -103866 -182208 -123068 -81009 -272179 -45278 539822
10802C96353b57164e6715j67500H9472O0298e0927D1282K89971h6826B14230a27244
$$ 396353 -257164 -56715 -224215 89472 149770 -50927 41282 331253 -86826 214230 -127244
10790a15293l9982A12375a23218C2136g8646B21653a21721p4753A35803D3332
$$ -115293 -155275 112375 -123218 32136 -78646 221653 -121721 -196474 135803 43332
10779b71325i2712P793j77399A45714m4090b97334J01406A20949b57631M1850
$$ -271325 -92712 -84919 -262318 145714 101624 -297334 -195928 120949 -257631 -215781
10769b15781c1226k4703G6199I590L8069e4390H4291J9949i1370A20038b81152
$$ -215781 -31226 -55929 76199 9590 47659 -54390 84291 104240 -91370 120038 -281152
10757a85896O289Q6394a786E497b12528B44926a08320q0861A51045a6284A06082
$$ -185896 -179607 -93213 -1786 5497 -212528 244926 -108320 -189181 151045 -16284 106082
10745C2344a58997J1989A0390J6430d32052a75643Q5322J0621A92851a90451B71717
$$ 32344 -158997 -147008 10390 26820 -432052 -175643 -90321 -79700 192851 -190451 271717
10733b88097E7664h7775k08873B16196J226D66b19031F5625k8114J06182a81926
$$ -288097 57664 -87775 -296648 216196 217422 466 -219031 65625 37511 143693 -181926
10721A4649R632K6329J48769E1463a40675k590h009k67114l546Q1507C6202a09903
$$ 14649 24281 50610 199379 51463 -140675 -143265 -8009 -275123 -278669 -197162 36202 -109903
10708I7877a40640A47361a72659c2445j51065k8895e5831A29031J99187j34135
$$ 97877 -140640 147361 -172659 -32445 -183510 -212405 -55831 129031 328218 194083
10698A94083h9780k27083B99070f4251j64984d5284j01766A77559a44481C173
$$ 194083 -89780 -316863 299070 -64251 -229235 -45284 -147050 177559 -144481 3173
10687C9596j9633i5223A14657b84301E3739a26836L4412B45662a78792O5855E1465
$$ 39596 19963 -95223 114657 -284301 53739 -126836 -92424 245662 -178792 -112937 51465
10675I2166d2696C2661A3633J55590C7906d333j65614L3762j35693A36447O5382
$$ 92166 -42696 32661 13633 169223 37906 -4333 -169947 -136185 -271878 136447 201829
10664B01829c38793O2613i6143k26542B00771a99748B17865F2578j2260f4808
$$ 201829 -338793 -276180 -96143 -322685 200771 -199748 217865 62578 50318 -64808
10653e6498B54953b09287r9116K3722a31964A53593a52312r7390L0742g564j6065
$$ -56498 254953 -209287 -308403 -284681 -131964 153593 -152312 -249702 -218960 -7564 -23629
10642b3629A36529M3955n0496b93076I2621e5544m6923A03856b28811J13486m8476
$$ -23629 136529 180484 129988 -293076 92621 -55544 -102467 103856 -228811 -115325 -163801
10631a63801l4964A16425b00922m1650A30736b11360C2696a8836j13539G6218
$$ -163801 -198765 116425 -200922 -242572 130736 -211360 32696 -18836 -132375 76218
10620a52925F5992b28841E9103b87846J03737G4514C6226a47076C5545a07800
$$ -152925 65992 -228841 59103 -287846 -184109 74514 36226 -147076 35545 -107800
10609A09486c37441B5459a93777c945j38534j57077d5983F5489a02586A79289
$$ 109486 -337441 25459 -193777 -3945 -142479 -299556 -45983 65489 -102586 179289
10598A5350N7375M9259J20596J33773c02068C26082A35871n1215b64140H9336
$$ 15350 72725 121984 242580 376353 -302068 326082 135871 84656 -264140 89336
10587h8810C05705a76639Q0154o1922I3678b19518B11734m7681B9926b23828D897
$$ -88810 305705 -176639 -96485 -158407 93678 -219518 211734 164053 29926 -223828 4897
10575a2127q3708o5411O9638A64876J2006b55230B54384h3903E2077J17864a98052
$$ -12127 -95835 -161246 -91608 164876 176882 -255230 254384 -83903 52077 169941 -198052
10563G142L3236q113d0540n2619D14534B1729h1258k47311f7496B3312b75483
$$ 7142 40378 32265 -40540 -93159 414534 21729 -81258 -328569 -67496 23312 -275483
10551b99133F5137e37424b34836d4355p4569j02622A13233b51875C50684h1097
$$ -299133 65137 -537424 -234836 -44355 -118924 -221546 113233 -251875 350684 -81097
10540B55871a73410B41144n7270c80039J36886f2174C9481a17516J9799A15132
$$ 255871 -173410 241144 183874 -380039 -243153 -62174 39481 -117516 -97717 115132
10529b1765j42656A91116F7623b50587a06375d7906H0554a66487A47884N0627
$$ -21765 -164421 191116 67623 -250587 -106375 -47906 80554 -166487 147884 198511
10519A98511o7505a49117k95467c213I8118a04594F9366c84938e6988A75265L4623
$$ 198511 131006 -149117 -444584 -3213 98118 -104594 69366 -384938 -56988 175265 209888
10508B09888I6312c41399B69443a17567A05463a40296m7879N1020C74706p0726
$$ 209888 96312 -341399 269443 -117567 105463 -140296 -188175 -137155 374706 303980
10498C03980a86996H9117P4625p7275a56716A15708O2365l1882M4150j504a16105
$$ 303980 -186996 89117 163742 86467 -156716 115708 178073 146191 190341 188837 -116105
10486A86191c37006E4423h3753a6355k31243C70422a47479b48C79590A60418j1883
$$ 186191 -337006 54423 -83753 -16355 -247598 370422 -147479 -248 379590 160418 148535
10475A48535K55712j6417G7889R137B9654K28359d22948C5192J15419b11710C06
$$ 148535 404247 387830 77889 87026 29654 258013 -422948 35192 150611 -211710 306
10463A29795a09658M7685m4265p1315j46935G5927a0202j03999j4362B30775E0077
$$ 129795 -109658 -61973 -106238 -177553 -324488 75927 -10202 -114201 -128563 230775 50077
10451f4361K1741j2403j4363k74024A04320A3168K34805O4712a31170A95001o4296
$$ -64361 -42620 -55023 -69386 -343410 104320 13168 247973 312685 -131170 195001 130705
10440A30705O776n3685B720J20517Q853J33075c6149G7741N4310F655K3889N149
$$ 130705 137481 83796 2720 123237 132090 265165 -36149 77741 132051 6655 30544 35693
10428C5693A0257a13700R841B212d7207A31498C7202j420g5920I659b8902p1041
$$ 35693 10257 -113700 -103859 2212 -47207 131498 37202 35782 -75920 9659 -28902 -99943
10416i9943H0117k721a10651L0595G1106a77630b8655G5410L1846c0503j38304
$$ -99943 80117 77396 -110651 -80056 71106 -177630 -28655 75410 107256 -30503 -168807
10405a68807I2358L324K14830C5489J80542c8493A05514a54908d3162j43175j1510
$$ -168807 92358 95682 310512 35489 216031 -38493 105514 -154908 -43162 -186337 -197847
10394a97847f2633B07489j7858J96546A10102K96718l5190j03069A13862K40822
$$ -197847 -62633 207489 189631 386177 110102 406820 371630 268561 113862 354684
10384C54684r7199e6365A35277K45593q5796a40136c1891B69791O2284k7827K3079
$$ 354684 257485 -56365 135277 380870 295074 -140136 -31891 269791 332075 304248 327327
10373C27327j9373M9906C9008C898M45101o0027L62476j61989B78907L46165A06049
$$ 327327 307954 357860 39008 3898 448999 388972 751448 589459 278907 625072 106049
10361H69758l66944J6669r4302A37128K50121j45986H0156J49663K55436j87228
$$ 869758 502814 519483 425181 137128 387249 241263 80156 229819 485255 298027
10351B98027K71318L96624j86536B21331K98849K91776C00728L0459L28551m856
$$ 298027 569345 965969 779433 221331 520180 811956 300728 331187 659738 654882
10341F54882A76220O0686J08160P296A25610L50167j63842L6830j62884d3200
$$ 654882 176220 236906 345066 352362 125610 475777 311935 348765 185881 -43200
10330D45570A31517N3569k4099N2753F6377J5517J56677O3018N9121l6643D0577
$$ 445570 131517 185086 160987 213740 66377 81894 238571 301589 360710 324067 40577
10318H1568O3165P4907K8257J80376G4032c00970A76396a02879B12694K1562b13801
$$ 81568 144733 219640 247897 428273 74032 -300970 176396 -102879 212694 234256 -213801
10306A25298a94355p3549P9856d9920B18323a06988j72889A86382l5119a39726
$$ 125298 -194355 -267904 -188048 -49920 218323 -106988 -279877 186382 151263 -139726
10295g466A71867J53208A50853p1631a73618f9233F7624J27484c12050a01333
$$ -7466 171867 325075 150853 79222 -173618 -69233 67624 195108 -312050 -101333
10284A46974c6297M923A7099b5598k8630F8018b76420M2096A6007J74649A4115
$$ 146974 -36297 -31374 17099 -25598 -54228 68018 -276420 -234324 16007 190656 14115
10272A88012a29903E3759b43196i0394L8270k19280P8891B7882a94248E8791a2403
$$ 188012 -129903 53759 -243196 -90394 -52124 -271404 -192513 27882 -194248 58791 -12403
10260I2014A2227c9729B44427k4112B9585J47295P5075L8671J76228j1256k19522
$$ 92014 12227 -39729 244427 220315 29585 176880 251955 290626 466854 455598 236076
10249B36076a21061j9517p1863A35532i3956J3203j27585G1907a71711M4609m0415
$$ 236076 -121061 -140578 -212441 135532 -93956 -80753 -208338 71907 -171711 -127102 -167517
10238a67517p4995J19026b3160A70059c47584B20918b98163A5879a85785Q6419
$$ -167517 -242512 -123486 -23160 170059 -347584 220918 -298163 15879 -185785 -99366
10228i9366F5525b05464h4796d1914G1412L5099d13785a38178j81294a36998B27515
$$ -99366 65525 -205464 -84796 -41914 71412 106511 -413785 -138178 -319472 -136998 227515
10216c9476k4005D13643j67881g6007a8396k32920B14259c26502B3029a58937
$$ -39476 -63481 413643 245762 -76007 -18396 -251316 214259 -326502 23029 -158937
10205i8874o3523G594J87948b54064J3472j14806B818c13734f6479k4523k02907
$$ -98874 -162397 7594 195542 -254064 -240592 -355398 2818 -313734 -66479 -91002 -293909
10194b93909B93903C526J80044G617J2953f4610A16692a05650k30879G9885a15835
$$ -293909 293903 3526 183570 7617 20570 -64610 116692 -105650 -336529 79885 -115835
10182b26493e6834A43665a42036A56246K9664M9192e7368k3700A33049a50412
$$ -226493 -56834 143665 -142036 156246 185910 235102 -57368 -81068 133049 -150412
10171E3136J31921I1944k7593a95168R6425n0928I818c19712q657B95792A01489
$$ 53136 185057 91944 64351 -195168 -98743 -149671 9818 -319712 -328369 295792 101489
10159A98739b12554D2080a08803M5183j1314b8519l6625l9527A57743j5074a52761
$$ 198739 -212554 42080 -108803 -63620 -74934 -28519 -65144 -104671 157743 142669 -152761
10147A20776c72259E0683J60208D4456b00550d7975B48798M0097B2189c6704j24812
$$ 120776 -372259 50683 210891 44456 -200550 -47975 248798 288895 22189 -36704 -161516
10136a61516f6026j19587i921l07023D0680J01865a73310A75671b51744A09662
$$ -161516 -66026 -185613 -9921 -316944 40680 142545 -173310 175671 -251744 109662
10125c39274A16005Q8784I3293a07521M2296k04547H7901f7908j40184e8635e752
$$ -339274 116005 204789 93293 -107521 -65225 -269772 87901 -67908 -208092 -58635 -5752
10113a17359L5072B49763a65452F4860i37F7688a86692M323A67331b90372i2083
$$ -117359 -82287 249763 -165452 64860 -937 67688 -186692 -182369 167331 -290372 -92083
10101c67380J20379A17909b35558B4441b17177P9961A8505M408i2246L0404j4984
$$ -367380 -247001 117909 -235558 24441 -217177 -137216 18505 22913 -92246 -61842 -76826
10090g6826L4927j17111j28412M131N5432n3623B4379N7311I158L2464J34277
$$ -76826 -41899 -159010 -287422 -283291 -227859 -281482 24379 81690 9158 41622 175899
10079A75899J38800b47647I6563a53881e0768j83074A96995M9902L9291A12313
$$ 175899 314699 -247647 96563 -153881 -50768 -233842 196995 246897 286188 112313
10068a76288M5528A83623c00484l2902P2163J8021I4792b19703n5486J9961N8993
$$ -176288 -130760 183623 -300484 -333386 -261223 -243202 94792 -219703 -275189 -255228 -196235
10057a96235d0409F1627K8158a26335p0826N4077l8782h8594j64804g1847j36570
$$ -196235 -40409 61627 89785 -126335 -197161 -143084 -181866 -88594 -253398 -71847 -208417
10046b08417M7276a2006j88834j23731b0338j21637N2762j32559K5189j80771
$$ -208417 -161141 -12006 -200840 -324571 -20338 -141975 -89213 -221772 -196583 -377354
10036c77354a26931D8142a11566j70970B65248B3209b66410a05938A63604F9976
$$ -377354 -126931 48142 -111566 -282536 265248 23209 -266410 -105938 163604 69976
10025i9878k69704A63444a14189A66381p6684d2898B67241h3042A02213g9910
$$ -99878 -369582 163444 -114189 166381 89697 -42898 267241 -83042 102213 -79910
10014f3477j70772A8630K0814a47788m3621O3236I8336J8082f1073B7534a00817
$$ -63477 -234249 18630 39444 -147788 -191409 -128173 98336 116418 -61073 27534 -100817
10002d5915C21750A59837b30107A47571c4492l3808C7961i318B65347A26265j0722
$$ -45915 321750 159837 -230107 147571 -34492 -68300 37961 -9318 265347 126265 115543
9991A15543a85295C95757a29793j60581N141A50405b08903A63253c7734p258j25456
$$ 115543 -185295 395757 -129793 -290374 -285233 150405 -208903 163253 -37734 -44992 -170448
9980a70448a9571m3052p2018I1666b28120C9194i1999B28533b20076j01856J04187
$$ -170448 -19571 -62623 -134641 91666 -228120 39194 -91999 228533 -220076 -321932 -217745
9969b17745R2471p8750b4198A05690h8654G41b52799f9865a9771A34704b03573
$$ -217745 -125274 -204024 -24198 105690 -88654 741 -252799 -69865 -19771 134704 -203573
9957c54100f8736j57344a1663r0345p892l30934J12241f0794I630a58807A06836
$$ -354100 -68736 -226080 -11663 -102008 -109900 -440834 -328593 -60794 9630 -158807 106836
9945c13737A35006a99402f3812B20430k1025d0239r2307D8450a20129L4935o8876
$$ -313737 135006 -199402 -63812 220430 199405 -40239 -132546 48450 -120129 -85194 -154070
9934a54070j61178E5252a4498j33031C912c28979J43830A72176F4910i5814K691
$$ -154070 -315248 55252 -14498 -147529 3912 -328979 -185149 172176 64910 -95814 -93123
9923i3123k36564G8915b5098B5859j0884M5057b70616F7467Q4418a05185K0645
$$ -93123 -329687 78915 -25098 25859 14975 60032 -270616 67467 151885 -105185 -84540
9912h4540A91366K2656i785k224A08183g0192F1400f6275q9799q5713C6321Q3702
$$ -84540 191366 214022 -9785 -12009 108183 -70192 61400 -66275 -156074 -241787 36321 120023
9900A20023c35220R3714k0120L9710o3599E755c81632a51792A00299J28463h8124
$$ 120023 -335220 -241506 -261626 -221916 -285515 5755 -381632 -151792 100299 228762 -88124
9888b1227m695m97353i4692A40685c11084e9100j50700h7262j33904L7968N9734
$$ -21227 -25922 -523275 -94692 140685 -311084 -59100 -209800 -87262 -221166 -183198 -123464
9877a23464C673b19577J01952M0129H2745b80849e9945k08898i5679d4816B86365
$$ -123464 3673 -219577 -117625 -77496 82745 -280849 -59945 -268843 -95679 -44816 286365
9865b34051E0418a3547E4910h6546L3111R449k16226j7142r606A9361a38196a9573
$$ -234051 50418 -13547 54910 -86546 -53435 -43986 -260212 -277354 -286960 19361 -138196 -19573
9852A60827a89102A00158J03037a36385c3571a5601A77461b0644A19902g3772
$$ 160827 -189102 100158 203195 -136385 -33571 -15601 177461 -20644 119902 -73772
9841b7592k33321h447B4368e9289j4004o6750C0779h3563B63240A11760b71491
$$ -27592 -260913 -8447 24368 -59289 -73293 -140043 30779 -83563 263240 111760 -271491
9829A7484P0604b93258A291L2324N9424d19222f5743D1713a24833d4368a6389
$$ 17484 88088 -293258 1291 33615 93039 -419222 -65743 41713 -124833 -44368 -16389
9817a89770G6762c55540a63667l0477A73908a00893k14720F2996a1113m5445B213
$$ -189770 76762 -355540 -163667 -194144 173908 -100893 -315613 62996 -11113 -56558 2213
9805C6866J13385B6211a49431f6351q5271m81301A18446a28944N5304a2543j53547
$$ 36866 150251 26211 -149431 -66351 -151622 -632923 118446 -128944 -73640 -12543 -166090
9794a66090L4536l09071B4710a18473j19730D85627D0334L417O0315m4467f3350
$$ -166090 -131554 -440625 24710 -118473 -238203 485627 40334 43751 104066 59599 -63350
9782c7530m65677b05033K7290q2722d9028k2518g046m02773C0300b97388A29938
$$ -37530 -503207 -205033 -177743 -260465 -49028 -71546 -7046 -409819 30300 -297388 129938
9770D2833d5172j12811k37076f6370l67470A21525h7158A01749a86031b3669A80832
$$ 42833 -45172 -157983 -395059 -66370 -433840 121525 -87158 101749 -186031 -23669 180832
9758b98117B40623m7436a49939L8307J5969r9121A95487G8130J41500G443a74262
$$ -298117 240623 193187 -149939 -111632 -95663 -194784 195487 78130 219630 7443 -174262
9746b83760e0169B11255b68425f5765j38318g3329j65427j73510A30603d93172
$$ -283760 -50169 211255 -268425 -65765 -204083 -73329 -238756 -412266 130603 -493172
9735b10038i1222m1223A5268a62156B16137h4616C40366I9964J64310c8357j64261
$$ -210038 -91222 -132445 15268 -162156 216137 -84616 340366 99964 264274 -38357 -202618
9724b02618Q394D8109a60002J4651j16521i7854j08941O8802B88099b5504F7569
$$ -202618 -194224 48109 -160002 -145351 -261872 -97854 -206795 -137993 288099 -25504 67569
9712a84593H9596a26684A74373b98480B69953I7503B360b31718a08102A73021
$$ -184593 89596 -126684 174373 -298480 269953 97503 2360 -231718 -108102 173021
9701B56670h0818C28242a12798G2107b69702k84266b03892J00852b8119j7784
$$ 256670 -80818 328242 -112798 72107 -269702 -553968 -203892 -103040 -28119 -45903
9691d5903q9672A12989J0296b82692b5502q7602C06685b7741j70169H7582b1431
$$ -45903 -135575 112989 123285 -282692 -25502 -113104 306685 -27741 -197910 87582 -21431
9679b25166C35827b72255i6551K1058o5960j59476J33173K7307f9513m2443J4279
$$ -225166 335827 -272255 -96551 -75493 -141453 -300929 -167756 -140449 -69513 -111956 -97677
9668i7677k5457N4866b6092k41178h2466B12900a46322c4E2328c40999a66317
$$ -97677 -123134 -68268 -26092 -267270 -82466 212900 -146322 -34 52328 -340999 -166317
9656b19908Q2719p620N5812A46856d00784C44412a56991j2933B22623a09525C2705
$$ -219908 -137189 -144809 -88997 146856 -400784 344412 -156991 -169924 222623 -109525 32705
9644e2754D5556L6850e7741A16978b31597M7905A89218p5308a42488n6701B8542
$$ -52754 45556 82406 -57741 116978 -231597 -183692 189218 113910 -142488 -199189 28542
9632a83533Q2727h996B04868p8482J2238b40715j1950p358a27513l665j50541
$$ -183533 -100806 -8996 204868 126386 138624 -240715 -252665 -260023 -127513 -131178 -281719
9621b81719g0688J2864j2359A40562a85334G0879b53112c6077l940r66b799l51433
$$ -281719 -70688 -57824 -70183 140562 -185334 70879 -253112 -36077 -40017 -40983 -2799 -354232
9609c54232i9016k0246p7721G2510M03049E8376d28291b13031j4662a3082j72758
$$ -354232 -99016 -119262 -196983 72510 475559 58376 -428291 -213031 -227693 -13082 -185840
9598a85840n3893a4010A26641b54786A18156a59446N7517j61647i4911a5398j99762
$$ -185840 -239733 -14010 126641 -254786 118156 -159446 -101929 -263576 -94911 -15398 -215160
9587b15160A21b53040p1296A30075b41599o2370A40190b10977A12806J03596a41182
$$ -215160 121 -253040 -324336 130075 -241599 -303969 140190 -210977 112806 216402 -141182
9575i5206G4671F215g2022l6031k70582a53703D7565d52104d8008q6234B1436
$$ -95206 74671 6215 -72022 -108053 -378635 -153703 47565 -452104 -48008 -134242 21436
9563b78109n865L5567J15938A35858a25720A07066c04777q612J8551R978f8745
$$ -278109 -283974 -248407 -132469 135858 -125720 107066 -304777 -313389 -294838 -284860 -68745
9551B4159J59906a52925E0949a5943k97894E2879R4035d0040H3650h3307K7888
$$ 24159 184065 -152925 50949 -15943 -313837 52879 146914 -40040 83650 -83307 -55419
9540e5419A4993a72060h0749M056G3736g814k28324O255J12888j8043B05581A4440
$$ -55419 14993 -172060 -80749 -76693 73736 -7814 -236138 -229883 -116995 -135038 205581 14440
9527A8842d0981q097j28894c3114j63747g9340k00565L7504A5266d73340I8878
$$ 18842 -40981 -49078 -177972 -33114 -196861 -79340 -279905 -242401 15266 -473340 98878
9515A86539a74247E4448m95b50452A2716b790B40147D6979N6816C629c12739h1860
$$ 186539 -174247 54448 53953 -250452 12716 -2790 240147 46979 103795 3629 -312739 -81860
9502d16856a32118k27792i6204H089J09965b61468R9241B59240b36889Q5183b251
$$ -416856 -132118 -359910 -96204 8089 118054 -261468 -162227 259240 -236889 -151706 -2251
9490g259m8866B58301a53163l082M2026b354A19344o265D9412c7099j55507A17120
$$ -7259 -56125 258301 -153163 -156245 -114219 -2354 119344 113079 49412 -37099 -192606 117120
9477a26861k01641p3312P7176A98863M9152a11655j12425a11335A10431J573C0660
$$ -126861 -328502 -401814 -324638 198863 248015 -111655 -224080 -111335 110431 112004 30660
9465b58740E2747B4840j238d12020b1585r6774D0834J74132j03501A2757c55500
$$ -258740 52747 24840 23602 -412020 -21585 -118359 40834 214966 111465 12757 -355500
9453a44656H3833B2897c2633n5414k58123H9408a75457J6120d1925r8518j52514
$$ -144656 83833 22897 -32633 -88047 -346170 89408 -175457 -159337 -41925 -140443 -292957
9442b92957B9397O1398a28694A92131a19200n0828N2929l4976a9803j61830B48520
$$ -292957 29397 90795 -128694 192131 -119200 -170028 -117099 -152075 -19803 -181633 248520
9430A0209a60339C140d1578m06485a79131n4579l2464a4037o3864k30836A5456
$$ 10209 -160339 3140 -41578 -448063 -179131 -233710 -266174 -14037 -77901 -308737 15456
9418c2947j84267l0870M358R4515H9480c8076k38599J27026B6281b24712Q5366
$$ -32947 -217214 -248084 -243726 -149211 89480 -38076 -276675 -149649 26281 -224712 -139346
9407a39346I6121J34966A10300l5935b57510A9274a50021j71569J27177L5408
$$ -139346 96121 231087 110300 74365 -257510 19274 -150021 -321590 -194413 -159005
9397a59005A92231j9393F5960b26948o7685A0166m549O8385a46649A57142D0591
$$ -159005 192231 172838 65960 -226948 -294633 10166 5617 74002 -146649 157142 40591
9385A1157a24718j52568i7225L4991A68875a81051n7856q014O0929G8482b12440
$$ 11157 -124718 -277286 -97225 -62234 168875 -181051 -238907 -246921 -185992 78482 -212440
9373a4437l4881I5422d7607j26650j28418A23883B3069d08583c8456A15837a26663
$$ -14437 -49318 95422 -47607 -174257 -302675 123883 23069 -408583 -38456 115837 -126663
9361H2956a37689l07737a51300L9542m8299j11913b2268C9605e0173j61177d567
$$ 82956 -137689 -445426 -151300 -111758 -160057 -271970 -22268 39605 -50173 -211350 -4567
9349c2110C11764a36107A35817n9854Q6740p6575a55347A77025c50576J41446
$$ -32110 311764 -136107 135817 75963 162703 86128 -155347 177025 -350576 -209130
9339b09130J6283j24724J31711G8173J40664B3394a99022b4931H3757M6367b65685
$$ -209130 -192847 -317571 -185860 78173 218837 23394 -199022 -24931 83757 130124 -265685
9327B09360E8409Q0791A703a75787b9632C7758b8951A23328c3660k16433A319
$$ 209360 58409 139200 1703 -175787 -29632 37758 -28951 123328 -33660 -250093 1319
9315A41257O742b25370A74682C951g9022G6786N2584c36460H9104a08257A04683
$$ 141257 147999 -225370 174682 3951 -79022 76786 129370 -336460 89104 -108257 104683
9303b3195k5155n7967j22884M7907f0059o3903N9087j42506I3636h725m29024
$$ -23195 -48350 -106317 -229201 -181294 -60059 -123962 -64875 -207381 93636 -8725 -437749
9292d37749J73495F5057K69970a44399B15664b91957O2455m73L6514j82519a78243
$$ -437749 -264254 65057 335027 -144399 215664 -291957 -229502 -229975 -193461 -375980 -178243
9280A83450a34850l6618k5256q293j0325A49467G820O8871b6979j92268P0678
$$ 183450 -134850 -171468 -196724 -205017 -215342 149467 7820 76691 -26979 -219247 -148569
9269a48569j06936J19705j33363j63721A2225a12360L1872A02777c5078E1478
$$ -148569 -255505 -135800 -269163 -432884 12225 -112360 -80488 102777 -35078 51478
9258A41398b30661J14713L8307k09052B9991b01502c4248l44228I8622a31157
$$ 141398 -230661 -115948 -77641 -286693 29991 -201502 -34248 -378476 98622 -131157
9247A49698e8256A51142f3671i913B0070a91740L9514B1988L9089i9625o0737
$$ 149698 -58256 151142 -63671 -9913 20070 -191740 -152226 21988 61077 -99625 -160362
9236a60362b2607l4454A07759C0185L5016J24119l615m512h5468n27591K96335
$$ -160362 -22607 -57061 107759 30185 65201 189320 185705 181193 -85468 -613059 -316724
9225c16724J20862I8317i6653B51538d14384A04225g0246C37366H4601i5915A84754
$$ -316724 -195862 98317 -96653 251538 -414384 104225 -70246 337366 84601 -95915 184754
9213a45861B18787a19077p3598b1882j62216Q2750k13762A38839a93238G8314
$$ -145861 218787 -119077 -192675 -21882 -184098 -101348 -315110 138839 -193238 78314
9202i1961c9922j14768b6369A9644b18623a7039l91432a50447g4183j14215p6448
$$ -91961 -39922 -154690 -26369 19644 -218623 -17039 -408471 -150447 -74183 -188398 -264846
9191b64846G7857c41900a39443Q992O4670l7356k18186f9386F6581A1979K26167
$$ -264846 77857 -341900 -139443 -130451 -65781 -103137 -321323 -69386 66581 11979 238146
9180B38146a27536A34207a72475j54424A0606i8191B75667a65509Q975k25121
$$ 238146 -127536 134207 -172475 -326899 10606 -98191 275667 -165509 -156534 -381655
9170c81655O8700A68658g6809A40721a82011A30181j0943b34682C9951a41912
$$ -381655 -312955 168658 -76809 140721 -182011 130181 119238 -234682 39951 -141912
9159a99179D3942d2646k78338O7636a00559G3377a16089k01428d6185j42491C37444
$$ -199179 43942 -42646 -320984 -253348 -100559 73377 -116089 -317517 -46185 -188676 337444
9147a95021D3921b39930i012j21335j4517f9838j48606A02144C4384L14033j46425
$$ -195021 43921 -239930 -9012 -130347 -144864 -69838 -218444 102144 34384 348417 201992
9136B01992B4193a50147c2530m150j15642E9682K08485j19845f0107A53513B2489
$$ 201992 24193 -150147 -32530 -36680 -152322 59682 268167 148322 -60107 153513 22489
9124b71356m3897B1876a78358r6230A45811b2198D80534a44396l1236q6510R4299
$$ -271356 -315253 21876 -178358 -274588 145811 -22198 480534 -144396 -175632 -262142 -167843
9113a67843A7860a26127b7943k5939j86917B54577e8678j06790O6094b3350r0666
$$ -167843 17860 -126127 -27943 -53882 -240799 254577 -58678 -165468 -99374 -23350 -114016
9102a14016e4570P341A26929a86403n835l2307a10607p572I0671a16333D5125
$$ -114016 -54570 -47229 126929 -186403 -192238 -224545 -110607 -118179 90671 -116333 45125
9090E9234e186D3814a03481j94210B35480a40906j48387H7382J5094a3563H9471
$$ 59234 -5186 43814 -103481 -297691 235480 -140906 -289293 87382 102476 -13563 89471
9078f7154q8444C4825c23703h3699l6448A58104a60703A52034b31534J2389O8412
$$ -67154 -155598 34825 -323703 -83699 -120147 158104 -160703 152034 -231534 -219145 -150733
9067a50733j91458A94578b13426f7544G3950Q5258a72162d4376B98933a14550
$$ -150733 -342191 194578 -213426 -67544 73950 159208 -172162 -44376 298933 -114550
9056a93753E3061a09584j84978i797A39386i4029q5817j22839a35348J0471N7162
$$ -193753 53061 -109584 -294562 -9797 139386 -94029 -179846 -302685 -135348 -124877 -67715
9045f7715C5254J33076a19962N7106A30853b72334d8961n4975H9952b19075a02098
$$ -67715 35254 168330 -119962 -62856 130853 -272334 -48961 -103936 89952 -219075 -102098
9033d58110a7866j26091A01790h6202B59104c8735A2619P7714a2270k8938k62215
$$ -458110 -17866 -143957 101790 -86202 259104 -38735 12619 90333 -12270 -41208 -303423
9022c03423a30104j16617G5081a32147B854P0658a73993m1045A77338g9495j70218
$$ -303423 -130104 -246721 75081 -132147 2854 73512 -173993 -215038 177338 -79495 -249713
9011b49713b6380q1944K5132A04084c61108a45426A70984a20959l6276C9521J1235
$$ -249713 -26380 -108324 -83192 104084 -361108 -145426 170984 -120959 -157235 39521 50756
9000E0756g347C62770a58324N8538B69774c12819a02238A36380f3651j17090H6268
$$ 50756 -7347 362770 -158324 -99786 269774 -312819 -102238 136380 -63651 -180741 86268
8988A9598b21169a02895l4589e9421n8345k06523a08331o3535B12688J6859a55428
$$ 19598 -221169 -102895 -137484 -59421 -117766 -324289 -108331 -171866 212688 229547 -155428
8976a51459A07454b10402A98528a75710g734E498K0690P4666O2046C5443a54483
$$ -151459 107454 -210402 198528 -175710 -7734 5498 26188 100854 162900 35443 -154483
8964e2651C11625b08897A8592a54103j55176F1736f0973j84037B10374a42678
$$ -52651 311625 -208897 18592 -154103 -309279 61736 -60973 -245010 210374 -142678
8953A45119a27460A98357a70651c1592r473Q440A87484C6292b10540O9360N1200
$$ 145119 -127460 198357 -170651 -31592 -41065 -32625 187484 36292 -210540 -141180 -89980
8942h9980K036E9926a74195j56060a60288a8474j06666D26345e8333A78643c46648
$$ -89980 -87944 59926 -174195 -330255 -160288 -18474 -125140 426345 -58333 178643 -346648
8930b40290k44005a64189C41771A49404Q7120K27702j715J070544J736578K214817
$$ -240290 -484295 -164189 341771 149404 236524 464226 462511 1533055 3269633 5484450
8920E484450j758895A502114B88997l9562J04545C4458g9625B70794b84700i6107
$$ 5484450 3725555 1502114 288997 249435 353980 34458 -79625 270794 -284700 -96107
8909d36266d066A50481D4227J43226a05670n221F1980E259a36147j14342c0008
$$ -436266 -4066 150481 44227 187453 -105670 -110891 61980 5259 -136147 -250489 -30008
8897A47673g6308k3650C04879b11910B70795j15492d40405A31454b1832p867m93211
$$ 147673 -76308 -99958 304879 -211910 270795 155303 -440405 131454 -21832 -29699 -522910
8886e22910A38133a04298B0662J42595b43400e2407j2164k30504D1670d3260C7102
$$ -522910 138133 -104298 20662 163257 -243400 -52407 -64571 -295075 41670 -43260 37102
8874g600p5638A70050a8977o6084a8612A16576A9926R7148c18257h9281j06034
$$ -7600 -83238 170050 -18977 -85061 -18612 116576 19926 117074 -318257 -89281 -195315
$$ [...]
##END NTUPLES=NMR SPECTRUM
##END=
