##TITLE=AC1683_2985_8571279_yJtKDicOSf
##JCAMPDX= 6.0         $$ Bruker NMR JCAMP-DX V2.0
##DATA TYPE= NMR SPECTRUM
##DATA CLASS= NTUPLES
##ORIGIN= BRUKER
##OWNER= Administrator
$$ 1.72 TOPSPIN		Version 2.1
$$ 2014-04-10 22:20:39.863 -0700  Administrator@X
$$ Compression mode = diff/dup
##.OBSERVE FREQUENCY= 400.02188249412
##.OBSERVE NUCLEUS= ^1H
##.ACQUISITION MODE= SIMULTANEOUS (DQD)
##.ACQUISITION SCHEME= undefined
##.AVERAGES= 64
##.DIGITISER RES= 22
##SPECTROMETER/DATA SYSTEM= spect
##.PULSE SEQUENCE= noesygpps1d.comp
##.SOLVENT NAME= COFFEE_meoh
##.SHIFT REFERENCE= INTERNAL, COFFEE_meoh, 1, 14.96148
##AUDIT TRAIL= $$ (NUMBER, WHEN, WHO, WHERE, PROCESS, VERSION, WHAT)
$$ ##TITLE= Audit trail, TOPSPIN		Version 2.1
$$ ##JCAMPDX= 5.01
$$ ##ORIGIN= Bruker BioSpin GmbH
$$ ##OWNER= Administrator
$$ $$ E:\/data/COFFEE/nmr/AC1683_2985_8571279_yJtKDicOSf/22/pdata/1/auditp.txt
$$ ##AUDIT TRAIL=  $$ (NUMBER, WHEN, WHO, WHERE, PROCESS, VERSION, WHAT)
(   1,<2014-04-10 22:20:33.816 -0700>,<Administrator>,<X>,<go>,<TOPSPIN 2.1>,
      <created by zg
	started at 2014-04-10 22:09:04.111 -0700,
	POWCHK enabled, PULCHK disabled,
       configuration hash MD5:
       C8 4E 4E 5D D3 5C D8 9E 9F 52 82 E0 59 8A DE 15
       data hash MD5: 64K
       24 32 43 F0 22 30 25 A7 5A 9A 68 5F F6 9B 42 30>)
(   2,<2014-04-10 22:20:37.269 -0700>,<Administrator>,<X>,<proc1d>,<TOPSPIN 2.1>,
      <Start of raw data processing
       efp LB = 0.3 FT_mod = 6 PKNL = 1 PHC0 = 0 PHC1 = 0 SI = 128K 
       data hash MD5: 128K
       E6 05 41 16 2F BD F3 BF 5E 9B 13 AF B3 A9 03 AB>)
(   3,<2014-04-10 22:20:38.613 -0700>,<Administrator>,<X>,<proc1d>,<TOPSPIN 2.1>,
      <pk PHC0 = -81.30432 PHC1 = 0 
       data hash MD5: 128K
       81 18 FF 9B 40 BE 26 7A B3 6F 55 0B 92 33 D5 BD>)
(   4,<2014-04-10 22:20:39.238 -0700>,<Administrator>,<X>,<proc1d>,<TOPSPIN 2.1>,
      <abs ABSG = 1 
       data hash MD5: 128K
       6B F9 23 48 43 AA 72 B6 82 35 4C BA B4 67 82 D7>)
(   5,<2014-04-10 22:20:39.347 -0700>,<Administrator>,<X>,<proc1d>,<TOPSPIN 2.1>,
      <abs ABSG = 2 
       data hash MD5: 128K
       15 9A 1E 2D C5 6B AF 20 F2 D7 23 23 12 9D 36 27>)
(   6,<2014-04-10 22:20:39.441 -0700>,<Administrator>,<X>,<proc1d>,<TOPSPIN 2.1>,
      <abs ABSG = 3 
       data hash MD5: 128K
       F1 CD 9C 95 25 62 A4 3E 01 4C 40 55 D0 4F 52 F1>)
(   7,<2014-04-10 22:20:39.534 -0700>,<Administrator>,<X>,<proc1d>,<TOPSPIN 2.1>,
      <abs ABSG = 4 
       data hash MD5: 128K
       CD F5 7C BA 93 7B 6E C4 8D 29 98 D6 77 4D 41 16>)
(   8,<2014-04-10 22:20:39.644 -0700>,<Administrator>,<X>,<proc1d>,<TOPSPIN 2.1>,
      <abs ABSG = 5 
       data hash MD5: 128K
       4E D4 11 29 D6 98 E8 11 9F BC 3D 39 2A 66 48 D4>)
$$ ##END=
$$ 
$$ $$ hash MD5
$$ $$ E5 37 57 7E EA BC 82 C1 68 A8 49 76 82 84 AB FA
##$RELAX= 
##$RELAX= 
##$RELAX= 
##$RELAX= 
##$RELAX= 
##$RELAX= 
##$RELAX= 
##$RELAX= 
$$ Bruker specific parameters
$$ --------------------------
##$DU= <E:\>
##$EXPNO= 22
$$ [...]
##$TP07= 0
##$TPNAME0= <>
##$TPNAME1= <>
##$TPNAME2= <>
##$TPNAME3= <>
##$TPNAME4= <>
##$TPNAME5= <>
##$TPNAME6= <>
##$TPNAME7= <>
##$TPOAL= (0..7)
0.5 0.5 0.5 0.5 0.5 0.5 0.5 0.5
##$TPOFFS= (0..7)
0 0 0 0 0 0 0 0
##$TUNHIN= 0
##$TUNHOUT= 0
##$TUNXOUT= 0
##$USERA1= <user>
##$USERA2= <user>
##$USERA3= <user>
##$USERA4= <user>
##$USERA5= <user>
##$V9= 5
##$VALIST= <valist>
##$VCLIST= <CCCCCCCCCCCCCCC>
##$VD= 0
##$VDLIST= <DDDDDDDDDDDDDDD>
##$VPLIST= <PPPPPPPPPPPPPPP>
##$VTLIST= <TTTTTTTTTTTTTTT>
##$WBST= 1024
##$WBSW= 4
##$XGAIN= (0..3)
0 0 0 0
##$XL= 0
##$YL= 0
##$YMAX_a= 7863493
##$YMIN_a= -14857682
##$ZGOPTNS= <>
##$ZL1= 120
##$ZL2= 120
##$ZL3= 120
##$ZL4= 120
##$ABSF1= 14.96148
##$ABSF2= -5.596702
##$ABSG= 5
##$ABSL= 3
##$ALPHA= 0
##$AQORDER= 0
##$ASSFAC= 0
##$ASSFACI= 0
##$ASSFACX= 0
##$ASSWID= 0
##$AUNMP= <proc_prof1d_extract.lims>
##$AXLEFT= 0
##$AXNAME= <>
##$AXNUC= <1H>
##$AXRIGHT= 0
##$AXTYPE= 0
##$AXUNIT= <>
##$AZFE= 0.1
##$AZFW= 0.1
##$BCFW= 0
##$BC_mod= 0
##$BYTORDP= 0
##$COROFFS= 0
##$CY= 15
##$DATMOD= 1
##$DC= 0
##$DFILT= <>
##$DTYPP= 0
##$F1P= 0
##$F2P= 0
##$FCOR= 0.5
##$FTSIZE= 131072
##$FT_mod= 6
##$GAMMA= 0
##$GB= 0
##$INTBC= 1
##$INTSCL= 1
##$ISEN= 128
##$LB= 0.3
##$LEV0= 0
##$LPBIN= 0
##$MAXI= 10000
##$MC2= 0
##$MEAN= 0
##$ME_mod= 0
##$MI= 0
##$NCOEF= 0
##$NC_proc= -2
##$NLEV= 6
##$NOISF1= 0
##$NOISF2= 0
##$NSP= 0
##$NTH_PI= 0
##$NZP= 0
##$OFFSET= 14.96148
##$PC= 1
##$PHC0= -81.30432
##$PHC1= 0
##$PH_mod= 1
##$PKNL= yes
##$PPARMOD= 0
##$PPDIAG= 0
##$PPIPTYP= 0
##$PPMPNUM= 2147483647
##$PPRESOL= 1
##$PSCAL= 4
##$PSIGN= 0
##$PYNMP= <proc.py>
##$REVERSE= no
##$SF= 400.020009445568
##$SI= 131072
##$SIGF1= 0
##$SIGF2= 0
##$SINO= 400
##$SIOLD= 131072
##$SPECTYP= <>
##$SREGLST= <1H.CDCl3>
##$SSB= 0
##$STSI= 131072
##$STSR= 0
##$SW_p= 8223.68421052631
##$SYMM= 0
##$S_DEV= 0
##$TDeff= 65536
##$TDoff= 0
##$TI= <>
##$TILT= no
##$TM1= 0
##$TM2= 0
##$TOPLEV= 0
##$USERP1= <user>
##$USERP2= <user>
##$USERP3= <user>
##$USERP4= <user>
##$USERP5= <user>
##$WDW= 1
##$XDIM= 131072
##$YMAX_p= 297994588
##$YMIN_p= -117604591
##$CURPLOT= <Network HP LaserJet P1505>
##$CURPRIN= <$Network HP LaserJet P1505>
##$DFORMAT= <normdp>
##$LAYOUT= <+/1D_H.xwp>
##$LFORMAT= <normlp>
##$PFORMAT= <normpl>
##$SURQMSG= 1
$$ End of Bruker specific parameters
$$ ---------------------------------
##NTUPLES= NMR SPECTRUM
##VAR_NAME=  FREQUENCY,     SPECTRUM/REAL,   SPECTRUM/IMAG
##SYMBOL=    X,             R,               I
##VAR_TYPE=  INDEPENDENT,   DEPENDENT,       DEPENDENT
##VAR_FORM=  AFFN,          ASDF,            ASDF
##VAR_DIM=   131072,        131072,          131072
##UNITS=     HZ,            ARBITRARY UNITS, ARBITRARY UNITS
##FACTOR=    0.0627417313425164, 1,          1
##FIRST=     8223.62146879497, 1646,         -71460
##LAST=      0,             3129,            -72223
##MIN=       0,             -117604591,      0
##MAX=       8223.62146879497, 297994588,    0
$$ Real data points
##PAGE= N=1
##DATA TABLE= (X++(R..R)), XYDATA
$$ [...]
61343I45948J5552J4496J2454R647O927M575K076q98l908o263p702q391q649q870
61329I66994r390j0134j0568j0239r209p907o654n551m630l976l631l508l343
61316H78254k771j585lJ485K595L532M647N947P060P645P707P544P492P688P941
61301I45178P870P311O625O357O531O449N370L301R59r29k162l009l846m843n745
61286I75417o009n314m011k786j942j227l87M59J178K023L362N208P241R229J1112
61271I93553J2840J4356J5714J7086J8605K0301K2061K3539K4320K4314K3906
61260A210595K3453K2847K1728J9988J7819J5345J2540R424O079K504j374n518
61248A355430r729j3700j6997j9197k0252k0558k0476j9949j8787j7020j4716
$$ plain form
61343 945948 961500 975996 988450 998097 1005024 1009599 1011675 1010777 1006869 1000606 992904 984513 975864 966994
61329 966994 957604 947470 936902 926663 917454 909547 902893 897342 892712 888736 885105 881597 878254
61316 878254 875483 873898 873895 875380 877975 881507 886154 892101 899161 906806 914513 922057 929549 937237 945178
61301 945178 953048 960359 966984 973341 979872 986321 991691 994992 995951 995022 992860 989851 986005 981162 975417
61286 975417 969408 964094 960083 957297 955355 954128 953741 954200 955378 957401 960763 965971 973212 982441 993553
61271 993553 1006393 1020749 1036463 1053549 1072154 1092455 1114516 1138055 1162375 1186689 1210595
61260 1210595 1234048 1256895 1278623 1298611 1316430 1331775 1344315 1353739 1359818 1362322 1360948 1355430
61248 1355430 1345701 1332001 1315004 1295807 1275555 1254997 1234521 1214572 1195785 1178765 1164049
61237A164049j1792q489n695m141l411k400p29R32K018K775L554M106M062L676
61223A148515L559L862M158M061L685L451L682M339N063N572N984O665P742R010
61209A219348J0266J1519J2856J4352J6112J8107J9910K0972K1326K1729K2915
61198A409412K4869K6863K8065K8128K7399K6605K6127K5568K4355K2591K0937
61187A690919J9637J8120J5636J1994P563K915j491n586r702j3989j7968k1085
61175A696963k3556k5989k8370l0116l1154l2038l2867l3097l2747l2708l3204
61164A361117l3003l1014k7959k5371k3470k1191j8062j4904j2553j0827q980
61153A133783o596l831j209O77J722K564L969O017Q226J0292J2233J3977J5404
$$ plain form
61237 1164049 1152257 1143768 1138073 1133932 1130521 1128121 1127392 1128324 1130342 1133117 1136671 1140777 1144839 1148515
61223 1148515 1152074 1155936 1160094 1164155 1167840 1171291 1174973 1179312 1184375 1189947 1195931 1202596 1210338 1219348
61209 1219348 1229614 1241133 1253989 1268341 1284453 1302560 1322470 1343442 1364768 1386497 1409412
61198 1409412 1434281 1461144 1489209 1517337 1544736 1571341 1597468 1623036 1647391 1669982 1690919
61187 1690919 1710556 1728676 1744312 1756306 1763869 1766784 1765293 1759707 1750005 1736016 1718048 1696963
61175 1696963 1673407 1647418 1619048 1588932 1557778 1525740 1492873 1459776 1427029 1394321 1361117
61164 1361117 1328114 1297100 1269141 1243770 1220300 1199109 1181047 1166143 1153590 1142763 1133783
61153 1133783 1127187 1123356 1122147 1122824 1124546 1127110 1131079 1137096 1145322 1155614 1167847 1181824 1197228
61140A197228J6731J8263J9697K0281J9843J9269J9697K1489K4061K6510K8378
61129A431447K9994L2056L4675L7061L8375L8665L8556L8238L7387L5895L4113
61118A826462L2262L0088K7191K3410J8862J4015R504N499J352l595q971j3753
61106A962326j7627k1241k5100k8910l2214l4983l7274l8934m0015m0955m1991
61095A603082m2894m3460m3806m3838m3050m1275l9111l7116l5069l2593k9987
61084A170883k7786k5835k3548k0888j8312j5899j3315j0681q574p007n220k909
61072I90909r48k25k42L55K087M237O117P898R927J1957J3620J5150J6970J8799
61058A096611J9990K0664K1804K3944K6424K8269K9268K9803L0105L0232L0340
$$ plain form
61140 1197228 1213959 1232222 1251919 1272200 1292043 1311312 1331009 1352498 1376559 1403069 1431447
61129 1431447 1461441 1493497 1528172 1565233 1603608 1642273 1680829 1719067 1756454 1792349 1826462
61118 1826462 1858724 1888812 1916003 1939413 1958275 1972290 1981794 1987293 1988645 1985050 1976079 1962326
61106 1962326 1944699 1923458 1898358 1869448 1837234 1802251 1764977 1726043 1686028 1645073 1603082
61095 1603082 1560188 1516728 1472922 1429084 1386034 1344759 1305648 1268532 1233463 1200870 1170883
61084 1170883 1143097 1117262 1093714 1072826 1054514 1038615 1025300 1014619 1006045 999038 993818 990909
61072 990909 989961 989736 989494 989849 991936 996173 1002290 1010188 1020115 1032072 1045692 1060842 1077812 1096611
61058 1096611 1116601 1137265 1159069 1183013 1209437 1237706 1266974 1296777 1326882 1357114 1387454
61047A387454L0401K9956K8720K7187K5972K4774K2731J9746J6682J4156J1919
61036A639698R577P216M996K722L13j829l271m058m441m499m286l998l607k702
61022A631831r43J621M934R192J4324J9646K4477K8784L2917L7140M1818M7518
61010A893259N4234O1063O7307P3581Q0944Q9281R7586J05811J15489J28236J44677
60999B911468J65199J90942K23258K62643L08763L61289M20416M87013N63040
60990E894031O51710P56513Q78875J015143J154338J279131J371892J423365J437660
60981A5862658J430024J420265J426061J455065J493864J501484J421591J214828
60973B7225840Q89089N00343J21929j90404m11555n40811n97037o21588o72360
$$ plain form
61047 1387454 1417855 1447811 1476531 1503718 1529690 1554464 1577195 1596941 1613623 1627779 1639698
61036 1639698 1649275 1656491 1661487 1664209 1664522 1662693 1659422 1655364 1650923 1646424 1642138 1638140 1634533 1631831
61022 1631831 1630888 1632509 1637443 1646635 1660959 1680605 1705082 1733866 1766783 1803923 1845741 1893259
61010 1893259 1947493 2008556 2075863 2149444 2230388 2319669 2417255 2523066 2638555 2766791 2911468
60999 2911468 3076667 3267609 3490867 3753510 4062273 4423562 4843978 5330991 5894031
60990 5894031 6545741 7302254 8181129 9196272 10350610 11629741 13001633 14424998 15862658
60981 15862658 17292682 18712947 20139008 21594073 23087937 24589421 26011012 27225840
60973 27225840 28114929 28615272 28737201 28546797 28135242 27594431 26997394 26375806 25703446
60964B5703446p97102j002665j249546j478152j642293j723595j725262j661171
60956A4423660j550283j413229j267342j123331r86790q61518p50232o53382n69368
60947E248185m96239m32487l76680l27575k84702k48036k16963j90309j67348
60938B507846j48002j31889j18005j05620r4737q5271p6547o8169o0771n5162
60928A563673n1038m7262m3209l9113l5169l1105k6856k2986k0077j8053j6408
60917A212397j4860j3403j2054j0827r876r282q780q057p369p457q631j0182j1031
60904A080588j0988j0996j1976j3659j4871j4946j4446j4295j4540j4357j3247
60893I32267j1705j0548r935r487r111r138r586r816r231p998o717n613m501l355
$$ plain form
60964 25703446 24906344 23903679 22654133 21175981 19533688 17810093 16084831 14423660
60956 14423660 12873377 11460148 10192806 9069475 8082685 7221167 6470935 5817553 5248185
60947 5248185 4751946 4319459 3942779 3615204 3330502 3082466 2865503 2675194 2507846
60938 2507846 2359844 2227955 2109950 2004330 1909593 1824322 1747775 1679606 1618835 1563673
60928 1563673 1512635 1465373 1422164 1383051 1347882 1316777 1289921 1266935 1246858 1228805 1212397
60917 1212397 1197537 1184134 1172080 1161253 1151377 1142095 1133315 1125258 1117889 1110432 1101801 1091619 1080588
60904 1080588 1069600 1058604 1046628 1032969 1018098 1003152 988706 974411 959871 945514 932267
60893 932267 920562 910014 900079 890592 881481 872343 862757 852941 843710 835712 828995 823382 818881 815526
60879H15526k480k026j797j528r61K26K067L803M422L965L644M291N351N910O030
60864H46443O333O847P193P529Q252Q993Q997Q418Q185Q496Q586Q152P822P898
60850I58144P843P555P842Q745Q707O591L648K002J795J297m19k425l651m219
60836A003455m748n394o091o906p728q273q713r623j1007j2070j2318j2192j2192
60823H86200j2022j1248j0217r609r363q742p481o193n555n445n168m365l406
60810G87386k846k659k286j450n77j54j3L45R12J308J570K215L321M188M231L755
60794G99246L607M250N496O792P658P953P994Q248Q807R323R448R161Q650Q206
60780I04839Q108Q352Q516Q276P903P794P651O831N563M973N622O687P061O696
$$ plain form
60879 815526 813046 811020 809223 807695 806734 806960 809027 812830 817252 821217 824861 829152 834503 840413 846443
60864 846443 852776 859623 866816 874345 882597 891590 900587 909005 917190 925686 934272 942424 950246 958144
60850 958144 965987 973542 981384 990129 998836 1005427 1009075 1011077 1012872 1014169 1013750 1011325 1007674 1003455
60836 1003455 998707 993313 987222 980316 972588 964315 955602 945979 934972 922902 910584 898392 886200
60823 886200 874178 862930 852713 843104 833741 824999 817518 811325 805770 800325 795157 790792 787386
60810 787386 784540 781881 779595 778145 777568 777414 777401 777746 778658 779966 781536 783751 787072 791260 795491 799246
60794 799246 802853 807103 812599 819391 827049 835002 842996 851244 860051 869374 878822 887983 896633 904839
60780 904839 912947 921299 929815 938091 945994 953788 961439 968270 973833 978806 984428 991115 998176 1004872
60766A004872O336O380O537O419N926N238M757M850N427N948O085O101O331O659
60752A087866O826O924P192P586P885Q037Q168Q461R168J0394J1706J2433J2549
60739A205195J2777J3502J4178J4271J4156J4435J4970J5316J5613J6196J6633
60728A367242J6159J4867J3613J2797J2075J1144R939Q052N044J512j258k981
60716A468205m806p512j0253j1795j2303j2967j4396j6241j8094j9895k1436k2334
60704A296173k2670k3056k3822k4503k4481k3824k3226k3138k3151k2384k0519
60693A041399j8333j6993j6778j6852j6345j5312j4272j3235j1774r952q563q203
60681H74787q548q759q313p216n734m303l420l281l520l634l559l526l364k538
$$ plain form
60766 1004872 1011208 1017588 1024125 1030544 1036470 1041708 1046465 1051315 1056742 1062690 1068775 1074876 1081207 1087866
60752 1087866 1094692 1101616 1108808 1116394 1124279 1132316 1140484 1148945 1158113 1168507 1180213 1192646 1205195
60739 1205195 1217972 1231474 1245652 1259923 1274079 1288514 1303484 1318800 1334413 1350609 1367242
60728 1367242 1383401 1398268 1411881 1424678 1436753 1447897 1457836 1465888 1470932 1472444 1471186 1468205
60716 1468205 1463399 1455887 1445634 1433839 1421536 1408569 1394173 1377932 1359838 1339943 1318507 1296173
60704 1296173 1273503 1250447 1226625 1202122 1177641 1153817 1130591 1107453 1084302 1061918 1041399
60693 1041399 1023066 1006073 989295 972443 956098 940786 926514 913279 901505 891553 882990 874787
60681 874787 866239 857480 849167 841951 836217 831914 828494 825213 821693 818059 814500 810974 807610 805072
60667H05072j017L50P46L96K07N70J054J237J254J311J241R08P31J290K603M078
60651H22031N139N524N219M496L973M175M886N293M894M037L379L105K776J869
60637H80796M14q16q91K30J351J196j48j425j934k301l249m364m770m570m717
60622H54802n571o458o681o297n758n466n805o916q104q208p007n713n492o045
60608G65281o273n828n183m573l837l187l129l424l093j749k05O18P08M90K1p42
60592G25895j387j440j010m70J34Q38J259J034N77O49J291J788J744J490J339
60577G33731J137Q12Q48J760L314M683N258N182N121N618O648P792Q777R680J0599
60562H10960J1446J2255J3251J4267J4598J3881J2785J2096J1488J0038P776N689
$$ plain form
60667 805072 804055 804405 805151 805547 805754 806324 807378 808615 809869 811180 812421 813329 814060 815350 817953 822031
60651 822031 827170 832694 837913 842409 846382 850557 855443 860736 865630 869667 873046 876151 878927 880796
60637 880796 881210 880394 879503 879733 881084 882280 882132 880707 878773 876472 873223 868859 864089 859519 854802
60622 854802 849231 842773 836092 829795 824037 818571 812766 805850 797746 789538 782531 776818 771326 765281
60608 765281 759008 753180 747997 743424 739587 736400 733271 729847 726754 725005 724800 725418 726126 726616 726637 725895
60592 725895 724508 723068 722058 721588 721722 722560 723819 724853 725430 726079 727370 729158 730902 732392 733731
60577 733731 734868 735680 736528 738288 741602 746285 751543 756725 761846 767464 774112 781904 790681 800361 810960
60562 810960 822406 834661 847912 862179 876777 890658 903443 915539 927027 937065 944841 950530
60550I50530M158K450J42j999l137l574m050m474m153k919j267N07K544M861P149
60535I46768R183J1016J2694J4074J4981J5307J4984J4137J3121J2212J1239R800
60523A099516P760N361K882L61k225m681o517p299p177o974p376q044p884o325
60509A051378l955j681K70K199M158N843P155Q439J0137J2396J5098J8035K1100
60496A150572K4315K7698L1122L4512L7975M1571M4931M7493M9048M9754M9640
60485A588631M8575M6606M3735L9393L2840K4313J5020N718l950j4281k4575l3895
60473A768130m2076m9175n4648n7967n9618o0423o0193n8063n4074m9468m5302
60462A177123m1642l8255l5206l2457k9549k6235k2973k0422j8629j7031j5134
$$ plain form
60550 950530 954688 957138 957280 955281 952144 948570 944520 940046 935893 932974 931707 932214 934758 939619 946768
60535 946768 955951 966967 979661 993735 1008716 1024023 1039007 1053144 1066265 1078477 1089716 1099516
60523 1099516 1107276 1112637 1115519 1115880 1113655 1108974 1102457 1095158 1087981 1081007 1073631 1065587 1057703 1051378
60509 1051378 1047423 1045742 1046012 1048211 1052369 1058212 1065367 1073806 1083943 1096339 1111437 1129472 1150572
60496 1150572 1174887 1202585 1233707 1268219 1306194 1347765 1392696 1440189 1489237 1538991 1588631
60485 1588631 1637206 1683812 1727547 1766940 1799780 1824093 1839113 1844831 1840881 1826600 1802025 1768130
60473 1768130 1726054 1676879 1622231 1564264 1504646 1444223 1384030 1325967 1271893 1222425 1177123
60462 1177123 1135481 1097226 1062020 1029563 1000014 973779 950806 930384 911755 894724 879590
60451H79590j3035j1324j0446j0151r740q916q021p294o388n098m051l990m640
60438G76496m987m539l615k578j619j215j814k910l238k357j269j058j495j543
60424G42259q36J3M35O05J034J765K281K218J855J692J647J173K87j60L82J288
60408G57938J659J568J680K050K225K341K984L945M206L471K726K829L378L529
60394G96529L171K727K387K179K339K923L395L231K636K236K274K530K809L009
60380H34375K886K282J466R49R35J276J754K193K407K318K104J997K049K169K195
60365H63355J914J274P02P88J452J883J606J191J462K358L146L559M038M882N689
60350H99299N887N483N043N084N585O177O685P373Q402R225Q964P574O085N361
$$ plain form
60451 879590 866555 855231 844785 834634 824894 815978 807957 800663 794275 789177 785126 781136 776496
60438 776496 771509 766970 763355 760777 759158 757943 756129 753219 749981 747624 746355 745297 743802 742259
60424 742259 741423 741436 741871 742476 743510 745275 747556 749774 751629 753321 754968 756141 756428 756268 756650 757938
60408 757938 759597 761165 762845 764895 767120 769461 772445 776390 780596 784067 786793 789622 793000 796529
60394 796529 799700 802427 804814 806993 809332 812255 815650 818881 821517 823753 826027 828557 831366 834375
60380 834375 837261 839543 841009 841958 842893 844169 845923 848116 850523 852841 854945 856942 858991 861160 863355
60365 863355 865269 866543 867245 868033 869485 871368 872974 874165 875627 877985 881131 884690 888728 893610 899299
60350 899299 905186 910669 915712 920796 926381 932558 939243 946616 955018 964243 973207 980781 986866 992227
60336I92227N073M361L102J863Q23m46k067l506m427n221o261p164p313o810o269
60321I57965n861n206m207l332k847k299j211J35J112J736K698M435O637Q771
60307I58526J0667J2427J4086J5601J6906J7878J8433J8747J9091J9314J8853
60296A140529J7513J5821J4283J2663J0428P603M685J822j358n109r166j3075
60284A196639j6566j9444k1391k1980k0953j8557j5710j3552j2627j2594j2798
60273A010467j2886j2695j2113j1336j0895j0939j0834r940q478p014n574l903
60261H93860k361j634j647j645j380j337j666j783j347q75r06j152j082p63o59
60246H73623q45r63q20o13o20q05p55J5J493K923L457L097K697K955L693M312
$$ plain form
60336 992227 997300 1001661 1004763 1006626 1007449 1007003 1004936 1001430 997003 991782 985521 978357 971044 964234 957965
60321 957965 952104 946898 942691 939359 936512 934213 933002 933137 934249 935985 938683 943118 949755 958526
60307 958526 969193 981620 995706 1011307 1028213 1046091 1064524 1083271 1102362 1121676 1140529
60296 1140529 1158042 1173863 1188146 1200809 1211237 1218840 1223525 1225347 1223989 1218880 1209714 1196639
60284 1196639 1180073 1160629 1139238 1117258 1096305 1077748 1062038 1048486 1035859 1023265 1010467
60273 1010467 997581 984886 972773 961437 950542 939603 928769 918829 910351 903337 897763 893860
60261 893860 891499 889865 888218 886573 885193 883856 882190 880407 879060 878185 877279 876127 875045 874282 873623
60246 873623 872778 871815 870995 870382 869762 868957 868202 868217 869710 872633 876090 879187 881884 884839 888532 892844
60230H92844M637N006N677O386O691O655O893P644Q107P337N785M954N295N565
60216I79476M905M377N229O601O584N082L827L685L750L312L010L287L292K235
60202A038652P22k33o11r67j405j785k273k894l144k775k392k569k952k873k357
60187A010144j780j147l27L98P59J089J841K864L626L861L599L027K653K998L710
60172A037315L700K654J590J363J450J084O80J072J981K418K217K021J980J618
60158A063143R96R33J845L167M136M599M844N103N351N420N284N269N694O207
60144A121991O096N411N136N788O624O754O417O376O738P138P545Q033Q172P519
60130A215738O327N081L728K096N31o65j909l597n246o310p224q554r733r850
$$ plain form
60230 892844 897481 902487 908164 914550 921241 927896 934789 942433 950540 957877 963662 968616 973911 979476
60216 979476 984381 988758 993987 1000588 1007172 1012254 1016081 1019766 1023516 1026828 1029838 1033125 1036417 1038652
60202 1038652 1039374 1039141 1038530 1037563 1036158 1034373 1032100 1029206 1026062 1023287 1020895 1018326 1015374 1012501 1010144
60187 1010144 1008364 1007217 1006890 1007288 1008047 1009136 1010977 1013841 1017467 1021328 1024927 1027954 1030607 1033605 1037315
60172 1037315 1041015 1043669 1045259 1046622 1048072 1049156 1049836 1050908 1052889 1055307 1057524 1059545 1061525 1063143
60158 1063143 1064139 1065072 1066917 1070084 1074220 1078819 1083663 1088766 1094117 1099537 1104821 1110090 1115784 1121991
60144 1121991 1128087 1133498 1138634 1144422 1151046 1157800 1164217 1170593 1177331 1184469 1192014 1200047 1208219 1215738
60130 1215738 1222065 1227146 1230874 1232970 1233501 1232836 1230927 1227330 1222084 1215774 1208550 1199996 1190263 1180413
60116A180413r268r108r450r433q866q363p882o686m888l616l285k967j825r2
60102A094684J751L650N416O485O813P109P821Q622R244R908J0626J0921J0697
60089A193747J0565J0835J0936J0276R077P901O916N956M713K693l84l934o949
60076A262348r320j1898j4992j7677j9034j9274j9152j8963j8647j8240j7635
60065A077516j6477j4738j2924j1383r875q180o508n047l750k853k861l606l961
60052I75353l063j221P33K301L121K779J537N23M64O55Qj440k729l359l656m046
60036I67960m655n421o048o035n299m552m517m960n160n057n346o338p458p923
60022H89191p561o751n890n092m270l362k428j515o18Q8J47n31j145o86P13J807
$$ plain form
60116 1180413 1171145 1162037 1152587 1143154 1134288 1125925 1118043 1111357 1106469 1102853 1099568 1096601 1094776 1094684
60102 1094684 1096435 1100085 1105501 1111986 1118799 1125908 1133729 1142351 1151595 1161503 1172129 1183050 1193747
60089 1193747 1204312 1215147 1226083 1236359 1245436 1253337 1260253 1266209 1270922 1273615 1273231 1269297 1262348
60076 1262348 1253028 1241130 1226138 1208461 1189427 1170153 1151001 1132038 1113391 1095151 1077516
60065 1077516 1061039 1046301 1033377 1021994 1012119 1003939 997431 992384 988634 985781 982920 979314 975353
60052 975353 972290 971069 971802 974103 977224 980003 981540 982063 982527 983182 983190 981750 979021 975662 972006 967960
60036 967960 963305 957884 951836 945801 940502 935950 931433 926473 921313 916256 910910 904572 897114 889191
60022 889191 881630 874879 868989 863897 859627 856265 853837 852322 851704 851792 851939 851408 850263 849577 850290 852097
60006H52097J863J528J734K399K849L001L396M219N013N334N230N035M967N044
59992I03709N121N075M915M656M069K900J394K16k89m43o55r40j154j327j475
59977I25772j413j068o62l53J9O08J360K208L197M162M768M999N189N344N104
59962I59234M548M404M931N247M408K617P35r35k555l904m558m848n660p094q144
59947I48426q015p181o652o657o568n960n174m696m403l782k756j844j388j129
59933H82221p89o55r98j245m89J258K960L835M127M460N088N961O903P499P388
59918I27524P009P370Q759J0163J0467R696Q677P980P706P802P977P601O312M572
59904A039615L178K390J990J857K043K404K648K734K814K902K885K842L110L945
$$ plain form
60006 852097 853960 855488 857222 859621 862470 865471 868867 873086 878099 883433 888663 893698 898665 903709
59992 903709 908830 913905 918820 923476 927545 930445 931839 932055 931766 931323 930668 929728 928574 927247 925772
59977 925772 924359 923291 922629 922276 922295 922903 924263 926471 929668 933830 938598 943597 948786 954130 959234
59962 959234 963782 968186 973117 978364 982772 985389 986124 985189 982634 978730 974172 969324 963664 956570 948426
59947 948426 940411 933230 926578 919921 913353 907393 902219 897523 893120 889338 886582 884738 883350 882221
59933 882221 881432 880777 879779 878534 878045 879303 882263 886098 890225 894685 899773 905734 912637 920136 927524
59918 927524 934533 941903 950662 960825 971292 980988 989665 997645 1005351 1013153 1021130 1028731 1035043 1039615
59904 1039615 1042793 1045183 1047173 1049030 1051073 1053477 1056125 1058859 1061673 1064575 1067460 1070302 1073412 1077357
59890A077357N234O509P343P756Q175Q720Q824P978O581N461M782M147L618L600
59876A166085L673K706M62j903l460m600n949p223q003q651r589j0393j0606j0736
59862A091813j1356j1880j1386j0283r821j0098r853q346o373n072m546m060l068
59849I85671j739o96l58l97k1J009K011K411K639L488M950O368P382Q086Q488
59834A029292Q552Q566Q766Q850Q475P945P705P392O247M267K069k29l048o208
59820A098641q732r970j0230j0061r688r348r499j0235j1028j1336j1149j0729
59808I76636j0146r306q170o800n382m219l489l105k974l215l806m329m459m425
59794I02811m524m446l721k650k087k330k784k747k053r82j2L65J68O6O47J624
$$ plain form
59890 1077357 1082591 1089100 1096443 1104199 1112374 1121094 1129918 1137896 1144477 1149938 1154720 1158867 1162485 1166085
59876 1166085 1169758 1172464 1172926 1171023 1167563 1162963 1157014 1149791 1141788 1133137 1123548 1113155 1102549 1091813
59862 1091813 1080457 1068577 1057191 1046908 1037087 1026989 1017136 1008790 1002417 997345 992799 988739 985671
59849 985671 983932 983236 982878 982481 982460 983469 985480 987891 990530 994018 998968 1005336 1012718 1020804 1029292
59834 1029292 1037844 1046410 1055176 1064026 1072501 1080446 1088151 1095543 1101790 1106057 1108126 1107897 1104849 1098641
59820 1098641 1089909 1079939 1069709 1059648 1049960 1040612 1031113 1020878 1009850 998514 987365 976636
59808 976636 966490 957184 949014 942214 936832 932613 929124 926019 923045 919830 916024 911695 907236 902811
59794 902811 898287 893841 890120 887470 885383 883053 880269 877522 875469 874487 874475 874840 875008 875074 875721 877345
59778H77345K339K787L529M703N842O585O940O935O657O586P192Q170Q789R018
59764I63417R594J0887J2342J3235J3330J2764J1800J0914J0504J0414J0198R814
59752A099213R509R063P858N849L770K203J004j51j273k306l328m247m811n070
59738A117283n436o104o739o868o322n295m298l837l816l463k371j272j051j384
59724A059027j216m10J83K01L09J052K135L084L771M094L949L708L911M362M489
59709A092649M624N695P408Q084O988N507N176N597N440M573L867L496K801J678
59695A163583Q96Q92J158R60P6j351l052m533n185m838m023l526l664m056m139
59680A129198l919l965m510m988m922m879n701p015p546p016o611p161p933p899
$$ plain form
59778 877345 879684 882471 886000 890703 896545 903130 910070 917005 923662 930248 937440 945610 954399 963417
59764 963417 973011 983898 996240 1009475 1022805 1035569 1047369 1058283 1068787 1079201 1089399 1099213
59752 1099213 1108722 1117785 1125643 1131492 1135262 1137465 1138469 1138318 1137045 1134739 1131411 1127164 1122353 1117283
59738 1117283 1111847 1105743 1099004 1092136 1085814 1080519 1076221 1072384 1068568 1065105 1062734 1061462 1060411 1059027
59724 1059027 1057811 1057401 1057584 1057785 1058094 1059146 1061281 1064365 1068136 1072230 1076179 1079887 1083798 1088160 1092649
59709 1092649 1097273 1102968 1110376 1118460 1125448 1130955 1136131 1141728 1147168 1151741 1155608 1159104 1161905 1163583
59695 1163583 1164479 1165371 1166529 1167489 1167565 1166214 1163162 1158629 1153444 1148606 1144583 1141057 1137393 1133337 1129198
59680 1129198 1125279 1121314 1116804 1111816 1106894 1102015 1096314 1089299 1081753 1074737 1068126 1060965 1053032 1045133
59666A045133p217o580n866m501k723j416q73o16l63l05m55m71k94l99j078j882
59650A010094k073j534j023j415k676l815m059l860m170m985n344m872m312m218
59636I61738m069l348k676k922l689l726k656j408r47j259j683j689j308j060
59622I29298j414k052j955o27J168K328K705K882L036K857K401K171K256K150
59608I47204J650J302J629K405K958K896K379J825J531J402J083N12J72M60R77
59593I70385R67L43k35l68m24q06j216j011k2J302K303K430J394n68k616l830
59577I68028l919l323k633k108j750j648j990k761l575l893l452k521j787j790
59563I30878k306k407j449P6J048J098R28J158J455J371J342K042L159L777L881
$$ plain form
59666 1045133 1037916 1031336 1025470 1020969 1018246 1016830 1015957 1015341 1014978 1014673 1014218 1013747 1013453 1013054 1011976 1010094
59650 1010094 1008021 1006487 1005464 1004049 1001373 997558 993499 989639 985469 980484 975140 970268 965956 961738
59636 961738 957669 954321 951645 948723 945034 941308 938652 937244 936297 935038 933355 931666 930358 929298
59622 929298 927884 925832 923877 923250 924418 926746 929451 932333 935369 938226 940627 942798 945054 947204
59608 947204 948854 950156 951785 954190 957148 960044 962423 964248 965779 967181 968264 968776 968948 969408 970385
59593 970385 971352 971695 971460 971092 970668 969862 968646 967635 967613 968915 971218 973648 975042 974474 971858 968028
59577 968028 964109 960786 958153 956045 954295 952647 950657 947896 944321 940428 936976 934455 932668 930878
59563 930878 928572 926165 924716 924792 925840 926938 927866 929024 930479 931850 933192 935234 938393 942170 946051
59548I46051M438N822P261Q249R512J1855J4674J6560J7099J7243J7995J9347
59536A096106K0643K1503K2074K2573K2725K1790J9292J5672J1995Q984O553M304
59524A294214K075j01k228m296o307q449j0926j3490j5519j6762j7593j8302j8561
59511A163755j7950j6711j5520j4640j3643j1981r733p719o733o570n999m162
59499A032394j778l73m21r17r36p49r82j406j178R8K054M047N565O399O797P283
59483A055897Q136R197J0237J1150J1751J1897J1873J2156J2619J2600J1901J1067
59471A190481J0510J0005R410R071R194R465R794J0634J2037J3171J3469J3552
59459A320793J4279J5426J6145J6172J5786J4986J3556J1691R729P530M783J683
$$ plain form
59548 946051 950489 956311 963572 971821 981333 993188 1007862 1024422 1041521 1058764 1076759 1096106
59536 1096106 1116749 1138252 1160326 1182899 1205624 1227414 1246706 1262378 1274373 1283357 1289910 1294214
59524 1294214 1296289 1296188 1293960 1289664 1283357 1274908 1263982 1250492 1234973 1218211 1200618 1182316 1163755
59511 1163755 1145805 1129094 1113574 1098934 1085291 1073310 1063577 1055858 1049125 1042555 1036556 1032394
59499 1032394 1030616 1030243 1029822 1028905 1027969 1027220 1026238 1024832 1023654 1023752 1025806 1029853 1035418 1041817 1048614 1055897
59483 1055897 1064033 1073230 1083467 1094617 1106368 1118265 1130138 1142294 1154913 1167513 1179414 1190481
59471 1190481 1200991 1210996 1220406 1229477 1238671 1248136 1257930 1268564 1280601 1293772 1307241 1320793
59459 1320793 1335072 1350498 1366643 1382815 1398601 1413587 1427143 1438834 1448563 1456093 1460876 1462559
59447A462559j305m057o564q528r833j1042j2664j4347j5484j6231j6973j7135
59435A328396j5584j2236q349n205l095j624k87J231K827M089N096O651R098J1330
59421A322338J1928J1033J0101R838R396P779N050J853j426m597p204q676q821
59408A358592q127p700q585j0747j2949j4043j4158j4148j4287j4122j3257j1644
59396A214825r459p521p347r775j3619j6656j7811j7613j6695j5038j2715j0282
59384A060294q139o307m904m045l258j938l89N92J190K423M310N503N299M866
59370A055497N723P874J0199J1989J3315J4483J5897J8040K0962K4023K6552K8520
59358A253074L0252L1875L3314L4464L5121L5085L4486L3509L1804K8792K4675
$$ plain form
59447 1462559 1461254 1457197 1450633 1442105 1432272 1421230 1408566 1394219 1378735 1362504 1345531 1328396
59435 1328396 1312812 1300576 1292227 1287022 1283927 1282303 1282016 1283247 1286074 1290163 1295259 1301910 1311008 1322338
59421 1322338 1334266 1345299 1355400 1365238 1374634 1382413 1387463 1389316 1387890 1383293 1376089 1367413 1358592
59408 1358592 1350465 1342765 1334180 1323433 1310484 1296441 1282283 1268135 1253848 1239726 1226469 1214825
59396 1214825 1205366 1197845 1190498 1180723 1167104 1150448 1132637 1115024 1098329 1083291 1070576 1060294
59384 1060294 1052155 1045848 1040944 1036899 1033641 1031703 1031314 1031906 1033096 1035519 1039829 1045332 1050631 1055497
59370 1055497 1061220 1069094 1079293 1091282 1104597 1119080 1134977 1153017 1173979 1198002 1224554 1253074
59358 1253074 1283326 1315201 1348515 1382979 1418100 1453185 1487671 1521180 1552984 1581776 1606451
59347A606451K0357J6219J1703O383N86n332j1438j7492k2664k6572k9838l2949
59335A515414l5337l6328l6259l5830l4951l3135l0620k8170k6026k3782k1144
59324A173832j8171j5008j1924r336p286n319l410k405k739l317k664q49P65J496
59310A093665J898K411K694K548K448K694K835K463J874J529J432J542K156L352
59296A125541M474M878M888N414O814Q719J0916J3681J7055K0320K2594K3667
59284A268961K4026K4178K4266K4276K4279K4363K4444K4249K3348K1251J7637
59273A525278J2768P558L004n07l312n982q821j1799j4671j7111j8884j9984k0581
59260A426956k0774k0629k0313k0017j9597j8598j6821j4733j2978j1556r832
$$ plain form
59347 1606451 1626808 1643027 1654730 1661113 1661699 1656367 1644929 1627437 1604773 1578201 1548363 1515414
59335 1515414 1480077 1443749 1407490 1371660 1336709 1303574 1272954 1244784 1218758 1194976 1173832
59324 1173832 1155661 1140653 1128729 1119393 1112107 1106788 1103378 1100973 1098234 1094917 1092253 1091404 1092169 1093665
59310 1093665 1095563 1097974 1100668 1103216 1105664 1108358 1111193 1113656 1115530 1117059 1118491 1120033 1122189 1125541
59296 1125541 1130015 1134893 1139781 1145195 1152009 1160728 1171644 1185325 1202380 1222700 1245294 1268961
59284 1268961 1292987 1317165 1341431 1365707 1389986 1414349 1438793 1463042 1486390 1507641 1525278
59273 1525278 1538046 1545604 1548608 1548101 1544789 1538807 1529986 1518187 1503516 1486405 1467521 1447537 1426956
59260 1426956 1406182 1385553 1365240 1345223 1325626 1307028 1290207 1275474 1262496 1250940 1241108
59249A241108p410m737k553r26P66K872M813N656N129L846K660K012J690R04j265
59234A254565m949r036j2138j4014j5586j7495j9295k0221k0092j9098j7418j5499
59222A069724j4106j3389j2473j0623q361o666n535m289k934k100j675o98J103
59209I87978K742L382L492L952M674M864M328L861M256N416O503O857O616O457
59195A055378O772P281P583P747Q023Q266Q129P722P590Q003Q742R498J0104J0411
59181A171249J0419J0525J1130J2021J2588J2706J2873J3383J3923J4109J3998
59170A308924J3817J3528J2818J1352Q985N990K936N2l076o839j0815j4139j6366
59157A327167j7557j7772j7197j6519j6344j6317j5645j4436j3594j3363j2924
$$ plain form
59249 1241108 1233698 1228961 1226408 1225482 1226248 1229120 1233933 1239589 1244718 1248564 1251224 1253236 1254926 1255830 1254565
59234 1254565 1249616 1240580 1228442 1214428 1198842 1181347 1162052 1141831 1121739 1102641 1085223 1069724
59222 1069724 1055618 1042229 1029756 1019133 1010772 1004106 998571 994282 991348 989248 987573 986875 987978
59209 987978 990720 994102 997594 1001546 1006220 1011084 1015412 1019273 1023529 1028945 1035448 1042305 1048921 1055378
59195 1055378 1062150 1069431 1077014 1084761 1092784 1101050 1109179 1116901 1124491 1132494 1141236 1150734 1160838 1171249
59181 1171249 1181668 1192193 1203323 1215344 1227932 1240638 1253511 1266894 1280817 1294926 1308924
59170 1308924 1322741 1336269 1349087 1360439 1369424 1375414 1378350 1378402 1375326 1368487 1357672 1343533 1327167
59157 1327167 1309610 1291838 1274641 1258122 1241778 1225461 1209816 1195380 1181786 1168423 1155499
59146A155499j1649r891q237o791n570m836m569m272l654l014k570k007j037J79
59132A087581J443K889M607O447Q357J0382J2197J3256J3632J4041J4845J5851
59120A205528J7155J9240K1820K3655K4120K4049K4309K4475K3702K2128K0401
59109A450582J8450J5758J2489R331O463L584Q20j342k909m464o339q327j0216
59096A483880j1973j3333j3781j3217j2250j1689j1832j2341j2602j2250j1483
59085A347129j0872j0885j1609j2801j3943j4396j3912j2982j2219j1509j0309
59074A211692q780p864q022q544q475p655o608n887n832o394o983o939o362n950
59060A111397n937n844n437n091m946m610l979l532l338k744j478k07O28J583
$$ plain form
59146 1155499 1143850 1133959 1125722 1118931 1113361 1108525 1103956 1099684 1096030 1093016 1090446 1088439 1087402 1087581
59132 1087581 1089024 1091913 1096520 1102967 1111324 1121706 1133903 1147159 1160791 1174832 1189677 1205528
59120 1205528 1222683 1241923 1263743 1287398 1311518 1335567 1359876 1384351 1408053 1430181 1450582
59109 1450582 1469032 1484790 1497279 1506610 1513073 1516657 1517477 1516135 1513226 1508762 1502423 1494096 1483880
59096 1483880 1471907 1458574 1444793 1431576 1419326 1407637 1395805 1383464 1370862 1358612 1347129
59085 1347129 1336257 1325372 1313763 1300962 1287019 1272623 1258711 1245729 1233510 1222001 1211692
59074 1211692 1202912 1195048 1187026 1178482 1170007 1162352 1155744 1149857 1144025 1137631 1130648 1123709 1117347 1111397
59060 1111397 1105460 1099616 1094179 1089088 1084142 1079532 1075553 1072021 1068683 1065939 1064461 1064254 1064882 1066465
59046A066465L126M690N605O225P238Q544R722J1015J2922J5231J7235J8545J9069
59033A205632J8794J8217J8309J9200J9585J8305J5880J3623J1858J0041Q019
59022A377463O068M172K273Q38J29n08j628k429j845l66N74P47J251K657M397
59007A393793O028P735R425J0588J1222J1840J2356J2151J1334J0713J0225Q651
58995A516061N426J631j429l764o199r014j1721j3749j4907j5535j6274j7302
58983A413224j7772j6626j3979j1006q426n962l326p59J708M607Q145J1704J4662
58970A376194J7032J8981K0388K1288K1967K2222K1259J8875J5952J3173R957
58959A577288N497K50m609q818j3091j7581k1326k3470k4284k4553k4493k3770
$$ plain form
59046 1066465 1069591 1074281 1079886 1086111 1093349 1101893 1111615 1122630 1135552 1150783 1168018 1186563 1205632
59033 1205632 1224426 1242643 1260952 1280152 1299737 1318042 1333922 1347545 1359403 1369444 1377463
59022 1377463 1383531 1387703 1389976 1390814 1390943 1390435 1388807 1386378 1384533 1384167 1384741 1385488 1386739 1389396 1393793
59007 1393793 1399821 1407556 1416981 1427569 1438791 1450631 1462987 1475138 1486472 1497185 1507410 1516061
58995 1516061 1521487 1523118 1521689 1517925 1511726 1502712 1490991 1477242 1462335 1446800 1430526 1413224
58983 1413224 1395452 1378826 1364847 1353841 1345415 1339453 1336127 1335368 1337076 1341683 1349828 1361532 1376194
58970 1376194 1393226 1412207 1432595 1453883 1475850 1498072 1519331 1538206 1554158 1567331 1577288
58959 1577288 1582785 1583035 1578426 1569608 1556517 1538936 1517610 1494140 1469856 1445303 1420810 1397040
58947A397040k2251k0199j7777j4886j1658q718o673n548m953m661m726n231o217
58934A263542p750r630j1208j2023j2466j3245j4227j4558j3943j2960j1957j0598
58922A118977q882p528o778n715l604j037J040K747M661O578P939Q973J0326J1986
58908A139683J3615J5551J8274K1270K3657K5709K8511L2226L5964L9311M2685
58897A436456M6073M8709N0195N0896N0988N0205M8741M7279M5779M3250L9109
58886A957680L3724K7331J9582J0668J835n957j2990j9780k5975l1023l5260l9307
58874A880528m2822m4712m4458m2641m0210l7695l5111l2308k9369k6689k4597
58863A479916k2923k1299j9781j8872j8829j9278j9541j9147j8185j7413j7741
$$ plain form
58947 1397040 1374789 1354590 1336813 1321927 1310269 1301551 1294878 1289330 1284377 1279716 1274990 1269759 1263542
58934 1263542 1255792 1246162 1234954 1222931 1210465 1197220 1182993 1168435 1154492 1141532 1129575 1118977
58922 1118977 1110095 1102567 1095789 1090074 1086470 1085433 1086473 1089220 1093881 1100459 1108398 1117371 1127697 1139683
58908 1139683 1153298 1168849 1187123 1208393 1232050 1257759 1286270 1318496 1354460 1393771 1436456
58897 1436456 1482529 1531238 1581433 1632329 1683317 1733522 1782263 1829542 1875321 1918571 1957680
58886 1957680 1991404 2018735 2038317 2048985 2050820 2044863 2031873 2012093 1986118 1955095 1919835 1880528
58874 1880528 1837706 1792994 1748536 1705895 1665685 1627990 1592879 1560571 1531202 1504513 1479916
58863 1479916 1456993 1435694 1415913 1397041 1378212 1358934 1339393 1320246 1302061 1284648 1266907
58852A266907j9170k0553k0878k0410j9967j9595j8780j7613j6629j5644j3907
58841A063761j1449r217p713o500n181l929k842j757r01p66j104r45J4J007J403
58826A013881J421J314Q74J86j40k7k78j266k190k362k386l187m479n133m701
58811I91527l831l310l329l575l586l055k038q73J36Q27J135J247J581K203K575
58796I77634K462K644L817N229N563N027N152O488P930Q587Q888R282R347Q886
58782A066936Q648Q955Q811P426N662M876N036N063M436L451K411J550J301J734
58768A136296K010J290j18j182j441j193p40j96K53N44R58J633K119K011J719
58753A143963K066L353N277P484R719J1732J3478J5190J6908J8310J9289K0348
$$ plain form
58852 1266907 1247737 1227184 1206306 1185896 1165929 1146334 1127554 1109941 1093312 1077668 1063761
58841 1063761 1052312 1043095 1035382 1028882 1023701 1019772 1016930 1015173 1014272 1013506 1012402 1011457 1011471 1012478 1013881
58826 1013881 1015302 1016616 1017490 1017676 1017536 1017509 1017231 1015965 1013775 1011413 1009027 1005840 1001361 996228 991527
58811 991527 987696 984386 981057 977482 973896 970841 968803 967930 968066 968893 970028 971275 972856 975059 977634
58796 977634 980096 982740 986557 991786 997349 1002376 1007528 1014016 1021946 1030533 1039421 1048703 1058050 1066936
58782 1066936 1075584 1084539 1093350 1100776 1106438 1111314 1116350 1121413 1125849 1129300 1131711 1133261 1134562 1136296
58768 1136296 1138306 1139596 1139478 1138296 1136855 1135662 1134922 1134726 1134979 1135523 1136481 1138114 1140233 1142244 1143963
58753 1143963 1146029 1149382 1154659 1162143 1171862 1183594 1197072 1212262 1229170 1247480 1266769 1287117
58741A287117K1921K3718K5102K5747K5626K4773K3532K2485K1727K0538J8270
58730A540556J5149J1846Q711N790L137O46j997m742o991q401r467j0836j2479
58717A530922j3954j5118j6105j6979j7870j9131k0915k2842k4389k5384k5948
58706A312287k6243k6436k6601k6564k6192k5768k5549k5092k3777k1880k0239
58695A037946j8916j7220j5156j3575j2603j1242r131p436p110p386o920n533
58683I05718l878k156k19J728L453N264P462R717J1635J3412J5173J6323J6321
58670I99953J5550J4761J4140J3542J3032J2476J1187Q708N474K095j406n097
58658A104415q538j1270j3286j4448j4303j3033j1694j0807r695p911o284n564
$$ plain form
58741 1287117 1309038 1332756 1357858 1383605 1409231 1434004 1457536 1480021 1501748 1522286 1540556
58730 1540556 1555705 1567551 1576262 1582052 1585189 1585835 1583838 1579096 1572105 1563704 1554237 1543401 1530922
58717 1530922 1516968 1501850 1485745 1468766 1450896 1431765 1410850 1388008 1363619 1338235 1312287
58706 1312287 1286044 1259608 1233007 1206443 1180251 1154483 1128934 1103842 1080065 1058185 1037946
58695 1037946 1019030 1001810 986654 973079 960476 949234 940103 932667 925557 918171 911251 905718
58683 905718 901840 899684 899465 901193 904646 909910 917372 927089 938724 952136 967309 983632 999953
58670 999953 1015503 1030264 1044404 1057946 1070978 1083454 1094641 1103349 1108823 1110918 1109512 1104415
58658 1104415 1095877 1084607 1071321 1056873 1042570 1029537 1017843 1007036 997341 989430 983146 977582
58646I77582n096m002k715k114j987j731j721k495l236k748j473r72j520j782
58632I43990r09N03J693K780M231O198Q637J1304J3593J5043J5958J6910J7867
58619A057798J8426J8572J8390J7440J5411J3061J1503J0577Q943N818J821j914
58607A195846m731o551p654q380q676q045o383m412k814j316P19L239N763Q260
58593A154865J0965J3613J5613J6773J7318J7470J7483J7646J7743J7095J5596
58582A332180J4063J3020J1963J0533R489R682J0781J2001J3290J4893J6563J8235
58570A486693K0638K4049K7180K8568K8387K7736K6872K5390K3373K0901J7110
58559A756897J1321M703p74m683q097j1620j4946j8021k1150k4064k6203k7715
$$ plain form
58646 977582 972486 968484 965769 963655 961668 959937 958216 955721 952485 949737 948264 947292 945772 943990
58632 943990 943081 943584 945277 948057 952288 958486 967123 978427 992020 1007063 1023021 1039931 1057798
58619 1057798 1076224 1094796 1113186 1130626 1146037 1159098 1170601 1181178 1190121 1195939 1197760 1195846
58607 1195846 1191115 1184564 1176910 1168530 1159854 1151809 1145426 1141014 1138200 1136884 1137603 1140842 1146605 1154865
58593 1154865 1165830 1179443 1195056 1211829 1229147 1246617 1264100 1281746 1299489 1316584 1332180
58582 1332180 1346243 1359263 1371226 1381759 1391248 1400930 1411711 1423712 1437002 1451895 1468458 1486693
58570 1486693 1507331 1531380 1558560 1587128 1615515 1643251 1670123 1695513 1718886 1739787 1756897
58559 1756897 1768218 1772921 1772147 1767464 1759367 1747747 1732801 1714780 1693630 1669566 1643363 1615648
58547A615648k8954k9461k8750k7651k7305k7240k6106k4023k2486k1962k1292
58536A330418j9538j6930j3895j0602p532n082k603P30M196O217O726P240Q501
58523A287846R682J0123J0205J0126R397Q063O931O111M603J988o62k166k650
58510A359597l055m026n548p044p713p501p517q651j0084j0313r303q362q080
58497A262400p773o826n306l264q26J229K374L573O036Q978J0496J0633J1430
58484A293154J3605J5224J4488J1950R035N916K096k084n737q628j1214j3926
58472A323879j6806j9417k0965k1032k0125j8892j7151j4509j1539r175p249m906
58460A142113k194N5J643K939L731L571K998K825K501R28j409k883l196l407l609
$$ plain form
58547 1615648 1586694 1557233 1528483 1500832 1473527 1446287 1420181 1396158 1373672 1351710 1330418
58536 1330418 1310880 1293950 1280055 1269453 1261921 1256839 1254236 1254966 1259162 1265379 1272105 1279345 1287846
58523 1287846 1297528 1307651 1317856 1327982 1337379 1345442 1352373 1358484 1363087 1365075 1364413 1362247 1359597
58510 1359597 1356542 1352516 1346968 1339924 1332211 1324710 1317193 1308542 1298458 1288145 1278842 1270480 1262400
58497 1262400 1254627 1247801 1242495 1239231 1238405 1239634 1242008 1245581 1251617 1260595 1271091 1281724 1293154
58484 1293154 1306759 1321983 1336471 1348421 1357456 1363372 1365468 1363384 1357647 1349019 1337805 1323879
58472 1323879 1307073 1287656 1266691 1245659 1225534 1206642 1189491 1174982 1163443 1154268 1147019 1142113
58460 1142113 1139919 1139974 1141617 1144556 1148287 1151858 1154856 1157681 1160182 1161110 1159701 1156818 1153622 1150215 1146606
58445A146606k721p58P79J269J705K699L659M448N950Q231R955J0389J0412J0847
58431A213470J1285J1229J1032J1024J0974J0765J0471R543P376M708K935K018
58419A316830P44r50j881j892k201l202m007m455n459o938p598p220p049p402
58405A257320p228o594p227r620j1845j2351j1867j1579j1353j0836j0468j0378
58393A135974r935r209r160r776r847r068q346p617n593k347L17J802L487N857
58379A066539P445P723Q326J0138J1718J2024J2248J3390J4468J4543J4317J4284
58367A207163J3657J2484J2395J3721J4314J2864J0856R610P955M823J638J6p38
58354A320758j709k115j044N85J733L042N081O802P610Q815J1199J3262J3765
$$ plain form
58445 1146606 1143885 1143127 1143906 1145175 1146880 1149579 1153238 1157686 1163636 1171867 1181822 1192211 1202623 1213470
58431 1213470 1224755 1235984 1247016 1258040 1269014 1279779 1290250 1299793 1307169 1311877 1314812 1316830
58419 1316830 1317574 1316624 1314743 1312851 1310650 1307448 1303441 1298986 1293527 1286589 1278991 1271771 1264722 1257320
58405 1257320 1250092 1243498 1236271 1226651 1214806 1202455 1190588 1179009 1167656 1156820 1146352 1135974
58393 1135974 1126039 1116830 1107670 1097894 1088047 1078979 1070633 1063016 1057423 1055076 1055393 1057195 1060682 1066539
58379 1066539 1073984 1081707 1090033 1100171 1111889 1123913 1136161 1149551 1164019 1178562 1192879 1207163
58367 1207163 1220820 1233304 1245699 1259420 1273734 1286598 1297454 1307064 1315019 1319842 1321480 1321496 1320758
58354 1320758 1319049 1316934 1315890 1316475 1318208 1321250 1326331 1333133 1340743 1349558 1360757 1374019 1387784
58341A387784J3802J4484J4736J3483J1756J0667R513P869P106P718P578N228
58329A511724K503J570J697J331R62J402J667J178J660M162O573O837O320P121
58315A556707Q482Q859R157J0714J2293J2332J2062J3194J4620J4628J4229J4939
58303A702216J5416J3858J1771J1642J2727J2745J2002J2201J2809J2379J1889
58292A841655J3173J5385J6600J7457J9725K2663K4333K5189K6975K9443L1398
58281B083996L3471L6599L9473M0735M1883M4722M7920M9556N0869N3795N6916
58270B579935N7795N7237N7343N7429N5842N3636N2427N0918M7622M4467M3465
58259C158116M2511L9236L6171L6997M0265M2301M3789M7827N3726N8557O2844
$$ plain form
58341 1387784 1401586 1416070 1430806 1444289 1456045 1466712 1476225 1484094 1491200 1498918 1506496 1511724
58329 1511724 1514227 1515797 1517494 1518825 1519787 1521189 1522856 1524034 1525694 1529856 1536429 1543266 1549586 1556707
58315 1556707 1565189 1574048 1583205 1593919 1606212 1618544 1630606 1643800 1658420 1673048 1687277 1702216
58303 1702216 1717632 1731490 1743261 1754903 1767630 1780375 1792377 1804578 1817387 1829766 1841655
58292 1841655 1854828 1870213 1886813 1904270 1923995 1946658 1970991 1996180 2023155 2052598 2083996
58281 2083996 2117467 2154066 2193539 2234274 2276157 2320879 2368799 2418355 2469224 2523019 2579935
58270 2579935 2637730 2694967 2752310 2809739 2865581 2919217 2971644 3022562 3070184 3114651 3158116
58259 3158116 3200627 3239863 3276034 3313031 3353296 3395597 3439386 3487213 3540939 3599496 3662340
58248C662340O8963P5845Q0993Q5650R2287R9204J03572J07409J14298J22706
58238D613267J28987J34631J43591J54856J64669J73819J85499J98448K09692
58229F107459K21502K37888K56772K73734K90675L12328L37279L61532L87782
58220H786951M21380M60209M99103N41211N93959O56828P25025Q02179Q96860
58211A4383705J009746J138264J291210J484349J724857K016861K379765K842374
58203B8271131L418682M106544M906954N822619O841175P954872R214081J0736203
58195H1272261J2621023J4817368J7030517J8751687J9454360J8886299J7241786
58188B00075301J5048379J2878594J1143398J0012327R293009Q304135O078927
$$ plain form
58248 3662340 3731303 3807148 3888141 3973791 4066078 4165282 4268854 4376263 4490561 4613267
58238 4613267 4742254 4876885 5020476 5175332 5340001 5513820 5699319 5897767 6107459
58229 6107459 6328961 6566849 6823621 7097355 7388030 7700358 8037637 8399169 8786951
58220 8786951 9208331 9668540 10167643 10708854 11302813 11959641 12684666 13486845 14383705
58211 14383705 15393451 16531715 17822925 19307274 21032131 23048992 25428757 28271131
58203 28271131 31689813 35796357 40703311 46525930 53367105 61321977 70536058 81272261
58195 81272261 93893284 108710652 125741169 144492856 163947216 182833515 200075301
58188 200075301 215123680 228002274 239145672 249157999 258451008 266755143 272834070
58181B72834070K005086l604277r617832j4796330j8416068k0344207k0769988
58174A87290454k0003864j8423891j6414110j4270938j2183610j0286374q675088
58167H7032579p372112o324528n455628m700599m004770l338239k737465k306742
58159E0792496k146388k269709k584573k944375l219682l344685l319032l176120
58151B7787932k952150k679362k390343k111696j854512j620003j411695j233824
58143A1534347j082304r48226q28693p25580o36324n55542m83887m25800l79638
58134E468353l38896l02219k73267k51369k30964k10349j92804j78823j64871
58125C324791j50316j38273j28948j18983j08005r9397r3919q8702q3153p9829
$$ plain form
58181 272834070 274839156 271234879 261617047 246820717 228404649 208060442 187290454
58174 187290454 167286590 148862699 132448589 118177651 105994041 95707667 87032579
58167 87032579 79660467 73335939 67880311 63179712 59174942 55836703 53099238 50792496
58159 50792496 48646108 46376399 43791826 40847451 37627769 34283084 30964052 27787932
58151 27787932 24835782 22156420 19766077 17654381 15799869 14179866 12768171 11534347
58143 11534347 10452043 9503817 8675124 7949544 7313220 6757678 6273791 5847991 5468353
58134 5468353 5129457 4827238 4553971 4302602 4071638 3861289 3668485 3489662 3324791
58125 3324791 3174475 3036202 2907254 2788271 2680266 2580869 2486950 2398248 2315095 2235266
58115B235266p8852p7076p3566p0521o8278o4654n9806n6535n5119n2727m8604
58104A529528m5051m2771l9896l6174l3480l1675k8364k3447j9571j7541j5449
58093A196109j2824j1439j1486j1093j0133j0503j2192j3071j3029j4251j6901
58082A059187j8593j8719j9305k0897k1550k0683k0115k0375j9742j7805j6405
58071H44998j6122j5384j3816j2947j2776j1341q550o893p222p380o227n497o268
58058G14575o889o009m681m000l429k827l353m986n789m923l933l798l423k272
58044F54263j866l211n034n940o232o489o497o553p609r134r179p536o462p156
58030E65365p966p269n802m801m088l350l247l811l717k417j192r43q35k07J61
$$ plain form
58115 2235266 2156414 2079338 2005772 1935251 1866973 1802319 1742513 1685978 1630859 1578132 1529528
58104 1529528 1484477 1441706 1401810 1365636 1332156 1300481 1272117 1248670 1229099 1211558 1196109
58093 1196109 1183285 1171846 1160360 1149267 1139134 1128631 1116439 1103368 1090339 1076088 1059187
58082 1059187 1040594 1021875 1002570 981673 960123 939440 919325 898950 879208 861403 844998
58071 844998 828876 813492 799676 786729 773953 762612 754062 747169 739947 732567 726340 720843 714575
58058 714575 707686 701677 696996 692996 689567 686740 683387 678401 672612 667689 663756 659958 656535 654263
58044 654263 652397 649186 644152 638212 631980 625491 618994 612441 604832 595698 586519 578983 572521 565365
58030 565365 557399 550130 544328 539527 535439 532089 528842 525031 521314 518897 517705 516762 515927 515720 515881
58015E15881j37l7J068K179K648L387M890O027O144O455P899R386R705R524R943
58000E94962J0521J0365R867R844J0035R758R034Q032O466M530L193K622J635
57987F90864l34k075k555k612l451m703n310n241n049m593l488k115j123n75l57
57972F47283o59j280j275j52J279J941J719J102L41m81j213j869k548k980k892
57957F38316k702k865k906k295j971l183n003n090l102j224p83n92N64J956K562
57942F11682K781L260L704M083N388P874R982J0398R906R988J0721J1269J1360
57929G12396J1084J0227Q863P672O796N423L234J127l09j802m056o619q885j0899
57915G34252j2432j2703j1924j1650j2583j3563j3708j3896j4875j5555j4787
$$ plain form
58015 515881 515744 515707 516775 518954 521602 524989 529879 535906 542050 548505 556404 565790 575495 585019 594962
58000 594962 605483 615848 625715 635559 645594 655352 664386 672418 678884 683414 686607 689229 690864
57987 690864 690530 688455 685900 683288 679837 675134 669824 664583 659534 654941 651453 649338 648215 647640 647283
57972 647283 646624 645344 644069 643917 645196 647137 648856 649958 650299 649818 648605 646736 644188 641208 638316
57957 638316 635614 632749 629843 627548 625577 622394 617391 612301 609199 607975 607192 606600 607164 609120 611682
57942 611682 614463 617723 621427 625510 630898 638772 648754 659152 669058 679046 689767 701036 712396
57929 712396 723480 733707 742570 750242 757038 762461 765695 766822 766513 764711 760655 754036 745151 734252
57915 734252 721820 709117 697193 685543 672960 659397 645689 631793 616918 601363 586576
57904E86576j3402j2864j3075j3054j2714j2351j1409r383p163n998n776n542
57892D63845m930l982k455n34P14P32M30O36Q18M67M45J408K228J619K97k51j92
57875D61295o81j624j989j752j662j556p21L84N59j81o02j31P32J692K968M418
57859D61149N540O330P127P842Q301Q918J0048J1144J1602J1876J2624J3295J2817
57846E88613J1262R528P843N769L403J385J3p90j094j473l069o049q756r670r417
57831E87498r525j0015r767q605p270n908m261k931k759l168k782j509m57k4L76
57816E18893Q49Q29L45M0L3J4J86P88J152O77K66J106K488K673J633R19R88P77
57798E34656k9n09o25j648l876n815o354o139o021n828n380n254n648n782n218
$$ plain form
57904 586576 573174 560310 547235 534181 521467 509116 497707 488324 481161 475163 469387 463845
57892 463845 458915 454933 452478 451944 452658 453390 453820 454456 455274 455741 456186 457594 459822 461441 461738 461487 461295
57875 461295 460614 458990 457001 455249 453587 452031 451310 451694 452253 452072 451470 451339 452071 453763 456731 461149
57859 461149 466689 473019 480146 487988 496289 505207 515255 526399 538001 549877 562501 575796 588613
57846 588613 599875 609403 617246 623015 626418 627803 627816 627026 625932 624459 621390 615341 606585 596915 587498
57831 587498 577973 567958 558191 549586 542316 536408 532147 529216 526457 523289 520507 518998 518541 518517 518893
57816 518893 519742 520571 520916 520956 520989 521003 521189 521977 523129 523806 524072 525178 527666 530339 531972 532891 533879 534656
57798 534656 534627 534118 533493 531845 527969 522154 515800 509661 503640 497812 492432 487178 481530 475748 470530
57783D70530m565m253l769k770j810j269p24Q1O74Q56J128J664J938J827J811
57768D61349J717N48j771l904m977n674o681p458p531p643q509r470r539q925
57754C81532q386p915p173o498o338o239n460m199l288l012l019l010k824k256
57740C11915j490j220j739k306k090j282o38l99k77j61r5O2M03O27M14q4n03o63
57722C00474m62J73R02J069N06k22o54q83j020q69n31m97p47n80J74O81M46K09
57704B98169O69J190Q15j01m30J5L82K25kJ66O91J425K295L076L585M083M992
57687C21245O262P608R192J1504J4584J7983K1527K5546L0265L5474M1020M7245
57675E89455N4587O2737P0433P6117P8880P8816P6569P2828O8290O3656N8865
$$ plain form
57783 470530 465965 461712 457943 455173 453363 452094 451370 451451 452125 452981 454109 455773 457711 459538 461349
57768 461349 463066 463614 461843 457939 452962 447288 440607 433149 425618 417975 409466 399996 390457 381532
57754 381532 373146 365231 358058 351560 345222 338983 333523 329324 326036 323024 320005 316995 314171 311915
57740 311915 310425 309205 307466 305160 303070 301788 301150 300751 300474 300313 300218 300280 300683 301310 301724 301640 301137 300474
57722 300474 300012 300185 301087 302156 302662 302440 301786 300903 299883 299014 298483 297986 297239 296659 296833 297514 297960 298169
57704 298169 298838 300028 300843 300742 300312 300327 300709 300934 300932 301098 301789 303214 305509 308585 312170 316253 321245
57687 321245 327507 335115 344307 355811 370395 388378 409905 435451 465716 501190 542210 589455
57675 589455 644042 706779 777212 853329 932209 1011025 1087594 1160422 1228712 1292368 1351233
57664A351233N2208M0862K2885j121k8034n3613p4207q8010r5153r6660r3496
57653I36894q6811p8382o9881o1787n3841m6378m0233l5401l0899k6269k2114
57642C84898j8857j6081j3494j1491j0185q918p414o369o155n885m726l285k669
57629B69369k814k765k152j385q21n77q38j443j562o67M57N45n50j867k690l011
57613B47229k906k363j686j308j163r00n70m94o04n14j67J76M06M42p8j299k519
57596B31682k816k192j408r08o51q22j727k905l354k888k459k776l269l025k177
57581A98305j741k243l060l215k540j804j735k123k157j544q52o41p01n28j75
57566A73246j31n41j006j109p89k91O9J37N4Q4K17K14J13K62P06J016R78Q92R73
$$ plain form
57664 1351233 1403441 1444303 1467188 1466067 1438033 1384420 1310213 1222203 1127050 1030390 936894
57653 936894 850083 771701 701820 640033 586192 539814 499581 464180 433281 407012 384898
57642 384898 366041 349960 336466 324975 314790 305872 298458 292089 285934 280049 275323 272038 269369
57629 269369 266555 263790 261638 260253 259432 258855 258017 256574 255012 254345 254802 255347 254797 252930 250240 247229
57613 247229 244323 241960 240274 238966 237803 236903 236333 235839 235235 234721 234554 234730 235136 235578 235500 234201 231682
57596 231682 228866 226674 225266 224358 223707 222885 221158 218253 214899 212011 209552 206776 203507 200482 198305
57581 198305 196564 194321 191261 188046 185506 183702 181967 179844 177687 176143 175291 174650 173949 173421 173246
57566 173246 173115 172574 171568 170459 169670 169379 169448 169585 169639 169723 169940 170154 170267 170529 171235 172251 173229 174121 175094
57547A75094R88R13J273K258L066K796J663O34K98O55J579K684L049K036K97q44
57531A98439r50p32q06r97r65q45q74r24o90j21N11Q51P58M81M37O63P42M35J47
57512A95560M54J385K417K947K642J639N97J87L67N60O02Q32J114P28l39j000
57496B10692o68k43p20j624j968j945k401l137l148k298j507j284j237j071r80
57481A86461r80p62l57j52j90j64q0j71k85j07J48Q7%N29J526K213K289K038J504
57462A93547O15m9K90J351K090K215K373K733K657J988J430J337J232R39J087
57447B15835J926K642K471J748J235J104J126J312J800K470K976K969K295J317
57433B43226Q37J170J557J268Q44J246K087K090J199P14J154J477Q70m3m16l32
$$ plain form
57547 175094 176082 176995 178268 180526 183592 186388 188051 188685 188983 189638 191217 193901 196950 198986 199283 198439
57531 198439 197489 196757 195951 194954 193989 193144 192270 191346 190656 190535 191046 191897 192655 193136 193573 194236 194978 195413 195560
57512 195560 196014 197399 199816 202763 205405 207044 207641 207828 208195 208755 209357 210189 211303 212031 211692 210692
57496 210692 210024 209781 209061 207437 205469 203524 201123 197986 194838 192540 191033 189749 188512 187441 186461
57481 186461 185481 184719 184362 184210 184020 183856 183776 183605 183320 183213 183361 183448 183448 183977 185503 187716 190005 192043 193547
57462 193547 194162 194113 194403 195754 197844 200059 202432 205165 207822 209810 211240 212577 213809 214748 215835
57447 215835 217761 220403 222874 224622 225857 226961 228087 229399 231199 233669 236645 239614 241909 243226
57433 243226 244063 245233 246790 248058 248902 250148 252235 254325 255524 256238 257392 258869 259739 259696 259280 258948
57417B58948j13L73J023J206Q12O42J085J423J191J063J657K409K565K367K359
57402B79010K372K082J823J952K126K087K372L379M378M468L894L526L512L393
57388C20374L048K689K394K332K929M118M961M827M277M055L918L411L057L593
57374C69983M529M739M150L761M088M624M849M834M801M809M901N043M994M678
57360D34783M438M572M931N429O371P678Q452Q039P069O609O721O736O551O661
57346E25040P140P460P317O942O651O621O882P153O967O377O075O380O700O581
57332F20286O514P011P634P824P999Q760R599R558Q745Q183Q375R087J0112J1261
57318G40948J1892J1546J0840J0771J1361J1900J2200J2565J2894J2867J2762
$$ plain form
57417 258948 258835 259208 260231 261437 262249 262891 263976 265399 266590 267653 269310 271719 274284 276651 279010
57402 279010 281382 283464 285287 287239 289365 291452 293824 297203 301581 306049 309943 313469 316981 320374
57388 320374 323422 326111 328505 330837 333766 337884 342845 347672 351949 356004 359922 363333 366390 369983
57374 369983 374512 379251 383401 387162 391250 395874 400723 405557 410358 415167 420068 425111 430105 434783
57360 434783 439221 443793 448724 454153 460524 468202 476654 484693 491762 498371 505092 511828 518379 525040
57346 525040 532180 539640 546957 553899 560550 567171 574053 581206 588173 594550 600625 607005 613705 620286
57332 620286 626800 633811 641445 649269 657268 666028 675627 685185 693930 702113 710488 719575 729687 740948
57318 740948 752840 764386 775226 785997 797358 809258 821458 834023 846917 859784 872546
57307H72546J3023J3285J2939J2358J2406J2961J3182J3058J3393J4347J5213
57296A018711J5715J6241J6782J6821J6528J6751J7648J8363J8328J7858J7218
57285A206964J6220J5061J4581J5204J6409J7480J8160J8473J8634J9210K0568
57274A396964K2142K3007K3135K3270K3718K4294K5227K6953K8989L0243L0609
57263A678551L1141L2474L4075L5250L5822L5699L4905L4216L4618L5925L6873
57252B059549L6899L6681L6857L7330L8090L9552M1654M3666M5211M6604M8016
57241B510109M9312N0765N2787N4864N6081N6744N8058N9887O0497N9043N6821
57230C124968N5347N4467N3208N1314M9166M7208M6131M6638M8568N1140N4471
$$ plain form
57307 872546 885569 898854 911793 924151 936557 949518 962700 975758 989151 1003498 1018711
57296 1018711 1034426 1050667 1067449 1084270 1100798 1117549 1135197 1153560 1171888 1189746 1206964
57285 1206964 1223184 1238245 1252826 1268030 1284439 1301919 1320079 1338552 1357186 1376396 1396964
57274 1396964 1419106 1442113 1465248 1488518 1512236 1536530 1561757 1588710 1617699 1647942 1678551
57263 1678551 1709692 1742166 1776241 1811491 1847313 1883012 1917917 1952133 1986751 2022676 2059549
57252 2059549 2096448 2133129 2169986 2207316 2245406 2284958 2326612 2370278 2415489 2462093 2510109
57241 2510109 2559421 2610186 2662973 2717837 2773918 2830662 2888720 2948607 3009104 3068147 3124968
57230 3124968 3180315 3234782 3287990 3339304 3388470 3435678 3481809 3528447 3577015 3628155 3682626
57219C682626N9617O6714P4466Q1891Q9152R5954J00719J02323J01316R8546R3937
57208D647261Q7651Q1032P5090O9068O1757N3269M4413L5300K5900J7182J0449
57197E208372O035L591L052M366O940J0184J4055J8418K2551K5998K9065L1841
57185E384468L3588L3809L3048L1956L0446K8465K6587K5151K3748K2209K1083
57174E694558K0627K0409K0439K1273K2455K2444K1042K0124K0888K2006K1815
57163E928080K0789K0473K1244K2634K4513K6437K7099K5867K3842K2074J9997
57152F183049J6837J3176R689N825J172l395p516j2632j9876k8275l6962m7428
57140F073664o1419p8095r5364j12567j29677j45236j57468j66226j71760j72945
$$ plain form
57219 3682626 3742243 3808957 3883423 3965314 4054466 4150420 4251139 4353462 4454778 4553324 4647261
57208 4647261 4734912 4815944 4891034 4960102 5021859 5075128 5119541 5154841 5180741 5197923 5208372
57197 5208372 5214407 5217998 5221050 5225416 5232356 5242540 5256595 5275013 5297564 5323562 5352627 5384468
57185 5384468 5418056 5451865 5484913 5516869 5547315 5575780 5602367 5627518 5651266 5673475 5694558
57174 5694558 5715185 5735594 5756033 5777306 5799761 5822205 5843247 5863371 5884259 5906265 5928080
57163 5928080 5948869 5969342 5990586 6013220 6037733 6064170 6091269 6117136 6140978 6163052 6183049
57152 6183049 6199886 6213062 6222751 6228576 6229748 6226353 6218837 6206205 6186329 6158054 6121092 6073664
57140 6073664 6012245 5934150 5838786 5726219 5596542 5451306 5293838 5127612 4955852 4782907
57130D782907j69075j62038j54470j47312j41383j39541j44488j55796j71650
57121C397154j91593k14820k37812k57093k72828k86816k99002l09647l22826
57112A004717l43670B87552a23499m56375n09312n67094o28543o99228p88106
57103c772157r01563j045793j231927j472863j778013k157538k628392l209858
57095a8198104l916842m757443n710619o673209p437916p779066p609054p056240
57087f9138493o375818n780208n345357n042743m820225m643700m476496m226429
57079a09849469l719630k761180j274312N93648K515559M158647N341688O064514
57071i8930535O435622O588005O628689O617220O567250O468505O309627O083405
$$ plain form
57130 4782907 4613832 4451794 4297324 4150012 4008629 3869088 3724600 3568804 3397154
57121 3397154 3205561 2990741 2752929 2495836 2223008 1936192 1637190 1327543 1004717
57112 1004717 661047 287552 -123499 -579874 -1089186 -1656280 -2284823 -2984051 -3772157
57103 -3772157 -4673720 -5719513 -6951440 -8424303 -10202316 -12359854 -14988246 -18198104
57095 -18198104 -22114946 -26872389 -32583008 -39256217 -46694133 -54473199 -62082253 -69138493
57087 -69138493 -75514311 -81294519 -86639876 -91682619 -96502844 -101146544 -105623040 -109849469
57079 -109849469 -113569099 -116330279 -117604591 -117010943 -114495384 -110336737 -104995049 -98930535
57071 -98930535 -92494913 -85906908 -79278219 -72660999 -66093749 -59625244 -53315617 -47232212
57063d7232212N783059N406870M966068M481291L972545L457667K957017K491501
57055a3716194K075061J713226J407481J156026R51730P85030O49574N41743M56125
57046c980198L86045L28188K82363K46770K17331J91715J70288J52892J37998
57037a866608J25151J15023J06760R8297Q9608Q2678P7956P3636O8877O4951O2484
57026i01187O0208N7233N4335N2117M9928M7481M5735M5369M5905M6947M8815
57015c47114N1436N4003N6084N7727N8217a3216C9544M9188M6840M4845M1867
57004B22284L7460L1521K3833J4736N178m175j2901j9807k3393k3648k2102j9834
56992B09152j6698j2737q887n768l021l92J661K857L464L465K607J499J317J897
$$ plain form
57063 -47232212 -41449153 -36042283 -31076215 -26594924 -22622379 -19164712 -16207695 -13716194
57055 -13716194 -11641133 -9927907 -8520426 -7364400 -6412670 -5627640 -4978066 -4436323 -3980198
57046 -3980198 -3594153 -3265965 -2983602 -2736832 -2519501 -2327786 -2157498 -2004606 -1866608
57037 -1866608 -1741457 -1626434 -1519674 -1421377 -1331769 -1249091 -1171135 -1097499 -1028622 -963671 -901187
57026 -901187 -840979 -783746 -729411 -677294 -627366 -579885 -534150 -488781 -442876 -395929 -347114
57015 -347114 -295678 -241675 -185591 -127864 -69647 -13216 39544 88732 135572 180417 222284
57004 222284 259744 291265 315098 329834 335012 330837 317936 298129 274736 251088 228986 209152
56992 209152 192454 179717 170830 165062 162041 161649 163310 166167 169631 173096 175703 177202 178519 180416
56978A80416J628k42k571m253n670p301q339p939o688n583m362k181P42L328N025
56963A36010O024O554O879P584Q922J0213J0746J0807J0995J0931R620O927L719
56950B45931O81k168m774o713p659p618o633m811k626o93R62K929N608Q641J1205
56935B32262J2692J3046J2702J2218J1829J1385J0707R776Q463O359L167r11n383
56922C38312r832j3853j6793j8019j7486j5882j4095j2603j1322r909q176o231
56910A84111m354k848j984j782j783j360m06O33J646L191N473P590Q523Q561Q820
56895B14031R650J0514J1275J2433J3883J4572J3798J2052J0218Q773Q072Q430
56883C47701R331R438P958N417K576m99l733o279p334o990n553k698J771O875
$$ plain form
56978 180416 182044 181802 179231 174978 169308 162007 153668 145729 139041 133458 129096 126915 127657 130985 136010
56963 136010 142034 148588 155467 163051 171973 182186 192932 203739 214734 225665 235285 242212 245931
56950 245931 246612 244444 239670 232957 225298 217680 211047 206236 203610 202917 203879 206808 212416 221057 232262
56935 232262 244954 258000 270702 282920 294749 306134 316841 326617 335080 341439 344606 343695 338312
56922 338312 328480 314627 297834 279815 262329 246447 232352 219749 208427 198518 190342 184111
56910 184111 179757 176909 174925 173143 171360 170000 169594 170227 171873 175064 180537 188127 196650 205211 214031
56895 214031 223681 234195 245470 257903 271786 286358 300156 312208 322426 331199 339271 347701
56883 347701 357032 366470 374428 379845 382421 381922 378189 371910 364576 357586 352033 349335 351106 357981
56869C57981J1252J4671J7944K1534K5072K7902K9379K8931K6778K4286K2800
56858F08530K2180K1228J9150J5724J0445K886n915j3530j8139j9815j9553j7774
56846F05417j4242q884k132N313J2789J9877K6539L2856L8571M2846M4648M3513
56834H47111M0292L7013L5374L4935L3233K7884J8177M634j1703k8746m3136n2075
56822I42993n5253n4173n0085m3599l5740k7729j9673j0795j193P759J4872J9905
56810F87289K2713K3000K1473K0077K0261K1571K2273K0577J5089N252p765k1250
56798H50560l2620m0615m4879m5457m3133l9251l4444k8357k1042j3726p484k135
56786D97417K696O316P897Q005P985Q269Q391Q275Q255P762N213l80q201j6215
$$ plain form
56869 357981 369233 383904 401848 423382 448454 476356 505735 534666 561444 585730 608530
56858 608530 630710 651938 671088 686812 697257 700143 694228 680698 662559 642744 623191 605417
56846 605417 591175 582291 580159 585472 598261 618138 644677 677533 716104 758950 803598 847111
56834 847111 887403 924416 959790 994725 1027958 1055842 1074019 1078653 1066950 1038204 995068 942993
56822 942993 887740 833567 783482 739883 704143 676414 656741 645946 644753 652512 667384 687289
56810 687289 710002 733002 754475 774552 794813 816384 838657 859234 874323 879575 871810 850560
56798 850560 817940 777325 732446 686989 643856 604605 570161 541804 520762 507036 499552 497417
56786 497417 500113 506429 514326 522331 530316 538585 546976 555251 563506 571268 576481 576101 567900 551685
56772E51685k2558k6461k8343k9092k9074k7938k5584k2696j9974j7332j4545
56761B88088j2094j0547r475p978o134m940m800m967m710m166l783l577l316k975
56747B04626k646k260j715j087o07n36j018j802k241j849q43R0M77L07j37l76
56731A88383M2J030J795J684J044Q20J403K338L019L163K670J619M40k62k22L87
56715B09353J211J804J725R64J84K5L25L63j78r04j224q44J9N78Nj467k378j600
56697B07961K21J509J726J613J663J484P90K1m13p22j159j468j304p62j43M19
56681B11436Q14R54J003J219J443J225O26L34O97J178J093N02K6J22P30J398J564
56664B26364J075N42P66J713K428K185J297O01N55J060J772K293K328J912J335
$$ plain form
56772 551685 529127 502666 474323 445231 416157 388219 362635 339939 319965 302633 288088
56761 288088 275994 265447 255972 247994 241860 236920 232120 227153 222443 218277 214494 210917 207601 204626
56747 204626 201980 199720 198005 196918 196311 195775 194757 192955 190714 188865 188022 188112 188589 188896 188759 188383
56731 188383 188425 189455 191250 192934 193978 194798 196201 198539 201558 204721 207391 209010 209450 209188 208966 209353
56715 209353 210564 212368 214093 215057 215241 215266 215591 215954 215776 214872 213648 212804 212823 213401 213406 211939 209561 207961
56697 207961 208182 209691 211417 213030 214693 216177 216967 216988 216575 215853 214694 213226 211922 211160 211017 211436
56681 211436 212250 213204 214207 215426 216869 218094 218720 219054 219751 220929 222022 222524 222550 222672 223402 224800 226364
56664 226364 227439 227981 228747 230460 232888 235073 236370 236971 237526 238586 240358 242651 244979 246891 248226
56649B48226P81K43k11m52n47p30r83j045q27m75n2M80R87J258J315J242Q86J71
56631B50267m52m95j85l9J43R34K040K436J899J401J546J705J177L84J93O78J260
56614B64892J528J379P95K5l77j11N94J484K494L160K616Q38p93r31J08Q92O54
56597B79247k05j107j944k677k957k491j493o13l93p27r63o61j03K17L12M21L21
56580B64184k51p25k51Q58J418J287J672L080M295M263L741L994M808N129N002
56565C02504N481O929Q623R839J0435J0521J0447J0889J2094J3286J3542J2937
56553D27527J2026J0732Q715O535N202M777M400L686L005K486J792R15J26q81
56539D91043k680m848o209o586p133q452r623r754r466r865j0821j1285j0925
$$ plain form
56649 248226 249007 249250 249039 248587 248040 247310 246327 245282 244455 243980 243928 244408 245395 246653 247968 249210 250096 250267
56631 250267 249815 249320 249135 249096 249239 250173 252213 254649 256548 257949 259495 261200 262377 262761 262954 263632 264892
56614 264892 266420 267799 268594 268619 268242 268131 268725 270209 272703 275863 278479 279317 278524 277593 277701 278593 279247
56597 279247 279042 277935 275991 273314 270357 267866 266373 265760 265367 264640 263677 263016 262913 263130 263442 263863 264184
56580 264184 263933 263208 262957 263815 265233 266520 268192 271272 275567 279830 283571 287565 292373 297502 302504
56565 302504 307985 314914 323537 333376 343811 354332 364779 375668 387762 401048 414590 427527
56553 427527 439553 450285 459000 465535 470737 475514 479914 483600 486605 489091 490883 491798 491924 491043
56539 491043 488363 483515 477306 470720 463587 455135 445512 435758 426292 416427 405606 394321 383396
56526C83396j0353r934r308q201p033o370o200o091n840n672n776n941n774n169
56512B85734m317l352k287j367j034j338j709j670j464j575j841j599o66L54P62
56497B62631N06L3k97n19q49j240j258o11K58M99r7p72p46j02N54Q84Q49L69n19
56478B59573j301j334n75L38O98L85l7J95J148J876J429J92n24k85ql54o46j10
56460B60660P98J184J106J125J088N29j49o6O72J018M77l50p61o60k63J24R3m23
56442B66202p70l16N31Q49N79N16J043J721K138K280J998J036j67o32o1P22Q97
56425B78566N53K40J54J04p7m15p57p38j00R05J624J600Q98Nm16J3Q80J253P60
56406B85052om05n00m73o6P62J306J096O81O80P23L79L27J314K561K665J724J044
$$ plain form
56526 383396 373043 363109 353801 345600 338567 332197 325997 319906 314066 308394 302618 296677 290903 285734
56512 285734 281417 278065 275778 274411 273377 272039 270330 268660 267196 265621 263780 262181 261515 261869 262631
56497 262631 263137 263170 262873 262354 261505 260265 259007 258396 258654 259153 259056 258284 257538 257436 257990 258874 259723 260092 259573
56478 259573 258272 256938 256363 256701 257399 257784 257747 257942 259090 260966 262395 262587 262063 261778 261770 261416 260770 260660
56460 260660 261458 262642 263748 264873 265961 266490 266341 266275 266947 267965 268442 268092 267331 266671 266408 266532 266625 266202
56442 266202 265432 265116 265647 266496 267075 267591 268634 270355 272493 274773 276771 277807 277640 277008 276947 277669 278566
56425 278566 279119 279359 279513 279617 279540 279125 278368 277630 277530 278435 280059 281659 282557 282562 282146 282159 283039 284292 285052
56406 285052 285046 284641 284141 283668 283602 284364 285670 286766 287447 288127 288850 289229 289556 290870 293431 296096 297820 298864
56388B98864J025R07N20N72J108J244Q01P26J475K320K633K631K413J615N27K35
56372C19616R90J640J278M40l9k24m36m70k36k61p97j209j027p93j075j395j032
56355C14970k68J04L8J49O23R62P70K55m8J80O72P62J77m23j62Q50J609J523R74
56336C23717O08O83J158J797K120J891J563J603J695J349R28R71R86L01k06R27
56320C42091L090L871K459Q65Q66J648J615R46Q36J341J635J671K142L107L852
56305C72035L898L364K577K021K219L047L578L168K283J680J362Q82K73N5N22
56290D02964J416K140K194J772J796K714L573L194K018J593K301L005L052L066
56276D36798L386L434L203L699N078N951N598N393O742Q865R995R731Q996Q582
$$ plain form
56388 298864 299889 300796 301316 301888 302996 304240 305041 305767 307242 309562 312195 314826 317239 318854 319381 319616
56372 319616 320606 322246 323524 323964 323925 323701 323265 322795 322559 322298 321501 320292 319265 318472 317397 316002 314970
56355 314970 314702 314806 314844 314993 315616 316578 317348 317603 317555 317735 318407 319169 319346 318923 318761 319611 321220 322743 323717
56336 323717 324325 325008 326166 327963 330083 331974 333537 335140 336835 338184 339112 340083 341069 341370 341164 342091
56320 342091 345181 349052 351511 352376 353242 354890 356505 357451 358287 359628 361263 362934 365076 368183 372035
56305 372035 375933 379297 381874 383895 386114 389161 392739 395907 398190 399870 401232 402114 402387 402442 402964
56290 402964 404380 406520 408714 410486 412282 414996 418569 421763 423781 425374 427675 430680 433732 436798
56276 436798 440184 443618 446821 450520 455598 461549 467147 472540 479282 488147 498142 507873 516869 525451
56262E25451Q872J0079J1617J2144J1432J1197J2917J5694J7611J8349J9032K0181
56250F94576K1405K2668K4354K6286K7857K9026L0160L1133L1458L1052L0004
56239I99979K8038K5037K1711J8849J6196J2947Q912M468k09n005r314j2516j4755
56226A094338j6705j8748k0852k2799k4183k4746k4921k5355k5594k4422k1913
56215H44100j9871j9477j9730j9145j7851j6827j6083j4990j3595j2382j1257
56204F62892r926q706p994p424o438n207m178l366k737k564k665k216j051k55
56190E98165n99j433j852j923j835j043O30K142K591K410K257J894J228J185K236
56175F06053L308L494L530M210M615L627K061J516K067K787L595M893O180O740
$$ plain form
56262 525451 534323 544402 556019 568163 579595 590792 603709 619403 637014 655363 674395 694576
56250 694576 715981 738649 763003 789289 817146 846172 876332 907465 938923 969975 999979
56239 999979 1028017 1053054 1074765 1093614 1109810 1122757 1131669 1136137 1135928 1130923 1121609 1109093 1094338
56226 1094338 1077633 1058885 1038033 1015234 991051 966305 941384 916029 890435 866013 844100
56215 844100 824229 804752 785022 765877 748026 731199 715116 700126 686531 674149 662892
56204 662892 652966 644260 636266 628842 622404 617197 613019 609653 606916 604352 601687 599471 598420 598165
56190 598165 597566 596133 594281 592358 590523 589480 590110 592252 594843 597253 599510 601404 602632 603817 606053
56175 606053 609361 612855 616385 620595 625210 628837 630898 632414 634481 637268 640863 645756 651936 658676
56161F58676O992P565P993P847Q117R656J1306J1537J1110J1989J4238J6162J7129
56148H00317J8169K0000K2383K5335K9254L3817L8239M2578M7607N3648O0585
56137A191932O8521P7308Q6085R4427J03146J12704J21837J29133J34989J40497
56127B260579J45353J48479J49700J49039J45311J37171J24903J09794R2809P5378
56117C538516O0064M8343L8643K8322J6543L483j1648k9380m7825o4124p7380
56106C503557q8340r7376j04924j12640j21643j30515j37093j41110j42926j41270
56096B285720j34979j25691j15916j05616r3470q0342o8433n7985m7944l8863
56086A416481l2045k6584k0535j4302r740o669l455l18J289J928L431N389N720
$$ plain form
56161 658676 665668 673233 681226 689073 697190 706846 718152 729689 740799 752788 767026 783188 800317
56148 800317 818486 838486 860869 886204 915458 949275 987514 1030092 1077699 1131347 1191932
56137 1191932 1260453 1337761 1423846 1518273 1621419 1734123 1855960 1985093 2120082 2260579
56127 2260579 2405932 2554411 2704111 2853150 2998461 3135632 3260535 3370329 3463138 3538516
56117 3538516 3598580 3646923 3685566 3713888 3730431 3733914 3722266 3692886 3645061 3580937 3503557
56106 3503557 3415217 3317841 3212917 3100277 2978634 2848119 2711026 2569916 2426990 2285720
56096 2285720 2150741 2025050 1909134 1803518 1710048 1629706 1561273 1503288 1455344 1416481
56086 1416481 1384436 1357852 1337317 1323015 1313275 1306606 1303151 1302833 1304122 1306050 1309481 1314870 1320590
56073A320590M312K932J948M21j215j750j889k968l846k503QJ011P92J866M304
56058A324013N930O621Q172J0258J0864J0564J1967J4958J6816J7070J7884J9506
56046A474623J9931J9320K0208K2833K4668K5109K6232K8386K9476K9268L0036
56035A750090L2244L3824L4364L5745L8118L9538M0012M1564M3936M4700M4001
56024B178136M4648M7118M9083N0087N1957N4487N5614N5958N8197O1949O4498
56013B771732O6220O9797P4497P7259P9094Q3866R0960R6042R8943J03582J10091
56002C722083J14782J18020J24065J32572J38813J42987J50455J61715J71442
55993D976934J78747J88788K02502K14761K24827K38363K56650K74285K90262
$$ plain form
56073 1320590 1324902 1327834 1329782 1330203 1328988 1327238 1325349 1322381 1318535 1316032 1316040 1317051 1317843 1319709 1324013
56058 1324013 1329943 1336564 1344736 1354994 1365858 1376422 1388389 1403347 1420163 1437233 1455117 1474623
56046 1474623 1494554 1513874 1534082 1556915 1581583 1606692 1632924 1661310 1690786 1720054 1750090
56035 1750090 1782334 1816158 1850522 1886267 1924385 1963923 2003935 2045499 2089435 2134135 2178136
56024 2178136 2222784 2269902 2318985 2369072 2421029 2475516 2531130 2587088 2645285 2707234 2771732
56013 2771732 2837952 2907749 2982246 3059505 3138599 3222465 3313425 3409467 3508410 3611992 3722083
56002 3722083 3836865 3954885 4078950 4211522 4350335 4493322 4643777 4805492 4976934
55993 4976934 5155681 5344469 5546971 5761732 5986559 6224922 6481572 6755857 7046119
55984G046119L10525L36531L62586L87809M19150M58845N01002N44508N96759
55975A0963834O60444P30019Q06010Q98764J013080J144307J295660J483854J721799
55966B0717771K013314K372423K829106L406302M108757M941409N916031P031270
55958E3336383Q276775R677564J1305710J3209839J5322284J7421571J9155680
55951A47705806K0123904K0043421J8935208J7150915J5181231J3428078J2100391
55944B64668954J1136839J0059414P993228M136153j568282q219833j4480167
55937B73726306j9317674k2332324k3598765k3416182k2190478k0357050j8269991
55930A24243842j6146450j4112111j2253956j0615714r190260p951551o880553
$$ plain form
55984 7046119 7356644 7693175 8055761 8443570 8862720 9321565 9822567 10367075 10963834
55975 10963834 11624278 12354297 13160307 14059071 15072151 16216458 17512118 18995972 20717771
55966 20717771 22731085 25103508 27932614 31338916 35447673 40389082 46305113 53336383
55958 53336383 61613158 71290722 82596432 95806271 111128555 128550126 147705806
55951 147705806 167829710 187873131 206808339 223959254 239140485 252568563 264668954
55944 264668954 275805793 285865207 293858435 297994588 296426306 288206473 273726306
55937 273726306 254408632 232076308 208477543 185061361 162870883 142513833 124243842
55930 124243842 108097392 93985281 81731325 71115611 61925351 53973800 47093247
55923D7093247n953916n137308m408057l766630l214973k741213k334116j993486
55915A7543548j715631j484521j286899j121938r88033q74087p72020o84847o14471
55906H001101n53416m95851m45378m04767l68596l32838l01587k77674k56143
55897D564851k33227k12695j97386j83189j67218j53403j44269j35375j23564
55888C014525j12780j06109r9697r0249q1301p6283p2126o5390n8345n3532m8376
55877B150337m0592l3293k9446k6675k2387j8854j8379j8609j7439j7541k1317
55866A885805k6097k8939l1617l6248m0576m2225m3379m6594m9901n0587n0013
55855A439629n0389n0313m7800m4304m1693l8636l3898k9855k8776k8708k6949
$$ plain form
55923 47093247 41139331 36002023 31593966 27827336 24612363 21871150 19537034 17543548
55915 17543548 15827917 14343396 13056497 11934559 10946526 10072439 9300419 8615572 8001101
55906 8001101 7447685 6951834 6506456 6101689 5733093 5400255 5098668 4820994 4564851
55897 4564851 4331624 4118929 3921543 3738354 3571136 3417733 3273464 3138089 3014525
55888 3014525 2901745 2795636 2695939 2605690 2524389 2448106 2375980 2310590 2252245 2198713 2150337
55877 2150337 2109745 2076452 2047006 2020331 1997944 1979090 1960711 1942102 1924663 1907122 1885805
55866 1885805 1859708 1830769 1799152 1762904 1722328 1680103 1636724 1590130 1540229 1489642 1439629
55855 1439629 1389240 1338927 1291127 1246823 1205130 1166494 1132596 1102741 1073965 1045257 1018308
55844A018308k4510k3422k2728k0826j8924j8497j8067j6037j3878j3157j2257
55833H16005r576p055o897p459o108l690k515k135p64J137K073K540L733N021
55819G84310N492O033P234P468N686L853L787L926K157n24k251l805o735j0022
55805H06609j1868j2933j4730j6562j7079j7023j7487j7287j5099j2410j1280
55794F42851j0909r424p421o526o051m332k012p81j77J289K934L012K086K155
55780F06694L226L534K605J358m0k003l899n007o217q509j0647j0841r710r163
55766E51381r218q514p191o719p362q177q927r920j0490r802q546p885p479o423
55752D34728n255m988n053m344l410l500m242m429m205m461m836m417l607l232
$$ plain form
55844 1018308 993798 970376 947648 926822 907898 889401 871334 855297 841419 828262 816005
55833 816005 806429 799374 792477 785018 778910 775220 772705 770570 769806 770943 773016 775556 779289 784310
55819 784310 789802 795835 803069 810537 816223 820076 823863 827789 829946 829422 827171 823366 816631 806609
55805 806609 794741 781808 767078 750516 733437 716414 698927 681640 666541 654131 642851
55794 642851 631942 622518 615097 608571 602520 598188 596176 595395 595218 596507 599441 602453 604539 606694
55780 606694 609920 613454 616059 617417 617377 615374 611475 606468 600251 591742 581095 570254 560544 551381
55766 551381 542163 533649 526458 519739 512377 504200 495273 485353 474863 465061 456515 448630 441151 434728
55752 434728 429473 424485 419432 415088 411678 408178 403936 399507 395302 390841 386005 381588 377981 374749
55738C74749k705j192L45M47l74o74o49j301k068j758j085j661l048l418k713
55723C52895k555l270l513k792k039j680j255q87j094j299m94P97J197Q21Q77
55708C35709J324J120N85J127K620L271K410J298Q53M99k94j088j497j677j599
55693C44661j116p38r70j092j03J478K311K445K989L946M271L947M011M500M351
55678C74891L498L155L744M334M438M620M988M791L909L160K787K129J135O09
55664D22188N86j6j647l472m874o213p597q331q170p905q086q254p934p416o936
55649C35923o138m875l763l435l858m606n200n065l949k550j929k244k629k431
55635B83251j875j511j642k217k788k761k115j547j426j284r44j178k351l318
$$ plain form
55738 374749 372044 370852 371197 371644 371270 370596 369947 368646 366578 364820 363735 362074 359026 355608 352895
55723 352895 350340 347070 343557 340765 338726 337046 335791 334904 333810 332511 332017 332814 334011 334832 335709
55708 335709 337033 338153 338738 339865 342485 345756 348166 349464 350317 350816 350522 349434 347937 346260 344661
55693 344661 343545 342807 341837 340745 340642 342120 344431 346876 349865 353811 358082 362029 366040 370540 374891
55678 374891 378389 381544 385288 389622 394060 398680 403668 408459 412368 415528 418315 420444 421579 422188
55664 422188 422774 422758 421111 417639 412765 406552 398955 390624 382454 374549 366463 358209 350275 342859 335923
55649 335923 329785 324910 321147 317712 313854 309248 304048 298983 295034 292484 290555 288311 285682 283251
55635 283251 281376 279865 278223 276006 273218 270457 268342 266795 265369 264085 263141 261963 259612 256294
55621B56294k899j711j141j261j197r29j034j120k83J060J496P39j56o10j051
55606B46197j621j862j792j911k054j603r11j105k275l156k851j781p78k60l14
55591B21923o37n14K72Q13L86j87K41J184J335P82O85J102J079O52P85J393J454
55574B32748J110J558K607K574J143J74Q41J955K127J835K074K556K495K036J710
55559B59543J360P54M00P96J483J624J033O9r20j637j824j593j224o25L06R31
55543B60476M59p12j342j113r01j228j706k141k838l460l085j852j237k026l240
55528B34054l704l522l318l093k667k357k446k560k206j354k57P34J014K80p04
55513B07894q49l67m83j411j962j472p64o44p46m53J25P86J721K705K874J997
$$ plain form
55621 256294 253395 251684 250543 249282 248085 247156 246122 245002 244719 245779 247275 248014 247858 247248 246197
55606 246197 244576 242714 240922 239011 236957 235354 234443 233338 231063 227907 225056 223275 222497 222237 221923
55591 221923 221286 220772 221044 221857 222243 222056 222297 223481 224816 225598 226283 227385 228464 229116 229901 231294 232748
55574 232748 233858 235416 238023 240597 241740 241914 242755 244710 246837 248672 250746 253302 255797 257833 259543
55559 259543 260903 261657 262057 262853 264336 265960 266993 267062 266142 264505 262681 261088 259864 259239 259545 260476
55543 260476 260935 260223 258881 257768 256867 255639 253933 251792 248954 245494 242409 240557 239320 237294 234054
55528 234054 230350 226828 223510 220417 217750 215393 212947 210387 208181 206827 206570 207304 208318 208598 207894
55513 207894 207045 206678 206195 204784 202822 201350 200586 199942 199196 198743 198868 199654 201375 204080 206954 208951
55497B08951J006O38N28J67k05l13m45o97n80o9pq27j768k052j899j716j303o06
55479A98803k40m41m35K81R58Q03K92K63N09L60jK9K10j73r02r43K9J136J440
55460B01978R94N11M15M49J45m63p71l98K12M38L45L02P3p97j810j847p36M47
55442A99487R15R11P63K65n78j131r85m72lL91N51K14k54l9Q79J601J710J755
55424B05980K012J909J193N97P16J192J553J946K446K610K313K100K148J877J121
55409B31713O18P20O61p4p19m73J26K4q68j891k684l230l432l339l255l112k415
55392B08370j281o62r41j279j008p48j277k110k175j232J17J286J820J341J05
55377B00326q97j002n28jM50N52k45j700k567k197j423j149j075o25q8J39N56
$$ plain form
55497 208951 209957 210595 211123 211290 211085 210772 210327 209630 209050 208981 208974 208147 206379 204327 202428 200712 199409 198803
55479 198803 198563 198122 197687 197968 198926 199729 200021 200284 200793 201153 201152 201181 201391 201218 200316 199373 199402 200538 201978
55460 201978 202972 203483 203898 204347 204492 204029 203258 202860 203072 203510 203855 204157 204230 203433 201623 199776 199040 199487
55442 199487 200402 201313 202076 202341 201763 200632 199647 199175 199172 199563 200114 200328 200074 200035 200914 202515 204225 205980
55424 205980 207992 209901 211094 211691 212407 213599 215152 217098 219544 222154 224467 226567 228715 230592 231713
55409 231713 232331 233051 233712 233638 232919 232446 232572 232596 231728 229837 227153 223923 220491 217152 213897 210785 208370
55392 208370 207089 206427 205486 204207 203199 202451 201174 199064 196889 195657 195774 197060 198880 200221 200326
55377 200326 199429 198427 197899 197898 198348 198900 198655 196955 194388 192191 190768 189619 188544 187919 187831 187970 188526
55360A88526J599K522K299J137R4l11k96j52j51n48j040q43J05Q50Q75P91R27
55343A96384N62n43j167m33N63L74n98j028q95j084j463j088J2Q79J254J681K116
55326A95526J843Q27p3k82rL27L70k38j316j887j324l56j6j44J03P14R51O34J93
55307A95843k07n87n27L08J300J558J059K96o63j711j994r40N27J074P87N61L47
55290A97031n14j604j739p92K87J075J802K142J479L94J77Q14R72J71o11p61q68
55273A99455j281j330n73L25N97K86j66m04k1J040J831J289q9o77j3O33L28k59
55255B00971k20K24M63N53Q00J080J206J246J119N05m16r29p64l66K4N94J096
55238B07186P83l57j288j293q20n22l96l18m76p52n86j0J49l72o28O3R07P46k54
$$ plain form
55360 188526 190125 192647 194946 196083 196177 195866 195570 195418 195267 194719 193679 192836 192941 193791 194666 195457 196384
55343 196384 196946 196403 195236 194803 195366 195740 195142 194114 193219 192135 190672 189584 189596 190475 191729 193410 195526
55326 195526 197369 198196 198123 197841 197832 198159 198529 198291 196975 195088 193764 193408 193392 193248 193351 194065 195016 195650 195843
55307 195843 195636 195049 194522 194830 196130 197688 198747 199043 198380 196669 194675 193735 194262 195336 196123 196684 197031
55290 197031 196517 194913 193174 192382 192669 193744 195546 197688 199167 199561 199738 200552 201524 201695 201084 200323 199455
55273 199455 198174 196844 196271 196596 197193 197479 197313 196909 196888 197928 199759 201048 200959 200282 200269 200902 201230 200971
55255 200971 200751 200975 201438 201991 202791 203871 205077 206323 207442 207947 207531 206602 205838 205472 205496 206090 207186
55238 207186 207969 207612 206324 205031 204211 203689 203293 202975 202499 201747 201161 201151 201300 200928 200300 200363 201270 202016 201762
55219B01762r11n21O18J794K345J985J081L63l7o56j569j903j042L51J174J178
55203B06012Q12L08l30p58n48J19N64M18o1l51j88K09L35J6k13J70P04M08o93
55184B06933j381r17n0J61k07l34O1N96R58J125J034O72L41L29M96M70J60k47
55166B10200n28m61Q7Q09J069O91L31O71J557K274K423K125J644J228J125J340
55150B26585J473J134M22k23n65p24r49j396k028k506k434j807j061n15j0O75
55134B16071J276J238L79q11j586j591j123p72p05m54L57J263J361M84m52m95
55118B14440K66R56J005O80N31O25N37P2l47k41J81L59K88M52P77N55k44n37K66
55099B20621J085O17o51j105l57L82K89p1mJ62k33j066j608j344l68P04J089N69
$$ plain form
55219 201762 200851 200330 200948 202742 205087 207072 208153 208516 208479 207823 206254 204351 203309 203660 204834 206012
55203 206012 206824 207132 206802 206044 205496 205615 206179 206597 206536 206185 205997 206206 206541 206557 206344 206514 207218 207626 206933
55184 206933 205552 204635 204585 204746 204539 204205 204266 204862 205820 206945 207979 208651 208992 209321 209817 210287 210447 210200
55166 210200 209672 209211 209298 210107 211176 211867 212198 212869 214426 216700 219123 221248 222892 224120 225245 226585
55150 226585 228058 229192 229614 229391 228826 228102 227153 225757 223729 221223 218789 216982 215921 215406 215396 216071
55134 216071 217347 218585 218964 218153 216567 214976 213853 213081 212376 211922 212279 213542 214903 215387 214935 214440
55118 214440 214706 215662 216667 217347 217878 218503 219040 219112 218765 218524 218705 219064 219352 219804 220581 221136 220892 220355 220621
55099 220621 221706 222323 221672 220567 220210 220592 220881 220810 220806 220968 220735 219669 218061 216717 216349 217053 218142 218711
55081B18711j27k09Q7n1o22q17m14j41l98n84j81L98N20J91k51o94j049j064p49
55062B12556m57k47K11P43N95l74j115p15L39R40Q63P45Q77Q65M56RqL67O37M39
55042B17726L5N7O16R86N49k00k87L59R37J071J093R37k9j666k624k011o18K74
55024B17205N31Q00J141J086P06O14J001J364J252O99j6n85o98l16J68L30K12
55007B25494J67L37N87Q22J059J290J460J485J250P28J70r1m7K3J6Q1K54M30O51
54988B36166J001J253J120P66N48L63o5m11j33L83J18r30j517q77L17J164J637
54971B40903J966J927J531J481K061K454J936J106R13J156R58K25l04j71M86J360
54955B59988K004J858J014N41J218K410L009L039L299L873M192M373N266P053
$$ plain form
55081 218711 218584 218375 218462 218411 217789 216972 216558 216417 216019 215435 215254 215652 216172 216363 216112 215418 214369 213305 212556
55062 212556 212099 211852 212063 212806 213401 213027 211912 211197 211536 212476 213339 214084 214961 215826 216282 216291 216283 216650 217287 217726
55042 217726 217761 217818 218434 219420 219969 219769 219482 219841 220778 221849 222942 223879 223850 222184 219560 217549 216931 217205
55024 217205 217736 218536 219677 220763 221469 222083 223084 224448 225700 226399 226383 225798 225100 224784 224952 225282 225494
55007 225494 225661 225998 226585 227407 228466 229756 231216 232701 233951 234679 234849 234758 234711 234734 234750 234831 235085 235515 236166
54988 236166 237167 238420 239540 240306 240854 241217 241152 240741 240608 240991 241109 240179 238662 237785 238102 239266 240903
54971 240903 242869 244796 246327 247808 249869 252323 254259 255365 256278 257434 258392 258617 258313 258142 258628 259988
54955 259988 261992 263850 264864 265405 266623 269033 272042 275081 278380 282253 286445 290818 296084 303137
54941C03137Q744R407R183Q884R096R799J0405J0237R314Q476Q267Q061O896M835
54927D24741K688P18j401l567n205o321p614r317j0776j1444j1461j1041j0019
54914C39981q469p055o265n771m975l822k678j795j164o99j97N46J439K171K752
54899C03999L640N071O601P633Q139Q503Q852Q963Q766Q521Q390Q109P315O038
54885D08540M657L352J868j01k418m574o223p429q501r678j0933j1900j2084j1349
54871C33227j0120q846p562o265n437n569o286o601o086n120m045k797j591j071
54857B55831j353j637j288o83m78n94n72m51n82q96j005q36o18m32l35o22j411
54840B42038k112j938r49q1l7n46p83l07N25J022R71Q55J096J340J010L78L83
$$ plain form
54941 303137 311881 321288 330471 339355 348451 358250 368655 378892 388206 396682 404949 413010 419906 424741
54927 424741 427429 428147 426746 423179 417974 411653 404039 394722 383946 372502 361041 350000 339981
54914 339981 331512 324457 318192 312421 307446 303624 300946 299151 297987 297288 297091 297637 299076 301247 303999
54899 303999 307639 312710 319311 326944 335083 343586 352438 361401 370167 378688 387078 395187 402502 408540
54885 408540 413197 416549 418417 418316 415898 411324 405101 397672 389171 379493 368560 356660 344576 333227
54871 333227 323107 314261 306699 300434 294997 289428 283142 276541 270455 265335 261290 258493 256902 255831
54857 255831 254478 252841 251553 250870 250392 249798 249226 248775 248193 247297 246292 245456 244838 244406 244071 243449 242038
54840 242038 239926 237988 237039 236958 236921 236375 235592 235285 235810 236832 237803 238658 239754 241094 242104 242482 242865
54823B42865J257K091K045J334N99M1l70m27J1O76J250J670J794J354O23L95Q48
54806B58056J080M39l90k56R36K316L116L108K426J603J354J808K366K712L294
54791B83968M360N302N556N438N396N381N589O796Q967J0596J0557R666R186Q824
54777C85582P763O703O929P804P257M685J523j045l271n476p251q387r221r651
54763C83944r153q084p593p894p937p178o277n585m393k382n62R3j12l95n78n90
54747C15324J06J663L265M199M846N887P158Q059Q518Q777Q729Q165P359O762
54733C98817O376N870N073L952K475P18j201l372n812p962r145r632j0392j1561
54719C64204j2093j1310r900q824q119p369o567n828m905l690k669k245k133j996
$$ plain form
54823 242865 244122 246213 248258 249592 250191 250232 249862 249435 249446 250122 251372 253042 254836 256190 256813 257208 258056
54806 258056 259136 259575 259185 258929 259865 262181 265297 268405 270831 272434 273788 275596 277962 280674 283968
54791 283968 288328 293630 299186 304624 310020 315401 320990 327786 336753 347349 357906 367572 376758 385582
54777 385582 393345 400048 406977 414781 422038 426723 428246 427201 423930 418454 411203 402816 393595 383944
54763 383944 374791 366707 359114 351220 343283 336105 329828 324243 319850 317468 316906 316999 316887 316492 315914 315324
54747 315324 315430 317093 320358 324557 329403 335290 342448 350507 359025 367802 376531 384696 392055 398817
54733 398817 405193 411063 416136 420088 422563 423281 422080 418708 412896 404934 395789 386157 375765 364204
54719 364204 352111 340801 330901 322077 313958 306589 300022 294194 289289 285599 282930 280685 278552 276556
54705B76556k027k244j953p06O85J094O09K84N61Q37N11k82j052j437j319q74
54689B69243n50o37q99r60q52q29q50p01n06o26j009j071l87O98J301Q67k22r95
54671B61015q84k74P6r7n05q57r57m92O14J669J686M86j146k396k898k448j065
54654B51527N22J319J174P66M56M7k20L22J403J640M47r01r50P8R01R03L14n80
54636B59168j458j718j233q50j188j454m74J356K324J541j45j371j616j139l25
54621B51418N78J451K155K348J794R16N70Q58Q76J72l24L45J524J785R28j4m48
54604B66932p00q54n06J92M08m2k91K24Q79Q67K83l43q56j208r99l6J064J444
54586B66458J027M15O8K1K45O23O99K9j078j658j165q6O65P87O61N99M19n9n09
$$ plain form
54705 276556 274529 272285 270332 269626 270311 271405 272014 272298 272859 273696 274207 273925 272873 271436 270117 269243
54689 269243 268693 268056 267157 266197 265345 264516 263666 262965 262459 261833 260824 259753 259366 260064 261365 262232 262010 261015
54671 261015 260131 259857 259933 259836 259331 258474 257517 257025 257639 259308 260994 261480 260334 257938 255040 252592 251527
54654 251527 252049 253368 254542 255308 255764 255811 255591 255913 257316 258956 259403 258502 257552 257630 258531 259434 259748 259168
54636 259168 257710 255992 254759 253909 252721 251267 250793 252149 254473 256014 255869 254498 252882 251743 251418
54621 251418 251996 253447 255602 257950 259744 260660 261230 262088 262964 263136 262812 263157 264681 266466 267394 267380 266932
54604 266932 266232 265378 264872 265064 265472 265430 265139 265363 266242 267109 267392 267049 266193 264985 263986 263950 265014 266458
54586 266458 267485 267900 267968 267989 268234 268857 269556 269585 268507 266849 265684 265598 266263 267050 267711 268310 268729 268670 268161
54567B68161m13K80J045J352J075L99l34p22o33m37n76q77p99l64k74p82j165
54550B64936p13K56R64J229J356J364J091Q30J023J402J253O12M38J315K620L314
54534B83290L047K216J334P14M73M67M03K19J61K94K50k65q93j019o24l77p09
54517B88981j168r73r9N86L75m07q70p18n20p63j158j145p53m90n21m13K26J089
54499B81259J400P39m34j117o94M56J347J371Q28M69O78J194J486J256O37L1j98
54482B90708R6Q63J836K496K291J248J28k62J22P47J230J503J516J279J126J335
54466C08262J532J132L73J09M93P17L38k8J90N57M72J63J07K7n52j196j094m47
54448C11155k97r27j396r85j86J21j41m22m80n50p54q58p08n25n92p85p48m94
$$ plain form
54567 268161 267748 268028 269073 270425 271500 271899 271565 270843 270210 269773 269197 268320 267521 267157 266883 266101 264936
54550 264936 264223 264479 265443 266672 268028 269392 270483 271313 272336 273738 274991 275603 276041 277356 279976 283290
54534 283290 286337 288553 289887 290601 291074 291541 291944 292163 292324 292618 292868 292603 291710 290691 290067 289690 288981
54517 288981 287813 286840 286741 287327 287702 287295 286425 285707 285187 284424 283266 282121 281368 280878 280357 279944 280170 281259
54499 281259 282659 283398 282964 281847 281153 281609 282956 284327 285155 285624 286302 287496 288982 290238 290875 290906 290708
54482 290708 290804 291667 293503 295999 298290 299538 299666 299404 299526 300273 301503 303006 304522 305801 306927 308262
54466 308262 309794 310926 311299 311408 311901 312618 312956 312928 313118 313675 314147 314310 314417 314444 313892 312696 311602 311155
54448 311155 310858 309931 308535 307550 307364 307485 307344 306922 306442 305892 305138 304280 303572 303047 302455 301670 300922 300428
54430C00428m54p26o80K20J454J914J347O19M41N64M53R9l05q08j281j151j53
54413C01981J032J547J384J050N99k25j217j767j635j034j35P98J122M23o32q92
54397C02399k33L40K58J66Q12J809K142J437K99m88o78n97o67q88p94n5Q74J070
54379C07206K05r80j385o37O67J614J729J202N31N3k11l74n29p02q41p52k93L77
54361C06880Q78J029R17O19J65k81n20o47p91o49J24R57O83q32k206k193j119
54344C03014k1Q19J605J998J479M65m2J77M61M88O28R84J050N64k3k22n0L35Q72
54325C14581J215P56n24j699j826j001j29J62M7J05O26J333J721J642J489J706
54309C20204K181K351J816P74k04p00q33j068j565j870j584j141j337k105k467
$$ plain form
54430 300428 299974 299248 298568 298788 300242 302156 303503 304122 304563 305127 305580 305679 305374 304566 303285 302134 301981
54413 301981 303013 304560 305944 306994 307593 307368 306151 304384 302749 301715 301580 302378 303500 303923 303291 302399
54397 302399 302166 302506 302764 302930 303742 305551 307693 309130 309429 308941 308263 307666 306999 306111 305317 305262 306136 307206
54379 307206 307411 306431 305046 304409 305076 306690 308419 309621 310152 310205 309994 309620 309091 308389 307548 306796 306503 306880
54361 306880 307758 308787 309704 310323 310488 310207 309687 309040 308249 307600 307724 308681 309364 308532 306326 304133 303014
54344 303014 302993 303812 305417 307415 308894 309359 309317 309494 309955 310443 311071 312055 313105 313669 313646 313424 313374 313709 314581
54325 314581 315796 316552 316028 314329 312503 311502 311373 311535 311582 311687 312313 313646 315367 317009 318498 320204
54309 320204 322385 324736 326552 327326 327122 326422 325589 324521 322956 321086 319502 318361 317024 314919 312452
54294C12452j912j032n23k99j32l03r42j403j126n72m60o27m50nJ86J35K09L06
54276C03502J02j66j17r8o45j335j318p02l65n15n97n11o52p73p9J328K312K245
54258C01616J662J090M12l42o25l31j9Q8L80P78N26m17r13k34P67Q55m1j143j942
54239C02167k280j996j255o88n92m84J03Q49J204J151R48O72M61O14J036J163
54223C03073Q67P75J220J603J332P06K18l23j221j981j867r48OM40L25r8l92j27
54205C03608N69J041J021Q93P54N9j261k173j866r66n67p09p21m94l62j60M47
54188B99113R89O75k53p27m12p7l01p15q41p87p57m98K40J078J269N33o04j320
54170B96605j325j123j293j587j186M7J198J441R88N06J12m39j001j192r97o29
$$ plain form
54294 312452 310540 309508 308985 308686 308554 308251 307309 305906 304780 304208 303748 303121 302671 302666 302852 302987 303196 303502
54276 303502 303604 303438 303321 303223 302578 301243 299925 299223 298858 298343 297746 297235 296583 295810 295731 297059 299371 301616
54258 301616 303278 304368 304780 304438 303813 303482 303463 303551 303931 304709 305235 304818 303905 303671 304438 305293 305252 304109 302167
54239 302167 299887 297891 296636 295948 295356 294872 294975 295824 297028 298179 299127 299799 300260 300874 301910 303073
54223 303073 303940 304715 305935 307538 308870 309576 309794 309471 308250 306269 304402 303454 303460 303900 304225 304127 303735 303608
54205 303608 304177 305218 306239 307132 307886 307945 306684 304511 302645 301679 301112 300403 299682 299188 298826 298666 299113
54188 299113 300102 300777 300524 299797 299385 299308 299007 298292 297451 296664 295907 295409 295649 296727 297996 298529 297925 296605
54170 296605 295280 294157 292864 291277 290091 290138 291336 292777 293765 294271 294383 293944 292943 291751 290754 290125
54154B90125m0Q33J555J580J012M29P7j56j70L22J147J672J527J031P94J042J403
54137C04183J286P07N98J747L412L806K329M47k37K4n2p50j247j096o49k02K57
54120C14563N33L68Q5K47P40R94R27Q50O06k16j222j480q94l70l75l56J09N50
54102C15659M02j39n53o71o05m39k68o5N06J567K364J978P68Q6L64N42j45q88
54084C20463o41J91M38r9n70m47m0K60M13M41K89Q9P5K11K39Q6j20l50o40q62
54064C19426q11n17j55K96J027K028K909L158K542J324J84k79o3L86Q42J499K356
54047C36152K841K424J394O56Q37J866L283M608N462N688N431M934M302L565K912
54032C86355K654K957L729M669N360N458N021M486M230M215M273M431M766N156
$$ plain form
54154 290125 290085 290918 292473 294053 295065 295494 295571 295415 295245 295567 296714 298386 299913 300944 301738 302780 304183
54137 304183 305469 306176 306774 308521 311933 315739 318068 318515 318278 318302 318250 317500 316253 315157 314508 314306 314563
54120 314563 315096 315464 315549 315796 316536 317530 318457 319307 319913 319697 318475 316995 316101 315731 315356 315000 315109 315659
54102 315659 316061 315922 315369 314698 314093 313654 313386 313321 313827 315394 317758 319736 320504 320590 320954 321496 321351 320463
54084 320463 319822 320013 320451 320352 319782 319335 319295 319555 319968 320409 320698 320787 320862 321073 321312 321398 321278 320928 320288 319426
54064 319426 318615 318098 317943 318239 319266 321294 324203 327361 329903 331227 331411 331132 331069 331455 332297 333796 336152
54047 336152 338993 341417 342811 343467 344304 346170 349453 354061 359523 365211 370642 375576 379878 383443 386355
54032 386355 389009 391966 395695 400364 405724 411182 416203 420689 424919 429134 433407 437838 442604 447760
54018D47760N561O313P606Q868R237Q813Q833J0322J2993J5740J7777J8848J8817
54005E97488J7677J5876J4017J2313J0704R334Q222O514K918k709q950j4310j8516
53992F50578k1883k4081k4485k3426k2109k1200k0203j8389j5799j3175j1256
53981D34572j0214r464q145o138m399l785l811l348k358j928k521l245l235k789
53967C69192k515k267j626q37m14l15k11j70l52l43L79J494K103J890J449J402
53951C68859J727J955J757J322J365K471M279N593N641M906M319M166M222M461
53937D17043M986N531N690N433M865L887K652J927K241K954K949K027Q31k64j316
53922D61436k030j866r56j6O79J447K265K666K670K917L551L927L763L718M236
$$ plain form
54018 447760 453321 459634 467240 476108 485345 494158 502991 513313 526306 542046 559823 578671 597488
54005 597488 615165 631041 645058 657371 668075 677409 685631 692145 695063 692354 683404 669094 650578
53992 650578 628695 604614 580129 556703 534594 513394 493191 474802 459003 445828 434572
53981 434572 424358 414894 406749 400611 396212 392427 388616 385268 382910 380982 378461 375216 371981 369192
53967 369192 366677 364410 362784 361947 361533 361218 361007 360837 360485 360142 360521 362015 364118 366008 367457 368859
53951 368859 370586 372541 374298 375620 376985 379456 383735 389328 394969 399875 404194 408360 412582 417043
53937 417043 422029 427560 433250 438683 443548 447435 450087 452014 454255 457209 460158 462185 463016 462752 461436
53922 461436 459406 457540 456584 456568 457247 458694 460959 463625 466295 469212 472763 476690 480453 484171 488407
53907D88407M621M031K897K485L213M096L969K782J445O94L49j60r06j496j889
53892E14538k530l424l841l437k967l155l494l213k843l517m988n740n220m535
53878D61634m607m909m653m092l885m047m221m355m376l852k704j677j503j947
53864D10806k295k307k168j993j873k036k390k283j266K47J504K168K183J440
53850C99737J69p67o31L99J670K901M034M717M707M563N196O672Q116Q716Q512
53835D58711Q156Q312R141J0143J0578J0367J0298J1082J2459J3599J4023J3715
53823E90584J2664J0899Q812P009N829N298N237N005L489m6n116j0435j4988j8326
53809F05915k0187k0476j9596j8188j6512j4501j2301j0251q367o358m251k567
$$ plain form
53907 488407 493028 497059 499956 502441 505654 509750 513719 516501 517946 518640 518989 518829 517923 516427 514538
53892 514538 512008 508584 504743 501306 498339 495184 491690 488477 485634 482117 477129 471389 466169 461634
53878 461634 457027 452118 447465 443373 439488 435441 431220 426865 422489 418637 415933 414256 412753 410806
53864 410806 408511 406204 404036 402043 400170 398134 395744 393461 392195 392442 393946 396114 398297 399737
53850 399737 399906 399139 398508 398907 400577 403478 407512 412229 416936 421499 426695 433367 441483 450199 458711
53835 458711 466867 475179 484320 494463 505041 515408 525706 536788 549247 562846 576869 590584
53823 590584 603248 614147 622959 629968 635797 641095 646332 651337 654826 654780 649664 639229 624241 605915
53809 605915 585728 565252 545656 527468 510956 496455 484154 473903 465536 459178 454927 452360
53797D52360j643j204p12K6Q04J357J653J890K193K396K260J878J563J326Q83
53782D67030K67p8j33n84j766k860k855j976j393j707k504l262l866m169l794
53767D36350k780j846j674k202k808k972k664k346k599l502m397m568m022l273
53753C94697k496j521n85l62r95j678j628j033o46p13p63l53L31P46O43L49L36
53736C84329N44M04l04r44p52R6O68N48L31O91J467J988J940J595J396J643K339
53719C97979L074L218K553J650J299J654K179K337K153J956J936K000K035K101
53705D28124K314K606K696K394J880J605J940K914M224N321N579M706L118J758
53691D71179J344J731K173K109J690J477J782K329K597K354J845J466J359J371
$$ plain form
53797 452360 450717 449513 448801 448827 449631 450988 452641 454531 456724 459120 461380 463258 464821 466147 467030
53782 467030 467297 467219 467086 466502 464736 461876 459021 457045 455652 453945 451441 448179 444313 440144 436350
53767 436350 433570 431724 430050 427848 425040 422068 419404 417058 414459 410957 406560 401992 397970 394697
53753 394697 392201 390680 390095 389733 388738 387060 385432 384399 383753 383040 382277 381924 382255 383001 383644 383993 384329
53736 384329 384873 385277 384973 384029 383277 383373 384041 384589 384920 385611 387078 389066 391006 392601 393997 395640 397979
53719 397979 401053 404271 406824 408474 409773 411427 413606 415943 418096 420052 421988 423988 426023 428124
53705 428124 430438 433044 435740 438134 440014 441619 443559 446473 450697 456018 461597 466303 469421 471179
53691 471179 472523 474254 476427 478536 480226 481703 483485 485814 488411 490765 492610 494076 495435 496806
53677D96806J267J006Q04R45J410J737J430N26m16r28j017q30l31M00Q73O33p0
53660E04245n34n58n92q95j050o52k6J75j28n30q96j446k047k113j466p43m98
53643D90246m31o1K55k67j493k271j855o96L72J001J081L85q46j507o91J108K534
53626D86864K936K740K471K196J964K020K387K776L071L375L570L361K905K799
53612E25435L320M119M744N000M729L878K891K420K520K768L155M015M996N127
53598E79117M365L938M576N320M956L780K942K724K586K418K596K992K995K450
53584F27755J665O66o58j773j874j080l07J4K21L10l18j680k733k740k322k460
53568F12686l026l056k201j194q69j224j533j176k64N01N77N7o60j382k018k171
$$ plain form
53677 496806 498073 499079 499883 500828 502238 503975 505405 505931 505515 504587 503570 502740 502409 502809 503682 504315 504245
53660 504245 503711 503153 502561 501666 500616 499964 499938 500113 499985 499455 498559 497113 495066 492953 491487 490744 490246
53643 490246 489815 489754 490009 489742 488249 485978 484123 483427 483799 484800 485881 486266 485420 483913 483222 484330 486864
53626 486864 489800 492540 495011 497207 499171 501191 503578 506354 509425 512800 516370 519731 522636 525435
53612 525435 528755 532874 537618 542618 547347 551225 554116 556536 559056 561824 564979 568994 573990 579117
53598 579117 583482 587420 591996 597316 602272 606052 608994 611718 614304 616722 619318 622310 625305 627755
53584 627755 629420 630086 629428 627655 625781 624701 624394 624408 624629 624939 624621 622941 620208 617468 615146 612686
53568 612686 609660 606604 604403 603209 602340 601116 599583 598407 598143 598644 599221 599278 598618 597236 595218 593047
53552E93047j480l63K38N6j16M62J436J878J482Q33O29J060J842K542K846K786
53536F09178K715K931L359L746M148M985O467Q126R128R142Q809R064J0142J1470
53522G03410J2524J3447J4632J6063J7418J8590J9810K1202K2544K3426K3628
53511I06694K3365K3243K3735K4591K5030K4698K4074K3774K3789K3801K3821
53500A170615K4011K4239K4332K4654K5727K7340K8598K8966K8825K8911K9496
53489A465714L0214L0506L0190K9727K9806L0553L1383L1756L1587L0790K9162
53478A801388K7173K6117K6549K7175K6330K4160K2241K1280K0497J9238J7854
53467B060002J6643J5188J3304J1593J0406R079O886M018J047j989n284q636j1721
$$ plain form
53552 593047 591567 591204 591442 591498 591382 591844 593280 595158 596640 597473 598102 599162 601004 603546 606392 609178
53536 609178 611893 614824 618183 621929 626077 631062 637529 645655 654783 663925 672734 681798 691940 703410
53522 703410 715934 729381 744013 760076 777494 796084 815894 837096 859640 883066 906694
53511 906694 930059 953302 977037 1001628 1026658 1051356 1075430 1099204 1122993 1146794 1170615
53500 1170615 1194626 1218865 1243197 1267851 1293578 1320918 1349516 1378482 1407307 1436218 1465714
53489 1465714 1495928 1526434 1556624 1586351 1616157 1646710 1678093 1709849 1741436 1772226 1801388
53478 1801388 1828561 1854678 1881227 1908402 1934732 1958892 1981133 2002413 2022910 2042148 2060002
53467 2060002 2076645 2091833 2105137 2116730 2127136 2136215 2143101 2147119 2148166 2146177 2140893 2132257 2120536
53454B120536j4514j6922j8514j9224j9824k1056k2633k3781k4385k5024k6073
53443A888586k7353k8521k9314k9563k9375k9107k8827k8063k6557k4874k3794
53432A583238k3264k2546k1174j9314j7294j5282j3306j1207q661n614k536Q1
53420A423121K322M531O715Q633J0312J1953J3531J4954J6434J8194J9984K1484
53408A572168K3027K5183K7697K9600L0619L1740L3963L7017L9831M1872M3594
53397A936311M5758M8703N2211N5646N8312O0008O1293O3000O5401O8047P0414
53386B585104P2434P4186P5375P5537P4792P3995P3815P3944P3479P1926O9534
53375C394121O6803O4037O1370N8797N6118N3095M9729M6123M2180L7791L3172
$$ plain form
53454 2120536 2106022 2089100 2070586 2051362 2031538 2010482 1987849 1964068 1939683 1914659 1888586
53443 1888586 1861233 1832712 1803398 1773835 1744460 1715353 1686526 1658463 1631906 1607032 1583238
53432 1583238 1559974 1537428 1516254 1496940 1479646 1464364 1451058 1439851 1431190 1425576 1423040 1423121
53420 1423121 1425443 1429974 1436689 1445322 1455634 1467587 1481118 1496072 1512506 1530700 1550684 1572168
53408 1572168 1595195 1620378 1648075 1677675 1708294 1740034 1773997 1811014 1850845 1892717 1936311
53397 1936311 1982069 2030772 2082983 2138629 2196941 2256949 2318242 2381242 2446643 2514690 2585104
53386 2585104 2657538 2731724 2807099 2882636 2957428 3031423 3105238 3179182 3252661 3324587 3394121
53375 3394121 3460924 3524961 3586331 3645128 3701246 3754341 3804070 3850193 3892373 3930164 3963336
53364C963336K8577K3664J7758J0847L658l372j0601j8357k6340l4204m2097n0030
53352C862839n7257o2976o7267p0702p3382p5040p5868p6495p7226p7878p8300
53341C070448p8420p7966p6684p4906p3237p1774p0141o8280o6535o4932o3042
53330B284531o0699n8221n5749n2962m9693m6303m3156m0170l7140l4115l1176
53319A775147k8261k5455k3096k1304j9825j8510j7487j6541j4946j2454r923
53308A567345q359p632o821n568m275l021j256J164L458M980O255Q275J1033J3527
53294A579105J5174J6594J8625K1058K2836K3460K3689K4668K6603K8626K9911
53283A830349L0608L1423L2522L3279L3155L2423L1694L1044L0097K8843K7764
$$ plain form
53364 3963336 3991913 4015577 4033335 4044182 4047840 4044468 4033867 4015510 3989170 3954966 3912869 3862839
53352 3862839 3805582 3742606 3675339 3604637 3531255 3456215 3380347 3303852 3226626 3148748 3070448
53341 3070448 2992028 2914062 2837378 2762472 2689235 2617461 2547320 2479040 2412505 2347573 2284531
53330 2284531 2223832 2165611 2109862 2056900 2007207 1960904 1917748 1877578 1840438 1806323 1775147
53319 1775147 1746886 1721431 1698335 1677031 1657206 1638696 1621209 1604668 1589722 1577268 1567345
53308 1567345 1558986 1551354 1544533 1538965 1534690 1531669 1530413 1531577 1535035 1540015 1546270 1554545 1565578 1579105
53294 1579105 1594279 1610873 1629498 1650556 1673392 1696852 1720541 1745209 1771812 1800438 1830349
53283 1830349 1860957 1892380 1924902 1958181 1991336 2023759 2055453 2086497 2116594 2145437 2173201
53272B173201K7021K6019K4144K1534J8749J5970J3040J0000P058M113Q29k761
53260B338917o277r694j3454j7781k2330k6691l0724l4240l6823l8405l9529m0744
53248B022225m2027m3151m4104m4815m4902m4288m3618m3451m3328m2411m0804
53237A545326l9496l9009l8896l8692l8551l8671l8725l8338l7621l6729l5302
53226A125296l2885k9731k6750k4623k3223k1945k0355j8544j6945j5898j5324
53215H79073j4893j4370j3795j3295j2994j3007j3312j3594j3518j3200j3063
53204G30032j3187j3069j2298j1130j0186r797r873j0153j0304j0009r275q519
53192F02232q057p726p250o758o469o228n797n512n859o486o458n627m910m825
$$ plain form
53272 2173201 2200222 2226241 2250385 2271919 2290668 2306638 2319678 2329678 2336736 2340849 2341678 2338917
53260 2338917 2332640 2322946 2309492 2291711 2269381 2242690 2211966 2177726 2140903 2102498 2062969 2022225
53248 2022225 1980198 1937047 1892943 1848128 1803226 1758938 1715320 1671869 1628541 1586130 1545326
53237 1545326 1505830 1466821 1427925 1389233 1350682 1312011 1273286 1234948 1197327 1160598 1125296
53226 1125296 1092411 1062680 1035930 1011307 988084 966139 945784 927240 910295 894397 879073
53215 879073 864180 849810 836015 822720 809726 796719 783407 769813 756295 743095 730032
53204 730032 716845 703776 691478 680348 670162 660365 650492 640339 630035 620026 610751 602232
53192 602232 594175 586449 579199 572441 565972 559744 553947 548435 542576 536090 529632 524005 519095 514270
53178E14270m655l697k627k538l117k984j741n89n20j007r77l41J81J84r6l53
53162D89393m51l52k51n83j402k008j694o44L96J052J422J417P89k23r36j025
53146D84900p58l96M9L95K87k14n86o64r66j841k751k846k019j056q08j388k052
53129D67286j862p21L62L53n49j192r17p6Q50J829K750L129K830K416K310K091
53113D80889J288K94r8K16O11N34j11j105k009k386k319k419k975l470l398l065
53097D60477l056l291l307l076k876k588j908j044n47n32o97r78j421j617j060
53082D32479r3L10j94r15j169j011p68n14k36M1M67J207J861J705P40j30l04k22
53064D33254n09q87o50J64P73P68O52J021J660J819J269O79P32J180J225Q04P78
$$ plain form
53178 514270 509615 505918 503291 500753 497636 494652 492911 492322 491802 490795 489818 489477 489658 489842 489746 489393
53162 489393 488942 488590 488339 487756 486354 484346 482652 482008 482404 483456 484878 486295 487084 486861 485925 484900
53146 484900 484142 483746 483795 484190 484477 484263 483677 483013 482047 480206 477455 474609 472590 471534 470726 469338 467286
53129 467286 465424 464703 465065 465418 464869 463677 462760 462684 463534 465363 468113 471242 474072 476488 478798 480889
53113 480889 482177 482471 482373 482589 483200 483734 483623 482518 480509 478123 475804 473385 470410 466940 463542 460477
53097 460477 457421 454130 450823 447747 444871 442283 440375 439331 438784 438252 437555 436577 435156 433539 432479
53082 432479 432386 432696 432502 431587 430418 429407 428639 428125 427889 427930 428397 429604 431465 433170 433910 433780 433476 433254
53064 433254 432745 431858 431208 431372 432145 432913 433565 434586 436246 438065 439334 440013 440745 441925 443150 443954 444732
53047D44732J603K473K344J360N62M93Q35J208J505J516J061N17M74P52N42m03
53031D61574j473k184k649k878k570j847j328j095n07M77Q76K15m88k17M71M59
53015D46836o9r1L91L85k97o59j35N76O95M03J72k8l26l93N7P09J126J398J763
52996D52513J979J662J038P13P92Q42O59N58P48R26P36K75q1j50L6N14J330K246
52978D67336K754K480J539M57j83p8O23J471K088K417K563K558K359K013J611
52963D92008J129O14M03P70J315J139q5j590k373k257j759j238p32l96n13r68
52947D85467j259j154r63r50r44o86k84m9j15m19q75j358j660j669j572j662k018
52930D67830k370k281j545m76K67L36Q2O3L09L40o0n59p49n79j79L91R77J209
$$ plain form
53047 444732 446335 448808 451152 452512 453074 453567 454402 455610 457115 458631 459692 460209 460683 461435 461977 461574
53031 461574 460101 457917 455268 452390 449820 447973 446645 445550 445043 445520 446396 446611 446123 445906 446377 446836
53015 446836 446767 446676 447067 447452 447155 446496 446361 446937 447632 448035 448207 448179 447853 447460 447517 448226 449352 450750 452513
52996 452513 454492 456154 457192 457905 458697 459539 460198 460756 461504 462430 463166 463441 463360 463210 463246 463760 465090 467336
52978 467336 470090 472570 474109 474566 474383 474305 474928 476399 478487 480904 483467 486025 488384 490397 492008
52963 492008 493137 493751 494154 494924 496239 497378 497293 495703 493330 491073 489314 488076 487344 486948 486435 485467
52947 485467 484208 483054 482091 481141 480197 479511 479227 479178 479063 478644 477769 476411 474751 473082 471510 469848 467830
52930 467830 465460 463179 461634 461158 461425 461761 461843 461906 462215 462555 462495 461936 461187 460608 460429 460820 461797 463006
52912D63006Q68K07k37j48L39P66O99J41l68l03K22N52K97l38r62j344j265m66
52894D61666R00K112K475J971J096K95j83j79K24N32K17o30j296j213n99k20n35
52877D66633j218j566j302p69l75j69n9j22l48m60l44l72q28j206q16J36P45O80
52859D58240M24K39j64p31p62k8P10Q24P18R10J057O75J87J83K22n37j720k020
52841D58427j113j34l9m32n30l53m05p37j041j324j935k940l824l851k657o44
52825D36468J169J958J864J662J787K014K202K665L476L930L317J967J007J060
52811D66546J714K226K334K140J614N37j118l009m638n695o159o166n836n223
52797D39267m405l552k874k474k343k395k456k207j387j99O87P73L70K72P05J002
$$ plain form
52912 463006 463874 464081 463844 463696 464035 464801 465500 465641 465273 464970 465192 465744 466041 465703 464741 463397 462132 461666
52894 461666 462566 464678 467153 469124 470220 470515 470332 470153 470377 470909 471126 470496 469200 467987 467388 467168 466633
52877 466633 465415 463849 462547 461778 461403 461234 461175 461053 460705 460245 459901 459529 458701 457495 456679 456815 457560 458240
52859 458240 458664 458903 458739 458008 457246 457218 457928 458752 459470 460380 461437 462112 462299 462482 462704 462167 460447 458427
52841 458427 457314 457180 457141 456709 456179 455826 455421 454684 453643 452319 450384 447444 443620 439769 437112 436468
52825 436468 437637 439595 441459 443121 444908 446922 449124 451789 455265 459195 462512 464479 465486 466546
52811 466546 468260 470486 472820 474960 476574 477111 475993 472984 468346 462651 456492 450326 444490 439267
52797 439267 434862 431310 428436 425962 423619 421224 418768 416561 415174 414975 415662 416435 416805 417077 417782 418784
52781D18784N39k94m62M84J956L082L496L321K754J956J153N99L92M48N49M60
52765D39217J60q7L6N01Q73P12k8q81j122l58R37J723J528R92R18J163J054O31
52747D47969N57Q52O97j94r93j066r61j411k046j980j262q06j019j398j398j061
52731D34480o47k87p8n1K6M58J096J372R52R9o24p89l48K89N03M5o51r61p11j29
52711D34044N27J019J082P68O32J065J632J598R90N16M72M66K62K55P52J330J362
52694D48772R39P89J290J899J707O26l03q0Q60J074P2q64l64J102J865J265K47
52677D60896j53R2N91J269K073K587K434J741R31L76K81M94M01m48j435j337J44
52660D70937J801K349J807J079O82M22N3l65o55p43o48m72k83m0J88pq97j960
$$ plain form
52781 418784 419323 419029 418567 419051 421007 424089 427585 430906 433660 435616 436769 437368 437760 438208 438757 439217
52765 439217 439377 439290 439326 439827 440700 441412 441384 440503 439381 439023 439960 441683 443211 444203 445121 446284 447338 447969
52747 447969 448526 449378 450075 449881 448888 447822 446861 445450 443404 441424 440162 439356 438337 436939 435541 434480
52731 434480 433833 433546 433468 433417 433443 433901 434997 436369 437321 437420 436796 436007 435659 435948 436451 436496 435845 434884 434173 434044
52711 434044 434571 435590 436672 437440 438072 439137 440769 442367 443357 443873 444345 444811 445073 445328 446080 447410 448772
52694 448772 449711 450500 451790 453689 455396 456022 455719 455639 456499 457573 457645 456781 456417 457519 459384 460649 460896
52677 460896 460743 460835 461426 462695 464768 467355 469789 471530 472461 472837 473118 473612 474013 473565 472130 470793 470937
52660 470937 472738 475087 476894 477973 478655 479077 479130 478765 478110 477367 476719 476247 475964 475924 476112 476105 475208 473248
52642D73248k295j850j534j866k157j581l38P45J342J650J748J566J252R49M55
52627D71334l02p72m49J92J73o02j207r59j77M49O42M80O0m90r53j201j230j023
52609D63965o32l25l22m02j79L32Q08J192J642J949J661Q64L10M34Q13Q71O74
52592D73655O17P72R46J078J204J194Q85L84K0Q4O83J598K221K051J427J238J676
52575D91733J828J009j26n44l61n00j064j133k83P04J006Q23O96N27p4r04j331
52558D92006j181q83p83q33q89r62j076j218j428j699j849j678j210o16J0N65
52542D76276P68L93l53r02q13q3Q85J479J300O23K39N26R60R10O18Q31J616K238
52524D87511K206J739J143M92J52Q24K510M000M069K864J524P23J76n17j208j524
$$ plain form
52642 473248 470953 469103 467569 465703 463546 461965 461627 462372 463714 465364 467112 468678 469930 470879 471334
52627 471334 471032 470260 469811 470003 470176 469574 468367 467408 467231 467680 468322 468802 468862 468372 467419 466218 464988 463965
52609 463965 463333 463008 462686 462284 462105 462437 463245 464437 466079 468028 469689 470553 470863 471297 472110 472981 473655
52592 473655 474272 475044 475990 477068 478272 479466 480351 480735 480755 480839 481522 483120 485341 487392 488819 490057 491733
52575 491733 493561 494570 494444 493900 493539 493039 491975 490842 490559 491263 492269 493092 493788 494315 494241 493337 492006
52558 492006 490825 489942 489159 488326 487437 486475 485399 484181 482753 481054 479205 477527 476317 475701 475711 476276
52542 476276 477044 477437 477084 476182 475369 475286 476171 477650 478950 479573 479812 480338 481298 482208 482826 483657 485273 487511
52524 487511 489717 491456 492599 493091 493243 494067 496577 500577 504646 507510 509034 509757 509933 509416 508208 506684
52508E06684j450j378j737k574l400l571l015k404k334k580k426j658p22l3M47
52493D77849Q37J022Q96O39M93M33K93Q0o4j34k35k91RP89J649K044J885J585
52475D89779J450J460J674K373L422L977L426K333J726J679J406O33j00o44j603
52460E12991l031l817l183j940j393j629j869j974k431l117l300k812k247j871
52446D78377j301m49J61L07M41Q54J146R64O01M00J63l74r93j318j373j296r72
52429D75338l72K4k75j037j520j289n48K28O12M08j62m70j03O09J031J072J247
52412D74793J838K464K757L046L943N344O385O572O509P054Q035Q405P679O542
52398E51366N871N654N311M555L508K258Q57m76j614k788m176n428o064o058n595
$$ plain form
52508 506684 505234 503856 502119 499545 496145 492574 489559 487155 484821 482241 479815 478157 477435 477402 477849
52493 477849 478686 479708 480604 481243 481736 482169 482462 482542 482478 482344 482109 481818 481827 482616 484265 486309 488194 489779
52475 489779 491229 492689 494363 496736 500158 504135 507561 509894 511620 513299 514705 515338 515238 514594 512991
52460 512991 509960 506143 502960 501020 499627 497998 496129 494155 491724 488607 485307 482495 480248 478377
52446 478377 477076 476627 476788 477095 477536 478390 479536 480500 481101 481501 481664 481290 480297 478979 477606 476310 475338
52429 475338 474966 474990 474715 473678 472158 470869 470321 470549 471161 471569 471407 470937 470834 471443 472474 473546 474793
52412 474793 476631 479095 481852 484898 488841 494185 500570 507142 513651 520705 528740 537145 544824 551366
52398 551366 557237 562891 568202 572757 576265 578523 579380 578904 577290 574502 570326 564898 558834 552776 547181
52383E47181m563k906j270m66m35m47k31r0N8P47J850K291J376k53j408j584j089
52366E38761m68j85m17p70o49j20P9l35o73k33P28J481J733J623J276R56J230
52349E44017K320L521L839L175K396K297K865L494L636L288K928L014L430L720
52335E87940L813M087M627M926M657M257M385N092N840O048N446M284L428L744
52321F52574N004N897N588M751M615N416O482P443Q583J0039J1342J1941J1818
52308G51493J1457J1388J1804J2447J3021J3601J4395J5124J5154J4366J3355
52297H97605J2565J1913J1507J1921J3199J4301J4318J3693J3519J4074J4789
52286A043404J5230J5230J4497J3084J1969J2138J3084J3277J2178J0879J0557
$$ plain form
52383 547181 542618 539712 538442 537976 537541 537094 536863 536773 536831 537578 539428 541719 543095 542842 541434 539850 538761
52366 538761 538293 538108 537691 536921 536272 536152 536231 535896 535223 534990 535718 537199 538932 540555 541831 542787 544017
52349 544017 546337 549858 553697 556872 559268 561565 564430 567924 571560 574848 577776 580790 584220 587940
52335 587940 591753 595840 600467 605393 610050 614307 618692 623784 629624 635672 641118 645402 648830 652574
52321 652574 657578 663475 669063 673814 678429 683845 690327 697770 706353 716392 727734 739675 751493
52308 751493 762950 774338 786142 798589 811610 825211 839606 854730 869884 884250 897605
52297 897605 910170 922083 933590 945511 958710 973011 987329 1001022 1014541 1028615 1043404
52286 1043404 1058634 1073864 1088361 1101445 1113414 1125552 1138636 1151913 1164091 1174970 1185527
52275A185527J1054J1390J0988R970Q744P720P117O817O525O060N423M687M085
52262A286107L933M070L688K302O33j20K14O94N96J03l16m90l85K8N84J128J978
52245A304747L554N513O855P158P109P602Q826J0339J1613J2279J2434J2735J3729
52232A424493J4943J5326J4689J3916J3619J3381J2754J2118J1888J1588J0514
52221A569229Q873P498O658N897M923L956L195K561K013J680J475J015Q6r88j631
52206A616440j551r37k43J39O4l70r23j293j301j066r27r72q41k70L49L78r3j86
52188A606397O67J997K841K798K282J944K054K357K390K033J731K046K959L878
52174A638374M248L896K818J138n98j546j452j080j402k453l346l408k920k649
$$ plain form
52275 1185527 1196581 1207971 1218959 1228929 1237673 1245393 1252510 1259327 1265852 1271912 1277335 1282022 1286107
52262 1286107 1290040 1294110 1297798 1300100 1300733 1300613 1300827 1301521 1302117 1302220 1301904 1301414 1301029 1301057 1301641 1302769 1304747
52245 1304747 1308301 1313814 1320669 1327827 1334936 1342538 1351364 1361703 1373316 1385595 1398029 1410764 1424493
52232 1424493 1439436 1454762 1469451 1483367 1496986 1510367 1523121 1535239 1547127 1558715 1569229
52221 1569229 1578102 1585600 1592258 1598155 1603078 1607034 1610229 1612790 1614803 1616483 1617958 1618973 1619059 1618071 1616440
52206 1616440 1614889 1613952 1613709 1613848 1613912 1613542 1612619 1611326 1610025 1608959 1608032 1607060 1606219 1605949 1606298 1606676 1606583 1606397
52188 1606397 1607064 1609061 1611902 1614700 1616982 1618926 1620980 1623337 1625727 1627760 1629491 1631537 1634496 1638374
52174 1638374 1642622 1646518 1649336 1650474 1649876 1648330 1646878 1645798 1644396 1641943 1638597 1635189 1632269 1629620
52160A629620k846l102l094l116l575m184m203l479k665k205j688o54N71J390
52146A596770J924K669L505L802L456L042K933K996L137L434L691L598L408L703
52132A642068M378M705M611M925N947O714O227M774L373K522K104J938J739J001
52118A697026l62j542j675q16L46J423K433L290L887M424N126N816O268O743P671
52103A740058R028J0519J2043J3421J4074J3709J3061J3157J4002J4839J5507
52092A883418J6584J8120J9270J9584J9749K0497K1478K1842K1373K0359J8722
52081B100996J6166J3098J0571R063P933O393M599L263K427J317n15k446l576
52068B169289l859l993m381m765m894m954n163n367n348n154m896m487l858l077
$$ plain form
52160 1629620 1626774 1623672 1620578 1617462 1613887 1609703 1605500 1602021 1599356 1597151 1595463 1594809 1595380 1596770
52146 1596770 1598694 1601363 1604868 1608670 1612126 1615168 1618101 1621097 1624234 1627668 1631359 1634957 1638365 1642068
52132 1642068 1646446 1651151 1655762 1660687 1666634 1673348 1679575 1684349 1687722 1690244 1692348 1694286 1696025 1697026
52118 1697026 1696664 1695122 1693447 1692631 1692977 1694400 1696833 1700123 1704010 1708434 1713560 1719376 1725644 1732387 1740058
52103 1740058 1749086 1759605 1771648 1785069 1799143 1812852 1825913 1839070 1853072 1867911 1883418
52092 1883418 1900002 1918122 1937392 1956976 1976725 1997222 2018700 2040542 2061915 2082274 2100996
52081 2100996 2117162 2130260 2140831 2149894 2157827 2164220 2168819 2172082 2174509 2175826 2175311 2172865 2169289
52068 2169289 2165430 2161437 2157056 2152291 2147397 2142443 2137280 2131913 2126565 2121411 2116515 2112028 2108170 2105093
52054B105093k104p36R11K227K814L019L325L639L660L724M493N923P126P409
52040B150523O976O469O232O135N831N025L815K856K794L473L961L600K809K611
52026B213110L468M790N597N577N307N445N897O056N760N394N015M002K018k56
52012B277180k001l501n642q406j0781j2252j3527j5474j7993k0356k2108k3179
52000B121960k3591k3582k3709k4343k5177k5649k5789k6287k7737k9996l2189
51989A833911l3299l2916l1677l0687l0395l0260k9723k8949k8223k7046k4735
51978A506001k1744j9506j8631j8113j6799j4951j3655j3079j2365j1140j0193
51967A335825j0281j1064j1776j2390j3354j4500j5039j4700j4119j3832j3438
$$ plain form
52054 2105093 2102989 2102253 2103164 2105391 2108205 2111224 2114549 2118188 2121848 2125572 2130065 2135988 2143114 2150523
52040 2150523 2157499 2163968 2170200 2176335 2182166 2187191 2191006 2193862 2196656 2200129 2204090 2207690 2210499 2213110
52026 2213110 2216578 2221368 2226965 2232542 2237849 2243294 2249191 2255247 2261007 2266401 2271416 2275418 2277436 2277180
52012 2277180 2275179 2271678 2266036 2257630 2246849 2234597 2221070 2205596 2187603 2167247 2145139 2121960
52000 2121960 2098369 2074787 2051078 2026735 2001558 1975909 1950120 1923833 1896096 1866100 1833911
51989 1833911 1800612 1767696 1736019 1705332 1674937 1644677 1614954 1586005 1557782 1530736 1506001
51978 1506001 1484257 1464751 1446120 1428007 1411208 1396257 1382602 1369523 1357158 1346018 1335825
51967 1335825 1325544 1314480 1302704 1290314 1276960 1262460 1247421 1232721 1218602 1204770 1191332
51956A191332j2189j0031p650n648m068k651j188L51J812K989L865M598N140N038
51942A171700L926K098K58j311k920m796o613p973r080j0430j1930j2762j2370
51929A097797j1285j0599j0661j0722r949q480p154o417n829m665k766o53R91
51916A009608J918K408K810L043K803K241J984K184K032O77j637l990o064q185
51902A011832j0231j1483j1762j1857j2298j2561j1988j0851r815q908p681n925
51890H86472l564l36L572P034R061J0149J1557J3417J4561J4335J3432J2651J1794
51877A004135J0342Q362O154L572M56k627m805n829o097n851m968l480j792k14
51863I97358J455L654O491R512J2088J4053J5864J7992K0156K1536K1740K1197
$$ plain form
51956 1191332 1179143 1169112 1161462 1155814 1151746 1149095 1147907 1148258 1150070 1153059 1156924 1161522 1166662 1171700
51942 1171700 1175626 1177724 1177982 1176671 1173751 1168955 1162342 1154369 1145289 1134859 1122929 1110167 1097797
51929 1097797 1086512 1075913 1065252 1054530 1044581 1036101 1028947 1022530 1016701 1012036 1009270 1008617 1009608
51916 1009608 1011526 1013934 1016744 1019787 1022590 1024831 1026815 1028999 1031031 1031708 1030071 1026081 1020017 1011832
51902 1011832 1001601 990118 978356 966499 954201 941640 929652 918801 908986 900078 892397 886472
51890 886472 882908 882572 886144 893178 902239 912388 923945 937362 951923 966258 979690 992341 1004135
51877 1004135 1014477 1022839 1028993 1032565 1033021 1030394 1025589 1019760 1013663 1007812 1002844 999364 997572 997358
51863 997358 998813 1002467 1008958 1018470 1030558 1044611 1060475 1078467 1098623 1120159 1141899 1163096
51851A163096K0411J9224J7227J4573J1764Q734M708p53o969j2710j7309k0924
51839A201072k3841k5942k6962k6927k6032k4309k1783j8983j6760j5440j4405
51828I59688j2889j0962r342q375p687o861n986n327m867m515m437m864n684o593
51814H61299p549q694r843j0418r974q599o730m852l480k988l188l274k615j478
51800G77617o01j34M69J476K388K710K760L177L910M299M010L344K644J978J526
51785H11573J698K525L405L740L587L369L267L223L258L439L561L271K484J429
51771H53829L55p16j947l514n397p224q489q966q877q567q237p943p561o772n436
51756G64538m027l241l038k602j470j23Q45J558K310K850K872K801L251L974M233
$$ plain form
51851 1163096 1183507 1202731 1219958 1234531 1246295 1255029 1259737 1258984 1252015 1239305 1221996 1201072
51839 1201072 1177231 1151289 1124327 1097400 1071368 1047059 1025276 1006293 989533 974093 959688
51828 959688 946799 935837 926495 918120 910433 903572 897586 892259 887392 882877 878440 873576 867892 861299
51814 861299 853750 845056 835213 824795 814821 806222 799492 794640 791160 788172 784984 781710 779095 777617
51800 777617 777016 776882 777351 778827 781215 783925 786685 789862 793772 798071 802081 805425 808069 810047 811573
51785 811573 813271 815796 819201 822941 826528 829897 833164 836387 839645 843084 846645 849916 852400 853829
51771 853829 854184 853468 851521 848007 842610 835386 826897 817931 809054 800487 792250 784307 776746 769974 764538
51756 764538 760511 757270 754232 751630 750160 750037 750882 752440 754750 757600 760472 763273 766524 770498 774731
51741G74731M002L895L917L318J904O12K67M70K93l80q81q32n49m19m10l20k16
51724G89402k34j31O29K114L567M106L726L194K947K702K318K276K836L352L223
51709H26027L007L675N002N714N260M489M422N167O282P424Q174P934O550M652
51695I03779K996J812J048P51Q50R82Q25L13p08k476m757o743p948q770r717j0603
51679H61634j1033j1191j1536j1875j1493j0110q187o234m362k576j086l9P86
51666G72698J816L238M732N722N937N729N651N677N213L963K422J254M44n43j954
51651H21999l516m885n966o806p443p898q098p824o971n804m816m269m080m004
51637G39619l843l564l356l528m092m619m673m324l978l704l108k035j072r69
$$ plain form
51741 774731 778733 782628 786545 789863 791767 792379 792646 793116 793409 793029 792148 791316 790767 790348 789938 789618 789402
51724 789402 789168 789037 789666 791780 795347 799453 803179 806373 809320 812022 814340 816616 819452 822804 826027
51709 826027 829034 832709 837711 843425 848685 853174 857596 862763 869045 876469 884643 892577 899127 903779
51695 903779 906775 908587 909635 910386 911236 912218 913043 913356 912648 910172 905415 898672 890724 881954 872237 861634
51679 861634 850601 839410 827874 815999 804506 794396 786209 779975 775613 773037 771951 771912 772698
51666 772698 774514 777752 782484 788206 794143 799872 805523 811200 816413 820376 822798 824052 824496 823953 821999
51651 821999 818483 813598 807632 800826 793383 785485 777387 769563 762592 756788 751972 747703 743623 739619
51637 739619 735776 732212 728856 725328 721236 716617 711944 707620 703642 699938 696830 694795 693723 692754
51623F92754j590j894j222l09m99j998l492l755l059k480k339k065j399p87m88
51608F65378o1Q10J718K161K343K829L715M648N449O257P170Q133R090J0000J0731
51593G40371J1216J1618J2172J2916J3710J4380J4755J4737J4465J4270J4354
51582H88964J4797J5860J7972K1188K5045K9197L3844L9245M5047N0431N4805
51571A236395N8159O0937O3731O6858P0055P2680P4270P4600P3223O9607O3945
51560A984460N7240N0188M2478L3607K3791J3488K457r817k3127l6641m9787o2168
51548B026169p2816q0471q4864q6932q7547q6596q3635p8832p2899o6486o0007
51537A165084n3764m7878m2267l6985l2391k8786k5947k3267k0316j7152j4097
$$ plain form
51623 692754 691164 689270 688048 687739 687240 685242 681750 677995 674936 672456 670117 668052 666653 665866 665378
51608 665378 665317 666127 667845 670006 672349 675178 678893 683541 688990 695247 702417 710550 719640 729640 740371
51593 740371 751587 763205 775377 788293 802003 816383 831138 845875 860340 874610 888964
51582 888964 903761 919621 937593 958781 983826 1013023 1046867 1086112 1131159 1181590 1236395
51571 1236395 1294554 1355491 1419222 1486080 1556135 1628815 1703085 1777685 1850908 1920515 1984460
51560 1984460 2041700 2091888 2134366 2167973 2191764 2205252 2207709 2197892 2174765 2138124 2088337 2026169
51548 2026169 1953353 1872882 1788018 1701086 1613539 1526943 1443308 1364476 1291577 1225091 1165084
51537 1165084 1111320 1063442 1021175 984190 951799 923013 897066 873799 853483 836331 822234
51526H22234j1339q831o580m909m138m073m088l918l988m610n212m839l373j848
51512G50488j440k369l735m282l470k038j376k088l377m058l859l267k574j785
51498G10770j223j325j760j595o52N6l28j300j729j385j086j476k193k463k104
51483F90207j695j854k460k806k486j888j606j618j470j111r97j301j519j132
51469F66264k47O23J158J368J401J459J721K169K642L119L713M294M530M500M824
51454G03538N903P302Q304Q784R214J0031J1282J2686J3643J3459J2069J0431
51442H26646R719J0149J0978J1456J1194R695O454J896k409n071o093o336o239
51429H72039n748n221n488o845q596r890j0452j0329r422p842o280n424n089m402
$$ plain form
51526 822234 810895 802064 795484 790575 786437 782364 778276 774358 770370 765760 760548 755709 752336 750488
51512 750488 749048 746679 742944 738662 735192 733154 731778 729690 726313 722255 718396 715129 712555 710770
51498 710770 709547 708222 706462 704867 704215 704271 703943 702643 700914 699529 698443 696967 694774 692311 690207
51483 690207 688512 686658 684198 681392 678906 677018 675412 673794 672324 671213 670216 668915 667396 666264
51469 666264 666017 666640 667798 669166 670567 672026 673747 675916 678558 681677 685390 689684 694214 698714 703538
51454 703538 709441 716743 725047 733831 743045 753076 764358 777044 790687 804146 816215 826646
51442 826646 836365 846514 857492 868948 880142 889837 896291 898187 895778 890707 884614 878278 872039
51429 872039 866291 861070 855582 848737 840141 830251 819799 809470 800048 792206 785926 780502 775413 771011
51415G71011k873q44J035K372L051L131K914K866L271M085N048N845O287O721
51401H13920Q012J0634J3851J6382J7955J9603K2244K5729K9571L3911L9156M5219
51389A096187N1772N8826O6352P3562P9373Q3557Q6800Q9594R1559R1926R0203
51378A959711Q6160P9631P0526N8918M5131K9782J3642k854j9673l6534n2437
51367B232003o6317p7816q6994r3558r7138r8109r7317r4962r0549q4116p6687
51356A268440o9233o1881n4574m7815m2188l7563l3426k9608k6208k3091k0039
51345H22814j7266j5259j4096j3328j2528j1609j0666r724q717p530o139m817
51333F91135m068m085m447m572m306l832l169k212j208p03q22r60m72N28J358
$$ plain form
51415 771011 768138 767294 768329 770701 773752 776883 779797 782663 785934 790019 795067 800912 807199 813920
51401 813920 821932 832566 846417 862799 880754 900357 922601 948330 977901 1011812 1050968 1096187
51389 1096187 1147959 1206785 1273137 1346699 1426072 1509629 1596429 1686023 1777582 1869508 1959711
51378 1959711 2045871 2125502 2196028 2254946 2300077 2329859 2343501 2340647 2320974 2284440 2232003
51367 2232003 2165686 2087870 2000876 1907318 1810180 1712071 1614754 1519792 1429243 1345127 1268440
51356 1268440 1199207 1137326 1082752 1034937 992749 955186 921760 892152 865944 842853 822814
51345 822814 805548 790289 776193 762865 750337 738728 728062 718338 709621 702091 695952 691135
51333 691135 687067 682982 678535 673963 669657 665825 662656 660444 659236 658533 657711 656751 656279 656807 658165
51318F58165J714K088L062M462N461N546N039M579M364M128L700L181K591J762
51304G09842O75l86j261k193l444m783n706o063o178o322o380o083n378m368l159
51289F48813j998j378j529j863j343L55K359L577L816L669L585L613L802M224
51275F69702M647M777M882N489O423O881O664O456O513O011M427K727K210K733
51261G40542L133K950K659K359J494m1j548k563l358m224n043n812o808p840q151
51246G07749p448o417n808n547n156m491l664k751j922j404j009k75O95J095N80
51231F64227p5oO13J104J367J722K104K097J710J437J609K105K612K824K571K085
51215F90106J960K466L188L647L981M532N145N377N189M923M738M521M285M163
$$ plain form
51318 658165 659879 661967 665029 669491 674952 680498 685537 690116 694480 698608 702308 705489 708080 709842
51304 709842 710517 710131 708870 706677 703233 698450 692744 686681 680503 674181 667801 661718 656340 651972 648813
51289 648813 646815 645437 643908 642045 640702 641057 643416 646993 650809 654478 658063 661676 665478 669702
51275 669702 674349 679126 684008 689497 695920 702801 709465 715921 722434 728445 732872 735599 737809 740542
51261 740542 743675 746625 749284 751643 753137 753096 751548 748985 745627 741403 736360 730548 723740 715900 707749
51246 707749 700301 693884 688076 682529 677373 672882 669218 666467 664545 663141 662132 661857 662552 663647 664227
51231 664227 664152 664146 664759 665863 667230 668952 671056 673153 674863 676300 677909 680014 682626 685450 688021 690106
51215 690106 692066 694532 697720 701367 705348 709880 715025 720402 725591 730514 735252 739773 744058 748221
51201G48221M197M419M913N514N820N887O378P434P928O683M161J957Q63L39j52
51186H14562m69o68j437l065m707n378n171m942n180n740o315o700o735o468o203
51171G45384o031n603m663l577k838k327j549n43O9j8l38l32j27l15j170k351
51155G13671l203l258k528j576j178j650k499k972k883k671k662k663k368j797
51141F79763j077k15N59O77jn64L8J640L093L867M490N266N572M994M260M193
51125G16555M397L963L048K668L038L222K624J779J349J132O85K66M23J023J386
51110G47558J263J081J219J514J671J761J978K134J753P37m04j099j353j584j939
51095G56290k196k347k792l713m565m591l691k414j246l06M01Q03R51J003J004
$$ plain form
51201 748221 752418 756837 761750 767264 773084 778971 785349 792783 800711 807394 811555 813512 814375 814714 814562
51186 814562 814093 813425 811988 808923 804216 798838 793667 788725 783545 777805 771490 764790 758055 751587 745384
51171 745384 739353 733750 729087 725510 722672 720345 718796 718253 718322 718304 717966 717634 717507 717192 716022 713671
51155 713671 710468 707210 704682 703106 701928 700278 697779 694807 691924 689253 686591 683928 681560 679763
51141 679763 678686 678471 679030 679707 679706 679142 679180 680820 683913 687780 692270 697536 703108 708102 712362 716555
51125 716555 720952 724915 727963 730631 733669 736891 739515 741294 742643 743775 744460 744726 745149 746172 747558
51110 747558 748821 749902 751121 752635 754306 756067 758045 760179 761932 762669 762265 761166 759813 758229 756290
51095 756290 754094 751747 748955 745242 740677 736086 732395 729981 728735 728429 728830 729633 730584 731587 732591
51080G32591R37R84J465K367L298M000M629N381O055O206N658M718L960L808M266
51065G90323M956N438N497N174M692M380M487M819M773L940K650J671J502K144
51051H46446L345M676N570N742N611N833O485P157P792Q738R861J0323R728Q811
51037I46118Q429Q256P312N481L659K347R72j021l098m242m294m075m284m834
51023I56726n230n134m421l142j633k91R62K693N084P427Q864R430R757R966R469
51008A000527Q108O775O496P167P662P098N657M161L108K273J243K36J00J299
50994A061910L180M638N404O214P715R801J2060J4238J6059J7251J8081J9282
50982A195833K0994K2420K3049K3591K4905K6550K7349K7154K7026K7678K8669
$$ plain form
51080 732591 733528 734512 735977 738344 741642 745642 750271 755652 761707 767913 773571 778289 782249 786057 790323
51065 790323 795279 800717 806214 811388 816080 820460 824947 829766 834539 838479 841129 842800 844302 846446
51051 846446 849791 854467 860037 865779 871390 877223 883708 890865 898657 907395 917256 927579 937307 946118
51037 946118 954547 962803 970115 975596 979255 981602 982574 981553 978455 974213 969919 965844 961560 956726
51023 956726 951496 946362 941941 938799 937166 936875 937837 940530 945614 953041 961905 971335 981092 991058 1000527
51008 1000527 1008635 1015410 1021906 1029073 1036735 1043833 1049490 1053651 1056759 1059032 1060275 1060511 1060611 1061910
50994 1061910 1065090 1069728 1075132 1081346 1089061 1098862 1110922 1125160 1141219 1158470 1176551 1195833
50982 1195833 1216827 1239247 1262296 1285887 1310792 1337342 1364691 1391845 1418871 1446549 1475218
50971A475218K9345K9837L0720L2166L3816L5147L5819L5966L6246L7256L8859
50960A850395M0357M1362M2074M2718M3184M3242M2647M1033L8200L4717L1663
50949B291592K9525K7685K5319K2392J9543J7249J5426J3648J1588R336P323N780
50937B496406M288K198o56m007p832j2387j7479k2373k6708l0889l5236l9288
50925B306037m2455m4934m7358m9755n1499n2263n2561n3092n3826n3982n2838
50914A751474n0486m7704m5075m2465l9529l6457l3770l1450k8871k5775k2764
50903A347128k0500j8818j7019j4791j2491j0522q793o884m687k759j847j945
50891A226072k072j384k02N61Q42J500K896M207M567M268M295N089O287P365Q069
$$ plain form
50971 1475218 1504563 1534400 1565120 1597286 1631102 1666249 1702068 1738034 1774280 1811536 1850395
50960 1850395 1890752 1932114 1974188 2016906 2060090 2103332 2145979 2187012 2225212 2259929 2291592
50949 2291592 2321117 2348802 2374121 2396513 2416056 2433305 2448731 2462379 2473967 2483303 2490626 2496406
50937 2496406 2500694 2502892 2502236 2498229 2490397 2478010 2460531 2438158 2411450 2380561 2345325 2306037
50925 2306037 2263582 2218648 2171290 2121535 2070036 2017773 1965212 1912120 1858294 1804312 1751474
50914 1751474 1700988 1653284 1608209 1565744 1526215 1489758 1455988 1424538 1395667 1369892 1347128
50903 1347128 1326628 1307810 1290791 1276000 1263509 1252987 1244194 1237310 1232623 1229864 1228017 1226072
50891 1226072 1224000 1222616 1222414 1222975 1223817 1225317 1228213 1232420 1236987 1241255 1245550 1250639 1256926 1264291 1272360
50876A272360Q450Q841R591J0713J1943J3327J5166J7219J8568J8821J8888K0047
50864A443934K2577K5893K9540L3370L7114M0623M4364M8912N4023N8967O3720
50853A903037O9059P5326Q1892Q8134R4218J00523J06780J12316J16755J20076
50843B868116J22125J22598J21472J19109J15863J11733J06387R9495R0945Q0922
50833C958765O9850N8345M7102L6684K7312J8945J1524N097k83m550p522r102
50821D212167r654r920j0456j1464j3192j6157k0682k6579l3521m1408n0117n9231
50809C909786o8388p7476q6152r3550r8995j02638j04889j05594j04367j01394
50799B966343r7168r1663q4646p6608o8497o0435n1663m2059l2747k4797j8005
$$ plain form
50876 1272360 1280810 1289651 1299242 1309955 1321898 1335225 1350391 1367610 1386178 1404999 1423887 1443934
50864 1443934 1466511 1492404 1521944 1555314 1592428 1633051 1677415 1726327 1780350 1839317 1903037
50853 1903037 1972096 2047422 2129314 2217448 2311666 2412189 2518969 2631285 2748040 2868116
50843 2868116 2990241 3112839 3234311 3353420 3469283 3581016 3687403 3786898 3877843 3958765
50833 3958765 4028615 4086960 4134062 4170746 4198058 4217003 4228527 4233624 4233341 4228791 4221269 4212167
50821 4212167 4202513 4192593 4182137 4170673 4157481 4141324 4120642 4094063 4060542 4019134 3969017 3909786
50809 3909786 3841398 3763922 3677770 3584220 3485225 3382587 3277698 3172104 3067737 2966343
50799 2966343 2869175 2777512 2692866 2616258 2547761 2487326 2435663 2393604 2360857 2336060 2318055
50788B318055j1621n623o25L128N985Q240R757J0218R425P424M574J420j712m930
50774B353715q412j2063j5687j9270k2847k6219k9044l1161l2687l3906l5097
50763B087322l6382l7631l8694l9586m0179l9814l7765l4345l0919k8452k6458
50752A697097k3844k0368j6661j3078r319n183j007K844O497J0289J4365J8731
50740A660363K3344K7988L2357L6577M1201M6340N1143N4645N7073N9595O2747
50729B153373O5734O7654O8787P0014P1280P1451O9770O6595O2460N7233N0830
50718B875181M4102L8012L2212K5429J7460R761L730q13m872q714j1778j3698
50706C006012j4562j4405j3280j1894j1380j2152j3472j4493j5266j6499j8652
$$ plain form
50788 2318055 2306434 2300811 2300186 2303314 2309299 2317539 2327296 2337514 2346939 2354363 2358937 2360357 2358645 2353715
50774 2353715 2345303 2333240 2317553 2298283 2275436 2249217 2220173 2189012 2156325 2122419 2087322
50763 2087322 2050940 2013309 1974615 1935029 1894850 1855036 1817271 1782926 1752007 1723555 1697097
50752 1697097 1673253 1652885 1636224 1623146 1613827 1608644 1607637 1610481 1616978 1627267 1641632 1660363
50740 1660363 1683707 1711695 1744052 1780629 1821830 1868170 1919313 1973958 2031031 2090626 2153373
50729 2153373 2219107 2286761 2355548 2425562 2496842 2568293 2638063 2704658 2767118 2824351 2875181
50718 2875181 2919283 2957295 2989507 3014936 3032396 3042157 3045887 3045074 3040202 3031488 3019710 3006012
50706 3006012 2991450 2977045 2963765 2951871 2940491 2928339 2914867 2900374 2885108 2868609 2849957
50695B849957k1730k5591l0050l4646l8751m1986m4383m6057m6816m6188m3801
50684B429958l9731l4483k8612k2369j5804r067k367M427J1807J9973K8285L5757
50672B377774M2057M7708N3188N8136O1737O3686O4395O4163O2640N9369N4640
50661C009493M9396M4199L8686L2219K4800J7069R633K826l027p606j1077j4151
50649C192460j7418k0824k3969k6674k8893l0248l0094k8169k4951k1321j7886
50638B922013j4650j1161p072k576J742N555R013J2219J4755J6072J6099J5021
50626B977030J2767R308N374K127l9j805l982o869j0703j5829k1845k7226l0564
50613B887744l1819l1790l0788k8595k5430k2123j9364j7472j6700j7095j8094
$$ plain form
50695 2849957 2828227 2802636 2772586 2737940 2699189 2657203 2612820 2566763 2519947 2473759 2429958
50684 2429958 2390227 2355744 2327132 2304763 2288959 2279892 2277525 2281952 2293759 2313732 2342017 2377774
50672 2377774 2419831 2467539 2520727 2578863 2640600 2704286 2768681 2832844 2895484 2954853 3009493
50661 3009493 3058889 3103088 3141774 3173993 3198793 3215862 3225495 3228321 3225294 3217688 3206611 3192460
50649 3192460 3175042 3154218 3130249 3103575 3074682 3044434 3014340 2986171 2961220 2939899 2922013
50638 2922013 2907363 2896202 2889130 2886554 2888296 2893851 2902864 2915083 2929838 2945910 2962009 2977030
50626 2977030 2989797 2999105 3004479 3006606 3006567 3004762 3000780 2993911 2983208 2967379 2945534 2918308 2887744
50613 2887744 2855925 2824135 2793347 2764752 2739322 2717199 2697835 2680363 2663663 2646568 2628474
50602B628474j9027k0075k2023k5063k8644l2538l7098m2158m6624m9664n1691
50591B253869n3487n4973n5485n4767n3066n0541m7258m3634m0194l6978l3548
50580A729938k9543k4985k0146j5433j1165p232l204R34M540P155R188J1331J3667
50567A665045J5869J7884J9774K1321K2489K3948K6296K8927L0749L1898L3651
50556A937851L6417L9063M0781M2506M5502M9272N2048N3057N3203N3509N3873
50545B457082N3738N3115N2332N1179M9060M6009M2954M0814L9633L8916L8559
50534B963391L9035M0619M2875M5051M6893M8753N1008N3606N6203N8564O0775
50523C506773O3009O5174O6859O7735O7872O7337O5625O1933N6070M8698M0368
$$ plain form
50602 2628474 2609447 2589372 2567349 2542286 2513642 2481104 2444006 2401848 2355224 2305560 2253869
50591 2253869 2200382 2145409 2089924 2035157 1982091 1931550 1884292 1840658 1800464 1763486 1729938
50580 1729938 1700395 1675410 1655264 1639831 1628666 1621434 1618230 1619164 1623704 1630859 1640047 1651378 1665045
50567 1665045 1680914 1698798 1718572 1739893 1762382 1786330 1812626 1841553 1872302 1904200 1937851
50556 1937851 1974268 2013331 2054112 2096618 2142120 2191392 2243440 2296497 2349700 2403209 2457082
50545 2457082 2510820 2563935 2616267 2667446 2716506 2762515 2805469 2846283 2885916 2924832 2963391
50534 2963391 3002426 3043045 3085920 3130971 3177864 3226617 3277625 3331231 3387434 3445998 3506773
50523 3506773 3569782 3634956 3701815 3769550 3837422 3904759 3970384 4032317 4088387 4137085 4177453
50512D177453L0904K0091Q501k996j4208k5431l6461m6461n4836o1536o6524o9584
50500C858912p0801p0519o8599o4417n8022n0619m3338l6008k7964j9759j3157
50489C335709r344p817p464q115j0429j4624k0088k6407l4007m3197n3055o2085
50477C039077o9875p7120q3811q8438q9759q8594q6814q4963q2031p7420p1953
50466B138299o6638o1544n6440n1698m7801m4567m1502l8552l5917l3431l0699
50455A629510k7698k4758k2117j9788j7612j5122j1797p914m726l180k732k058
50443A470008p31N90J447K213L252M282M982N619O663Q106R577J0911J2244J3712
50429A552875J5379J7274J9275K1094K2607K4076K5790K7643K9338L0906L2756
$$ plain form
50512 4177453 4208357 4228448 4236949 4233953 4219745 4194314 4157853 4111392 4056556 3995020 3928496 3858912
50500 3858912 3788111 3717592 3648993 3584576 3526554 3475935 3432597 3396589 3368625 3348866 3335709
50489 3335709 3326365 3318548 3311084 3302969 3292540 3277916 3257828 3231421 3197414 3154217 3101162 3039077
50477 3039077 2969202 2892082 2808271 2719833 2630074 2541480 2454666 2369703 2287672 2210252 2138299
50466 2138299 2071661 2010117 1953677 1901979 1854178 1809611 1768109 1729557 1693640 1660209 1629510
50455 1629510 1601812 1577054 1554937 1535149 1517537 1502415 1490618 1482704 1477978 1474798 1472066 1470008
50443 1470008 1469277 1469867 1471314 1473527 1476779 1481061 1486043 1491662 1498325 1506431 1516008 1526919 1539163 1552875
50429 1552875 1568254 1585528 1604803 1625897 1648504 1672580 1698370 1726013 1755351 1786257 1819013
50418A819013L5186L8059M0970M3549M5623M7340M9185N1595N4429N6995N8765
50407B340709N9842O0515O0643N9760N7713N4801N1267M6998M1771L5512K8230
50396B897761J9993J1082J888p460j7060k6693l5667m3500n0318n6253o0735o2990
50384B570048o3073o1913o0280n8079n4640m9449m2687l5421k9054k4191k0118
50373B071143j5895j1682q358o079m173k605k500m700q534j2676j6702k1037k5784
50360A930418l0329l4040l6694l8311l8981l8953l8537l7843l6847l5602l4160
50349A530121l2434l0333k8062k6039k4633k4002k3892k3548k2232k0100j8166
50338A256680j7068j6311j5124j3596j2314j1273r989q543p604p245o613n100
$$ plain form
50418 1819013 1854199 1892258 1933228 1976777 2022400 2069740 2118925 2170520 2224949 2281944 2340709
50407 2340709 2400551 2461066 2521709 2581469 2639182 2693983 2745250 2792248 2834019 2869531 2897761
50396 2897761 2917754 2928836 2930724 2923264 2906204 2879511 2843844 2800344 2750026 2693773 2633038 2570048
50384 2570048 2506975 2445062 2384782 2326703 2272063 2222614 2179927 2144506 2115452 2091261 2071143
50373 2071143 2055248 2043566 2035208 2029129 2024956 2022351 2019851 2015151 2006617 1993941 1977239 1956202 1930418
50360 1930418 1900089 1866049 1829355 1791044 1752063 1713110 1674573 1636730 1599883 1564281 1530121
50349 1530121 1497687 1467354 1439292 1413253 1388620 1364618 1340726 1317178 1294946 1274846 1256680
50338 1256680 1239612 1223301 1208177 1194581 1182267 1170994 1161005 1152462 1144858 1137613 1131000 1125900
50326A125900l250j974j323n86O59K155L541M888O453Q247J0049J1669J2948J3582
50312A192958J3317J2523J2228J3208J5049J6551J7060J6938J6631J5973J4742
50301A357178J3376J2478J1928J1074R645P900O094M346K960K211J780J064Q3
50288A442117m93l77j08j89m20m64n27r45j398j130J4J280J704R27p03k547m066
50271A432675m971n180m741l740k204j04K399M771O435P418Q239Q962Q872P680
50257A466511O531O928Q776J0389J0581R782Q888P977O804N680M945M114K506
50244A560412M64r83j509j777k366l224m250n558o878p472p088o464o437o922
50230A499948p226o969o266n224l933k718j902j240j49J505L233M686O147Q070
$$ plain form
50326 1125900 1122650 1120676 1119353 1118767 1119426 1121581 1125122 1130010 1136463 1144710 1154759 1166428 1179376 1192958
50312 1192958 1206275 1218798 1231026 1244234 1259283 1275834 1292894 1309832 1326463 1342436 1357178
50301 1357178 1370554 1383032 1394960 1406034 1415679 1423579 1429673 1434019 1436979 1439190 1440970 1442034 1442117
50288 1442117 1441624 1441247 1441139 1440950 1440530 1440066 1439539 1438594 1437196 1436066 1436080 1437360 1439064 1439991 1439288 1436741 1432675
50271 1432675 1427704 1422524 1417783 1414043 1411839 1411735 1414134 1418905 1425340 1432758 1440997 1449959 1458831 1466511
50257 1466511 1473042 1479970 1488746 1499135 1509716 1519498 1528386 1536363 1543167 1548847 1553792 1557906 1560412
50244 1560412 1560876 1559893 1558384 1556607 1554241 1551017 1546767 1541209 1534331 1526859 1519771 1513307 1506870 1499948
50230 1499948 1492722 1485753 1479487 1474263 1470330 1467612 1465710 1464470 1464321 1465826 1469059 1473745 1479892 1487962
50216A487962J0474J3046J5508J7633J9235K0531K2233K4837K7914L0693L3260
50205A723326L6568M1182M6586N2027N7449O3052O8533P3429P7975Q2793Q7785
50194B410705R2053R5120R7491R9706J01369J01613J00096R6999R2298Q5616P6812
50183C449878O6334N4928M3279L1897K0975J0250q12j2563k4989l7989n1528o5428
50171C484232p9089r1504j01493j08077j10866j10291j07334j02962r7774r2067
50161B482775q5972p9456p2458o5221n8372n2527m7875m4231m1383l9224l7593
50150A858463l6238l4892l3357l1576k9712k8098k6841k5562k3772k1567j9641
50139A547207j8421j7451j5938j3784j1707j0342r524q650p429o050m674l230
$$ plain form
50216 1487962 1498436 1511482 1526990 1544623 1563858 1584389 1606622 1631459 1659373 1690066 1723326
50205 1723326 1759894 1801076 1847662 1899689 1957138 2020190 2088723 2162152 2240127 2322920 2410705
50194 2410705 2502758 2597878 2695369 2795075 2896444 2998057 3098153 3195152 3287450 3373066 3449878
50183 3449878 3516212 3571140 3614419 3646316 3667291 3677541 3676729 3664166 3639177 3601188 3549660 3484232
50171 3484232 3405143 3313639 3212146 3104069 2993203 2882912 2775578 2672616 2574842 2482775
50161 2482775 2396803 2317347 2244889 2179668 2121296 2068769 2020894 1976663 1935280 1896056 1858463
50150 1858463 1822225 1787333 1753976 1722400 1692688 1664590 1637749 1612187 1588415 1566848 1547207
50139 1547207 1528786 1511335 1495397 1481613 1469906 1459564 1450040 1441390 1433961 1427911 1423237 1420007
50127A420007j751n94q6%K17P37J130J082R96J507K576L515M008M578N770P250
50111A450942Q211Q451Q604R364J0855J2799J4864J6796J8517K0244K2265K4535
50099A626447K6719K8748L0956L3590L6477L9389M2486M6146N0569N5723O1540
50088B078790O8012P5235Q3365R2353J01720J10907J19962J29423J39429J49356
50078C148552J58509J66748J74117J80462J85767J90368J94042J95324J92508
50069D786397J85322J74970J62631J48622J33023J16232R8640Q0269O1029M0825
50059E987960J9159m818l1457n9964q8811j16448j41494j62702j79287j91127
50049E031011j98438k01460k00652j96876j90972j83284j73904j63264j52104
$$ plain form
50127 1420007 1418256 1417662 1417576 1417576 1417793 1418530 1419660 1420742 1421738 1423245 1425821 1429336 1433344 1437922 1443692 1450942
50111 1450942 1459153 1467604 1476208 1485572 1496427 1509226 1524090 1540886 1559403 1579647 1601912 1626447
50099 1626447 1653166 1681914 1712870 1746460 1782937 1822326 1864812 1910958 1961527 2017250 2078790
50088 2078790 2146802 2222037 2305402 2397755 2499475 2610382 2730344 2859767 2999196 3148552
50078 3148552 3307061 3473809 3647926 3828388 4014155 4204523 4398565 4593889 4786397
50069 4786397 4971719 5146689 5309320 5457942 5590965 5707197 5805837 5886106 5947135 5987960
50059 5987960 6007119 6002301 5970844 5910880 5822069 5705621 5564127 5401425 5222138 5031011
50049 5031011 4832573 4631113 4430461 4233585 4042613 3859329 3685425 3522161 3370057
50040C370057j40874j29412j17352j04835r2801q2509p4561o8306o2510n6635
50030B440262n1263m7022m3548l9870l5650l1553k8271k5645k2969j9972j7186
50019B077313j5278j4187j3045j1041q222n428l395k098r89K42J337J966K339
50006B009514L068M270N094M436K130r96m154p250j0379j3281j5740j8010k0227
49993A938475k1891k2588k2993k4184k6026k7104k6407k4358k1918j9501j6989
49982A684516j4164j0693o403j913J704M420P679J2647J8730K4527K9764L5299
$$ plain form
50040 3370057 3229183 3099771 2982419 2877584 2784783 2702274 2627713 2559407 2496897 2440262
50030 2440262 2388999 2341977 2298429 2258559 2222909 2191356 2163085 2137440 2114471 2094499 2077313
50019 2077313 2062035 2047848 2034803 2023762 2015540 2010112 2006717 2004619 2003630 2003872 2005209 2007175 2009514
50006 2009514 2012582 2016852 2021946 2026382 2028512 2027516 2023362 2016112 2005733 1992452 1976712 1958702 1938475
49993 1938475 1916584 1893996 1871003 1846819 1820793 1793689 1767282 1742924 1721006 1701505 1684516
49982 1684516 1670352 1659659 1653256 1651343 1653047 1657467 1665146 1677793 1696523 1721050 1750814 1786113
$$ [...]
##END NTUPLES=NMR SPECTRUM
##END=
