##TITLE=AC1683_2985_8571279_yJtKDicOSf
##JCAMPDX= 6.0         $$ Bruker NMR JCAMP-DX V2.0
##DATA TYPE= NMR SPECTRUM
##DATA CLASS= NTUPLES
##ORIGIN= BRUKER
##OWNER= Administrator
$$ 1.72 TOPSPIN		Version 2.1
$$ 2014-04-11 18:24:50.328 -0700  Administrator@X
$$ Compression mode = diff/dup
##.OBSERVE FREQUENCY= 400.02188249412
##.OBSERVE NUCLEUS= ^1H
##.ACQUISITION MODE= SIMULTANEOUS (DQD)
##.ACQUISITION SCHEME= undefined
##.AVERAGES= 8
##.DIGITISER RES= 22
##SPECTROMETER/DATA SYSTEM= spect
##.PULSE SEQUENCE= zg30
##.SOLVENT NAME= COFFEE_meoh
##.SHIFT REFERENCE= INTERNAL, COFFEE_meoh, 1, 14.98509
##AUDIT TRAIL= $$ (NUMBER, WHEN, WHO, WHERE, PROCESS, VERSION, WHAT)
$$ ##TITLE= Audit trail, TOPSPIN		Version 2.1
$$ ##JCAMPDX= 5.01
$$ ##ORIGIN= Bruker BioSpin GmbH
$$ ##OWNER= Administrator
$$ $$ E:\/data/COFFEE/nmr/AC1683_2985_8571279_yJtKDicOSf/30/pdata/1/auditp.txt
$$ ##AUDIT TRAIL=  $$ (NUMBER, WHEN, WHO, WHERE, PROCESS, VERSION, WHAT)
(   1,<2014-04-11 18:24:43.344 -0700>,<Administrator>,<X>,<go>,<TOPSPIN 2.1>,
      <created by zg
	started at 2014-04-11 18:23:37.844 -0700,
	POWCHK enabled, PULCHK disabled,
       configuration hash MD5:
       C8 4E 4E 5D D3 5C D8 9E 9F 52 82 E0 59 8A DE 15
       data hash MD5: 64K
       5A 83 E4 23 29 5B BA 31 BC 71 54 F1 BD E2 F1 55>)
(   2,<2014-04-11 18:24:46.313 -0700>,<Administrator>,<X>,<proc1d>,<TOPSPIN 2.1>,
      <Start of raw data processing
       efp LB = 0 FT_mod = 6 PKNL = 1 PHC0 = 0 PHC1 = 0 SI = 32K 
       data hash MD5: 32K
       78 A7 F1 8E 55 CF 3E 2E 2A 5D 7A 7E 66 93 0F 24>)
(   3,<2014-04-11 18:24:46.625 -0700>,<Administrator>,<X>,<proc1d>,<TOPSPIN 2.1>,
      <pk PHC0 = 93.9386 PHC1 = 0 
       data hash MD5: 32K
       C6 BD A9 B8 FC A9 93 A0 F5 DF 70 7D C6 90 C2 33>)
(   4,<2014-04-11 18:24:46.734 -0700>,<Administrator>,<X>,<proc1d>,<TOPSPIN 2.1>,
      <abs ABSG = 1 
       data hash MD5: 32K
       7E 16 63 00 D1 B2 3C 86 43 28 C6 1E 33 68 48 A8>)
(   5,<2014-04-11 18:24:46.797 -0700>,<Administrator>,<X>,<proc1d>,<TOPSPIN 2.1>,
      <abs ABSG = 2 
       data hash MD5: 32K
       88 20 45 A8 CD DE 78 9E 64 B0 7B D2 7B BC 06 D8>)
(   6,<2014-04-11 18:24:46.906 -0700>,<Administrator>,<X>,<proc1d>,<TOPSPIN 2.1>,
      <abs ABSG = 3 
       data hash MD5: 32K
       A3 AA AD AE B9 82 6F 41 0D 5F E8 46 FC 65 28 CB>)
(   7,<2014-04-11 18:24:47.109 -0700>,<Administrator>,<X>,<proc1d>,<TOPSPIN 2.1>,
      <abs ABSG = 4 
       data hash MD5: 32K
       84 9F 03 2A B0 19 AB 24 A7 1E 7A 65 98 FA BB FF>)
(   8,<2014-04-11 18:24:47.219 -0700>,<Administrator>,<X>,<proc1d>,<TOPSPIN 2.1>,
      <abs ABSG = 5 
       data hash MD5: 32K
       84 A3 2D 03 AE 81 9C 92 08 85 DD 0E 15 24 72 AB>)
$$ ##END=
$$ 
$$ $$ hash MD5
$$ $$ E0 AE 7E 39 FB 23 14 07 79 EF F6 2D 6C AB DC B8
##$RELAX= 
##$RELAX= 
##$RELAX= 
##$RELAX= 
##$RELAX= 
##$RELAX= 
##$RELAX= 
$$ Bruker specific parameters
$$ --------------------------
##$DU= <E:\>
##$EXPNO= 30
##$NAME= <AC1683_2985_8571279_yJtKDicOSf>
##$PROCNO= 1
$$ [...]
##$TP= (0..7)
150 150 150 150 150 150 150 150
##$TP07= 0
##$TPNAME0= <>
##$TPNAME1= <>
##$TPNAME2= <>
##$TPNAME3= <>
##$TPNAME4= <>
##$TPNAME5= <>
##$TPNAME6= <>
##$TPNAME7= <>
##$TPOAL= (0..7)
0.5 0.5 0.5 0.5 0.5 0.5 0.5 0.5
##$TPOFFS= (0..7)
0 0 0 0 0 0 0 0
##$TUNHIN= 0
##$TUNHOUT= 0
##$TUNXOUT= 0
##$USERA1= <user>
##$USERA2= <user>
##$USERA3= <user>
##$USERA4= <user>
##$USERA5= <user>
##$V9= 5
##$VALIST= <valist>
##$VCLIST= <CCCCCCCCCCCCCCC>
##$VD= 0
##$VDLIST= <DDDDDDDDDDDDDDD>
##$VPLIST= <PPPPPPPPPPPPPPP>
##$VTLIST= <TTTTTTTTTTTTTTT>
##$WBST= 1024
##$WBSW= 4
##$XGAIN= (0..3)
0 0 0 0
##$XL= 0
##$YL= 0
##$YMAX_a= 585516
##$YMIN_a= -495565
##$ZGOPTNS= <>
##$ZL1= 120
##$ZL2= 120
##$ZL3= 120
##$ZL4= 120
##$ABSF1= 14.98509
##$ABSF2= -5.573092
##$ABSG= 5
##$ABSL= 3
##$ALPHA= 0
##$AQORDER= 0
##$ASSFAC= 0
##$ASSFACI= 0
##$ASSFACX= 0
##$ASSWID= 0
##$AUNMP= <proc_prof1d_extract_pilot.lims>
##$AXLEFT= 0
##$AXNAME= <>
##$AXNUC= <1H>
##$AXRIGHT= 0
##$AXTYPE= 0
##$AXUNIT= <>
##$AZFE= 0.1
##$AZFW= 0.1
##$BCFW= 0
##$BC_mod= 0
##$BYTORDP= 0
##$COROFFS= 0
##$CY= 15
##$DATMOD= 1
##$DC= 0
##$DFILT= <>
##$DTYPP= 0
##$F1P= 0
##$F2P= 0
##$FCOR= 0.5
##$FTSIZE= 32768
##$FT_mod= 6
##$GAMMA= 0
##$GB= 0
##$INTBC= 1
##$INTSCL= 1
##$ISEN= 128
##$LB= 0
##$LEV0= 0
##$LPBIN= 0
##$MAXI= 10000
##$MC2= 0
##$MEAN= 0
##$ME_mod= 0
##$MI= 0
##$NCOEF= 0
##$NC_proc= -8
##$NLEV= 6
##$NOISF1= 0
##$NOISF2= 0
##$NSP= 0
##$NTH_PI= 0
##$NZP= 0
##$OFFSET= 14.98509
##$PC= 1
##$PHC0= 93.9386
##$PHC1= 0
##$PH_mod= 1
##$PKNL= yes
##$PPARMOD= 0
##$PPDIAG= 0
##$PPIPTYP= 0
##$PPMPNUM= 2147483647
##$PPRESOL= 1
##$PSCAL= 4
##$PSIGN= 0
##$PYNMP= <proc.py>
##$REVERSE= no
##$SF= 400.02
##$SI= 32768
##$SIGF1= 0
##$SIGF2= 0
##$SINO= 400
##$SIOLD= 32768
##$SPECTYP= <>
##$SREGLST= <1H.CDCl3>
##$SSB= 0
##$STSI= 32768
##$STSR= 0
##$SW_p= 8223.68421052631
##$SYMM= 0
##$S_DEV= 0
##$TDeff= 65536
##$TDoff= 0
##$TI= <>
##$TILT= no
##$TM1= 0
##$TM2= 0
##$TOPLEV= 0
##$USERP1= <user>
##$USERP2= <user>
##$USERP3= <user>
##$USERP4= <user>
##$USERP5= <user>
##$WDW= 1
##$XDIM= 32768
##$YMAX_p= 452436416
##$YMIN_p= -672009
##$CURPLOT= <Network HP LaserJet P1505>
##$CURPRIN= <$Network HP LaserJet P1505>
##$DFORMAT= <normdp>
##$LAYOUT= <+/1D_H.xwp>
##$LFORMAT= <normlp>
##$PFORMAT= <normpl>
##$SURQMSG= 1
$$ End of Bruker specific parameters
$$ ---------------------------------
##NTUPLES= NMR SPECTRUM
##VAR_NAME=  FREQUENCY,     SPECTRUM/REAL,   SPECTRUM/IMAG
##SYMBOL=    X,             R,               I
##VAR_TYPE=  INDEPENDENT,   DEPENDENT,       DEPENDENT
##VAR_FORM=  AFFN,          ASDF,            ASDF
##VAR_DIM=   32768,         32768,           32768
##UNITS=     HZ,            ARBITRARY UNITS, ARBITRARY UNITS
##FACTOR=    0.250966925370066, 1,           1
##FIRST=     8223.43324360094, 45232,        -48018
##LAST=      0,             76330,           -11295
##MIN=       0,             -672009,         0
##MAX=       8223.43324360094, 452436416,    0
$$ Real data points
##PAGE= N=1
##DATA TABLE= (X++(R..R)), XYDATA
$$ [...]
$$ plain form
19562 -194355 22160 56310 -385173 -146246 -62514 -69106 413382 -330166 -90758 2307 61608
19551 61608 -173327 -116833 49252 -216870 -389283 -44569 -194521 -84202 201657 -48273 -181
19539 165916 -199331 94409 64796 -93408 -117674 -179516 -79346 -43856 36982 -110748 126372
19527 -70223 76697 -46289 -430358 127253 -92284 -261907 -92656 -2233 318096 -367558 -58519
19515 -61448 -95489 -78299 173408 -262057 -300887 -321035 -402220 8474 -38502 29096 -193364
19503 -176748 83919 -280735 -287191 292408 11249 -141869 145513 23478 -116142 -287967
19493 -287967 -43006 86269 33493 67113 -63796 25833 96236 358575 45970 227714 -83738
19481 -6344 -108650 -159430 134345 93097 -186462 -154276 411570 -410161 195679 149535 -205797
$$ packed form
19562a94355B2160L4150c85173a46246f2514o592D13382c30166i0758B307N9301
19551F1608a73327N6494D9252b16870j72413d4569j49952h4202B01657d8273a81
19539A65916a99331I4409k9613i3408k4266o1842g9346L5490C6982a10748A26372
19527g0223G6697d6289l84069A27253i2284j69623i2656b233C18096c67558e8519
19515f1448l4041J7190A73408b62057l8830k0148q1185H474c8502B9096a93364
19503a76748H3919b80735o456B92408A1249a41869A45513B3478a16142j71825
19493b87967d3006H6269C3493L3620f3796B5833P0403K62339D5970J81744h3738
19481f344j02306n0780A34345m1248a86462L2186D11570d10161A95679m6144b05797
$$ plain form
19469 90568 -249029 -221473 136150 -81621 210112 74470 -97152 -66529 -131148 -166411 124586
19457 -362108 -316632 -239786 -64644 -97752 -72313 -84144 -253342 -89794 260632 -162477 224649
19445 -230916 -39735 -364004 -427486 -332464 -34330 -239044 -91530 119793 -9762 87940 84876
19434 84876 -134443 66443 -50528 257829 60303 -77913 -150805 -303516 -177781 64138 -111961
19422 -255659 -13664 39506 -159776 -199329 128434 69023 -122275 -241901 166716 -120526
19411 57839 -227225 46838 23640 -327442 182023 -134959 -163279 -198061 -64088 97643 -334197
19399 -184961 -16185 -57748 -90083 206465 46126 55586 -156507 -21390 16253 -54760 -60826
19388 -60826 -35395 -68705 -89541 2926 -189255 430 -144305 188286 -25743 103569 -67321
$$ packed form
19469I0568b49029K7556A36150h1621B10112G4470i7152L0623o4619l5263A24586
19457c62108M5476P6846f4644l3108K5439j1831j69198h9794B60632a62477B24649
19445b30916c9735l24269o3482R5022c4330k04714i1530A19793i762H7940l064
19434H4876a34443F6443e0528B57829F0303g7913p2892j52711J25735F4138a11961
19422b55659a3664C9506a59776l9553A28434n9411a22275j19626A66716a20526
19411E7839b27225D6838k3198c27442A82023a34959k8320l4782f4088I7643c34197
19399a84961a6185m1563l2335B06465D6126R460a56507b1390A6253e4760o066
19388f0826K5431l3310k0836B926a89255D30a44305A88286b5743A03569f7321
$$ plain form
19376 28433 -338686 25604 -286903 -34161 -91293 -191780 100271 -104658 -63108 143045
19365 37087 -221543 -323523 -121971 -85400 141436 -66367 -228793 186399 -129976 -274542
19355 -274542 -333313 -266866 39985 -101121 -50748 -204519 -43241 269888 54724 -32727 19060
19343 60074 -237588 47483 -3497 -313140 -20235 -52790 -20362 23921 28780 89232 -216183
19331 49747 -198316 -239746 127283 -37233 -374992 -177914 -360299 -7535 -25896 -192063 -5926
19319 -294213 -472577 -58553 95118 -31394 -22778 194189 -327828 -173913 17441 -159235 -93639
19308 -93639 -460938 -269000 241059 93192 -86641 46335 -92399 -64757 38938 68734 -167381
19296 102416 -33465 -211193 -18484 53962 -34095 -322584 -112504 -96613 -137232 -130865 171107
$$ packed form
19376B8433c38686B5604b86903c4161n7132j00487A00271a04658M1550A43045
19365C7087b21543j01980a21971L6571A41436f6367j62426A86399a29976j44566
19355b74542n8771O6447C9985a01121N0373j53771d3241B69888E4724c2727A9060
19343F0074b37588D7483c497l09643b0235l2555b0362B3921M859O0452b16183
19331D9747a98316m1430A27283c7233l37759a77914j82385g535j8361j66167e926
19319b94213j78364e8553I5118c1394Q616A94189c27828J53915A7441a59235O5596
19308i3639l67299J91938B41059I3192h6641D6335i2399K7642C8938K9796a67381
19296A02416c3465j77728a8484E3962c4095k88489a12504J5891m0619O367A71107
$$ plain form
19284 7114 51085 89271 -44751 -266050 104541 -408998 -181821 -175367 -164172 -22788 -80554
19273 -80554 -113000 348861 -183787 -192686 -100879 155754 -107085 -268379 206474 -165024
19262 -66173 -327865 -174095 53864 128074 18214 -356762 -49691 -181538 -148853 -109232 -166263
19251 -166263 37696 300627 -243840 33456 -50583 283670 -55713 -319426 -38143 5979 -47208
19239 -26780 125430 11156 95972 350397 35439 -260279 137039 -157434 -41702 110523
19228 -50015 150518 -202329 -146926 57349 23383 40645 -290924 -312640 -328062 -13290 -20636
19217 -20636 89882 -293009 -9979 44268 -148076 -284526 31718 -195274 -103360 103689 38893
19205 -62396 -226425 -201478 -176159 -46098 39338 -248043 -433186 -232199 -27535 412120 -17534
$$ packed form
19284G114M3971L8186d4751k21299A04541d08998a81821O454J1195b2788n7766
19273h0554l2446C48861a83787q899R1807A55754a07085j61294B06474a65024
19262f6173k61692J53770E3864P4210A8214c56762d9691j31847L2685L9621n7031
19251a66263C7696K62931b43840C3456e0583B83670e5713k63713c8143E979d7208
19239b6780A25430A1156Q4816K54425C5439b60279A37039a57434d1702A10523
19228e0015A50518b02329N5403E7349B3383J7262b90924k1716j5422a3290p346
19217b0636H9882b93009i979D4268a48076j36450C1718a95274R1914A03689C8893
19205f2396j64029K4947K5319d6098C9338b48043j85143K00987b7535D12120a7534
$$ plain form
19193 -338502 -95360 -222805 100654 150628 -108618 -101741 39333 -54504 -245009 -188344 -113520
19182 -113520 -114629 -418016 -239093 -284416 -163474 9248 -215211 -240670 55316 -153328 -95317
19171 -95317 2426 105514 -319628 -58842 -116259 -39420 -3452 -246354 13187 -119461 20630
19159 -1442 -161164 31973 -87256 -357114 28734 -456540 -65683 -298309 -2573 50238 67762
19148 67762 147565 94506 -166736 -68914 -105268 -74303 -181081 -73738 -445108 -58195 -53328
19137 -53328 -153415 3846 78614 -9293 233457 -123344 44957 -393722 -205301 -177819 -258614
19126 -258614 -113286 -79996 110442 -9349 -109817 94785 -146819 170800 -132987 -389475
19116 -389475 -30306 -204275 -15930 -42605 16130 127039 16581 -114910 -266 16706 179245
$$ packed form
19193c38502i5360j27445A00654M9974a08618O877C9333e4504j90505N6665P4824
19182a13520j109l03387J78923m5323J20942I248b15211k5459E5316a53328N8011
19171i5317B426J03088c19628e8842n7417c9420c452k42902A3187a19461B0630
19159a442j59722C1973h7256k69858B8734d56540f5683k32626b573E0238J7524
19148F7762P9803n3059a66736f8914l6354L0965j06778g3738l71370e8195M867
19137e3328j00087C846P4768i293B33457a23344D4957c93722J88421K7482q0795
19126b58614a13286L3290A10442i349j00468I4785a46819A70800a32987k56488
19116c89475c0306j73969a5930k6675A6130J10909A6581a14910b66A6706J62539
$$ plain form
19105 179245 -53826 -172775 -49482 138165 -225415 64513 219876 -200971 64665 149977
19095 149977 100620 -293295 -104413 -61832 27130 -346634 67143 239189 82941 -244618
19084 288358 -116492 153064 -316680 181827 161525 118622 -174708 -75902 71715 118511
19074 118511 2091 -25518 189184 63814 215363 670 83743 -31909 -76942 -189687 -12521
19062 -205279 -209131 -188996 -20165 -149755 -132464 -12011 -281079 280810 -123231 -117950 -596285
19051 -596285 -179290 36882 397389 160393 -458276 -272248 -54753 -104331 -172957 -215121
19041 -215121 -190443 -168178 76911 38350 85632 -252912 51940 44709 -12404 -390258 -204171
19030 -204171 49334 67994 93052 92114 253224 -94470 190122 106415 144025 -74447 -263027
$$ packed form
19105A79245e3826j18949d9482A38165b25415F4513J55363b00971F4665Q5312
19095A49977m9357b93295a04413M2581B7130c46634F7143J72046H2941b44618
19084B88358a16492A53064c16680A81827k0302m2903a74708g5902G1715M6796
19074A18511B091b5518A89184F3814J51549F70Q3073c1909m5033j12745a2521
19062b05279l852K0135b0165j29590J7291a2011k69068B80810a23231N281m78335
19051e96285a79290C6882L60507A60393d58276J86028e4753m9578o8626m2164
19041b15121K4678K2265G6911C8350M7282b52912E1940p231a2404l77854J86087
19030b04171D9334J8660K5058r38J61110i4470A90122q3707L7610g4447j88580
$$ plain form
19019 -263027 145430 117391 -25339 -135118 69636 -272300 343479 175858 11778 -6074 -104879
19008 -104879 67260 111691 69468 83840 -199851 -258043 -145925 -375098 166068 -189387
18997 17824 70789 -24887 -104360 -179997 -165566 210666 139601 -182050 -88174 346203 -13644
18985 -8287 163974 -213141 -276181 66253 32747 253545 -77131 90252 -100740 -154945 124258
18973 -20192 -73605 -118624 157120 93100 2848 167209 -199536 -134260 -185161 -86052 -285082
18962 -285082 -11804 -128613 -18646 -365415 198063 -36707 -20516 -109971 -199247 2795 -287057
18950 -44242 73069 466354 -175370 40785 -66753 75148 -118179 -435172 90638 -114165 -170299
18939 -170299 96068 -305777 105148 -427872 62566 -335230 24056 -17353 -153068 -189704
$$ packed form
19019b63027A45430k8039b5339j09779F9636b72300C43479j67621A1778f074r8805
19008a04879F7260M4431m2223J4372a99851n8192J12118k29173A66068a89387
18997A7824N2965b4887p9473p5637J4431B10666p1065a82050h8174C46203a3644
18985h287A63974b13141o3040F6253C2747K20798g7131I0252a00740n4205A24258
18973b0192n3413m5019A57120o4020B848J64361a99536O5276n0901h6052j99030
18962b85082a1804j16809a8646l46769A98063c6707J6191q9455q9276B795b87057
18950d4242G3069L93285a75370D0785f6753G5148a18179l16993I0638a14165n6134
18939a70299I6068c05777A05148d27872F2566c35230B4056a7353j35715l6636
$$ plain form
18929 -189704 -181988 -38180 -339240 -83803 -66433 -48551 -144146 71124 98721 -5944 -455257
18918 -455257 -1119 -140110 269778 -316979 -36218 -80788 -33167 75879 -267776 351036 -150735
18906 63877 238987 239058 62646 -246735 -222365 -200747 -22244 -513655 -315533 -232258 -105822
18894 130226 -119282 19922 -275451 278861 -205081 -65625 -43939 -123292 32805 1924 -315193
18882 18695 -56230 36272 164055 -102513 -242407 74388 199321 142526 162254 301021 -171096
18870 -10664 257982 -235502 -343507 -348731 -58534 -151834 209809 -125828 67986 -81096 174525
18858 62590 -167845 -60156 -462509 -48755 -12149 -9097 179186 -22731 -190333 199689 277902
18847 277902 397207 239611 -3564 -81428 71896 -10716 45336 -55900 52838 -92799 131955
$$ packed form
18929a89704P716c8180l01060h3803J7370J7882r5595G1124K7597e944m49313
18918d55257a119j38991B69778c16979c6218m4570c3167G5879b67776C51036a50735
18906F3877J75110P1F2646b46735K4370K1618b2244m91411J98122Q3275a05822
18894A30226a19282A9922b75451B78861b05081f5625K1686p9353C2805A924c15193
18882A8695e6230C6272J27783a02513j39894G4388J24933n6795J9728J38767a71096
18870a0664B57982b35502j08005n224e8534r3300B09809a25828F7986h1096A74525
18858F2590a67845f0156m02353d8755a2149L052A79186b2731j67602A99689P8213
18847B77902J19305j57596c564p7864G1896a0716D5336e5900E2838i2799A31955
$$ plain form
18835 67827 -5761 -86202 -55157 511688 311294 162337 41697 -177133 -101663 -38804 -9419
18823 9043 170279 267868 174155 -373607 -57415 114977 -175193 212973 132463 -94379 -56504
18812 -56504 -224919 274456 -25463 18973 -285452 -141434 -50432 72461 144824 -355606 -196417
18801 -196417 -195214 -26089 15882 101936 -241131 -19843 -176042 189015 -161116 -90404 -83679
18790 -83679 -267629 -138798 109582 -127388 -68052 48197 135761 -240717 296824 -283284
18779 26466 -59536 276858 30591 -35971 -245848 33661 135243 91929 -140244 -546205 -217954
18767 -56214 -131511 3897 95265 -324513 -128142 -59860 24300 215579 -329119 56184 204466
18756 204466 -145057 177058 225599 37742 -146974 -172233 -122363 185391 -159472 165537
$$ packed form
18835F7827e761q0441L1045E11688k00394j48957D1697a77133P5470c8804i419
18823I043J61236R7589r3713c73607e7415A14977a75193B12973q0510i4379L7875
18812e6504j68415B74456b5463A8973b85452a41434e0432G2461P2363c55606J59189
18801a96417J203b6089A5882Q6054b41131a9843j56199A89015a61116P0712O725
18790h3679j83950J28831A09582a27388N9336D8197Q7564b40717B96824b83284
18779B6466e9536B76858C0591c5971k09877C3661J01582m3314a40244m05961b17954
18767e6214p5297C897R1368c24513a28142e9860B4300J91279c29119E6184J48282
18756B04466a45057A77058M8541C7742a46974k5259M9870A85391a59472A65537
$$ plain form
18745 -68849 -201568 -333880 11632 -106731 -31716 106051 -106453 -127155 294391 -142182
18734 -256196 -17949 218753 9491 -284175 -194442 193992 121701 12460 170469 -181866 -64675
18722 -147351 -330458 -242352 -15863 -235863 -404263 -3290 39782 -6620 124779 -331453 -280120
18711 -280120 112068 -155991 -101073 -127451 117026 -333716 28071 -78334 -28598 -55667 -156132
18700 -156132 -281464 -127603 -151598 105419 -310128 -110597 -195126 -14281 87736 158185
18690 158185 -100227 43957 238878 -63460 -152987 -111260 -356231 -397356 -124999 160491
18679 -153784 171747 248937 82209 123050 -354244 -254380 -50216 -92966 144087 -194000 103640
18667 154685 -118320 45950 -65190 -179603 197512 -104940 90605 -63649 -21909 -114329 120523
$$ packed form
18745f8849j32719j32312A1632a06731c1716A06051a06453k0702B94391a42182
18734b56196a7949B18753I491b84175Q9733A93992p2291A2460J58009a81866f4675
18722a47351j83107Q8106a5863k20000j68400c290C9782f620A24779c31453N1333
18711b80120A12068a55991N4918k6378A17026c33716B8071g8334b8598k7069j00465
18700a56132j25332a27603k3995A05419c10128a10597q4529a4281H7736P0449
18690A58185a00227D3957J94921f3460q9527M1727k44971m1125a24999A60491
18679a53784A71747P7190H2209M0841c54244R9864e0216m2750A44087a94000A03640
18667A54685a18320D5950f5190j14413A97512a04940I0605f3649b1909r2420A20523
$$ plain form
18655 -38405 20280 -178952 69302 219023 -377188 277401 9861 -139042 -245514 -192873 -115583
18644 -115583 -115953 20409 -47737 -66241 -292432 -192420 -280855 -70035 53459 162365 -118568
18632 15112 -268362 -57060 -369543 -120771 -145511 -163775 27748 -230473 -153292 165153 -40220
18620 18863 -33526 210628 -403314 -366113 44661 -463593 12249 -344783 43268 20347 -12831
18608 192969 -123981 -224545 -167236 -157852 -120815 75392 -115688 -82479 144882 -129008 300577
18596 3564 180718 -328313 -13274 -142119 -110074 -161922 -23780 118806 -446443 -123004 -164120
18585 -164120 67934 314904 229418 28118 -85221 16369 -68474 -185028 -331181 -188200 -336920
18574 -336920 133925 -267294 -107177 -195440 -161736 158050 16945 -150886 91874 -109124
$$ packed form
18655c8405B0280a78952F9302J49721c77188B77401I861a39042j06472N2641P7290
18644a15583l70B0409d7737j8504k26191J00012q8435g0035E3459J08906a18568
18632A5112b68362e7060l12483a20771k4740j8264B7748b30473P7181A65153d0220
18620A8863c3526B10628d03314L7201D4661d63593A2249c44783D3268B0347a2831
18608A92969a23981j00564N7309R384L7037G5392a15688L3209A44882a29008C00577
18596C564J77154c28313a3274j28845L2045n1848b3780A18806d46443a23004m1116
18585a64120F7934K46970q5486B8118h5221A6369f8474j16554j46153J42981j48720
18574c36920A33925b67294a07177q8263L3704A58050A6945a50886I1874a09124
$$ plain form
18563 -227846 12613 86878 -174400 -108253 -338005 -368695 -260613 -297322 229681 -295554
18552 73786 -104618 40320 97804 -242822 22951 103197 -36094 -26621 28804 -72638 159614
18540 -88695 27527 -101534 -192677 -181990 167451 237094 162887 -183236 153374 -239214 -116639
18528 -206976 91599 -86655 -265833 -341894 167609 159503 -497989 68854 -446 -96507 -17911
18516 -175386 92508 57195 -148510 137430 6488 -352065 178809 -244528 -262205 21462 75491
18505 75491 67734 -165105 -135166 -74579 -330146 227286 294415 -220690 -400199 -157761 -85644
18494 -85644 151233 -32131 -360016 221450 -300743 -1207 -52620 -210941 43388 190155 -15775
18482 90845 226011 -57639 -243657 -40706 -211484 -36920 -194827 68017 110886 -198073 32014
$$ packed form
18563b27846A2613P4265a74400O6147k29752l0690J08082l6709B29681b95554
18552G3786a04618D0320N7484b42822B2951Q0246c6094R473B8804g2638A59614
18540h8695B7527a01534r1143J0687A67451O9643p4207a83236A53374b39214a16639
18528b06976I1599h6655j79178p6061A67609q106d97989F8854d46r6061a7911
18516a75386I2508l5313a48510A37430F488c52065A78809b44528j7677B1462N4029
18505G5491p757a65105K9939O0587k55567B27286O7129b20690j79509a57761P2117
18494h5644A51233c2131l27885B21450c00743a207n1413j58321D3388J46767a5775
18482I0845J35166e7639j86018d0706j70778c6920j57907F8017M2869a98073C2014
$$ plain form
18470 94632 -295869 88549 -343331 -3054 269384 -130400 -283443 -15973 -117305 -15578 -214491
18459 -214491 -219842 21850 -365029 109124 111014 49251 -29346 130434 259264 -66755 -14289
18447 -48700 200674 -61283 191289 218556 49815 -480212 -9383 -84835 211613 -152322 60432
18435 241362 20597 -178267 -6150 57827 -117358 -184922 50788 -252420 -73707 147243 -191897
18423 43625 -84576 49014 -414013 -68945 237254 162185 132908 167576 9234 -59211 -352368
18412 -352368 -467855 76314 158808 -161570 176706 95362 16326 -70481 206057 140924 -56955
18400 -274987 -219861 20250 89643 40033 54837 26582 -176097 -13822 13350 -80418 143519
18388 100528 -9188 -204641 -233804 -31556 26079 -10516 -357215 -99229 -18423 383513 -116330
$$ packed form
18470I4632b95869H8549c43331c054B69384a30400j53043a5973j01332a5578j98913
18459b14491n351B1850c65029A09124J890D9251b9346A30434J28830f6755a4289
18447d8700B00674f1283A91289K7267D9815d80212i383p5452B11613a52322F0432
18435B41362B0597a78267f150E7827a17358o7564E0788b52420g3707A47243a91897
18423D3625h4576D9014d14013f8945B37254p5069k9277L4668I234e9211k93157
18412c52368j15487G6314Q2494a61570A76706q1344A6326g0481B06057o5133e6955
18400b74987N5126B0250O9393D0033J4804B6582a76097a3822A3350h0418A43519
18388A00528i188j95453k9163c1556B6079a0516l46699i9229a8423C83513a16330
$$ plain form
18376 71744 -134045 -244920 72996 119438 140686 14191 -363919 -136456 -56755 43583 -175928
18364 191681 -194710 -61701 14284 9228 -217716 1485 255286 532817 -29322 143204 -64200
18352 51930 -6368 73719 -178250 -402081 -133553 -8004 52445 103777 -213620 -193279 -260925
18341 -260925 -368890 -272072 343722 -94199 123287 -286455 4351 -114193 -241712 -96543
18330 174449 -11398 -108664 -196566 -202749 -203583 -281310 94473 -59090 -267581 -268364 -312773 -66218
18317 -292840 81662 224571 96821 -221652 -54634 -286421 -7100 124264 -20824 214280 -287568
18305 412592 -133714 171788 241875 118679 -174416 -432981 -708 324472 251301 -198280
18294 -361547 -47955 -244122 -20587 -246383 94810 126763 -18591 -31114 137130 -272226 -311595
$$ packed form
18376G1744a34045j10875G2996M6442K1248A4191c63919a36456e6755D3583a75928
18364A91681a94710f1701A4284n056b17716A485K53801K77531b9322A43204f4200
18352E1930f368G3719a78250k23831a33553h004E2445N1332b13620K0341o7646
18341b60925j07965R6818C43722i4199A23287b86455D351a14193j27519i6543
18330A74449a1398r7266q7902o183q34p7727I4473e9090k08491p83m4409f6218
18317b92840H1662J42909I6821b21652e4634k31787g100A24264b0824B14280b87568
18305D12592a33714A71788P0087A18679a74416k58565g08C24472p3171a98280
18294c61547d7955j96167b0587k25796I4810L1953a8591j2523A37130b72226l9369
$$ plain form
18283 -311595 -54389 -122411 -155865 139190 27146 -20767 -187180 169852 -71951 12124 -104007
18271 -252467 -140408 47451 -256480 1363 120631 118033 149710 -154665 7017 124324 48160
18259 293622 147331 -216999 234344 -19935 -8955 99879 223243 -13667 -63714 -313414 -119737
18247 59717 -66723 96573 -9292 -79654 -9817 209325 232681 217298 74857 203025 286351 -4170
18234 -43325 -81680 353737 -7614 152833 -221606 -453577 -274407 -190373 -72897 -232502 51524
18222 -61447 -257174 -17769 -144691 -4834 -139603 -38671 -126032 -193416 -59740 85629 -467629
18210 -117552 219903 -141275 -97979 137199 -195263 -325893 -202310 -236331 -50800 -186453
18200 -186453 -6902 -103284 -247374 -117827 63677 -99877 -423764 161656 -3254 16927 -25939
$$ packed form
18283c11595e4389o8022l3454A39190B7146b0767j66413A69852g1951A2124a04007
18271b52467J12059D7451b56480A363J19268k598L1677a54665G017J17307D8160
18259B93622j46291b16999B34344a9935h955I9879J23364a3667n0047k49700a19737
18247E9717f6723I6573i292p0362i817B09325K3356j5383G4857J28168Q3326d170
18234d3325l8355C53737g614A52833b21606k31971J79170Q4034g2897j59605E1524
18222f1447j95727a7769j26922d834j34769c8671q7361o7384e9740H5629d67629
18210a17552B19903a41275M3296A37199a95263j30630J23583l4021e0800j35653
18200a86453f902r6382j44090a17827F3677i9877l23887A61656c254A6927b5939
$$ plain form
18188 -143639 -145503 -210301 -227206 116108 -243552 -156340 193322 49978 -185581 17956 68724
18177 68724 21703 -54245 88612 -106201 248335 -221040 -261982 -7223 174735 -7903 -369267
18166 -369267 5886 -4658 -164729 -65093 -313761 140017 -254909 -31616 -45862 -157722 -282112
18155 -282112 -108214 -304155 -141495 7111 19739 90906 15264 -129869 -77362 -172245 -140871
18144 -140871 -42548 -95154 -80193 -311562 209837 194800 -26406 -201738 -47383 63357 -26140
18132 -302841 25708 -65753 -193161 -172069 67039 201862 -70632 -124451 -214083 -234174 282657
18120 -184498 -139371 -131003 33714 -283779 -15013 231415 -1950 -263812 -43102 172851 -91042
18108 -336030 69965 -101287 133873 -15259 -163508 -18927 -4735 -320485 97850 129780 158929
$$ packed form
18188a43639j864o4798j6905A16108b43552Q7212A93322D9978a85581A7956N0768
18177F8724B1703e4245H8612a06201B48335b21040m0942g223A74735g903l61364
18166c69267E886d658j60071f5093k48668A40017b54909c1616j4246j11860j24390
18155b82112a08214j95941a41495G111J2628P1167A5264a29869N2507r4883L1374
18144a40871d2548n2606J4961k31369B09837j5037b6406j75332d7383F3357b6140
18132c02841B5708f5753j27408K1092F7039J34823g0632n3819q9632k0091B82657
18120a84498M5127Q368C3714b83779a5013B31415a950k61862d3102A72851i1042
18108c36030F9965a01287A33873a5259j48249a8927d735l15750I7850L1930K9149
$$ plain form
18097 158929 79857 -156519 11439 57709 -38355 3677 2801 -462515 27589 266949 -49511
18085 68460 66409 -31846 -209944 2368 386666 -315439 -1354 -35471 471110 -151198 14669
18073 -39105 -173321 234829 284244 -85495 17528 -324241 242896 -307916 57082 233200
18063 233200 -93263 20437 50803 176792 -141195 -115399 -48564 -2268 -220201 -126895 -456166
18052 -456166 252496 63844 224518 -69778 111437 14142 -182521 -32840 132725 124837 -14984
18040 172643 136049 -278735 188323 -208171 -25713 -66833 -144799 -420917 -357401 -217491
18030 -217491 -122026 28757 -119803 70298 35697 233077 125137 -16994 -209306 -140233 399940
18018 -261625 171153 79328 230983 -115460 -106740 -196977 305511 13073 -214160 39902 -303412
$$ packed form
18097A58929p9072a56519A1439M6270c8355C677q76d62515B7589K39360d9511
18085F8460k051c1846j78098B368L84298c15439a354l4117D71110a51198A4669
18073c9105j34216B34829M9415h5495A7528c24241B42896c07916E7082J76118
18063B33200i3263B0437L0366J25989a41195K5796d8564b268k17933R3306l29271
18052d56166B52496F3844J60674f9778A11437A4142a82521c2840A32725p888a4984
18040A72643l6594b78735A88323b08171b5713m1120p7966k76118O3516J39910
18030b17491R5465B8757a19803G0298l4601J97380j07940a6994j92312O9073C99940
18018b61625A71153G9328J51655a15460Q720r0237C05511A3073b14160C9902c03412
$$ plain form
18006 -264466 -116547 -57474 -64436 307257 -64986 -32062 -20223 -367530 -160316 -478518 -263715
17995 -263715 -178348 137437 -160405 -351120 99007 191895 -115822 261727 488897 -291209
17984 -382936 -334391 23384 -86014 -63188 -78546 60338 -223634 146152 -103740 -66199 -55590
17973 -55590 -352420 29656 353247 55656 248049 205921 -144200 -181248 240873 -182603
17962 66376 -49825 -120441 -246630 -101758 279171 -34293 -38973 113977 -60485 35786 58492
17951 58492 -239943 165944 -71372 -336729 -12892 -201227 -191088 5767 262454 -61399 76277
17939 9627 -144174 170101 40896 -14223 -274095 -455183 -310800 87296 -62733 -289950 -230683
17928 -230683 -192515 120634 -14859 -74886 -118430 -179258 -14703 -270757 156260 -63976 -54105
$$ packed form
18006b64466a16547e7474o962C07257f4986c2062J1839l47307a60316l18202K14803
17995b63715Q5367A37437a60405j90715I9007R2888a15822B61727K27170b91209
17984c82936M8545B3384h6014K2826j5358F0338b23634A46152a03740L7541J0609
17973e5590k96830B9656L23591E5656J92393m2128a44200l7048B40873a82603
17962F6376d9825p0616j26189a01758B79171c4293m680A13977f0485C5786K2706
17951E8492b39943A65944g1372k65357a2892j88335J0139E767K56687f1399G6277
17939I627a44174A70101D0896a4223k59872j81088J44383H7296f2733k27217N9267
17928b30683L8168A20634a4859o0027m3544o0828a4703k56054A56260f3976R871
$$ plain form
17917 -54105 -255207 170502 -213080 -236436 -22396 206903 117422 -150437 9838 53498 -175371
17905 231955 -193806 -43004 -36093 -23903 126341 20288 132268 -38495 -130069 -85573 -53720
17894 -53720 140400 -51815 -132609 -18667 153752 13360 366136 164011 -226738 138227
17883 -253692 -140949 158653 87979 -114165 -57303 190700 52849 -73705 52820 -112997
17872 -179218 -83961 10941 -35097 34584 -208191 1729 149951 -16282 133054 -169669 35529
17860 52411 -61493 -31005 -363196 163623 -292648 223021 -163828 -85704 -205054 -1469 -294233
17849 -294233 -17026 -87888 -90431 20120 63781 3985 222265 233365 105521 121517 -170107
17837 -398327 355184 -202294 -94609 -51871 -146771 290518 -198931 233388 47318 -61696
$$ packed form
17917e4105k01102A70502b13080k3356b2396B06903q9481a50437I838M3660a75371
17905B31955a93806d3004O911J2190A26341B0288J11980c8495r1574M4496L1853
17894e3720A40400e1815q0794a8667A53752A3360L52776A64011b26738A38227
17883b53692J12743A58653p0674a14165N6862A90700E2849g3705E2820a12997
17872a79218h3961A0941c5097C4584b08191A729J48222a6282A33054a69669C5529
17860E2411f1493L0488l32191A63623b92648B23021a63828P8124j19350a469k92764
17849b94233a7026p0862k543B0120M3661C985K18280J1100A05521J5996a70107
17837c98327C55184b02294i4609M2738r4900B90518a98931B33388D7318f1696
$$ plain form
17826 41908 25522 30368 241295 114973 28238 -271399 -283655 163219 55303 -28545 -97060
17815 -97060 133078 -73105 371742 61408 48656 -49285 -199917 -387638 184942 -121886
17804 -59041 -95400 61721 72574 187177 -88817 -69124 -60103 -152000 -96172 -145388 -125362 -192248
17792 -192248 -53936 -162881 92683 -92387 -35916 -6650 -119335 102108 117598 93640 14751
17780 220731 -170887 197970 -83341 -147555 -67280 127487 -53944 -74817 -201545 -160173 -186529
17769 -186529 -116771 -273787 -133681 234378 -133884 63561 199110 87960 126201 5678 -23765
17757 -3680 145073 60129 141851 59198 94926 -141193 554134 275101 -330768 -195517 61303
17745 -116985 132820 77350 -38181 122178 -222024 -17036 336281 88767 -77570 -314621
$$ packed form
17826D1908j6386M846K10927A14973B8238b71399j2256A63219E5303b8545o8515
17815i7060A33078g3105C71742F1408j2752d9285j50632j87721A84942a21886
17804e9041l6359F1721J0853J14603h8817J9693R021r1897N5828m9216K0026o6886
17792a92248e3936j08945I2683i2387c5916f650j12685A02108J5490k3958A4751
17780B20731a70887A97970h3341o4214f7280A27487e3944k0873j26728M1372k6356
17769a86529O9758j57016a33681B34378a33884F3561J35549H7960L8241E678b3765
17757c680A45073F0129Q1722E9198L5728a41193E54134B75101c30768J35251F1303
17745a16985A32820n5470c8181A22178b22024a7036C36281H8767g7570k37051
$$ plain form
17735 -314621 -367881 75790 182509 16993 120204 -152204 -84346 245728 95338 202835
17725 202835 -518003 -202551 -173054 11622 -144211 -121297 -83122 -151989 -53805 -194809 -6768
17713 75719 185835 144915 -437705 207201 -289114 -214344 -76277 38168 -100805 -244176
17703 -244176 776 -64267 142220 7573 115529 -9217 70506 79613 -141672 -193883 15740 200833
17691 200833 64624 -29155 46836 211038 -93604 105606 -218582 27784 -190425 191834
17680 -18612 -45241 -17332 271261 -9761 -161281 -5955 108168 123540 -15700 152667 370197
17669 370197 3126 28934 175088 45432 298325 -158495 71063 -52327 -173048 112548 216088
17658 216088 303323 -213686 -8390 -9768 421666 -130279 -41236 -109513 -38037 55210 146846
$$ packed form
17735c14621n3260G5790J06719A6993J03211a52204O7858B45728I5338J07497
17725B02835e18003b02551K9497A1622a44211K2914L8175o8867e3805j41004f768
17713G5719J10116m0920d37705B07201b89114P4770g6277C8168a00805j43371
17703b44176G76f4267A42220G573J07956i217G0506R107a41672n2211A5740J85093
17691B00833F4624b9155D6836J64202i3604A05606b18582B7784a90425A91834
17680a8612k6629a7332B71261i761j51520e955A08168J5372a5700A52667K17530
17669C70197C126K5808J46154D5432K52893a58495G1063e2327j20721A12548J03540
17658B16088Q7235b13686h390j378D21666a30279d1236o8277c8037E5210R1636
$$ plain form
17647 146846 130663 279891 -37870 99500 -149459 98309 -30411 28299 -216802 249531 -40039
17635 169239 116118 96422 232138 -191053 4938 420200 19172 214813 -12563 -311 43265
17623 -75371 -48981 -19845 56147 252365 217056 -234139 158777 101343 -23086 123019 -223745
17611 48607 222113 -257590 -51269 -242961 -112407 -241625 161919 218890 -14196 124261
17600 130111 82003 169660 -14473 -240782 -200651 355329 -20844 126555 99168 -66610 8400
17588 165011 219346 -63416 111569 -72648 114147 133889 -117979 132191 228995 -279126
17577 -287103 199659 125566 216612 290887 66385 42814 -23626 -34845 65574 201672 374466
17566 374466 304896 3729 -250002 175147 383309 -88882 -3556 80285 57463 3363 -274830
$$ packed form
17647A46846j6183J49228c7870I9500a49459I8309c0411B8299b16802B49531d0039
17635A69239n3121j9696J35716a91053D938M15262A9172J95641a2563c11D3265
17623g5371K6390a9845E6147J96218l5309b34139A58777n7434b3086A23019b23745
17611D8607J73506b57590e1269j91692a12407j29218A61919N6971a4196A24261
17600A30111m8108Q7657a4473k26309M0131C55329b0844A26555k7387f6610H400
17588A65011N4335f3416A11569g2648A14147J9742a17979A32191R6804b79126
17577b87103A99659p4093R1046P4275F6385k3571b3626j1219F5574J36098J72794
17566C74466o9570C729b50002A75147K08162h8882c556H0285k2822C363b74830
$$ plain form
17554 -88395 -11317 455538 6087 54888 194626 102490 -73080 88412 11707 167325 -118441
17542 129558 -5896 -105033 -213629 327672 -227485 -42991 -316883 -121662 158575 -85663
17531 -136338 66697 -76409 46264 283676 45607 181239 127008 302481 83305 -169931 130352
17519 34036 -27769 -140796 180112 -52955 267676 -271541 156948 -154225 34504 167293
17509 167293 436145 178828 -65762 36523 23173 134053 75323 -290770 222382 -127583
17498 -231264 222213 -74027 -2549 397495 372098 -257162 416066 -197274 -264192 149772
17487 -319113 -11411 94264 227880 -42202 -37137 -213780 130870 65344 205705 -93954 -66521
17476 -66521 134551 169012 -217830 16847 172369 -18111 313325 164999 42299 -57123 223924
$$ packed form
17554h8395a1317D55538F087M8801J39738r2136g3080H8412A1707J55618a18441
17542A29558e896r9137j08596C27672b27485d2991k73892a21662A58575h5663
17531a36338F6697g6409D6264K37412D5607J35632n4231J75473H3305a69931A30352
17519C4036b7769j13027A80112e2955B67676b71541A56948a54225C4504J32789
17509A67293K68852A78828f5762C6523j3350J10880n8730b90770B22382a27583
17498b31264B22213g4027b549C97495k5397b57162D16066a97274o6918A49772
17487c19113a1411I4264J33616d2202N065j76643A30870F5344J40361i3954K7433
17476f6521A34551L4461b17830A6847J55522a8111C13325j48326D2299e7123B23924
$$ plain form
17464 -156208 144903 233129 39824 21295 302148 242015 257524 244853 76089 246253 -36634
17452 299351 125147 70749 116312 497055 -57997 -93847 463163 425836 191549 204611 368994
17441 368994 361413 142080 280167 165583 486424 323904 76309 205537 219789 -151266
17430 -47569 36017 347020 293501 264870 163038 205031 504864 196874 290266 390517 256597
17419 256597 4627 58343 18053 10153 519712 498431 426188 101029 284734 74712 -168930
17407 173122 350761 139199 160187 -5139 -229289 -17865 364981 158160 57191 29175 368791
17396 368791 303931 32454 -45184 152664 183526 120359 227460 125729 103193 130674 16538
17384 442787 265364 92809 -113375 -166360 -98422 -74657 39589 36912 -235811 -156574 -32138
$$ packed form
17464a56208A44903Q8226C9824j8529K80853o0133J5509j2671G6089J70164c6634
17452B99351A25147n4398M5563L80743e7997l5850D63163l7327A91549J3062J64383
17441C68994p581A42080J38087j14584L20841j62520G6309J29228J4252a51266
17430d7569C6017L11003n3519k8631j01832M1993K99833A96874R3392J00251j33920
17419B56597D627N3716A8053p900N09559k1281p2243A01029J83705G4712a68930
17407A73122J77639A39199K0988e139k24150a7865C64981A58160E7191k8016L39616
17396C68791o4860C2454d5184A52664L0862o3167J07101j01731k2536K7481A6538
17384D42787j77423I2809a13375n2985O7938K3765C9589k677b35811P9237c2138
$$ plain form
17372 175652 156723 169547 -113327 -4573 -11251 115868 180328 383258 206084 94398 -81046
17360 299620 78513 247271 -23954 321196 175643 77770 270251 149095 -136048 123661
17349 -92248 58368 224213 118932 362123 6726 187916 35511 178077 49562 64218 383771
17338 383771 124124 -318787 1412 310942 244665 166233 -195021 -15454 332502 136793
17327 15005 139716 -77166 123475 -289146 -78418 50354 102511 -35956 -61498 84466 -86758
17315 -41046 19728 368447 27628 160442 262604 -47713 251734 -51005 207423 238655 119078
17303 227551 25034 115938 225794 72243 360423 209059 -86935 319782 268352 283591 255773
17292 255773 152211 -1821 240053 336653 226387 206600 211399 281874 -120890 -26022 144926
$$ packed form
17372A75652j8929J2824a13327d573o678A15868O4460K02930j77174I4398h1046
17360B99620G8513J68758b3954C21196j45553G7770J92481j21156a36048A23661
17349i2248E8368J65845j05281K43191F726J81190C5511J42566D9562J4656L19553
17338C83771A24124c18787A412L09530o6277p8432a95021a5454C32502A36793
17327A5005J24711g7166A23475b89146g8418E0354N2157c5956k5542H4466h6758
17315d1046A9728L48719B7628J32814J02162d7713B51734e1005B07423L1232A19078
17303B27551B5034R0904J09856G2243K88180j51364h6935C19782n1430J5239k7818
17292B55773j03562a821B40053R6600j10266j9787M799P0475a20890b6022A44926
$$ plain form
17280 257961 85651 122193 -71737 463861 -46378 112649 218915 190350 -15278 389293 175430
17268 59714 143700 160017 270790 207376 421876 99404 184910 89592 530413 28120 478949
17257 478949 77831 25560 -42646 113247 366335 324515 446606 65945 163795 140400 -48318
17245 261247 -109115 208266 96656 73086 304780 383129 81819 186502 96913 372072
17235 372072 286685 364420 168886 252335 328842 205128 150433 59169 6462 23325 467761
17224 467761 -134328 -283424 197201 133809 35600 159445 155309 53460 415882 289219
17214 289219 221405 346463 163977 509103 543089 373390 8305 325750 220035 219188 207740
17203 207740 166782 -65054 236195 169725 440304 249817 112464 268347 749182 341188
$$ packed form
17280B57961H5651L6542g1737D63861d6378A12649J06266k8565a5278C89293A75430
17268E9714Q3986J6317J10773o3414K14500I9404Q5506H9592M40821B8120M50829
17257D78949G7831B5560d2646A13247K53088m1820J22091F5945R7850k3395d8318
17245B61247a09115B08266I6656k3570K31694P8349H1819J04683q9589K75159
17235C72072q5387P7735A68886Q3449P6507j23714n4695E9169F462J6863M44436
17224D67761a34328j49096A97201o3392C5600J23845m136E3460L62422j26663
17214B89219o7814J25058A63977L45126L3986j69699H305L17445j05715q47j1448
17203B07740m0958f5054B36195o6470K70579j90487A12464J55883M80835C41188
$$ plain form
17192 169061 143124 49280 111923 372136 305054 291138 152038 181228 261593 227378 126888
17181 126888 367806 182152 115835 565366 545302 -20069 181946 553904 310205 173847
17171 173847 212795 102405 267671 534147 304365 161572 340404 279584 543621 196526
17160 -4480 252533 403432 62641 390577 451229 31776 232271 230283 33040 30929 216604
17149 216604 52138 787172 541643 110741 557973 470166 56594 267969 362829 335090
17139 335090 216051 123330 84169 316377 335826 243327 335829 178374 84232 420808 321000
17128 321000 445608 541412 257604 89459 513035 205036 35916 367200 239176 484089
17118 484089 334593 711029 170549 312150 663322 172585 692078 307487 466638 94947
$$ packed form
17192A69061k5937D9280O2643K60213o7082j3916j39100K9190Q0365l4215j00490
17181A26888K40918A82152o6317M49531k0064b0069A81946L71958k43699j36358
17171A73847L8948A02405J65266K66476k29782j42793J78832o0820K64037A96526
17160d480B52533J50899F2641L27936O0652C1776K00495j988C3040k111J85675
17149B16604E2138P35034k45529A10741M47232q7807E6594K11375R4860k7739
17139C35090j19039r2721l9161K32208J9449r2499R2502j57455H4232L36576r9808
17128C21000J24608R5804B57604H9459M23576B05036C5916L31284j28024K44913
17118D84089j49496L76436A70549J41601L51172A72585N19493C07487J59151I4947
$$ plain form
17107 442899 513151 426817 147422 236678 651776 205000 496002 246947 349406 695937
17097 695937 607174 280507 434789 502824 254282 414717 136931 580550 380330 710694
17087 710694 562186 272303 151013 200648 584501 355803 213644 -158419 597619 578962
17077 578962 543960 352193 589121 466747 490343 244361 465574 554937 601357 535694
17067 535694 568548 596617 526046 560624 592208 508968 618406 430495 566704 341160 364483
17056 364483 474397 383573 422365 954148 390246 550962 336300 685552 515448 318351
17046 318351 416519 446451 593043 836333 706632 656622 502907 441176 284599 484014
17036 484014 502091 636738 624899 635423 533031 821014 405901 432942 657015 630138
$$ packed form
17107D42899P0252q6334A47422Q9256M15098B05000K91002B46947J02459L46531
17097F95937q8763B80507J54282O8035k48542J60435A36931M43619k00220L30364
17087G10694j48508B72303j21290M9635L83853k28698j42159a58419E97619j8657
17077E78962l5002j91767K36928j22374K3596B44361K21213Q9363M6420o5663
17067E35694L2854K8069p0571L4578L1584q3240J09438j87911J36209k25544K3323
17056C64483J09914r0824L8792N31783C90246J60716k14662L49252j70104j97097
17046C18351R8168K9932J46592K43290j29701n0010j53715o1731j56577J99415
17036D84014J8077J34647j1839J0524j02392K87983D05901K7041K24073k6877
$$ plain form
17026 630138 464600 579605 484427 444916 750769 177466 608536 936001 633331 499609
17016 499609 538899 735964 494871 701687 446776 662025 458720 589356 809686 623175
17006 623175 936648 704195 876263 760657 876633 458917 566910 751817 571024 919145
16996 919145 888444 1026955 847115 898559 1039884 621036 823866 640663 702324 760660
16986 760660 829369 1080295 602021 978675 814286 864998 764037 1031102 909422 932419
16976 932419 624790 1160368 768940 815298 529753 1122572 625915 1056716 1146787 686087
16966 686087 1052014 963023 974348 1151692 1152803 972476 900966 1101011 702117 1172484
16956 1172484 621655 1052276 936920 926914 1214602 1072556 986134 1135468 1265711 1125859
$$ packed form
17026F30138j65538J15005r5178l9511L05853A77466M31070L27465l02670j33722
17016D99609L9290J97065k41093K06816k54911K15249k03305J30636K20330j86511
17006F23175L13473k32453J72068j15606J15976m17716J07993J84907j80793L48121
16996I19145l0701J38511j79840N1444J41325m18848K02830j83203O1661N8336
16986G60660O8709K50926m78274L76654j64389N0712j00961K67065j21680K2997
16976I32419l07629N35578l91428M6358k85545N92819m96657M30801R0071m60700
16966F86087L65927q8991J1325J77344J111j80327p1510K00045l98894M70367
16956A172484n50829M30621j15356j0006K87688j42046q6422J49334J30243j39852
$$ plain form
16946 1125859 1313967 995107 1344517 1233854 1222198 999696 1194530 1379524 1048722 1193473
16936 1193473 1281125 1165813 1373589 1306237 1260128 1293847 1283837 1317747 1480463 1305033
16926 1305033 1674500 1149268 1171716 1458472 1434379 1444082 1630801 1114417 1382518 1336297
16916 1336297 1245276 1279025 1430169 1888664 1726463 1439838 1494695 1336873 1801689 1685959
16906 1685959 1795683 2012400 1579267 1621340 1799752 1618373 1524655 1943368 1807400 1852631
16896 1852631 1514712 1891383 1970707 2054572 2130659 1769911 2012401 1744990 1906724 1993415
16886 1993415 2139294 2089396 1930299 2000514 2112686 1968384 2304182 2156693 2368341 2463733
16876 2463733 2105959 2470275 2020111 2597097 2543392 2536151 2403124 2469011 2642076 2581518
$$ packed form
16946A125859J88108l18860L49410j10663j1656k22502J94834J84994l30802J44751
16936A193473Q7652j15312K07776o7352m6109L3719j0010L3910J62716j75430
16926A305033L69467n25232K2448K86756k4093R703J86719n16384K68101m6221
16916A336297r1021L3749J51144M58495j62201k86625N4857j57822M64816j15730
16906A685959J09724K16717m33133M2073J78412j81379r3718M18713j35968M5231
16896A852631l37919L76671P9324Q3865P6087l60748K42490k67411J61734Q6691
16886A993415J45879m9898j59097P0215J12172j44302L35798j47489K11648R5392
16876B463733l57774L64316m50164N76986n3705p241j33027O5887J73065o0558
$$ plain form
16866 2581518 2649787 2694128 2802718 2672310 2670053 2480996 2750479 2954822 3012948 2580635
16856 2580635 3086827 2860110 3270100 3210643 3016541 3270737 3356725 3379509 3465103 3334078
16846 3334078 3212101 3517043 3364880 3465401 3488387 3605574 3724159 3793664 3718489 4186836
16836 4186836 3881117 4141193 4137894 4316610 4300588 4352549 4617953 4342738 4238806 4672527
16826 4672527 4573583 5025744 4734703 5296222 5121518 5176443 5409285 5255783 5560485 5579776
16816 5579776 5739890 5528641 5801532 6063544 6064515 6053484 6453736 6945651 6830533 6889775
16806 6889775 7002610 7346922 7343551 7357972 7738527 7712879 7734911 8421650 8525638 8616355
16796 8616355 8498910 8672518 9196581 9592901 9907172 9675157 10040545 10278878 10546647
$$ packed form
16866B581518O8269M4341J08590j30408k257j89057K69483K04343N8126m32313
16856B580635N06192k26717M09990n9457j94102K54196Q5988K2784Q5594j31025
16846C334078j21977L04942j52163J00521K2986J17187J18585O9505p5175M68347
16836D186836l05719K60076l299J78716j6022N1961K65404k75215j03932M33721
16826D672527r8944M52161k91041N61519j74704N4925K32842j53502L04702J9291
16816E579776J60114k11249K72891K62012R71j1031M00252M91915j15118N9242
16806F889775J12835L44312l371J4421L80555k5648K2032O86739J03988R0717
16796H616355j17445J73608N24063L96320L14271k32015L65388K38333K67769
$$ plain form
16787 10546647 10849158 11363860 11412792 11777964 12139097 12207176 12769619 13001764 13548496 13875765
16777 13875765 14361712 15093004 15146068 15340021 16518884 16924444 17502961 17711599 18637037
16768 18637037 19089463 19668536 20280578 21248285 22510227 23067102 23929809 24850767 25627632
16759 25627632 26409046 27718194 28829357 29923215 31369974 32475443 34019828 35430398
16751 35430398 37029364 39142116 40952461 42490504 44694478 47367063 49212709 52023023
16743 52023023 54112703 57034503 60336473 63351463 66455972 70757982 74512332 78608934
16735 78608934 82615950 87327758 92150443 97168757 102273003 107698802 113146194 118766272
16727 118766272 124392203 129978762 135642254 140936322 145842033 150581481 154762323 157907523
$$ packed form
16787A0546647L02511N14702M8932L65172L61133O8079N62443K32145N46732L27269
16777A3875765M85947P31292N3064J93953J178863M05560N78517K08638R25438
16768A8637037M52426N79073O12042R67707J261942N56875Q62707R20958P76865
16759B5627632P81414J309148J111163J093858J446759J105469J544385J410570
16751C5430398J598966K112752J810345J538043K203974K672585J845646K810314
16743E2023023K089680K921800L301970L014990L104509M302010L754350M096602
16735G8608934M007016M711808M822685N018314N104246N425799N447392N620078
16727A18766272N625931N586559N663492N294068M905711M739448M180842L145200
$$ plain form
16719 157907523 160269411 161897974 162883879 162706688 161887044 160015003 157426146 153684689
16711 153684689 149862287 145364877 140146436 134501037 129039124 123446143 117508449 111713003
16703 111713003 106273214 100559369 95468419 90266047 85265145 80541045 76163524 72066931
16695 72066931 68492597 64695278 61571304 58264917 54798474 52058806 49678781 46807977
16687 46807977 44787719 42666197 40334560 38663569 36948492 35320959 33617680 31939469
16679 31939469 30396318 29397355 28269762 26754013 26026237 24800284 23682540 22739848
16671 22739848 22209988 21202345 20193105 19572593 18846211 18521712 17637955 17166632 16278502
16662 16278502 15920092 15303626 14666552 14708073 13810180 13341808 12969405 12691350 12305093
$$ packed form
16719A57907523K361888J628563R85905j77191q19644j872041k588857l741457
16711A53684689l822402m497410n218441n645399n461913n592981n937694n795446
16703A11713003n439789n713845n090950n202372n000902m724100m377521m096593
16695G2066931l574334l797319l123974l306387l466443k739668k380025k870804
16687D6807977k020258k121522k331637j670991j715077j627533j703279j678211
16679C1939469j543151r98963j127593j515749p27776j225953j117744r42692
16671B2739848n29860j007643j009240o20512p26382l24499q83757m71323q88130
16662A6278502l58410o16466o37074M1521q97893m68372l72403k78055l86257
$$ plain form
16653 12305093 12018426 11199625 11106698 10871772 10157294 10061479 9729570 9594215 9182893 9026901
16643 9026901 8858461 8572654 8226510 8145062 8076740 7991731 7444124 7273726 7233128 6913059
16633 6913059 6534263 6628152 6573686 6520576 6541885 5977835 5933088 5678962 5623012 5521807
16623 5521807 5607458 5046702 4717215 4809764 4869233 4984711 4489752 4457697 4482792 4636319
16613 4636319 4367196 4193043 4418171 4035628 4073152 3956348 3849209 3715479 3719401 3823052
16603 3823052 3825742 3567260 3423827 3480548 3295420 3252317 3469505 3146750 2998135 3382679
16593 3382679 3160895 3050932 3063031 2456650 2893575 2612018 2853630 2581826 2604798 2709464
16583 2709464 2820427 2663484 2316474 2225021 2533522 2189667 2085454 2392564 2439269 2163833
$$ packed form
16653A2305093k86667q18801r2927k34926p14478r5815l31909j35355m11322j55992
16643I026901j68440k85807l46144q1448o8322q5009n47607j70398m0598l20069
16633F913059l78796R3889n4466n3110K1309n64050m4747k54126n5950j01205
16623E521807Q5651n60756l29487R2549N9469J15478m94959l2055K5095J53527
16613D636319k69123j74153K25128l82543L7524j16804j07139j33730L922J03651
16603C823052K690k58482j43433N6721j85128m3103K17188l22755j48615L84544
16593C382679k21784j09963J2099o06381M36925k81557K41612k71804K2972J04666
16583B709464J10963j56943l47010r1453L08501l43855j04213L07110M6705k75436
$$ plain form
16573 2163833 2136210 2024296 2167741 2136958 2331086 2061417 1765842 1909994 1952520 1937439
16563 1937439 1812387 2004869 1923125 1548242 2003715 1547139 2037098 1710193 1675855 1750567
16553 1750567 2079723 1517854 1710585 1555572 1874959 1585767 1718195 1320682 1557646
16544 1557646 1399784 1374862 1293665 1426896 1408541 1542574 1149291 1458143 1726593 1390003
16534 1390003 1629592 1156300 1088346 1249757 1141796 1400796 1314080 817149 991238 1276083
16524 1276083 1328928 1152507 1378616 1028992 867009 1290753 1245676 1216551 864564 931068
16514 931068 884301 1052846 948167 1347194 1088520 1118655 993045 1145615 1153699 862122
16504 862122 929386 939440 970383 1323866 696559 1123034 433335 939590 807105 688677
$$ packed form
16573B163833k7623j11914J43445l0783J94128k69669k95575J44152M2526j5081
16563A937439j25052J92482q1744l74883M55473m56576M89959l26905l4338P4712
16553A750567L29156n61869J92731j55013L19387k89192J32428l97513K36964
16544A557646j57862k4922q1197J33231j8355J34033l93283L08852K68450l36590
16534A390003K39589m73292o7954J61411j07961K59000q6716m96931J74089K84845
16524A276083N2845j76421K26109l49624j61983M23744m5077k9125l51987O6504
16514I31068m6767J68545j04679L99027k58674L0135j25610J52570Q084k91577
16504H62122O7264J0054L0943L53483o27307M26475D33335N06255j32485j18428
$$ plain form
16494 688677 740173 612973 996344 989903 827278 1079836 846478 538535 708322 625778
16484 625778 936360 913648 507551 623650 1008262 393763 665467 691639 572488 825677
16474 825677 527182 973758 536036 421975 749452 367133 661679 115743 791051 631960
16464 631960 928586 771662 625663 842396 557862 656617 594786 556062 895264 616269
16454 616269 456199 503129 507641 752934 226826 344239 526853 533027 274193 342969 423993
16443 423993 423122 623677 819230 390031 537728 798931 422568 369555 480691 680182
16433 680182 45809 470206 242556 622336 499306 389298 389397 762003 415665 425681 219991
16422 219991 389948 292877 407348 521164 451256 414274 550839 549593 148887 68749 571617
$$ packed form
16494F88677N1496j27200L83371o441j62625K52558k33358l07943J69787q2544
16484F25778L10582k2712m06097J16099L84612C93763K71704K6172j19151K53189
16474H25677k98495M46576m37722j14061L27477C67133K94546A15743O75308j59091
16464F31960K96626j56924j45999K16733k84534R8755o1831l8724L39202k78995
16454F16269j60070M6930M512K45293B26826J17413J82614O174k58834O8776Q1024
16443D23993q71K00555J95553C90031J47697K61203l76363n3013J11136J99491
16433F80182D5809M24397k27650L79780j23030j10008R9L72606l46338J0016k05690
16422B19991J69957r7071J14471J13816o9908l6982J36565j246A48887F8749N02868
$$ plain form
16411 571617 314860 423217 400800 522827 768478 237062 262727 271362 183158 920309
16401 920309 -86538 381960 342737 212861 295389 147034 316149 116326 -90226 162597
16390 154347 512727 348248 527924 414890 135663 401237 315789 256004 525327 232586
16379 707333 7299 91545 267718 317301 290171 230069 181120 278404 395410 242261 36144
16367 309167 420314 -54615 93229 577459 554385 491367 -34090 178865 187523 170768 430929
16356 430929 184716 29334 578619 104179 84368 444045 437227 357723 63955 79861 75895
16345 75895 211444 401945 151046 91222 -116403 133693 256805 119654 428281 84574
16334 145189 494430 650599 319406 247817 2504 614532 345692 273338 165972 -8663 254
$$ packed form
16411E71617k56757J08357k2417J22027K45651B37062K5665Q635q8204P37151
16401I20309h6538C81960l9223j29876Q2528A47034J69115A16326i0226A62597
16390A54347L58380j64479J79676j13034A35663K65574q5448n9785K69323B32586
16379G07333G299Q4246J76173M9583k7130o0102m8949R7284J17006j53149C6144
16367C09167J11147e4615I3229M84230k3074o3018c4090A78865Q658j6755K60161
16356D30929A84716B9334N49285A04179j9811L59677o818p9504F3955J5906l966
16345G5895J35549J90501A51046n9824a16403A33693J23112A19654L08627H4574
16334A45189L49241J56169C19406p1589B504O12028k68840p2354j07366h663B54
$$ plain form
16322 505198 46049 418850 306228 146418 -142308 -23732 232202 154127 -197855 -18295
16311 -118899 175173 319420 110952 196984 170916 399831 161861 78252 63190 105290
16301 105290 254576 110443 17087 -294747 252193 -186980 250393 168644 -118973 214423
16290 138433 252255 -292061 115484 -11414 175752 163728 107778 76047 242816 74556
16279 550829 182834 96165 96942 103259 -179936 205470 -92819 -191996 488676 87899 90700
16268 90700 101293 206438 130791 105596 107013 -73016 345431 416131 175674 155289 34347
16256 -36638 90939 -224615 98335 -194904 284180 163691 218767 463006 481838 80374 73264
16245 73264 -30273 82696 271987 322978 -193005 -8464 115995 139356 161695 6637 234436
$$ packed form
16322E05198D6049L72801j12622A46418a42308b3732B32202p8075a97855a8295
16311a18899A75173J44247A10952Q6032k6068K28915A61861G8252j5062M2100
16301A05290J49286A10443A7087b94747B52193a86980B50393q1749a18973B14423
16290A38433J13822b92061A15484a1414A75752j2024n5950l1731J66769G4556
16279E50829A82834q6669P77O317a79936B05470i2819r9177D88676H7899K801
16268I0700J0593J05145p5647k5195J417g3016C45431P0700A75674k0385C4347
16256c6638I0939b24615I8335a94904B84180j20489N5076K44239J8832H0374p110
16245G3264c0273H2696J89291N0991a93005h464A15995K3361K2339F637K27799
$$ plain form
16234 234436 51967 39816 78621 130212 -120612 164364 -208623 -75905 46685 229432 129823
16223 129823 -58510 48726 53615 120761 35582 186877 144231 42313 100851 -62406 305398
16211 -13872 465667 -339646 52761 -90442 -102754 -136711 -194155 -304225 340259 308301 -218178
16199 316087 -152506 -108441 -69585 -371280 -189719 94512 -9727 67922 -51902 -35264 444585
16187 -4097 169167 -242742 110281 38505 60174 340959 125418 -127678 -160359 62912 193777
16176 193777 -27668 -177791 -172437 163555 121909 -28312 -50377 158336 -46777 -404001 64008
16164 -30819 184348 -46255 76815 265346 -161938 244349 90702 -12275 179801 -76990 6006
16152 139394 146766 -445947 38665 -6066 -127144 129314 -50179 62750 225123 -51721 160574
$$ packed form
16234B34436E1967j2151L8805N1591a20612A64364b08623g5905D6685J82747r9609
16223A29823e8510D8726M889O7146C5582J51295m2646D2313N8538f2406C05398
16211a3872D65667c39646E2761i0442j2312l3957n7444j10070C40259l1958b18178
16199C16087a52506M4065L8856l01695J81561I4512i727F7922e1902J6638D44585
16187d097A69167b42742A10281C8505K1669K80785A25418a27678l2681F2912J30865
16176A93777b7668j50123N354A63555m1646b8312k2065A58336d6777l57224F4008
16164c0819A84348d6255G6815J88531a61938B44349I0702a2275A79801g6990F006
16152A39394P372d45947C8665f066j21078A29314e0179F2750J62373e1721A60574
$$ plain form
16140 429085 24769 -84703 9057 -117181 -23954 -16873 -4841 -66640 7421 49380 -306841 -51916
16127 -42804 87513 102486 -106299 300624 93533 19169 -110444 117836 81312 61350 -327820
16115 -67244 -86957 189007 21386 75467 333737 265755 110304 29786 376060 22415 -11024
16103 -108509 197741 212257 211057 309153 -3421 72519 184250 -266541 -66949 105584 93084
16092 93084 -138359 -5628 -93166 -19098 233028 58585 69388 -45138 -259054 -267879 253858
16080 -62511 265309 -130348 188062 -104866 94989 -185546 45709 134205 231421 98790 -55434
16068 -201020 -116188 99556 218405 -39645 325265 -216291 -67758 94794 -312825 -107084
16057 -144425 121717 -273228 -77356 -259439 331357 38049 223385 133967 -465924 -66685
$$ packed form
16140D29085B4769h4703I057a17181b3954P081d841o1799G421M1959c06841e1916
16127d2804H7513J4973a06299C00624I3533A9169a10444A17836l6524j9962c27820
16115f7244j9713A89007B1386N4081K58270o7982A10304B9786L46274B2415a1024
16103a08509A97741J4516j200R8096c421G2519J11731b66541f6949A05584j2500
16092I3084a38359e628q7538a9098B33028E8585J0803d5138k13916q825B53858
16080f2511B65309a30348A88062a04866I4989a85546D5709Q8496R7216I8790e5434
16068b01020Q4832I9556J18849c9645C25265b16291f7758I4794c12825a07084
16057a44425A21717b73228g7356j82083C31357C8049J85336q9418d65924f6685
$$ plain form
16046 179587 -384750 -112865 -189460 76155 36819 -58921 183143 168057 -146481 -175055 171480
16034 366424 -213395 291242 -82044 223342 -224410 -171691 -165973 -185512 221989 40090 -110121
16022 117248 -100772 -135931 -33045 151769 -209212 128595 -122193 36554 -216220 -99420
16011 -18690 -242067 14975 173952 -96460 -67393 218904 -106642 -145766 45937 -55996 62434
15999 -205321 219345 207543 -131792 -49856 68956 -192776 120047 256826 82817 -115740
15988 -229156 49896 -161657 285602 -96246 -155304 96017 228578 -243163 463467 154802
15977 170552 2352 118252 -165595 -239596 -6413 -25059 -110491 -83048 133665 10559 70366
15966 70366 42549 152606 191101 -180471 113916 92882 185601 117761 -7945 365761 101383
$$ packed form
16046A79587c84750a12865p6595G6155C6819e8921A83143j5086a46481k8574A71480
16034C66424b13395B91242h2044B23342b24410N2719N718j9539B21989D0090a10121
16022A17248a00772l5159c3045A51769b09212A28595a22193C6554b16220i9420
16011a8690k23377A4975J58977i6460K9067B18904a06642l9124D5937e5996F2434
15999b05321B19345j1802a31792d9856F8956a92776A20047J36779H2817a15740
15988b29156D9896a61657B85602i6246n9058I6017J32561b43163D63467A54802
15977A70552B352J15900a65595p4001f413j8646q5432K7443A33665A0559N9807
15966G0366k7817J10057L8495a80471A13916k1034R2719o7840g945C65761A01383
$$ plain form
15954 33853 220067 -113180 105906 62337 10059 21793 -173644 1752 219768 -66048 -140618
15943 -140618 -198761 -9832 236151 -86161 -90358 -59321 -421945 47746 240555 35020 -57145
15931 -207026 -197672 -256264 -24361 -112054 22514 -105825 -327288 160208 -340663 -159497 -212045
15920 -212045 368830 267733 -154743 -202035 -38858 -92720 -127382 -27834 107343 -58452 256089
15908 107523 -4056 162101 -261157 -158006 -47158 104294 31119 -137689 6429 130819 256696
15897 256696 265175 -85112 20643 36488 -475799 44419 -10414 -38961 -7430 -103634 1421 -187564
15884 136202 142651 206292 -101786 216831 -397082 26833 34657 -139281 104132 -47044 2984
15872 -362221 19751 -145157 -196856 -114065 -113330 -72430 59023 16604 -62732 -95190 105217
$$ packed form
15954C3853J86214a13180A05906m3569A0059J1734a73644A752K18016f6048p4570
15943a40618n8143i832B36151h6161m197L1037l62624D7746J92809C5020e7145
15931b07026R354n8592b4361q7693B2514a05825k21463A60208c40663a59497n2548
15920b12045C68830j01097a54743m7292c8858n3862l4662b7834A07343e8452B56089
15908A07523d056A62101b61157J03151d7158A04294C1119a37689F429J24390J25877
15897B56696Q479h5112B0643J5845d75799D4419a0414k8547g430r6204A421a87564
15884A36202O449O3641a01786B16831c97082B6833P824a39281A04132d7044B984
15872c62221A9751a45157n1699Q2791P35M0900E9023A6604f2732l2458A05217
$$ plain form
15860 -48554 -147236 94136 -150544 63697 -87688 80953 221519 75768 -242869 273351 233267
15849 233267 -302775 172114 -38865 112571 -103575 -355329 -134274 -298735 -170659 -333278
15839 -333278 -74648 291536 -111319 29691 -54552 208129 -232770 -123875 156951 -50786
15828 72448 -90716 261465 -38884 -175135 87262 378701 250846 -334506 -265783 116432
15817 -206883 37226 -226409 -55051 122497 -147607 -86508 -2329 19676 -314953 -292941 -108707
15805 123311 5218 262668 139123 136803 239235 173360 -55511 -50932 168811 -40123 110403
15793 1223 -54610 342901 -240729 -296237 49221 -22010 24180 -74186 -146080 -103 -452770 -269615
15781 -269615 -253021 252194 16802 141722 -173500 -223205 -38364 -177606 -458531 4723 138475
$$ packed form
15860d8554r8682I4136a50544F3697h7688H0953J40566G5768b42869B73351m0084
15849B33267c02775A72114c8865A12571a03575k51754a34274j64461J28076j62619
15839c33278g4648B91536a11319B9691e4552B08129b32770J08895A56951e0786
15828G2448i0716B61465c8884j36251H7262K91439j27855c34506O8723A16432
15817b06883C7226b26409e5051A22497a47607O1099b329A9676c14953K2012a08707
15805A23311E218K57450j23545k320J02432o5875e5511M579A68811d0123A10403
15793A223e4610C42901b40729n5508D9221b2010B4180g4186p1894a03m52667J83155
15781b69615J6594B52194A6802J24920a73500m9705c8364j39242k80925D723J33752
$$ plain form
15770 138475 -182216 89778 -204245 124385 46045 -447619 5325 -26850 -198473 100162
15759 265475 109816 139222 187288 343019 -313337 197595 -142204 124525 -65182 85650
15748 -88674 -9936 21180 26774 -6864 -69465 -34762 -31650 44018 -131826 54900 265930 147636
15736 147636 172333 -71583 -24975 96942 -199854 -19780 -74534 42005 -11377 -71744 -329299
15725 -329299 -183987 -400820 -37593 -80951 127979 439991 -52333 117370 -255924 -401545
15715 -401545 23459 -109614 178949 194445 -232213 -269616 -15123 -242025 -65406 68483 -265126
15703 -302490 -124920 115732 -294919 229967 6057 -115570 19766 -91814 -93857 106605 231456
15692 231456 5344 117809 -15504 165886 -13305 118218 9100 -231012 113605 155298 -205805
$$ packed form
15770A38475a82216H9778b04245A24385D6045d47619E325b6850j71623A00162
15759B65475A09816K9406M8066J55731c13337A97595a42204A24525f5182H5650
15748h8674i936B1180N594f864o2601L4703L112D4018a31826E4900K11030j18294
15736A47636K4697g1583b4975I6942a99854a9780n4754D2005a1377o0367k57555
15725c29299J45312k16833c7593m3358A27979L12012e2333A17370b55924j45621
15715d01545B3459a09614A78949J5496b32213l7403a5123k26902f5406F8483b65126
15703c02490a24920A15732b94919B29967F057a15570A9766i1814k043A06605J24851
15692B31456E344J12465a5504A65886a3305A18218I100b31012A13605M1693b05805
$$ plain form
15680 99026 -103333 -124565 -14259 220565 191453 39410 61562 -19828 114786 -36966 -79806
15669 -79806 -193234 -104241 44584 -157784 45455 -159385 287611 18665 -139302 64974 -439630
15657 36525 164167 159856 156413 -191766 168876 -63685 54000 -122172 -59022 212453 -68185
15645 -160789 -208311 -2079 186027 51446 -329254 150835 -53205 314671 256217 102352 112272
15634 112272 -6429 35140 -106950 241234 30660 -41413 -41842 -57795 -39868 52960 238062
15623 238062 -111427 339097 -331388 -167774 -135202 -131146 50525 -48661 333123 -88642 27359
15611 -180386 -203135 276116 -22733 -31781 75966 262042 -185229 41777 -375448 -135480 112216
15599 137039 3049 287399 -252093 30129 -93544 47402 -261029 -42478 -10056 -259147 -320372
$$ packed form
15680I9026a03333k1232a4259B20565k9112C9410K2152a9828A14786c6966m2840
15669g9806j13428Q8993D4584a57784D5455a59385B87611A8665a39302F4974d39630
15657C6525J27642m311l443a91766A68876f3685E4000a22172e9022B12453f8185
15645a60789m7522b079A86027E1446c29254A50835e3205C14671n8454A02352R920
15634A12272f429C5140a06950B41234C0660d1413m29j5953J7927E2960J85102
15623B38062a11427C39097c31388J63614L2572M056E0525d8661C33123h8642B7359
15611a80386k2749B76116b2733r048G5966J86076a85229D1777c75448a35480A12216
15599A37039C049K84350b52093C0129i3544D7402b61029d2478a0056k49091o1225
$$ plain form
15588 -320372 169796 33872 108804 127940 23114 -11554 -223033 -130197 49970 244135 249844
15577 249844 207418 -18323 -182798 87255 -194078 165727 300494 87747 -12705 27909 -333502
15565 216546 80725 -181598 37762 -2181 30483 298606 123542 -572411 6021 243404 -33663
15553 -159371 1853 65912 235216 -103467 -205299 224200 -265892 -203773 198848 -33752
15542 323218 5365 -265376 -405781 -177855 -280323 -165008 337113 -104354 174011 14870
15531 -288324 -224902 -60416 7217 -153761 -204271 167292 49199 101536 -78480 -52560 -135303
15520 -135303 -191713 181807 -54660 119414 -259293 -77853 165741 253311 174183 111205 240549
15509 240549 -384231 -143472 -20886 41358 269583 -258455 -94982 -241798 -176934 -95406
$$ packed form
15588c20372A69796C3872P4932J9136B3114a1554k11479R2836D9970J94165N709
15577B49844m2426a8323j64475H7255a94078A65727J34767H7747a2705B7909c33502
15565B16546H0725a81598C7762b181C0483K68123A23542e72411F021K37383c3663
15553a59371A853O4059J69304a03467j01832B24200b65892O2119A98848c3752
15542C23218E365b65376j40405a77855j02468J15315C37113a04354A74011A4870
15531b88324O3422f0416G217a53761n0510A67292D9199N2337g8480K5920q2743
15520a35303n6410A81807e4660A19414b59293g7853A65741Q7570p9128o2978J29344
15509B40549c84231a43472b0886D1358K28225b58455i4982j46816O4864Q1528
$$ plain form
15499 -95406 -81630 -320083 146384 -430747 60371 -301843 -9387 -160434 41007 -95283 -116438
15488 -116438 -75299 -206911 196168 -117835 -34335 -24991 330464 187742 44632 54773 -298635
15476 -93320 318963 -152549 -152940 141252 -53397 29731 -99558 -127555 90357 -32471 -178371
15465 -178371 -66223 -22377 14764 128181 184874 62097 309764 61639 54455 83680 -2294
15453 154083 9325 171386 -170064 -13739 -63185 258417 149612 -219788 212567 -23897
15442 78917 186455 -201599 373 40337 -421302 369979 -250971 77068 -67170 15009 43 64965
15430 64965 -5101 -104761 -117294 148119 -199700 289971 63519 76446 -349098 150726 -220652
15418 130625 6702 -121093 -221432 142155 -256292 -143854 187136 -35769 216958 -7489
$$ packed form
15499i5406J3776k38453A46384d30747F0371c01843i387j51047D1007i5283k1155
15488a16438M1139j31612A96168a17835c4335R344C30464j42722D4632J0141b98635
15476i3320C18963a52549l91A41252e3397B9731i9558k7997I0357c2471j45900
15465a78371f6223b2377A4764J13417N6693F2097K47667F1639p184K9225b294
15453A54083I325J62061a70064a3739m9446B58417j08805b19788B12567b3897
15442G8917J07538b01599C73L9964d21302C69979b50971G7068f7170A5009D3O4922
15430F4965e101r9660j2533A48119a99700B89971F3519J2927c49098A50726b20652
15418A30625F702a21093j00339A42155b56292J12438A87136c5769B16958g489
$$ plain form
15407 167176 -198104 64438 -29889 -18238 -43537 16938 -196387 158088 -102463 106532
15396 -14255 -138167 187695 -220901 -165264 -292313 -92453 -219186 123081 -114266 -125830
15386 -125830 -109941 -247493 -440575 20257 -345622 37479 184770 4712 -4041 52255 -9508
15374 -162615 -200680 -14561 -175242 75111 192168 -226292 124583 -302753 -75819 -69441 110593
15362 -191411 60530 -157149 -133019 -315838 -116640 33268 -101543 -12938 -309850 19387
15351 -175908 -160236 180762 14034 -99726 -129505 -57481 -12908 -143975 267819 281118 -48483
15339 314986 85208 -69376 -25643 -92593 129954 133142 -92991 -114732 51723 -108340 -80898
15328 -80898 63372 147979 -6073 65949 44040 41592 -9272 117803 271004 171362 99715 53912
$$ packed form
15407A67176a98104F4438b9889J1651k5299A6938a96387A58088a02463A06532
15396a4255j23912A87695b20901N5637j27049i2453j26733A23081a14266j1564
15386a25830J5889j37552j93082B0257c45622C7479J47291D712d041E2255i508
15374a62615l8065a4561j60681G5111J17057b26292A24583c02753g5819O378A10593
15362a91411F0530a57149K4130j82819a16640C3268a01543a2938k96912A9387
15351a75908J5672A80762A4034i9726k9779e7481a2908j31067B67819J3299d8483
15339C14986H5208f9376b5643o6950A29954L188i2991k1741E1723a08340K7442
15328h0898F3372Q4607f073F5949k1909k448i272A17803J53201r9642p1647m5803
$$ plain form
15316 53912 287186 25235 -336975 54227 344859 211439 -29230 178076 255659 -328446
15305 67248 135228 128990 -302447 -8987 216427 -217345 119071 123228 46850 -245232 247990
15293 99518 -28658 -125230 172887 -99926 177604 52654 -265710 239908 -162184 187103
15282 28346 -211189 -72043 138599 58838 144531 204856 152648 -54128 -53292 -156084 218960
15270 32621 187621 -129653 73755 179785 -19524 -245992 35809 37330 -172779 57774 72747
15259 72747 71271 -356262 183982 92546 139889 331980 174621 166247 279089 110689 49921
15247 186769 347300 181577 1234367 1343613 1288035 1555516 1101342 745681 285251 149164
15237 149164 66020 6404 41087 31241 412360 -91407 232377 64293 -35923 216707 155693
$$ packed form
15316E3912K33274B5235c36975E4227K90632j33420b9230A78076P7583c28446
15305F7248O7980o238c02447h987B16427b17345A19071M157D6850b45232B47990
15293I9518b8658r6572A72887i9926A77604E2654b65710B39908a62184A87103
15282B8346b11189g2043A38599E8838Q5693O0325n2208e4128Q36j02792B18960
15270C2621J55000a29653G3755J06030a9524k26468C5809J521a72779E7774J4973
15259G2747j476c56262A83982r1436M7343J92091j57359q374J12842A10689D9921
15247A86769J60531j65723J052790J09246n5578K67481m54174l55661B85251j36087
15237A49164F6020F404L4683r846L81119i1407B32377F4293c5923B16707o1014
$$ plain form
15226 155693 -134541 106065 -103574 -196583 188356 171672 261192 -70915 -51661 103752
15215 325073 -49205 -56860 -299028 -171449 -50324 -98336 -184092 94222 594206 313326 -33792
15203 155853 -11507 155800 -164572 72620 -145548 -55418 -17843 171187 -93250 157194
15192 -97695 -277012 -66616 267473 -322813 255297 186267 92992 -179636 -231392 260746
15181 -42993 43611 378983 -88886 -433609 211708 267767 147938 -347746 284650 221665
15171 221665 -164188 207494 118761 97253 47549 -166268 99367 295987 240681 275634 23851
15159 31913 53543 91658 -78588 -10595 216100 48228 115843 238802 53944 -50028 -123814
15148 -123814 -138064 -148515 81175 -150073 -227058 34382 -28160 103554 130540 166611 156390
$$ packed form
15226A55693a34541A06065a03574r3009A88356j6684Q9520g0915J9254A03752
15215C25073d9205p655k42168J27579e0324m8012q5756I4222M99984k80880c3792
15203A55853a1507A55800a64572G2620a45548e5418a7843A71187i3250A57194
15192i7695j79317f6616B67473c22813B55297o9030I2992a79636n1756B60746
15181d2993D3611L35372h8886l44723B11708N6059j19829c47746B84650o2985
15171B21665a64188B07494q8733k1508D7549a66268I9367J96620n5306L4953B3851
15159C1913K1630L8115g8588a0595B16100D8228O7615J22959E3944e0028p3786
15148a23814j4250j0451H1175a50073p6985C4382b8160A03554K6986L6071j0221
$$ plain form
15137 156390 -435016 148929 -12721 282905 57171 42321 -14699 340209 219452 150596
15127 150596 -126872 54932 -105462 280947 227789 111759 198217 306541 192129 182577
15117 182577 178795 105519 344210 116001 216936 14245 82187 -168517 186845 -325638
15106 245426 2603 -28410 -56372 215360 -21676 -169424 201053 -35811 -239288 -52251 -164359
15095 -164359 298872 -22883 189798 300671 -187762 -34348 128283 173138 115924 188464
15085 188464 105281 392445 192996 243421 254595 117448 146109 -30904 165056 -128120
15074 -121955 242396 56258 -81611 -2464 184277 286490 -203707 17348 308923 323382 265426
15063 265426 675909 446406 248682 45036 252510 159188 151706 81104 -2398 393252 179260
$$ packed form
15137A56390d35016A48929a2721B82905E7171j4850a4699C40209j20757o8856
15127A50596a26872E4932a05462B80947n3158A11759Q6458J08324j14412r552
15117A82577l782p3276K38691A16001J00935A4245O7942a68517A86845c25638
15106B45426B603b8410k7962B15360b1676j47748B01053c5811k03477e2251j12108
15095a64359B98872b2883A89798J10873a87762c4348A28283M4855n7214P2540
15085A88464q3183K87164A92996N0425J1174A17448K8661c0904A65056a28120
15074a21955B42396E6258h1611b464A84277J02213b03707A7348K91575J4459n7956
15063B65426M10483k29503j97724D5036K07474r3322p482p0602b398C93252A79260
$$ plain form
15051 322008 356537 -38250 -33126 186218 -113855 85474 243397 342666 70424 67357 10959
15039 60599 124673 202480 169899 108138 60700 275298 529397 320279 158279 315502 139333
15027 77841 361362 -108309 45202 141243 7269 196359 37834 204761 -33013 -178028 290792
15015 315848 25231 376273 184959 461803 92777 17601 465743 260690 179970 -125351
15004 153694 -5020 -47922 102765 -247911 115010 191939 -64617 144281 140627 195225 -36038
14992 -33029 265703 -46188 94544 323575 91070 307255 471449 -11937 308992 134118
14981 160890 -39195 130998 -128175 373079 99907 -83692 418651 278139 -62174 38312
14970 128232 133564 247186 -22726 222259 369950 60771 134062 225954 58487 67721 90560
$$ packed form
15051C22008L4529c8250N124A86218a13855H5474J57923R9269G0424l067A0959
15039F0599O4074P7807l2581o1761m7438K14598K54099k09118A58279J57223A39333
15027G7841K83521a08309D5202R6041G269J89090C7834J66927c3013j45015B90792
15015C15848B5231L51042A84959K76844I2777A7601M48142k05053q0720a25351
15004A53694e020m2902A02765b47911A15010P6929f4617A44281l654N4598c6038
14992c3029B65703d6188I4544K29031I1070K16185J64194a1937C08992A34118
14981A60890c9195A30998a28175C73079I9907h3692D18651j40512f2174C8312
14970A28232N332J13622b2726B22259J47691F0771P3291R1892E8487R234K2839
$$ plain form
14959 90560 308963 276585 282294 22098 163265 244977 535514 204238 241786 -38663 492432
14947 33338 198437 169950 354047 121903 612476 274557 528950 91658 368352 445091
14937 445091 233071 226974 280905 229538 -44230 372384 -31410 95995 351227 167568 301721
14926 301721 435932 246326 597112 315867 484198 544233 -48319 288036 284741 187355
14916 187355 139730 176944 264776 219385 400122 -62491 187658 347303 326722 117606 121343
14905 121343 74394 302777 101343 39893 -48616 -85471 75365 38051 341621 385287 145462
14893 233578 254815 276081 171072 347029 481774 128284 75716 303200 368124 304115
14883 304115 345296 242133 186114 272447 429876 400762 369558 547320 252080 228485 131951
$$ packed form
14959I0560K18403l2378N709B2098J41167Q1712K90537B04238L7548c8663D92432
14947C3338J65099k8487J84097A21903M90573B74557K54393I1658K76694P6739
14937D45091k12020o097N3931n1367d4230C72384c1410I5995K55232A67568J34153
14926C01721J34211j89606L50786k81245J68331O0035d8319B88036l295r7386
14916A87355m7625L7214Q7832m5391J80737f2491A87658J59645k0581A17606L737
14905A21343m6949K28383A01343C9893d8616l6855G5365l7314L03570M3666A45462
14893B33578K1237K1266j05009J75957J34745A28284n2568K27484O4924o4009
14883C04115M1181j03163n6019Q6333J57429k9114l1204J77762B52080k3595r6534
$$ plain form
14872 131951 366135 259672 65831 -47493 92543 634332 303336 367695 218378 270155
14862 270155 168818 201684 78665 456074 83653 434079 405412 507748 234189 296084
14852 296084 291710 129521 296999 700242 231702 413810 386547 441955 221295 309030
14842 309030 408772 380663 158876 333509 279390 228687 232229 458514 389710 66167 725415
14831 725415 374364 287022 107180 279484 502359 499478 138731 490864 304861 572085
14821 572085 410637 241587 481134 329276 302639 636076 708218 326824 440122 567089
14811 567089 159108 465265 737450 334986 289509 325939 826706 426684 151543 108701
14801 108701 539016 143681 578188 272816 369817 503418 454480 645737 415931 115885
$$ packed form
14872A31951K34184j06463F5831d7493I2543N41789C03336O4359j49317N1777
14862B70155j01337L2866G8665L77409H3653L50426k8667J02336B34189O1895
14852B96084m374A29521J67478M03243B31702J82108k7263N5408k20660Q7735
14842C09030R9742k8109A58876J74633n4119n0703L542K26285o8804F6167O59248
14831G25415l51051q7342A07180J72304K22875k881A38731L52133j86003K67224
14821E72085j61448j69050K39547j51858k6637L33437P2142C26824J13298J26967
14811E67089A59108L06157K72185C34986m5477L6430N00767m00022A51543m2842
14801A08701M30315A43681M34507B72816R7001J33601m8938J91257k29806A15885
$$ plain form
14790 60977 600611 412913 529330 382720 192395 445736 501092 650760 306485 461205
14780 461205 326356 752871 592822 353480 658036 822832 677967 665797 427468 761210
14770 761210 279181 385008 888210 758458 433957 432415 466122 384377 524987 270271
14760 270271 596510 722316 361662 308801 656296 605612 415306 371267 519818 373411
14750 373411 697621 661082 391198 449001 658397 852151 397986 395096 420317 599550
14740 599550 418210 459041 568553 197034 380269 585250 758501 590806 438915 778191
14730 778191 445984 547054 520136 683636 917315 661302 573340 872835 957230 969426
14720 969426 849147 898820 627234 390273 674359 773103 435819 725546 1140797 537141
$$ packed form
14790F0977N39634j87698J16417j46610j90325K53341N5356J49668C06485J54720
14780D61205j34849M26515j60049k39342L04556J64796j44865j2170k38329L33742
14770G61210B79181J05827N03202j29752l24501j542L3707q1745J40610k54716
14760B70271L26239J25806l60654n2861L47495n0684j90306m4039J48551j46407
14750C73411L24210l6539k69884N7803K09396J93754C97986k890K5221J79233
14740E99550j81340M0831J09512A97034J83235K04981J73251j67695j51891L39276
14730G78191l32207J01070k6918J63500K33679k56013q7962K99495Q4395J2196
14720I69426j20279M9673k71586k36961K84086R8744l37284K89727M15251E37141
$$ plain form
14709 583167 322958 631302 517396 876723 796969 595885 819996 695521 587950 408680
14699 408680 529894 873150 920710 820935 702419 711129 1023379 631365 837236 721086
14689 721086 545634 993681 817708 660789 595715 858713 717491 939547 832120 750670
14679 750670 739340 962965 548215 651287 1208514 973260 734708 907254 883465 877860
14669 877860 951611 1068555 1051180 941583 909339 927488 833003 916885 826844 911885 1146140
14658 1146140 823666 856197 1113865 1118729 940267 1161966 873126 701037 927016 940898
14648 940898 815270 749925 1048270 835700 1041765 782262 1200230 696890 683710 1286007
14638 1286007 1051362 810353 985577 958874 1042834 1227318 1076236 417186 1257071 1271887
$$ packed form
14709E83167k60209L08344j13906L59327p9754k01084K24111j24475j07571j79270
14699D08680J21214L43256M7560r9775j18516Q710L12250l92014K05871j16150
14689G21086j75452M48047j75973j56919o5074K62998j41222K22056j07427q1450
14679G50670j1330K23625m14750J03072N57227k35254k38552J72546k3789n605
14669H77860P3751J16944j7375j09597l2244J8149r4485Q3882r0041Q5041K34255
14658A146140l22474L2531K57668M864j78462K21699k88840j72089K25979J3882
14648I40898j25628o5345K98345k12570K06065k59503M17968n03340j3180O02297
14638A286007k34645k41009J75224k6703Q3960J84484j51082D17186Q39885J4816
$$ plain form
14628 1271887 1140821 1235318 1028023 978364 1386853 939247 998368 994564 799652 1055076
14618 1055076 1038851 965022 905004 1217909 968945 1020767 931638 1655734 1312692 1270906
14608 1270906 1629843 1523866 1147298 1232029 1183514 1682984 1514580 1199923 1281098 1570412
14598 1570412 1351268 1262236 1282343 1333898 1184983 1535477 1532396 1110171 1583610 1464739
14588 1464739 1361966 1371912 1199010 1718533 1481514 1371092 1581674 1541243 1799858 1610330
14578 1610330 1536085 1496785 1676043 1639144 1753800 1947139 1624361 1475777 1824954 1793803
14568 1793803 1775804 1649049 1970990 1779060 2008041 2138973 1806343 2390214 2086329 1903558
14558 1903558 2154325 2595763 2567224 2813942 2717488 3269571 3347869 4241576 5783906 8971843
$$ packed form
14628A271887j31066R4497k07295m9659M08489m47606N9121l804j94912K55424
14618A055076j6225p3829o0018L12905k48964N1822q9129P24096l43042m1786
14608A270906L58937j05977l76568Q4731m8515M99470j68404l14657Q1175K89314
14598A570412k19144q9032K0107N1555j48915L50494l081m22225M73439j18871
14588A464739j02773R946j72902N19523k37019j10422K10582m0431K58615j89528
14578A610330p4245l9300J79258l6899J14656J93339l22778j48584L49177l1151
14568A793803j7999j26755L21941j91930K28981J30932l32630N83871l03885j82771
14558A903558K50767M41438k8539K46718r6454N52083P8298Q93707J542330L187937
$$ plain form
14548 8971843 13118795 21823870 34489641 37779486 17266446 7420343 4131417 4196603
14540 4196603 4534677 2620500 1827966 1666735 1220283 2075235 1548932 1435574 1490616
14531 1490616 1832665 1221030 1733568 1963424 1777362 1832605 1942862 1606028 2328799 1827178
14521 1827178 2078878 2124912 2337587 2318379 2153777 2526439 2178976 2192513 2068483 2608100
14511 2608100 2352616 2323883 2477924 2466114 2534895 2383530 2545093 2361595 2630560 2750395
14501 2750395 2713604 2695750 2677369 2646950 2602210 2974834 2878488 2816883 2926457 2883041 3265249
14490 3265249 3033636 3038111 2796894 3464975 2971631 3106390 3538672 2794755 3431623 3380989
14480 3380989 3400710 3680919 3110995 3262656 3260193 3491631 3214491 3329991 3212617 3375321
$$ packed form
14548H971843M146952Q705075J2665771L289845A7266446G420343l288926O5186
14540D196603L38074j914177p92534j61231m46452Q54952n26303j13358N5042
14531A490616L42049o11635N12538K29856j86062N5243J10257l36834P22771n01621
14521A827178K51700M6034K12675j9208j64602L72662l47463J3537j24030N39617
14511B608100k55484k8733J54041j1810O8781j51365J61563j83498K68965J19835
14501B750395l6791j7854j8381l0419m4740L72624r6346o1605J09574m3416L82208
14490C265249k31613M475k41217O68081m93344J34759M32282p43917O36868n0634
14480C380989J9721K80209n69924J51661k463K31438k77140J15500j17374J62704
$$ plain form
14470 3375321 3395769 3478022 3771079 3569475 3452954 3742627 3804466 3861369 3949138 3776774
14460 3776774 3830320 4398008 3986917 4198418 4131437 4491502 4277029 4699248 4377190 4443061
14450 4443061 4565331 4273920 4747319 4401473 4738763 4462592 4770496 4886969 4852938 4847417
14440 4847417 4946483 5157282 4957803 5238718 5327918 5350364 5512417 5672889 5329978 5598107
14430 5598107 5595355 5789916 5747881 6028092 6096689 6062208 6017874 6128479 6135994 6398014 6526133
14419 6526133 6570609 6708712 6953165 6743479 7349818 7098719 7056821 7277010 7485294 7469228
14409 7469228 7771770 7582580 8169923 7864241 7855456 8100411 8616026 8496714 8762146 8744394
14399 8744394 8787997 9110807 9617217 9371985 9208459 9857854 9474135 9943072 10024856 10241997
$$ packed form
14470C375321K0448Q2253K93057k01604j16521K89673O1839N6903Q7769j72364
14460C776774N3546N67688m11091K11501o6981L60065k14473M22219l22058O5871
14450D443061J22270k91411M73399l45846L37290k76171L07904J16473l4031n521
14440D847417R9066K10799j99479K80915Q9200K2446J62053J60472l42911K68129
14430E598107k752J94561m2035K80211O8597l4481m4334J10605P515K62020J28119
14419F526133M4476J38103K44453k09686O06339k51099m1898K20189K08284j6066
14409G469228L02542j89190N87343l05682q785K44955N15615j19312K65432j7752
14399H744394M3603L22810N06410k45232j63526O49395l83719M68937Q1784K17141
$$ plain form
14389 10241997 10377541 10562701 10692459 10983571 11106141 11262600 11686205 12092151 11906112
14380 11906112 12354134 12435648 12565275 13012342 13025269 13600818 13490319 14259246 14473630 14693222
14370 14693222 14971883 15282877 15502724 15843522 16148289 15944502 17234044 17240959 17384218
14361 17384218 17821383 18422370 18669084 19173859 19739195 19833495 20766553 20916470 21510226
14352 21510226 21821162 22707871 23070723 23912677 24366991 24541254 25484716 26354271 26733616
14343 26733616 27605339 28188837 28635927 29826226 30935711 31394821 32370241 33224550 34002515
14334 34002515 35201130 36195736 37735358 38533142 39955717 41010173 42371029 43925385
14326 43925385 45487598 46506845 48216886 49971607 51818575 53933218 55760484 58257444
$$ packed form
14389A0241997J35544J85160J29758K91112J22570J56459M23605M05946j86039
14380A1906112M48022Q1514J29627M47067J2927N75549j10499P68927K14384K19592
14370A4693222K78661L10994K19847L40798L04767k03787J289542O915J43259
14361A7384218M37165O00987K46714N04775N65336R4300R33058J49917N93756
14352B1510226L10936Q86709L62852Q41954M54314J74263R43462Q69555L79345
14343B6733616Q71723N83498M47090J190299J109485M59110R75420Q54309P77965
14334C4002515J198615R94606J539622P97784J422575J054456J360856J554356
14326D3925385J562213J019247J710041J754721J846968K114643J827266K496960
$$ plain form
14318 58257444 60570778 62438790 64577299 67608958 70148498 73331197 76353039 79384286
14310 79384286 82789844 86067232 90205010 94198775 98631099 102961737 108146392 113001252
14302 113001252 118691903 124522551 130534630 137220288 144434423 152274257 160399415 168806658
14294 168806658 178312745 188040444 198396651 209263377 221299031 233450789 246915750
14287 246915750 260868363 275502061 291060247 306575180 322909536 339854089 356700202
14280 356700202 373567448 390628265 406706974 421838921 435634871 446061061 449549128
14273 449549128 450280473 450376110 451208135 448336159 452436416 450036544 446168483 439948422
14265 439948422 427727588 414074130 399192135 384457206 367241990 350280682 332870271
$$ packed form
14318E8257444K313334J868012K138509L031659K539540L182699L021842L031247
14310G9384286L405558L277388M137778L993765M432324M330638N184655M854860
14302A13001252N690651N830648O012079O685658P214135P839834Q125158Q407243
14294A68806658R506087R727699J0356207J0866726J2035654J2151758J3464961
14287B46915750J3952613J4633698J5558186J5514933J6334356J6944553J6846113
14280C56700202J6867246J7060817J6078709J5131947J3795950J0426190L488067
14273D49549128P31345R5637Q32025k871976M100257k399872l868061o220061
14265D39948422j2220834j3653458j4881995j4734929j7215216j6961308j7410411
$$ plain form
14258 332870271 316024530 299316424 283288791 267993173 253479924 239453350 226591396
14251 226591396 215200828 203942826 192740975 182184800 172583176 163319150 155112771
14244 155112771 147913464 140248857 132693069 126735317 120282278 114746560 109831828 104801322
14236 104801322 99876488 95654040 91202882 87369296 84024730 80543365 77288305 74205287
14228 74205287 71237392 68194544 65704674 63143875 60696385 58413333 56314974 54429783
14220 54429783 52665858 50614922 49229442 47195380 45634138 44287678 43373382 41894188
14212 41894188 40410836 39233467 37815106 36750818 35589749 35332797 34005505 33028561
14204 33028561 32070873 30955754 30002561 29229249 28728198 28286609 26925973 26198574 25299346
$$ packed form
14258C32870271j6845741j6708106j6027633j5295618j4513249j4026574j2861954
14251B26591396j1390568j1258002j1201851j0556175r601624r264026q206379
14244A55112771p199307p664607p555788n957752o453039n535718m914732n030506
14236A04801322m924834m222448m451158l833586l344566l481365l255060l083018
14228G4205287k967895l042848k489870k560799k447490k283052k098359j885191
14220E4429783j763925k050936j385480k034062j561242j346460r14296j479194
14212D1894188j483352j177369j418361j064288j161069k56952j327292r76944
14204C3028561r57688j115119r53193p73312n01051m41589j360636p27399q99228
$$ plain form
14195 25299346 25017511 24329926 23920324 23261574 22668283 21991249 21631703 21063550 20504299
14186 20504299 20181865 19796001 19075455 18600989 18234692 18142234 17566661 17187823 16738704
14177 16738704 16138152 16076662 15728795 15477831 15220440 14991794 14576804 14282562 13978219
14168 13978219 13641773 13446676 13391875 13099536 12469559 12781481 12332086 11817692 12035161
14159 12035161 11603392 11387989 11403500 10793141 11037097 10204148 10596842 9958346 10438426
14150 10438426 10267444 9676200 9740177 9412874 9620419 9004991 9208956 8807118 8750927 8598709
14140 8598709 8591712 8485629 8292681 8293151 8385263 7861132 8195482 7780195 7461815 7436271 7027751
14129 7027751 7294698 7004417 7247909 6729834 6864697 7000556 6986742 6415196 6485937 6444997
$$ packed form
14195B5299346k81835o87585m09602o58750n93291o77034l59546n68153n59251
14186B0504299l22434l85864p20546m74466l66297r2458n75573l78838m49119
14177A6738704o00552o1490l47867k50964k57391k28646m14990k94242l04343
14168A3978219l36446j95097n4801k92339o29977L11922m49395n14394K17469
14159A2035161m31769k15403J5511o10359K43956q32949L92694o38496M80080
14150A0438426j70982n91244O3977l27303K07545o15428K03965m01838n6191j52218
14140H598709o997j06083j92948M70R2112n24131L34350m15287l18380k5544m08520
14129G027751K66947k90281K43492n18075J34863J35859j3814n71546P0741m0940
$$ plain form
14119 6444997 6051800 6097168 6335270 5929252 5696741 5926153 5741543 5817849 5838951 5641512
14109 5641512 5636201 5613671 5550777 5359560 5253478 5584647 5220346 5109786 5176504 5026116
14099 5026116 4915287 4768799 4840318 4863830 4900962 4639394 4747176 4546074 4922118 4426479
14089 4426479 4267987 4668133 4513545 4413589 4194072 4181661 4217418 4026830 3945631 3821863
14079 3821863 4082156 3895864 3969739 3932964 3761326 3330521 3709919 3682074 3230496 3412549
14069 3412549 3762336 3410105 3294826 3485278 3401908 3247007 3376404 3326617 2858298 3149241
14059 3149241 3640696 3086108 2948946 3066944 2975629 3021369 3155866 2836577 2680002 2984325
14049 2984325 3007370 2531298 2989005 2590352 2845389 2813512 2957066 2874379 2849962 2713790
$$ packed form
14119F444997l93197M5368K38102m06018k32511K29412j84610P6306K1102j97439
14109E641512n311k2530o2894j91217j06082L31169l64301j10560O6718j50388
14099E026116j10829j46488P1519K3512L7132k61568J07782k01102L76044m95639
14089D426479j58492M00146j54588r9956k19517j2411L5757j90588q1199j23768
14079C821863K60293j86292P3875l6775j71638m30805L79398k7845m51578J82053
14069C412549L49787l52231j15279J90452q3370j54901J29397m9787m68319K90943
14059C149241M91455n54588j37162J17998r1315M5740J34497l19289j56575L04323
14049B984325K3045m76072M57707l98653K55037l1877J43554q2687k4417j36172
$$ plain form
14039 2713790 2474709 2541848 2664658 2324649 2458386 2393027 2388742 2300953 2354404 2588064
14029 2588064 2174288 2728805 2372197 2393791 2647223 1805099 2094824 2039736 2582762 2387274
14019 2387274 2346316 1701528 2311027 2144759 2146656 1719074 2074803 2036647 1993431 1932439
14009 1932439 1983522 1863142 1788025 2054992 1813953 1622779 1670881 1878229 2054532 1581062
13999 1581062 1429502 1975989 1501954 1433306 1482634 1530352 1394627 1873676 1861624 2845519
13989 2845519 4783881 8016530 16082174 29965552 40722187 22373093 10901920 6143393
13981 6143393 4595013 4008602 3379090 2921029 2682602 2749378 2819745 2539287 1937869 2134843
13971 2134843 1924032 1764888 1747182 2085188 1942225 2105220 1884003 1954971 1789982 2009402
$$ packed form
14039B713790k39081O7139J22810l40009J33737o5359m285q7789N3451K33660
14029B588064m13776N54517l56608K1594K53432q42124K89725n5088N43026j95488
14019B387274m0958o44788O09499j66268J897m27582L55729l8156m3216o0992
14009A932439N1083j20380p5117K66967k41039j91174M8102K07348J76303m73470
13999A581062j51560N46487m74035o8648M9328M7718j35725M79049j2052R83895
13989B845519J938362L232649Q065644J3883378J0756635j8349094A0901920m758527
13981F143393j548380n86411o29512m58061k38427O6776P0367k80458o01418J96974
13971B134843k10811j59144j7706L38006j42963J62995k21217P0968j64989K19420
$$ plain form
13961 2009402 1893996 1730304 1758747 1943407 1976015 1686974 1614687 1801776 1804817 1613111
13951 1613111 1946162 1839528 1548499 1501536 1685779 1823364 1574432 1551056 1467534 1397550
13941 1397550 1476583 1634525 1610171 1581957 1590961 1508313 1383143 1521215 1282958 1292615 1283663
13930 1283663 1376433 1227248 1588448 1350572 1274940 1580633 953582 915636 999427 1732224
13920 1732224 1372782 1402298 1282314 1465956 1161694 1442989 1278409 1084679 1160736 1538270
13910 1538270 1486761 1305701 1245844 1052997 1578820 966291 1187537 969947 1035470 1013512
13900 1013512 1382901 1012403 955686 1090121 754773 1086062 1229159 846649 1158245 904369
13890 904369 808575 1127449 832315 1062031 1008061 987401 889439 926920 1023294 890664 795729
$$ packed form
13961B009402j15406j63692K8443J84660L2608k89041p2287J87089L041j91706
13951A613111L33051j06634k91029m6963J84243J37585k48932k3376q3522o9984
13941A397550P9033J57942k4354k8214R004q2648j25170J38072k38257R657q952
13930A283663R2770j49185L61200k37876p5632L05693o27051l7946Q3791P32797
13920A732224l59442K9516j19984J83642l04262K81295j64580j93730P6057L77534
13910A538270n1509j81060n9857j92847N25823o12529K21246k17590O5523k1958
13900A013512L69389l70498n6717J34435l35348L31289J43097l82510L11596k53876
13890I04369r5794L18874k95134K29716n3970k0660r7962L7481R6374j32630r4935
$$ plain form
13879 795729 920375 968121 1011557 1076837 930760 1073879 873504 1155847 1217195 663198
13869 663198 1081813 573457 970756 1147964 961611 815108 812647 473533 608813 853853
13859 853853 871434 966919 942728 799604 789361 772935 1001872 1193214 890898 995048
13849 995048 706168 653091 788076 1054510 1065375 771091 782246 1008459 842613 704600
13839 704600 604557 891777 1098645 949682 643878 604775 1016313 948999 820898 777260
13829 777260 793315 522932 649639 731201 577589 718557 757571 655738 578328 355028
13819 355028 714890 612436 840400 645234 796918 737061 981479 868486 594469 633725
13809 633725 460451 568941 712127 615603 643631 731226 918149 426277 648254 719541
$$ packed form
13879G95729J24646M7746M3436O5280j46077J43119k00375K82343O1348n53997
13869F63198M18615n08356L97299J77208j86353j46503k461l39114J35280K45040
13859H53853J7581R5485k4191j43124j0243j6426K28937J91342l02316J04150
13849I95048k88880n3077J34985K66434J0865k94284J1155K26213j65846j38013
13839G04600j00043K87220K06868j48963l05804l9103M11538o7314j28101m3638
13829G77260J6055k70383J26707Q1562j53612J40968L9014j01833p7410k23300
13819C55028L59862j02454K27964j95166J51684n9857K44418j12993k74017L9256
13809F33725j73274J08490J43186r6524K8028Q7595J86923D26277K21977P1287
$$ plain form
13799 719541 443575 595928 805933 790723 763751 430737 759880 485574 394372 626898
13789 626898 548800 633763 707000 748631 824828 490250 894522 632646 553863 833073 621578
13778 621578 246273 426495 819640 811987 506372 929448 536747 899580 544446 690964
13768 690964 438231 207877 528806 679781 485770 586450 475577 618535 406775 515102
13758 515102 539821 398983 265325 527765 482032 368926 639873 493437 487478 372105
13748 372105 567427 245168 409184 437813 828436 781870 694504 555771 496845 846101
13738 846101 192173 529850 403055 232696 470988 637748 247430 696687 447830 749826
13728 749826 467142 303102 452271 553649 430138 290115 500624 399118 524753 580985
$$ packed form
13799G19541k75966J52353K10005j5210k6972l33014L29143k74306r1202K32526
13789F26898p8098Q4963P3237M1631P6197l34578M04272k61876p8783K79210k11495
13778F21578B46273J80222L93145p653l05615M23076l92701L62833l55134J46518
13768F90964k52733B07877L20929J50975j94011J00680j10873J42958k11760J08327
13758E15102K4719j40838j33658K62440m5733j13106K70947j46436n959j15373
13748C72105J95322B45168J64016K8629L90623m6566q7366j38733n8926L49256
13738H46101A92173L37677j26795j70359K38292J66760B47430M49257k48857L01996
13728G49826k82684j64040J49169J01378j23511j40023K10509j01506J25635N6232
$$ plain form
13718 580985 397932 543334 481452 474648 307672 375749 816194 460177 293181 434104
13708 434104 367280 446326 533408 353002 287655 321791 320364 752350 351682 511944 836436
13697 836436 538016 445559 676584 511998 280144 541887 464456 533186 280445 820029
13687 820029 704968 451950 489588 615066 259096 639786 519061 532752 187365 503630
13677 503630 466653 581881 441675 234239 401635 115644 425187 539354 635298 221515
13666 317722 -58124 185364 354733 414670 416039 438396 200866 252299 431445 119638 455306
13655 455306 322394 325634 538268 573467 709558 555526 172920 257549 129760 293661
13645 293661 366577 252380 305336 301485 630208 112637 280046 569749 395758 209506
$$ packed form
13718E80985j83053J45402o1882o804j66976O8077M40445l56017j66996J40923
13708D34104o6824P9046Q7082j80406o5347L4136j427M31986C51682J60262L24492
13697H36436k98420r2457K31025j64586k31854K61743p7431O8730k52741N39584
13687H20029j15061k53018L7638J25478B59096L80690j20725J3691A87365L16265
13677E03630l6977J15228j40206k07436J67396A15644L09543J14167R5944B21515
13666C17722e8124A85364J69369N9937J369K2357B00866N1433J79146A19638L35668
13655D55306j32912L240K12634L5199J36091j54032A72920Q4629j27789J63901
13645B93661P2916j14197N2956l851L28723A12637J67409K89703j73991j86252
$$ plain form
13635 209506 395196 389884 349332 366248 191774 580526 336188 216826 429032 426780 309210
13624 309210 336324 63868 427544 385779 69265 207702 402338 705604 330370 189838
13614 189838 536418 380059 500889 156885 338893 58889 45951 73902 331732 174773
13604 174773 27820 240844 354224 432325 533754 81696 -47600 427163 90204 283793
13594 283793 65090 235575 283482 169934 447253 122264 389505 222378 151114 155285
13584 155285 83059 303143 129577 410538 340091 434620 160810 487134 209926 438610
13574 438610 711252 205863 214258 250819 48758 360622 132273 206960 275875 -198468 225196
13562 360080 487798 317378 644919 121120 104715 149746 110711 256763 359898 -126604
$$ packed form
13635B09506J85690n312m0552J6916j74474L88752k44338j19362K12206k252j17570
13624C09210K7114F3868L63676m1765F9265J38437J94636L03266C30370j40532
13614A89838L46580j56359J20830A56885J82008E8889j2938K7951K57830j56959
13604A74773B7820K13024J13380P8101J01429H1696d7600D27163I0204J93589
13594B83793F5090J70485M7907j13548K77319A22264K67241j67127p1264M171
13584A55285p2226K20084A29577K80961p0447R4529A60810L26324B09926K28684
13574D38610K72642B05863Q395L6561D8758L11864A32273P4687O8915a98468B25196
13562C60080J27718j70420L27541A21120j6405M5031l9035J46052J03135a26604
$$ plain form
13551 255230 293100 169705 296476 352302 125270 136914 217562 -47800 289034 34885 42912
13540 42912 212929 919518 554815 146026 201700 364776 306937 -24522 73054 139026 121795
13529 121795 388342 233771 264312 261735 258939 432186 9666 19755 116387 201152 47526
13517 56673 309170 138965 233126 202761 24795 248455 202401 397623 215474 10734 389470
13506 389470 412730 241778 187120 141241 55183 260366 68151 238903 109791 57222 245508
13495 245508 248675 190717 259977 42514 203301 106858 104906 159255 59018 145220 129962 355968
13483 355968 226331 251125 418263 254389 271700 258742 271660 246476 321135 327047 609916
13472 609916 412883 112564 -70809 288121 220032 509746 407205 69807 200098 235774
$$ packed form
13551B55230L7870j23395J26771N5826A25270J1644Q0648d7800B89034C4885Q027
13540D2912J70017P06589l64703A46026N5674J63076n7839b4522G3054O5972j7231
13529A21795K66547j54571L0541k577k796J73247I666J0089R6632Q4765D7526
13517E6673K52497A38965R4161l0365B4795K23660m6054J95222j82149A0734L78736
13506C89470K3260j70952n4658m5879E5183K05183F8151J70752A09791n2569J88286
13495B45508L167n7958O9260D2514J60787r6443j952N4349E9018Q6202j5258K26006
13483C55968j29637K4794J67138j63874J7311j2958J2918k5184P4659N912K82869
13472F09916j97033A12564g0809B88121o8089K89714j02541F9807J30291L5676
$$ plain form
13462 235774 307861 102443 36204 192395 169680 70425 306951 78461 290991 460361
13452 460361 350509 177876 113074 106480 132513 539913 108528 543805 -18796 82959 152783
13441 152783 95099 183505 75226 48405 27483 77751 341847 235348 198836 421326 -38415
13429 208788 162996 127436 179409 144127 330313 -185989 -40545 522536 -106956 148891
13418 -99071 217206 241229 -157754 168136 -74629 343987 171435 216109 245073 199149 246681
13407 246681 189304 191369 -201380 594833 -53424 -278787 -66353 -266163 326327 128978
13396 -116641 121706 188828 -68120 295884 61262 143846 -45960 276532 199639 -32681 266250
13384 41320 440345 199487 50442 229793 94340 385875 -163878 147371 -50243 -78181
$$ packed form
13462B35774P2087A02443C6204J56191k2715G0425K36526G8461K12530J69370
13452D60361j09852j72633o4802o594K6033M07400A08528M35277a8796H2959O9824
13441A52783n7684Q8406G5226k6821k0922N0268K64096j06499l6512K22490c8415
13429B08788m5792l5560N1973l5282J86186a85989d0545E22536a06956A48891
13418i9071B17206K4023a57754A68136g4629C43987A71435M4674K8964m5924M7532
13407B46681n7377K065b01380E94833e3424k25363f6353j99810C26327A28978
13396a16641A21706O7122f8120B95884F1262Q2584d5960B76532p6893c2681B66250
13384D1320L99025A99487E0442J79351I4340K91535a63878A47371e0243k7938
$$ plain form
13374 -78181 163143 259794 93661 -60148 368024 192360 206958 283836 229823 -55 284191
13362 203448 -25945 -40316 -19975 221496 92922 329524 141307 109610 364861 228306
13352 228306 529144 207400 329028 124139 158641 179203 347665 11647 531113 81703
13341 -5835 298707 227780 281971 453966 276584 113774 40225 370924 24210 546417 346277
13330 346277 353873 75592 262282 326039 261791 117064 1569 517169 279741 79196 79789
13319 79789 179494 210185 299618 99456 538005 156458 439573 94710 226567 -140852 101014
13307 -45417 87406 256667 173724 147257 385226 113152 72019 124280 327579 119237 -142621
13295 25361 204456 246658 168109 -44004 -5136 290287 336735 338071 108860 -69970 303128
$$ packed form
13374g8181A63143R6651I3661f0148C68024j75664J4598P6878n4013e5B84191
13362B03448b5945j4371a9975B21496I2922K36602A41307l1697K55251j36555
13352B28306L00838B07400J21628A24139L4502K0562J68462A1647N19466H1703
13341e835B98707p0927N4191J71995j77382A13774D0225L30699B4210N22207k00140
13330C46277P596G5592J86690O3757o4248A17064A569N15600k37428G9196N93
13319G9789R9705L0691Q9433I9456M38549A56458K83115I4710J31857a40852A01014
13307d5417H7406J69261q2943k6467K37969A13152m1133N2261K03299A19237a42621
13295B5361J79095M2202p8549d4004e136B90287M6448J336A08860f9970C03128
$$ plain form
13283 168632 -11729 155660 49620 550065 120070 323663 -26102 -49442 1912 181464 101910
13272 101910 -97603 156469 -247835 184613 185872 118176 -405262 -125785 -52537 50557 204008
13261 204008 128724 7323 82631 252467 -66229 351874 182434 222393 97739 119915 217742
13250 217742 -264642 161374 -199112 440511 15123 35707 195641 177808 45091 -203485
13239 117800 468154 -172648 465874 390661 149043 187686 -225485 -139661 149960 284305
13229 284305 90816 226830 71904 9022 -63230 -154846 11859 -179660 354928 -286888 391506
13217 353051 259073 -14865 -77344 -11465 232338 177666 205177 35382 57779 -44976 303464
13205 162303 374302 -180218 60497 57774 30920 156661 107609 -49478 322916 161515 110648
$$ packed form
13283A68632a1729A55660D9620N00445A20070K03593b6102k3340A912J79552p9554
13272A01910i7603A56469b47835A84613J259o7696d05262a25785e2537E0557J53451
13261B04008p5284G323P5308J69836f6229C51874j69440L9959I7739K2176R7827
13250B17742b64642A61374a99112D40511A5123K0584J59934j7833D5091b03485
13239A17800L50354a72648D65874p5213A49043L8643b25485Q5824A49960J34345
13229B84305I0816J36014G1904I022f3230r1616A1859a79660C54928b86888C91506
13217C53051r3978a4865o2479a1465B32338n4672K7511C5382K2397d4976C03464
13205A62303K11999a80218F0497k723k6854J25741m9052d9478C22916j61401n0867
$$ plain form
13194 110648 186307 125264 194241 90159 -43984 -186622 233855 139214 -29274 -77748 201054
13182 503621 401598 -138307 221004 346283 70774 265635 72896 174682 33891 -161215
13171 395226 39222 212479 -64570 -160040 -301386 -23199 140848 -47111 -86357 -114031 -29857
13159 -159328 -14420 -232354 347691 215109 -265037 377703 16633 211828 -91011 11429
13148 -120014 -136527 143105 292985 -36116 118522 83106 144360 -53559 -91387 -185210 244455
13136 83885 289292 215843 -223521 80167 211179 118177 -92865 325914 -327659 -245281 -55515
13124 239081 275051 155060 299481 -211146 -242465 56592 153956 -24804 -34411 -26949 121749
13112 215407 123701 -171305 189835 -103787 195322 -85873 85696 574038 111103 98041
$$ packed form
13194A10648P5659o1043O8977I0159d3984j42638B33855r4641b9274m8474B01054
13182E03621j02023a38307B21004J25279G0774J94861G2896J01786C3891a61215
13171C95226C9222J73257f4570r5470j41346b3199A40848d7111l9246k7674b9857
13159a59328a4420k17934C47691j32582b65037C77703A6633J95195i1011A1429
13148a20014j6513A43105J49880c6116A18522l5416O1254e3559l7828r3823B44455
13136H3885K05407p3449b23521H0167J31012r3002i2865C25914c27659Q2378e5515
13124B39081L5970j19991J44421b11146l1319E6592R7364b4804r607P462A21749
13112B15407r1706a71305A89835a03787A95322h5873H5696M88342A11103j3062
$$ plain form
13102 98041 131574 -24469 64867 43821 -8567 106848 -288743 -118470 58469 42386 99966
13091 99966 57445 264208 -212894 41353 -98310 -3862 -45940 -272378 287870 -108791 306124
13079 245843 112339 14399 274563 -72452 32551 -4514 -104844 -216360 144407 91116 45106
13067 39344 266037 88263 106719 -61401 -171142 204008 106326 75956 -78443 -216006 39116
13055 49234 215662 33015 6410 -7851 164488 195165 130417 52405 213143 119592 -267235
13043 -19066 268055 -307217 140281 -7523 -108816 84587 -251245 -315881 -97750 2499 -171970
13031 198054 5093 89803 -79379 -20731 150357 311688 377482 62273 310831 40130 252917
13020 252917 60314 85116 -123188 21815 197272 199572 204805 -16815 174120 -90826 23881
$$ packed form
13102I8041L3533b4469F4867k1046h567A06848b88743a18470E8469j6083N7580
13091I9966m2521K06763b12894D1353i8310c862m2078k26438B87870a08791C06124
13079B45843A12339A4399K60164g2452C2551d514j00330j11516A44407n3291D5106
13067C9344K26693H8263J8456f1401j09741B04008r7682l0370g8443j37563C9116
13055D9234J66428C3015F410g851A64488L0677o4748E2405J60738r3551b67235
13043a9066B68055c07217A40281g523j01293H4587b51245o4636i7750B499a71970
13031A98054E093Q4710g9379b0731A50357J61331O5794F2273K48558D0130K12787
13020B52917F0314K4802a23188B1815J75457K300N233a6815A74120i0826B3881
$$ plain form
13008 -68657 -294132 216713 143484 12294 165868 498 231943 229738 78358 150405 -178056
12996 31982 370552 325934 257018 89528 260732 214304 -28620 4670 -118815 104843 38865
12984 16857 136759 -104486 312727 -148696 246621 -32614 90425 -107082 -135337 -297631
12974 -297631 385654 215138 -275259 193590 -171755 185058 194219 325033 328339 -55953
12963 149210 -248465 65051 429471 -80462 139692 32401 -149387 -127095 168579 305813
12953 305813 -195805 380441 88197 324671 32172 -70405 -197513 134250 -195937 9577
12942 23940 -3187 195781 103191 102940 60836 -27063 -106900 234989 -9211 -97186 -84228 284167
12929 69362 -4578 -247748 298818 55539 -462205 113366 89530 132977 -14576 52068 -119419
$$ packed form
13008f8657k25475B16713p3229A2294J53574D98K31445k205G8358P2047a78056
12996C1982L38570m4618o8916H9528J71204m6428b8620D670a18815A04843C8865
12984A6857J19902a04486C12727a48696B46621c2614I0425a07082k8255j62294
12974b97631C85654j70516b75259A93590a71755A85058R161J30814L306e5953
12963A49210b48465F5051L64420h0462A39692C2401a49387K2292A68579J37234
12953C05813a95805C80441H8197K36474C2172g0405j27108A34250a95937I577
12942B3940c187A95781r2590k51m2104b7063p9837B34989i211q7975J2958B84167
12929F9362d578k43170B98818E5539d62205A13366k3836M3447a4576E2068a19419
$$ plain form
12917 28389 404333 28904 216530 166450 -46490 -19684 -166700 472643 16364 -436094 -273911
12906 -273911 72305 209624 286006 -81630 351975 176457 3243 -87724 305779 82528 -191008
12894 -3820 278921 187298 291849 97465 -216884 117765 -144232 -36069 -130026 166193 -92666
12882 326569 47508 -139375 115329 120981 -55844 -7111 309086 -53504 -244122 211134 -305638
12870 247657 -19796 43012 45436 194345 -211363 -76807 -267543 315075 -228839 -115310
12860 -115310 -191607 -7207 351987 -204118 -92198 131093 -202499 283179 234015 -206077
12849 194060 -223149 -168624 -68285 49013 -164159 48888 447346 71457 -235381 -76028 327891
12837 268033 -34421 -197768 149084 246106 -24000 -74951 97629 -275906 -102737 -79019 -78162
$$ packed form
12917B8389L75944B8904J87626n0080d6490a9684j47016D72643A6364d36094J62183
12906b73911G2305J37319P6382h1630C51975j75518C243h7724C05779H2528a91008
12894c820B78921r1623J04551I7465b16884A17765a44232c6069r3957A66193i2666
12882C26569D7508a39375A15329N652e5844g111C09086e3504j90618B11134c05638
12870B47657a9796D3012K424J48909b11363g6807j90736C15075b28839J13529
12860a15310p6297g207C51987b04118i2198A31093b02499B83179m9164b06077
12849A94060b23149N4525f8285D9013a64159D8888L98458G1457b35381g6028C27891
12837B68033c4421j63347A49084R7022b4000n0951I7629b75906a02737K3718Q57
$$ plain form
12826 -78162 -73249 -384711 151844 145713 215111 -131088 33910 29481 49138 71804 89191 -136068
12813 83251 152044 67577 281927 -217512 -46726 100218 204905 -205487 -158152 36198 -174168
12801 50011 -165377 83708 -153540 -97473 127078 -210732 151089 59806 82310 -260776
12790 311189 84306 238109 12169 -153425 -231724 -126096 -117809 39134 80882 -74801 -182711
12779 -182711 -147371 -71611 -136680 -180400 -369863 389296 383067 -163099 -34442 239 -31185
12767 14018 53218 88846 -67689 75358 -205592 23709 -89733 233020 417333 -54362 -329099
12756 -329099 -182379 -217099 115028 -218579 -24232 -77627 117442 40286 202461 222696
12746 222696 -26497 255379 -20140 180533 122387 378963 78946 -75942 87835 227044 303380
$$ packed form
12826g8162M913l11462A51844o131O9398a31088C3910m429J9657K2666J7387a36068
12813H3251O8793F7577K14350b17512d6726A00218J04687b05487M7335C6198a74168
12801E0011a65377H3708a53540N6067A27078b10732A51089E9806K2504b60776
12790C11189H4306J53803A2169a53425p8299J05628Q287C9134M1748g4801j07910
12779a82711L5340g1611o5069m3720j89463C89296o229a63099c4442B39c1185
12767A4018L9200L5628f7689G5358b05592B3709h9733B33020J84313e4362k74737
12756c29099J46720l4720A15028b18579b4232n3395A17442D0286J62175K0235
12746B22696b6497B55379b0140A80533n8146K56576G8946g5942H7835J39209P6336
$$ plain form
12735 303380 125861 145904 88791 -145687 123008 -193294 130851 -292269 202815 -217260
12724 88785 -218912 151708 -75426 106073 43675 22403 -355135 25045 94752 38876 25869
12713 25869 -232983 -52690 -13201 472880 78649 214303 291550 332647 293995 130087 234710
12702 234710 -47148 146884 19763 -13682 -11696 186524 201576 -80565 216293 178669 116063
12691 116063 -190884 -184873 154527 47686 42223 278875 224518 157003 52389 32167 -27187
12679 -13643 -52791 -109971 -336188 68744 134722 38866 303200 -10130 359442 356376 52411
12667 230093 136499 276550 21006 55 246043 -46973 -215363 281978 121408 -62977 -72328
12656 -72328 30611 -24192 115511 153441 -71262 351129 461710 -262615 254918 206520 187239
$$ packed form
12735C03380A25861K0043n7113a45687A23008a93294A30851b92269B02815b17260
12724H8785b18912A51708g5426A06073D3675k1272c55135B5045O9707C8876j3007
12713B5869b32983e2690a3201D72880G8649J35654P7247M1097l8652A30087J04623
12702B34710d7148A46884A9763a3682J986A86524J5052h0565B16293l7624o2606
12691A16063a90884O011A54527D7686n463K36652n4357o7515E2389k0222b7187
12679a3643l9148n7180k26217F8744O5978C8866K64334a0130C59442l066E2411
12667B30093r3594J40051B1006E5K45988d6973j68390B81978A21408f2977r351
12656g2328C0611b4192A15511L7930g1262C51129J10581b62615B54918m8398j9281
$$ plain form
12645 187239 -114443 -11136 27837 44137 -179699 15967 3489 -85935 323062 464858 419843
12634 419843 250994 -418445 471222 -244172 375820 208879 63544 324730 57160 -98453
12623 -109634 -44349 -194003 39995 290423 15645 -64510 -141838 -40702 -106607 95207 46901
12611 44615 121267 294658 203138 -53422 -21384 -393741 64651 33717 -298657 169573 93528
12600 93528 -11120 -130221 238412 -207685 176269 170099 85675 99542 110188 177344 -35738
12588 -132099 -11840 62762 87587 78193 14178 100576 -110013 -26023 66735 -143470 -108563
12577 -108563 43873 -26929 -84295 -74017 373790 33674 -66873 73315 97953 -25959 -20439
12566 -20439 56549 238816 -134292 9982 212144 -88413 85451 141357 -151637 -163740 -153453
$$ packed form
12645A87239a14443a1136B7837J6300a79699A5967C489h5935C23062J41796m5015
12634D19843j68849d18445D71222b44172C75820j66941F3544K61186E7160i8453
12623a09634d4349j49654C9995K50428A5645f4510p7328d0702o5905I5207D6901
12611D4615P6652J73391r1520e3422b1384l72357F4651l0934b98657A69573p6045
12600I3528a1120j19101B38412b07685A76269o170q4424J3867J0646O7156c5738
12588a32099a1840F2762K4825r394A4178Q6398a10013b6023F6735a43470L4907
12577a08563D3873b6929n7366J0278C73790C3674f6873G3315K4638b5959N520
12566b0439E6549J82267a34292I982K02162h8413H5451N5906a51637j2103J0287
$$ plain form
12555 -153453 -1123 -45686 267057 -1662 -135488 -468 152375 1780 141613 295082 -38349
12543 -54652 96261 136447 56459 98697 -24391 205567 -68041 198169 313215 323553 74131
12531 -11767 207009 -6637 142302 -212260 -320952 84279 -105103 -66072 -245410 96542 181573
12520 181573 -87890 -187367 -2169 200537 -66622 347551 28306 -95924 144894 32644 238696
12509 238696 -163456 -25754 197007 -369 27325 248342 83849 -32727 -18474 -100712 369406
12497 98921 90202 128533 33056 46551 44374 246850 -148506 286872 167863 283043 343677
12486 343677 127416 61641 195110 182702 369776 279852 -125365 -217172 104514 -148727
12475 -60449 128012 59973 50989 -97009 13437 184260 -118346 -41220 84634 178542 294209
$$ packed form
12555a53453a123m4563B67057a662j33826d68A52375A780J39833J53469c8349
12543e4652I6261M0186E6459M2238b4391B05567f8041A98169J15046J0338G4131
12531a1767B07009f637A42302b12260j08692H4279a05103L9031j79338I6542Q5031
12520A81573h7890r9477b169B00537f6622C47551B8306i5924A44894C2644K06052
12509B38696a63456b5754A97007c69B7325K21017H3849c2727J4253q2238C69406
12497I8921q719L8331C3056J3495k177K02476a48506B86872j19009J15180O0634
12486C43677A27416F1641J33469j2408J87074q9924a25365r1807A04514a48727
12475f0449A28012E9973q984i7009A3437J70823a18346d1220H4634R3908J15667
$$ plain form
12464 294209 320000 48463 211521 106987 -102974 -109583 113126 232172 -61367 -65053 93254
12452 225027 -209766 29447 -95600 57628 -170511 -145164 -56838 66412 162491 144883 46084
12440 -209535 275664 75783 -51438 -38407 -175870 69414 312191 81408 178639 -263409 288806
12428 108511 -155558 151960 64022 -203574 -268384 104810 -25372 -299475 -206454 -116512
12418 -116512 -53384 162437 -128548 -125665 28425 110985 -21623 -39252 228607 -44999 -67189
12407 -67189 121304 -274768 -41762 -93404 -151429 -217642 -150602 142046 58400 -229623 119645
12395 -190065 -74079 154411 -368070 -460024 229220 -21629 113706 -405420 -41767 -75585
12385 -75585 80077 -47780 21619 173125 129648 275561 215585 -163760 55221 80186 41313
$$ packed form
12464B94209K5791D8463J63058j04534a02974o609A13126J19046f1367l686I3254
12452B25027b09766B9447i5600E7628a70511K5347e6838F6412R6079j7608D6084
12440b09535B75664G5783e1438J3031j37463F9414K42777H1408R7231b63409B88806
12428A08511a55558A51960F4022b03574o4810A04810b5372k74103R3021Q9942
12418a16512e3384A62437a28548K883B8425Q2560b1623j7629B28607d4999k2190
12407f7189A21304b74768d1762n1642n8025o6213O7040A42046E8400b29623A19645
12395a90065g4079A54411c68070r1954B29220b1629A13706d05420d1767l3818
12385g5585H0077d7780B1619J51506m3477J45913n9976a63760E5221K4965l8873
$$ plain form
12374 41313 72606 -153757 -42031 184073 14619 201205 347835 68129 -227004 -75675 164157
12362 184924 -72167 -179249 -174790 -96036 47257 292584 56683 285073 73640 273572 178323
12351 178323 10859 176809 -231529 222365 64793 176407 223222 346407 3537 202146
12341 202146 511687 -115766 -30964 -44674 79850 -222960 -41977 -47378 -311567 -22719 -562859
12330 -562859 -60798 -112080 36208 44939 83603 170008 -3537 -163438 173462 254998 -162881
12318 228457 108822 220264 -2051 137144 188477 176055 60841 250602 77181 164048 -293610
12306 -426998 -42224 -13491 -233368 224488 -47354 27127 -64796 -71976 218491 -159371 181618
12294 309453 -2820 257897 -140634 31453 63962 -128104 -55432 27219 41820 -177076 -1076
$$ packed form
12374D1313L1293a53757d2031A84073A4619J86586J46630F8129b27004g5675A64157
12362A84924g2167j07082M459P8754D7257K45327E6683K28390G3640J99932r5249
12351A78323A0859J65950b31529B22365F4793J11614M6815J23185C537J98609
12341B02146L09541a15766c0964j3710G9850b22960d1977n401k64189b2719n40140
12330e62859f0798n1282C6208Q731L8664Q6405c537j59901A73462Q1536a62881
12318B28457A08822J11442b051A37144N1333j2422F0841J89761G7181Q6867b93610
12306d26998d2224a3491k19877B24488d7354B7127f4796p180B18491a59371A81618
12294C09453b820B57897a40634C1453L2509a28104e5432B7219J4601a77076a076
$$ plain form
12282 175294 -47625 -416995 302649 -153743 -7611 42146 323872 12537 167427 184510 -31469
12270 34059 85476 225739 -118005 312121 112176 355528 315777 129832 322624 49306
12259 -14684 107234 -23274 -40582 139977 235663 -42486 -47499 -62471 63000 -69437 73171
12247 337863 415514 85155 64139 -63280 184684 -92885 -7041 203364 79223 -24275 -87351
12236 -87351 309598 321815 188917 95028 -19908 -97470 -294006 45849 -86486 39261 171612
12225 171612 -28484 332695 140374 321088 -19462 214181 428995 150601 407510 85448
12214 398620 301331 149280 371621 90487 50526 240901 154186 -14546 305961 207866 18620
12202 129085 10145 314128 493253 281921 383424 254014 449195 368217 539660 564566
$$ packed form
12282A75294d7625l69370C02649a53743g611D2146K81726A2537J54890J7083c1469
12270C4059N1417J40263a18005C12121A12176K43352l9751A29832J92792D9306
12259a4684A07234b3274j7308A39977R5686d2486n013j4972F3000f9437G3171
12247C37863P7651H5155k1016f3280A84684i2885g041B03364G9223b4275o3076
12236h7351C09598J2217j32898r3889a9908p7562j96536D5849h6486C9261J32351
12225A71612b8484C32695A40374J80714a9462B14181K14814A50601K56909H5448
12214C98620r7289A49280K22341I0487l9961J90375q6715a4546C05961r8095A8620
12202A29085A0145L03983J79125k11332J01503j29410J95181q0978J71443K4906
$$ plain form
12192 564566 72924 336077 53322 326084 -28201 320127 352035 228589 47361 211697
12182 211697 480631 25252 120654 186806 172946 51361 235687 5748 182395 155448 163419
12171 163419 47976 -83642 101916 169843 -219155 207710 -189568 88662 115479 284207
12161 284207 285711 152272 300704 -242240 145949 -96324 111700 6587 53717 -49313 76678
12149 274343 296286 -150953 -30078 -157096 33806 268027 -100849 61051 310990 -11397
12138 -187421 -404452 208905 64058 35271 -93822 -52190 20353 -327689 56397 144060 256931
12127 256931 -65003 331889 -165278 92526 271647 6457 -6211 -191344 387692 -176155 -17768
12115 83722 35804 96951 51481 -97085 -24579 61407 21272 -33724 -136370 254033 26997
$$ packed form
12192E64566G2924K63153E3322K72762b8201C20127L1908j23446D7361J64336
12182B11697K68934B5252R5402O6152j3860E1361J84326E748J76647k6947P971
12171A63419D7976h3642A01916O7927b19155B07710a89568H8662K6817J68728
12161B84207J504j33439J48432b42240A45949i6324A11700F587M7130d9313G6678
12149B74343K1943a50953c0078j27018C3806K34221a00849F1051K49939a1397
12138a87421k17031B08905F4058k8787i3822M1632B0353c27689E6397Q7663J12871
12127B56931f5003C31889a65278I2526J79121F457f211j85133C87692a76155a7768
12115H3722C5804O1147m5470i7085b4579F1407B1272c3724j02646B54033B6997
$$ plain form
12103 -345073 -153182 -37066 43089 70706 51450 116842 19471 34199 162237 -54268 73537
12091 68492 46895 -326262 -53679 40345 -84323 -150609 -77727 -198562 -168319 13712 110325
12080 110325 120951 -21941 -72661 -359786 -283925 23929 144678 376193 -313738 -169139
12070 -169139 -174431 104903 -224340 -14301 248307 103627 -150109 268189 -58441 -199131
12060 -199131 22710 224141 404028 1150885 1521016 750281 270166 -33657 130304 159611
12050 159611 -75732 -133634 171311 -166606 -74545 -53316 -17669 10790 -35021 -105275 42430
12038 602640 -284333 25098 -42148 60925 -25359 87753 237727 -258667 -111677 -123853 126501
12026 -95435 77730 -213597 231631 207883 70867 -216059 -162702 221427 -283573 227155
$$ packed form
12103c45073a53182c7066D3089K7617j9256O5392A9471J4728J28038e4268G3537
12091F8492k1597c26262e3679D0345h4323o6286P2882j20835L0243A3712R6613
12080A10325J0626b1941n0720k87125P5861B3929J20749K31515c13738J44599
12070a69139n292A04903b24340a4301B48307A03627a50109B68189e8441j40690
12060a99131B2710K01431J79887P46857L70131G50281B70166c3657A30304K9307
12050A59611g5732n7902A71311a66606g4545K1229a7669A0790c5021p0254D2430
12038F02640b84333B5098d2148F0925b5359H7753J49974b58667a11677j2176A26501
12026i5435G7730b13597B31631k3748G0867b16059N3357B21427b83573B27155
$$ plain form
12015 78479 258127 -94933 -134599 -268251 224190 30975 225815 -51608 -52234 173133 -52783
12003 -13587 241338 -61613 155907 -58576 152860 -2234 55137 -339097 -107907 150959 13912
11991 -9506 247548 -124846 125787 -45957 -12713 69641 49552 185807 -113783 -170543 55754
11979 332 -14039 -185364 -80834 197733 22892 164356 -59495 -203117 -359212 211194 -123693
11967 -99305 -126273 -386506 -97379 1724 32788 89304 -398439 -142998 28260 -39497 69283
11955 -68997 -61113 -157314 80474 468002 91367 44379 -19976 -216918 184207 43276 -3373
11943 -217258 85092 392056 -212541 -162613 -581138 94824 83224 -250467 -189317 166092
11932 -117805 -87165 103157 -181443 47661 -40842 131140 245703 -183566 18466 -76710
$$ packed form
12015G8479J79648i4933l9666j33652B24190C0975J94840e1608o26A73133e2783
12003a3587B41338f1613A55907e8576A52860b234E5137c39097a07907A50959A3912
11991i506B47548a24846A25787d5957a2713F9641k0089J36255a13783n6760E5754
11979C32a4039j71325h0834A97733B2892J41464e9495j43622j56095B11194a23693
11967i9305k6968k60233i7379A724L1064N6516c98439a42998B8260c9497F9283
11955f8997P884r6201H0474L87528I1367D4379a9976j96942A84207D3276c373
11943b17258H5092L06964b12541M9928m18525I4824j1600b50467O1150A66092
11932a17805L0640A03157a81443D7661d0842A31140J14563a83566A8466g6710
$$ plain form
11921 -148395 123898 -188893 -45946 -28709 175420 -164568 -101738 227682 -59739 -185056
11911 -185056 -113192 -56604 -255928 172503 200619 49436 225379 -427478 -113623 200888
11900 79878 -12054 24808 96352 229591 -159448 -84466 8769 -228056 -60290 -61103 170536
11888 171429 -212792 60961 -207579 100173 -235580 -44481 42892 -233408 -59142 90484
11877 -131142 -19389 -161766 -197549 103977 74839 -6244 -117377 -104716 -158414 -91182 -154154
11866 -154154 -110200 293748 -286964 -78882 -47717 -244212 -243690 -140314 186049 -34729 -64517
11855 -64517 -101891 146912 -119498 90735 -76990 -237164 -188718 79477 386363 86708 -27022
11843 517405 -306775 -13814 11537 -126631 19635 -119268 84973 34685 -281187 -176638
$$ packed form
11921a48395A23898a88893d5946J7237A75420a64568O2830B27682e9739j25317
11911a85056P1864N6588j99324A72503K8116D9436J75943d27478a13623B00888
11900G9878a2054B4808P1544J33239a59448P4982H769b28056f0290q13A70536
11888A71429b12792F0961b07579A00173b35580d4481D2892b33408e9142I0484
11877a31142a9389j42377l5783A03977k9138f244j11133J2661n3698O7232o2972
11866a54154M3954B93748b86964g8882L1165j96495N22J03376A86049c4729k9788
11855f4517l7374A46912a19498I0735g6990j60174M8446G9477L06886H6708b7022
11843E17405c06775a3814A1537a26631A9635a19268H4973C4685b81187J04549
$$ plain form
11833 -176638 112169 -115418 -208902 -241968 -288572 -182100 -37855 -285493 84947 -78686 -117924
11822 -117924 -73394 -104708 -225413 186378 -30406 208890 -28956 75872 -227746 -104259
11811 34587 -175118 -88067 149 -153840 -49939 -239934 69938 -116323 91503 250768 212354
11800 212354 -80364 -70045 130703 -82635 -81855 163571 -79557 -193034 35796 -103686 219903
11788 161704 -162607 27589 -23308 398641 58558 93740 192742 -24750 -194419 -82325 -103003
11777 -103003 -135391 107055 -19520 64322 178740 186567 491624 99049 -154479 193740 -488134
11765 -241343 -194449 -210981 -364057 -45417 -191391 231777 -211482 198591 -248499 -152436
11755 -152436 149759 -315597 -375423 90378 -114643 -313857 -162617 179711 -256489 21372
$$ packed form
11833a76638A12169a15418r3484l3066m6604J06472c7855k47638H4947g8686l9238
11822a17924M4530l1314j20705A86378c0406B08890b8956G5872b27746a04259
11811C4587a75118Q7051A49a53840d9939j89995F9938a16323I1503J59265l8414
11800B12354h0364J0319A30703h2635P80A63571g9557j13477C5796a03686B19903
11788A61704a62607B7589b3308C98641E8558L5182R9002b4750j69669h2325k0678
11777a03003l2388A07055a9520F4322J14418P827L05057I9049a54479A93740d88134
11765b41343M6894j6532j53076d5417j45974B31777b11482A98591b48499R6063
11755a52436A49759c15597n9826I0378a14643j99214J51240A79711b56489B1372
$$ plain form
11744 77974 3176 -406422 -150430 52094 -89814 361012 200236 129289 -128254 224701 -38808
11732 -57427 -102298 -116102 58061 56480 211468 139020 177571 -72270 4567 -42194 -95623 150694
11719 -92921 31047 260149 426094 397543 -71428 72690 254160 207098 337038 72033 -75827
11707 -282160 -428954 -91966 20443 -60881 -275298 204946 252069 122596 -194107 46420
11696 309622 194457 216146 106754 -122765 -111760 274258 151629 12790 -267673 -179235
11686 -179235 -160795 50632 -322701 113762 -123457 -16855 -137012 -88488 111102 99655
11676 99655 253982 -3846 269639 14565 145653 5444 -157850 23236 -16533 -335155 274458
11664 200689 -81159 -69942 -117488 165727 45972 273219 303656 -178195 403979 48617 -39987
$$ packed form
11744G7974C176d06422a50430E2094h9814C61012j60776p0947a28254B24701c8808
11732e7427m4871j3804E8061j581J54988p2448L8551g2270D567d2194n3429A50694
11719i2921C1047K29102J65945k8551g1428G2690J81470m7062J29940G2033g5827
11707b82160j46794i1966B0443f0881k14417B04946M7123A22596a94107D6420
11696C09622j15165K1689A06754a22765J1005B74258j22629A2790b67673Q8438
11686a79235J8440E0632c22701A13762a23457a6855j20157M8524A11102j1447
11676I9655J54327c846B69639A4565J31088E444a57850B3236a6533l18622B74458
11664B00689h1159J1217m7546A65727D5972K27247L0437a78195D03979D8617c9987
$$ plain form
11652 -112976 121262 -91107 -183876 261958 44475 -75926 -77484 87485 -72780 -154368 -636 126812
11639 99284 -100564 -40417 106826 149042 29676 12948 -130048 43312 -106402 187121 -195143
11627 48417 64408 -71343 -113828 -30322 -143940 347631 25742 -155727 181737 -69123 -271544
11616 -271544 104026 95340 -141385 437733 346593 -179599 -137516 -44644 -175181 159989
11605 279344 23104 -76295 -126515 -67599 -92421 33163 6107 -94649 -326085 11154 298048
11594 298048 -138897 146848 280686 -55730 267786 265673 211391 117650 278263 114828
11583 234 5053 227052 372918 120824 66519 -29652 67404 265943 118855 77313 84150
11572 84150 73729 -128332 249182 -171513 165241 53967 177118 259732 -16210 -161289
$$ packed form
11652a12976A21262i1107r2769B61958D4475g5926j558H7485g2780q1588f36A26812
11639I9284a00564d0417A06826M2216B9676A2948a30048D3312a06402A87121a95143
11627D8417J5991g1343m2485c0322j13618C47631B5742a55727A81737f9123k02421
11616b71544A04026q686a41385D37733r1140a79599M2083d4644j30537A59989
11605B79344B3104g6295n0220N8916k4822C3163F107i4649k31436A1154K86894
11594B98048a38897A46848J33838e5730B67786k113n4282r3741J60613A14828
11583B34M819K21999J45866A20824n4305b9652F7404J98539A18855m1542O837
11572H4150j0421a28332B49182a71513A65241E3967J23151Q2614a6210j45079
$$ plain form
11562 -161289 -363276 104295 -22476 78909 -156615 -51433 -246752 265506 -185027 339701
11551 -130569 69406 -223728 -54822 -3832 -227333 -126130 161194 111482 -334692 109214
11540 43580 208003 194506 12453 -184805 166100 511861 150358 -23051 191123 -34147
11529 181439 54144 82578 -87106 334883 211694 114340 331754 -29287 264975 118736
11518 32293 208060 7606 -282093 -11430 11749 219824 73866 33712 44364 417930 33799
11506 -127769 -47625 302627 348995 203583 -12294 249562 332405 224146 366079 154150
11495 126205 -167 580948 97491 266427 176109 73489 318976 215963 274309 -10946 -283348
11484 -283348 283242 343431 549873 -21026 -97635 163491 113497 283818 159703 502666
$$ packed form
11562a61289k01987A04295b2476G8909a56615e1433j95319B65506a85027C39701
11551a30569F9406b23728e4822c832k23501J01203A61194m9712c34692A09214
11540D3580J64423j3497A2453a84805A66100L45761A50358b3051A91123c4147
11529A81439E4144K8434h7106C34883j23189r7354K17414b9287B64975A18736
11518C2293J75767G606b82093a1430A1749K08075G3866C3712J0652L73566C3799
11506a27769d7625C02627M6368j45412a2294B49562Q2843j08259J41933A54150
11495A26205a67E80948I7491J68936r0318G3489K45487j03013N8346a0946k72402
11484b83348B83242O0189K06442b1026p6609A63491m9994J70321j24115L42963
$$ plain form
11474 502666 37135 -50058 308482 26944 339153 346781 375132 238451 227908 200906 153963
11463 153963 214906 106201 -3011 340345 195228 250365 -127632 304809 16530 -201480
11452 434031 260511 62722 34228 -30000 -89001 -63001 189305 81418 -126576 55217 240334
11441 240334 135371 -165385 -5771 -99873 85311 64600 423335 -69104 -184614 79860 230852
11430 230852 -63046 193298 -20271 459009 211525 93776 -166281 274441 -115110 -172654
11420 -172654 184833 181762 193266 -72596 -10479 91751 -295322 5699 71595 215246 -48163
11408 122470 -139802 41589 -35150 193191 -5010 -98444 -127345 -44081 345901 16114 -99202
11396 -26568 -26168 -77754 189559 128402 -202202 -204926 29134 -20601 -281167 -187400 -90252 85783
$$ packed form
11474E02666C7135e0058C08482B6944L12209P628K8351j36681j0543k7002m6943
11463A53963O0943A06201c011C40345j45117N5137a27632C04809A6530b01480
11452D34031j73520F2722k8494c0000n9001K6000A89305H1418a26576E5217J85117
11441B40334j04963a65385e771r4102H5311k0711L58735f9104j15510G9860J50992
11430B30852f3046A93298b0271D59009B11525I3776a66281B74441a15110n7544
11420a72654A84833l071J1504g2596a0479I1751b95322E699O5896J43651d8163
11408A22470a39802D1589c5150A93191e010r3434k8901d4081C45901A6114i9202
11396b6568M00n1586A89559o1157b02202k724B9134b0601k60566R3767i0252H5783
$$ plain form
11383 47166 48388 -44573 -81825 184799 -74128 -71811 -200806 106121 -26699 405855 290230
11372 290230 -47457 -29906 -257664 -171102 340783 -138930 115697 88928 43687 53141 -328657
11360 264705 2448 -45404 229075 89147 -97279 184586 -24976 69142 93483 192126 -60919
11348 -6357 -28488 202901 -58634 32447 -15309 31653 327897 94515 -102892 -170932 -98660
11337 -98660 -81960 -92936 43505 -186213 -189893 209399 -259119 320982 -193039 66949 356092
11326 356092 60416 -63747 -92842 -57883 -347485 78309 -365551 -116433 -309081 252177
11315 -219297 29936 -124603 44843 104794 -94359 -38643 31764 -154659 88677 349053 236119
11304 236119 24695 -106627 353849 28723 -112396 -115043 -185126 303019 127130 -199490
$$ packed form
11383D7166J222d4573l7252A84799g4128K317j28995A06121b6699D05855j15625
11372B90230d7457J7551k27758Q6562C40783a38930A15697k6769D3687R454c28657
11360B64705B448d5404B29075H9147i7279A84586b4976F9142K4341R8643f0919
11348f357k2131B02901e8634C2447a5309C1653K96244I4515a02892o8040P2272
11337i8660J6700j0976D3505a86213l680B09399b59119C20982a93039F6949K89143
11326C56092F0416f3747k9095L4959k89602G8309c65551a16433j92648B52177
11315b19297B9936a24603D4843N9951i4359c8643C1764a54659H8677K60376j12934
11304B36119B4695a06627C53849B8723a12396k647p0083C03019A27130a99490
$$ plain form
11293 370883 252071 -33475 24411 -198878 -264326 -89581 -153972 182405 248053 -27506 86662
11281 11001 -55779 233865 41850 -20020 -147433 -54423 -235822 -47056 -308027 -30462 -319006
11270 -319006 134971 -311364 -438602 192956 -54710 -91102 465006 -256709 242862 159183
11260 159183 -138977 196687 1377 69792 -3611 45331 -365037 241542 -99276 2444 -40693
11248 -369138 -119097 219614 321686 -19102 75593 -70811 1462 -26438 322671 -76050 -120889
11237 -120889 -180468 72800 -146094 -401737 -323023 -166853 -7611 345907 120003 90252 -215204
11225 110507 57865 -359539 225930 94094 -124441 -276811 -40953 75542 133241 186703 326959
11214 326959 -45494 -189603 -169676 -106145 161570 65400 -41328 -299610 -260535 -234904 -70048
$$ packed form
11293C70883j18812c3475B4411a98878o5448h9581o4391A82405O5648b7506H6662
11281A1001e5779B33865D1850b0020j27413e4423j81399d7056k60971c0462k88544
11270c19006A34971c11364j27238A92956e4710l6392D65006b56709B42862q3679
11260A59183a38977A96687A377O8415c611D5331c65037B41542i9276B444d0693
11248c69138a19097B19614J02072a9102G5593g0811A462b6438C22671g6050m4839
11237a20889n9579G2800a46094k55643P8714J56170g611C45907A20003k9751b15204
11225A10507n2642c59539B25930I4094a24441j52370d0953G5542N7699N3462J40256
11214C26959d5494j44109J9927O3531A61570F5400d1328k58282L9075K5631g0048
$$ plain form
11202 118716 160664 -299594 96996 -36299 -129303 -57314 112146 50480 -73423 39787 235968
11191 235968 165186 -53749 -6459 -263799 -434816 279135 -238092 -90219 -194636 -63273 -281171
11180 -281171 -96890 -386609 149247 -193830 -18857 -147308 179091 100170 368914 -297122
11169 8271 -162430 -186426 -102806 34737 -207390 -2493 -118043 -189526 -35839 51639 -250564
11157 -315371 107859 -217879 -172090 87967 48124 25990 235454 -174830 23142 -412388
11146 251429 -244494 10548 170830 146467 -53874 158260 -95600 -111383 181061 -6530 -52463
11135 -52463 35179 -13173 152441 83880 -79038 232354 356632 25998 103417 73716 182612
11124 182612 63951 110408 98397 3729 155078 287658 267211 13883 170384 -64889 170121
$$ packed form
11202A18716M1948b99594I6996c6299r3004e7314A12146E0480g3423C9787J96181
11191B35968p0782e3749f459k57340j71017B79135b38092i0219j04417f3273k17898
11180b81171i6890k89719A49247a93830a8857j28451A79091p8921K68744b97122
11169H271a62430k3996Q3620C4737b07390b493j15550p1483c5839E1639b50564
11157c15371A07859b17879M5789H7967l9843k2134K09464a74830B3142d12388
11146B51429b44494A0548J60282k4363e3874A58260i5600j5783A81061f530m5933
11135e2463C5179a3173A52441o8561g9038B32354J24278B5998P7419k9701J08896
11124A82612F3951M6457j2011C729J51349J32580k0447A3883J56501f4889A70121
$$ plain form
11112 81176 -104237 67163 416197 25697 288899 -58304 -359325 207751 -117806 41056
11101 93407 95282 320983 662378 33447 451865 134228 259585 65379 120198 207945 427800
11090 427800 105549 363689 169046 102238 374014 195945 336847 273934 74750 138529
11080 138529 465538 420755 82671 -15927 306673 244899 251031 130353 301608 145463 -56942
11068 633694 361597 584396 591215 579671 127298 298897 291482 636915 731752 409819 828397
11057 828397 537890 539142 696388 455690 744395 646423 727634 840446 644020 878679
11047 878679 704885 822896 856598 972917 1089338 1128366 961919 966253 927681 906202 996372
11036 996372 833871 1054281 367136 1001593 892636 730862 964821 784799 962218 846662
$$ packed form
11112H1176a04237F7163L49034B5697K63202e8304l01021B07751a17806D1056
11101I3407J875K25701L41395C3447M18418A34228J25357F5379N4819Q7747K19855
11090D27800A05549K58140A69046o6808K71776j78069J40902o2913G4750O3779
11080A38529L27009m4783H2671a5927C06673o1774O132j20678J71255A45463e6942
11068F33694k72097K22799O819j1544A27298J71599p415L45433R4837l21933M18578
11057H28397k90507J252J57246k40698K88705r7972Q1211J12812j96426K34659
11047H78679j73794J18011L3702J16319J16421L9028j66447M334l8572k1479R0170
11036I96372j62501K20410C67136O34457j08957j61774K33959j80022J77419j15556
$$ plain form
11026 846662 737255 1056903 730385 700168 737974 1204108 685038 500483 707537 630257
11016 630257 647011 877785 644310 522359 694313 556092 759712 733711 1065073 966363
11006 966363 883868 581001 902474 916855 610308 655896 687927 1003964 928941 438317
10995 662007 745546 707385 1119425 972475 886300 629878 1069241 900369 937688 789241
10985 789241 878824 1084569 988953 1063030 1147082 1156190 957691 1593391 1778810 1934760 2163181
10974 2163181 2245640 2684486 3134652 3412787 3773350 3640287 4243274 4051993 3648223 3753222
10964 3753222 2885427 2601551 2337439 1853341 1803357 1857321 1858364 1617439 1513030 1715541
10954 1715541 1935293 1766733 1803548 881879 1520463 889857 753528 921571 696195 324857
$$ packed form
11026H46662j09407L19648l26518l0217L7806M66134n19070j84555K07054p7280
11016F30257J6754K30774k33475j21951J71954j38221K03620k6001L31362r8710
11006I66363q2495l02867L21473J4381l06547M5588L2031L16037p5023D38317
10995F62007Q3539l8161M12040j46950q6175k56422M39363j68872L7319j48447
10985G89241Q9583K05745r5616P4077Q4052R108j98499O35700J85419J55950K28421
10974B163181Q2459M38846M50166K78135L60563j33063O02987j91281m03770J04999
10964C753222q67795k83876k64112m84098m9984N3964J043k40925j04409K02511
10954A715541K19752j68560L6815H81879O38584o30606j36329J68043k25376C24857
$$ plain form
10943 473285 546898 651250 214760 364518 166913 227428 252108 187959 42549 48577 -112150
10931 310593 182146 210032 141675 -146223 165346 -172257 78647 24800 448756 -136419
10920 217334 -78765 173816 -32133 10278 -260606 164239 154611 321531 59506 18126 83457
10909 83457 198579 -49084 50454 147518 -4551 77265 373668 -84784 -97771 222011 154039
10898 154039 37811 19854 160625 251663 -177824 -48549 181208 236146 -13810 28148 147289
10887 147289 -232213 -203011 112329 -173372 79104 -344584 -41596 222379 -171907 114265
10876 -40886 -4511 93615 145998 13855 -142652 -190569 -4005 -31321 301109 215157 -164033
10864 55208 151477 -33294 -147839 -228676 -178337 -19869 -183946 -146100 -217291 112791 -29476
$$ packed form
10943D73285P3613J04352B14760J49758A66913O0515K4680o4149D2549O028a12150
10931C10593j28447K7886o8357a46223A65346a72257G8647B4800M23956a36419
10920B17334g8765A73816c2133A0278b60606A64239r628J66920E9506A8126O5331
10909H3457J15122d9084E0454R7064d551G7265K96403h4784j2987B22011o7972
10898A54039C7811j7957J40771R1038a77824d8549A81208N4938a3810B8148J19141
10887A47289b32213K9202A12329a73372G9104c44584d1596B22379a71907A14265
10876d0886d511I3615N2383A3855a42652m7917d005k7316C01109q5952a64033
10864E5208R6269c3294j14545q0837N0339a9869j64077L7846p1191A12791b9476
$$ plain form
10852 79657 -105775 -9811 -12553 -170391 -104787 -108503 -69403 107118 -175469 -100907 219753
10840 -98784 -226774 79358 -47408 155695 -12156 208673 -99076 -209289 221945 70875 -232721
10828 128261 177272 -255535 140431 -188023 -37853 466959 -52875 -263837 95850 -394392
10817 5109 -107890 -149016 -225580 -128534 -146323 -80210 -159373 -81210 -55099 -206133 -94101
10805 75121 103632 -60287 -168375 -191047 -333146 88976 -47354 115534 9898 -171105 -11565
10793 85285 -40109 61950 -154921 337832 -199753 -149227 -199167 -132827 71178 -38891 30920
10781 314304 16460 -113332 -96961 -14512 -22978 151671 -263185 -134365 -56447 332959 36957
10769 -39044 -2387 13182 -25860 -70532 -77969 109728 22466 369736 -287299 -331503 214600
$$ packed form
10852G9657a05775i811k742j57838O5604l716L9100A07118a75469P4562B19753
10840i8784j27990G9358d7408A55695a2156B08673i9076j10213B21945G0875b32721
10828A28261M9011b55535A40431a88023c7853D66959e2875k10962I5850c94392
10817E109a07890m1126p6564R7046j7789O6113p9163P8163K6111j51034i4101
10805G5121K8511f0287j08088k2672j42099H8976d7354A15534I898a71105a1565
10793H5285d0109F1950a54921C37832a99753N0526m9940O6340G1178c8891C0920
10781C14304A6460a13332J6371a4512q466A51671b63185J28820e6447C32959C6957
10769c9044b387A3182b5860m4672p437A09728B2466L47270b87299m4204B14600
$$ plain form
10757 -278906 9823 -21564 -363507 76096 -186376 -68303 -96557 -59149 -202147 76132 484792
10746 484792 -129821 -369312 -119 180890 218766 77344 93110 179502 303377 5974 -99465
10734 -64258 91249 -285687 -102008 -194225 -106725 -311117 100542 -216923 -27053 -416 -986
10723 -986 66349 -368722 -320625 81744 -195315 -7090 223662 -134548 151868 79454 -246469
10711 -432034 -224913 -209393 -280251 -127047 115852 -189499 58143 184476 -275264 -12273
10700 80867 100428 -83604 -6828 -222353 -171510 212662 -324064 38106 1257 -32572 111250
10688 -83422 187410 107091 188503 202075 165199 -178416 145145 -204873 -254442 -156771 -149154
10677 -149154 251066 -148781 141981 -366100 -567142 156757 -71245 -75069 -179756 -258095
$$ packed form
10757b78906I823b1564l41943G6096a86376f8303k8254L7408j42998G6132M08660
10746D84792a29821k39491a19A80890L7876G7344J5766Q6392J23875E974i9465
10734f4258I1249b85687a02008r2217Q7500k04392A00542b16923b7053d16n70
10723i86F6349c68722M8097H1744a95315g090B23662a34548A51868p2414b46469
10711d32034K07121J5520p0858a27047A15852a89499E8143J26333b75264a2273
10700H0867J9561h3604f828k15525N0843B12662c24064C8106A257c2572A11250
10688h3422A87410q0319Q1412J3572l6876a78416A45145b04873m9569R7671P617
10677a49154B51066a48781A41981c66100k01042A56757g1245l824j04687p8339
$$ plain form
10667 -258095 418361 33238 -890 110752 56188 -89289 -59381 -241468 -152810 -192617 297093
10655 -170900 -380784 94886 -15482 109799 32057 -34572 -1352 -46109 202613 -219878 -30228
10643 -94674 -110585 -399966 153301 -249296 -27259 -125509 41819 -71530 -88612 74222 -68157
10631 -145702 -4930 239272 -9873 -108610 226381 -85294 117366 -331428 -244979 -68239 29864
10619 -161286 -459499 225658 44055 -28005 -315352 -251088 -297637 -201618 390836 -51591 -11689
10607 -52962 304395 -98457 -383697 -69666 351439 -405503 332572 137799 -146915 11223
10596 288536 103974 -337444 20954 11196 308799 15906 81893 -259918 -75596 167225 228441
10585 228441 -205339 -59085 -131951 122952 -44834 321705 10908 40359 259732 -182619
$$ packed form
10667b58095D18361C3238h90A10752n4564h9289K9908j82087Q8658l9807B97093
10655a70900k09884I4886a5482A09799C2057c4572a352m4757B02613b19878c0228
10643i4674j5911k89381A53301b49296b7259r8250D1819g1530j7082G4222f8157
10631a45702d930B39272i873r8737B26381h5294A17366c31428Q6449f8239B9864
10619a61286k98213B25658D4055b8005k87347O4264m6549R6019C90836e1591a1689
10607e2962C04395i8457k85240f9666C51439d05503C32572A37799a46915A1223
10596B88536A03974c37444B0954r758K97603A5906O5987b59918g5596A67225O1216
10585B28441b05339e9085p2866A22952d4834C21705A0908K9451K19373a82619
$$ plain form
10574 187796 233185 235541 -72422 40657 225952 18417 -279060 58021 -124676 -45087 -346408
10563 -346408 -97460 -32587 105712 62775 -81712 -248852 -53531 -154673 -205692 -30799 -60060
10552 -60060 16929 -107129 -76390 -3568 -263377 69445 -270361 -65403 -263792 -15258 -262663
10541 -262663 -36444 -113709 96950 -30794 -186127 -87484 -4963 -201444 24808 284060 -105963
10529 -21705 459688 66247 29823 -57785 -133167 259762 7955 -114832 -320336 -76037 21934
10517 405030 218521 92401 94284 117743 31004 59042 195021 -141819 44854 98407 48477
10505 -296995 132910 -115376 49853 -58387 24274 131985 100464 -59960 -125091 -118454 -85043
10494 -85043 -35423 6871 88604 234898 -34347 136686 -323497 7414 254536 243251 -147778
$$ packed form
10574A87796M5389K356g2422D0657J85295A8417b79060E8021a24676d5087l01321
10563c46408i7460c2587A05712m2937h1712j67140e3531j01142n1019c0799k9261
10552f0060A6929a07129L0739c568k59809F9445b70361f5403j98389a5258k47405
10541b62663c6444p7265I6950c0794j55333h7484d963j96481B4808K59252a05963
10529b1705D59688F6247B9823e7785p5382B59762G955a14832k05504g6037B1934
10517D05030j86509I2401J883K3459C1004K8038J35979a41819D4854N3553D8477
10505b96995A32910a15376D9853e8387B4274J07711l1521e9960o5131O637L3411
10494h5043c5423F871Q1733J46294c4347A36686c23497G414K47122j1285a47778
$$ plain form
10482 184647 -172172 256631 -57420 572941 614896 482916 98383 359480 157946 -169743
10471 -141154 -133591 -253329 90316 -104357 220038 -241037 207299 -2464 -302207 121510
10460 -321171 235346 -183654 -110567 -186284 287280 -161127 -283256 128508 145589 -252521
10449 -88573 -143180 -162518 202202 58619 -156406 -26129 -165969 -131649 -180388 -110456 -252567
10438 -252567 -70190 -34593 98760 -66261 17368 -239463 -119414 116729 -248740 242565
10427 131830 36073 56928 -158519 -119183 159549 125682 -103776 7076 129776 -195309 -95029
10415 -100320 -64382 -249398 176449 30525 -74229 -196473 338611 11260 133992 392395
10405 392395 -192499 -303044 343027 177423 57182 262422 -79410 -180613 202339 -238031
$$ packed form
10482A84647a72172B56631e7420E72941M1955j31980I8383K61097A57946a69743
10471a41154P563j19738I0316a04357B20038b41037B07299b464k99743A21510
10460c21171B35346a83654P3087p5717B87280a61127j22129A28508J7081b52521
10449h8573n4607j9338B02202E8619a56406b6129j39840L4320m8739O9932j42111
10438b52567g0190c4593I8760f6261A7368b39463a19414A16729b48740B42565
10427A31830C6073K0855a58519L9336A59549l3867a03776G076J22700a95309i5029
10415a00320L5938j85016A76449C0525g4229j22244C38611A1260J22732K58403
10405C92395a92499j10545C43027j65604E7182K05240g9410j01203B02339b38031
$$ plain form
10394 208517 335549 -277401 -122306 -60170 278217 416366 240954 -35672 51454 89556
10384 89556 76194 194264 -91748 216453 151332 -137016 11888 271581 297726 396757 635974
10373 635974 -44047 379102 251417 264003 343647 473614 348160 588793 416247 687899
10363 687899 633997 415314 432909 452971 172963 388140 245388 171493 151502 29100 412992
10352 412992 541760 380627 378931 851649 633718 353031 178330 358236 712822 573311
10342 573311 372272 493481 39931 356731 332530 252045 349190 251456 330314 256151 11626
10330 332866 166985 65452 134881 191759 -64026 -120483 195993 -18397 420559 330088 197594
10319 197594 286909 147137 243775 -64480 97637 -68115 37521 312360 87093 172961 93072
$$ packed form
10394B08517J27032b77401a22306f0170B78217J38149j75412c5672E1454L8102
10384H9556j3362J18070i1748B16453o5121a37016A1888K59693K6145R9031K39217
10373F35974d4047C79102j27685J2586P9644J29967j25454K40633j72546K71652
10363F87899n3902k18683J7595K0062A72963K15177j42752p3895j9991B9100L83892
10352D12992J28768j61133j696M72718k17931k80687j74701J79906L54586j39511
10342E73311k01039J21209C9931L16800k4201q0485R7145r7734P8858p4163A1626
10330C32866j65881F5452O9429N6878f4026n6457A95993a8397D20559r0471j32494
10319A97594Q9315j39772R6638f4480I7637f8115C7521K74839H7093Q5868p9889
$$ plain form
10308 93072 80420 177333 1270 62162 -100560 -101008 -319071 -131056 -31602 115467 402419
10297 402419 -95484 101016 167499 -24148 -42208 95908 -184498 -8729 -8300 -74252 174279
10285 152080 191775 -164623 -19980 -267830 -70120 -40661 -73015 -232275 -451960 64245 -170982
10273 -120393 -443058 -452834 -60081 148181 -83113 -117214 -212114 49060 -323664 55074 30290
10262 30290 -23801 -18643 -2330 165664 -21017 28533 -120045 79710 -116832 206779 203133
10251 203133 93926 211463 260402 -16158 137107 149851 -281557 26225 94590 172978 -145847
10239 -44020 -291409 525007 -52238 -86412 230983 32841 -47531 162768 110394 14512 83699
10228 83699 61204 -421405 -50722 66257 -154244 -67382 12368 113337 -152351 -147824 -109679
$$ packed form
10308I3072j2652R6913A270O0892a00560m48k18063a31056c1602A15467K86952
10297D02419i5484A01016O6483b4148j8060I5908a84498h729M29o5952A74279
10285A52080L9695a64623a9980k47850g0120K9459l2354j59260k19685F4245a70982
10273a20393l22665r776f0081A48181h3113l4101r4900D9060c23664E5074k4784
10262C0290b3801N158b330A65664b1017B8533a20045G9710a16832B06779l646
10251B03133I3926J17537M8939a6158A37107J2744b81557B6225O8365P8388a45847
10239d4020k47389E25007e2238l4174B30983C2841d7531A62768n2374A4512O9187
10228H3699k2495d21405e0722F6257a54244f7382A2368J00969a52351M527L8145
$$ plain form
10217 -109679 -278515 -236254 -240316 -34292 -142303 4578 156376 -179737 212180 -121350 200378
10205 101600 -56204 -152030 -58253 -410422 -230222 -155039 -47409 -66698 -414522 -141258 210944
10193 124437 -158911 52221 -230756 -121880 -235876 -137172 30477 -5947 69254 27115 -45588
10181 -199031 -183570 -236995 -179967 -5568 -228250 171074 -267225 63399 -203164 -175607 -173439
10170 -173439 452490 92070 -68671 -56807 120147 497187 -7620 -297397 -203965 67732 23238
10158 281202 -109950 159469 -236322 -33277 -161698 -420729 19257 -173380 158137 1367
10147 -74819 -149909 -162625 -151840 90474 88034 -110805 86646 42444 -282367 -22878 -102597
10136 -102597 -90349 76519 208741 102455 -176832 -173583 -9420 -201230 39271 176823 -464184
$$ packed form
10217a09679j68836M2261m062c4292j08011D578J51798a79737B12180a21350B00378
10205A01600e6204r5826e8253l52169J80200P5183d7409j9289l47824a41258B10944
10193A24437a58911E2221b30756J08876j13996R8704C0477e947F9254B7115d5588
10181a99031J5461n3425N7028e568k22682A71074b67225F3399b03164K7557K168
10170a73439D52490I2070f8671J1864A20147L77040g620k89777R3432F7732B3238
10158B81202a09950A59469b36322c3277j28421k59031A9257a73380A58137A367
10147g4819p5090j2716J0785I0474k440a10805H6646D2444b82367b2878p9719
10136a02597J2248G6519J32222A02455a76832L249i420j91810C9271J37552d64184
$$ plain form
10124 -11728 -268507 2727 -165583 -117760 65191 53374 -47095 -238731 -223061 62788 -13260
10112 -353232 -33125 -292884 -344906 207040 -59263 -15364 -987 7678 255317 -205072 -284271
10101 -284271 116414 73363 -424897 199080 -169325 -269685 107869 57706 315746 153969
10090 -159047 -211844 -106482 -227641 323172 124926 -269069 228829 206233 286777 -311388
10079 -41171 60609 151981 -114080 54708 55575 -157712 152065 -208072 -152163 393456 -85411
10067 117325 -114474 -80721 2663 89544 -264364 213921 8464 -21830 -23774 59883 77542
10056 77542 -163245 73965 266207 175359 -198350 -158871 292282 -119884 218671 -320716
10045 -315892 -67789 40521 -247515 -499997 -51258 -139095 -256788 -258750 295607 -17071 -175250
$$ packed form
10124a1728k56779B727a65583M7823F5191j1817d7095j91636J5670F2788a3260
10112c53232c3125k59759n2022B07040e9263a5364i87G678K47639b05072p9199
10101b84271A16414m3051d24897A99080a69325j00360A07869n0163K58040A53969
10090a59047n2797J05362j21159C23172A24926b69069B28829k2596Q0544c11388
10079d1171F0609R1372a14080E4708Q67a57712A52065b08072N5909C93456h5411
10067A17325a14474L3753B663Q6881b64364B13921H464b1830j944E9883J7659
10056G7542a63245G3965J92242r0848a98350L9479B92282a19884B18671c20716
10045c15892f7789D0521b47515k52482e1258q7837j17693j962B95607a7071j58179
$$ plain form
10034 -175250 -298435 33030 -82030 -3479 41930 -134658 -28985 -650632 -150191 152931 -446663
10022 16764 122049 -149045 225676 28142 131187 61477 -58292 284868 -123615 116369
10011 115451 -15447 11829 -6177 -98447 117923 12612 27899 -310730 50484 206763 -134375
9999 186467 -279502 -180546 -208001 -421517 129235 35224 47380 -274253 76819 189908 96870
9988 96870 -394403 -26462 -187095 -133226 -291458 -123801 -8290 296870 -127076 -177143 -87510
9976 -152493 -276887 72011 347549 -36816 -65012 -319390 -319696 -13178 -238866 -310959 47678
9964 30691 -49321 108763 -104684 -341744 -179834 -147010 -119966 -157918 -141696 140726 304288
9953 304288 182395 152571 -275470 74545 273086 -40032 122983 208854 -179253 -388731
$$ packed form
10034a75250j23185C3030h2030c479D1930a34658b8985o21647a50191A52931d46663
10022A6764J05285a49045B25676B8142J03045F1477e8292B84868a23615A16369
10011A15451a5447A1829f177r2270A17923A2612J5287c10730E0484J56279a34375
9999A86467b79502R8956k7455k13516A29235C5224J2156b74253G6819J13089r3038
9988I6870c94403b6462j60633N3869j58232a23801h290B96870a27076n0067h7510
9976a52493j24394G2011K75538c6816k8196k54378l06a3178k25688p2093D7678
9964C0691d9321A08763a04684k37060J61910L2824K7044l7952J6222A40726J63562
9953C04288j21893k9824b75470G4545J98541d0032A22983Q5871a79253k09478
$$ plain form
9943 -388731 -50955 -142571 54846 3964 15973 142472 2651 -408049 -19768 -62469 -162908
9932 -162908 -220118 -323373 -153017 -52018 14251 199136 163907 277773 -7870 -129555 -89669
9921 -89669 158489 -223496 -56890 -153112 -138407 129065 -160601 -199477 -176947 -216508 -16357
9909 79858 -119165 -276060 12847 -15302 -44260 -308921 133888 -185440 -85972 -99847 -194090
9898 -194090 -220551 -134390 118051 -178347 39964 -123801 -205043 -110473 24417 46673 -159397
9886 -377488 -155220 -78792 -74488 -223819 -234474 -237839 -188862 -139050 312837 -229662 -74143
9874 91888 63342 -26117 128428 -510049 78121 -420814 -234487 93494 51585 -141141 -200068
9863 -200068 -293086 -13020 -37948 -2545 -183303 -323426 -107086 -48214 23474 -31234 -154973
$$ packed form
9943c88731e0955r1616E4846C964J2009J26499B651d08049a9768m2701j00439
9932a62908n7210j03255a53017e2018A4251J84885l5229J13866g870j21685L9886
9921h9669A58489b23496e6890r6222J4705A29065a60601l8876K2530l9561a6357
9909G9858a19165j56895A2847a5302k8958k64661A33888a85440h5972j3875r4243
9898a94090k6461Q6161A18051a78347C9964a23801q1242R4570B4417K2256a59397
9886c77488a55220P6428M304j49331j0655l365M8977M9812C12837b29662g4143
9874I1888k8546b6117A28428e10049G8121d20814J86327I3494m1909a41141n8927
9863b00068r3018a3020k4928b545j80758j40123a07086d8214B3474c1234j23739
$$ plain form
9852 -154973 -263593 -166871 -196951 17902 -306203 126556 -235483 40489 246251 -67853 350457
9840 -184886 12902 167786 -27102 -29923 -96297 76971 -31601 -249741 -287143 334137 52067
9828 -77215 -16667 -62396 293750 301069 241156 245307 -202969 -211426 93497 59749 66234 265311
9816 265311 -342201 46395 151790 73126 -368909 -271725 -36011 95194 -536148 -354855 7154
9804 30779 -307219 -297594 234999 55238 138671 -80457 -145608 -150248 29621 -192508 -45129 -353043
9792 -353043 -43699 -15785 27735 -292720 -105760 -83986 344361 46430 115266 259341 121968
9780 -119784 -188025 -156647 -123833 -4649 -16435 77314 55970 149570 -68722 14148 196769 -286188
9767 -167048 105650 -75801 110615 32278 -118922 -70302 -216357 45492 -180057 239719
$$ packed form
9852a54973j08620R6722l0080A7902c06203A26556b35483D0489K05762f7853C50457
9840a84886A2902J54884b7102k821o6374G6971c1601k18140l7402C34137E2067
9828g7215a6667m5729B93750P319n9913M151b02969q457I3497l3748O485J99077
9816B65311c42201D6395J05395G3126c68909R7184c6011I5194e36148J81293G154
9804C0779c07219R625B34999E5238Q3433h0457o5151m640B9621a92508d5129l07914
9792c53043d3699a5785B7735b92720a05760K1774C44361D6430O8836J44075A21968
9780a19784o8241L1378L2814d649j1786G7314k1344R3600f8722A4148J82621b86188
9767a67048A05650g5801A10615C2278a18922M8620j46055D5492a80057B39719
$$ plain form
9756 28529 -309845 -187946 -371712 -89234 -143724 20168 -275786 -356899 -253040 -45352 -292287
9745 -292287 -202234 -51707 -47017 -172057 161426 134353 98935 126913 141810 -187539 -126424
9734 -126424 21331 61616 63791 231772 -470506 -248459 -51947 -258832 -18295 -33499 -24829
9723 -24829 -68233 -196043 -116770 -199899 -219704 47597 -59363 17403 -56472 206980 -81009
9711 73220 -83044 -127043 40276 -113431 894 -123649 -11308 -172269 58830 -139351 -219285
9700 -219285 11330 -173142 337446 -36414 121502 85905 -298893 15367 -178448 -150122 -205726
9689 -205726 -68162 266464 -205771 -321245 84076 119163 -266117 -49116 -151173 22841 127435
9678 127435 -119571 -110797 -102321 250616 -50630 -223226 -20006 -100508 -495513 173252 -63780
$$ packed form
9756B8529c09845J21899j83766h9234n4490B0168b75786q1113J03859d5352k46935
9745b92287R0053e1707M690j25040A61426k7073l5418K7978J4897a87539O1115
9734a26424B1331M0285K175J67981d70506K22047e1947k06885a8295j5204Q670
9723b4829m3404j27810P9273q3129j9805D7597e9363A7403e6472B06980h1009
9711G3220h3044m3999D0276a13431H94a23649a1308j60961E8830a39351p9934
9700b19285A1330a73142C37446c6414A21502l5597b98893A5367a78448K8326n5604
9689b05726f8162B66464b05771j15474H4076L5087b66117d9116j02057B2841J04594
9678A27435a19571Q774Q476B50616e0630j72596b0006q0502l95005A73252f3780
$$ plain form
9666 -618133 -117719 -194522 -222034 -70468 204761 -140473 -20181 -132081 214366 -94411 38662
9654 38552 162019 274245 44800 -235847 71294 -191733 180785 366931 -143696 -114663
9644 -114663 -414145 187014 -256787 -193483 -196065 -264531 56461 -89554 -292386 -98221 -9845
9632 -296062 -91735 -4791 79636 -71702 -63994 47145 9365 -122990 -33682 -243715 -133779 -9921
9619 -174331 -161110 -51242 -43659 -15494 -121699 17535 -31222 142987 -243021 -79178 -249839
9608 -249839 12045 -126647 170740 -101246 -306181 -66996 -139151 -272464 -206036 -60532 -120110
9597 -120110 -112452 -101580 -196427 -333831 69498 279420 13082 -64349 23223 -530777 -57526
9585 -93502 -235317 -27553 -264618 -37065 1106 47707 -126471 13965 153454 -69124 -178493
$$ packed form
9666f18133a17719p6803k7512g0468B04761a40473b0181j11900B14366i4411C8662
9654C8552J23467J12226D4800b35847G1294a91733A80785J86146a43696K9033
9644a14663k99482A87014b56787O3304k582o8466E6461h9554k02832i8221i845
9632b96062i1735d791G9636g1702P708D7145I365a22990c3682k10033J09936i921
9619a74331J3221e1242P583a5494j06205A7535c1222A42987b43021g9178j70661
9608b49839A2045a26647A70740a01246k04935f6996p2155j33313O6428f0532n9578
9597a20110P658J0872r4847j37404F9498K09922A3082f4349B3223e30777e7526
9585i3502j41815b7553k37065c7065A106M6601a26471A3965J39489f9124j09369
$$ plain form
9574 -178493 -85508 -253907 -125412 89235 275674 -17291 -231930 28832 9877 -275568 -92218
9562 19319 -118690 -273981 -23701 46823 -59443 -214055 -30514 -115029 -38365 91736 313110
9551 313110 -45932 -3210 -163621 401074 -142573 -142624 -25653 -17005 -95813 114099 -140268 168569
9538 -471406 59188 1400 -167463 -297360 -334250 144611 74750 179526 -71109 -33638 -90977
9527 -90977 -232514 76038 -185066 75450 93776 32629 -75909 -226541 302416 88557 -127900
9515 -17250 213716 8262 145978 -5131 -287230 -68327 -270628 -273764 16832 -68340 -188917
9504 -188917 7953 -188954 214489 -201808 -316935 -316154 -424370 -58394 -58494 6844 109811 -69620
9491 -133269 138394 -313908 119759 -100837 76746 -95174 116748 -11322 321866 -35460
$$ packed form
9574a78493h5508j68399a25412H9235J86439a7291k14639B8832I877b75568i2218
9562A9319a18690j55291b3701D6823e9443j54612c0514q4515c8365I1736K21374
9551C13110d5932c210j60411D01074a42573n1b5653Q648p8808A14099a40268A68569
9538d71406E9188A400a67463j29897l6890A44611o9861J04776g1109c3638n7339
9527i0977j41537G6038a85066G5450J8326C2629g5909j50632C02416H8557a27900
9515a7250B13716H262J37716e131k82099f8327k02301l136A6832f8340j20577
9504a88917G953a88954B14489b01808j15127P81j08216e8394j00F844J02967f9620
9491a33269A38394c13908A19759a00837G6746i5174A16748a1322C21866c5460
$$ plain form
9480 16505 -12845 -421645 -230667 8816 16866 -185664 -155221 -371676 -248490 -206598 -97981
9468 -211580 -216704 30978 67659 -161731 -116658 -985 51291 58670 -105089 -230883 -173462 -225798
9456 -225798 -146379 -181682 -98349 -114297 -134175 131646 -186153 -64463 -193449 158001 42271
9444 246254 101074 -342742 -199189 -85165 -52670 130656 -438125 227860 -68494 423849
9433 -94528 -184701 -156365 151251 -251183 91538 151775 -157201 -178779 -199326 -227966 -98677
9421 -273726 -83536 -99075 -136569 -94356 110111 -6985 28987 -217996 204527 -199605 102509
9409 74097 72071 -67530 -204468 -4813 206750 75552 -34262 -96964 -25072 333019 194677
9398 194677 -322398 35428 -170986 3820 117324 249908 -252301 -328413 53367 265857 -14188
$$ packed form
9480A6505a2845m08800J90978H816Q050a85664L0443k16455J23186M1892i7981
9468b11580n124C0978L6681a61731M5073i85E1291P379a05089j25794N7421n2336
9456b25798P9419l5303Q3333j5948j9878A31646a86153f4463j28986A58001D2271
9444B46254A01074c42742J43553h5165L2495A30656d38125B27860f8494D23849
9433i4528r0173K8336A51251b51183I1538O0237a57201k1578k0547k8640i8677
9421b73726h3536j5539l7494M2213A10111f985B8987b17996B04527a99605A02509
9409G4097k026f7530j36938d813B06750G5552c4262o2702b5072C33019j38342
9398A94677c22398C5428a70986C820J13504J32584b52301p6112E3367K12490a4188
$$ plain form
9386 -19964 -43652 211022 -222036 -16358 -537511 -265223 134128 -217578 -313659 -243427 -61524
9374 -115201 -44562 3948 -7911 158373 82929 42653 195097 -160071 -162868 264028 48043
9362 -34741 -156653 372123 -152402 -144583 -16055 -54671 58431 -24858 38228 -220351 -239148
9351 -239148 10792 -173086 -35139 -151708 -220143 188524 19848 25968 -325411 -152402 80502
9339 -219738 -367069 -45001 113797 95444 -248299 -59528 82685 -1138 -285708 -104707 -83885
9328 -83885 158074 -239757 -288602 -407617 -232287 -269862 84460 -400805 -228775 -132500 -65583
9316 -356595 235889 -79243 174697 136330 101995 -111257 -54382 147614 -191638 85398 -207289
9304 234865 -226877 -234049 225323 50169 -28463 -75127 220899 -437701 25077 -85545 -203863
$$ packed form
9386a9964k3688B11022b22036a6358n21153b65223A34128b17578r6081P0232f1524
9374a15201d4562C948g911A58373p5444m0276J52444a60071k797B64028D8043
9362c4741j21912C72123a52402P819a6055l8616E8431b4858C8228b20351j8797
9351b39148A0792a73086c5139j16569o8435A88524A9848O120c25411a52402H0502
9339b19738j47331d5001A13797j8353b48299e9528H2685a138k84570a04707K0822
9328h3885A58074b39757m8845j19015J75330l7575H4460d00805J72030R6275f5583
9316c56595B35889g9243A74697l8367l4335a11257e4382A47614a91638H5398b07289
9304B34865b26877p172B25323E0169b8463m6664B20899d37701B5077h5545j18318
$$ plain form
9293 -203863 -256122 -218862 236675 -179192 -15266 -305206 -227908 -20306 15038 -389206 75975
9281 196449 36609 -12437 -237764 -193968 37592 13549 -134999 -160984 -64328 -397332 211368
9269 -27999 -35439 357606 -321268 -103748 -86863 -98743 227462 197590 -72829 109810 -315875
9257 -192121 -367467 -329640 -11722 -6735 -98035 -31156 -21869 -297174 -107954 -313634 -195682
9246 -195682 -202447 231884 -64101 -329521 120234 -123618 -274550 -357454 -232905 59475 -54524
9234 -188408 -92662 23763 209898 47333 -184652 175200 28886 -32075 -1408 16038 144535
9223 144535 -307123 -422563 -280008 -314315 209320 -82611 -71520 -3611 -4021 61253 -159451
9211 -127079 -123282 118718 -328996 -351682 34768 -79163 -45056 220324 -315568 208418 -152304
$$ packed form
9293b03863n2259L7260B36675a79192a5266k89940P7298b0306A5038c89206G5975
9281A96449C6609a2437k25327M3796C7592A3549a34999k5985f4328l33004B11368
9269b7999p440C57606c21268a03748J6885j1880B27462k9872g2829A09810c15875
9257a92121j75346L7827a1722M987r1300c1156R287k75305a07954k05680J17952
9246a95682o765B31884f4101k65420A20234a23618j50932q2904J24549E9475e4524
9234a88408i2662B3763J86135D7333a84652A75200B8886c2075a408A6038J28497
9223A44535c07123j15440J42555l4307B09320h2611J1091c611m10F1253a59451
9211a27079L797A18718c28996k2686C4768g9163L4107B20324c15568B08418a52304
$$ plain form
9199 -16362 -182083 -145271 -94388 -197752 -12565 -124028 -189254 -6339 107436 -115727 -87353
9188 -87353 -74430 10115 -82660 -337356 -353413 -42004 -47213 -277415 79127 -124131 -69097
9177 -69097 7972 -146519 -294676 -187661 79 156528 -182314 -411167 243361 10307 -14873
9165 46032 -416050 -27889 1821 275517 -145045 -142032 -79756 -31219 75308 -308226 -190761
9154 -190761 28171 88727 217733 19769 -202424 56091 131727 106589 69083 -336461 -203521
9143 -203521 -140606 -217428 169915 -59517 -153302 -87080 -62400 228303 134408 72471 -142802
9131 -363411 -394954 268518 -50461 107443 32273 -454767 77610 -245090 179806 72336 35480
9119 25201 109490 -272938 264471 -68176 -35778 -103978 -108026 -346890 88299 -97004 23249
$$ packed form
9199a6362j65721L6812N0883j03364a2565j11463o5226f339A07436a15727K8374
9188h7353J2923A0115h2660k54696j6057d2004n209k30202G9127a24131N5034
9177f9097G972a46519j48157J07015G9J56449a82314k28853B43361A0307a4873
9165D6032d16050b7889A821K73696a45045L013O2276c1219G5308c08226J17465
9154a90761B8171O0556J29006A9769b02424E6091P5636k5138l7506c36461J32940
9143b03521O2915p6822A69915e9517r3785O6222K4680B28303r3895o1937a42802
9131c63411l1543B68518e0461A07443C2273d54767G7610b45090A79806G2336C5480
9119B5201Q4289b72938B64471f8176L2398o8200m048k38864H8299i7004B3249
$$ plain form
9107 25253 -28407 -249491 -9405 85935 -550119 -166035 -239474 103355 -174958 197667 -253439
9095 35891 153982 85877 297765 -214027 41884 -316175 -283910 206849 140874 -140199 -170302
9084 -170302 -150296 361761 -187431 -209795 -180411 211541 148720 -292870 154321 167323 -301571
9072 -192703 -331076 56684 -138870 -246131 -31803 50660 -135078 -240887 -265830 -354157 -55912
9060 -150725 -63733 319560 -19551 -138356 -153514 -10890 -274076 -354746 62707 324722 -80144
9048 -278474 -138385 -153213 -95196 53836 -29145 -169915 78300 -343327 334155 -9444 65144
9036 124662 154313 -169877 214731 95762 111926 -164633 32689 18456 -85008 13016 174995
9025 174995 -214897 128928 -313961 299821 -88217 -318940 251602 -131432 -50911 250475
$$ packed form
9107B5253b8407k21084i405H5935e50119a66035p3439A03355a74958A97667b53439
9095C5891J18091o8105K11888b14027D1884c16175L2265B06849o5975a40199l0103
9084a70302K0006C61761a87431k2364K9384B11541o2821b92870A54321J3002c01571
9072a92703j38373E6684a38870j07261c1803E0660a35078j05809k4943q8327e5912
9060a50725f3733C19560a9551j18805j5158a0890k63186q0670F2707K62015h0144
9048b78474a38385j4828N8017E3836b9145j40770G8300c43327C34155i444F5144
9036A24662K9651a69877B14731I5762J6164a64633C2689j4233h5008A3016J61979
9025A74995b14897A28928c13961B99821h8217k30723B51602a31432e0911B50475
$$ plain form
9014 -121354 -149398 -11414 -307591 209220 -53294 -121827 -92834 -305791 -133013 -249825 116800
9002 3516 -20935 98058 -13617 -223836 62587 112488 -155975 -95551 81931 81729 -326805 -226384
8990 -226384 222049 -4747 -118652 73990 207055 -32973 128588 124197 263399 -135302 -179873
8979 -179873 -236823 -138772 113303 -292442 -228661 -106343 -89531 45051 -103927 -122850 106424
8967 -62557 12870 -66849 153861 -174699 -256255 -326941 107682 10176 -266490 -6157 -254716
8956 -254716 -251679 -247786 335707 -101761 -219666 100575 62327 110170 -103873 -18140 -260651
8945 -260651 -123380 96804 -62055 -12745 153077 30210 57026 35385 -25961 -49757 444815
8933 52002 -218348 73300 -335789 261265 94544 345335 -168010 -495970 306542 193264
$$ packed form
9014a21354k8044a1414k96177B09220e3294o8533K8993k12957a33013j16812A16800
9002C516b0935I8058a3617k10219F2587M9901a55975O0424H1931k02c26805J00421
8990b26384B22049d747j13905G3990J33065c2973A28588m391J39202a35302m4571
8979a79873n6950R8051A13303b92442O3781a06343J6812D5051a03927j8923A06424
8967f2557A2870f6849A53861a74699q1556p0686A07682A0176b66490f157k48559
8956b54716L037L893C35707a01761j17905A00575l8248M7843a03873a8140k42511
8945b60651a23380I6804f2055a2745A53077C0210K6816k1641b5961k3796D44815
8933E2002b18348G3300c35789B61265I4544K50791a68010l27960C06542j13278
$$ plain form
8923 193264 529574 1872985 3263627 1623606 170515 -85208 196641 -43589 10019 109269
8913 109269 6671 95424 52783 154860 -76266 -91263 -310180 -131964 -117641 -97248 39462
8901 -66716 -272176 89405 33402 -16270 141480 -220092 80232 -74850 -264463 29551 12751
8889 605 -132543 -42634 -407107 -34894 -237870 -322061 -19889 -134428 -309026 -258412 -16991
8877 -53516 93567 70462 -58080 -55339 76215 -137820 116717 165817 -215762 -191310 -168012
$$ packed form
8923A93264L36310J343411J390642A623606A70515h5208A96641d3589A0019R9250
8913A09269F671Q8753m2641J02077g6266j4997k18917a31964J4323K0393C9462
8901f6716k05460H9405C3402a6270A41480b20092H0232g4850j89613B9551A2751
8889F05a32543d2634l64473c4894k02976q4191a9889j14539j74598N0614a6991
8877e3516I3567k3105e8080K741G6215a37820A16717M9100b15762K4452K3298
$$ [...]
##END NTUPLES=NMR SPECTRUM
##END=
