##TITLE=AC1683_2985_8571279_yJtKDicOSf
##JCAMPDX= 6.0         $$ Bruker NMR JCAMP-DX V2.0
##DATA TYPE= NMR SPECTRUM
##DATA CLASS= NTUPLES
##ORIGIN= BRUKER
##OWNER= Administrator
$$ 1.72 TOPSPIN		Version 2.1
$$ 2014-04-11 18:37:50.721 -0700  Administrator@X
$$ Compression mode = diff/dup
##.OBSERVE FREQUENCY= 400.02188249412
##.OBSERVE NUCLEUS= ^1H
##.ACQUISITION MODE= SIMULTANEOUS (DQD)
##.ACQUISITION SCHEME= undefined
##.AVERAGES= 64
##.DIGITISER RES= 22
##SPECTROMETER/DATA SYSTEM= spect
##.PULSE SEQUENCE= noesygpps1d.comp
##.SOLVENT NAME= COFFEE_meoh
##.SHIFT REFERENCE= INTERNAL, COFFEE_meoh, 1, 14.96144
##AUDIT TRAIL= $$ (NUMBER, WHEN, WHO, WHERE, PROCESS, VERSION, WHAT)
$$ ##TITLE= Audit trail, TOPSPIN		Version 2.1
$$ ##JCAMPDX= 5.01
$$ ##ORIGIN= Bruker BioSpin GmbH
$$ ##OWNER= Administrator
$$ $$ E:\/data/COFFEE/nmr/AC1683_2985_8571279_yJtKDicOSf/32/pdata/1/auditp.txt
$$ ##AUDIT TRAIL=  $$ (NUMBER, WHEN, WHO, WHERE, PROCESS, VERSION, WHAT)
(   1,<2014-04-11 18:37:45.221 -0700>,<Administrator>,<X>,<go>,<TOPSPIN 2.1>,
      <created by zg
	started at 2014-04-11 18:26:15.703 -0700,
	POWCHK enabled, PULCHK disabled,
       configuration hash MD5:
       C8 4E 4E 5D D3 5C D8 9E 9F 52 82 E0 59 8A DE 15
       data hash MD5: 64K
       B7 21 A6 D6 7D 78 C6 E8 0F AB CA 91 71 9D 59 61>)
(   2,<2014-04-11 18:37:48.346 -0700>,<Administrator>,<X>,<proc1d>,<TOPSPIN 2.1>,
      <Start of raw data processing
       efp LB = 0.3 FT_mod = 6 PKNL = 1 PHC0 = 0 PHC1 = 0 SI = 128K 
       data hash MD5: 128K
       05 DE 84 8F B3 26 81 92 E0 66 57 54 51 4F 0F EE>)
(   3,<2014-04-11 18:37:49.424 -0700>,<Administrator>,<X>,<proc1d>,<TOPSPIN 2.1>,
      <pk PHC0 = -83.83118 PHC1 = 0 
       data hash MD5: 128K
       CF 3A 05 34 C3 91 91 3A 88 78 08 B7 93 00 D2 38>)
(   4,<2014-04-11 18:37:49.892 -0700>,<Administrator>,<X>,<proc1d>,<TOPSPIN 2.1>,
      <abs ABSG = 1 
       data hash MD5: 128K
       42 5C FF 6F 75 7B 32 45 39 96 DE A1 6B 93 1F C0>)
(   5,<2014-04-11 18:37:50.033 -0700>,<Administrator>,<X>,<proc1d>,<TOPSPIN 2.1>,
      <abs ABSG = 2 
       data hash MD5: 128K
       AB 4A 0D 62 6C C7 AE 57 A2 6C ED 99 1E B4 57 70>)
(   6,<2014-04-11 18:37:50.158 -0700>,<Administrator>,<X>,<proc1d>,<TOPSPIN 2.1>,
      <abs ABSG = 3 
       data hash MD5: 128K
       AC E8 60 2A 72 22 CA 25 4F 58 98 3E C9 F6 E0 D6>)
(   7,<2014-04-11 18:37:50.330 -0700>,<Administrator>,<X>,<proc1d>,<TOPSPIN 2.1>,
      <abs ABSG = 4 
       data hash MD5: 128K
       1F 0A 4D B8 F6 8E 49 0F CB FA D6 AD AA 05 85 34>)
(   8,<2014-04-11 18:37:50.424 -0700>,<Administrator>,<X>,<proc1d>,<TOPSPIN 2.1>,
      <abs ABSG = 5 
       data hash MD5: 128K
       7C 9C AD 5A BE DA 81 72 84 B0 3E D8 3C 03 B6 AE>)
$$ ##END=
$$ 
$$ $$ hash MD5
$$ $$ 2E CA 96 7C 32 24 EF 7F 69 73 09 A6 31 C3 D5 69
##$RELAX= 
##$RELAX= 
##$RELAX= 
##$RELAX= 
##$RELAX= 
##$RELAX= 
##$RELAX= 
##$RELAX= 
$$ Bruker specific parameters
$$ --------------------------
##$DU= <E:\>
##$EXPNO= 32
$$ [...]
##$TP07= 0
##$TPNAME0= <>
##$TPNAME1= <>
##$TPNAME2= <>
##$TPNAME3= <>
##$TPNAME4= <>
##$TPNAME5= <>
##$TPNAME6= <>
##$TPNAME7= <>
##$TPOAL= (0..7)
0.5 0.5 0.5 0.5 0.5 0.5 0.5 0.5
##$TPOFFS= (0..7)
0 0 0 0 0 0 0 0
##$TUNHIN= 0
##$TUNHOUT= 0
##$TUNXOUT= 0
##$USERA1= <user>
##$USERA2= <user>
##$USERA3= <user>
##$USERA4= <user>
##$USERA5= <user>
##$V9= 5
##$VALIST= <valist>
##$VCLIST= <CCCCCCCCCCCCCCC>
##$VD= 0
##$VDLIST= <DDDDDDDDDDDDDDD>
##$VPLIST= <PPPPPPPPPPPPPPP>
##$VTLIST= <TTTTTTTTTTTTTTT>
##$WBST= 1024
##$WBSW= 4
##$XGAIN= (0..3)
0 0 0 0
##$XL= 0
##$YL= 0
##$YMAX_a= 6524167
##$YMIN_a= -14158589
##$ZGOPTNS= <>
##$ZL1= 120
##$ZL2= 120
##$ZL3= 120
##$ZL4= 120
##$ABSF1= 14.96144
##$ABSF2= -5.596742
##$ABSG= 5
##$ABSL= 3
##$ALPHA= 0
##$AQORDER= 0
##$ASSFAC= 0
##$ASSFACI= 0
##$ASSFACX= 0
##$ASSWID= 0
##$AUNMP= <proc_prof1d_extract.lims>
##$AXLEFT= 0
##$AXNAME= <>
##$AXNUC= <1H>
##$AXRIGHT= 0
##$AXTYPE= 0
##$AXUNIT= <>
##$AZFE= 0.1
##$AZFW= 0.1
##$BCFW= 0
##$BC_mod= 0
##$BYTORDP= 0
##$COROFFS= 0
##$CY= 15
##$DATMOD= 1
##$DC= 0
##$DFILT= <>
##$DTYPP= 0
##$F1P= 0
##$F2P= 0
##$FCOR= 0.5
##$FTSIZE= 131072
##$FT_mod= 6
##$GAMMA= 0
##$GB= 0
##$INTBC= 1
##$INTSCL= 1
##$ISEN= 128
##$LB= 0.3
##$LEV0= 0
##$LPBIN= 0
##$MAXI= 10000
##$MC2= 0
##$MEAN= 0
##$ME_mod= 0
##$MI= 0
##$NCOEF= 0
##$NC_proc= -2
##$NLEV= 6
##$NOISF1= 0
##$NOISF2= 0
##$NSP= 0
##$NTH_PI= 0
##$NZP= 0
##$OFFSET= 14.96144
##$PC= 1
##$PHC0= -83.83118
##$PHC1= 0
##$PH_mod= 1
##$PKNL= yes
##$PPARMOD= 0
##$PPDIAG= 0
##$PPIPTYP= 0
##$PPMPNUM= 2147483647
##$PPRESOL= 1
##$PSCAL= 4
##$PSIGN= 0
##$PYNMP= <proc.py>
##$REVERSE= no
##$SF= 400.020009461743
##$SI= 131072
##$SIGF1= 0
##$SIGF2= 0
##$SINO= 400
##$SIOLD= 131072
##$SPECTYP= <>
##$SREGLST= <1H.CDCl3>
##$SSB= 0
##$STSI= 131072
##$STSR= 0
##$SW_p= 8223.68421052631
##$SYMM= 0
##$S_DEV= 0
##$TDeff= 65536
##$TDoff= 0
##$TI= <>
##$TILT= no
##$TM1= 0
##$TM2= 0
##$TOPLEV= 0
##$USERP1= <user>
##$USERP2= <user>
##$USERP3= <user>
##$USERP4= <user>
##$USERP5= <user>
##$WDW= 1
##$XDIM= 131072
##$YMAX_p= 274884744
##$YMIN_p= -12035
##$CURPLOT= <Network HP LaserJet P1505>
##$CURPRIN= <$Network HP LaserJet P1505>
##$DFORMAT= <normdp>
##$LAYOUT= <+/1D_H.xwp>
##$LFORMAT= <normlp>
##$PFORMAT= <normpl>
##$SURQMSG= 1
$$ End of Bruker specific parameters
$$ ---------------------------------
##NTUPLES= NMR SPECTRUM
##VAR_NAME=  FREQUENCY,     SPECTRUM/REAL,   SPECTRUM/IMAG
##SYMBOL=    X,             R,               I
##VAR_TYPE=  INDEPENDENT,   DEPENDENT,       DEPENDENT
##VAR_FORM=  AFFN,          ASDF,            ASDF
##VAR_DIM=   131072,        131072,          131072
##UNITS=     HZ,            ARBITRARY UNITS, ARBITRARY UNITS
##FACTOR=    0.0627417313425164, 1,          1
##FIRST=     8223.62146879497, 2543,         -66268
##LAST=      0,             3807,            -66800
##MIN=       0,             -12035,          0
##MAX=       8223.62146879497, 274884744,    0
$$ Real data points
##PAGE= N=1
##DATA TABLE= (X++(R..R)), XYDATA
$$ [...]
63679D21349L527L515L255L351L711L846L793M060M672M935M492L903L741L618
63665D75768K801J468N56M31M49j1p64j355j870k736l978n064n477n222m780m626
63649D45590m738m590l783k674k037k076k110j455k69P49J262J498J745J968J991
63634D31071J817J698J954K705L740M719N536O337P191P993Q812R936J1388J2679
63620E17576J3417J3864J4592J5738J7022J8235J9299J9968J9993J9558J9126
63609G08388J8797J8283J7591J7133J6958J6401J4880J2642J0353Q225O003L628
63597H69282J412n02k355m353o269p755q828r803j0750j1313j1182j0635j0362
63584G76587j0751j1525j2161j2423j2284j1631j0362q791p558o994o790o390
$$ y = [421349, 424876, 428391, 431646, 434997, 438708, 442554, 446347, 450407, 455079, 460014, 464506, 468409, 472150, 475768, 478569, 480037, 480593, 481024, 481473, 481462, 480698, 479343, 477473, 474737, 470759, 465695, 460218, 454996, 450216, 445590, 440852, 436262, 432479, 429805, 427768, 425692, 423582, 422127, 421858, 422607, 423869, 425367, 427112, 429080, 431071, 432888, 434586, 436540, 439245, 442985, 447704, 453240, 459577, 466768, 474761, 483573, 493509, 504897, 517576, 530993, 544857, 559449, 575187, 592209, 610444, 629743, 649711, 669704, 689262, 708388, 727185, 745468, 763059, 780192, 797150, 813551, 828431, 841073, 851426, 859651, 865654, 869282, 870694, 870192, 867837, 863484, 857215, 849460, 840632, 830829, 820079, 808766, 797584, 786949, 776587, 765836, 754311, 742150, 729727, 717443, 705812, 695450, 686659, 679101, 672107, 665317, 658927]
63572F58927n583m568l562k475j032P89K444L190K959K697L506N512P923J0166
63558F80893J2403J4801J6919J8324J9433K1114K3428K5339K5837K4980K3648
63547I07119K2507K1562K0563J9528J8686J8056J7249J5638J2683Q237K784k603
63535A082009o852r644j1550j3276j4903j6048j6557j6780j7152j7765j8373j8707
63523I04402j8790j8993j9644k0524k1026k0970k0835k0869k0434j8875j6733
63512F86709j5198j4460j3557j2030j0724j0405j0391r392p279n273m510m986
63500E68504n829o095n367l995k767k175k006j856j710j748j835j639j123n15
63486E29844J22R28J881K718L183L203K906K559K321J961J147J23l51pM74L93
$$ y = [658927, 653344, 648776, 645214, 642739, 641707, 642496, 644940, 648130, 651089, 653786, 657292, 662804, 670727, 680893, 693296, 708097, 725016, 743340, 762773, 783887, 807315, 832654, 858491, 883471, 907119, 929626, 951188, 971751, 991279, 1009965, 1028021, 1045270, 1060908, 1073591, 1081828, 1084612, 1082009, 1075157, 1065513, 1053963, 1040687, 1025784, 1009736, 993179, 976399, 959247, 941482, 923109, 904402, 885612, 866619, 846975, 826451, 805425, 784455, 763620, 742751, 722317, 703442, 686709, 671511, 657051, 643494, 631464, 620740, 610335, 599944, 590552, 583273, 578000, 573490, 568504, 562675, 556580, 551213, 547218, 544451, 542276, 540270, 538414, 536704, 534956, 533121, 531482, 530359, 529844, 529966, 530894, 532775, 535493, 538676, 541879, 544785, 547344, 549665, 551626, 552773, 552896, 552545, 552538, 553012, 553405]
63470E53405j11o18j262k257l071l022k483k577l637m831n358n172m423l125j625
63455E09833n96j59L40J280K152K480K806M163O810J0007J2826J4940J6727J8803
63441F02412K1179K2974K3330K2569K1822K1506K1063K0355K0206K1030K1908
63430H40354K1942K1575K1498K1060J9134J6126J3533J1614R142N743K904J927
63418A006552K210K512K838L926N558O723P092P105O715N264K699j29k699n368
63404A050998q306j0774j2143j2957j4114j5508j6330j6532j6995j8150j9228
63393H89961j9323j8680j8406j9122k0303k0916k0426j9051j7261j5281j3168
63382F88024j1215r841q984p972o265m072j884K65K496M389N361N790O909R290
$$ y = [553405, 553294, 552676, 551414, 549157, 546086, 543064, 540581, 538004, 534367, 529536, 524178, 519006, 514583, 511458, 509833, 509237, 509078, 509418, 510698, 512850, 515330, 518136, 522299, 529109, 539116, 551942, 566882, 583609, 602412, 623591, 646565, 669895, 692464, 714286, 735792, 756855, 777210, 797416, 818446, 840354, 862296, 883871, 905369, 926429, 945563, 961689, 975222, 986836, 995978, 1001721, 1004625, 1006552, 1008762, 1011274, 1014112, 1018038, 1023596, 1030319, 1037411, 1044516, 1051231, 1056495, 1059194, 1059065, 1056366, 1050998, 1042692, 1031918, 1019775, 1006818, 992704, 977196, 960866, 944334, 927339, 909189, 889961, 870638, 851958, 833552, 814430, 794127, 773211, 752785, 733734, 716473, 701192, 688024, 676809, 666968, 657984, 650012, 643747, 639675, 637791, 638056, 640552, 644941, 650302, 656092, 663001, 672291]
63368F72291J2108J4321J5927J7511J9082K0096K0374K0293K0204K0142K0059
63357H72408J9881J9366J8315J6935J5655J4650J3815J2989J1857R913O960L554
63345A036298M89k040m328o432q124r421j0629j1808j2769j3519j4201j4596j4283
63332I14637j3331j2349j1713j1311j1025j0895j0748j0343j0017j0480j1680
63321G90745j2549j2223j0974r526q098o655n672n941p752j0559j3422j5469j6326
63308F55579j6341j6297j6596j6855j6412j4985j2803j0388q358p066o304n619
63296E07555m979m679m621m300l598l024k887k902k830k898l137l045k334j481
63282D60840j023q52o59n19n13l79n9pl96o24k64K31M46Q05J581J946J213L30
$$ y = [672291, 684399, 698720, 714647, 732158, 751240, 771336, 791710, 812003, 832207, 852349, 872408, 892289, 911655, 929970, 946905, 962560, 977210, 991025, 1004014, 1015871, 1025784, 1032744, 1036298, 1036787, 1034747, 1030419, 1023987, 1015863, 1006442, 995813, 984005, 971236, 957717, 943516, 928920, 914637, 901306, 888957, 877244, 865933, 854908, 844013, 833265, 822922, 812905, 802425, 790745, 778196, 765973, 754999, 745473, 737375, 730720, 725048, 719107, 711355, 700796, 687374, 671905, 655579, 639238, 622941, 606345, 589490, 573078, 558093, 545290, 534902, 526544, 519478, 513174, 507555, 502576, 497897, 493276, 488976, 485378, 482354, 479467, 476565, 473735, 470837, 467700, 464655, 462321, 460840, 459817, 458965, 458306, 457787, 457274, 456895, 456836, 456829, 456433, 455809, 455545, 455776, 456222, 457027, 458608, 460554, 461767, 462097]
63264D62097O69J788K047J237Q02J338J697J167Q19J689K995L373K940K781L072
63249D90511L036K512K313K975M016M710N009N414O370P892R576J0881J1539J1696
63235E78450J1725J1986J2815J4296J5907J6789J6723J6456J6804J7701J8586
63224G48238J9306K0129K1028K1570K1493K0974K0256J9404J8539J7898J7557
63213I66392J7286J6755J5660J3633J0454O607L281J340L16j205m052p620j0709
63200A028138j2913j4715j6393j7483j7600j7186j6932j6720j5792j3843j1389
63189H57172r040o916m928l127j411O41L307O253Q851J0862J2537J4111J5487
63176I03799J6454J7047J7488J7824J7801J7246J6452J5837J5196J3796J1479
$$ y = [462097, 462766, 464554, 466601, 467838, 468640, 469978, 471675, 472842, 473661, 475350, 478345, 481718, 484658, 487439, 490511, 493547, 496059, 498372, 501347, 505363, 510073, 515082, 520496, 526866, 534758, 544334, 555215, 566754, 578450, 590175, 602161, 614976, 629272, 645179, 661968, 678691, 695147, 711951, 729652, 748238, 767544, 787673, 808701, 830271, 851764, 872738, 892994, 912398, 930937, 948835, 966392, 983678, 1000433, 1016093, 1029726, 1040180, 1046787, 1050068, 1051408, 1051724, 1050519, 1046467, 1038847, 1028138, 1015225, 1000510, 984117, 966634, 949034, 931848, 914916, 898196, 882404, 868561, 857172, 848132, 841216, 836288, 833161, 831750, 832391, 835698, 841951, 850802, 861664, 874201, 888312, 903799, 920253, 937300, 954788, 972612, 990413, 1007659, 1024111, 1039948, 1055144, 1068940, 1080419]
63165A080419R160P722O793N275K763k64l482o982j0467j3216j5180j7208j9691
63152A025642k1812k2753k2931k3226k3579k3288k2323k1435k0969k0448j9357
63141G83521j7675j5556j3129j0747q901p671o707n840n268m952m361l134j680
63128F77900p51o24r30j130r64n60k99m78q79q48K0J300K087J938J279P81N40
63111F78382J80l89p21n24k46n70j477k189k057j126P6R33R56J17q63j053l34
63094F69095N55J093J544K173K599K505K366K780L461L651L287K942K826K653
63080G03530K481K774L576M319M680M887N036M815M249M001M522N454O306P215
63066G67845Q520J0005J1194J2051J2951J4095J5432J6935J8525J9994K1312K2850
$$ y = [1080419, 1089579, 1097301, 1104094, 1109369, 1112132, 1111868, 1108386, 1101404, 1090937, 1077721, 1062541, 1045333, 1025642, 1003830, 981077, 958146, 934920, 911341, 888053, 865730, 844295, 823326, 802878, 783521, 765846, 750290, 737161, 726414, 717513, 709842, 703135, 697295, 692027, 687075, 682714, 679580, 677900, 677149, 676525, 675595, 674465, 673501, 672941, 672642, 672164, 671285, 670437, 670457, 671757, 673844, 675782, 677061, 677842, 678382, 678562, 678173, 677452, 676928, 676682, 676112, 674635, 672446, 670389, 669263, 669339, 670272, 671228, 671345, 670482, 669429, 669095, 669650, 670743, 672287, 674460, 677059, 679564, 681930, 684710, 688171, 691822, 695109, 698051, 700877, 703530, 706011, 708785, 712361, 716680, 721360, 726247, 731283, 736098, 740347, 744348, 748870, 754324, 760630, 767845, 776365, 786370, 797564, 809615, 822566, 836661, 852093, 869028, 887553, 907547, 928859, 951709]
63054I51709K4900K7186K9285L1214L3115L4663L5496L6058L7268L9266M1218
63043A321378M2534M3510M4463M4980M4602M3810M3508M3704M3386M1765L9114
63032A796754L6147L3084K9672K5838K1863J7895J3625Q676L078k773q541j4155
63020A961163j9579k4678k9296l3354l6776l9522m1694m3373m4200m3499m1087
63009A564105l7742l4408l1134k7228k2477j7561j3117q883m114J433P225J2456
62997A388555J6573J9578K2079K4816K7841L0394L1852L2538L3106L3435L2765
62986A693532L0898K8585K6462K4202K1066J6918J2269P553K831j940o793j1975
62974A843608j7850k4316l0522l5480l9038m1991m5139m8377n0898n2155n2320
$$ y = [951709, 976609, 1003795, 1033080, 1064294, 1097409, 1132072, 1167568, 1203626, 1240894, 1280160, 1321378, 1363912, 1407422, 1451885, 1496865, 1541467, 1585277, 1628785, 1672489, 1715875, 1757640, 1796754, 1832901, 1865985, 1895657, 1921495, 1943358, 1961253, 1974878, 1983554, 1986632, 1983859, 1975318, 1961163, 1941584, 1916906, 1887610, 1854256, 1817480, 1777958, 1736264, 1692891, 1648691, 1605192, 1564105, 1526363, 1491955, 1460821, 1433593, 1411116, 1393555, 1380438, 1371555, 1367441, 1368874, 1376099, 1388555, 1405128, 1424706, 1446785, 1471601, 1499442, 1529836, 1561688, 1594226, 1627332, 1660767, 1693532, 1724430, 1753015, 1779477, 1803679, 1824745, 1841663, 1853932, 1861485, 1864316, 1862376, 1855583, 1843608, 1825758, 1801442, 1770920, 1735440, 1696402, 1654411, 1609272, 1560895, 1509997, 1457842, 1405522]
62963A405522n1810n0788m9306m7551m5613m3271m0423l7503l5018l2833l0525
62952I40881k8281k6809k6170k5462k3909k1720j9521j7534j5774j4475j3697
62941G07529j2878j1463r773q648q306q199p890p445o875n855m270k651j729j766
62927F09781k402k994l047k534j892j488j221p90k70l9k08m59n05l43j23l8k94
62910E91134p62p46K71J655K080J159lk35L12O68M02q6l39k08L12J022J379R95
62892E99010K93J40P67J524J850J956K286K726K790K374J842J415Q67j4r51j387
62876F17488j108n18l06q91k105l291l770l335k346j389q73j018j883l160m086
62861E87409m067l367k776k600k442k097j914j978j669o33L91N40J54K38Q27J032
$$ y = [1405522, 1353712, 1302924, 1253618, 1206067, 1160454, 1117183, 1076760, 1039257, 1004239, 971406, 940881, 912600, 885791, 859621, 834159, 810250, 788530, 769009, 751475, 735701, 721226, 707529, 694651, 683188, 673415, 664767, 656461, 648262, 640372, 632927, 626052, 620197, 615927, 613276, 611547, 609781, 607379, 604385, 601338, 598804, 596912, 595424, 594203, 593413, 593143, 593104, 592896, 592437, 591932, 591589, 591466, 591428, 591134, 590372, 589626, 589897, 591552, 593632, 594791, 594788, 594553, 594865, 595533, 595935, 595849, 595510, 595302, 595614, 596636, 598015, 599010, 599303, 599443, 600210, 601734, 603584, 605540, 607826, 610552, 613342, 615716, 617558, 618973, 619840, 619826, 618875, 617488, 616380, 615862, 615556, 614665, 612560, 609269, 605499, 602164, 599818, 598429, 597556, 596538, 594655, 591495, 587409, 583342, 579975, 577199, 574599, 572157, 570060, 568146, 566168, 564499, 563866, 564257, 564797, 564951, 565189, 566016, 567048]
62845E67048N78K62N93R91Q35L89J93K25L15O71J345J658R99r2m19M37J752K609
62827E80389K713K330J890J757J978K285K467K592K767K896K942L068L248L098
62813F16420K544K252K840L908M427M039L419L394M146N275O245O716O831P131
62799F79587P962R074J0052J0940J2011J3165J4125J5016J6228J7741J9118K0247
62787H45266K1559K3476K6062K9204L2706L6093L8920M1268M3587M5928M7895
62776A231964M9392N0895N2681N4210N4668N3822N2123N0066M7668M4459L9980
62765A781928L4362K8288K2208J5812Q647R85o496j3773k1429k9432l6708m2322
62753A742070m6496n0065n3321n5906n7494n8168n8144n7543n6279n4099n0877
$$ y = [567048, 567626, 567888, 568481, 569472, 570307, 570696, 570889, 571114, 571429, 572100, 573445, 575103, 576102, 576010, 575591, 576028, 577780, 580389, 583102, 585432, 587322, 589079, 591057, 593342, 595809, 598401, 601168, 604064, 607006, 610074, 613322, 616420, 618964, 621216, 624056, 627964, 632391, 636430, 639849, 643243, 647389, 652664, 658909, 665625, 672456, 679587, 687549, 696623, 706675, 717615, 729626, 742791, 756916, 771932, 788160, 805901, 825019, 845266, 866825, 890301, 916363, 945567, 978273, 1014366, 1053286, 1094554, 1138141, 1184069, 1231964, 1281356, 1332251, 1384932, 1439142, 1493810, 1547632, 1599755, 1649821, 1697489, 1741948, 1781928, 1816290, 1844578, 1866786, 1882598, 1891245, 1892230, 1885734, 1871961, 1850532, 1821100, 1784392, 1742070, 1695574, 1645509, 1592188, 1536282, 1478788, 1420620, 1362476, 1304933, 1248654, 1194555, 1143678]
62742A143678m7075m3570m0783l8193l5050l1365k7862k5136k3149k1437j9528
62731G90530j7111j4202j1253q990p866p588p201n845l571j329K7O17J261K460
62717G09939M018N537O940Q413J0131J2050J3843J5106J5909J6958J8816K1166
62705H58826K3352K5491K8256L1666L4971L7873M0891M4116M6677M8070M9155
62694A269344N0821N2393N2497N1163M9822M9150M8063M5167M0387L4736K9090
62683A772633K3621J7958J1468L663n201j4064k1907k8584l4620m0338m5443m9460
62671A589726n2324n4395n5927n6711n6377n4969n2958n0700m8114m5042m1628
62660A020581l8132l4678l1440k8847k7059k5454k3110j9920j6831j4839j4006
$$ y = [1143678, 1096603, 1053033, 1012250, 974057, 939007, 907642, 879780, 854644, 831495, 810058, 790530, 773419, 759217, 747964, 738974, 731108, 723520, 716319, 710474, 706903, 705574, 705601, 706218, 707479, 709939, 713957, 719494, 726434, 734847, 744978, 757028, 770871, 785977, 801886, 818844, 837660, 858826, 882178, 907669, 935925, 967591, 1002562, 1040435, 1081326, 1125442, 1172119, 1220189, 1269344, 1320165, 1372558, 1425055, 1476218, 1526040, 1575190, 1623253, 1668420, 1708807, 1743543, 1772633, 1796254, 1814212, 1825680, 1829343, 1824142, 1810078, 1788171, 1759587, 1724967, 1684629, 1639186, 1589726, 1537402, 1483007, 1427080, 1370369, 1313992, 1259023, 1206065, 1155365, 1107251, 1062209, 1020581, 982449, 947771, 916331, 887484, 860425, 834971, 811861, 791941, 775110, 760271, 746265]
62649G46265j3509j2486j0793r103q205q105p927o960n601m803m755m633l754
62636F45631k434j490j290j628k141k590k852k985l111l148k818k129j550j457
62622F14008j606j502j105q59j057j482j665j336n41M19J203J698K092K604L194
62607F14065L670M050M584N478O688P983R155J0252J1715J4014J6956J9581K1158
62594G49349K2142K3617K5728K7320K7387K6393K5618K5544K5429K4440K2587
62583A025554K0422J8236J5917J3320J0442P274L720k26m347q272j1761j4850
62571A075429j7681k0223k2264k3702k4669k5286k5493k5254k4771k4229k3533
62560H18324k2584k1635k0891j9887j7900j5098j2671j1468j0958r999q298o538
$$ y = [746265, 732756, 720270, 709477, 700374, 692169, 684064, 676137, 669177, 663576, 658773, 654018, 649385, 645631, 643197, 641707, 640417, 638789, 636648, 634058, 631206, 628221, 625110, 621962, 619144, 617015, 615465, 614008, 612402, 610900, 609795, 608936, 607879, 606397, 604732, 603396, 602855, 603274, 604477, 606175, 608267, 610871, 614065, 617735, 621785, 626369, 631847, 638535, 646518, 655673, 665925, 677640, 691654, 708610, 728191, 749349, 771491, 795108, 820836, 848156, 875543, 901936, 927554, 953098, 978527, 1002967, 1025554, 1045976, 1064212, 1080129, 1093449, 1103891, 1111165, 1114885, 1114659, 1110312, 1102040, 1090279, 1075429, 1057748, 1037525, 1015261, 991559, 966890, 941604, 916111, 890857, 866086, 841857, 818324, 795740, 774105, 753214, 733327, 715427, 700329, 687658, 676190, 665232, 655233, 646935, 640397]
62548F40397n321m565l986l581l413l262k789j988j181o46l18J8L87O78J042J869
62532F13341L073L816L551L134M043O337Q283Q575Q088Q695J0920J3730J6244
62519G11830J8569K0926K3052K4801K6593K8820L1255L3333L4751L5633L6449
62508A026012L7821L9929M2078M3281M3393M3130M2968M2628M1758M0457L8828
62497A482283L6675L4036L1419K9075K6494K3117J9108J4931J0614N937J103l420
62485A711372p600j1882j6652k1928k7449l2686l6941l9926m2182m4660m7747
62474A381719n0928n3288n4245n3898n2829n1471m9703m7225m4257m1335l8404
62463H44136l4809l0474k6398k3457k1196j8556j5402j2649j0974j0079r263q200
$$ y = [640397, 635076, 630511, 626525, 622944, 619531, 616269, 613480, 611492, 610311, 609665, 609347, 609365, 609752, 610430, 611472, 613341, 616414, 620230, 623781, 626915, 630958, 637295, 645578, 654153, 662241, 670936, 681856, 695586, 711830, 730399, 751325, 774377, 799178, 825771, 854591, 885846, 919179, 953930, 989563, 1026012, 1063833, 1103762, 1145840, 1189121, 1232514, 1275644, 1318612, 1361240, 1402998, 1443455, 1482283, 1518958, 1552994, 1584413, 1613488, 1639982, 1663099, 1682207, 1697138, 1707752, 1713689, 1714792, 1711372, 1703772, 1691890, 1675238, 1653310, 1625861, 1593175, 1556234, 1516308, 1474126, 1429466, 1381719, 1330791, 1277503, 1223258, 1169360, 1116531, 1065060, 1015357, 968132, 923875, 882540, 844136, 809327, 778853, 752455, 728998, 707802, 689246, 673844, 661195, 650221, 640142, 630879, 622679]
62451F22679p045o074n340m551l447k324j827k076k406k309j995j688j038J21
62437E80680R76O61m57j320j719k212k714k474j570j204j990k954k922k129j741
62422E56911k288l232l755l427k383j318j019j504j832j201M3Q71Q34M18L22Q67
62406E38307K000L424M640N192N105M935N270O197P230P817P929Q043Q489Q922
62392F23500Q789Q152P684P785Q149Q291Q123P741P119O335N744N584N571N328
62378G23895M932M677M470L993L490L826N471P796R747J1054J2430J4578J7383
62365H27742K0237K2893K5587K8433L1145L3479L5544L7401L8704L9148L9063
62354A179376L9077L9240L8942L7750L5802L3256K9845K5317K0054J4817R949
$$ y = [622679, 615634, 609560, 604220, 599669, 596222, 593898, 592071, 589995, 587589, 585280, 583285, 581597, 580559, 580680, 581656, 582317, 581860, 580540, 578821, 576609, 573895, 571421, 569851, 568647, 566657, 563703, 560781, 558652, 556911, 554623, 551391, 547636, 544209, 541826, 540508, 539489, 537985, 536153, 534952, 534995, 535866, 536700, 537118, 537440, 538307, 540307, 543731, 548371, 553563, 558668, 563603, 568873, 575070, 582300, 590117, 598046, 606089, 614578, 623500, 632289, 640441, 648125, 655910, 664059, 672350, 680473, 688214, 695333, 701668, 707412, 712996, 718567, 723895, 728827, 733504, 737974, 741967, 745457, 749283, 754754, 762550, 772297, 783351, 795781, 810359, 827742, 847979, 870872, 896459, 924892, 956037, 989516, 1025060, 1062461, 1101165, 1140313, 1179376, 1218453, 1257693, 1296635, 1334385, 1370187, 1403443, 1433288, 1458605, 1478659, 1493476, 1503425]
62343A503425N167J12n109j0079j4713j9400k4364k8996l2349l4393l6221l8606
62331A264474m0787m1387m0287l8779l7861l7202l5948l3864l1265k8466k5761
62320H72867k3506k1789k0239j8492j6517j4312j1722q962o801n714n161m225
62308G15427k752j320l09M15J001J362J483J559J696J823J897J951J906J593R71
62293G28703J65o49j254j499j580k009k919l693l630k917k389k497k948l324l459
62278F94101l214k446j348k64R43K806N274P467Q809R893J1676J4197J6750J9041
62264G83685K1503K4455K7565L0324L2559L4241L5191L5312L4861L4294L3876
62253A127866L3598L3230L2329L0428K7433K3703J9540J4795R225L074k990q417
$$ y = [1503425, 1508592, 1508704, 1503595, 1493516, 1478803, 1459403, 1435039, 1406043, 1373694, 1339301, 1303080, 1264474, 1223687, 1182300, 1142013, 1103234, 1065373, 1028171, 992223, 958359, 927094, 898628, 872867, 849361, 827572, 807333, 788841, 772324, 758012, 746290, 737328, 730527, 724813, 719652, 715427, 712675, 711355, 711046, 711461, 712462, 713824, 715307, 716866, 718562, 720385, 722282, 724233, 726139, 727732, 728703, 728868, 728219, 726965, 725466, 723886, 721877, 718958, 715265, 711635, 708718, 706329, 703832, 700884, 697560, 694101, 690887, 688441, 687093, 686829, 687772, 690578, 695852, 703319, 712128, 722021, 733697, 747894, 764644, 783685, 805188, 829643, 857208, 887532, 920091, 954332, 989523, 1024835, 1059696, 1093990, 1127866, 1161464, 1194694, 1227023, 1257451, 1284884, 1308587, 1328127, 1342922, 1352147, 1355221, 1352231, 1343814]
62241A343814j3034j6841k0021k3010k6136k9119l1330l2676l3706l4667l5007
62230A048267l4213l2682l1196k9862k8188k6038k3857k1911j9962j7812j5639
62219G66907j3629j1741j0015q728p954p371o742o188n794n265m314l086j894
62206F74186r03k74k33n02j40J463L599M930N070M892N244O059O890P702Q697
62191G26680R719J0299J0187R537Q711Q052P766P817P970Q078Q215Q441Q639Q690
62177H48801Q690Q864R375J0352J1888J3784J5494J6640J7466J8455J9649K0711
62165A020169K1658K2962K4707K6088K6167K4892K3005K1107J9205J7015J4334
62154A261309J1092P451L890Q67j698m222o735q805j0316j1801j3614j5214j5859
$$ y = [1343814, 1330780, 1313939, 1293918, 1270908, 1244772, 1215653, 1184323, 1151647, 1117941, 1083274, 1048267, 1014054, 981372, 950176, 920314, 892126, 866088, 842231, 820320, 800358, 782546, 766907, 753278, 741537, 731522, 722794, 714840, 707469, 700727, 694539, 688745, 683480, 679166, 676080, 674186, 673283, 673009, 672776, 672274, 672134, 673597, 677196, 682126, 687196, 692088, 697332, 703391, 710281, 717983, 726680, 736399, 746698, 756885, 766422, 775133, 783185, 790951, 798768, 806738, 814816, 823031, 831472, 840111, 848801, 857491, 866355, 875730, 886082, 897970, 911754, 927248, 943888, 961354, 979809, 999458, 1020169, 1041827, 1064789, 1089496, 1115584, 1141751, 1166643, 1189648, 1210755, 1229960, 1246975, 1261309, 1272401, 1279852, 1283742, 1284609, 1282911, 1278689, 1271954, 1263149, 1252833, 1241032, 1227418, 1212204, 1196345]
62141A196345j5687j5504j5546j5125j3678j1590r681q213o833n369m149l455
62129A071515k899j774O8J911L043L653M504N826P008P512P515P373P024O436
62115A128715O184O852Q028Q586P953O566N090L827K947K614K706K871L098L750
62101A199787M865N960O769P642Q843R987J0588J0818J1235J1994J2845J3659
62089A314992J4503J5280J5727J5807J5821J5975J6108J5862J5154J4417J4328
62078A483974J5120J6236J6859J6778J6465J6352J6472J6784J7292J7591J6863
62067A666786J4751J1949R486P742O478N528M903M387L493J873m26l049n433p105
62053A721363q161r363j1367j3967j6327j7898j8861j9823k1243k3149k5223k7238
$$ y = [1196345, 1180658, 1165154, 1149608, 1134483, 1120805, 1109215, 1099534, 1091321, 1084488, 1079119, 1074970, 1071515, 1068616, 1066842, 1066910, 1068821, 1071864, 1075517, 1080021, 1085847, 1092855, 1100367, 1107882, 1115255, 1122279, 1128715, 1134899, 1141751, 1149779, 1158365, 1166318, 1172884, 1177974, 1181801, 1184748, 1187362, 1190068, 1192939, 1196037, 1199787, 1204652, 1210612, 1217381, 1225023, 1233866, 1243853, 1254441, 1265259, 1276494, 1288488, 1301333, 1314992, 1329495, 1344775, 1360502, 1376309, 1392130, 1408105, 1424213, 1440075, 1455229, 1469646, 1483974, 1499094, 1515330, 1532189, 1548967, 1565432, 1581784, 1598256, 1615040, 1632332, 1649923, 1666786, 1681537, 1693486, 1702972, 1710714, 1717192, 1722720, 1727623, 1732010, 1735503, 1737376, 1736950, 1733901, 1728468, 1721363, 1713202, 1703839, 1692472, 1678505, 1662178, 1644280, 1625419, 1605596, 1584353, 1561204, 1535981, 1508743]
62041A508743k9361l1742l3860l4889l4964l5378l6928l8600l8715l7090l5143
62030A122073l3884l2726l0620k7671k5076k3755k3429k3067k1928k0123j8220
62019H41574j6403j4368j2054j0108r110q684p883o398m828l662k627j271K62
62006G44440J433K068K483K989L496L742L642L288K655J582J73j064j792k431
61992G66704l685n480o928p530p838q543r453r905r825r681r665r531r175q738
61978F50727q175p262o062m961m208l767l553l426l037k121r15J17Q40J385J743
61963F07325J946K404L480M793N672O194P041Q368R633J0648J1927J3750J5679
61950G08860J7304J8812K0392K1872K3294K5165K7598K9869L1417L2625L3980
$$ y = [1508743, 1479382, 1447640, 1413780, 1378891, 1343927, 1308549, 1271621, 1233021, 1194306, 1157216, 1122073, 1088189, 1055463, 1024843, 997172, 972096, 948341, 924912, 901845, 879917, 859794, 841574, 825171, 810803, 798749, 788641, 779531, 770847, 762964, 756566, 751738, 748076, 745449, 744178, 744440, 745873, 747941, 750424, 753413, 756909, 760651, 764293, 767581, 770236, 771818, 771991, 770927, 769135, 766704, 763019, 757539, 750611, 743081, 735243, 726700, 717247, 707342, 697517, 687836, 678171, 668640, 659465, 650727, 642552, 635290, 629228, 624267, 620059, 616292, 612739, 609313, 606276, 604155, 603240, 603357, 604197, 605582, 607325, 609271, 611675, 615155, 619948, 625620, 631814, 638855, 647223, 656856, 667504, 679431, 693181, 708860, 726164, 744976, 765368, 787240, 810534, 835699, 863297, 893166, 924583, 957208, 991188]
61939I91188L5086L5253L4615L3700L2336K9986K7046K4681K3271K1879J9620
61928A308661J6730J3913J1324Q782O486M773L421J808j33j688k165j602m84Q10
61914A370636K030K852L159L455M470O129P377P352O397N425M509K829Kl216n952
61899A417454q370j1219j4528j7496j9674k1620k4025k6578k8253k8618k8364
61888A188709k8321k8350k7633k5894k3818k2129k0737j9126j7306j5869j5140
61877I44386j4619j3418j1117q152n435l491j939J05K974O079Q729J1050J3674
61864I28826J6823K0150K3458K6975L0878L4976L8933M2513M5438M7464M8736
61853A305170M9727N0644N1124N0768M9766M8689M7721M6298M3627L9611L5123
$$ y = [991188, 1026274, 1061527, 1096142, 1129842, 1162178, 1192164, 1219210, 1243891, 1267162, 1289041, 1308661, 1325391, 1339304, 1350628, 1359410, 1365896, 1370669, 1374090, 1375898, 1375765, 1374077, 1371912, 1370310, 1369826, 1370636, 1372666, 1375518, 1378677, 1382132, 1386602, 1392731, 1400108, 1407460, 1413857, 1419282, 1423791, 1426620, 1426622, 1423406, 1417454, 1409084, 1397865, 1383337, 1365841, 1346167, 1324547, 1300522, 1273944, 1245691, 1217073, 1188709, 1160388, 1132038, 1104405, 1078511, 1054693, 1032564, 1011827, 992701, 975395, 959526, 944386, 929767, 916349, 905232, 897080, 891645, 888154, 886215, 886320, 889294, 895373, 904102, 915152, 928826, 945649, 965799, 989257, 1016232, 1047110, 1082086, 1121019, 1163532, 1208970, 1256434, 1305170, 1354897, 1405541, 1456665, 1507433, 1557199, 1605888, 1653609, 1699907, 1743534, 1783145, 1818268]
61842A818268L1149K7650K3743J9112J4675J1389Q859N901K258j071l144m054
61830A954735m457m820n354o097o798p111p099p170p588q512j0421j3816j8364
61817A847128k3010k7130l0919l4523l7619m0163m2719m5460m7469m7673m6035
61806A424408m3384m0468l7634l5015l2528k9974k7391k4965k2476j9533j6571
61795A094469j4759j4363j4035j2434r915p807o696o285o296o465o134m969l848
61782I80463l864m647m795l961l254l457l984m010l555k909j972q26k52p96j793
61767I36388k061j402o73n02n39j79M50N85k02j417k200k311k263k440k553k243
61751I16438j911k327l447m218l718k192p79l68q57j444j472j065p89p75m89M64
$$ y = [1818268, 1849417, 1877067, 1900810, 1919922, 1934597, 1945986, 1954845, 1960746, 1963004, 1961933, 1958789, 1954735, 1950278, 1945458, 1940104, 1934007, 1927209, 1920098, 1912999, 1905829, 1898241, 1889729, 1879308, 1865492, 1847128, 1824118, 1796988, 1766069, 1731546, 1693927, 1653764, 1611045, 1565585, 1518116, 1470443, 1424408, 1381024, 1340556, 1302922, 1267907, 1235379, 1205405, 1178014, 1153049, 1130573, 1111040, 1094469, 1079710, 1065347, 1051312, 1038878, 1028963, 1021156, 1014460, 1008175, 1001879, 995414, 989280, 984311, 980463, 976599, 971952, 967157, 963196, 959942, 956485, 952501, 948491, 944936, 942027, 940055, 939229, 938977, 938181, 936388, 934327, 932925, 932252, 931750, 931211, 931032, 931482, 932067, 931865, 930448, 928248, 925937, 923674, 921234, 918681, 916438, 914527, 912200, 908753, 904535, 900817, 898625, 897846, 897478, 896621, 895177, 893705, 892640, 891851, 891076, 890587, 891051]
61735H91051J689K531K958L444M175M907N504O111O731P103P058O672O054N300
61721I61288M670M385M252L827L026K229J773J591J381R07J55n74r59j165j844
61706I84942l249m705n480n753o182o754o865o371n719n114m369l622l357l551
61692I13851l560l124k675k502k393k339k781l732m478m585m531m775m986m772
61678H62618m465m523m686m478m055l876l941m077m487n252n710n197m145l535
61664H00191l475l258k675k283k246k002j342q70r25q42M2J231J685J237P27Q17
61648G86012J289J627J714J758J775J520Q60M5n32p90j020j454j957k231k313
61633G86303k579l287m270n163n741n936n698n045m211l562l311l356l490l668
$$ y = [891051, 892740, 895271, 898229, 901673, 905848, 910755, 916259, 922370, 929101, 936204, 943262, 949934, 955988, 961288, 965958, 970343, 974595, 978422, 981448, 983677, 985450, 987041, 988422, 989329, 989484, 988910, 987951, 986786, 984942, 981693, 976988, 971508, 965755, 959573, 952819, 945954, 939583, 933864, 928750, 924381, 920759, 917402, 913851, 910291, 907167, 904492, 901990, 899597, 897258, 894477, 890745, 886267, 881682, 877151, 872376, 867390, 862618, 858153, 853630, 848944, 844466, 840411, 836535, 832594, 828517, 824030, 818778, 813068, 807871, 803726, 800191, 796716, 793458, 790783, 788500, 786254, 784252, 782910, 782040, 781115, 780273, 780315, 781546, 783231, 784468, 785195, 786012, 787301, 788928, 790642, 792400, 794175, 795695, 796555, 796600, 796068, 795278, 794258, 792804, 790847, 788616, 786303, 783724, 780437, 776167, 771004, 765263, 759327, 753629, 748584, 744373, 740811, 737500, 734144, 730654, 726986]
61619G26986m002m522n062n427n613n721n781n804n953o503p522q725r637r854
61605F36860r229p983o684n911n811o043o128n774m977m033l405l356l675l986
61591E59865m228m511m576l953k818k131k543l552m140l953l379k791k264j906
61577E13120j859j905j571q16j85j45n48j003j398j820k148k121j678r77j13Q93
61561D95726J810K232K088J870K040K384K329J800J363J379J529J435J307J544
61547E20836K022K269K133J749J080J83k53M67J857K542J993J132P95O06l0o81
61531E38700o05j02j81j113k264l103l534l478k944k442k387k261j387m08p45
61516E11746k369l442k784j478j190j846k142j675j341j759k434k555j887p15
$$ y = [726986, 722984, 718462, 713400, 707973, 702360, 696639, 690858, 685054, 679101, 672598, 665076, 656351, 646714, 636860, 627631, 619648, 612964, 607053, 601242, 595199, 589071, 583297, 578320, 574287, 570882, 567526, 563851, 559865, 555637, 551126, 546550, 542597, 539779, 537648, 535105, 531553, 527413, 523460, 520081, 517290, 515026, 513120, 511261, 509356, 507785, 506969, 506784, 506639, 506091, 505088, 503690, 501870, 499722, 497601, 495923, 494946, 494833, 495726, 497536, 499768, 501856, 503726, 505766, 508150, 510479, 512279, 513642, 515021, 516550, 517985, 519292, 520836, 522858, 525127, 527260, 529009, 530089, 530272, 530019, 530486, 532343, 534885, 536878, 538010, 538805, 539411, 539381, 538700, 538095, 537993, 537812, 536699, 534435, 531332, 527798, 524320, 521376, 518934, 516547, 514286, 512899, 512491, 511746, 509377, 505935, 503151, 501673, 500483, 498637, 496495, 494820, 493479, 491720, 489286, 486731, 484844, 484129]
61502D84129M86J201J248J046J119J303J038L70P1N25J160J290J036R48J110J144
61486D99224R60R34J255J479J017m0q34n86N16J482J643J379J469J924J912R20
61470E14654m72j301j325j065r49q69o34l65k74l18l14k64k87l83l77j41K96Q65
61452E06477J480K019K419K821L406M036M276L940L447L356L696M010M014L854
61438E53251L696L431L041K935L541M577N135M629L479K657K614K885K783K313
61424F00967K035K159K215J840J412J419J540R95j95j212j740k415l588m477m273
61409E96682l454l142l584m170m632n219n746n605m811m088l669l004j958j290
61395E42310j400j534r70j75M1j35J3M77P50Q75J286J772J728J343J499K315K853
$$ y = [484129, 484615, 485816, 487064, 488110, 489229, 490532, 491570, 491940, 492011, 492536, 493696, 494986, 496022, 496970, 498080, 499224, 500184, 501118, 502373, 503852, 504869, 504829, 503995, 503409, 503925, 505407, 507050, 508429, 509898, 511822, 513734, 514654, 514182, 512881, 511556, 510491, 509542, 508673, 508039, 507674, 507400, 507082, 506768, 506504, 506217, 505834, 505457, 505316, 505612, 506477, 507957, 509976, 512395, 515216, 518622, 522658, 526934, 530874, 534321, 537677, 541373, 545383, 549397, 553251, 556947, 560378, 563419, 566354, 569895, 574472, 579607, 584236, 587715, 590372, 592986, 595871, 598654, 600967, 603002, 605161, 607376, 609216, 610628, 612047, 613587, 614582, 614387, 613175, 611435, 609020, 605432, 600955, 596682, 593228, 590086, 586502, 582332, 577700, 572481, 566735, 561130, 556319, 552231, 548562, 545558, 543600, 542310, 540910, 539376, 538406, 538231, 538272, 538137, 538150, 538627, 539377, 540252, 541538, 543310, 545038, 546381, 547880, 550195, 553048]
61378E53048K514J877J731K058K371K524K635K744K935L389L976M178L799L376
61364E93155L510M201N149O319P725Q951R523R643J0102J1384J3131J4570J5299
61351G12662J5586J5894J6186J5898J4777J3439J2706J2532J2142J1176R989Q817
61339H71804P384N568L694J848l84l046n417o990q107r025r124p967o471n912
61325H27855o192o256n926o010o591o508n000k836j198k86L68R28J291J694K511
61310G87844L635M575N091N329N458N531N687O096O571O518N495L834K588K599
61296H56851L607M387L954K408N16j231k794m036m618m478l956l342k646j866
61282H42756j125l63P48K292L828M810N218N566O411P890R623J1056J2036J3006
$$ y = [553048, 555562, 557439, 559170, 561228, 563599, 566123, 568758, 571502, 574437, 577826, 581802, 585980, 589779, 593155, 596665, 600866, 606015, 612334, 620059, 629010, 638533, 648176, 658278, 669662, 682793, 697363, 712662, 728248, 744142, 760328, 776226, 791003, 804442, 817148, 829680, 841822, 852998, 862987, 871804, 879188, 884756, 888450, 890298, 889914, 886868, 881451, 874461, 866354, 857329, 848205, 840238, 833767, 827855, 821663, 815407, 809481, 803471, 796880, 790372, 785372, 782536, 781338, 781052, 781420, 782348, 783639, 785333, 787844, 791479, 796054, 801145, 806474, 811932, 817463, 823150, 829246, 835817, 842335, 847830, 851664, 854252, 856851, 860458, 864845, 868799, 871207, 871723, 870492, 867698, 863662, 859044, 854566, 850610, 847268, 844622, 842756, 841631, 841268, 842016, 844308, 848136, 852946, 858164, 863730, 870141, 878031, 887654, 898710, 910746, 923752]
61268I23752J4506J6433J8063J8803J8801J8718J9042J9598J9668J8663J6732
61257A122779J4600J2703J0849Q800O818N150L417J078j786m652p414j0309j3134
61244A148899j5236j6346j6744j6636j5951j4848j3667j2265j0199p713n781m744
61232I98769l757k072j01J340K191K833L185K970K535K575L113L497L362K943
61218A023383K548K248K206K632L350L842L960M216N223P091R438J1690J3313
61205A095140J4118J4525J5263J6644J8304J9876K1534K3575K5597K6718K6654
61194A317948K6166K6053K6112K5607K4454K3225K1936J9802J6575J3319J1060
61183A552257R270O615K849j069m621q320j2423j6152j8755k0559k2391k4491
$$ y = [923752, 938258, 954691, 972754, 991557, 1010358, 1029076, 1048118, 1067716, 1087384, 1106047, 1122779, 1137379, 1150082, 1160931, 1169731, 1176549, 1181699, 1185116, 1186194, 1184408, 1179756, 1172342, 1162033, 1148899, 1133663, 1117317, 1100573, 1083937, 1067986, 1053138, 1039471, 1027206, 1017007, 1009294, 1003513, 998769, 995012, 992940, 992839, 994179, 996370, 999203, 1002388, 1005358, 1007893, 1010468, 1013581, 1017078, 1020440, 1023383, 1025931, 1028179, 1030385, 1033017, 1036367, 1040209, 1044169, 1048385, 1053608, 1060699, 1070137, 1081827, 1095140, 1109258, 1123783, 1139046, 1155690, 1173994, 1193870, 1215404, 1238979, 1264576, 1291294, 1317948, 1344114, 1370167, 1396279, 1421886, 1446340, 1469565, 1491501, 1511303, 1527878, 1541197, 1552257, 1561527, 1568142, 1570991, 1569922, 1565301, 1556981, 1544558, 1528406, 1509651, 1489092, 1466701, 1442210]
61171A442210k6494k8078k9055k9242k8737k8022k7459k6873k6001k4962k3966
61160A143321k2866k1407j9624j7586j5122j2164r225o985n474m032k056L33K350
61147A009463L289L369L701N099P036Q419R240J0603J2944J5217J6370J6705J7155
61134A138610J7993J9042K0448K2304K4011K5007K5786K7195K9093L0677L1878
61123A412044L3267L4599L4788L3523L1863L0688K9469K7246K4086K0817J7767
61112A730157J4517J0784O900L301p0l621p528j1513j5234j8746k2403k6294k9977
61099A630273l2851l4696l5821l6809l8115l9608m0591m0616m0158l9967l9717
61088A211324l8268l5460l2707l1113k9897k7676k4602k1951j9978j7586j4287
$$ y = [1442210, 1415716, 1387638, 1358583, 1329341, 1300604, 1272582, 1245123, 1218250, 1192249, 1167287, 1143321, 1120455, 1099048, 1079424, 1061838, 1046716, 1034552, 1025327, 1018342, 1012868, 1008836, 1006780, 1007113, 1009463, 1012752, 1016121, 1019822, 1024921, 1031957, 1040376, 1049616, 1060219, 1073163, 1088380, 1104750, 1121455, 1138610, 1156603, 1175645, 1196093, 1218397, 1242408, 1267415, 1293201, 1320396, 1349489, 1380166, 1412044, 1445311, 1479910, 1514698, 1548221, 1580084, 1610772, 1640241, 1667487, 1691573, 1712390, 1730157, 1744674, 1755458, 1762358, 1765659, 1765589, 1761968, 1754440, 1742927, 1727693, 1708947, 1686544, 1660250, 1630273, 1597422, 1562726, 1526905, 1490096, 1451981, 1412373, 1371782, 1331166, 1291008, 1251041, 1211324, 1173056, 1137596, 1104889, 1073776, 1043879, 1016203, 991601, 969650, 949672, 932086, 917799]
61077I17799j1163r308q268o747m366j978m93Q1M47J187K278L358M376N679P380
61062I00262Q973R977J0727J2010J4108J6524J8666K0294K1421K2230K3170K4629
61050A102991K6372K7620K7847K7291K6619K6201K5755K4667K2731K0558J8959
61039A377611J7946J6649J4438J1629Q895O504M430K732J412L59k84j84L96O23
61025A463156L97P76K483M747O576Q358J1165J5046J9221K3410K7837L2326L6739
61012A652237M1883M8621N6332O3649P0570P8341Q7491R7716J09803J25857J47325
61001B579825J74501K08435K51470L05223L69951M46778N38010O42624P52344
60992F269161Q54769R40998J009226J061191J097369J117500J125747J132955
$$ y = [917799, 906636, 897328, 889060, 882313, 877947, 875969, 875476, 875557, 876004, 877191, 879469, 882827, 887203, 892882, 900262, 909235, 919212, 929939, 941949, 956057, 972581, 991247, 1011541, 1032962, 1055192, 1078362, 1102991, 1129363, 1156983, 1184830, 1212121, 1238740, 1264941, 1290696, 1315363, 1338094, 1358652, 1377611, 1395557, 1412206, 1426644, 1438273, 1447168, 1453672, 1458102, 1460834, 1462246, 1462605, 1462321, 1462137, 1462533, 1463156, 1463553, 1464329, 1466812, 1471559, 1478135, 1486493, 1497658, 1512704, 1531925, 1555335, 1583172, 1615498, 1652237, 1694120, 1742741, 1799073, 1862722, 1933292, 2011633, 2099124, 2196840, 2306643, 2432500, 2579825, 2754326, 2962761, 3214231, 3519454, 3889405, 4336183, 4874193, 5516817, 6269161, 7123930, 8064928, 9074154, 10135345, 11232714, 12350214, 13475961, 14608916]
60984A4608916J150563J180421J211966J231237J230461J203972J135086R95874
60976B3948496P69678M75316J63656j13579l31565m91776o02949o71761p12182
60967B2433334p53936q30230r52619j099818j233541j325090j367524j367687
60959A3502889j333326j269188j180496j075235r62562q50450p44392o46867n58078
60950D882295m77987m07510l47403k96972k54858k20328j92811j70761j52216
60941B361449j36162j22368j10322r9390q9738q1946p5679o9701o3208n6514n0445
60930A405976m5618m2093l9162l5781l1733k8043k5639k4076k2245j9710j6704
60919A075172j3411j0258q245p861q030p299n710m445m062m264m998o330p441
$$ y = [14608916, 15759479, 16939900, 18151866, 19383103, 20613564, 21817536, 22952622, 23948496, 24718174, 25193490, 25357146, 25243567, 24912002, 24420226, 23817277, 23145516, 22433334, 21679398, 20849168, 19896549, 18796731, 17563190, 16238100, 14870576, 13502889, 12169563, 10900375, 9719879, 8644644, 7682082, 6831632, 6087240, 5440373, 4882295, 4404308, 3996798, 3649395, 3352423, 3097565, 2877237, 2684426, 2513665, 2361449, 2225287, 2102919, 1992597, 1893207, 1803469, 1721523, 1645844, 1576143, 1512935, 1456421, 1405976, 1360358, 1318265, 1279103, 1243322, 1211589, 1183546, 1157907, 1133831, 1111586, 1091876, 1075172, 1061761, 1051503, 1043258, 1035397, 1027367, 1020068, 1014358, 1009913, 1005851, 1001587, 996589, 990259, 982818]
60906I82818p293o383o366p740r264r964j0238j0588j0667j0311j0252j0922j1534
60893H61296j1238j0439j0053j0158j0161r823r339q691p683o384n116m128l629
60880G54454l780m337m599m070k958j833j073o89l05P26K660M668N397M510L127
60865G51898K557L102M340N893P483Q747R471R756R708R321Q797Q489Q360Q005
60851H55927P439P207P471P581O971N880M817L892L084K530K034Q99j129l222
60837I11381m451m961n567o495p293p682p876q104q387q765r236r601r726r746
60823H03491r746r510q946q490q510q633q198p209o289n839n682n456m901l937
60809G02145k885k414k739l088k545j234m6O39J198J861K333K552K971L763M384
$$ y = [982818, 975525, 969142, 962776, 955036, 945772, 935808, 925570, 914982, 904315, 894004, 883752, 872830, 861296, 850058, 839619, 829566, 819408, 809247, 799424, 790085, 781394, 773711, 767327, 762211, 758083, 754454, 750674, 746337, 741738, 737668, 734710, 732877, 731804, 731115, 730810, 731536, 734196, 738864, 744261, 748771, 751898, 754455, 757557, 761897, 767790, 775273, 784020, 793491, 803247, 812955, 822276, 831073, 839562, 847922, 855927, 863366, 870573, 878044, 885625, 892596, 898476, 903293, 907185, 910269, 912799, 914833, 915732, 914603, 911381, 906930, 901969, 896402, 889907, 882614, 874932, 867056, 858952, 850565, 841800, 832564, 822963, 813237, 803491, 793745, 784235, 775289, 766799, 758289, 749656, 741458, 734249, 727960, 722121, 716439, 710983, 706082, 702145, 699260, 696846, 694107, 691019, 688474, 687240, 687194, 687833, 689031, 690892, 693225, 695777, 698748, 702511, 706895]
60794G06895M358M037M140M831N694O346O677O653O278N782N559N855O578P386
60780G87069P913P976P648P101O482O019O022O481O824O482N638N052N097N393
60766H77197N493N406N232M793M033L394L361L829M310M595M780M818M557M136
60752I39934L873L797L731L801M352N256N848N845N819O411P398Q026Q050P967
60738A020108Q313R134J0185J1265J2255J3085J3882J4904J6188J7385J8065J8163
60726A182932J7942J7606J7071J6206J5156J4228J3476J2597J1382R979Q465O424
60714A343464L463M4k791m680o304q303j0449j2333j4175j6282j8208j9309j9858
60701A214279k0740k2135k3361k3982k4166k3902k2823k1114j9676j9016j8618
$$ y = [706895, 711253, 715290, 719430, 724261, 729955, 736301, 742978, 749631, 755909, 761691, 767250, 773105, 779683, 787069, 794982, 802958, 810606, 817707, 824189, 830208, 836230, 842711, 849535, 856017, 861655, 866707, 871804, 877197, 882690, 888096, 893328, 898121, 902154, 905548, 908909, 912738, 917048, 921643, 926423, 931241, 935798, 939934, 943807, 947604, 951335, 955136, 959488, 964744, 970592, 976437, 982256, 988667, 996065, 1004091, 1012141, 1020108, 1028421, 1037555, 1047740, 1059005, 1071260, 1084345, 1098227, 1113131, 1129319, 1146704, 1164769, 1182932, 1200874, 1218480, 1235551, 1251757, 1266913, 1281141, 1294617, 1307214, 1318596, 1328575, 1337040, 1343464, 1346927, 1346971, 1344180, 1339500, 1333196, 1324893, 1314444, 1302111, 1287936, 1271654, 1253446, 1234137, 1214279, 1193539, 1171404, 1148043, 1124061, 1099895, 1075993, 1053170, 1032056, 1012380, 993364, 974746]
60690I74746j7925j7184j6771j6343j5366j4031j2997j2510j2281j2008j1467
60679H15863j0444r041p758o902o197n368m652m263l847l178k880l602m774n054
60665G37903m021k486j237k24P72J433J335O31m7j36M86J462K224K554K779L200
60649G46628L557L465L204L459M290M922M713L865L005K450K039J534R41N34M67
60634G89073M09j44j030j416r64n26j056k303l298l783m243m717m683m174m015
60619G53130m627n453n868n932n854n450m708m284m699n424n402m362l100k554
60605F85413k913l707m389m757m864m699m102l014j657l58O09R50N01l22o62k82
60589F51747M0l36q33n35L21P22N06M68Q63J030P43P60J548K474K908L241M060
$$ y = [974746, 956821, 939637, 922866, 906523, 891157, 877126, 864129, 851619, 839338, 827330, 815863, 805419, 796378, 788620, 781718, 775521, 770153, 765501, 761238, 757391, 754213, 751333, 747731, 742957, 737903, 733882, 731396, 730159, 729935, 730707, 732140, 733475, 734106, 734059, 733923, 734409, 735871, 738095, 740649, 743428, 746628, 750185, 753650, 756854, 760313, 764603, 769525, 774238, 778103, 781108, 783558, 785597, 787131, 788072, 788606, 789073, 789482, 789338, 788308, 786892, 785928, 785402, 784346, 782043, 778745, 774962, 770719, 766002, 761319, 757145, 753130, 748503, 743050, 737182, 731250, 725396, 719946, 715238, 710954, 706255, 700831, 695429, 691067, 687967, 685413, 682500, 678793, 674404, 669647, 664783, 660084, 655982, 652968, 651311, 650953, 651562, 652512, 653013, 652691, 652029, 651747, 651787, 651451, 650618, 650083, 650404, 651126, 651632, 652100, 652963, 653993, 654736, 655496, 657044, 659518, 662426, 665667, 669727]
60572F69727N078N687O085O939Q249R283R622R608R774J0226J0637J0596J0003
60559G81514R269Q968R182R346Q844P600N972M355L026K069J343O30j76j090k021
60544H48831k470j674M32K700L945M390N148O475P623Q312R149J0280J0836J0285
60530I24262R402R121R261R019Q110O729M925K728N20j279k626l696m608n474
60516I66394o231o350n407m062l526l865l792k524p09R71K940N621Q320J0257
60502I58037J1891J4169J7170K0449K3992K7785L1106L3414L5273L7360L9155
60491A249801L9819L9729L9794L9712L8381L5761L2839K9817K5796K0346J4136
60480A605931P750J060o023j3232k0624k8437l6034m2046m5947m8529n0477n1378
$$ y = [669727, 674805, 680492, 686577, 693516, 701765, 711048, 720670, 730278, 740052, 750278, 760915, 771511, 781514, 790783, 799751, 808933, 818279, 827123, 834723, 840695, 845050, 848076, 850145, 851488, 852118, 851942, 850852, 848831, 846361, 844687, 845119, 847819, 851764, 856154, 861302, 867777, 875400, 883712, 892861, 903141, 913977, 924262, 933664, 942785, 952046, 961065, 969175, 975904, 980829, 983557, 984077, 982798, 980172, 976476, 971868, 966394, 960163, 953813, 948406, 944344, 940818, 936953, 933161, 930637, 929928, 930899, 933839, 939460, 947780, 958037, 969928, 984097, 1001267, 1021716, 1045708, 1073493, 1104599, 1138013, 1173286, 1210646, 1249801, 1289620, 1329349, 1369143, 1408855, 1447236, 1482997, 1515836, 1545653, 1571449, 1591795, 1605931, 1613681, 1614741, 1608718, 1595486, 1574862, 1546425, 1510391, 1468345, 1422398, 1373869, 1323392, 1272014]
60468A272014n0607m8414m5607m2775m0129l7591l4728l1208k7523k4599k2507
60457H66326k0341j7624j5042j3353j2295j1134r680q238p021o120n760n988o339
60444G27391o263n778n366n316n393n146m420l535k956k729k467k013j756j984
60430F72269k267k009j358r74j018r56l95M74J218J508J184M78N4L27Q85J080
60414F70500R58R98J165J088R71J415K326K896K819K617K576K262J427N75K77
60399F94870N28J106J871K474K488K091K028K583L260L636L813L805L318K516
60385G30387K153K487K856K806K825L307L630L075J993J227Q50L89o0J62J180
60370G59267K272K690K340J635J134J203J763K374K706K749K493J843J069Q60
$$ y = [1272014, 1221407, 1172993, 1127386, 1084611, 1044482, 1006891, 972163, 940955, 913432, 888833, 866326, 845985, 828361, 813319, 799966, 787671, 776537, 766857, 758619, 751598, 745478, 739718, 733730, 727391, 721128, 715350, 709984, 704668, 699275, 694129, 689709, 686174, 683218, 680489, 678022, 676009, 674253, 672269, 670002, 667993, 666635, 665661, 664643, 663687, 663292, 663766, 664984, 666492, 667676, 668154, 668208, 668535, 669420, 670500, 671458, 672456, 673621, 674709, 675680, 677095, 679421, 682317, 685136, 687753, 690329, 692591, 694018, 694593, 694870, 695398, 696504, 698375, 700849, 703337, 705428, 707456, 710039, 713299, 716935, 720748, 724553, 727871, 730387, 732540, 735027, 737883, 740689, 743514, 746821, 750451, 753526, 755519, 756746, 757596, 757985, 757925, 758087, 759267, 761539, 764229, 766569, 768204, 769338, 770541, 772304, 774678, 777384, 780133, 782626, 784469, 785538, 786398]
60356G86398J546K660L596M254M731M889M764M905N704O653O926O461N900N670
60342H55057N653N626N448M918L982L017K472K239J813J008R7p59j757k985m115
60327H81714m767n045n444o258p112p204o150m476l065k218j553p47J71J257K788
60312H31891M697O503Q046R770J1830J3572J4485J5055J6009J7032J7119J6020
60300I82029J4541J3435J2738J2203J1770J1308J0468R035P149M986K532j93k991
60287A089010n767q691j1850j4851j6980j7813j7598j7022j6529j5967j4953j3571
60275I17418j2411j1856j1667j1358j0746r936r033q139p359o602n576m284l385
60262H05066l570m618n390m877l152j229n2L16M62O86N60l13j400j683r57p8J98
$$ y = [786398, 787944, 790604, 794200, 798454, 803185, 808074, 812838, 817743, 823447, 830100, 837026, 843487, 849387, 855057, 860710, 866336, 871784, 876702, 880684, 883701, 886173, 888412, 890225, 891233, 891330, 890571, 888814, 885829, 881714, 876947, 871902, 866458, 860200, 853088, 845884, 839734, 835258, 832193, 829975, 828422, 827675, 827846, 829103, 831891, 836588, 843091, 851137, 860907, 872737, 886309, 900794, 915849, 931858, 948890, 966009, 982029, 996570, 1010005, 1022743, 1034946, 1046716, 1058024, 1068492, 1077527, 1084676, 1089662, 1092194, 1092001, 1089010, 1083243, 1074552, 1062702, 1047851, 1030871, 1013058, 995460, 978438, 961909, 945942, 930989, 917418, 905007, 893151, 881484, 870126, 859380, 849444, 840411, 832272, 824913, 818311, 812735, 808451, 805066, 801496, 796878, 791488, 786611, 783459, 782230, 782178, 782494, 782956, 783642, 784202, 783889, 782489, 780806, 779849, 779771, 779969]
60245G79969L9r6k17m73n74j26O99J390J837K333K999L606L909L870L613L428
60229H06206L631M148M500M471M454M825N330N568N676N974O197N796M955M546
60215H76277N044N936O384O026N105M159L684L660L471K580J268K97o6j90l01
60200I23334k58j44m25j187j780j656j181j178j897k830l310k967j774j83R01
60185I03465P56l14j127q60Q7O63N28M01J059K281L128L059K438J933J789J844
60169I21130J975K272K804L401L677L310K386J474J117J301J566J674J899K527
60155I52513L380L919L726K853J966K060L552N573O646O332N735O064P176P970
60141A019465P857P228O700O439O258N934N388M841M679M897M901M174L011K060
$$ y = [779969, 780008, 779912, 779695, 779222, 778648, 778522, 779221, 780611, 782448, 784781, 787780, 791386, 795295, 799165, 802778, 806206, 809837, 813985, 818485, 822956, 827410, 832235, 837565, 843133, 848809, 854783, 860980, 866776, 871731, 876277, 881321, 887257, 893641, 899667, 904772, 908931, 912615, 916275, 919746, 922326, 923594, 923891, 923825, 923635, 923334, 923076, 922932, 922507, 921320, 919540, 917884, 916703, 915525, 913628, 910798, 907488, 904521, 902747, 902564, 903465, 904221, 903907, 902780, 901920, 902007, 902670, 903198, 903599, 904658, 906939, 910067, 913126, 915564, 917497, 919286, 921130, 923105, 925377, 928181, 931582, 935259, 938569, 940955, 942429, 943546, 944847, 946413, 948087, 949986, 952513, 955893, 959812, 963538, 966391, 968357, 970417, 973969, 979542, 986188, 992520, 998255, 1004319, 1011495, 1019465, 1027322, 1034550, 1041250, 1047689, 1053947, 1059881, 1065269, 1070110, 1074789, 1079686, 1084587, 1088761, 1091772, 1093832]
60127A093832J351K63j447l152m090m227m177m473n205o180p168p938q207p791
60113A031391o860n903n275m877m470m139m029l759k646o87J225K323K782L230
60099I98306L886M633N497O628P985R422J0791J1689J1497J0175Q656P921P913
60086A104999P790P037N819M491L271K187R15r97l368n278o398p820j0627j4025
60072A087996j6055j6115j5631j5941j6637j6490j5181j3457j2162j1602j1531
60061I27194j1312j0373q772p044n434l717j885m37L11O48Q98R20N32j2l52m43
60045H80722l46k8L29K80k39p11q80j238k136k994l142l056l757n193o178o055
60029H45378n521n475n859o099o098o097o038n633n006m634m697m912m940m595
$$ y = [1093832, 1095183, 1095446, 1093999, 1090847, 1086757, 1082530, 1078353, 1073880, 1068675, 1062495, 1055327, 1047389, 1039182, 1031391, 1024531, 1018628, 1013353, 1008476, 1004006, 999867, 995838, 992079, 989433, 988746, 989971, 992294, 995076, 998306, 1002192, 1006825, 1012322, 1018950, 1026935, 1036357, 1047148, 1058837, 1070334, 1080509, 1089165, 1097086, 1104999, 1112789, 1119826, 1125645, 1130136, 1133407, 1135594, 1136509, 1135512, 1132144, 1126866, 1120468, 1112648, 1102021, 1087996, 1071941, 1055826, 1040195, 1024254, 1007617, 991127, 975946, 962489, 950327, 938725, 927194, 915882, 905509, 896737, 889693, 884259, 880542, 878657, 878220, 878531, 879179, 880077, 880997, 881529, 881517, 881165, 880722, 880376, 880348, 880677, 880957, 880718, 880007, 879127, 877889, 875753, 872759, 869617, 866561, 862804, 857611, 851433, 845378, 839857, 834382, 828523, 822424, 816326, 810229, 804191, 798558, 793552, 788918, 784221, 779309, 774369, 769774]
60015G69774l629j883J11J245R58n0o23m40n9J55N09J252K021K334K324K572L371
59998G79942M478N444N961N968N668N370N126M634L712K666K006J816J694J305
59984H35790P31K73Ml14q70j432j474q52j18P9j04J08J038K159K823K955K824
59967H43620K672K801L448M225M287L478K745K826L172K869K032J381Q46l06k112
59952H77984l792m974n994o883p055o322n387m921m905n131n584n905n408m114
59938H01609l115l204l747l644k826k040j554r39RR62J695K394L241M163N083
59923G98087N982O657O860O710O677O998P432P672P672P478P063O509O116O079
59909H93992O211O155N790N264M700M083L390K696K085J638J491J799K482L144
$$ y = [769774, 766145, 764262, 764373, 765618, 766576, 766526, 765903, 765463, 765404, 765559, 766068, 767320, 769341, 771675, 773999, 776571, 779942, 784420, 789864, 795825, 801793, 807461, 812831, 817957, 822591, 826303, 828969, 830975, 832791, 834485, 835790, 836521, 836794, 836798, 836484, 835614, 834182, 832708, 831856, 831738, 831817, 831713, 831821, 832859, 835018, 837841, 840796, 843620, 846292, 849093, 852541, 856766, 861053, 864531, 867276, 870102, 873274, 876143, 878175, 879556, 880402, 880096, 877984, 874192, 869218, 863224, 856341, 849286, 842964, 837577, 832656, 827751, 822620, 817036, 811131, 805723, 801609, 798494, 795290, 791543, 787899, 785073, 783033, 781479, 780540, 780549, 781511, 783206, 785600, 788841, 793004, 798087, 804069, 810726, 817586, 824296, 830973, 837971, 845403, 853075, 860747, 868225, 875288, 881797, 887913, 893992, 900203, 906358, 912148, 917412, 922112, 926195, 929585, 932281, 934366, 936004, 937495, 939294, 941776, 944920]
59895I44920L379L153K773K628L064M305O170P954Q917R029Q831Q631Q132P061
59881A028947N706M547L722L100K598K067J174k26j766l015m022n107o217o939
59867A024569p120p153p601q676r998j0788j0528r521q587q084p669p096o656
59854I15092o505o186n391m581m196l802k724j136L56J766L460N166O233O710
59840I04262P148P466P099O201N588N388M985M428M720O107P232O702M716K503
59826I84545Q30l54j434k849m825o890q212q701r176j0041j0635j0381r822r795
59812H92260j0185j0335j0096r738r202q275p186o311n545m604l645k949k316
59799H01873j429o39n58j064j495j737k351l477m319m052k814j486p42m90j27
$$ y = [944920, 948299, 951452, 954225, 956853, 959917, 964222, 970392, 978346, 987263, 996292, 1005123, 1013754, 1021886, 1028947, 1034653, 1039200, 1042922, 1046022, 1048620, 1050687, 1051861, 1051635, 1049869, 1046854, 1042832, 1037725, 1031508, 1024569, 1017449, 1010296, 1002695, 994019, 984021, 973233, 962705, 953184, 944597, 936513, 928844, 921748, 915092, 908587, 902401, 897010, 892429, 888233, 884431, 881707, 880571, 880927, 882693, 886153, 891319, 897552, 904262, 911410, 918876, 925975, 932176, 937764, 943152, 948137, 952565, 957285, 963392, 970624, 977326, 982042, 984545, 985375, 985021, 983587, 980738, 975913, 969023, 960811, 952110, 942934, 932893, 922258, 911877, 902055, 892260, 882075, 871740, 861644, 851906, 842704, 834429, 827243, 820932, 815387, 810783, 807138, 804189, 801873, 800444, 799805, 799247, 798183, 796688, 794951, 792600, 789123, 784804, 780752, 777938, 776452, 775710, 775220, 775093]
59784G75093P14J678K058J642R93P49J014J577K363L289M048M431M645M968N384
59769H14646N893O795Q130R240R479R158R125R566R875R752R648R966J0409J0477
59755I42159J0148R739R404R026Q485P691O562N172L832K755J732M28j006j931
59741A014196k069k046k674l862m781n133n501o193o519n897m993m778m870m017
59727I50863k138o50n43j196j512j199m02R15K527L595L599L088K952L326L842
59712I67067M375M911N127M785M154L583L093K829L286M448N332N133M224L365
59698A025712K522J433O40Q06J431J395N42m29j380k732m177m713m196l614l591
59683A009649l703l656l944m804n539n588n386n517n731n589n400n629n901n498
$$ y = [775093, 775807, 777485, 779543, 781185, 782178, 782927, 783941, 785518, 787881, 791170, 795218, 799649, 804294, 809262, 814646, 820539, 827334, 835464, 844704, 854183, 863341, 872466, 882032, 891907, 901659, 911307, 921273, 931682, 942159, 952307, 962046, 971450, 980476, 988961, 996652, 1003214, 1008386, 1012218, 1014973, 1016705, 1017133, 1016127, 1014196, 1012127, 1010081, 1007407, 1003545, 998764, 993631, 988130, 981937, 975418, 969521, 964528, 959750, 954880, 950863, 948725, 948075, 947532, 946336, 944824, 943625, 943223, 944138, 946665, 950260, 953859, 956947, 959899, 963225, 967067, 971442, 976353, 981480, 986265, 990419, 994002, 997095, 999924, 1003210, 1007658, 1012990, 1018123, 1022347, 1025712, 1028234, 1029667, 1030307, 1031113, 1032544, 1033939, 1034481, 1034052, 1032672, 1029940, 1025763, 1021050, 1016854, 1013240, 1009649, 1005946, 1002290, 998346, 993542, 988003, 982415, 977029, 971512, 965781, 960192, 954792, 949163, 943262, 937764]
59669I37764m601m163m545n045m820l767k414j411j175j570j883j451m83J45k
59654I00579m42o14p35j344k295k823k574j987j534j153q11j007k121l596m459
59639H73084m523m427m528m508m064l338k466j428n62m58j059j534j424j255j565
59624H35945j965j837j309q85n16J41R18J270J106R07J125J891L045M075M329
59609H48240L710K839K184J577R84R93J835K582K251J200N23N30P55J042J478
59594H72723J621R73J02N3P24J032O44K98K30l29j642k657k413j387p25q31j306
59577H67110j724j896j808j702j920k440k918l228l484l492k846j676o65j98j95
59562H36918o82j715k658k579j579p28l03P03K794M762N226M474L900M225N228
$$ y = [937764, 933163, 929000, 924455, 919410, 914590, 910823, 908409, 906998, 905823, 904253, 902370, 900919, 900436, 900581, 900579, 900137, 899523, 898788, 897444, 895149, 892326, 889752, 887765, 886231, 885078, 884267, 883260, 881139, 877543, 873084, 868561, 864134, 859606, 855098, 851034, 847696, 845230, 843802, 843240, 842782, 841723, 840189, 838765, 837510, 835945, 833980, 832143, 830834, 829949, 829433, 829574, 830492, 831762, 832868, 833775, 834900, 836791, 839836, 843911, 848240, 851950, 854789, 856973, 858550, 859534, 860527, 862362, 864944, 867195, 868395, 868918, 869448, 870203, 871245, 872723, 874344, 875317, 875419, 875472, 876196, 877228, 877872, 878170, 878400, 878071, 876429, 873772, 871359, 869972, 869247, 868416, 867110, 865386, 863490, 861682, 859980, 858060, 855620, 852702, 849474, 845990, 842498, 839652, 837976, 837311, 837113, 836918, 836236, 834521, 831863, 829284, 827705, 826977, 826674, 827377, 830171, 834933, 840159, 844633, 848533, 852758, 857986]
59547H57986O659Q398J0028J1128J1906J2805J3695J4121J4248J4836J6189J7687
59535A009686J8537J8607J8407J8318J7971J6527J3749J0591Q199O464M284J309
59523A162649j450l084m030n253o939q635j0141j1556j2856j4026j5300j6657
59511A052722j7466j7219j6205j4927j3322j1238r248q141p876p738p333o663
59499I15346n599m092k785k415k677k489j450j90P60J618K616L462L852L980M144
59484I14081M396M818N655O800P624P710P380P236P505Q046Q607Q866Q618Q262
59470A015604Q620R908J1208J1504J0932J0450J0502J0658J0593J0750J1652J3019
59458A145400J3998J4122J3676J3104J2406J1258R488P209M561J668j090l115
$$ y = [857986, 864645, 873043, 883071, 894199, 906105, 918910, 932605, 946726, 960974, 975810, 991999, 1009686, 1028223, 1046830, 1065237, 1083555, 1101526, 1118053, 1131802, 1142393, 1150592, 1157056, 1161340, 1162649, 1161199, 1158115, 1154085, 1148832, 1141893, 1133258, 1123117, 1111561, 1098705, 1084679, 1069379, 1052722, 1035256, 1018037, 1001832, 986905, 973583, 962345, 953097, 944956, 937080, 929342, 922009, 915346, 909747, 905655, 902870, 900455, 897778, 895289, 893839, 893649, 894409, 896027, 898643, 902105, 905957, 909937, 914081, 918477, 923295, 928950, 935750, 943374, 951084, 958464, 965700, 973205, 981251, 989858, 998724, 1007342, 1015604, 1024224, 1034132, 1045340, 1056844, 1067776, 1078226, 1088728, 1099386, 1109979, 1120729, 1132381, 1145400, 1159398, 1173520, 1187196, 1200300, 1212706, 1223964, 1233452, 1240661, 1245222, 1246890, 1245800, 1242685]
59446A242685m186m885o046p799r482j0548j1106j1411j1312j0678r957r619r174
59433A126482p524m518j391O85J904L105M434N510O515Q037R932J1361J2038J2439
59419A189009J2501J1250Q323M986K714J514M62p14j582k163k932l898m790o076
59405A208604q650j2250j5262j6538j6528j6179j5541j4170j2291j0722r903r670
59393A050900r860j0564j1707j2793j3249j2945j2242j1508j0642r230p306n538
59381I23316m468l823k989j889q37K34J648L258M523N435O514P865Q951R574J0297
59366I67609J1544J3016J4440J6197J8667K1449K3806K5496K6730K7729K8691
59355A195374K9846L1016L1470L0672K8877K6642K4143K1340J8413J5505J2330
$$ y = [1242685, 1238499, 1233614, 1227568, 1219769, 1210287, 1199739, 1188633, 1177222, 1165910, 1155232, 1145275, 1135656, 1126482, 1118958, 1114440, 1113049, 1113734, 1115638, 1118743, 1123177, 1128687, 1135202, 1143239, 1153171, 1164532, 1176570, 1189009, 1201510, 1212760, 1221083, 1226069, 1228783, 1230297, 1230759, 1230045, 1228463, 1226300, 1223368, 1219470, 1214680, 1208604, 1199954, 1187704, 1172442, 1155904, 1139376, 1123197, 1107656, 1093486, 1081195, 1070473, 1060570, 1050900, 1041040, 1030476, 1018769, 1005976, 992727, 979782, 967540, 956032, 945390, 936160, 928854, 923316, 918848, 915025, 912036, 910147, 909310, 909544, 911192, 914450, 918973, 924408, 930922, 938787, 947738, 957312, 967609, 979153, 992169, 1006609, 1022806, 1041473, 1062922, 1086728, 1112224, 1138954, 1166683, 1195374, 1225220, 1256236, 1287706, 1318378, 1347255, 1373897, 1398040, 1419380, 1437793, 1453298, 1465628]
59344A465628Q576M370o5m860j0013j4775j8251k0500k2436k4654k6908k8737
59332A307375k9979l0554l0236k8980k7175k5322k3579k1745j9575j7047j4396
59321A038787j1917r757p909o377n228m415l662k625j181M06J549J745J108L78
59307I90902J90M50P41J049J650K358K595K247J996K600M272O751R464J1573J2447
59292A051285J2414J2543J3452J4732J5675J6085J6187J6265J6631J7443J8415
59281A221127J9070J9351J9346J8519J6089J2478R368P800O965N455K997K99k095
59268A356769m002n284o166p458r669j2189j4034j5075j5862j6558j6810j6478
59256A217184j5803j4944j3879j2633j1214r496p575n949m861l878k542j124j45
$$ y = [1465628, 1474204, 1478574, 1478509, 1473649, 1463636, 1448861, 1430610, 1410110, 1387674, 1363020, 1336112, 1307375, 1277396, 1246842, 1216606, 1187626, 1160451, 1135129, 1111550, 1089805, 1070230, 1053183, 1038787, 1026870, 1017113, 1009204, 1002827, 997599, 993184, 989522, 986897, 985716, 986122, 987671, 989416, 990524, 990902, 991092, 991542, 992283, 993332, 994982, 997340, 999935, 1002182, 1004178, 1006778, 1011050, 1017801, 1027265, 1038838, 1051285, 1063699, 1076242, 1089694, 1104426, 1120101, 1136186, 1152373, 1168638, 1185269, 1202712, 1221127, 1240197, 1259548, 1278894, 1297413, 1313502, 1325980, 1335348, 1343148, 1350113, 1355568, 1358565, 1358864, 1356769, 1352767, 1347483, 1341317, 1333859, 1324190, 1312001, 1297967, 1282892, 1267030, 1250472, 1233662, 1217184, 1201381, 1186437, 1172558, 1159925, 1148711, 1139215, 1131640, 1125691, 1120830, 1116952, 1114410, 1113286, 1113141]
59243A113141M91J245K104K551K228J233j27j504k749m195o270q555r976j0361
59229A079256j0969j2763j4926j6054j6128j6198j6523j6266j4870j2771j0638
59218I21150q836p522o573n559m346l448l047k268l88J736K674K506K541L149
59204H91769L384K897K653L343M389N143N899O992P936Q181Q016P973Q046Q100
59190I74721Q364Q892R125Q645P945P734P991Q331Q905J0124J1666J2502J2072
59177A097017J1004J0473J1047J2171J2765J2274J1142J0113R315Q379P255O312
59165A219267N493M037J378j981m932o878q163r501j1186j2811j3834j4354j5127
59152A131408j6474j7545j7174j5351j3237j1715j0602r397q116o998n940m698
$$ y = [1113141, 1113632, 1114877, 1116981, 1119532, 1121760, 1122993, 1122866, 1121362, 1118613, 1114418, 1108148, 1099593, 1089617, 1079256, 1068287, 1055524, 1040598, 1024544, 1008416, 992218, 975695, 959429, 944559, 931788, 921150, 912314, 904792, 898219, 892660, 888314, 884866, 881819, 879551, 879163, 880899, 883573, 886079, 888620, 891769, 895153, 898050, 900703, 904046, 908435, 913578, 919477, 926469, 934405, 942586, 950602, 958575, 966621, 974721, 983085, 991977, 1001102, 1009747, 1017692, 1025426, 1033417, 1041748, 1050653, 1060777, 1072443, 1084945, 1097017, 1108021, 1118494, 1129541, 1141712, 1154477, 1166751, 1177893, 1188006, 1197321, 1205700, 1212955, 1219267, 1224760, 1228797, 1230175, 1228194, 1223262, 1216384, 1208221, 1198720, 1187534, 1174723, 1160889, 1146535, 1131408, 1114934, 1097389, 1080215, 1064864, 1051627, 1039912, 1029310, 1019913, 1011797, 1004799, 998859, 994161]
59140I94161l443k571k114j633p53M49J551K269K721L182L673M072M677O151Q604
59125A020996J1148J2862J3932J5185J6824J8230J8979J9305J9517J9613J9589
59114A206180J9564J9443J8930J8004J6887J5497J3432J0679P867N607L952K639
59102A358681J480K91j214l251n813q629j1108j2464j2393j1588j1182j1642j2480
59089A258688j2899j2403j1055r645r328j0503j2133j2813j2348j1663j1323j1037
59077A121538j0566j0159r945r642r183q790q273p089n476m624n155o134o285
59064A020217n663n369n924o679o816o337n799n436m887l831k654k135k430k784
59050I53473k467j552m64Q20K473M133N193N682O263P482R443J1879J4042J5001
$$ y = [994161, 990718, 988147, 986033, 984400, 983647, 984096, 985647, 987916, 990637, 993819, 997492, 1001564, 1006241, 1012392, 1020996, 1032144, 1045006, 1058938, 1074123, 1090947, 1109177, 1128156, 1147461, 1166978, 1186591, 1206180, 1225744, 1245187, 1264117, 1282121, 1299008, 1314505, 1327937, 1338616, 1346483, 1352090, 1356042, 1358681, 1360161, 1360452, 1359238, 1355987, 1350174, 1341545, 1330437, 1317973, 1305580, 1293992, 1282810, 1271168, 1258688, 1245789, 1233386, 1222331, 1212686, 1203358, 1192855, 1180722, 1167909, 1155561, 1143898, 1132575, 1121538, 1110972, 1100813, 1090868, 1081226, 1072043, 1063253, 1054980, 1047891, 1042415, 1037791, 1032636, 1026502, 1020217, 1014554, 1009185, 1003261, 996582, 989766, 983429, 977630, 972194, 967307, 963476, 960822, 958687, 956257, 953473, 951006, 949454, 948990, 949810, 952283, 956416, 961609, 967291, 973554, 981036, 990479, 1002358, 1016400, 1031401]
59036A031401J4795J4782J5939J7318J7358J6250J5520J5535J5102J3754J2587
59025A200341J2283J1892J0498Q707P391O106M041J698L36K07M37M07K59K42L74
59010A265219P45J540K735M113N470O605P378P957Q624R190R027P899O214M338
58996A347054K294K90j211k267l513n075o328p131q340j0378j2219j2701j2115
58983A268360j1580j1402j0994r978q355n934k596J028M026O332Q634J1187J3432
58970A252160J4856J5653J6322J6971J7183J6447J4742J2702J0946R269O979M022
58958A408252J110j478m366p897j1287j3631j5179j6747j8349j9245j9110j8349
58946A263724j7421j6404j5191j3647j1702r700q301p701p294o553n837n816o492
$$ y = [1031401, 1046196, 1060978, 1076917, 1094235, 1111593, 1127843, 1143363, 1158898, 1174000, 1187754, 1200341, 1212624, 1224516, 1235014, 1243721, 1251112, 1257218, 1261259, 1262957, 1263293, 1263500, 1263937, 1264344, 1264603, 1264845, 1265219, 1265964, 1267504, 1270239, 1274352, 1279822, 1286427, 1293805, 1301762, 1310386, 1319576, 1328603, 1336502, 1342716, 1347054, 1349348, 1349638, 1348427, 1346160, 1342647, 1337572, 1331244, 1324113, 1315773, 1305395, 1293176, 1280475, 1268360, 1256780, 1245378, 1234384, 1224406, 1216051, 1210117, 1207521, 1208549, 1212575, 1218907, 1227541, 1238728, 1252160, 1267016, 1282669, 1298991, 1315962, 1333145, 1349592, 1364334, 1377036, 1387982, 1397251, 1404230, 1408252, 1409362, 1407884, 1403518, 1395621, 1384334, 1370703, 1355524, 1338777, 1320428, 1301183, 1282073, 1263724, 1246303, 1229899, 1214708, 1201061, 1189359, 1179659, 1171358, 1163657, 1156363, 1149810, 1143973, 1138157, 1131665]
58933A131665p304p885q255q630r446j1065j2967j3778j2816j1024r712q877p664
58920A002242n937m350l095j719j18J250K336L758N847Q122J0019J1630J3457
58907A043442J5751J8335K0771K2757K4478K6517K9224L2383L5684L9083M2309
58896A350734M4567M5284M4880M4073M2887M0994L8705L6637L4528L1374K6848
58885A781511K1730J6662J1302N133j607q198j4253j9755k4605k8580l1706l4256
58873A673378l6341l7644l7704l6461l4459l2371l0367k8196k5844k3745k2187
58862A328059k0939j9704j8637j8033j7795j7566j7193j6757j6342j6044j6024
58851A133025j6210j6263j6036j5839j5944j6071j5765j5021j4162j3206j1818
$$ y = [1131665, 1124361, 1116476, 1108221, 1099591, 1090145, 1079080, 1066113, 1052335, 1039519, 1028495, 1018783, 1009906, 1002242, 996305, 991955, 988860, 987141, 987023, 988273, 990609, 994367, 1000214, 1008336, 1018355, 1029985, 1043442, 1059193, 1077528, 1098299, 1121056, 1145534, 1172051, 1201275, 1233658, 1269342, 1308425, 1350734, 1395301, 1440585, 1485465, 1529538, 1572425, 1613419, 1652124, 1688761, 1723289, 1754663, 1781511, 1803241, 1819903, 1831205, 1836338, 1834731, 1826533, 1812280, 1792525, 1767920, 1739340, 1707634, 1673378, 1637037, 1599393, 1561689, 1525228, 1490769, 1458398, 1428031, 1399835, 1373991, 1350246, 1328059, 1307120, 1287416, 1268779, 1250746, 1232951, 1215385, 1198192, 1181435, 1165093, 1149049, 1133025, 1116815, 1100552, 1084516, 1068677, 1052733, 1036662, 1020897, 1005876, 991714, 978508, 966690]
58840I66690r866p753o146n370n103m667l866l199k919k306o31J354K037J190
58826I19445L66O53J212Q51j22o54p37j101j756k062k043k379l191l907m333m776
58810H95466n031m304k537r12n43j219j855j765j029KJ146K341L443M205M441
58795H91849M278M121M342N041O051P013P491P265O592N996N828O209P157Q262
58781I77495Q561P432N558M252L835L544L031K832L056K803J538O7n53l53k6Q8
58765A023160j8l52n68J1J335K309K177J592J646K480L532M414N006N354O042
58750A058120P794J0159J1624J1790J2236J4251J6921J8704J9698K0855K1895
58739A224047K1724K0424J9183J8598J8415J8514J8788J8422J6765J4569J3009
$$ y = [966690, 956824, 949071, 942925, 937555, 932452, 927785, 923919, 920720, 917801, 915495, 914864, 916218, 918255, 919445, 919811, 920464, 921676, 922527, 922405, 921751, 921014, 919913, 918157, 916095, 914052, 911673, 908482, 904575, 900242, 895466, 890435, 886131, 883594, 882682, 882139, 880920, 879065, 877300, 876271, 876273, 877419, 879760, 883203, 887408, 891849, 896127, 900248, 904590, 909631, 915682, 922695, 930186, 937451, 944043, 950039, 955867, 962076, 969233, 977495, 986056, 993488, 999046, 1003298, 1007133, 1010677, 1013708, 1016540, 1019596, 1022399, 1023937, 1024004, 1023451, 1023098, 1023072, 1023160, 1023142, 1022790, 1022222, 1022233, 1023568, 1025877, 1028054, 1029646, 1031292, 1033772, 1037304, 1041718, 1046724, 1052078, 1058120, 1065914, 1076073, 1087697, 1099487, 1111723, 1125974, 1142895, 1161599, 1181297, 1202152, 1224047, 1245771, 1266195, 1285378, 1303976, 1322391, 1340905, 1359693, 1378115, 1394880, 1409449, 1422458]
58728A422458J1792R758O967M628L059J337r93l371n508p788j0161j1942j2983
58715A407253j3894j4941j5826j6663j8002j9729k1004k1582k2121k3012k3869
58704A196610k4349k4578k4593k4254k3790k3592k3454k2819k1719k0596j9420
58693I43446j7904j6322j5097j3794j1745r417p949p349o485m852l053j501Q9
58680H28067J769L225M670O680Q992J0674J1619J2675J4045J4834J4423J3183
58668I44856J1643J0038Q845Q546Q605P771N633K906K02k361m446n732o856q689
58654I80961j0660j1278j0448r614r349q647p046n704n479n539m835l638k688
58641H86036k015j489j466j924j935r06M27J077J090J157J631K578M055N797P256
$$ y = [1422458, 1434250, 1444008, 1450975, 1455603, 1458662, 1459999, 1459006, 1455635, 1450127, 1442339, 1432178, 1420236, 1407253, 1393359, 1378418, 1362592, 1345929, 1327927, 1308198, 1287194, 1265612, 1243491, 1220479, 1196610, 1172261, 1147683, 1123090, 1098836, 1075046, 1051454, 1028000, 1005181, 983462, 962866, 943446, 925542, 909220, 894123, 880329, 868584, 859167, 851218, 843869, 837384, 832532, 829479, 827978, 828067, 829836, 833061, 837731, 844411, 853403, 864077, 875696, 888371, 902416, 917250, 931673, 944856, 956499, 966537, 975382, 983928, 992533, 1000304, 1005937, 1008843, 1009045, 1006684, 1002238, 996506, 989650, 980961, 970301, 959023, 948575, 938961, 929612, 920965, 913919, 908215, 902736, 897197, 892362, 888724, 886036, 884021, 882532, 881066, 879142, 877207, 876301, 876728, 877805, 878895, 880052, 881683, 884261, 888316, 894113, 901369]
58626I01369Q366R578J0963J2055J2804J3632J4340J4135J3056J2190J2050J1854
58614A046392J0977R896R042P883N886L444J148j008l071m631n505o082o503o250
58600A061618n080l535k104o23J099K938M987P508J0031J1601J2126J2496J3081
58587A126143J3337J3229J3627J4818J5855J6096J6155J6598J6899J6471J5700
58576A294928J5186J4920J4832J5270J6294J7340J8183J9343K1079K2774K3779
58565A493928K3955K3192K1381J9099J7128J5134J2089Q113M442J253k684p694
58553A629336j2297j5429j7949k0944k3975k6053k7121k7552k7343k6619k5964
58542A378090k5532k4809k3687k2579k1182j8695j5597j3443j2363j0679p698
$$ y = [901369, 909735, 919313, 930276, 942331, 955135, 968767, 983107, 997242, 1010298, 1022488, 1034538, 1046392, 1057369, 1067265, 1076307, 1084190, 1090076, 1093520, 1094668, 1093660, 1090589, 1085958, 1080453, 1074371, 1067868, 1061618, 1056538, 1053003, 1050899, 1050276, 1051375, 1054313, 1059300, 1066808, 1076839, 1088440, 1100566, 1113062, 1126143, 1139480, 1152709, 1166336, 1181154, 1197009, 1213105, 1229260, 1245858, 1262757, 1279228, 1294928, 1310114, 1325034, 1339866, 1355136, 1371430, 1388770, 1406953, 1426296, 1447375, 1470149, 1493928, 1517883, 1541075, 1562456, 1581555, 1598683, 1613817, 1625906, 1634019, 1638461, 1639714, 1637030, 1629336, 1617039, 1601610, 1583661, 1562717, 1538742, 1512689, 1485568, 1458016, 1430673, 1404054, 1378090, 1352558, 1327749, 1304062, 1281483, 1260301, 1241606, 1226009, 1212566, 1200203, 1189524, 1181826]
58531A181826m816k951j037J680L903M492M509N423O841P584P680P661P304O507
58517A236606O019N874M616J646j249k371k557l373m412m523m321n215o890p964
58503A211886q385r084r853r604q313o936n764m425l028j815j96K333M894O301
58489A158011O827P518Q351Q559Q180P832P448O601N553M801M042K739J100o34
58475A236928k970o172r241j1173j2316j3403j4164j4189j4080j4393j4348j3042
58463A097437j0966r024p031m565k300r97k03P09J235Q93N77J173J941J788J045
58448A071712M83k40j487k285j819j044r54n32J577M441O073O347O638P383Q024
58433A104317Q608R469J0003R610R097R450J0121J0153R927J0005R541P752N706
$$ y = [1181826, 1177010, 1174059, 1173022, 1174702, 1178605, 1183097, 1187606, 1193029, 1199870, 1207454, 1215134, 1222795, 1230099, 1236606, 1242625, 1248499, 1253115, 1254761, 1253512, 1251141, 1248584, 1245211, 1240799, 1236276, 1231955, 1226740, 1219850, 1211886, 1203501, 1194417, 1184564, 1174960, 1166647, 1159711, 1153947, 1149522, 1146494, 1144679, 1144483, 1146816, 1151710, 1158011, 1164838, 1172356, 1180707, 1189266, 1197446, 1205278, 1212726, 1219327, 1224880, 1229681, 1233723, 1236462, 1237562, 1236928, 1233958, 1227786, 1218545, 1207372, 1195056, 1181653, 1167489, 1153300, 1139220, 1124827, 1110479, 1097437, 1086471, 1077447, 1070416, 1065851, 1063551, 1062554, 1062351, 1063060, 1064295, 1065188, 1065765, 1066938, 1068879, 1070667, 1071712, 1072195, 1071955, 1070468, 1068183, 1066364, 1065320, 1064366, 1063834, 1065411, 1069852, 1075925, 1082272, 1088910, 1096293, 1104317, 1112925, 1122394, 1132397, 1142007, 1151104, 1160554, 1170675, 1180828, 1190755, 1200760, 1210301, 1218053, 1223759]
58420A223759M610L665J746k17r33j404l206n419o133n910o734q405r044q579
58406A177796q642r427r619r207r456j0228j0068q911q138p937p210n916n176
58393A067861n062m712m380m965n780n325m011l656m397m687m108l668l369k114
58379A007627NJ739K970M655O615P779Q458R969J2142J3546J3926J4123J3907
58366A117461J2434J0500R770J0031R707Q707Q151P726O111L739K311J851J033
58353A209532J08N95K240L241L323L813M864N466N930P383R087R347Q756R409
58339A283094J1136J1708J0695R826R693R199Q219P590O735M521K174J899L005
58326A379494K971J882K003L318L635K968L533N300N890N159N560P504Q635Q344
$$ y = [1223759, 1228369, 1232034, 1233780, 1233563, 1232630, 1231226, 1228020, 1222601, 1216468, 1210558, 1203824, 1195419, 1186375, 1177796, 1169154, 1159727, 1150108, 1140901, 1131445, 1121217, 1111149, 1102238, 1094100, 1086163, 1078953, 1073037, 1067861, 1062799, 1058087, 1053707, 1048742, 1042962, 1037637, 1033626, 1029970, 1025573, 1020886, 1016778, 1013110, 1009741, 1007627, 1007632, 1009371, 1012341, 1016996, 1023611, 1031390, 1039848, 1049817, 1061959, 1075505, 1089431, 1103554, 1117461, 1129895, 1140395, 1150165, 1160196, 1169903, 1178610, 1186761, 1194487, 1200598, 1204337, 1206648, 1208499, 1209532, 1209640, 1210235, 1212475, 1215716, 1219039, 1222852, 1227716, 1233182, 1239112, 1246495, 1255582, 1264929, 1273685, 1283094, 1294230, 1305938, 1316633, 1326459, 1336152, 1345351, 1353570, 1361160, 1367895, 1372416, 1374590, 1376489, 1379494, 1382465, 1384347, 1386350, 1389668, 1393303, 1396271, 1399804, 1405104, 1410994, 1416153, 1421713, 1429217, 1437852, 1446196]
58312A446196Q644R962J0327R493R601J0883J1014R667R400J1003J2140J1773
58300A570103J1729J2741J3001J1887J1224J1728J1999J1890J3019J5182J6262
58289A710765J6271J7371J9511K0520K0804K3040K6802K8668K8410K9653L3491
58278A975306L6916L8631M0805M3808M4994M4137M4353M6090M6117M4019M3570
58267B448746M5792M6881M5092M3490M3690M3147M1002M0233M1514M1368L8952
58256B919907L8152M0353M1913M1520M3033M7950N2264N4178N7619O4478P0670
58245C472037P3821P7646Q4616R1504R6327J02415J11419J19727J25965J34313
58235D489790J46214J56912J64567J74264J88453K02468K14364K29600K50521
$$ y = [1446196, 1454840, 1464802, 1475129, 1484622, 1494223, 1505106, 1516120, 1525787, 1535187, 1546190, 1558330, 1570103, 1581832, 1594573, 1607574, 1619461, 1630685, 1642413, 1654412, 1666302, 1679321, 1694503, 1710765, 1727036, 1744407, 1763918, 1784438, 1805242, 1828282, 1855084, 1883752, 1912162, 1941815, 1975306, 2012222, 2050853, 2091658, 2135466, 2180460, 2224597, 2268950, 2315040, 2361157, 2405176, 2448746, 2494538, 2541419, 2586511, 2630001, 2673691, 2716838, 2757840, 2798073, 2839587, 2880955, 2919907, 2958059, 2998412, 3040325, 3081845, 3124878, 3172828, 3225092, 3279270, 3336889, 3401367, 3472037, 3545858, 3623504, 3708120, 3799624, 3895951, 3998366, 4109785, 4229512, 4355477, 4489790, 4636004, 4792916, 4957483, 5131747, 5320200, 5522668, 5737032, 5966632, 6217153]
58226F217153K71324K89420L11402L41211L73184M03930M39935M85667N35824
58217I669050N87850O50006P27936Q16095R12934J031262J182367J364698J582870
58208A8525068J865484K249881K761030L416825M238386N243733O453849P916473
58200E2670729R676686J1668177J3648984J5307370J6450863J7062266J7175566
58193A53660641J6762563J5789937J4362104J2746973J1227277R931403Q828420
58186B43309318P881153P132104O532994N674424L837183N17568m028168q837198
58178B62019378j2898054j5752359j7502706j8403045j8574828j8057761j6960665
58171A43869960j5480552j3822205j2141750j0536415r047920p679760o431241
$$ y = [6217153, 6488477, 6777897, 7089299, 7430510, 7803694, 8207624, 8647559, 9133226, 9669050, 10256900, 10906906, 11634842, 12450937, 13363871, 14395133, 15577500, 16942198, 18525068, 20390552, 22640433, 25401463, 28818288, 33056674, 38300407, 44754256, 52670729, 62347415, 74015592, 87664576, 102971946, 119422809, 136485075, 153660641, 170423204, 186213141, 200575245, 213322218, 224549495, 234480898, 243309318, 251190471, 258322575, 264855569, 270529993, 274367176, 274884744, 270856576, 262019378, 249121324, 233368965, 215866259, 197463214, 178888386, 160830625, 143869960, 128389408, 114567203, 102425453, 91889038, 82841118, 75161358, 68730117]
58164F8730117n323091m401250l727006l346773l240180l297775l378254l398007
58156C8617781l353327l264539l130422k942204k709775k454255k190655j930944
58148A6641660j689933j475144j281071j102866r46167q16210p07964o14851n37490
58139G469964m76397m25312l79129l40359l11117k86597k62534k41463k25732
58130D521324k11592j95841j81308j70263j59321j45940j33454j24519j16160
58121C082926j06190r8142r4704r2395q7735q2919q0541p8340p3992o9679o7354
58110B150935o4563n9496n4992n3160n1118m6444m1859m0097l8973l5989l3118
58099A631126l2492l1775k8395k4324k2333k1413j9929j9352k0819k1860k0533
$$ y = [68730117, 63407026, 59005776, 55278770, 51931997, 48691817, 45394042, 42015788, 38617781, 35264454, 31999915, 28869493, 25927289, 23217514, 20763259, 18572604, 16641660, 14951727, 13476583, 12195512, 11092646, 10146479, 9330269, 8622305, 8007454, 7469964, 6993567, 6568255, 6189126, 5848767, 5537650, 5251053, 4988519, 4747056, 4521324, 4309732, 4113891, 3932583, 3762320, 3602999, 3457059, 3323605, 3199086, 3082926, 2976736, 2878594, 2783890, 2691495, 2603760, 2520841, 2440300, 2361960, 2287968, 2218289, 2150935, 2086372, 2026876, 1971884, 1918724, 1867606, 1821162, 1779303, 1739206, 1700233, 1664244, 1631126, 1598634, 1566859, 1538464, 1514140, 1491807, 1470394, 1450465, 1431113, 1410294, 1388434, 1367901]
58088A367901j8976j9144j9038j7034j5778j7519j9628j9167j8149j9586k1870
58077A162012k1880k0567k0626k1346k0459j8761j8378j8478j7028j4912j4219
58066I55358j4146j2566j0071q787q554p704o291n427m830l859l495m567n694
58053H59367n537n260o201p126o442n074m483m018k987l050n465q117q454p457
58039G79696p570q553q626q021q074q277p368o140o173o934o915o393o441o558
58025F77653n894n293n626n599m030k542l084m304l606j437l25o76p23J33J042
58010F35689K125M242O735Q053Q232Q488Q908Q780Q499Q910R426Q984Q036P539
57996G42646O945N441M112M419N398M913K952J181kj409k660k549j571j556k795
$$ y = [1367901, 1348925, 1329781, 1310743, 1293709, 1277931, 1260412, 1240784, 1221617, 1203468, 1183882, 1162012, 1140132, 1119565, 1098939, 1077593, 1057134, 1038373, 1019995, 1001517, 984489, 969577, 955358, 941212, 928646, 918575, 909788, 901234, 893530, 887239, 881812, 876982, 873123, 869628, 865061, 859367, 853830, 848570, 842369, 835243, 828801, 823727, 819244, 815226, 812239, 809189, 803724, 795607, 787153, 779696, 772126, 763573, 754947, 746926, 738852, 730575, 723207, 717067, 710894, 703960, 697045, 690652, 684211, 677653, 671759, 666466, 660840, 655241, 651211, 648669, 645585, 641281, 637675, 636238, 635913, 635237, 634514, 634647, 635689, 637814, 642056, 648791, 656844, 665076, 673564, 682472, 691252, 699751, 708661, 718087, 727071, 735107, 742646, 749591, 755032, 759144, 763563, 768961, 773874, 776826, 778007, 778005, 776596, 773936, 771387, 769816, 768260, 765465]
57981G65465l763l712l467l669l947l948l673k923j716q60q60r42l99jo32j591
57965G29362j816j722k184k758k711k667l333l748k848j689j949l173l740l584
57951F91440l588l262j602M27J003N14R47K492L456L486M160O099P886Q450Q483
57936G30391Q881R512J0094J0766J1339J1256J0571R878R153P848O072M531L406
57923H43698K277R54o22k842n715q132r078r109r546j0677j1924j3057j4039j4373
57909G37815j3899j3553j3996j4330j3486j2053j1220j0840j0098r256r001q835
57897E97248p943o879o630o681n852m393l408k833j896r73r91j427r71J94O82
57882E47247K53n5J58L54M36O96P16l1q32p12k46o51j618j917j601j574j505l61
$$ y = [765465, 761702, 757990, 754523, 750854, 746907, 742959, 739286, 736363, 734647, 733787, 732927, 731985, 731586, 731585, 730953, 729362, 727546, 725824, 723640, 720882, 718171, 715504, 712171, 708423, 705575, 703886, 701937, 698764, 695024, 691440, 687852, 684590, 682988, 683415, 684418, 684932, 685879, 688371, 691827, 695313, 699473, 705572, 713458, 721908, 730391, 739272, 748784, 758878, 769644, 780983, 792239, 802810, 812688, 821841, 829689, 835761, 840292, 843698, 845975, 846929, 846307, 843465, 837750, 829618, 820540, 811431, 801885, 791208, 779284, 766227, 752188, 737815, 723916, 710363, 696367, 682037, 668551, 656498, 645278, 634438, 624340, 615084, 606083, 597248, 589305, 582426, 575796, 569115, 563263, 558870, 555462, 552629, 550733, 549760, 548769, 547342, 546371, 546565, 547247, 547500, 547445, 547603, 547957, 548393, 549089, 549805, 549774, 548942, 548230, 547984, 547333, 545715, 543798, 542197, 540623, 539118, 538757]
57864E38757J382K300K550L618N595P016P414P840Q667R006Q631Q510R006R316
57850F29608R081Q888Q953Q799Q404Q145P570N831L285J158k65j596k793l353
57836F91715l755m883o277o784o608o811p163o634n672n690o435o284n131m497
57822F09091m701m395l123j888q86P85K704L076J787J031K015L375L677L238K611
57807F18397J488J43k14M39M29r72k422k958l453m546n284n019m765n322n855
57792E80086n561n077m977m648l886l776m720n292m450l168k495j740j20J425
57778E31601J706J171P56K95m07l78Q91J946J326j50q24q34j441k626l386l703
57762E25943m390n361n837n921o447p393p900p687p292p052o862o765o797o586
$$ y = [538757, 540139, 542439, 544989, 548607, 554202, 561218, 568632, 576472, 585139, 594145, 602776, 611286, 620292, 629608, 638689, 647577, 656530, 665329, 673733, 681878, 689448, 695279, 698564, 699722, 699457, 697861, 695068, 691715, 687960, 683077, 676800, 670016, 663408, 656597, 649434, 642800, 637128, 631438, 625003, 618719, 613588, 609091, 604390, 599995, 596872, 594984, 594098, 594883, 597587, 600663, 602450, 603481, 605496, 608871, 612548, 615786, 618397, 619885, 620028, 619814, 620253, 620682, 619710, 617288, 614330, 610877, 606331, 601047, 596028, 591263, 585941, 580086, 574525, 569448, 564471, 559823, 555937, 552161, 547441, 542149, 537699, 534531, 532036, 530296, 530176, 531601, 533307, 534478, 535234, 535529, 535122, 534744, 535635, 537581, 538907, 538757, 537933, 537099, 535658, 533032, 529646, 525943, 521553, 516192, 510355, 504434, 497987, 490594, 482694, 475007, 467715, 460663, 453801, 447036, 440239, 433653]
57748D33653n897n212m933m552l493k256j706j752j654j306j157j237j216j141
57734C96141j299j543j514j215q21k82K54K33m46q94l97M25M68k36o15q2Q43J308
57716C90328R72J83l23j14L39J32p93j415j023j42L37L08K66N37J137J852K117
57699C94698J437K29m14r7N39J100J991L313M249M318M255M936O287P987J0418
57684D45246J3988J8332K3021K8436L5029M2289M9332N5894O1891O6499O8639
57673I08596O8101O5478O1332N6116N0582M5522M1239L7672L4634L1388K6296
57662A426956J7480L988j3552l2894n0905o5115p4968q1115q3723q2393p7652
57651H86107p1263o4633n7868n0778m3739l7174l1165k5995k2088j9084j6106
$$ y = [433653, 427756, 422544, 417611, 413059, 409566, 407310, 405604, 403852, 402198, 400892, 399735, 398498, 397282, 396141, 394842, 393299, 391785, 390570, 389749, 389467, 389721, 389954, 389508, 388614, 388217, 388642, 389110, 388874, 388259, 388177, 389020, 390328, 391300, 391483, 391160, 391046, 391385, 391517, 390724, 389309, 388286, 388144, 388481, 388789, 389055, 389592, 390729, 392581, 394698, 396135, 396364, 395950, 395853, 396392, 397492, 399483, 402796, 407045, 411363, 415618, 420554, 426841, 434828, 445246, 459234, 477566, 500587, 529023, 564052, 606341, 655673, 711567, 773458, 839957, 908596, 976697, 1042175, 1103507, 1159623, 1210205, 1255727, 1296966, 1334638, 1369272, 1400660, 1426956, 1444436, 1448424, 1434872, 1401978, 1351073, 1285958, 1210990, 1129875, 1046152, 963759, 886107, 814844, 750211, 692343, 641565, 597826, 560652, 529487, 503492, 481404, 462320, 446214]
57640D46214j3206j1271j0258q930o963n589n455n499m865m327m576m749m013
57627C56513l158l064k957j879p40r57j968k091j222p49j153j522j341j100j039
57612C31573p91l13p7j78k63k58l20k64J26M62L24P2K13M07J9o81r67q73r85j370
57592C25856j662j885k171k188j771j666k459l340l144k249k039k743l272l054
57578B92213k710k738k790k507k138k021k246k827l576l770k786j056K92O95M42
57563B62477m5n10o71m85m05o69o53L07J732K510K340J859J578J446J321J098
57547B73230O36J90M78J627K571K356J533J211J255O74n22j201p44L14J278J846
57531B86732J708O38q55j892k266k411k357j662m05O44R79Q05M98K14O1R1J52
$$ y = [446214, 433008, 421737, 411479, 402549, 395586, 389997, 384542, 379043, 374178, 369851, 365275, 360526, 356513, 353355, 350291, 347334, 345455, 344715, 343758, 341790, 339699, 338477, 337728, 336575, 335053, 333712, 332612, 331573, 330782, 330469, 330392, 330214, 329951, 329693, 329373, 329109, 329235, 329697, 330021, 330093, 330306, 330713, 330732, 330051, 329084, 328211, 327226, 325856, 324194, 322309, 320138, 317950, 316179, 314513, 312054, 308714, 305570, 303321, 301282, 298539, 295267, 292213, 289503, 286765, 283975, 281468, 279330, 277309, 275063, 272236, 268660, 264890, 262104, 261048, 261340, 262035, 262477, 262432, 261922, 261251, 260766, 260361, 259692, 259039, 259346, 261078, 263588, 265928, 267787, 269365, 270811, 272132, 273230, 273866, 274056, 274534, 276161, 278732, 281088, 282621, 283832, 285087, 285761, 285239, 284038, 283294, 283608, 284886, 286732, 288440, 289078, 288223, 286331, 284065, 281654, 279297, 277635, 277230, 277874, 278853, 279658, 280156, 280370, 280431, 280522, 280674]
57514B80674J60L32O97Q02M26P1J87M19L54L78Q88J327R71K12k9K70M17J91k08
57495B88539q92j910k563k258j632j647k040j927j467j532j999j946j335r85r77
57480B63429n93Q2L8q69j463r70k5M60M01J41q0m8K60L50j60o74l08P08J373J475
57460B63527J641J927J715J052P38R26R08M97M05R39J455J482J280J039N21k00
57444B79852o12n95n16l34L61J360J903J809J531J114K45o53p04j48k34j311k284
57427B80784k331j945j802j774j519j060m17M38J061R34M65N06Q30M30o40j120
57411B72840n61L5kj02J46J41l98o60n1Q55J339J483J472J107N92O54J305J643
57393B81838J400J417J950J956Q56l19n22k10k68n07l03K74R09J727K611K809
$$ y = [280674, 280834, 281166, 281863, 282665, 283091, 283162, 283349, 283768, 284122, 284500, 285388, 286715, 287686, 287898, 287869, 288139, 288556, 288747, 288539, 287647, 285737, 283174, 280916, 279284, 277637, 275597, 273670, 272203, 270671, 268672, 266726, 265391, 264406, 263429, 262836, 262918, 262956, 262087, 260624, 259654, 259629, 260089, 260490, 260631, 260551, 260503, 260763, 261113, 260953, 260279, 259971, 260679, 262052, 263527, 265168, 267095, 268810, 269862, 270600, 271526, 272434, 272931, 273336, 274275, 275730, 277212, 278492, 279531, 280052, 279852, 279240, 278645, 278129, 277795, 278156, 279516, 281419, 283228, 284759, 285873, 286118, 285465, 284761, 284613, 284379, 283068, 280784, 278453, 276508, 274706, 272932, 271413, 270353, 269936, 270374, 271435, 272369, 272834, 273340, 274170, 274600, 273960, 272840, 272279, 272314, 272312, 272210, 272356, 272497, 272099, 271439, 271388, 272243, 273582, 275065, 276537, 277644, 278236, 278890, 280195, 281838, 283238, 284655, 286605, 288561, 289417, 289098, 288576, 288366, 288098, 287591, 287288, 287562, 288471, 290198, 292809, 295618]
57377B95618K121J470J492J537J007M89N27M35m46j330j200n63n56j065j152p39
57361B97645m14l2R62K159K510J965J516J631J785J608J421J499J601J471J223
57346C18550J113J336J907K452K360J604R73J087J605J936K104K343K330J678
57332C43378P74L39M70P73J095J395J283N04l61m43K67R85J234J214J249J433
57316C55589J778K198K449K492K683L257L820L813L258K645K298K222K324K445
57302C93271K407K318K564L269M033M406M299L787L029K509K746L553M169M347
57288D40707M578M994M924M088L365L606M344M447L665K773K543L250M893P280
57274D99457R965J2476J4475J5639J5789J5300J4873J4744J4688J4883J5974J8017
$$ y = [295618, 297739, 299209, 300701, 302238, 303245, 303734, 304261, 304696, 304250, 302920, 301720, 301157, 300601, 299536, 298384, 297645, 297231, 297199, 298161, 300320, 302830, 304795, 306311, 307942, 309727, 311335, 312756, 314255, 315856, 317327, 318550, 319663, 320999, 322906, 325358, 327718, 329322, 330295, 331382, 332987, 334923, 337027, 339370, 341700, 343378, 344152, 344491, 344961, 345734, 346829, 348224, 349507, 350011, 349650, 349207, 349474, 350459, 351693, 352907, 354156, 355589, 357367, 359565, 362014, 364506, 367189, 370446, 374266, 378079, 381337, 383982, 386280, 388502, 390826, 393271, 395678, 397996, 400560, 403829, 407862, 412268, 416567, 420354, 423383, 425892, 428638, 432191, 436360, 440707, 445285, 450279, 455203, 459291, 462656, 466262, 470606, 475053, 478718, 481491, 484034, 487284, 492177, 499457, 509422, 521898, 536373, 552012, 567801, 583101, 597974, 612718, 627406, 642289, 658263, 676280]
57262F76280K0219K2129K4215K6842K9516L1708L3517L4892L5104L3932L2683
57251A001037L3119L5573L8819M1339M2166M0913L7704L3036K7529K2074J8065
57240A371374J6753J8174K1449K5991L1232L5326L6091L4121L3008L4930L7212
57229A695661L5021K6884J6011O711R89j460j673m34J832M867Q365J2089J6218
57216A821081K0923K5558K9071L1509L4093L7204L9374L9119L6857L4051L1230
57205B180070K7921K3947J9717J5573J1728Q633O705O005O560Q454J1246J4021
57193B340580J6585J9786K4056K8540L2345L5725L9169M2227M4222M5393M6337
57182B714965M6957M6907M6579M6773M7740M9152N0493N1135N0713M9854M9650
$$ y = [676280, 696499, 718628, 742843, 769685, 799201, 830909, 864426, 899318, 934422, 968354, 1001037, 1034156, 1069729, 1108548, 1149887, 1192053, 1232966, 1270670, 1303706, 1331235, 1353309, 1371374, 1388127, 1406301, 1427750, 1453741, 1484973, 1520299, 1556390, 1590511, 1623519, 1658449, 1695661, 1730682, 1757566, 1773577, 1780288, 1781277, 1779817, 1778144, 1777710, 1779542, 1784409, 1792774, 1804863, 1821081, 1842004, 1867562, 1896633, 1928142, 1962235, 1999439, 2038813, 2077932, 2114789, 2148840, 2180070, 2207991, 2231938, 2251655, 2267228, 2278956, 2287589, 2294294, 2300299, 2306859, 2315313, 2326559, 2340580, 2357165, 2376951, 2401007, 2429547, 2461892, 2497617, 2536786, 2579013, 2623235, 2668628, 2714965, 2761922, 2808829, 2855408, 2902181, 2949921, 2999073, 3049566, 3100701, 3151414, 3201268, 3250918]
57171C250918N0064M9990M9274M9159M9972M9997M7783M4256M1199L8915L6660
57160C758187L4220L1630K8326K4117K0124J7423J5558J3640J2038J1611J2062
57149C978936J2419J2483J2591J2653J2444J2052J1036Q147K934l378r617j6003
57137D046697k2737k8737l3139l6694m0182m2830m3757m3600m3060m1115l6456
57126C634390k9573k1892j4018o303K89N456J0403J5997K1569K6785L2840M0318
57114C716261M7892N4736O2107P0900Q0072Q9309J00710J16182J36044J61698
57104D635911J96378K42428L03507L91365N22312P00079R06170J110989J287300
57095A0296439J407584J439855J360417J165086Q53658M10633j72800q46461j483625
$$ y = [3250918, 3300982, 3350972, 3400246, 3449405, 3499377, 3549374, 3597157, 3641413, 3682612, 3721527, 3758187, 3792407, 3824037, 3852363, 3876480, 3896604, 3914027, 3929585, 3943225, 3955263, 3966874, 3978936, 3991355, 4003838, 4016429, 4029082, 4041526, 4053578, 4064614, 4072761, 4075695, 4072317, 4062700, 4046697, 4023960, 3995223, 3962084, 3925390, 3885208, 3842378, 3798621, 3755021, 3711961, 3670846, 3634390, 3604817, 3582925, 3568907, 3562604, 3562893, 3568349, 3578752, 3594749, 3616318, 3643103, 3675943, 3716261, 3764153, 3818889, 3880996, 3951896, 4031968, 4121277, 4221987, 4338169, 4474213, 4635911, 4832289, 5074717, 5378224, 5769589, 6291901, 6991980, 7898150, 9009139, 10296439, 11704023, 13143878, 14504295, 15669381, 16523039, 16933672, 16760872, 15914411, 14430786]
57086A4430786j928029k061276j839764j301358n59783K22159Q89674J352655
57078I205064J600546J675229J634528J527089J380094J201257R92393P57170
57070A9973370M93765J92408j44668m83448p73308r86669j136337j252380j350178
57061A4532555j422126j449869j418370j325103j184008j020167q57344p10330
57053E145238n86965m90907m19840l66124l23514k91016k68293k50854k32753
57044A914972k11526j87841j62608j36998j13267r2919p5217n9135m5359l4764
57034G95338k6637j9909j4553j0368o045j056L098N151O262Q448J2052J6176K0366
57021G88323K4384K7365K8648K8774K8550K7890K6527K4971K3802K2868K2127
$$ y = [14430786, 12502757, 10441481, 8601717, 7300359, 6740576, 6962735, 7852409, 9205064, 10805610, 12480839, 14115367, 15642456, 17022550, 18223807, 19216200, 19973370, 20467135, 20659543, 20514875, 20031427, 19258119, 18271450, 17135113, 15882733, 14532555, 13110429, 11660560, 10242190, 8917087, 7733079, 6712912, 5855568, 5145238, 4558273, 4067366, 3647526, 3281402, 2957888, 2666872, 2398579, 2147725, 1914972, 1703446, 1515605, 1352997, 1215999, 1102732, 1009813, 934596, 875461, 830102, 795338, 768701, 748792, 734239, 723871, 717826, 716770, 719868, 725019, 731281, 739729, 751781, 767957, 788323, 812707, 840072, 868720, 897494, 926044, 953934, 980461, 1005432, 1029234, 1052102, 1074229]
57010A074229K2378K4168K6444K6889K3112J3467j811j9579l5101m5536n1540
56999A057120n4998n6387n5104n1186m5460l8612l1113k3657j6956j1527p905
56988F64215o411o355o363o042o432q338j1105j3693j6007j8475k1066k3581k6117
56975D94230k8483k9723k9033k6829k4177k1517j8514j4852j0685o506k986o54
56963B80271N92J379K104K553K398J776J175J064J475J735P61j842n186q078j0314
56948B71863j2316j3890j4265j3237j1274q606n167j431J714M014N787O917P003
56935B17112O543O699P570P901O954N560M829M697M293K862r6m719j0227j5131
56921B44847j8485k0456k1472k1589k0965k0048j8952j7292j5033j2759j0789
$$ y = [1074229, 1096607, 1120775, 1147219, 1174108, 1197220, 1210687, 1208876, 1189297, 1154196, 1108660, 1057120, 1002122, 945735, 890631, 839445, 793985, 755373, 724260, 700603, 683647, 672120, 664215, 657804, 651449, 645086, 639044, 632612, 624274, 613169, 599476, 583469, 564994, 543928, 520347, 494230, 465747, 436024, 406991, 380162, 355985, 334468, 315954, 301102, 290417, 283911, 280925, 280271, 280863, 282242, 284346, 286899, 289297, 291073, 292248, 293312, 294787, 296522, 297283, 295441, 290255, 282177, 271863, 259547, 245657, 231392, 218155, 206881, 198275, 193108, 191677, 193391, 197405, 203192, 210109, 217112, 223655, 230354, 237924, 245825, 252779, 258339, 263168, 267865, 272158, 275020, 274924, 270205, 259978, 244847, 226362, 205906, 184434, 162845, 141880, 121832, 102880, 85588, 70555, 57796, 47007]
56910D7007q848o868n332m360l340j871m31M90J267K571M428O252P558Q358R125
56895E6006J0352J1826J2472J1524R722Q544Q413Q509Q254Q005Q160Q578R052
56882A79417R397Q897O744L297N6j874k491j982k03K666N967R348J2817J5843
56868B47899J7554J8127J8855K0367K1832K2305K1817K0793J9496J8527J8657
56857D66229J9527J9504J7393J3362P914J266n540j0327j1644r998o453j124N987
56844E06096J3726K0645K6450L1438L5161L6736L6091L3970L1009K7663K4591
56833H23576K2351K0913J9933J8971J6801J1349J387j1743k4739l4594m0063m1605
56821G82537m0485l7543l2516k4882j5530o723o4M668Q196J0380J0967J0701J0608
$$ y = [47007, 38159, 31291, 25959, 21599, 18259, 16388, 15957, 16447, 17714, 20285, 24713, 30965, 38523, 46881, 56006, 66358, 78184, 90656, 102180, 111902, 120446, 128859, 137368, 145622, 153627, 161787, 170365, 179417, 188814, 197711, 204455, 207752, 207808, 205934, 203443, 201461, 201258, 203924, 209891, 219239, 232056, 247899, 265453, 283580, 302435, 322802, 344634, 366939, 388756, 409549, 429045, 447572, 466229, 485756, 505260, 522653, 536015, 543929, 545195, 539655, 529328, 517684, 507686, 501233, 500109, 506096, 519822, 540467, 566917, 598355, 633516, 670252, 706343, 740313, 771322, 798985, 823576, 845927, 866840, 886773, 905744, 922545, 933894, 935281, 923538, 898799, 864205, 824142, 782537, 742052, 704509, 671993, 647111, 631581, 624858, 624794, 629462, 637658, 648038, 659005, 669706, 680314]
56808F80314J0756J0657J0452J0637J0856R727N768j691j1912k2576l0875l5547
56796F46566l7430l7637l6069l2384k7371k2247j7180j1698o203j971K77R68R94
56783D18615J063J523K120K239J773J390J275J71l374r078j5064j9766k3037k5393
56769C34457k6979k7452k6543k4564k2402k0746j9336j7380j4794j2353j0442
56758A11466q529o328m573l996m188m212l814l363l099l053l239l375k907j846
56744E4944r94p93o56l8N56M02k53o19m87p2O45J665K499K745K665K537K033R81
56726F7760J12J70P81J091J060J199J498J548J389J424J717K044K291K269J685
56711H8038Q80Q32J694K181J328J1m25k35n78j415j642r99l29l3L05P69P87J84
$$ y = [680314, 691070, 701727, 712179, 722816, 733672, 743399, 749167, 747476, 735564, 712988, 682113, 646566, 609136, 571499, 535430, 503046, 475675, 453428, 436248, 424550, 418347, 416376, 416653, 417621, 418615, 419678, 421201, 423321, 425560, 427333, 428723, 429998, 430169, 426795, 417717, 402653, 382887, 359850, 334457, 307478, 280026, 253483, 228919, 206517, 185771, 166435, 149055, 134261, 121908, 111466, 102937, 96609, 92036, 88040, 83852, 79640, 75826, 72463, 69364, 66311, 63072, 59697, 56790, 54944, 53950, 53157, 52501, 52463, 53019, 53421, 53168, 52549, 52062, 51990, 52635, 54300, 56799, 59544, 62209, 64746, 66779, 67760, 67872, 68042, 68823, 69914, 70974, 72173, 73671, 75219, 76608, 78032, 79749, 81793, 84084, 86353, 88038, 88918, 89750, 91444, 93625, 94953, 94964, 94539, 94304, 93726, 92311, 90669, 89670, 89341, 89308, 89613, 90382, 91169, 91353]
56693I1353m99q52q68n17J06L41l00j061p47M77J186O70k92p61p26n70l83j22
56675H6435J75N79J191J774J991J927J849J658J221R22J197J711J824J594J569
56660A07617J799J948K061K363K474J866R01M26M87M77L75P70J661K328K462K357
56644A32372K014J103k3l94L25J369J873J512K25j633k919k545r22M09P34P72
56628A34272J217J760J902J768J678J629J541J381R51K46m8O83J782J949J092
56613A53803M41O33R86R37R04J152J048J68q26j211j199j199q93M9J045J243O69
56596A57750l6o55j404k163k456k112j414o63L8O08Q64O21q9q06q31Q0J311K053
56578A50696K233K304K344K075J700J883K749L681M294M961O009P088P717P960
$$ y = [91353, 90854, 90002, 89134, 88617, 88723, 89064, 88764, 87703, 86956, 87433, 88619, 89289, 88997, 88236, 87510, 86940, 86557, 86435, 86610, 87189, 88380, 90154, 92145, 94072, 95921, 97579, 98800, 99722, 100919, 102630, 104454, 106048, 107617, 109416, 111364, 113425, 115788, 118262, 120128, 121029, 121455, 121942, 122419, 122794, 123564, 125225, 127553, 130015, 132372, 134386, 135489, 135466, 135072, 135397, 136766, 138639, 140151, 140376, 138743, 135824, 133279, 132357, 132766, 133500, 134272, 135489, 137249, 139151, 140919, 142597, 144226, 145767, 147148, 148099, 148345, 148297, 148980, 150762, 152711, 153803, 154244, 154877, 155863, 156800, 157704, 158856, 159904, 160072, 159246, 158035, 156836, 155637, 154744, 154793, 155838, 157081, 157750, 157714, 157059, 155655, 153492, 151036, 148924, 147510, 146847, 146885, 147493, 148357, 148978, 148889, 148083, 147252, 147332, 148643, 150696, 152929, 155233, 157577, 159652, 161352, 163235, 165984, 169665, 173959, 178920, 184929, 192017, 199734, 207694]
56564B07694Q126Q225Q106P918Q076Q813R870J0629J0703J0428J0446J0609R906
56551C29549P973O033N473N972O022N034L724K547J096p03k041k412k499l201
56537C62567m401n360n898o554p683q816r082q313p508p770q788r062p930o541
56523B58861o183o575o681o403o256o059n362m689m835n244m634l115k117k195
56509A88513k478k414k413k564k272j660j755k688l136k245q04J43O37R67P56
56494A66587k18j242j520j092l24O66J508J498O58%J10L77J53k16j99J0Q1K27
56476A67064O29R05P98O35O06L50j91l74R8N70N40M96R74J555J574J149Q13P02
56458A78893P16R27J275J350R70M40L0k49j99L91J024Q98J92j17J30J09k76q3
$$ y = [207694, 215820, 224045, 232151, 240069, 248145, 256958, 266828, 277457, 288160, 298588, 309034, 319643, 329549, 337522, 343555, 349028, 355000, 361022, 366056, 369780, 372327, 373423, 372720, 370679, 368267, 365768, 362567, 358166, 352806, 346908, 340354, 332671, 323855, 314773, 306460, 298952, 291182, 282394, 273332, 265402, 258861, 252678, 246103, 239422, 233019, 226763, 220704, 215342, 210653, 205818, 200574, 195940, 192825, 190708, 188513, 186035, 183621, 181208, 178644, 176372, 174712, 172957, 170269, 167133, 164888, 164084, 164227, 164864, 165831, 166587, 166369, 165127, 163607, 162515, 162191, 162857, 164365, 165863, 166521, 166521, 166631, 167008, 167161, 166945, 166746, 166756, 166837, 167064, 167693, 168598, 169396, 170031, 170637, 170987, 170796, 170422, 170520, 171090, 171630, 172126, 173100, 174655, 176229, 177378, 178191, 178893, 179609, 180536, 181811, 183161, 184131, 184571, 184601, 184352, 184153, 184544, 185568, 186466, 186658, 186541, 186671, 186780, 186504, 186421]
56440A86421P88J010m3j121j084n99o76q20r6J060J630J735K098K443J974R28
56424A95648K77J82k2m61n26NO16Q36P28O20Q26J329J537Q48l12p32q1N84M57
56405B02359R8K46N97O41O41R08R67M63N2L60R39J228J593K322K573J620L97K90
56387B18294J079J461J114P78O78L39k43m90k44J92Q29J793K574K540J987J737
56371B34418J872J813J434J142R94O61J28l34o98j012r62l41L82O41N56M95L47
56354B41536n6l69k76j51l55n24k66J5j15k38J52O70P77Q02J222J621J461J176
56336B47082J362J562J126O27J042J976K178J454P67O37P99J181J918K502K164
56321B68377J137M56N47R73J380J758J908J620J225J168J258J123R61J056J037
$$ y = [186421, 187209, 188219, 188176, 187055, 185971, 185372, 184696, 183876, 183780, 184840, 186470, 188205, 190303, 192746, 194720, 195648, 195925, 196107, 196085, 195624, 195098, 195103, 195719, 196555, 197283, 197903, 198729, 200058, 201595, 202443, 202131, 201399, 201318, 201902, 202359, 202457, 202703, 203300, 203941, 204582, 205490, 206457, 206920, 206972, 207332, 208271, 209499, 211092, 213414, 215987, 217607, 218004, 218294, 219373, 220834, 221948, 222726, 223404, 223743, 223500, 223010, 222766, 222958, 223787, 225580, 228154, 230694, 232681, 234418, 236290, 238103, 239537, 240679, 241673, 242334, 242462, 242128, 241430, 240418, 239456, 239115, 239497, 240138, 240694, 241189, 241536, 241480, 241111, 240835, 240684, 240329, 239805, 239539, 239554, 239439, 239201, 239353, 240023, 240800, 241602, 242824, 244445, 245906, 247082, 248444, 250006, 251132, 251759, 252801, 254777, 256955, 258409, 259176, 259813, 260612, 261793, 263711, 266213, 268377, 269514, 269970, 270517, 271490, 272870, 274628, 276536, 278156, 279381, 280549, 281807, 282930, 283891, 284947, 285984]
56306B85984N44J09L56Q90J011R40J242J681J828K128L032L741L238K128J851
56291C10703K487K893K675K487K600K669K818L420L963L563K496J852J792J663
56277C48081J548K221L498M276M319M551N413O251O524O366N911N276N234O570
56263D16039Q705J0192J0639J0912J1527J2159J2765J3794J5140J6215J7156J8687
56251E73930K0668K2114K2729K3208K3855K4231K4279K4485K4761K4338K3054
56240H31652K1566K0150J8409J6258J4139J2086R709P076M583J982j276m812p624
56227I43898r631j1686j4104j6370j8246j9944k1210k1519k1177k1020k1051k0535
56215G27405j9363j8137j7071j5921j4827j3995j2920j1202r712r511j0019r783
$$ y = [285984, 286528, 286637, 286993, 287883, 288894, 289834, 291076, 292757, 294585, 296713, 299745, 303486, 306724, 308852, 310703, 313190, 316083, 318758, 321245, 323845, 326514, 329332, 332752, 336715, 340278, 342774, 344626, 346418, 348081, 349629, 351850, 355348, 359624, 363943, 368494, 373907, 380158, 386682, 393048, 398959, 404235, 409469, 416039, 424744, 434936, 445575, 456487, 468014, 480173, 492938, 506732, 521872, 538087, 555243, 573930, 594598, 616712, 639441, 662649, 686504, 710735, 735014, 759499, 784260, 808598, 831652, 853218, 873368, 891777, 908035, 922174, 934260, 943969, 951045, 955628, 957610, 956334, 951522, 943898, 934267, 922581, 908477, 892107, 873861, 853917, 832707, 811188, 790011, 768991, 747940, 727405, 708042, 689905, 672834, 656913, 642086, 628091, 615171, 603969, 594257, 584746, 574727, 564944]
56203E64944q620p425o334m970m028m492n490n048k991j132m77l34k03m12o50
56188E12338QJ188J381L44n24o22q31j437j357j31J213J977K674L540L892L590
56172E27243L440L663L594L316L809N050N728N392N080N341N495N412O090P758
56158E96411R203R755J0346J1849J3815J5477J6664J7351J7692J8539K0481K2413
56146G79996K2936K2990K5067K9784L5523M1436M8277N6057O3501P0431P7992
56135A273990Q6004R2621R7389J02019J07322J11954J15186J18185J21475J23558
56125B349703J23282J21181J17315J10248R9505Q6865P4069O1262M8609L6939
56115C228978K5812J3306j071j5602k9322m3166n7111o9061p7871q4808r0768
$$ y = [564944, 556324, 548899, 542565, 537595, 533567, 529075, 523585, 518537, 515546, 514414, 513937, 513603, 513400, 512988, 512338, 512346, 513534, 514915, 515259, 514735, 514113, 513282, 511845, 510488, 510357, 511570, 513547, 516221, 519761, 523653, 527243, 530683, 534346, 537940, 541256, 545065, 550115, 555843, 561235, 566315, 571656, 577151, 582563, 588653, 596411, 605614, 615369, 625715, 637564, 651379, 666856, 683520, 700871, 718563, 737102, 757583, 779996, 802932, 825922, 850989, 880773, 916296, 957732, 1006009, 1062066, 1125567, 1195998, 1273990, 1359994, 1452615, 1550004, 1652023, 1759345, 1871299, 1986485, 2104670, 2226145, 2349703, 2472985, 2594166, 2711481, 2821729, 2921234, 3008099, 3082168, 3143430, 3192039, 3228978, 3254790, 3268096, 3267025, 3251423, 3222101, 3178935, 3121824, 3052763, 2974892, 2890084, 2799316]
56104B799316r4899r7462j00927j06370j11477j13965j14351j13536j10503j04488
56094A731338r6872q8825p9502o8626n8265m9889m2179l3898k6412k1033j6369
56083A149468j0867n767k941j768n70P23J600K723M501N710N569N268N661N544
56069A164854M130K894K968L017J843P07R66J714J875K255L424M116L844M481
56055A203088O986R320R886J0207J1811J3343J3456J3579J5065J6339J5856J5118
56043A354054J5917J7244J7747J8482K0373K1813K1733K2067K4219K6151K6080
56032A585880K5886K7513K9330K9511K9841L2423L5693L7398L8526M0671M2641
56021A955313M3291M4435M7308M9628M9895N0848N4637N8493N9581O0140O3190
$$ y = [2799316, 2704417, 2606955, 2506028, 2399658, 2288181, 2174216, 2059865, 1946329, 1835826, 1731338, 1634466, 1545641, 1466139, 1397513, 1339248, 1289359, 1247180, 1213282, 1186870, 1165837, 1149468, 1138601, 1132834, 1129893, 1128125, 1127555, 1128278, 1129878, 1132601, 1137102, 1142812, 1148381, 1153649, 1159310, 1164854, 1168984, 1171878, 1174846, 1177863, 1179706, 1180413, 1181379, 1183093, 1184968, 1187223, 1190647, 1194763, 1198607, 1203088, 1210074, 1219394, 1229280, 1239487, 1251298, 1264641, 1278097, 1291676, 1306741, 1323080, 1338936, 1354054, 1369971, 1387215, 1404962, 1423444, 1443817, 1465630, 1487363, 1509430, 1533649, 1559800, 1585880, 1611766, 1639279, 1668609, 1698120, 1727961, 1760384, 1796077, 1833475, 1872001, 1912672, 1955313, 1998604, 2043039, 2090347, 2139975, 2189870, 2240718, 2295355, 2353848, 2413429, 2473569, 2536759]
56010B536759O7083O9245P1419P6061Q1328Q4780Q8244R3906R9579J03044J06852
55999C478300J13538J20584J25664J31830J41692J51759J58983J67198J80103
55990D769651J93807K04075K14936K31638K51107K68530K87291L12674L41754
55981G075463L69965M01526M42314M88778N35941N89938O59612P42377Q32784
55972A2138698R38675J073269J238236J433287J678473K008973K451281L020559
55964B5981451L734329M610687N665479O934307Q471453J0267074J2154857J3854749
55956I1674386J5140286J5937995J6250053J6039126J5260047J4000843J2529192
55949A96831928J1152698J0027206R109366Q290774P539504O838334N945389M300753
$$ y = [2536759, 2603842, 2673087, 2744506, 2820567, 2901895, 2986675, 3074919, 3168825, 3268404, 3371448, 3478300, 3591838, 3712422, 3838086, 3969916, 4111608, 4263367, 4422350, 4589548, 4769651, 4963458, 5167533, 5382469, 5614107, 5865214, 6133744, 6421035, 6733709, 7075463, 7445428, 7846954, 8289268, 8778046, 9313987, 9903925, 10563537, 11305914, 12138698, 13077373, 14150642, 15388878, 16822165, 18500638, 20509611, 22960892, 25981451, 29715780, 34326467, 39991946, 46926253, 55397706, 65664780, 77819637, 91674386, 106814672, 122752667, 139002720, 155041846, 170301893, 184302736, 196831928, 207984626, 218011832, 227121198, 235411972, 242951476, 249789810, 255735199, 260035952]
55941B60035952J350682k916140p784129j2241217j5616682j7815829j9049685
55934A85962952j9489070j9196102j8251395j6825724j5133519j3366089j1658435
55927G2042618j0076021q626588p304445o124694n109724m260432l559188k989647
55919B3991879k536158k173419j875255j629312j430510j266830j124366r99862
55911A0956167q95239q04954p20498o42317n75592n18459m64959m15601l74639
55902E543909l40386l07852k77765k53902k34539k15120j96395j81668j69098
55893C367184j54732j40341j30149j22571j13048j02545r5327r0454q3263p3695
55883B261059o5758n9998n3508m6297m1045l7453l3010k8487k6824k7436k7212
$$ y = [260035952, 261386634, 258470494, 250686365, 238445148, 222828466, 205012637, 185962952, 166473882, 147277780, 129026385, 112200661, 97067142, 83701053, 72042618, 61966597, 53340009, 46035564, 39910870, 34801146, 30540714, 26981526, 23991879, 21455721, 19282302, 17407047, 15777735, 14347225, 13080395, 11956029, 10956167, 10060928, 9255974, 8535476, 7893159, 7317567, 6799108, 6334149, 5918548, 5543909, 5203523, 4895671, 4617906, 4364004, 4129465, 3914345, 3717950, 3536282, 3367184, 3212452, 3072111, 2941962, 2819391, 2706343, 2603798, 2508471, 2418017, 2334754, 2261059, 2195301, 2135303, 2081795, 2035498, 1994453, 1957000, 1923990, 1895503, 1868679, 1841243, 1814031]
55872A814031k6124k6524k7924k7868k6986k7952l0448l2176l3785l7633m2651
55861A473960m5637m6794m8914n1705n2073m9631m6984m4857m1581l7312l4157
55850I74315l2128k9164k5198k2258k0606j8650j6491j5765j6151j5716j4538
55839G47650j4363j4944j4295j2394j1114j0632r454p747p179p501o726m723l412
55826F23166l331l035j906o66O77K605M136L980L171L659M892M842L767L636M375
55811F53968M140K944K503K578J100j965m325n262o517q846j0861j1834j2677
55798F04946j3572j3420j2279j1651j1859j1541j0221q931p990o607m996m411
55786D87468m660m064k203n03L00R76J801J982J431R38M22j015l112m643n513
$$ y = [1814031, 1787907, 1761383, 1733459, 1705591, 1678605, 1650653, 1620205, 1588029, 1554244, 1516611, 1473960, 1428323, 1381529, 1332615, 1280910, 1228837, 1179206, 1132222, 1087365, 1045784, 1008472, 974315, 942187, 913023, 887825, 865567, 844961, 826311, 809820, 794055, 777904, 762188, 747650, 733287, 718343, 704048, 691654, 680540, 669908, 660454, 652707, 645528, 638027, 631301, 626578, 623166, 619835, 616800, 614894, 614228, 614905, 617510, 621646, 625626, 628797, 632456, 637348, 642190, 645957, 649593, 653968, 658108, 661052, 663555, 666133, 667233, 665268, 660943, 655681, 649164, 640318, 629457, 617623, 604946, 591374, 577954, 565675, 554024, 542165, 530624, 520403, 511472, 503482, 496875, 491879, 487468, 482808, 478744, 476541, 476038, 476338, 477314, 479115, 481097, 482528, 483466, 483888, 482873, 479761, 475118, 469605]
55771D69605o580p570p475o856p183q034p535n751m872n804p154p978q847r791
55757C68175r750q744q160q288p882o719o184o736p101o617o081n723m634k908
55743B72648j977k092j866r72r23k207l072k328j177j006j363j352j228j352j248
55728B48485p85p72j436j808j476j325j748j816j120o63r57j006j73N66L96J18
55712B34480N89J144Q21k8m94m25k3Q01J771J990J172K17q0O8K81N89P41J87p15
55693B43086p83J73R68R79R96J554J933J617J261J471J869K193K875L807L977
55678B67976L233K900L748M694M595L941L590L251K464J847K008K200J493M50
55664C08390J91N19L52m88j170j337j506k123l080m187n361o388p010p219p257
$$ y = [469605, 463025, 455455, 447980, 441124, 433941, 425907, 418372, 412621, 407749, 401945, 394791, 386813, 377966, 368175, 358425, 349681, 341521, 333233, 325351, 318632, 312448, 305712, 298611, 291994, 285913, 280190, 275556, 272648, 270671, 268579, 266713, 265741, 264818, 262611, 259539, 257211, 256034, 255028, 253665, 252313, 251085, 249733, 248485, 247700, 246928, 245492, 243684, 242208, 240883, 239135, 237319, 236199, 235536, 234579, 233573, 233400, 233966, 234362, 234480, 235069, 236213, 237034, 237006, 236512, 236087, 236064, 236865, 238636, 240626, 241798, 242015, 241935, 242003, 242284, 242873, 243614, 243801, 243086, 242303, 242476, 243444, 244423, 245419, 246973, 248906, 250523, 251784, 253255, 255124, 257317, 260192, 263999, 267976, 271209, 274109, 277857, 282551, 287146, 291087, 294677, 297928, 300392, 302239, 304247, 306447, 307940, 308390, 308581, 309100, 309452, 308964, 307794, 306457, 304951, 302828, 299748, 295561, 290200, 283812, 276802, 269583, 262326]
55649B62326p333p496p544p145o299n485m980m393l457k776k893l115k421j180
55635A95809o58j086j564j696j866j978j542r71j230k071k246j652j423j758j554
55620A72514o00j91q60j365q13l8L7k10l08o57j341j457p46l35q65j292p78k26
55602A60469o81j512j663j516j981k685k514j396k82J41j46p65r27M7J479J695
55586A47763L40q27l67R12J501J402J469J648J393J087J530K461K923K703K325
55571A68263K039J764J694K018K415K508K420K351K107J666J421J407J048K37
55557A93358k61p0J39j38m48m89q26j621j885j039q0j04p03r46q72q99p61k95
55539A82060j97q32j294r62q21j827l010k897j878j451j873k269k509l120l742
$$ y = [262326, 254993, 247497, 239953, 232808, 226509, 221024, 216044, 211651, 208194, 205418, 202525, 199410, 196989, 195809, 195151, 194065, 192501, 190805, 188939, 186961, 185419, 184448, 183218, 181147, 178901, 177249, 175826, 174068, 172514, 171914, 171723, 170863, 169498, 168685, 168647, 168684, 168474, 168166, 167509, 166168, 164711, 163965, 163630, 162765, 161473, 160695, 160469, 159788, 158276, 156613, 155097, 153116, 150431, 147917, 146521, 146239, 146380, 146234, 145469, 144542, 144589, 146068, 147763, 148103, 147276, 146909, 147821, 149322, 150724, 152193, 153841, 155234, 156321, 157851, 160312, 163235, 165938, 168263, 170302, 172066, 173760, 175778, 178193, 180701, 183121, 185472, 187579, 189245, 190666, 192073, 193121, 193358, 193097, 193027, 193166, 193028, 192580, 192091, 191265, 189644, 187759, 186720, 186640, 186536, 185833, 184887, 184015, 183116, 182355, 182060, 181863, 181031, 179737, 178775, 177954, 176127, 173117, 170220, 168342, 166891, 165018, 162749, 160240, 157120, 153378]
55524A53378l440k361j493j039n36k65q93j898j949r31j06j91o29q26p86m96O6
55507A35605K84m24j279q37P88J827J253M1m47k01r1n01j036j098l90P96J687
55490A35977J750J267P34J23p26j330j162o33n91r62r17k96J88J69J07L31N77
55473A34606O72Q87J245J187K79j106k120k160j276j41M34K71o3n4J88M37Q33
55456A34119J351J397O27l38o99n85n59n75k79J09J36K1K05L72j03r43j250q74
55438A32132m42j54M16J234J552J001J66k05%L65M61K19R5O77J786K361J818R78
55420A44460R97J788K337K203J855J772J992K353K459J777M63l70pP08N49l23
55404A65013q23p32q01j275j583j439j147q95o86q69j678k444k306j552j137j085
$$ y = [153378, 149938, 147577, 146084, 145045, 144509, 144244, 143351, 141453, 139504, 138573, 138467, 138276, 137647, 136821, 136035, 135539, 135605, 135889, 135465, 134186, 133349, 134137, 135964, 137217, 137258, 136811, 136610, 136519, 136018, 134982, 133884, 133494, 134290, 135977, 137727, 138994, 139728, 139851, 139125, 137795, 136633, 136000, 135409, 134447, 133530, 133234, 133422, 133591, 133698, 134029, 134606, 135278, 136165, 137410, 138597, 138876, 137770, 135650, 133490, 132214, 132073, 132507, 132778, 132715, 132661, 132849, 133286, 134119, 135470, 136867, 137494, 137156, 136457, 135872, 135313, 134738, 134459, 134568, 134704, 134725, 134930, 135302, 135199, 134256, 133006, 132132, 131690, 131536, 131952, 133186, 134738, 135739, 135905, 135700, 135700, 136065, 136526, 136745, 136840, 137517, 139303, 141664, 143482, 144460, 145457, 147245, 149582, 151785, 153640, 155412, 157404, 159757, 162216, 163993, 164456, 164086, 164079, 164787, 165336, 165013, 164190, 163458, 162657, 161382, 159799, 158360, 157213, 156318, 155632, 154763, 153085, 150641, 148335, 146783, 145646, 144561]
55388A44561n96L51Q52N86J76o6n12j151j375j090r02r17n12L64Q21L54m88j087
55370A39369j486j745j551r24m07j85J38O12P17L43M9K9j98o30m11P55J774J475
55352A37724R8j156j553j234p28n13o95q35n16m6nj76J67Q53Q69O6l76K27R03
55333A33074M92o43j301j122p20n54n86o65o04j27P01J238R67J91l87m58j82K71
55315A29585P54J036J021Q84P52N34K57J68K77K10j68m22j61L67O62O55O61Q23
55297A37895R39P42J84m54p24m33J35N80Q06Q24M59k98q63o52M7M19K79J18J34
55278A40137l3n10r15j012r80q82n26qL24N13R26J433J422P86P6l90p93r75l86
55259A38207P99J451R45N5j38L83R05R98O80O8n59p43l47K33O72J046J325J105
$$ y = [144561, 143965, 144316, 145168, 145754, 145930, 145864, 145352, 144201, 142826, 141736, 140834, 139917, 139405, 139769, 140590, 140944, 140456, 139369, 137883, 136138, 134587, 133663, 133256, 133071, 133209, 133821, 134538, 134881, 134930, 134959, 134761, 134131, 133720, 134475, 136249, 137724, 137822, 136666, 135113, 133879, 133151, 132638, 131943, 131108, 130592, 130546, 130541, 130365, 130532, 131385, 132254, 132320, 131944, 132171, 133074, 133566, 132923, 131622, 130500, 129780, 129226, 128640, 127975, 127371, 127244, 127945, 129183, 130150, 130341, 129954, 129496, 129314, 129585, 130339, 131375, 132396, 133280, 134032, 134566, 134823, 134991, 135268, 135478, 135310, 134888, 134727, 135094, 135756, 136411, 137072, 137895, 138834, 139576, 139760, 139306, 138582, 138149, 138284, 138864, 139670, 140494, 140953, 140655, 139792, 139140, 139187, 139606, 139885, 140003, 140137, 140104, 139594, 138679, 137667, 136687, 135805, 135279, 135271, 135595, 136108, 137034, 138467, 139889, 140675, 140751, 140361, 139568, 138593, 138207, 139006, 140457, 141402, 141457, 141319, 141702, 142607, 143605, 144285, 144353, 143794, 143051, 142704, 142937, 143609, 144655, 145980, 147085]
55241A47085K78n37p28m46k66l80m93l23P3L11M9n16p06l06k1m26q57l74N90P64
55221A42771J46R0J061J874J655J082R31P51M4m78p8N48K97m82n58J93O85L64
55203A50896j26j05K48L76O5m99r83j111q97o06l48K7N01P42O46N13M23Nq17j373
55183A47577j069j96N32Q15P33L29k22m88k75J01L89P75J298J555J425J471J980
55166A56730K249J581M62n7K54Q13J241J589J722J349O17J17J98P03J214J322
55150A72104Q18pn73p83j204k111k903k873k148j370q30m30j29J20M23N44n4j280
55132A57314k060j618n31J25J99K48L69J97j83l13j62p7j0M17J103J452J217P71
55114A58458M93L91L30J88j87o95p93n6J166K046K172J772J222P67N30M17J15
$$ y = [147085, 147363, 146826, 146098, 145652, 145386, 145006, 144513, 144190, 144263, 144574, 144623, 144107, 143401, 143095, 143074, 142648, 141791, 141417, 142007, 142771, 142917, 143007, 144068, 145942, 147597, 148679, 149610, 150361, 150405, 149927, 149849, 150397, 150694, 150212, 149654, 149847, 150532, 150896, 150770, 150665, 150913, 151289, 151354, 150855, 149872, 148761, 147864, 147258, 146910, 146937, 147438, 148180, 148826, 149339, 149762, 149767, 148950, 147577, 146508, 146312, 146844, 147659, 148392, 148721, 148499, 148011, 147736, 147837, 148226, 149001, 150299, 151854, 153279, 154750, 156730, 158979, 160560, 161022, 160965, 161219, 162032, 163273, 164862, 166584, 167933, 168550, 168667, 168865, 169568, 170782, 172104, 172922, 172915, 172342, 171559, 170355, 168244, 165341, 162468, 160320, 158950, 158120, 157690, 157561, 157681, 158104, 158648, 158594, 157314, 155254, 153636, 153105, 153230, 153429, 153677, 154046, 154243, 154060, 153747, 153585, 153508, 153498, 153915, 155018, 156470, 157687, 158458, 158951, 159342, 159672, 159860, 159673, 158978, 158185, 158129, 159295, 161341, 163513, 165285, 166507, 167274, 167804, 168221, 168336]
55097A68336m98j063j188r36n99l05j21j62k99j70J52N3o20j075o28K17M73ln62
55078A61002p46n81j39M58Q30P16L63N9k77o63p27m21m10r76j260n01N43N72k76
55059A57566o54j6Q20J046O96K7q24j415j187k97M90Q28R77R85N60j34l90J03
55041A59181R36J644K053J926J091L1m33j89J28J80K10K94J68m4J10N58P41O77
55023A69262R51J411J050l06j398j264n92m19m48K05J185J241J86p11m99K94O56
55006A70804M72K81K47N4l02l61L4L78K77J58O51J498J800J337Q61Q91R38M80
54988A80498j2K48J084J568J274N62j24n88n84K1P60R00L59k17l23qM89R35R70
54969A87812M12k08o7Q14J432J020ro41l79M22J147J564J920K390K587J990R07
$$ y = [168336, 167838, 166775, 165587, 164651, 164052, 163747, 163626, 163464, 163165, 162995, 163147, 163200, 162580, 161505, 160877, 161094, 161567, 161564, 161002, 160256, 159675, 159536, 159994, 160824, 161540, 161903, 161962, 161685, 161022, 160295, 159874, 159464, 158488, 157228, 156727, 157270, 157842, 157566, 156912, 156896, 157716, 158762, 159458, 159485, 158661, 157246, 156059, 155762, 156252, 157080, 158057, 159042, 159602, 159468, 159078, 159181, 160117, 161761, 163814, 165740, 166831, 166862, 166429, 166240, 166368, 166548, 166758, 167052, 167220, 167176, 167286, 167844, 168585, 169262, 170213, 171624, 172674, 172368, 170970, 169706, 169114, 168695, 168247, 168452, 169637, 170878, 171064, 170353, 169854, 170148, 170804, 171276, 171557, 171804, 171858, 171556, 171195, 171229, 171607, 171884, 172042, 172693, 174191, 175991, 177328, 178189, 179080, 180018, 180498, 180486, 180734, 181818, 183386, 184660, 185222, 185098, 184510, 183926, 183947, 184707, 185607, 185966, 185749, 185426, 185418, 185907, 186842, 187812, 188224, 188016, 187949, 188763, 190195, 191215, 191206, 190565, 190186, 190608, 191755, 193319, 195239, 197629, 200216, 202206, 203113]
54952B03113M25J032J892K023J678J833K708L680M358M899N362N585N684N972
54938B50244O432O879P461Q269Q755Q355P436O752O211N202L992L470L545L048
54924C36051J492k57j446k431l720n066o116p081q164r022r302r087q424p148
54910B60279n573m521m250m047l375k589k040j304oJ336K070K418L043L993M831
54895B50265N420O003O695P381P867P839P083N967N263N181N175M855M411L773
54881C33178K302j41k575m132n186o492p871q609q724q849r128r157q784q205
54867B47627p416o344n389n052n059m566l305j887r97p86j085j671k185k270j929
54852A97686j459j056p32o25r28j506j907j843j438r80o36m61m96p28r85r39l92
$$ y = [203113, 203538, 204570, 206462, 208485, 210163, 211996, 214704, 218384, 222742, 227641, 233003, 238588, 244272, 250244, 256676, 263555, 271016, 279285, 288040, 296395, 303831, 310583, 316794, 321996, 325988, 329458, 333003, 336051, 337543, 337286, 335840, 333409, 329689, 324623, 318507, 311426, 303262, 294240, 284938, 275851, 267427, 260279, 254706, 250185, 245935, 241888, 238513, 235924, 233884, 232580, 232574, 233910, 235980, 238398, 241441, 245434, 250265, 255685, 261688, 268383, 275764, 283631, 291470, 298553, 304520, 309783, 314964, 320139, 324994, 329405, 333178, 335480, 335339, 332764, 328632, 323446, 316954, 309083, 300474, 291750, 282901, 273773, 264616, 255832, 247627, 240211, 233867, 228478, 223426, 218367, 213801, 210496, 208609, 207612, 206826, 205741, 204070, 201885, 199615, 197686, 196227, 195171, 194439, 193814, 192886, 191380, 189473, 187630, 186192, 185212, 184576, 184115, 183619, 182891, 181906, 180967, 180575]
54835A80575L54N99N3o76p80l23L3J74O59J534J985J555R17Q40J054Q69L60J64
54817A89946M11O55P22Q47J020Q66K75l04l60J52Q23J158R95P16Q39J336J607
54800B01704J330R72J132J756K273K301J836J119O34R16J993L160L774L978M379
54785B33257N250O414P659Q789R528R691R376Q741P845O871O094N425M428L149
54771C32517K347K374K364J282o55k374l489m610o173p708q440q106p074o106
54757B86149n886o372o591n583l547j656p49p00r88j300j424j043K6J604L333
54742B55273M871N915O242N957N554N572O171O947P204O575N387M231L298K379
54728C31576J492R70P64K06j211l188n074o533p481p841p757p714p954q097p706
$$ y = [180575, 180929, 181528, 181581, 180905, 180125, 179802, 179835, 180009, 180668, 182202, 184187, 185742, 186659, 187499, 188553, 189422, 189782, 189946, 190357, 191012, 191734, 192581, 193601, 194467, 194742, 194438, 194078, 194230, 195053, 196211, 197206, 197922, 198761, 200097, 201704, 203034, 204006, 205138, 206894, 209167, 211468, 213304, 214423, 215057, 215973, 217966, 221126, 224900, 228878, 233257, 238507, 244921, 252580, 261369, 270897, 280588, 289964, 298705, 306550, 313421, 319515, 324940, 329368, 332517, 334864, 337238, 339602, 340884, 340229, 337855, 334366, 329756, 323583, 315875, 307435, 299329, 292255, 286149, 280263, 273891, 267300, 261717, 258170, 256514, 255765, 255065, 254077, 252777, 251353, 250310, 250336, 251940, 255273, 260144, 266059, 272301, 278258, 283812, 289384, 295555, 302502, 309706, 316281, 321668, 325899, 329197, 331576, 333068, 334038, 334802, 335008, 333797, 330609, 325535, 319002, 311521, 303680, 295923, 288209, 280255, 272158, 264452]
54713B64452o888n963m982m024l472l472l475k973k207j692j378j037j031j755
54699B20103k648k672j731p27k37K6L43M41J00m13p38q41q11p10o98q96j055q22
54681B06014l00N9R9kj58l77m28j84j01o27j258j087k70O1m40p95k98L85L98K7
54661B00718N5M14N19L75L94L64l11j348j565m23J112J698J120K47j71j31L9K42
54643B03348N30P73O56N2p78j398j516j092l29L72O26M49L15O16J125J265Q93
54626B05907M71L91M67L19m4k99l14k60k36j10J00M3n38j267j446q76m0N67R49
54607B03784J244J289R15L44j31n76j032j052k53Q01J160Q20P02J191J629J482
54591B12317J069P15J23q01j343j002m26m97r72r32j58P58J382J701J638J099
$$ y = [264452, 257564, 251601, 246619, 242595, 239123, 235651, 232176, 229203, 226996, 225304, 223926, 222889, 221858, 220103, 217455, 214783, 213052, 212325, 212088, 212114, 212457, 212898, 212998, 212585, 211847, 211006, 210195, 209485, 208787, 207891, 206836, 206014, 205714, 205773, 205872, 205870, 205712, 205335, 204907, 204723, 204622, 203995, 202737, 201650, 201380, 201441, 201001, 200206, 199908, 200293, 200691, 200718, 200773, 201187, 201706, 202081, 202475, 202839, 202528, 201180, 199615, 199192, 200304, 202002, 203122, 203369, 203198, 203067, 203106, 203348, 203878, 204651, 205307, 205359, 204581, 203183, 201667, 200575, 200246, 200618, 201244, 201693, 202008, 202624, 203749, 205014, 205907, 206378, 206769, 207236, 207555, 207511, 207212, 206898, 206638, 206402, 206292, 206392, 206435, 205897, 204630, 203184, 202308, 202268, 202835, 203784, 205028, 206317, 207232, 207576, 207445, 206869, 205837, 204785, 204532, 205333, 206493, 207313, 208015, 209206, 210835, 212317, 213386, 214101, 214224, 213423, 212080, 211078, 210652, 210155, 209183, 208251, 208093, 208851, 210233, 211934, 213572, 214671]
54575B14671L58j91m69m84n1O17O68k64j197j017q6M28L90N99J135J206O98M43
54557B17454P89J128J139J248J425Q58n83j669j429m74R9J91L24N17N50P05J325
54540B23597K035K216J928J588J160M53r4J07P17P43q1r14r25j43Q98J729J965
54523B36979J278j98j675k258j702n57L67O08L25pp2K6K4j67l69l18R1O32Q45
54504B33852M38l61j003j148r18n87k78J05P01J387J613Q60m85j171m47R18J630
54487B35106J584J677K127K087J179K71J57L22j05q82j044l66M49Q89J120J368
54471B45939J499J368J109R21Q42Q38Q44P28M60K45K54K63o7o01p59k60M25N82
54453B54630L2o92r90q09n61n31n91o30q59j383j659j024K72J053N94n05j126
$$ y = [214671, 215029, 214838, 214369, 213885, 213834, 214451, 215119, 214855, 213658, 212641, 212555, 212983, 213373, 213972, 215107, 216313, 217011, 217454, 218243, 219371, 220510, 221758, 223183, 224041, 223458, 221789, 220360, 219886, 219985, 220176, 220500, 221017, 221567, 222272, 223597, 225632, 227848, 229776, 231364, 232524, 232977, 232883, 232990, 233707, 234450, 234369, 233455, 232530, 232387, 233285, 235014, 236979, 238257, 238059, 236384, 234126, 232424, 231867, 232234, 232842, 233167, 233160, 233088, 233114, 233138, 232971, 232602, 232284, 232375, 233007, 233852, 234290, 233929, 232926, 231778, 230860, 230273, 229995, 230100, 230801, 232188, 233801, 234661, 234176, 233005, 232558, 233476, 235106, 236690, 238367, 240494, 242581, 243760, 244031, 244188, 244510, 244405, 243523, 242479, 242113, 242562, 243451, 244571, 245939, 247438, 248806, 249915, 250836, 251678, 252516, 253360, 254088, 254548, 254793, 255047, 255310, 255243, 254642, 253883, 253623, 254048, 254630, 254662, 253970, 252980, 252171, 251610, 251079, 250488, 249858, 248999, 247616, 245957, 244933, 245205, 246258, 246852, 246347, 245221]
54436B45221r94p59r36j292j299q35k46J51L96O95R99J044Q37Q14J193J444Q75
54419B47308l23j141r91l52mo5j37%J85J76j12n28o72j97O78J243J066N03K35
54400B46872N11J013J248R49L19o8J82O95P31K02j19K90Q76P75l4q11j109j134
54382B51388j093q03j25O02Q08L18m54r00p39j95L40O21O22M12J50M4O6j01n47
54363B50414q02m10K55L65k25p57o56k19O2K23N01P02M43k11p51p37j34O15P37
54344B49415k07j574j948p20R93J568P89j7K56J188J570J030M13N16R38O63l98
54327B54475j157q90k95l63p94n35L76P28O8n07J7J116J619J320R34R54J271J612
54309B59949J711J334O40K50M38O23J63o47r96p42m97o77j042j176r80o22l15
$$ y = [245221, 244227, 243468, 242532, 241240, 239941, 239106, 238860, 239011, 239407, 240102, 241101, 242145, 242982, 243796, 244989, 246433, 247308, 246985, 245844, 244853, 244501, 244497, 244432, 244295, 244295, 244480, 244656, 244544, 244016, 243344, 243147, 243825, 245068, 246134, 246637, 246872, 247383, 248396, 249644, 250593, 250912, 250844, 251026, 251721, 252452, 252654, 252535, 252825, 253701, 254476, 254442, 253631, 252522, 251388, 250295, 249492, 249367, 249969, 250777, 251095, 250641, 249741, 249002, 248807, 249147, 249768, 250390, 250802, 250952, 250996, 251062, 250961, 250414, 249612, 249202, 249457, 249822, 249597, 248840, 248184, 247965, 248027, 248250, 248751, 249453, 249896, 249685, 248934, 248197, 248063, 248678, 249415, 249208, 247634, 245686, 244966, 245959, 247527, 248316, 248299, 248555, 249743, 251313, 252343, 252756, 253272, 254210, 254873, 254475, 253318, 252428, 252133, 251770, 250976, 250441, 250817, 251545, 251613, 251106, 251123, 252239, 253858, 255178, 256112, 257066, 258337, 259949, 261660, 262994, 263634, 263884, 264322, 264945, 265108, 264461, 263465, 262723, 262226, 261549, 260507, 259331, 258351, 257729, 257414]
54292B57414j47m1Q2K6m91j356k050k265k073j482m50M91M63n09j200p44J78M10
54274B46256q6m73l56j0K88L86K0o82q97r5R83J248Q59Q02J200J124K01p79j081
54255B48908r37q75r25q61o44l30L3K12j9m60p12p99r53r43k95P05J078M51m11
54236B42223o30j96L71P32Q12O32L76K38J16j64l07K00J198J860J770J341R81
54219B51553N25j55o28m57J43O26P23M46p1m72l86k7j16q09j310r45j51J44k21
54200B48412o19n98k98l0Q5M6o7j17r9k55o95j104j056n60jK95L06J65L4K9J33
54179B44006K18K56L35M61M94M02L16K52K7m25q92j234j599k061k293j891r05
54162B35467J95R44J146Q78M59K04R9j30n29p53n34m8L90P26R91J013O70K71K75
$$ y = [257414, 257267, 257226, 257308, 257334, 256843, 255487, 253437, 251172, 249099, 247617, 247167, 247658, 248121, 247612, 246412, 245668, 245846, 246256, 246170, 245697, 245341, 245331, 245619, 246005, 246025, 245343, 244446, 244351, 245334, 246582, 247441, 248243, 249443, 250567, 250768, 249989, 248908, 247971, 247096, 246171, 245310, 244666, 244336, 244369, 244581, 244562, 244102, 243390, 242591, 241638, 240695, 240400, 241105, 242183, 242634, 242223, 241593, 241397, 241768, 242500, 243312, 243944, 244320, 244558, 244674, 244510, 244203, 244403, 245601, 247461, 249231, 250572, 251553, 252078, 251923, 251295, 250838, 250981, 251607, 252330, 252776, 252705, 252233, 251847, 251820, 251704, 250895, 249585, 248640, 248489, 248633, 248412, 247793, 247195, 246897, 246867, 246952, 246998, 246931, 246814, 246715, 246460, 245765, 244661, 243605, 243045, 243044, 243339, 243645, 243810, 243844, 243873, 244006, 244224, 244480, 244815, 245276, 245770, 246172, 246488, 246740, 246767, 246342, 245450, 244216, 242617, 240556, 238263, 236372, 235467, 235662, 236606, 237752, 238630, 239089, 239293, 239392, 239262, 238733, 237980, 237446, 237398, 237788, 238514, 239505, 240518, 241188, 241459, 241734]
54143B41734O96J108J226J197J272J492J706J748J530J140Q74R54J240J335J064
54128B60316O36L01K0l50p17p76l83K30O82P75N99M06M56P93J138J091N69r3o22
54109B65071j148j738j920j184P4P91N32m4k45k09k60j00O16J326J122J04o77
54092B62111o64l68l91o23p19p37p74n52J12P09N40l62j207j428j172p89k24O80
54074B54142J531J544N80l94k72Q63J892K100J855J728J552Q48k64j096j160m75
54058B64974O33J594J703P50n46j135o30N62J817K574K435J547P27O76J228J829
54042B80738K412L151L689L553L082L089L619L952L831L704L657L210K415K146
54028C26248K820L714M146M400M838M936M069K723J984K133K524K673K752L005
$$ y = [241734, 242430, 243538, 244764, 245961, 247233, 248725, 250431, 252179, 253709, 254849, 255723, 256677, 257917, 259252, 260316, 260952, 261253, 261273, 260923, 260206, 259430, 259047, 259277, 259959, 260734, 261333, 261739, 262195, 262988, 264126, 265217, 265786, 265693, 265071, 263923, 262185, 260265, 259081, 259155, 259946, 260478, 260434, 260189, 259980, 259720, 259620, 260236, 261562, 262684, 262788, 262111, 261447, 261079, 260688, 260065, 259346, 258609, 257835, 257283, 257395, 258104, 258644, 258282, 257075, 255647, 254475, 253686, 253462, 254142, 255673, 257217, 257797, 257403, 257131, 257994, 259886, 261986, 263841, 265569, 267121, 267969, 267705, 266609, 265449, 264974, 265607, 267201, 268904, 269654, 269108, 267973, 267343, 267905, 269722, 272296, 274731, 276278, 277005, 277681, 278909, 280738, 283150, 286301, 289990, 293543, 296625, 299714, 303333, 307285, 311116, 314820, 318477, 321687, 324102, 326248, 329068, 332782, 336928, 341328, 346166, 351102, 355171, 357894, 359878, 362011, 364535, 367208, 369960, 372965]
54014C72965L321L487L497L546L912M871O503Q547J0531J1987J2679J2702J2356
54001D70904J1725J0597R065P827P387P232O526N394M568L898K229r33m693q038
53987E33688j0866j3334j5125j6067j6653j7226j7341j6570j5279j3909j2230
53976C69088j0104q300p558p354o574n097l781l145k940k884k880k606j750o49
53962C03466k9q2l47m53l63m0N34J056J214J146J124R89N67M05J229K758L845
53945C17019L953L709L829M188M243L922L636L725M071M196L763L074K849L307
53931C69484L787L622L010K512K106J441O85L75N25O90P47R01J048R24Q08J199
53915C93864J872K099J853J859K297K499K149J843K046K418K668L152L960M278
$$ y = [372965, 376286, 379773, 383270, 386816, 390728, 395599, 402102, 410649, 421180, 433167, 445846, 458548, 470904, 482629, 493226, 502291, 510118, 517505, 524737, 531263, 536657, 541225, 545123, 547352, 546419, 541726, 533688, 522822, 509488, 494363, 478296, 461643, 444417, 427076, 410506, 395227, 381318, 369088, 358984, 350684, 343126, 335772, 329198, 324101, 320320, 317175, 314235, 311351, 308471, 305865, 304115, 303466, 303437, 303355, 303008, 302555, 302192, 302152, 302686, 303742, 304956, 306102, 307226, 308215, 308782, 309187, 310416, 313174, 317019, 320972, 324681, 328510, 332698, 336941, 340863, 344499, 348224, 352295, 356491, 360254, 363328, 366177, 369484, 373271, 376893, 379903, 382415, 384521, 385962, 386647, 387022, 387547, 388237, 388984, 389885, 390933, 391857, 392665, 393864, 395736, 397835, 399688, 401547, 403844, 406343, 408492, 410335, 412381, 414799, 417467, 420619, 424579, 428857]
53901D28857L417J936Q75L18m24j537k430k701k623k668l004l527m011m171l906
53886D04401l524l475l897m586n253n590n322m481l580l124l066k952k631k498
53872C50422k950l777m169l459j923o72n53j231j702j569j260j046o32k8J9r16
53856C24554k010k150j441r01r16r23n91k59l3N98J694K309J683M45j75N0L20
53839C22254J56p4PK70O17J317K475L690M669N702P131Q738J0143J1470J3036
53824C91601J4648J5727J6095J6106J6024J5713J4997J3865J2363J0585Q822P348
53812E53894O157N197M555L931K249j245n682r316j1637j3672j5923j7287j6715
53799D84506j4814j2898j1304r658q125p120o231m748k977j852j327m04J071J928
$$ y = [428857, 432274, 434210, 435085, 435403, 434979, 433442, 431012, 428311, 425688, 423020, 420016, 416489, 412478, 408307, 404401, 400877, 397402, 393505, 388919, 383666, 378076, 372754, 368273, 364693, 361569, 358503, 355551, 352920, 350422, 347472, 343695, 339526, 336067, 334144, 333472, 332919, 331688, 329986, 328417, 327157, 326111, 325479, 325451, 325470, 324554, 322544, 320394, 318953, 318052, 317136, 316213, 315622, 315363, 315330, 315928, 317622, 319931, 321614, 322059, 321884, 321934, 322254, 322410, 322336, 322343, 322613, 323230, 324547, 327022, 330712, 335381, 341083, 348214, 356952, 367095, 378565, 391601, 406249, 421976, 438071, 454177, 470201, 485914, 500911, 514776, 527139, 537724, 546546, 553894, 560051, 565248, 569803, 573734, 575983, 574738, 569056, 559740, 548103, 534431, 518508, 501221, 484506, 469692, 456794, 445490, 435832, 427707, 420587, 414356, 409608, 406631, 404779, 403452, 403048, 404119, 406047]
53785D06047J315j66j463k302k836k913k344j507j028j160j809k826l896m574
53771C78538m743m764m858m691l903k720j711j206j258j839k704l359l466l104
53757C34212k463j602q08p20j593k742l189k738j959j260n16L70J098J285R10
53742C18285K50l74p11o54l27k6O3oj15k52m06l55K25J339K412K677J952R28M95
53723C25400Q65J470J722J614J567J876K436K851K778K204J510J215J574K366
53709C51448L041L160K810K559K773L034K613J606J035J567K587L088K974K888
53695C87183L033K973K519K041J783J623J562J797K161K149J757J548J669J577
53681D15375J087R10J503K124J805Q23K49L93N87M25K54L05J60n19j298j480r70
$$ y = [406047, 407362, 407196, 405733, 403431, 400595, 397682, 395338, 393831, 392803, 391643, 389834, 387008, 383112, 378538, 373795, 369031, 364173, 359482, 355579, 352859, 351148, 349942, 348684, 346845, 344141, 340782, 337316, 334212, 331749, 330147, 329339, 328619, 327026, 324284, 321095, 318357, 316398, 315138, 314622, 314992, 316090, 317375, 318285, 318535, 318161, 317450, 316796, 316469, 316443, 316506, 316500, 316385, 316133, 315727, 315372, 315597, 316936, 319348, 322025, 323977, 324905, 325400, 326265, 327735, 329457, 331071, 332638, 334514, 336950, 339801, 342579, 344783, 346293, 347508, 349082, 351448, 354489, 357649, 360459, 363018, 365791, 368825, 371438, 373044, 374079, 375646, 378233, 381321, 384295, 387183, 390216, 393189, 395708, 397749, 399532, 401155, 402717, 404514, 406675, 408824, 410581, 412129, 413798, 415375, 416462, 417372, 418875, 420999, 422804, 423627, 423876, 424269, 424856, 425281, 425535, 425840, 426000, 425481, 424183, 422703, 421733]
53664D21733k41K68M17J90l34q68j063q69o28o77r50j074q44m52k41l42o09q20
53646D12596q48p37p49j118j627j610o83O68J550J642J316R25M56j7j54J21M05
53629D12136M51N90J208K097K745L008L086L087L034L080L291L379L106K840L193
53614D50331M096M763M677M177L901L985M096L963L672L511L690M081M215L719
53600E06877K848K328K511K967L144L129L333L607L237J996O28J0J22L35L67M33
53584E37872N55L85j30m73l00j8k68j094k014k659k896k587j697o19P0J71j29
53567E24169p20j583k411k663k186j455j043j136j573k073k308k078j498q47k31
53552E00364L56P41P21M88M78P17P73M81K56M58R10J281J615K086K550K700K595
$$ y = [421733, 421492, 421760, 422177, 422367, 422033, 421165, 420102, 419233, 418605, 417928, 416978, 415904, 415060, 414608, 414367, 414025, 413416, 412596, 411748, 411011, 410262, 409144, 407517, 405907, 405224, 405892, 407442, 409084, 410400, 411325, 411781, 411764, 411610, 411731, 412136, 412587, 413177, 414385, 416482, 419227, 422235, 425321, 428408, 431442, 434522, 437813, 441192, 444298, 447138, 450331, 454427, 459190, 463867, 468044, 471945, 475930, 480026, 483989, 487661, 491172, 494862, 498943, 503158, 506877, 509725, 512053, 514564, 517531, 520675, 523804, 527137, 530744, 533981, 535977, 536605, 536615, 536737, 537072, 537439, 537872, 538427, 538812, 538682, 538209, 537909, 537891, 537623, 536529, 534515, 531856, 528960, 526373, 524676, 524057, 524127, 524298, 524169, 523449, 521866, 519455, 516792, 514606, 513151, 512108, 510972, 509399, 507326, 505018, 502940, 501442, 500595, 500364, 500720, 501461, 502182, 502670, 503148, 503865, 504638, 505119, 505375, 505833, 506743, 508024, 509639, 511725, 514275, 516975, 519570]
53535E19570K694L382M625N951O802P005P006P448Q481R662J0557J1120J1506
53522F15809J1898J2619J4009J5950J7746J8774J9140J9545K0569K2115K3440
53511H11614K3806K3296K2869K3254K3968K3994K3337K3201K4326K5915K6611
53500A076191K6070K5061K4354K4096K4096K4233K4509K4961K5548K6100K6449
53489A351668K6577K6447K5895K5044K4645K5351K6648K7169K6326K4980K4195
53478A634945K3981K3638K2720K1208J9252J7330J6124J5752J5475J4622J3429
53467A838476J2416J1443R927P705N018K070q39l095m432n575p457j0008j2380
53454A843269j4255j6093j8112j9848k0932k1691k2652k3871k5005k5786k6201
$$ y = [519570, 522264, 525646, 530271, 536222, 543024, 550029, 557035, 564483, 572964, 582626, 593183, 604303, 615809, 627707, 640326, 654335, 670285, 688031, 706805, 725945, 745490, 766059, 788174, 811614, 835420, 858716, 881585, 904839, 928807, 952801, 976138, 999339, 1023665, 1049580, 1076191, 1102261, 1127322, 1151676, 1175772, 1199868, 1224101, 1248610, 1273571, 1299119, 1325219, 1351668, 1378245, 1404692, 1430587, 1455631, 1480276, 1505627, 1532275, 1559444, 1585770, 1610750, 1634945, 1658926, 1682564, 1705284, 1726492, 1745744, 1763074, 1779198, 1794950, 1810425, 1825047, 1838476, 1850892, 1862335, 1872262, 1879967, 1884985, 1887055, 1886216, 1883121, 1878689, 1873114, 1865657, 1855649, 1843269, 1829014, 1812921, 1794809, 1774961, 1754029, 1732338, 1709686, 1685815, 1660810, 1635024, 1608823]
53443A608823k6402k6480k6275k5543k4354k3153k2240k1495k0793k0230j9673
53432A352185j8536j6553j4309j2502j0967r085o790m546k554o49J182K888M695
53419A264459O749Q604R782J0675J2072J4018J5978J7930K0310K2845K4564K5194
53407A453180K5640K6766K8585L0876L3643L6554L8837M0333M1847M3939M6111
53396A846311M7896M9885N2815N6193N8873O0603O2068O3621O4982O6099O7278
53385B496624O8298O8318O7136O5793O5309O5305O4525O2503O0073N8227N7032
53374C199143N5761N3686N0431M6003M0833L5730L1233K7046K2390J6956J1209
53363C590421N681M02m905j0401j6151k2209k8489l4773m0996m7186n2907n7390
$$ y = [1608823, 1582421, 1555941, 1529666, 1504123, 1479769, 1456616, 1434376, 1412881, 1392088, 1371858, 1352185, 1333649, 1317096, 1302787, 1290285, 1279318, 1270233, 1263443, 1258897, 1256343, 1255694, 1256876, 1259764, 1264459, 1271208, 1279812, 1289594, 1300269, 1312341, 1326359, 1342337, 1360267, 1380577, 1403422, 1427986, 1453180, 1478820, 1505586, 1534171, 1565047, 1598690, 1635244, 1674081, 1714414, 1756261, 1800200, 1846311, 1894207, 1944092, 1996907, 2053100, 2111973, 2172576, 2234644, 2298265, 2363247, 2429346, 2496624, 2564922, 2633240, 2700376, 2766169, 2831478, 2896783, 2961308, 3023811, 3083884, 3142111, 3199143, 3254904, 3308590, 3359021, 3405024, 3445857, 3481587, 3512820, 3539866, 3562256, 3579212, 3590421, 3596102, 3596504, 3591599, 3581198, 3565047, 3542838, 3514349, 3479576, 3438580, 3391394, 3338487, 3281097]
53351C281097o0475o2970o5582o8005o9631p0597p1357p1612p0693o8844o7204
53340B534127o6349o5726o4635o3066o1314n9478n7612n5835n4031n1904m9501
53329A884676m7180m4926m2289l9189l6107l3331l0649k8133k6404k5621k4825
53318A506022k2998k0303j7671j5548j3763j2265j1221j0423r316p778o277n075
53306A353384l780j985L0J676K931M403O446Q619J0281J1442J2731J4571J6766
53293A437515J8857K0504K1515K1995K2572K3934K5879K7383K7930K8177K8789
53282A705050K9353K9170K8571K8402K8632K8480K7721K6767K5559K3520K0730
53271B001955J8028J5717J3196J0196P334N052K889L11k596n683r176j2992j6442
$$ y = [3281097, 3220622, 3157652, 3092070, 3024065, 2954434, 2883837, 2812480, 2740868, 2670175, 2601331, 2534127, 2467778, 2402052, 2337417, 2274351, 2213037, 2153559, 2095947, 2040112, 1986081, 1934177, 1884676, 1837496, 1792570, 1750281, 1711092, 1674985, 1641654, 1611005, 1582872, 1556468, 1530847, 1506022, 1483024, 1462721, 1445050, 1429502, 1415739, 1403474, 1392253, 1381830, 1372514, 1364736, 1358459, 1353384, 1349604, 1347619, 1347649, 1349325, 1352256, 1356659, 1363105, 1371724, 1382005, 1393447, 1406178, 1420749, 1437515, 1456372, 1476876, 1498391, 1520386, 1542958, 1566892, 1592771, 1620154, 1648084, 1676261, 1705050, 1734403, 1763573, 1792144, 1820546, 1849178, 1877658, 1905379, 1932146, 1957705, 1981225, 2001955, 2019983, 2035700, 2048896, 2059092, 2066426, 2071478, 2074367, 2074678, 2072082, 2066399, 2057223, 2044231, 2027789]
53258B027789j9202k1848k4814k7643k9824l1645l3484l5025l5997l6970l8475
53247A692862l9860m0121l9562l9535m0608m1791m1723m0057l7597l5496l4329
53236A262183l3713l3003l2265l2076l2253l1765l0334k9118k8938k8769k7167
53225I22782k4493k2355k1230k0068j8206j6304j5143j4650j4429j4295j3953
53214G27656j3022j1709j0775j0561j0704j0953j1423j1831j1484j0388r565r701
53202E95540j0150r966r224q628q316p867p264o988p184p358p093o605o387o492
53188D86018o489o021n249m653m450m378m112l679l237k690j895j152j028j641
53174D35344k445k794k507j812j068n57l02k9M26P33L82n87j556k047k103j871
$$ y = [2027789, 2008587, 1986739, 1961925, 1934282, 1904458, 1872813, 1839329, 1804304, 1768307, 1731337, 1692862, 1653002, 1612881, 1573319, 1533784, 1493176, 1451385, 1409662, 1369605, 1332008, 1296512, 1262183, 1228470, 1195467, 1163202, 1131126, 1098873, 1067108, 1036774, 1007656, 978718, 949949, 922782, 898289, 875934, 854704, 834636, 816430, 800126, 784983, 770333, 755904, 741609, 727656, 714634, 702925, 692150, 681589, 670885, 659932, 648509, 636678, 625194, 614806, 605241, 595540, 585390, 575424, 566200, 557572, 549256, 541389, 534125, 527137, 519953, 512595, 505502, 498897, 492510, 486018, 479529, 473508, 468259, 463606, 459156, 454778, 450666, 446987, 443750, 441060, 439165, 438013, 436985, 435344, 432899, 430105, 427598, 425786, 424718, 424161, 423859, 423830, 424256, 424989, 425371, 424784, 423228, 421181, 419078, 417207]
53158D17207j335n75J2J80J64L30O16O76L99J2l23p33j338j889j889j191m05l95
53140D09523j273k136k065j178l54j16j83j22R2K25J67l2k92m93n49m92l42Q2
53122D00462R31J892K324J880Q85m8m45j82M51Q08M00n07j127j086q34r35j339
53105D03530j581j519j517j926k641l191l221k893k703k906l160k947k246j529
53091C69550j119q67n23j21J23J43N7M3J97M40M81J24l89n63k52J14Q1k13j60
53072C67146O20J735K285J626J1j580k239j740n31O37J089O50p1j68N49J264J189
53055C72472N11j8j29q2N3M92J115J434J276J048J155J602K177K636K628J963
53039C90333J061O85J015J379J055L4j103j735j612j029o65q88j270j178p38o39
$$ y = [417207, 415872, 415297, 415309, 415489, 415653, 415983, 416599, 417275, 417674, 417686, 417363, 416630, 415292, 413403, 411514, 410323, 409918, 409523, 408250, 406114, 404049, 402871, 402517, 402401, 402218, 402096, 402188, 402413, 402580, 402548, 402256, 401763, 401214, 400722, 400380, 400462, 401393, 403285, 405609, 407489, 408374, 408326, 407881, 407699, 408150, 408958, 409358, 408851, 407724, 406638, 405804, 404869, 403530, 401949, 400430, 398913, 396987, 394346, 391155, 387934, 385041, 382338, 379432, 376272, 373325, 371079, 369550, 368431, 367564, 367041, 366920, 367043, 367186, 367243, 367286, 367483, 367923, 368404, 368528, 368139, 367576, 367324, 367438, 367519, 367306, 367146, 367766, 369501, 371786, 373412, 373423, 371843, 369604, 367864, 367333, 367970, 369059, 369709, 369638, 369470, 370019, 371283, 372472, 372983, 372965, 372836, 372754, 372807, 373299, 374414, 375848, 377124, 378172, 379327, 380929, 383106, 385742, 388370, 390333, 391394, 392079, 393094, 394473, 395528, 395562, 394459, 392724, 391112, 390083, 389418, 388530, 387260, 386082, 385344, 384705]
53023C84705j008j180p54k10j52n21q38q10m56k3R7j81k92K74R82Q39Pk60L77
53004C80596O64k04j089n52R02J609J118M37K20J54Q4L83R19Q72Jq12p54m5P20
52985C85223J400K051K443K475K532K879L073K538J437M25k46q31j301j072K35
52970D03261K044L184L033K109J342R76M78m31j166j001o6Q21J148J022O86K18
52954D17658k68o25r37j355j649j429q21m35n63r04j189j471j603j125q2N83Q2
52937D03867j107j750j304m00l6o31j731k326j677j82P22L1j600k498j836l64
52921C87178O37P00L12O5Pk40q25j323j160m62k9l10p15m19M68J101J098Q38O45
52902C87566L07l05p71o41oP22J278J540J447J218J243J462J234K63p95j105p58
$$ y = [384705, 383697, 382517, 381763, 381553, 381401, 380880, 380042, 379232, 378776, 378753, 378850, 378669, 378377, 378651, 379633, 380472, 380479, 380219, 380596, 381260, 381056, 379967, 379415, 380317, 381926, 383044, 383481, 383701, 383855, 383939, 384322, 385241, 386113, 386114, 385302, 384548, 384503, 385223, 386623, 388674, 391117, 393592, 396124, 399003, 402076, 404614, 406051, 406476, 406230, 405399, 404098, 403026, 403261, 405305, 408489, 411522, 413631, 414973, 415949, 416427, 415996, 414830, 413829, 413763, 414584, 415732, 416754, 417440, 417658, 417390, 416765, 415828, 414473, 412824, 411395, 410574, 410139, 409576, 408672, 407483, 406012, 404409, 403284, 403202, 403785, 403867, 402760, 401010, 399706, 399306, 399270, 398639, 396908, 394582, 392905, 392723, 393445, 393476, 391876, 389378, 387542, 387178, 387815, 388515, 388827, 388892, 388899, 388659, 387834, 386511, 385351, 384889, 384860, 384550, 383835, 383416, 383884, 384985, 386083, 386921, 387566, 387873, 387568, 386797, 386156, 386150, 386872, 388150, 389690, 391137, 392355, 393598, 395060, 396294, 396557, 395762, 394657, 393899]
52885C93899n05n82n24o2M34N45L13K5j15j3K50K76k44r52j106n85n2m3l78p25
52865C89856j068j274q73J21P12J5j480k452k365j782j203n19K83P20N08J09J19
52848C79427M80O35K16o62j559j959j680j154j040j345j397q12r8O7k09k67J49
52831C68792O49P25K01p63j665j809q80N92J672J992J969K113K417K591K549K438
52815C83583K357K249K036J834J928K474L173L421K961K161J436N99p69k485l820
52800D03138m473m864n262n167m101k608j808k051k567k492j809j089p71r32j415
52785C61729j913k068j825j505j396j360j111o28o6O11J437K061J947J098K02
52770C57213j27J20O00J098J476J572J385J160J073R76P36N09M42M01K88L33O64
$$ y = [393899, 393394, 392812, 392288, 392226, 392660, 393205, 393518, 393543, 393428, 393415, 393665, 393941, 393697, 392745, 391639, 391054, 391002, 390959, 390581, 389856, 388788, 387514, 386641, 386762, 387474, 387489, 386009, 383557, 381192, 379410, 378207, 377688, 377971, 378691, 379199, 379308, 379427, 379907, 380542, 380758, 380096, 378537, 376578, 374898, 373744, 372704, 371359, 369962, 369150, 369052, 369119, 368910, 368643, 368792, 369441, 370166, 370367, 369604, 367939, 366130, 365250, 365842, 367514, 369506, 371475, 373588, 376005, 378596, 381145, 383583, 385940, 388189, 390225, 392059, 393987, 396461, 399634, 403055, 406016, 408177, 409613, 410212, 409443, 406958, 403138, 398665, 393801, 388539, 383372, 379271, 376663, 374855, 372804, 370237, 367745, 365936, 364847, 364076, 363144, 361729, 359816, 357748, 355923, 354418, 353022, 351662, 350551, 349923, 349857, 350468, 351905, 353966, 355913, 357011, 357213, 357086, 357206, 357806, 358904, 360380, 361952, 363337, 364497, 365570, 366546, 367282, 367791, 368233, 368634, 368922, 369255, 369919]
52753C69919Q84N49j17m92m20k12J0L54O11M40J72N64J520J936J238L21K55Q03
52735C78335R89O78N13N66J57q30j482j159n16n46j114j179l21O41P57J56k18
52718C75427J00N32L38l55p30l74K35M59L22K66M41N51M07K02J99M29P17Q62P29
52699C80757L56m5k67k78p9M07J089J501J204M02j88j55K21M77N31N45N41M27
52681C87446L16M78R92J588J853J587R88N31N19P31O70K70J13P15J733K215J681
52664D04426O78J52L80P75N89k71j216j607j315o49J33R67J670J760Q67o62j892
52647D04785k130j491o65k74n05j067j341q58J54Q66Q03M55N69J034J060M30j46
52630D01679j78q9l53n58q2P05R08N56N81J247J542O00j010k072k259k163k140
$$ y = [369919, 370803, 371352, 371235, 370743, 370323, 370111, 370121, 370475, 371086, 371526, 371698, 372262, 373782, 375718, 376956, 377277, 377532, 378335, 379324, 380002, 380515, 381081, 381238, 380408, 378926, 377767, 377251, 376705, 375591, 374412, 374091, 374732, 375489, 375645, 375427, 375527, 376059, 376397, 376042, 375312, 374938, 375173, 375632, 375954, 376220, 376661, 377212, 377619, 377821, 378020, 378449, 379166, 380028, 380757, 381113, 381068, 380801, 380523, 380444, 380851, 381940, 383441, 384645, 385047, 384859, 384704, 384925, 385402, 385933, 386478, 387019, 387446, 387762, 388240, 389232, 390820, 392673, 394260, 395248, 395779, 396298, 397029, 397699, 397969, 398082, 398797, 400530, 402745, 404426, 405104, 405256, 405636, 406411, 407000, 406729, 405513, 403906, 402591, 401942, 402075, 403042, 404712, 406472, 407339, 406677, 404785, 402655, 401164, 400499, 400225, 399720, 398653, 397312, 396454, 396608, 397474, 398277, 398732, 399301, 400335, 401395, 401825, 401679, 401501, 401412, 401059, 400501, 400419, 401124, 402032, 402588, 403169, 404416, 405958, 406558, 405548, 403476, 401217, 399054, 396914]
52613C96914j935j368o99j82K55O18O10R7m31l04N22J285J213L28n83q15m60j66
52595C94899k38k37L56J277J671J175M72M78J217J906K037J876J717J209J0j159
52579D08666r74P49K466K561J213jn7N99J007Q00K03m67r09q30k72K70L05j40
52561D15189o12p17m27m6L9k19l89p4M20L48m88j377j586j179p03m21j64K26O71
52542D08491R62Q07L8j053j785j753j253p82l27M65J578K433K521J961J353J135
52526D14791J169J009N65L01N24Q28O69L14N34J364J903J528O15j85o81p66j17
52509D24365J067J808J455N05l33j221k446l324l027k110j918k587k862k042q72
52494D06458k00J46O31J046R53N54M07O74R96R60M97mM2O98J177Q04J34L59J604
$$ y = [396914, 394979, 393611, 392912, 392730, 392985, 393603, 394213, 394310, 393879, 393575, 394097, 395382, 396595, 396923, 396340, 395525, 395065, 394899, 394661, 394424, 394780, 396057, 397728, 398903, 399375, 399853, 401070, 402976, 405013, 406889, 408606, 409815, 409825, 408666, 407692, 408441, 410907, 413468, 414681, 414680, 414623, 415222, 416229, 417029, 417232, 416765, 415856, 415026, 414754, 415024, 415329, 415189, 414577, 413860, 413433, 413387, 413426, 413207, 412818, 412744, 413164, 413512, 413024, 411647, 410061, 408882, 408179, 407758, 407594, 407820, 408491, 409453, 410260, 410298, 409245, 407460, 405707, 404454, 403672, 403345, 403810, 405388, 407821, 410342, 412303, 413656, 414791, 415960, 416969, 417534, 417835, 418359, 419187, 419856, 420170, 420704, 422068, 423971, 425499, 426114, 425929, 425248, 424482, 424365, 425432, 427240, 428695, 429200, 428867, 427646, 425200, 421876, 418849, 416739, 414821, 412234, 409372, 407330, 406458, 406258, 406404, 407035, 408081, 409034, 409588, 409995, 410669, 411665, 412625, 413122, 413118, 413160, 413858, 415035, 415839, 415973, 416332, 417936]
52475D17936K724K942K674K442J981J082L84M53P89O12J29Q5M21M09o2l81m39
52458D34181r68k266l374l134j777p72j146k373l146k903k250j870j616j045m03
52443D05138l74r89j492j361q08j30O05J022M49r60j894j396j72L85M7k91j54
52426C97625Qk01n07n13k36J29M38N28L75M10J163K470L530L856L777L813M079
52409D20744M468M952N384N459N177N037N389N834N689M949M373M486M825M405
52395D91171K857Q54o53j447k015k701l319l680l969m261m110l166j949j367j570
52380D60675j849j711j339r53l49N43J221J261J008J135J652J924J595R58L38
52365D66109l54j155j541r28L61J138P16j74k56O12J241P35l21p17j64O24J140
$$ y = [417936, 420660, 423602, 426276, 428718, 430699, 431781, 432165, 432618, 433407, 434019, 434148, 434233, 434654, 435063, 435001, 434620, 434181, 433213, 430947, 427573, 424439, 422662, 421890, 420744, 418371, 415225, 412322, 410072, 408202, 406586, 405541, 405138, 404764, 403775, 402283, 400922, 400114, 399984, 400589, 401611, 402060, 401100, 399206, 397810, 397638, 398023, 398070, 397779, 397625, 397633, 397432, 396925, 396412, 396176, 396305, 396743, 397271, 397646, 398056, 399219, 401689, 405219, 409075, 412852, 416665, 420744, 425212, 430164, 435548, 441007, 446184, 451221, 456610, 462444, 468133, 473082, 477455, 481941, 486766, 491171, 494028, 494882, 494229, 492782, 490767, 488066, 484747, 481067, 477098, 472837, 468727, 465561, 463612, 462245, 460675, 458826, 457115, 455776, 454823, 454474, 455017, 456238, 457499, 458507, 459642, 461294, 463218, 464813, 465771, 466109, 465755, 464600, 463059, 462131, 462492, 463630, 464346, 464172, 463916, 464528, 465769, 466504, 466183, 465466, 465302, 465926, 467066]
52348D67066J584K128K460K341K092K132K430K732L046L469L797L725L372L266
52334E05640L823M937O046O455N849M766M266M813N645N719N113M915N698O753
52320E80438P104O758O501O797P437Q110Q813R548J0098J0347J0554J1090J1946
52307F95541J2708J3057J3099J3248J3741J4366J4723J4704J4550J4413J4080
52296H48230J3393J2704J2499J2680J2637J2135J1638J1560J1663J1473J0948
52285I81560J0283R470Q549P981Q117Q385P776O267N048N115O111O913O868O099
52271A084542M981L896L194K987K945K731K495K648L183L602L581L365L365L559
52257A131074L501K864J880J229J470K557L901M906N403N626N900O342O775O952
$$ y = [467066, 468650, 470778, 473238, 475579, 477671, 479803, 482233, 484965, 488011, 491480, 495277, 499002, 502374, 505640, 509463, 514400, 520446, 526901, 532750, 537516, 541782, 546595, 552240, 557959, 563072, 567987, 573685, 580438, 587542, 594300, 600801, 607598, 615035, 623145, 631958, 641506, 651604, 661951, 672505, 683595, 695541, 708249, 721306, 734405, 747653, 761394, 775760, 790483, 805187, 819737, 834150, 848230, 861623, 874327, 886826, 899506, 912143, 924278, 935916, 947476, 959139, 970612, 981560, 991843, 1001313, 1009862, 1017843, 1025960, 1034345, 1042121, 1048388, 1053436, 1058551, 1064662, 1071575, 1078443, 1084542, 1089523, 1093419, 1096613, 1099600, 1102545, 1105276, 1107771, 1110419, 1113602, 1117204, 1120785, 1124150, 1127515, 1131074, 1134575, 1137439, 1139319, 1140548, 1142018, 1144575, 1148476, 1153382, 1158785, 1164411, 1170311, 1176653, 1183428, 1190380]
52243A190380O927P124P892R108J0356J1386J2018J1935J1042R977R553R683R471
52230A316852Q592P749P372O825N567M383M397N254N414M210K600J684J408J153
52216A383460P85N41L27k44j243k191k462j774m84N55O93J34l27k18K34O98J174
52199A379658J689K001K007K048K449K979L208L183L315L683L906L738L369L073
52185A420306K828K543K311K227K094J599Q44L37L81O46N36j09r70j747k406k843
52169A428577k845k520k459l058l966m559m753m871m866m338l313k396j979j743
52155A380911j246n59k5K37K97J71l1K9N85J407K080K448K575K474K265K359L055
52138A399032M038M659M713M486M186L751L299L257L769M353M433L957L255K590
$$ y = [1190380, 1197307, 1204431, 1212323, 1221431, 1231787, 1243173, 1255191, 1267126, 1278168, 1288145, 1297698, 1307381, 1316852, 1325444, 1333193, 1340565, 1347390, 1352957, 1357340, 1361737, 1366991, 1372405, 1376615, 1379215, 1380899, 1382307, 1383460, 1384245, 1384786, 1385113, 1384869, 1383626, 1381435, 1378973, 1377199, 1376715, 1377270, 1377963, 1378097, 1377770, 1377552, 1377786, 1378484, 1379658, 1381347, 1383348, 1385355, 1387403, 1389852, 1392831, 1396039, 1399222, 1402537, 1406220, 1410126, 1413864, 1417233, 1420306, 1423134, 1425677, 1427988, 1430215, 1432309, 1433908, 1434752, 1435089, 1435470, 1436116, 1436652, 1436543, 1435573, 1433826, 1431420, 1428577, 1425732, 1423212, 1420753, 1417695, 1413729, 1409170, 1404417, 1399546, 1394680, 1390342, 1387029, 1384633, 1382654, 1380911, 1379665, 1379106, 1379081, 1379318, 1379615, 1379786, 1379755, 1379784, 1380369, 1381776, 1383856, 1386304, 1388879, 1391353, 1393618, 1395977, 1399032, 1403070, 1407729, 1412442, 1416928, 1421114, 1424865, 1428164, 1431421, 1435190, 1439543, 1443976, 1447933, 1451188, 1453778]
52124A453778K111J970K134K246K050J819J997K508K930L271M031N369O771P792
52110A500777Q573R257R522R257R278J0475J2502J4153J4965J5573J6358J6749
52098A647439J6331J5732J5656J5788J5416J4712J4391J4424J4060J3140J2395
52087A809484J2235J2050J1173R897R024Q746Q435P437N775M065K881K121J112
52074A904435n23k251l282l693m310n393o147n871m998m437m287l881k939k020
52060A850403j706j809j605o32Q45K103K661K742L027L836M726N104N075N285
$$ y = [1453778, 1455889, 1457859, 1459993, 1462239, 1464289, 1466108, 1468105, 1470613, 1473543, 1476814, 1480845, 1486214, 1492985, 1500777, 1509350, 1518607, 1528129, 1537386, 1546664, 1557139, 1569641, 1583794, 1598759, 1614332, 1630690, 1647439, 1663770, 1679502, 1695158, 1710946, 1726362, 1741074, 1755465, 1769889, 1783949, 1797089, 1809484, 1821719, 1833769, 1844942, 1854839, 1863863, 1872609, 1881044, 1888481, 1894256, 1898321, 1901202, 1903323, 1904435, 1903912, 1901661, 1898379, 1894686, 1890376, 1884983, 1878836, 1872965, 1867967, 1863530, 1859243, 1855362, 1852423, 1850403, 1848697, 1846888, 1845283, 1844651, 1845496, 1847599, 1850260, 1853002, 1856029, 1859865, 1864591, 1869695, 1874770, 1880055]
$$ [...]
##END NTUPLES=NMR SPECTRUM
##END=
