##TITLE=AC1684_PANAN14365_8637509_Men9rfclpd
##JCAMPDX= 6.0         $$ Bruker NMR JCAMP-DX V2.0
##DATA TYPE= NMR SPECTRUM
##DATA CLASS= NTUPLES
##ORIGIN= BRUKER
##OWNER= Administrator
$$ 1.72 TOPSPIN		Version 2.1
$$ 2014-05-30 23:24:16.640 -0700  Administrator@X
$$ Compression mode = diff/dup
##.OBSERVE FREQUENCY= 400.02188249412
##.OBSERVE NUCLEUS= ^1H
##.ACQUISITION MODE= SIMULTANEOUS (DQD)
##.ACQUISITION SCHEME= undefined
##.AVERAGES= 8
##.DIGITISER RES= 22
##SPECTROMETER/DATA SYSTEM= spect
##.PULSE SEQUENCE= zg30
##.SOLVENT NAME= COFFEE_meoh
##.SHIFT REFERENCE= INTERNAL, COFFEE_meoh, 1, 14.98509
##AUDIT TRAIL= $$ (NUMBER, WHEN, WHO, WHERE, PROCESS, VERSION, WHAT)
$$ ##TITLE= Audit trail, TOPSPIN		Version 2.1
$$ ##JCAMPDX= 5.01
$$ ##ORIGIN= Bruker BioSpin GmbH
$$ ##OWNER= Administrator
$$ $$ E:\/data/COFFEE/nmr/AC1684_PANAN14365_8637509_Men9rfclpd/10/pdata/1/auditp.txt
$$ ##AUDIT TRAIL=  $$ (NUMBER, WHEN, WHO, WHERE, PROCESS, VERSION, WHAT)
(   1,<2014-05-30 23:24:09.468 -0700>,<Administrator>,<X>,<go>,<TOPSPIN 2.1>,
      <created by zg
	started at 2014-05-30 23:23:02.968 -0700,
	POWCHK enabled, PULCHK disabled,
       configuration hash MD5:
       C8 4E 4E 5D D3 5C D8 9E 9F 52 82 E0 59 8A DE 15
       data hash MD5: 64K
       98 3B 8F DF 18 90 6B 45 3A B7 7E D8 32 5B 33 BB>)
(   2,<2014-05-30 23:24:12.500 -0700>,<Administrator>,<X>,<proc1d>,<TOPSPIN 2.1>,
      <Start of raw data processing
       efp LB = 0 FT_mod = 6 PKNL = 1 PHC0 = 0 PHC1 = 0 SI = 32K 
       data hash MD5: 32K
       82 44 D1 7C B4 45 EF 1E 24 7A 8D 49 8A CA C0 84>)
(   3,<2014-05-30 23:24:12.906 -0700>,<Administrator>,<X>,<proc1d>,<TOPSPIN 2.1>,
      <pk PHC0 = 93.91663 PHC1 = 0 
       data hash MD5: 32K
       5E CB 78 CB 4C A3 0F 83 B9 A7 A9 7E 31 A0 8B C8>)
(   4,<2014-05-30 23:24:13.047 -0700>,<Administrator>,<X>,<proc1d>,<TOPSPIN 2.1>,
      <abs ABSG = 1 
       data hash MD5: 32K
       3F BF F5 7A A9 4D DA 18 F8 3F AD ED 6F 4C DA 74>)
(   5,<2014-05-30 23:24:13.140 -0700>,<Administrator>,<X>,<proc1d>,<TOPSPIN 2.1>,
      <abs ABSG = 2 
       data hash MD5: 32K
       7C F0 60 96 F5 3C C1 FA 75 DE F0 D2 AD 2A A0 D0>)
(   6,<2014-05-30 23:24:13.187 -0700>,<Administrator>,<X>,<proc1d>,<TOPSPIN 2.1>,
      <abs ABSG = 3 
       data hash MD5: 32K
       57 0B AD F9 FD D6 33 B4 8D 43 D0 1F F7 A6 A3 81>)
(   7,<2014-05-30 23:24:13.234 -0700>,<Administrator>,<X>,<proc1d>,<TOPSPIN 2.1>,
      <abs ABSG = 4 
       data hash MD5: 32K
       C5 BD 7D 31 60 A4 90 8C BD 65 30 26 04 34 B9 7D>)
(   8,<2014-05-30 23:24:13.281 -0700>,<Administrator>,<X>,<proc1d>,<TOPSPIN 2.1>,
      <abs ABSG = 5 
       data hash MD5: 32K
       CE 5B 63 19 85 14 63 41 73 E7 5B C9 93 62 06 13>)
$$ ##END=
$$ 
$$ $$ hash MD5
$$ $$ 35 24 F8 BB 50 9F 2F 11 C2 17 4F 97 98 F7 85 AB
##$RELAX= 
##$RELAX= 
##$RELAX= 
##$RELAX= 
##$RELAX= 
##$RELAX= 
##$RELAX= 
$$ Bruker specific parameters
$$ --------------------------
##$DU= <E:\>
##$EXPNO= 10
##$NAME= <AC1684_PANAN14365_8637509_Men9rfclpd>
$$ [...]
150 150 150 150 150 150 150 150
##$TP07= 0
##$TPNAME0= <>
##$TPNAME1= <>
##$TPNAME2= <>
##$TPNAME3= <>
##$TPNAME4= <>
##$TPNAME5= <>
##$TPNAME6= <>
##$TPNAME7= <>
##$TPOAL= (0..7)
0.5 0.5 0.5 0.5 0.5 0.5 0.5 0.5
##$TPOFFS= (0..7)
0 0 0 0 0 0 0 0
##$TUNHIN= 0
##$TUNHOUT= 0
##$TUNXOUT= 0
##$USERA1= <user>
##$USERA2= <user>
##$USERA3= <user>
##$USERA4= <user>
##$USERA5= <user>
##$V9= 5
##$VALIST= <valist>
##$VCLIST= <CCCCCCCCCCCCCCC>
##$VD= 0
##$VDLIST= <DDDDDDDDDDDDDDD>
##$VPLIST= <PPPPPPPPPPPPPPP>
##$VTLIST= <TTTTTTTTTTTTTTT>
##$WBST= 2048
##$WBSW= 25
##$XGAIN= (0..3)
0 0 0 0
##$XL= 0
##$YL= 0
##$YMAX_a= 615740
##$YMIN_a= -522182
##$ZGOPTNS= <>
##$ZL1= 120
##$ZL2= 120
##$ZL3= 120
##$ZL4= 120
##$ABSF1= 14.98509
##$ABSF2= -5.573092
##$ABSG= 5
##$ABSL= 3
##$ALPHA= 0
##$AQORDER= 0
##$ASSFAC= 0
##$ASSFACI= 0
##$ASSFACX= 0
##$ASSWID= 0
##$AUNMP= <proc_prof1d_extract_pilot.lims>
##$AXLEFT= 0
##$AXNAME= <>
##$AXNUC= <1H>
##$AXRIGHT= 0
##$AXTYPE= 0
##$AXUNIT= <>
##$AZFE= 0.1
##$AZFW= 0.1
##$BCFW= 0
##$BC_mod= 0
##$BYTORDP= 0
##$COROFFS= 0
##$CY= 15
##$DATMOD= 1
##$DC= 0
##$DFILT= <>
##$DTYPP= 0
##$F1P= 0
##$F2P= 0
##$FCOR= 0.5
##$FTSIZE= 32768
##$FT_mod= 6
##$GAMMA= 0
##$GB= 0
##$INTBC= 1
##$INTSCL= 1
##$ISEN= 128
##$LB= 0
##$LEV0= 0
##$LPBIN= 0
##$MAXI= 10000
##$MC2= 0
##$MEAN= 0
##$ME_mod= 0
##$MI= 0
##$NCOEF= 0
##$NC_proc= -8
##$NLEV= 6
##$NOISF1= 0
##$NOISF2= 0
##$NSP= 0
##$NTH_PI= 0
##$NZP= 0
##$OFFSET= 14.98509
##$PC= 1
##$PHC0= 93.91663
##$PHC1= 0
##$PH_mod= 1
##$PKNL= yes
##$PPARMOD= 0
##$PPDIAG= 0
##$PPIPTYP= 0
##$PPMPNUM= 2147483647
##$PPRESOL= 1
##$PSCAL= 4
##$PSIGN= 0
##$PYNMP= <proc.py>
##$REVERSE= no
##$SF= 400.02
##$SI= 32768
##$SIGF1= 0
##$SIGF2= 0
##$SINO= 400
##$SIOLD= 32768
##$SPECTYP= <>
##$SREGLST= <1H.CDCl3>
##$SSB= 0
##$STSI= 32768
##$STSR= 0
##$SW_p= 8223.68421052631
##$SYMM= 0
##$S_DEV= 0
##$TDeff= 65536
##$TDoff= 0
##$TI= <>
##$TILT= no
##$TM1= 0
##$TM2= 0
##$TOPLEV= 0
##$USERP1= <user>
##$USERP2= <user>
##$USERP3= <user>
##$USERP4= <user>
##$USERP5= <user>
##$WDW= 1
##$XDIM= 32768
##$YMAX_p= 438354533
##$YMIN_p= -750915
##$CURPLOT= <Network HP LaserJet P1505>
##$CURPRIN= <$Network HP LaserJet P1505>
##$DFORMAT= <normdp>
##$LAYOUT= <+/1D_H.xwp>
##$LFORMAT= <normlp>
##$PFORMAT= <normpl>
##$SURQMSG= 1
$$ End of Bruker specific parameters
$$ ---------------------------------
##NTUPLES= NMR SPECTRUM
##VAR_NAME=  FREQUENCY,     SPECTRUM/REAL,   SPECTRUM/IMAG
##SYMBOL=    X,             R,               I
##VAR_TYPE=  INDEPENDENT,   DEPENDENT,       DEPENDENT
##VAR_FORM=  AFFN,          ASDF,            ASDF
##VAR_DIM=   32768,         32768,           32768
##UNITS=     HZ,            ARBITRARY UNITS, ARBITRARY UNITS
##FACTOR=    0.250966925370066, 1,           1
##FIRST=     8223.43324360094, -127919,      -100114
##LAST=      0,             -169578,         -170450
##MIN=       0,             -750915,         0
##MAX=       8223.43324360094, 438354533,    0
$$ Real data points
##PAGE= N=1
##DATA TABLE= (X++(R..R)), XYDATA
$$ [...]
19537d24080B67831G6140e9740G1368d65442a80101O9235k20201N801i530j26498
19526a36028c3696P446G608c78588g4812A05965J19444d23608a91386p4497a03385
19514b963j09514j29170A16646e8338A68432a6250I4991a93515P9882k24137b2022
19502h3120c4445I7287D8064a28801m0023B35123b19335A53865b94653h0727L1169
19491d9558D0310f2152B5966d07307F5452A573c16391a30591e8937F9360h0439
19479I2238d3980a1745C32775a43441d4635j17005A75211d38867A28781b6757
19468b69472A45155b98342A29798g8037C8348J99392o6223h7893n8835A44539
19457h223n2750c0423G8128J38931E8188b28593O0867n985G2215a70518f0192
$$ y = [-424080, 267831, 76140, -59740, 71368, -465442, -180101, -110866, -331067, -325266, -9530, -136028, -33696, -26250, 7608, -378588, -74812, 105965, 225409, -423608, -191386, -265883, -103385, -2963, -112477, -241647, 116646, -58338, 168432, -16250, 94991, -193515, -113633, -337770, -22022, -83120, -34445, 97287, 48064, -128801, -168824, 235123, -219335, 153865, -294653, -80727, -49558, 40310, -62152, 25966, -407307, 65452, 1573, -316391, -130591, -58937, 69360, -80439, 92238, -43980, -11745, 332775, -143441, -44635, -161640, 175211, -438867, 128781, -26757, -269472, 145155, -298342, 129798, -78037, 38348, 237740, 171517, -87893, -146728, 144539, -8223, -60973, -30423, 78128, 217059, 58188, -228593, -167726, -173711, 72215, -170518, -60192]
19445A68146E6246b83849c1627j71183D2694b32431Q130N0615C61199A74220p7967
19434I6253c46167m8317H0763a3444p9208j75015e0830q0376I3259b01053R977
19423a91076Q9566l4864A73618a01929K7642O503a6540k1111B0418l505n548a8452
19410b51364L8068N3414E7574f3795k02112J22582B10732a64226N2582E1837a22550
19398B75777A3562i2648j90584N3956L6419J4029c3704A19605b6272A14467J08797
19387B23264b34659J07411r730c2149j8666j51773H6996c48041A40706b86571
19376i6332B66866g7512I5320c15640e095B50493i7630D3734L3535b25753B25794
19364b30362a14429B56971c63484a33889e6594a1180j03671D0930J61039a75304
$$ y = [168146, 56246, -283849, -31627, -202810, 42694, -232431, -224301, -173686, 361199, 174220, 96253, -346167, -394484, 80763, -13444, -92652, -267667, -50830, -131206, 93259, -201053, -191076, -101510, -136374, 173618, -101929, -74287, -67784, -16540, -37651, 20418, 16913, 11365, -18452, -251364, -213296, -159882, 57574, -63795, -265907, -143325, 210732, -164226, -111644, 51837, -122550, 275777, 13562, -92648, -283232, -229276, -192857, -178828, -33704, 119605, -26272, 114467, 223264, -234659, -127248, -136978, -32149, -50815, -202588, 86996, -348041, 140706, -286571, -96332, 266866, -77512, 95320, -315640, -5095, 250493, -97630, 43734, 77269, -225753, 225794, -230362, -114429, 256971, -363484, -133889, -56594, -11180, -114851, 40930, 201969, -175304]
19353g8927A01911a11829G3144a14094m4988C8523K07119d8961I3323a18720e0710
19341b44068B9944L19810a2621k35684H4839J65849a43763O6053A15965k6252
19331H9713K88810b45261i668o8922B13628e2722B09352b36977N9421m5268h253
19319A06539c5633j77402k9240i0925C221f5560I8446C3769O3021J19224G8852
19307b82820A18610g2632B56813Q3285D6441c22725B21199e0162q389k8115H0299
19295i38j36257p2905B3444c7036I4320b45991n8613B0096b04050A35085a82973
19283a97235j8999c5700K220l5745k6361H0938a47575g0113C63174c7101A15288
19271g8760A00366q43m0298e4305j31328R1206C1138d64821j75923b77360a09885
$$ y = [-78927, 101911, -111829, 73144, -114094, -159082, 38523, 245642, -48961, 93323, -118720, -50710, -244068, 29944, 349754, -12621, -248305, 84839, 250688, -143763, -77710, 115965, 89713, 378523, -245261, -9668, -78590, 213628, -52722, 209352, -236977, -177556, -222824, -8253, 106539, -35633, -213035, -242275, -90925, 3221, -65560, 98446, 33769, 96790, 216014, 78852, -282820, 118610, -72632, 256813, 340098, 46441, -322725, 221199, -50162, -58551, -86666, 80299, -938, -137195, -210100, 23444, -37036, 94320, -245991, -304604, 20096, -204050, 135085, -182973, -197235, -216234, -35700, -33480, -69225, -95586, 80938, -147575, -70113, 363174, -37101, 115288, -78760, 100366, 99523, 59225, -54305, -185633, -94427, 31138, -464821, -640744, -277360, -109885]
19259b94265f2410A9902J97973j02996a57179e7377k64855Q466n8242D8654g7896
19247a49801j82088F4709a13656A15603a21659M2284j97611r429k57379K28371
19237c15423J47360P5223G3274J3170a51601g5571H989f6581j27013A09008a41403
19225a61057D3402c00365J44588p3589a03233A50358c17998c6498q5992k3787
19215a46277J085r9777A08617g302l42471H544a17710d9562R918A5960a86420
19203b92526L1540a09219k47276B39175Q3488j38891b79639c5343k23408a12552
19192A98811G3619M7261e2288a5209A04871b10493b4079l6396j26071j04828P4575
19181b16799K3463A33076c85921G1287c36927a0527l29129j07732l8655a87534
$$ y = [-294265, -62410, 19902, 217875, 114879, -157179, -57377, -322232, -313766, -372008, 48654, -77896, -149801, -331889, 64709, -113656, 115603, -121659, -79375, -276986, -286415, -543794, -315423, -168063, -92840, 73274, 86444, -151601, -75571, 8989, -66581, -193594, 109008, -141403, -161057, 43402, -300365, -155777, -229366, -103233, 150358, -317998, -36498, -122490, -146277, -145192, -244969, 108617, -7302, -349773, 8544, -117710, -49562, -39644, 15960, -186420, -292526, -260986, -109219, -356495, 239175, 322663, 183772, -279639, -35343, -258751, -112552, 198811, 73619, 120880, -52288, -15209, 104871, -210493, -24079, -60475, -186546, -291374, -216799, -193336, 133076, -385921, 71287, -336927, -10527, -339656, -447388, -486043, -187534]
19170d13904C4303K49870b9058j86342O8405A38852D263b26613K0852F6504a83746
19158a20198a1103D3116J10259r255a53831q244k79964A6445P4978m0559M0453
19147I1317A5814c86537g1834k04334a7240F8203b13406e9014K3768p6500A72740
19135F3246c19782Q6544h2278j1218A76229b90634c3397J4354A16512d7415n1835
19124i9250I3286J86007a30727m4997b2406A3261e1618C20279M7911F8931f09782
19112a48528G284O2125a15843k85840a91334g5324A15845E5114Q514c27490B04382
19100a22715C14320A50288k853A766J28090d5337k75904G5135g3755a8645j94528
19089b13173M2368g5308B238f3188m1113j25818P5671K2303o9971M8166k53318
$$ y = [-413904, 34303, 284173, -29058, -215400, -146995, 138852, 4263, -226613, -205761, 66504, -183746, -120198, -11103, 43116, 153375, 144120, -153831, -162075, -442039, 16445, 91423, 50864, 91317, 15814, -386537, -71834, -276168, -17240, 68203, -213406, -59014, -35246, -111746, 172740, 63246, -319782, -233238, -82278, -93496, 176229, -290634, -33397, -19043, 116512, -47415, -99250, 93286, 279293, -130727, -175724, -22406, 13261, -51618, 320279, 368190, 68931, -609782, -148528, 7284, 69409, -115843, -401683, -191334, -75324, 115845, 55114, 63628, -327490, 204382, -122715, 314320, 150288, 147435, 1766, 129856, -45337, -321241, 75135, -73755, -18645, -213173, -170805, -75308, 2238, -63188, -104301, -230119, -154448, -132145, -202116, -153950, -407268]
19078d07268A49677a17841F8008a09886K257k00926B0840a20691K9282j28892
19068b20301B69363a11560K5008k5535B50858a02909L2154K5341j35556D8707
19057c41861a39541h508j01470d796k58249A26298g1458l14267h5539k18183A53163
19045a56833C9999J54273a8149q5757C78546c4176k8488L712D1827R9469a62426
19033B59678n5483J53054a01547j14523A71509j1630a65330B82093A33946J13261
19023B47207c0547C64639D3559c8140k47106G3483e1453j00684K3189C104c0105
19011a99655E0760a3323C01695K1997c70785L7997g1629A12979j6423J0013b41344
18999d95981b04930A84884K0816f5383j0615L148l8352M7394B4402L40507a71228
$$ y = [-407268, 149677, -117841, 68008, -109886, -107629, -308555, 20840, -120691, -91409, -220301, 269363, -111560, -86552, -112087, 250858, -102909, -70755, -45414, -180970, 48707, -341861, -139541, -8508, -109978, -4796, -263045, 126298, -71458, -385725, -85539, -303722, 153163, -156833, 39999, 194272, -18149, -103906, 378546, -34176, -62664, -58952, 41827, 141296, -162426, 259678, 204195, 357249, -101547, -216070, 171509, 159879, -165330, 282093, 133946, 247207, -30547, 364639, 43559, -38140, -285246, 73483, -51453, -152137, -128948, 3104, -30105, -199655, 50760, -13323, 301695, 323692, -370785, -332788, -71629, 112979, 96556, 106569, -241344, -495981, -204930, 184884, 205700, -65383, -75998, -72850, -111202, -63808, 24402, 364909, -171228]
18987b24398E0448d0107D4857a34974m3800B76755h2773j57419J7661B6122c7356
18975A99855a19396L0727B07012D4290K15300q8336m3288J6696a62563B6034b0945
18963a94437j48037m2699a55070g3609k34337J12872j68184d8004H8822l3938
18953E4884b24587C5984P1405K83323g2580J7565G1769a39786k37887a05789o790
18942a12579m2085J9140B16909a57559l0954A68978j5396a84136h3787L0028r8208
18931a51967A34750c55740H2538a0969E9891a47960l32388A1989a07694j37651
18921b45345J17087k33311A39295i5871K4253j79891g942k13645G3999a39543
18910g1590k79440i9909k9530o5550k83336e1106a4277q3604o7915e7786G9098
$$ y = [-224398, 50448, -40107, 44857, -134974, -178774, 276755, -82773, -240192, -222531, 26122, -37356, 199855, -119396, -88669, 207012, 44290, 259590, 171254, 127966, 144662, -162563, 26034, -20945, -194437, -342474, -385173, -155070, -73609, -307946, -195074, -363258, -48004, 88822, 54884, -224587, 35984, 107389, 390712, -72580, -55015, 71769, -139786, -377673, -105789, -112579, -154664, -135524, 216909, -157559, -188513, 168978, 153582, -184136, -83787, -53759, -151967, 134750, -355740, 82538, -10969, 59891, -147960, -480348, 11989, -107694, -245345, -128258, -361569, 139295, -95871, -71618, -251509, -7942, -221587, 73999, -139543, -71590, -351030, -99909, -129439, -194989, -478325, -51106, -14277, -97881, -165796, -57786, 79098]
18898h1816j8519A47273c00386A09022D3811d65606B36010a57372B10870a13195
18887A94639a36500j89516J51103A44700a32615A47315k446E5721b48849J11507
18877a37342n177o1452f7907k0248c0350k0514A47730l9784d1214B3820h2123
18865b6948E7145k1643a95695c168B27378d6250A59618e3052B9498g3679r0139
18854a63818j07296a4166H022b81497J36472C75288c59492B10945g5744j00162
18844a75906A00434D4164a12666I432L87685d3769D6721a1075A54978d3593F4923
18832a27277g539D0552J01089F8702a14720j80251C0822O8510g2128q6201E9571
18820B92226b22793c6531j76852a05501M666k36218D5955M2948a55843F4594M2825
$$ y = [-81816, -100335, 147273, -300386, 109022, 43811, -465606, 236010, -157372, 210870, -113195, 194639, -136500, -326016, -174913, 144700, -132615, 147315, 144869, 55721, -248849, -137342, -142519, -203971, -67907, -88155, -30350, -50864, 147730, 107946, -41214, 23820, -82123, -26948, 57145, 35502, -195695, -3168, 227378, -46250, 159618, -53052, 29498, -73679, -163818, -271114, -14166, 8022, -281497, -145025, 375288, -359492, 210945, -75744, -175906, 100434, 44164, -112666, 9432, 397117, -43769, 46721, -11075, 154978, -43593, 64923, -127277, -7539, 40552, 141641, 68702, -114720, -294971, 30822, 99332, -72128, -158329, 59571, 292226, -222793, -36531, -213383, -105501, -100835, -337053, 45955, 88903, -155843, 64594, 107419]
18809A07419o447p901b53407A9453d2868D83584a03341D9623p290b54815M7183
18798b07632B6941b17644K8822n737n0457H9744J60149c33067a31902Q838a196
18786C57082a48627n335j30233l87a26745I105N9643b14522j40776B1487J02969
18775A24456c80910A70900i8161A1675c4250r3635j57345P3141c6630o8452A69016
18763b28037E3026b77312h9236m142C7268e8662A54332d70804i2960m38895A91337
18751B3629a12623c3874A55723b82592O7036n9945B43339a17771l1990H8121e1745
18739a82081B16417b7252E8403b68380d9035J5615A31515l9967M8272n2656b01011
18727A1609g031l19486E2916a82975B04946b1518j47079A49573b15047B11945
$$ y = [107419, 100972, 93071, -253407, 19453, -42868, 483584, -103341, 49623, 42333, -254815, -207632, 26941, -217644, -188822, -194559, -245016, 89744, 249893, -333067, -131902, -123064, -1196, 357082, -148627, -153962, -284195, -284582, -126745, 9105, 68748, -214522, -355298, 21487, 124456, -380910, 170900, -98161, 11675, -34250, -127885, -285230, -212089, -36630, -105082, 169016, -228037, 53026, -277312, -89236, -93378, 37268, -58662, 154332, -470804, -92960, -531855, 191337, 23629, -112623, -33874, 155723, -282592, -215556, -275501, 243339, -117771, -149761, 88121, -51745, -182081, 216417, -27252, 58403, -268380, -49035, -33420, 131515, 91548, 139820, 87164, -201011, 11609, -7031, -326517, 52916, -182975, 204946, -21518, -168597, 149573, -215047, 211945]
18716a39290o2884J3721P8125g733j30335A32667a18456C1042A2157L1544j5554
18705B8147a75937A22420b83062A39153e3974r8301r1611A45598m2037a02733
18694b12802C20289f4674j56223c7184l27075e9098B6927b01678i6871j07409
18684b04280H1194a37811e7390k03153C5818M8908g9051D5887b9025A21210b28036
18672a11389B0558c01734a02524A54376m1207e0937C64012G0856A5281O645a40083
18660a06002B9021J38314i3472j40195A04248L4405F4813b6741B48904b63758
18649a50635r1296G4941i1089G9767J15394e3753j61001A67221a36743k74832
18639d11575J89073I6502C1710J24203P7226H9613b21423A2808c09617a22738
$$ y = [-139290, -202174, -188453, -110328, -7733, -138068, 132667, -118456, 31042, 12157, 43701, 28147, -175937, 122420, -283062, 139153, -53974, -152275, -243886, 145598, 103561, -102733, -212802, 320289, -64674, -220897, -37184, -364259, -59098, 26927, -201678, -96871, -204280, 81194, -137811, -57390, -260543, 35818, 84726, -79051, 45887, -29025, 121210, -228036, -111389, 20558, -301734, -102524, 154376, 113169, -50937, 364012, 70856, 15281, 21926, -140083, -106002, 29021, 167335, -93472, -233667, 104248, 138653, 64813, -26741, 248904, -263758, -150635, -241931, 74941, -91089, 79767, 195161, -53753, -214754, 167221, -136743, -411575, -222502, 96502, 31710, 155913, 233139, 89613, -221423, 12808, -309617, -122738]
18628b01281A34815l2026J17390d06001C6057i5560o0632g1741B6384a41012G4587
18616d09814a46402L5612H4671J41066c334r6747A92547o8241K80817E8829J55221
18605B14050d7430j4647b8693j44237j15557O2279Q7636f7338B70548b61821a15982
18593b54599J00178A35580K59309A59701a0507j10203k19588F7984M5243n4877
18583E8350R924J48929b71022J25399P0890j64164A16486f2949A38958J8816a82593
18571C48546b2846j78810B81600b30798Q4882A16973A201f5455p5120J8609K6901
18560i5065B2774a77610I0893f2594j84110B4063J07988b49095e6665B0150a11955
18548d8747B03082d88882a07415B72812h512m01417B72729H9998a19871E6392
$$ y = [-201281, 134815, 102789, 220179, -406001, 36057, -95560, -156192, -71741, 26384, -141012, 74587, -409814, -146402, -110790, 84671, 225737, -3334, -100081, 192547, 124306, 405123, 58829, 214050, -47430, -62077, -28693, -172930, -288487, -226208, -138572, -67338, 270548, -261821, -115982, -254599, -154421, 135580, 394889, 159701, -10507, -120710, -340298, 67984, 113227, 58350, 68274, 217203, -271022, -145623, -74733, -238897, 116486, -62949, 138958, 157774, -182593, 348546, -22846, -201656, 281600, -230798, -145916, 116973, 1201, -65455, -140575, -121966, -95065, 22774, -177610, 90893, -62594, -246704, 24063, 132051, -249095, -56665, 20150, -111955, -48747, 203082, -488882, -107415, 272812, -8512, -409929, 272729, 89998, -119871, 56392]
18537c63386h2550N555A23590E9149Q4105a03177q7017k14567J22888b4960a933
18525H511M6214g6946l33047a88222b8083n6365j80346J28563K9014j00268M9622
18514a57863i2H5737D584c4385j1792j76666A60905a48697p1218a3789j36329
18503a50118E090M6392j0115p155J2580q126b3353q027j68944C678b83589a03924
18490A95931b79237F0869K17943d1125A1739i5146A15144a44278e1541K1681r0933
18479a20793A09638O4624a29640b0107j95154C6567a87138C6914K75481c20372
18468B27357f5751I0912d71870i5506j306F098a95850E454c42408O1328f5152
18456b14484B2359c60090i5981D9331d8619p2330L3260c4768j90935L0692h1802
$$ y = [-363386, -82550, -76995, 123590, 59149, 143254, -103177, -190194, -404761, -281873, -24960, -1933, 8511, 54725, -76946, -409993, -188222, -28083, -84448, -264794, -136231, -107217, -207485, -157863, -92, 85737, 4584, -34385, -46177, -222843, 160905, -148697, -219915, -13789, -150118, 5090, 51482, 41367, 34212, 46792, 38666, -23353, -31380, -200324, 3678, -283589, -103924, 195931, -279237, 60869, 278812, -41125, 11739, -95146, 115144, -144278, -51541, -29860, -120793, 109638, 174262, -129640, -20107, -215261, 36567, -187138, 36914, 312395, -320372, 227357, -65751, 90912, -471870, -95506, -96812, 6098, -195850, 5454, -342408, -281080, -65152, -214484, 22359, -360090, -95981, 49331, -48619, -120949, -87689, -34768, -225703, -195011, -81802]
18444a88071k23630J44583J08118L0104E0324i2227k10857A23414b09429L4633
18434a74796L9995C9531K33930D4958e765j8037B0649c4558k29309i9893A47709
18422b49212h6882G1149a90909O9927n3671C57869A672K05484b97682a33624E6706
18410F4515P2572F4785a7414B52702C9506M3903J84006m4111a47078A74357a68708
18398B77866f0581j5811q6747E5623K68708j17379o4561J03947J36251c5556A32962
18386d34585A42044c2922J4969A36228c25365i9951c2351j27438G1613c7903B67427
18374b16858H5519J42782a56563r0301O072J9177B30204C3962O7754B5569J07204
18363A32773E8048j3584g9091F690b33657a08941a074D8484a0171p8609C9076
$$ y = [-188071, -411701, -267118, -159000, -128896, 50324, -92227, -303084, 123414, -209429, -174796, -134801, 39531, 273461, 44958, -5765, -23802, 20649, -34558, -263867, -99893, 147709, -249212, -86882, 71149, -190909, -120982, -174653, 357869, 1672, 207156, -297682, -133624, 56706, 64515, 137087, 64785, -17414, 252702, 39506, 83409, 267415, 223304, -147078, 174357, -168708, 277866, -60581, -76392, -163139, 55623, 324331, 206952, 142391, 246338, 382589, -35556, 132962, -434585, 142044, -32922, -17953, 136228, -325365, -99951, -32351, -159789, 71613, -37903, 267427, -216858, 85519, 228301, -156563, -246864, -240792, -221615, 230204, 33962, 101716, 25569, 132773, 58048, 44464, -79091, 6690, -233657, -108941, -1074, 48484, -10171, -88780, 39076]
18351e3867A89333C3764K01054a76143B8443J60445a0779D43085b23084O9991
18341a53093j44417a01687A56125a64596f3883A84428F2151b91452f097q7042
18331i3139p8052d5943A8442J45158a97098f1496j64605J12354A20904a71027
18320c31428G2241K0882B2998Q6838c26533D6986N0626d1224p9853r371G9586
18308c7641J3605C73412a8871B8794J049a37550A24115f2634B65972b29128j19284
18297c48412B83708f3702j48371M8317B00828e2102B71582C2603N1135a82242
18286B1166b38043A47042j3202k5617j193k2494L6965a4173B44553E6766J50842
18275B07608F0437k3671a70292k9756d72B23949A4609d2608o9293d981j31132
$$ y = [-53867, 189333, 33764, 234818, -176143, 28443, 188888, -10779, 443085, -223084, -153093, -297510, -101687, 156125, -164596, -63883, 184428, 62151, -291452, -6097, -93139, -171191, -45943, 18442, 163600, -197098, -61496, -226101, -113747, 120904, -171027, -331428, 72241, 93123, 22998, 109836, -326533, 46986, 97612, -41224, -121077, -130448, 79586, -37641, -24036, 373412, -18871, 28794, 29843, -137550, 124115, -62634, 265972, -229128, -348412, 283708, -63702, -212073, -163756, 200828, -52102, 271582, 32603, 83738, -182242, 21166, -238043, 147042, 133840, 108223, 107030, 84536, 121501, -14173, 244553, 56766, 207608, 60437, 36766, -170292, -200048, -472, 223949, 14609, -42608, -111901, -4981, -136113]
18264a36113k4417L70P8587j07104P5604J2370G2085f5478f83j12041p5692k21981
18252d10397f8744b7082A16391b60463E2757D118d7122r7546A99484e0904F8087
18240c8921j93933m4854b5539o7009C12214a80654d2247j45725A2831e80A0805
18228A7456f3642M269A75599C125N6210R9924a45228A69425L349f4529B69136
18216A81824a69175O6449B7534b87852A19868c43996a23916j49472f9673j4721
18206h4394j07115B3050Q8862g2567C31827b57492h762A56048E7441c06561a24444
18194A86267b28777A94770h1004K1066j2737k80394A50047a29996a1412j82785
18184a94197e0313j16853J9736j31260a3634j34870b4356l8802A69631l1826a39982
$$ y = [-136113, -160530, -160160, -81573, -188677, -113073, -100703, 72085, -65478, -683, -112724, -188416, -410397, -68744, -27082, 116391, -260463, 52757, 4118, -47122, -144668, 199484, -50904, 68087, -38921, -232854, -277708, -25539, -92548, 312214, -180654, -42247, -187972, 12831, -580, 10805, 17456, -63642, -59373, 175599, 3125, 59335, 159259, -145228, 169425, 172774, -64529, 269136, 181824, -169175, -102726, 27534, -287852, 119868, -343996, -123916, -273388, -69673, -84394, -191509, 23050, 111912, -72567, 331827, -257492, -8762, 156048, 57441, -306561, -124444, 186267, -228777, 194770, -81004, -59938, -72675, -353069, 150047, -129996, -11412, -194197, -50313, -167166, -147430, -278690, -13634, -148504, -24356, -63158, 169631, 137805, -139982]
18172H5452h9745M304A54422e8200k36090D6965a34474A64704a26915J8345B05406
18160a36710l35882g4518H5897a23296j11517C07910A07991B0842Q5628O399f7604
18148A9607b33473A75930a32218C4096a81700p298A78706c28720A11031a17007
18137c73430f6379j24942B22433F5050c02781b2931B63563a24514A44662g1883
18126g9867j77162A30769b82412K1434B69279b18277A58752o746i7094j33936
18116b31030H1007B5697a14805j40272D3359g0888l6033q0630j61484a65191L9063
18105a26128G326P0128J54450d1161C2037p483a13857a0953l95493F1245L5154
18094I6399a78824h100A73319p2897D5514a2301A60447D2176b37603b6154k01677
$$ y = [85452, -89745, -85441, 154422, -58200, -294290, 46965, -134474, 164704, -126915, -108570, 205406, -136710, -472592, -74518, 85897, -123296, -234813, 307910, 107991, 20842, 106470, 112869, -67604, 19607, -233473, 175930, -132218, 34096, -181700, -188998, 178706, -328720, 111031, -117007, -373430, -66379, -191321, 222433, 65050, -302781, -22931, 263563, -124514, 144662, -71883, -79867, -257029, 130769, -282412, -260978, 269279, -218277, 158752, 152006, -97094, -231030, 81007, 25697, -114805, -255077, 43359, -70888, -106921, -187551, -349035, -165191, -126128, 7326, 77454, 231904, -41161, 32037, 24554, -113857, -10953, -406446, 61245, 96399, -178824, -8100, 173319, 100422, 45514, -12301, 160447, 42176, -237603, -26154, -227831]
18083b27831A05460D7874J8170L0316m2131N803a77113f5915A54299a38579O7702
18072g0877b0863q4643D0543J37275E3451Q6705E3608i027A56192b95299C13933
18060a70216e1031n2131B72664a76306k25050e1605H684a5938l61341n468a1506
18048c77226A39958a74300B01912r5093i6155k78624a20232B48860C9936b01926
18037b07883g1487B51953d77867i7408H172N4289J7004r902a76747B60718q7164
18026A73554b01051A36742n3104M02050a19565j40652h9527L9460C5420b7650
18015b99548B8770a66998Q749j38506F7522d1270J601i73l7187I225c87648A64693
18002f6051j70665B85729b78749J33441O0459c2042C8520R9661a62119j7382D308
$$ y = [-227831, 105460, 47874, 66044, 96360, 54229, 60032, -177113, -65915, 154299, -138579, -70877, -20863, -105506, 40543, 177818, 53451, 140156, 53608, -9027, 156192, -295299, 313933, -170216, -51031, -103162, 272664, -176306, -401356, -51605, 8684, -15938, -377279, -382747, -11506, -377226, 139958, -174300, 201912, 106819, -96155, -374779, -120232, 248860, 39936, -201926, -207883, -71487, 251953, -477867, -97408, 8172, 62461, 79465, 69563, -176747, 260718, 173554, -201051, 136742, 83638, 485688, -119565, -260217, -89527, -50067, 35420, -27650, -299548, 28770, -166998, -158249, -296755, 67522, -41270, -39669, -973, -38160, 9225, -387648, 164693, -66051, -236716, 285729, -278749, -145308, -84849, -32042, 38520, 138181, -162119, -179501, 4308]
17990B64834a06248j03439m5740C5045Q2716a31204A39977o9237L501b24680d0429
17978G7206b35102a5905G6213b79598J12571F0919K1410B1618e2832j6700I0396
17966b6876n4452k88828i6369B01782E5265K07924D5909b8806J553A1966M5531
17955E7497b32008B72213d533o345F8602N2471b15119a2998l346A60390K24197
17944C84587G0155a65038j96150A9061J09523g1646B45829A03751M9894a04398
17933b83113B8977a09166E6615b45070R4870A66424b31709B6245J27570c13471
17922h905B0347J74514N422B9296L9374d7312A12606b0166H1715a20835C5963
17910b21616f7270F3474a87627L5351l770C8965J44112a76315f6693A23656l4149
$$ y = [264834, -106248, -209687, -255427, 35045, 117761, -131204, 139977, 70740, 74241, -224680, -40429, 77206, -235102, -15905, 76213, -279598, -167027, 60919, 82329, 21618, -52832, -69532, 90396, -26876, -81328, -370156, -96369, 201782, 55265, 263189, 45909, -28806, -27253, 11966, 57497, -232008, 272213, -4533, -10878, 68602, 121073, -215119, -12998, -16344, 160390, 384587, 70155, -165038, -361188, 19061, 128584, -71646, 245829, 103751, 153645, -104398, -283113, 28977, -109166, 56615, -245070, -150200, 166424, -231709, 26245, 153815, -313471, -8905, 20347, 194861, 200283, 29296, 68670, -47312, 112606, -20166, 81715, -120835, 35963, -221616, -67270, 63474, -187627, -152276, -156046, 38965, 183077, -176315, -66693, 123656, 89507]
17899H9507J09856a78007C73040f2505A48588K01995A02615J48307b6880I4886
17888A13072B9910c56289J18997Q6181k659j04214C77353j28883A7350b10214
17877b47239A30213a73818e5834A34306k3599a25705b5843B19691b02298e8019
17866a21314E3077g9738A7112J29577J15858a9017B8296b53279J22569L8289a8635
17854I597J24716C1088a35573B91462c10104a06835d8479K1846j81239L2016C1590
17842I8466L8277a957B09844H5593a1711k84492a44489M2989e604m234k35835
17831b45673A61272Q0388a70111b9813G6093A6570J41105j9599a04582A09604
17820a53829d8758E8798a32159A33261j3346b44685C12759i2123A97745M4777
$$ y = [89507, 199363, -178007, 373040, -62505, 148588, 350583, 102615, 250922, -26880, 94886, 113072, 29910, -356289, -237292, -151111, -153770, -257984, 377353, 248470, 17350, -210214, -247239, 130213, -173818, -55834, 134306, 110707, -125705, -25843, 219691, -202298, -58019, -121314, 53077, -79738, 17112, 146689, 262547, -19017, 28296, -253279, -130710, -92421, -18635, 9597, 134313, 31088, -135573, 291462, -310104, -106835, -48479, -26633, -207872, -175856, 31590, 98466, 136743, -1957, 209844, 85593, -11711, -296203, -144489, -101500, -5604, -9838, -245673, 161272, 241660, -170111, -29813, 76093, 16570, 157675, 138076, -104582, 109604, -153829, -48758, 58798, -132159, 133261, 119915, -244685, 312759, -92123, 197745, 242522]
17810B42522f8081B42445j6058K26341d3317l6491K5053j86116I9875g8563j49400
17799b27963p7619g4354n6129m0925C22701c29097a03823D57657A44970Q3922
17789B28892G1066M48860j76446a60177A12181b21399Q3840N8168C8102P4684
17779A12786a63388k23747a57132O4129K6624C15714c45121A65841n7117C3278
17768A99547K988R5604g3434a374B4970b419D3497b37537A95927B9034a17230
17756A01138a67085B50933A05907N4100l2291g0603B32715a67636A07939b49863
17745F7029e6234l49119D9074a93427A41341e1070A04291K0928b3356A04177L5894
17734A40071a6362k01457O0639n5474A6423R746b6411A18766I625Q7410M909J54694
$$ y = [242522, -68081, 242445, 226387, 452728, -43317, -79808, -54755, -240871, 99875, -78563, -227963, -305582, -74354, -130483, -171408, 322701, -329097, -103823, 457657, 144970, 228892, 71066, 519926, 343480, -160177, 112181, -221399, -137559, -79391, 38102, 112786, -163388, -387135, -157132, -93003, -66379, 315714, -345121, 165841, 108724, 33278, 199547, 202535, 298139, -73434, -1374, 24970, -2419, 43497, -237537, 195927, 29034, -117230, 101138, -167085, 250933, 105907, 160007, 127716, -70603, 232715, -167636, 107939, -249863, 67029, -56234, -405353, 49074, -193427, 141341, -51070, 104291, 125219, -23356, 104177, 140071, -16362, -217819, -157180, -212654, 16423, 26169, -26411, 118766, 9625, 97035, 101944, 256638]
17722B56638F9463d37A31436a4319k25007A13108b2007C0967a9510o1603B13420
17710A69711a69183j35118Q3029b439C384a93567B55K73919H1605L35219d5415
17698a02815A47786b0308D2777L21358b26244A61861g0164m3114B01995g5937
17687d28114A28528f2894n3657F5411a37763C9088g2897F9234b96666D8620g3831
17675C0503d08A59022F0263b08715P6833j3917F075f4137B84338b15577G7266
17663a53802B6668O8468J61904e8904l0056D9588J68373p9139l3363O8609J34163
17652C08231e9848A81752b40315G1633J26476c79795B25111f9888B54792q8906
17642A65886R0254P8975d7638B6730J53054B770f6857A87460c1356e405G7043
$$ y = [256638, 69463, -437, 131436, -14319, -239326, 113108, -22007, 30967, -19510, -81113, 213420, 169711, -169183, -304301, -221272, -2439, 3384, -193567, 255, 274174, 81605, 416824, -45415, -102815, 147786, -20308, 42777, 364135, -226244, 161861, -70164, -113278, 201995, -75937, -428114, 128528, -62894, -116551, 65411, -137763, 39088, -72897, 69234, -296666, 48620, -73831, 30503, -408, 159022, 60263, -208715, -131882, -145799, 6075, -64137, 284338, -215577, 77266, -153802, 26668, 95136, 257040, -58904, -88960, 49588, 217961, 138822, 105459, 174068, 308231, -59848, 181752, -240315, 71633, 198109, -379795, 225111, -69888, 254792, 165886, 256140, 335115, -47638, 26730, 179784, 2770, -66857, 187460, -31356, -5405, 77043]
17630A59884E1066i6824A03120m6011J34804h7129H9101K88236a21180b3430A20724
17618c52774C67136j18886I5123J04310h1590b8377p1540G918d2248C27806A40156
17606A01194d0222A63145a60659B05121F0464L40550H4499h0834B42434i7989
17595B14894k2433J15030C6665J10717k1184d6407k97994b0148k26955l9565e4280
17583a02525B14005e4449C1155R4549g4231A56412a45887N5597B70536D8196d3972
17571a74786q4269E09506C8191J11294a4214r1780B33588c024D21475A35616J28620
17560B64236L9691D7329d9928B8330J33035d94367a66379C19607j36777a54361
17549C05786A04283f184B19690F4234e7625E8350a90118G0236J1752B7953a05466
$$ y = [159884, 51066, -96824, 103120, 57109, 191913, -87129, 89101, 377337, -121180, -23430, 120724, -352774, 367136, 248250, 95123, 199433, -81590, -28377, -99917, 7918, -42248, 327806, 140156, 101194, -40222, 163145, -160659, 205121, 60464, 401014, 84499, -80834, 242434, -97989, 214894, 192461, 307491, 36665, 147382, 126198, -46407, -344401, -20148, -247103, -286668, -54280, -102525, 214005, -54449, 31155, 125704, -74231, 156412, -145887, -90290, 270536, 48196, -43972, -174786, -259055, 509506, 38191, 149485, -14214, -105994, 233588, -3024, 421475, 135616, 264236, 303927, 47329, -49928, 28330, 161365, -494367, -166379, 319607, 182830, -154361, 305786, 104283, -6184, 219690, 64234, -57625, 58350, -190118, 70236, 81988, 27953, -105466]
17537E3556R2038h144B41701I2668b3671A1322K50068E4638K31918f0430A46015
17525a85278B0639e4591B47978j17470o1553Q5991a66191C15508j51035j2934
17515A51539R7448d28919A09689K36935i6713E3761a01328A48090K88304I4987
17504B72584O2992A28498K85563a08892j25925P6365H8536a356j07700A84620
17493B21291b15131P4618K6931F5424A3295P1319J84065b63465B41185d5384D934
17481D00792b43010A18355Q6793J28497l6469c385A75240J01396A14052R6480
17471B10532j3111a82058B43064D6567M6372J94450I7016J33658I2446a15278
17460A65023E1374R505a1468D82382A36734J27843H8148J18573i3072C05539j14390
$$ y = [53556, 145594, -8144, 241701, 92668, -23671, 11322, 261390, 54638, 286556, -60430, 146015, -185278, 20639, -54591, 247978, 130508, 68955, 154946, -166191, 315508, 164473, 151539, 248987, -428919, 109689, 346624, -96713, 53761, -101328, 148090, 436394, 94987, 272584, 335576, 128498, 414061, -108892, -234817, -158452, 88536, -1356, -109056, 184620, 221291, -215131, -140513, -113582, 65424, 13295, 84614, 268679, -263465, 241185, -45384, 4934, 400792, -243010, 118355, 205148, 333645, 297176, -3385, 175240, 276636, 114052, 210532, 197421, -182058, 243064, 46567, 92939, 287389, 97016, 230674, 92446, -115278, 165023, 51374, 60879, -11468, 482382, 136734, 264577, 88148, 206721, -93072, 305539, 191149]
17449A91149J89619j54241J03645N1742j53122o431j08772l9801M52849B1617
17438A22535J39628j21433J38122K15588A66853M9083P2806m7313b757A5633Q5732
17427A01365J86612K4272j8474A38122J34945j35293C2385M69916A74359J37173
17417C11532n1951N1744J14831j44193J57935a35265A39239n5799J66053J58878
17407D08371A7423J69008J44486g2450a3624I0088J3222C9552Q3175k2118B9849
17395h6746D4433N7011K7384J48588e073A97993Q3571j09603J67077k4505d9678
17383b7838B43248A6371N02729d253F5557i8674I3818J98653C9167K05781j06252
17372A38696h0685E86604H7041M336A1270J3460M6995m443o894Q7740J2438a98857
$$ y = [191149, 380768, 226527, 330172, 381914, 228792, 222361, 113589, 73788, 526637, 21617, 122535, 262163, 140730, 278852, 494440, 166853, 215936, 288742, 241429, -2757, 15633, 101365, 287977, 312249, 293775, 138122, 273067, 137774, 32385, 502301, 174359, 311532, 259581, 311325, 426156, 281963, 439898, -135265, 139239, 83440, 249493, 408371, 17423, 186431, 330917, -72450, -13624, 90088, 103310, 39552, 122727, 100609, 29849, -86746, 44433, 101444, 128828, 277416, -5073, 197993, 281564, 171961, 339038, 314533, -49678, -27838, 243248, 16371, 519100, -4253, 65557, -98674, 93818, 292471, 39167, 244948, 138696, -80685, 586604, 87041, 91377, 11270, 24730, 71725, 67282, 60388, 148128, 160566, -198857]
17359b5645C33737Q4349P18j21295a36959M1851C69635a32849B01186N8650I3401
17347f5610c1384H2026J50955M8131j37777B7591O2724a11404C64437A02848a27201
17335B77483j33358J83514a04991A76147G9566J63458g705A64964n8332a1038
17324A72631d8851l8604B96299K2868b69318B81053k2896j8796K99472a23132
17313A70281B2268K93550j26699r932K7466o7140i226C8447K51586A04459A6404
17301C82580j62909B0173P8707K35252B7852R3186J23601G6230K65087b1310A9849
17289B50683a85677B56737L1466O1422A40342K02711H787J71563J9656j2093J08792
17278B96705j1711I8419M511j1076a08596D386M21549c3368D67669A09447L12177
$$ y = [-25645, 333737, 418086, 418804, 297509, -136959, -95108, 369635, -132849, 201186, 259836, 93401, -65610, -31384, 82026, 232981, 281112, 143335, 27591, 90315, -111404, 364437, 102848, -127201, 277483, 144125, 327639, -104991, 176147, 79566, 243024, -7705, 164964, 106632, -11038, 172631, -48851, -87455, 296299, 319167, -269318, 281053, 258157, 239361, 538833, -123132, 170281, 22268, 315818, 189119, 179187, 206653, 139513, -9226, 38447, 290033, 104459, 16404, 382580, 219671, 20173, 98880, 334132, 27852, 121038, 244639, 76230, 341317, -21310, 19849, 250683, -185677, 256737, 288203, 349625, 140342, 343053, 8787, 180350, 200006, 187913, 296705, 284994, 98419, 102930, 91854, -108596, 4386, 425935, -33368, 467669, 109447, 421624]
17267D21624j16546I0171N7792L18031A49086G0844O631K0143K95594h7325A11312
17255C66710L60142I9531J10870f3933k6861L394D90612i7526A25438a30574C1139
17243H6256J14477J91820D1017K38095l4780K82031K8011j31685j85662b23294
17232A89428a4478B52181B2077J24775o073J65155H3398K74161P243R7490F7934
17220h646A05207J58037p6998J42615j21474F8528A2067K13797J34904E6774b7143
17208C37482I710J40616a60911D41510j34888k7159O1889j35590q5838M0843a64376
17196H0443q497E286K81319K99098A86363K2195E6134L81712j88484M2480P8173
17185C70015P6539c7703A99993q6577J13473j03817J23191o5219q3731J65534
$$ y = [421624, 305078, 90171, 147963, 465994, 149086, 70844, 77475, 97618, 393212, -87325, 111312, 366710, 726852, 99531, 210401, -63933, -90794, -87400, 490612, -97526, 125438, -130574, 31139, 86256, 200733, 392553, 41017, 279112, 244332, 526363, 554374, 422689, 237027, -223294, 189428, -14478, 252181, 22077, 146852, 140779, 305934, 83398, 357559, 364802, 462292, 67934, -8646, 105207, 263244, 186246, 328861, 207387, 68528, 12067, 225864, 360768, 56774, -27143, 337482, 9710, 150326, -160911, 441510, 306622, 279463, 341352, 205762, 119924, 160767, -164376, 80443, 71946, 5286, 286605, 585703, 186363, 208558, 56134, 437846, 249362, 291842, 370015, 446554, -37703, 199993, 113416, 226889, 123072, 246263, 181044, 97313, 262847]
17175B62847J64080B1525J54728P1509M3701H5029K56492j69465L04081j70630
17165C05507j34857J71903A49029g8601E80910k1353k07698j41327L44495r9714
17155D55313b32640A62902J11923J43244j23716J09652A29973A5369K06080A01623
17144B6217O14739B02509B5721M99393j98340o0853L8513q6508F4815K54211O0451
17133C79477F1940Q1356J09615K56591B45098a07863B20037N4924M0819J00270
17123D16050j22343j06704O6855L3896l2902j03088M2641K38886o793Q6430j56965
17112C55963M3053J28358j66289L56779k93990m8452l1357P0304D8491L78658
17102D27149K04624n1904A61107K87058Q4247m7453G7478L50547m2429n3241i332
$$ y = [262847, 426927, 21525, 176253, 247762, 291463, 85029, 341521, 172056, 476137, 305507, 170650, 342553, 149029, -78601, 580910, 559557, 351859, 210532, 555027, 455313, -232640, 162902, 274825, 418069, 294353, 404005, 129973, 15369, 221449, 101623, 26217, 640956, 202509, 25721, 525114, 326774, 265921, 304434, 217926, 64815, 319026, 379477, 61940, 143296, 252911, 509502, 245098, -107863, 220037, 274961, 315780, 416050, 293707, 187003, 253858, 287754, 254852, 151764, 194405, 433291, 426498, 512928, 355963, 399016, 527374, 361085, 717864, 423874, 375422, 344065, 414369, 48491, 427149, 631773, 579869, 161107, 448165, 532412, 484959, 77478, 428025, 385596, 332355, -9332]
17090A76381K82768j23546Q7896O7357j85555p7645M88679B42524J23202J7377
17080C83103J65651j15850o388J51663k81144J19477n0084j25000K88268k41195
17070B88501A37303N21382j13227K5467K75604I9299N01580m16k05359r5773K62165
17059E61496Q0406l09545J88452L17594k84176L67666D37131M8226j4561K97025
17049G67821l71661J59563B60946K04899Q6436j24441R127J77054p2695L79910
17039I21236m8804l38845q9671J55819J60904r9954J11660q2580j30153J82152
17029G41764k07968o9333j1794N22726B29389M25367A69008N79162C32216L51974
17019F84190j97329N68156l80353O4214l56432L70921l04633L51100B85113L81722
$$ y = [176381, 459149, 335603, 423499, 490856, 305301, 227656, 716335, 242524, 365726, 383103, 548754, 432904, 426516, 578179, 297035, 416512, 366428, 241428, 529696, 288501, 137303, 658685, 545458, 570925, 846529, 99299, 600879, 600463, 395104, 299331, 561496, 641902, 332357, 520809, 838403, 554227, 921893, 437131, 485357, 470796, 767821, 396160, 555723, 260946, 465845, 552281, 427840, 436967, 614021, 541326, 921236, 872432, 533587, 443916, 599735, 760639, 660685, 772345, 689765, 559612, 741764, 533796, 464463, 452669, 975395, 229389, 654756, 169008, 748170, 332216, 684190, 486861, 1055017, 674664, 738878, 382446, 753367, 448734, 799834, 285113, 666835]
17009F66835J23988k18621K63472q5880j74694J97232l9393L35742C90995L16660
16999G07655J90208m4104O3822J77067k18379L4440k161k19702K72409J28082
16989A089337J48355n01701l3625j07434N15929k60701R3389k45950L01352j94130
16979H04821J85658J7277l65190L01939l95492L34244n3828K61710k04002R0008
16969I77145r7823L01648m3569Q0279j39468j21480N8903L99376n81345L47995
16959A181661K34543j62768L1424E84228J52004K27956K27929K03593m25823m6859
16949I23028K4400R2108j62142L19832k8958k7577j1394n5992J79715j72352j54739
16938I25929L22584J29061l5896j75660M4626k28310J29465K72289j08432K02752
$$ y = [666835, 790823, 572202, 835674, 749794, 575100, 772332, 732939, 1068681, 390995, 707655, 897863, 853759, 917581, 1094648, 876269, 910709, 908548, 688846, 961255, 1089337, 1237692, 735991, 702366, 594932, 1110861, 850160, 943549, 697599, 998951, 804821, 990479, 1007756, 642566, 944505, 549013, 883257, 829429, 1091139, 887137, 977145, 879322, 1180970, 1137401, 1217680, 1078212, 956732, 1015635, 1415011, 833666, 1181661, 1416204, 1253436, 1284860, 584228, 736232, 964188, 1192117, 1395710, 969887, 923028, 947428, 1039536, 877394, 1197226, 1168268, 1140691, 1129297, 1073305, 1253020, 1080668, 925929, 1248513, 1377574, 1341678, 1166018, 1210644, 982334, 1111799, 1384088, 1275656, 1478408]
16928A478408L5492J20073m34799M02570P989l84380J48949j99677L32559J02743
16918A609927j89151K22806J2876J55366j40735p6217P9151k78390J26415K04291
16908A726339r9897O1464K17621o12254K58420M87754m72232n1524M502M25103
16898A945296k99520q1345J76765m6035J39883m31934N09062K89515j86136k1860
16888A993691r9709J88927m47880M92058j85430O6671R9665K20761j22555j13087
16878B093112N1652K4976L45169l7622k39334J65199j28182N7910m3733K73606
16868B562753j68381K09213P7842n85002O22555r3442j16862N28044j25711K9697
16858B940706l6560J57691O8657k50965L78627J3209J98480l02656K28997l8489
$$ y = [1478408, 1513900, 1633973, 1199174, 1601744, 1609733, 1225353, 1374302, 1174625, 1507184, 1609927, 1420776, 1643582, 1656458, 1811824, 1671089, 1594872, 1674023, 1395633, 1522048, 1726339, 1626442, 1687906, 1905527, 1293273, 1551693, 2039447, 1567215, 1515691, 1520193, 1945296, 1645776, 1564431, 1741196, 1695161, 1835044, 1403110, 1912172, 2201687, 2015551, 1993691, 1893982, 2082909, 1635029, 2127087, 1941657, 2008328, 2107993, 2328754, 2206199, 2093112, 2144764, 2169740, 2514909, 2477287, 2237953, 2403152, 2274970, 2332880, 2289147, 2562753, 2394372, 2603585, 2681427, 2096425, 2718980, 2625538, 2508676, 3036720, 2911009, 2940706, 2904146, 3061837, 3130494, 2879529, 3258156, 3271365, 3469845, 3167189, 3396186, 3357697]
16848C357697R719k43104L9552M62966n814Q7021J10415j16673J17782Q5048j14523
16837C790086L22624K12664K9807l55135K36216O4215J01155N1027J56350l06103
16827D302906P24552p4427J74509J4627J34849k41348L12179J22538q5339K49644
16817E634690L62828l45742M24089r3970K44756O0124K24411J50789J44999m3004
16807F763970K17889L21499J99046l28694O28383k01584M52437M63570j13779
16798H402737K35738j67041O42612O0475J06090L27861O23715J42126j72790O13268
16788A0814791J88027N11683K21033J17396M55548K64656K83574M73917L20027
16779A3650652O19413L51319N69677K94582P12537L29161M00555O49126P41815
$$ y = [3357697, 3367416, 3124312, 3163864, 3626830, 3621016, 3708037, 3818452, 3701779, 3819561, 3904609, 3790086, 4112710, 4325374, 4355181, 4000046, 4236262, 4300477, 4401632, 4452659, 4609009, 4302906, 5027458, 4953031, 5127540, 5142167, 5277016, 5035668, 5347847, 5470385, 5385046, 5634690, 5997518, 5651776, 6075865, 5981895, 6226651, 6286775, 6511186, 6661975, 6806974, 6763970, 6981859, 7303358, 7502404, 7173710, 7802093, 7600509, 8052946, 8516516, 8402737, 8638475, 8471434, 9114046, 9174521, 9280611, 9608472, 10232187, 10374313, 10201523, 10814791, 11002818, 11514501, 11735534, 11852930, 12308478, 12573134, 12856708, 13330625, 13650652, 14270065, 14621384, 15191061, 15485643, 16198180, 16527341, 16927896, 17577022, 18318837]
16770A8318837P5549J014296O30473P60749O29894J137399O12930J020514N99474
16761B4800115Q89800J215143J119301J254552P82294J385791J282420J409245
16753C4138661J505864J388770K035753J861491J136512K244335K369982K270609
16745D8951977K570490K565716K700484K820103K915859L516956L162040L882270
16737G3085895L548645M390760M493834M628627M537947N286814N502635N447832
16729A10922989N530283O327588N658842O118782O006690N519918O050379M471827
16721A56607298N202465L569586L691624K344586J335077N84139k93403j537850
16713A71503522k719533l296760m323945m810625n359746n744797o276519o095853
$$ y = [18318837, 18394386, 19408682, 20039155, 20799904, 21429798, 22567197, 23180127, 24200641, 24800115, 25689915, 26905058, 28024359, 29278911, 30061205, 31446996, 32729416, 34138661, 35644525, 37033295, 39069048, 40930539, 42067051, 44311386, 46681368, 48951977, 51522467, 54088183, 56788667, 59608770, 62524629, 66041585, 69203625, 73085895, 76634540, 81025300, 85519134, 90147761, 94685708, 99972522, 105475157, 110922989, 116453272, 122780860, 128439702, 134558484, 140565174, 146085092, 152135471, 156607298, 161809763, 165379349, 169070973, 171415559, 172750636, 173334775, 173041372, 171503522, 168783989, 165487229, 161163284, 156352659, 150992913, 145248116, 138971597, 132875744]
16705A32875744o309653o375801o433362n718643n924850n628001n120450n111705
16697H6253279m718239m724132l773569m022345l761621l140957l321743l293226
16689E5497447k701227k649717k738637k290221k189734k422958j673776k111223
16681C6719954j385335j618042j384243j482875j260058j402976q07636j188942
16673B6189847r64526j296318r39773j148348o02385p19301j55100j510007m04724
16664A8449365p42842m87537q60588l3521r28142n92693l98873l65111k86454
16655A3753604o42587l19735l35143k37490m16959m54525m39894J935m40571m96794
16645I971841j35123j75028k35681o8442n27860j15754m78438j97710j15315J45126
$$ y = [132875744, 126566091, 120190290, 113756928, 108038285, 102113435, 96485434, 91364984, 86253279, 81535040, 76810908, 73037339, 69014994, 65253373, 62112416, 58790673, 55497447, 52796220, 50146503, 47407866, 45117645, 42927911, 40504953, 38831177, 36719954, 35334619, 33716577, 32332334, 30849459, 29589401, 28186425, 27378789, 26189847, 25225321, 23929003, 22989230, 21840882, 21238497, 20519196, 20364096, 18854089, 18449365, 17706523, 17218986, 16358398, 16324877, 15396735, 14804042, 14405169, 14040058, 13753604, 13111017, 12791282, 12456139, 12218649, 11801690, 11347165, 10907271, 10909206, 10468635, 9971841, 9836718, 9661690, 9426009, 9357567, 8829707, 8713953, 8235515, 8037805, 7922490, 8067616]
16635H067616o49597K38331j82880l62308k95186r3067L9853m62549j21502k59136
16625E919575J13394j49811l49428j31190M33840k01220k56165m47051K62638
16616E194582k88699J38317j21285j82614P2961l65272K49165k90331j28078j47193
16606D131553P0691J22263k76051l46743j23954K61584j56064j28451J70999m82679
16596C243148K17669o1792J4770k08859j15503m6405J73437n21548M76580k61567
16586B909930J54920k39403K46265k73685q8631R3164o4010o1230J78323l43581
16576B512062L60896m31989j7077N0932k21529l0752K85815k24857q5652j02842
16566B095007j43545J0488J57642o9742k40358J19764Q0027l8803k74049N57063
$$ y = [8067616, 7418019, 7656350, 7473470, 7111162, 6815976, 6722909, 6762762, 6300213, 6178711, 5919575, 6032969, 5883158, 5533730, 5402540, 5836380, 5635160, 5378995, 4931944, 5194582, 4905883, 5044200, 4922915, 4740301, 4813262, 4447990, 4697155, 4406824, 4278746, 4131553, 4202244, 4324507, 4048456, 3701713, 3577759, 3839343, 3683279, 3554828, 3725827, 3243148, 3460817, 3399025, 3413795, 3204936, 3089433, 3043028, 3216465, 2694917, 3171497, 2909930, 3064850, 2825447, 3071712, 2798027, 2709396, 2802560, 2738550, 2677320, 2855643, 2512062, 2872958, 2440969, 2423892, 2474824, 2253295, 2222543, 2508358, 2283501, 2197849, 2095007, 1951462, 1961950, 2119592, 2049850, 1809492, 1929256, 2009283, 1970480, 1696431, 2253494]
16556B253494m98772J81708j98365n6517J93789j36819J65283j43878l57296O07427
16546B010054n57698r8812J40217K6076J7254k09738J2696o2384K5488O9403J73920
16535A546476j1418p8787k79501L08907o9242M1437K1485l94089M6276L28386
16525A459930k49865j9298q3049n2787J98437j69709J20631J2720l16708O16944
16515A517246k30442Q3275m08603K09994J35161j25690j96928J86293j08484J68715
16505A230537k00173J40641j84748K02053k86991n8157K16856j80078q1314K9317
16495H27943j62303K54525k6794J67806R3544m04343r9250L77641k17575j00837
16485G10357k21657N00663o67J01035j41840m58420K92646p9343j4912L21630
$$ y = [2253494, 1754722, 1936430, 1738065, 1681548, 1875337, 1738518, 1903801, 1759923, 1402627, 2010054, 1452356, 1353544, 1493761, 1519837, 1537091, 1327353, 1340049, 1277665, 1303153, 1372556, 1546476, 1535058, 1456271, 1176770, 1485677, 1416435, 1457872, 1479357, 1085268, 1131544, 1459930, 1210065, 1190767, 1107718, 1054931, 1253368, 1083659, 1204290, 1217010, 900302, 1517246, 1286804, 1370079, 961476, 1171470, 1306631, 1180941, 984013, 1170306, 1061822, 1230537, 1030364, 1171005, 986257, 1188310, 901319, 843162, 1060018, 879940, 798626, 827943, 665640, 920165, 893371, 1061177, 1154721, 750378, 651128, 1028769, 811194, 710357, 488700, 989363, 988696, 1089731, 947891, 489471, 782117, 702774, 687862, 1009492]
16475A009492l87742j1609K29392J42933k20442R7700j9954k97634K95468j27874
16465G09730O3909l10672K90523k51213B46886M99041k50884Q0802k8924J66527
16455G13448k35220J59203j48579q1615K32583p6582K50298l01865j17120M13376
16445H07927j44868j93787J58040L37480C63364P7393P8870P0676K99288D15048
16434C63206J91868j19492L15855A77042K77826K60956C10384J06143m0220K67736
16424F44043j70789R8128n313j43774J83501j63426J39227R091j96530m3444j37912
16413B12802L30627k05820j21332M35971A79965p3787M57329A98921K25687J77542
16403F02150k10337L35825k12724j26500J18566k21077J57367O818k14511m0057
$$ y = [1009492, 621750, 610141, 839533, 982466, 762024, 859724, 839770, 542136, 837604, 709730, 773639, 462967, 753490, 502277, 246886, 745927, 495043, 575845, 546921, 713448, 478228, 637431, 488852, 407237, 639820, 563238, 813536, 511671, 394551, 807927, 663059, 469272, 627312, 964792, 363364, 440757, 519627, 590303, 889591, 415048, 363206, 555074, 435582, 751437, 177042, 454868, 715824, 310384, 416527, 376307, 644043, 473254, 571382, 566069, 422295, 605796, 442370, 581597, 590688, 394158, 350714, 212802, 543429, 337609, 216277, 652248, 179965, 106178, 563507, 198921, 424608, 602150, 391813, 727638, 514914, 388414, 506980, 285903, 443270, 450088, 235577, 195520]
16393A95520J5834L57091l8279k33067J60860B03392M37077k1204j97811A81294
16382C92192A94409k7944N8710P1422J51896A55146M66733n1196H8648L08789
16372C97437R1064A87785O8147K12853E4963L89516k6684j47420o4454n0777J15845
16361B70989J83806q7976j35274J2705j14570L13776R7709A43330K08722D5211
16350B29003r3029M41251A40927J94669J05845A52122P5131c3443D74386j73517
16340C00869D2407r082O14525C6872K72603n8576j23489P4153J34156p6463l1644
16329B27612A02276Q6092l1739G4822l0026J63729b35555C43108I3500c0850A47434
16317I9659R4933J87375A36613C9648N0633b53652D5697M76391B47174j17767
$$ y = [195520, 211354, 568445, 530166, 297099, 457959, 203392, 640469, 619265, 421454, 181294, 392192, 194409, 166465, 225175, 296597, 448493, 155146, 621879, 570683, 88648, 397437, 488501, 187785, 255932, 468785, 54963, 444479, 417795, 270375, 205921, 155144, 270989, 454795, 366819, 231545, 244250, 129680, 443456, 541165, 143330, 352052, 45211, 229003, 135974, 577225, 140927, 335596, 441441, 152122, 227253, -33443, 474386, 300869, 42407, 33325, 647850, 36872, 309475, 250899, 127410, 201563, 335719, 259256, 227612, 102276, 188368, 156629, 74822, 44796, 208525, -235555, 343108, 93500, -30850, 147434, 99659, 194592, 381967, 136613, 39648, 90281, -253652, 45697, 522088, 247174, 129407]
16307A29407A761L20823J13832j34889D7259K48021m5739Q2289l5887I2152J78508
16296B70660K9969A2639K98625E7696L4813R4561D8452b99497D5434O8402a30545
16284C45033A31355d0451F62754B30868d8388H48460A10605k0798b95190C00063
16273B92040j10231K78613b56009A79486O0826A13604K9739N6870k5701f449j6199
16262b2648B05979J06393b6393k1684D88944A20661K32446a27145j7476d9409
16251A67165n8199a14263J1760D54247A64335A5951K31720d39171J28255F6748
16240B80541j6461p4679L273I6192m5053M0562J72904a59970B12306f7968B28214
16228B02121o0286J67416H4502i3714D85160F2476K61803n9551I9128b79934A45910
$$ y = [129407, 1761, 322584, 436416, 301527, 47259, 295280, 249541, 331830, 295943, 92152, 270660, 300629, 12639, 311264, 57696, 92509, 187070, 48452, -299497, 45434, 113836, -130545, 345033, 131355, -40451, 662754, 230868, -48388, 848460, 110605, 89807, -295190, 300063, 292040, 181809, 460422, -256009, 179486, 240312, 113604, 143343, 200213, 174512, -6449, -22648, 205979, 312372, -26393, -48077, 488944, 120661, 353107, -127145, -144621, -49409, 167165, 108966, -114263, -102503, 454247, 164335, 15951, 247671, -439171, -310916, 66748, 280541, 264080, 189401, 192674, 96192, 51139, 91701, 264605, -159970, 212306, -67968, 228214, 202121, 141835, 309251, 84502, -93714, 485160, 62476, 324279, 264728, 99128, -279934, 145910]
16216A39505a05257B9130L3019K12148G1326j7861b72183A97243b54194B55241
16205E1998J77316k5999h8179F8694J53921o4832Q8580J00845b13857A2429J75300
16194A87729e8156H3517K06377E6132a94254B71540a35011n6133C48720B2549
16183B103J5803b32069A28672g644B26752b22285M5056B78148a54071f596q082
16172a4678B2288d26257D2614J07226B9359J16469J19559j22103a85058G371b79713
16160D63542j77929A25859J67903A056L6263R0370J27749C9296a64572G8146j1988
16149F6158d7534k8300j65402Q2190B606b1675c625j46759A40495B2091M1340
16138F3431M36350B11899E6282M0200A5215A998b6524C8485G002J28721a92804
$$ y = [139505, -105257, 29130, 62149, 274297, 71326, 53465, -272183, 197243, -254194, 255241, 51998, 229314, 203315, -88179, 68694, 222615, 157783, 246363, 347208, -213857, 12429, 187729, -58156, 83517, 289894, 56132, -194254, 271540, -135011, -191144, 348720, 22549, 2103, 17906, -232069, 128672, -7644, 226752, -222285, -177229, 278148, -154071, -6596, -14678, 22288, -426257, 42614, 149840, 29359, 145828, 265387, 143284, -185058, 7371, -279713, 463542, 285613, 125859, 293762, 1056, 37319, 127689, 255438, 39296, -164572, 78146, 66158, -47534, -75834, -241236, -159046, 2606, -21675, -3625, -150384, 140495, 22091, 63431, 499781, 211899, 56282, 96482, 15215, 1998, -26524, 38485, 7002, 135723, -192804]
16126g2922k9289A23222a77164A34717d7105m5305B38a52317A18203C5063J87889
16115B22952h7683j03638j07076f0452A04826D8640K35121m3144A7679c4211n9315
16104i3526m8181E5266A1730K13979E352N942L20343H4117C6987a11692a5339
16092C58964A18441N9942H01g9361I0755b88355A56418c6746k50194D49455k15077
16081B34378N9151A30063h9464c7337j47663e2134c186H3869b039A37680b42211
16069a1069A34572c07238b8744K701q7587k52640a587j34824n1689H9864J65400
16058B55264c302D2948J13248C9021K29711h2476E3843a42115l6796c7185B64845
16046d8728k0650A30185c9223A52436L6167o1309c0618G6816j7778f5473j44661
$$ y = [-72922, -102211, 123222, -177164, 134717, -47105, -92410, 238, -152317, 118203, 35063, 222952, -87683, -191321, -298397, -60452, 104826, 48640, 283761, 240617, 17679, -34211, -93526, -141707, 55266, 11730, 225709, 5352, 11294, 331637, 84117, 36987, -111692, -15339, 358964, 118441, 178383, 801, -79361, 90755, -288355, 156418, -36746, -286940, 449455, 234378, 293529, 130063, -89464, -37337, -185000, -52134, -3186, 83869, -2039, 137680, -242211, -11069, 134572, -307238, -28744, -26043, -113630, -366270, -1587, -136411, -188100, 89864, 255264, -3302, 42948, 156196, 39021, 268732, -82476, 53843, -142115, -178911, -37185, 264845, -48728, -69378, 130185, -39223, 152436, 188603, 127294, -30618, 76816, 59038, -65473, -210134]
16035b10134P1702J6087d5061j57962B6084q429b90687B60220F7547k1577B1271
16023C4050h3172j04776A50519B2712K2776f6028A05379C9043q977d15939G0139
16011a49656j6622C3948J8845j8152a03383k09918A23588c26471a05165j7258
16001a22423A42453b73257k23b6927l26843D7451b54373C4811K37944b60596J04036
15990a56560I4558Q853I02a3744A95545L34395B42261P140l1944R0082A25156
15978I846J50672D648J63854p4985Q8964C0478b90623f8484I1658l4204c65932
15966b77022C43667b13449A07281b72083c9963k00626K0832i6170a2237E8609
15955a32354B6586J00816b3074j40661K2084l5332j2435l0299D28402E7170k5117
$$ y = [-210134, -138432, -122345, -45061, -203023, 26084, 17655, -290687, 260220, 67547, 45970, 21271, 34050, -83172, -187948, 150519, 22712, 45488, -66028, 105379, 39043, 30066, -415939, 70139, -149656, -166278, 33948, 52793, 34641, -103383, -313301, 123588, -326471, -105165, -122423, 142453, -273257, -273480, -26927, -353770, 47451, -254373, 34811, 272755, -260596, -156560, 94558, 103411, 902, -13744, 195545, 529940, 242261, 249401, 217457, 307539, 125156, 9846, 160518, 4648, 168502, 93517, 182481, 30478, -290623, -68484, 91658, 57454, -365932, -277022, 343667, -213449, 107281, -272083, -39963, -240589, -219757, -96170, -12237, 58609, -132354, 26586, 127402, -23074, -163735, -141651, -176983, -189418, -219717, 428402, 57170, 32053]
15944C2053c4036B91492a57012b7795j05295A51015a3513A73319p0038M0654a6118
15932d4582k39997a2919E2336b8970p3602k62001J62880B18261d12809c3142f366
15920a75981A28359Q5559e8954A70642c05259g9006j27082F2540g9953k23732
15910c03685B05891d5807j95135j6443A8165d66037D0721P7490d13468a50841
15899a65247A66112J04214j14236J68319I0869G191f5676j2603A8830a97676a9515
15887b7804B9109a13237B00579g5013j99618a13655a743H2715a01877j1864l2955
15876a46696E1524c7805j60729F0683b47425g0731j65794G129d0324j97608d6452
15864A75719l2664n1290d3228A20881D3282c7008k90177a24335k9798j1227A97873
$$ y = [32053, -34036, 291492, -157012, -27795, -133090, 151015, -13513, 173319, 103281, 143935, -16118, -44582, -284579, -12919, 52336, -28970, -102572, -364573, -201693, 218261, -412809, -33142, -6366, -175981, 128359, 213918, -58954, 170642, -305259, -79006, -206088, 62540, -79953, -303685, 205891, -45807, -240942, -257385, 18165, -466037, 40721, 118211, -413468, -150841, -165247, 166112, 270326, 156090, 324409, 90869, 7191, -65676, -78279, 18830, -197676, -19515, -27804, 29109, -113237, 200579, -75013, -274631, -113655, -1743, 82715, -101877, -113741, -146696, 51524, -37805, -198534, 60683, -247425, -70731, -236525, 7129, -40324, -237932, -46452, 175719, 143055, 91765, -43228, 120881, 43282, -37008, -327185, -124335, -154133, -165360, 197873]
15852B86979a48119b0730N423A91325P5233C9495d2610B9797c20006B62079e8934
15840B47284I4551b07988E6344j1917L588a33176I5005D0697a34560j98507B2213
15828a54071A70989L505h0489j29267n9717a13296B6484b96516P2645l13911B124
15816a06741C51594g397k1346j48413N5201k36771A54553a55081f5620A17358
15805a73516f1008A63693C1201M30370G4978b68578E1711a41224a8484F3391k6817
15794C6574c04097J49364l7273C4887Q1942a60224j08264A59726a98289a9897
15783a15936L7989l7649l30940A69799a24090G8164c1200d385A93428a72750N743
15772a67007J9793r4608B6058K6689a18481M4533j50499A3901K17344G172c62721
$$ y = [286979, -148119, -20730, -15307, 191325, 266558, 39495, -42610, 29797, -320006, 262079, -58934, 247284, 94551, -207988, 56344, 44427, 48015, -133176, 95005, 40697, -134560, -333067, 22213, -154071, 170989, 174494, -80489, -209756, -269473, -113296, 26484, -296516, -223871, -537782, 2124, -106741, 351594, -7397, -28743, -177156, -121955, -358726, 154553, -155081, -65620, 117358, -173516, -61008, 163693, 31201, 461571, 74978, -268578, 51711, -141224, -18484, 63391, 36574, -304097, -154733, -192006, 34887, 116829, -160224, -268488, 159726, -198289, -19897, -115936, -77947, -115596, -446536, 169799, -124090, 78164, -31200, -4385, 193428, -172750, -167007, -147214, -241822, 26058, 52747, -118481, -73948, -224447, 13901, 231245, 7172, -362721]
15760d5168G8852e4623A1259a17358H2083g3435H7291a76383A0979J34520a39047
15748A7942a15570A23524e3053B25174q3322P4692c9085A46589e9765j02150F2391
15736d92783f9738j74767L9111B73130A10887M0766a19909A27496o0228a02310
15725b23922B45842a00832A02199K10916d12512f7039B65048C0175J2992e921
15714a27192F3386a50892A49875l0669k7438k5331J969b04666f8451F5743a32273
15702a27245G8543a23008M24f1262j7427Q348O584B2805J89716h0713b0462l8401
15690e8863B99855j12847E1045a95635A95252j0838F0277A8764J60998J19131
15680B98893h4560j50282R5151A121a38603A39777c24971a57852b406A74072F0982
$$ y = [-45168, 78852, -54623, 11259, -117358, 82083, -73435, 87291, -176383, 10979, 145499, -139047, 17942, -115570, 123524, -53053, 225174, 141852, 216544, -39085, 146589, -59765, -161915, 62391, -492783, -69738, -244505, -205394, 273130, 110887, 151653, -119909, 127496, 67268, -102310, -223922, 245842, -100832, 102199, 313115, -412512, -67039, 265048, 30175, 43167, -5921, -127192, 63386, -150892, 149875, 119206, 91768, 66437, 68406, -204666, -68451, 65743, -132273, -127245, 78543, -123008, -122584, -61262, -78689, -70341, -63757, 22805, 212521, -80713, -20462, -58863, 299855, 187008, 51045, -195635, 195252, 184414, 60277, 18764, 179762, 298893, -84560, -234842, -139691, 1121, -138603, 139777, -324971, -157852, -2406, 174072, 60982]
15668c0409C5879b69641c5504m54000a4733k56914b1669k2454n2863j95024F4454
15656a20074n9805A96068f7271k7393B37324c2593p2481A7977K18024Q2A01561
15644B34364D0833b41242A81751c028I7926k7309i84j48714j08273B62995a38143
15632e6853B8505b06460g1521j16603C29326l2863p0065a03647a7184A8662b1006
15620E8331R2238P4693c19977b5295B67023A7249L1843a71080a0387j86433A15030
15608E9120B0300K6168J45585B2438a16170A80519a28723C07228C4840K02891
15598B37731o7659a29328l8991c4906l08188a31956I2498i2519p8170G4682J5825
15587I0507a82105j2736G6580a93817g2327k55040A92766c0691j05873j22272
$$ y = [-30409, 35879, -269641, -35504, -489504, -14733, -271647, -21669, -44123, -96986, -292010, 64454, -120074, -179879, 196068, -67271, -94664, 237324, -32593, -105074, 17977, 236001, 236083, 101561, 234364, 40833, -241242, 181751, -3028, 97926, 70617, -984, -149698, -257971, 262995, -138143, -56853, 28505, -206460, -71521, -188124, 329326, 296463, 226398, -103647, -17184, 18662, -21006, 58331, 150569, 225262, -319977, -25295, 267023, 17249, 49092, -171080, -10387, -196820, 115030, 59120, 20300, 46468, 192053, 22438, -116170, 180519, -128723, 307228, 34840, 237731, 170072, -129328, -168319, -34906, -343094, -131956, 92498, -92519, -170689, 74682, 90507, -182105, -194841, 76580, -193817, -72327, -327367, 192766, -30691, -136564, -258836]
15577b58836b2815A5625g9224B6875J70414b57363B10268n3715l1356R1238b82527
15565C2787f9880j24287o7375B00605J68019b35804A2659R6498O6810C417c43573
15553h1561c4994A84396D8385a25799l120j820C1747J03115f3722k75325h764
15541b93578J35033B17366o3423c50808i9414A74643b41478O7153P6687I9968
15530b50660I2541C3541J5933J10342k9615b07551J2651B59776a89139c1806a0720
15518b72453C1740O2949k2058P1902J16202C1145b87630G4686P159O8654O6903
15507B17402j7084i5924B13353e96666A20123i1344l6987k5717j9975P112A44288
15495A84790G2246h4099j00146A86652c42919l213f8811B08294e1143k42751R1169
$$ y = [-258836, -22815, 15625, -79224, 26875, 197289, -257363, 210268, 156553, 125197, 216435, -282527, 32787, -69880, -194167, -261542, 200605, 368624, -235804, 12659, 109157, 175967, 3417, -343573, -81561, -34994, 184396, 48385, -125799, -128919, -130739, 31747, 134862, -63722, -339047, -8764, -293578, -158545, 217366, 153943, -350808, -99414, 174643, -241478, -174325, -97638, 99968, -250660, 92541, 33541, 49474, 159816, 130201, -207551, -194900, 259776, -189139, -31806, -10720, -272453, 31740, 94689, 72631, 144533, 260735, 31145, -287630, 74686, 81845, 150499, 217402, 200318, -95924, 213353, -596666, 120123, -91344, -128331, -154048, -174023, -166911, 144288, 184790, 72246, -84099, -184245, 186652, -342919, -346132, -68811, 208294, -51143, -293894, -202725]
15484b02725C9887a93001B28889N9847A21938B308c43727H0838J64429J56477
15474D01744F2406J34844A8792N6982L4173B7567i4018c3542A30159E0440P597
15463E8037g340j0760k19159j64520A16371b78939E916a00259L2759p0295l265
15452a41060j30676a25359H3938b82772c4706A02403J24397A9821i3262F6725
15441b02199H1705b5764B66930H8578C2077Q5632g7518c1951D3858Q596e02372
15429C12309c307j87719O3759J8447G6016K06758D5183J480d4522C2777a22476
15417A547a32234A95341H8920a04086L9610a9588D8555i6830B86509A1714K8097
15406C9811P0733c1777A56122l706D9427R1910a91829F6779h8521a527B06560
$$ y = [-202725, 39887, -193001, 228889, 288736, 121938, 2308, -343727, 80838, 245267, 401744, 62406, 197250, 18792, 75774, 109947, 27567, -94018, -33542, 130159, 50440, 58037, -7340, -18100, -237259, -401779, 116371, -278939, 5916, -100259, -67500, -137795, -141060, -271736, -125359, 83938, -282772, -34706, 102403, 226800, 19821, -93262, 66725, -202199, 81705, -25764, 266930, 88578, 32077, 117709, -77518, -31951, 43858, 52454, -502372, 312309, -3307, -191026, -127267, -108820, 76016, 282774, 45183, 46663, -44522, 32777, -122476, 1547, -132234, 195341, 88920, -104086, -64476, -19588, 48555, -96830, 286509, 11714, 39811, 110544, -31777, 156122, 152416, 49427, 141337, -191829, 66779, -88521, -1527, 206560]
15394A21089P3427H9387a53875n3066B63112B3664a52792A69878H0950K10297
15384B91247b97022B63165c1233j36796p5044j23792a64137c0428a355A83784
15373a76662F13306B60310b87278G1369f0326R216B49124j01087i8252A53487
15362A15546g8731B31699b566j26662D02419B9217c5008q1858B44483H2592j298
15351H1294b00794f3116C32389D1079b49294E6266K89175a75987m4947l9709C2402
15339A8882K27935a05721B52627e0526A94821h743b545A8047D060J30451c379
15327a42484H0523C8376J03501F1247J63646A10765O3189A3766b12586C44785
15316a68310e857A26278c83609D63439B06231p159J1926c34949c719p6489G0926
$$ y = [121089, 194516, 89387, -153875, -206941, 263112, 23664, -152792, 169878, 80950, 291247, -297022, 263165, -31233, -168029, -243073, -366865, -164137, -30428, -1355, 183784, -176662, 613306, 260310, -287278, 71369, -60326, -51110, 249124, 148037, -98252, 153487, 115546, -78731, 231699, -2566, -129228, 402419, 29217, -35008, -116866, 244483, 82592, 81294, -200794, -63116, 332389, 41079, -249294, 56266, 345441, -175987, -220934, -260643, 32402, 18882, 246817, -105721, 252627, -50526, 194821, -8743, -2545, 18047, 4060, 134511, -3379, -142484, 80523, 38376, 141877, 61247, 224893, 110765, 173954, 13766, -212586, 344785, -168310, -5857, 126278, -383609, 463439, 206231, 199072, 210998, -334949, -3719, -80208, 70926]
15304A16592A4761L39258A12364G205K31387C6366e1201C2388P6480E2281a44219
15292b53531C21876A06272K62809A22615c7535C0271g1435A36481c08984g8211
15281A2773J66876m1275o925g6976A20010K7403c23738a5436I1145j3036K8268
15270A06377L273R0531a3244j25753B1917K49269h4411H3200J23188c5172C36802
15258B39879a51524l1668f9347H0618R3075a58708c0830C1836P1648K95694J036745
15247A435923m33934m0977K11424m56570l34558A50211a28849A97847J25408a37321
15236C06548c0599l3356B02893A1644J5573M8993J16957b0018H8468d101E2389
15224d7177j04405p7506D4613a34356A65505b27182N4756A24892K26707b13253
$$ y = [116592, 14761, 354019, 112364, 7205, 238592, 36366, -51201, 32388, 108868, 52281, -144219, -253531, 321876, 106272, 369081, 122615, -37535, 30271, -71435, 136481, -308984, -78211, 12773, 179649, 138374, 131449, -76976, 120010, 147413, -323738, -15436, 91145, 78109, 106377, 109650, 200181, -13244, -138997, 21917, 271186, -84411, 83200, 206388, -35172, 336802, 239879, -151524, -183192, -69347, 80618, 173693, -158708, -30830, 31836, 103484, 399178, 1435923, 1001989, 961012, 1172436, 715866, 381308, 150211, -128849, 197847, 323255, -137321, 306548, -30599, -63955, 202893, 11644, 27217, 76210, 193167, -20018, 88468, -4101, 52389, -47177, -151582, -229088, 44613, -134356, 165505, -227182, -172426, 124892, 351599, -213253]
15213A11585c0646B79220E1896P1103N6916g948A8436J33469I10a34419k8138
15202a62557A36649a22594B98929j15015q2855a83642I244c19175A58988E9284
15191A34785i045C47257g5793B11080b31260c2311B40318J44086j67507q9548
15181A27349O284K01239i166A43483B7825J06734l9721e3461C952J67859a77366
15169B06885H5566h9194A63337J08243G1674M4412C9860O2089P2499a44943M2270
15158a02673A91836P5290j2453k2532c7267F9412J30665J58501a02175F6130N5191
15147A21321a22526A25663b63481I4456K43668j08289B0780a0270r4040d0384
15136a6807j49909B41948G801L40846o0752n4931g6623g832j1018g009A93975
$$ y = [111585, -30646, 279220, 51896, 122999, 179915, -7948, 18436, 151905, 910, -134419, -162557, 136649, -122594, 298929, 183914, 101059, -183642, 9244, -319175, 158988, 59284, 134785, -9045, 347257, -75793, 211080, -231260, -32311, 240318, 384404, 216897, 127349, 133633, 334872, -9166, 143483, 27825, 134559, 94838, -53461, 3952, 171811, -177366, 206885, 85566, -89194, 163337, 271580, 71674, 116086, 39860, 101949, 174448, -144943, -102673, 191836, 267126, 254673, 232141, -37267, 69412, 200077, 358578, -102175, 66130, 121321, -122526, 125663, -263481, 94456, 338124, 229835, 20780, -10270, -104310, -40384, -16807, -166716, 241948, 7801, 348647, 287895, 232964, -76623, -7832, -18850, -7009, 193975]
15124H5687R6780a2303A9106L29527A01793K72103n8757a9000A13886J42628E6927
15112B47367d7211A89524K08841A40795J61416H8410J69550a74055D3719J27138
15102A70857l4263l5785J31764a15783F5722J2205B0844R0141b2815C44337b58792
15090A47310o8459J82683a58904H6227J81082A32824K3165J50174l057A36763
15079a03231r237e690p7832n6281B55542O83c6249A23073d6339A7993J40928a24637
15066C18603i5834H6645M86600B41463q0211r955j1099L2935K21593h5980A89099
15054A09139C2013P7133O4708K07688j76612k2539l7256J68195b77517A9155R5232
15043A14387K3456L39289p0000F0488a73764B61586a30025B49860J68071F0363
$$ y = [85687, 182467, -12303, 19106, 348633, 101793, 373896, 315139, -19000, 113886, 256514, 56927, 247367, -47211, 189524, 398365, 140795, 302211, 88410, 257960, -174055, 43719, 170857, 136594, 100809, 232573, -115783, 65722, 77927, 20844, 110985, -22815, 344337, -258792, 147310, 78851, 261534, -158904, 86227, 267309, 132824, 155989, 306163, 303106, 136763, -103231, -112468, -5690, -83522, -139803, 255542, 256225, -36249, 123073, -46339, 17993, 158921, -124637, 318603, -95834, 86645, 573245, 241463, 161252, 151297, 140198, 173133, 394726, -85980, 189099, 109139, 32013, 109146, 173854, 381542, 204930, 182391, 145135, 313330, -277517, 19155, 114387, 137843, 477132, 407132, 60488, -173764, 261586, -130025, 249860, 417931, 60363]
15032A66277L0686J08857R9533j71838q2058a56612B67681n7766A01689J75994
15022B77683q8794a47562B6861a5171l670B06467J7517j02510m241J99777A52628
15010B61051r3765b01362A31817A4968K39043j06407J32522K75638k28577A60818
14999H8887J33099D6447K83896M9942J12418j84540l0469l0377J14813b0343B99359
14987D43811j72566K1174M8857A44524J23038o1370K42865l9549J21419A1409
14976A87269P7607j30372M55436k77918A05310J07039J17196M5371j31185P7405
14966C21136a94392A95840J67730A32458B1509J85851G7210N8284M94104B38911
14955D10983D1916J9585O00161k85466H1751J45626J23839R3155A32786K52157
$$ y = [166277, 196963, 305820, 405353, 233515, 151457, -156612, 267681, 209915, 101689, 277683, 188889, -147562, 26861, -15171, -18841, 206467, 223984, 121474, 117233, 317010, 152628, 261051, 167286, -201362, 131817, 14968, 254011, 147604, 280126, 555764, 327187, 160818, 88887, 221986, 46447, 330343, 380285, 492703, 308163, 277694, 247317, 362130, -20343, 299359, 443811, 271245, 292419, 341276, 144524, 267562, 206192, 449057, 409508, 530927, 11409, 187269, 264876, 134504, 589940, 312022, 105310, 212349, 329545, 374916, 243731, 321136, -194392, 195840, 363570, 132458, 21509, 207360, 77210, 135494, 629598, 238911, 410983, 41916, 61501, 661662, 376196, 81751, 227377, 351216, 444371, 132786, 384943]
14945C84943A6589K684O9094K12913r3548j00347L12403J03567A89541K67161
14935D56702A81905K56723j90819P3302h925B37418K39873B24673n6135M38745
14925F07283B87723J17078J5775A48047J64278F9678L03643O3937I9844O2731
14915A62575K167P3244K92738F2501M00336l7715r3347N3531J257p8853J75410
14904D83120j01991q4886L82927G124K38636L37436j32792j79387o5542a46262
14893A14907J57502o3360K27781F7492K41657O2928A29028i6072C46616k3678
14883C22938j35167J44087f5676C47066L26592H0966M65910p4332m0163j28846
14873C03535M6038K08957k27600J92621P2225k77320K83888l7508a05263C72410
$$ y = [384943, 16589, 19273, 88367, 301280, 207732, 107385, 419788, 523355, 189541, 456702, 181905, 438628, 247809, 321111, -8925, 237418, 477291, 224673, 168538, 607283, 287723, 404801, 420576, 148047, 312325, 69678, 373321, 437258, 99844, 162575, 164742, 237986, 530724, 62501, 462837, 425122, 331775, 385306, 386563, 307710, 483120, 381129, 296243, 679170, 7124, 245760, 583196, 450404, 271017, 205475, -146262, 114907, 272409, 209049, 436830, 67492, 309149, 372077, 129028, -96072, 346616, 322938, 187771, 331858, -65676, 347066, 673658, 80966, 546876, 472544, 432381, 303535, 349573, 558530, 330930, 523551, 595776, 318456, 602344, 564836, -105263, 372410]
14862E34342B38816J73883K73841A75892k6308M20101A63198J82578A33191N45819
14852F79010k78644m8544J4077K12193q3632Q9046r0931A77243K94627J29454
14842F01324k46416H2081N06293k63308J43110j30829J79530j6765B17235K65538
14832D82773j3541Q6682J5016A95958J41177J41809m8474J50576k14151J44668
14822E11563J2091K7453j32393J32748j50881j7443A44505K55488J74845j00437
14812D74401q7934R9799R2208j39469J52557L40848l47159O0601B35997P8573
14802C14570N22011j88438j40166j40063j09372J06453L29881l29139L03466j47406
14792E21797k14542K88943O7428P8674k78845J2578k35826P4133N42084l52200
$$ y = [534342, 238816, 412699, 686540, 175892, 149584, 569685, 163198, 345776, 133191, 679010, 400366, 351822, 365899, 578092, 494460, 583506, 492575, 177243, 471870, 601324, 354908, 82081, 588374, 325066, 468176, 337347, 516877, 500112, 217235, 482773, 469232, 555914, 570930, 195958, 337135, 478944, 430470, 581046, 366895, 511563, 523654, 551107, 418714, 551462, 400581, 383138, 144505, 399993, 574838, 474401, 386467, 486266, 578474, 439005, 591562, 932410, 585251, 645852, 235997, 314570, 836581, 648143, 507977, 367914, 258542, 364995, 694876, 365737, 669203, 521797, 307255, 596198, 663626, 742300, 463455, 476033, 240207, 314340, 856424, 504224]
14782E04224L1246k24894N8227m0622k9206J57116Q4852B24476K26544j558J75121
14771F24583J28600B29391P88879j62754p8346r6775k60536J30174j14331L62133
14761G97835l27336L4973R1875r1439j35697J81065o3754J13183j04153K89803
14751G86355k99925p7319Q7814J43803r6456K42807B21842M86700P1394k57700
14741E22236J28257j21169k6201P719O0586K07594k3260j32440K95575C46487
14730E06443N3089K60477J6529j87843J60917j85745J8578J80944C90563N67740
14720I58303K7027k92414J5876K2172K37177D39731M56599l12132J44836O7864
14710G96898j59746o1480J42593O6300k22848L67221l26822N99478l67597J03783
$$ y = [504224, 535470, 310576, 368803, 328181, 298975, 456091, 540943, 224476, 451020, 449462, 624583, 753183, 229391, 1018270, 855516, 777170, 680395, 419859, 550033, 435702, 797835, 470499, 505472, 597347, 505908, 370211, 551276, 487522, 600705, 496552, 786355, 486430, 409111, 496925, 640728, 544272, 787079, 221842, 708542, 779936, 522236, 650493, 529324, 503123, 510842, 571428, 779022, 755762, 623322, 918897, 346487, 506443, 559532, 820009, 836538, 648695, 809612, 623867, 642445, 823389, 390563, 958303, 985330, 692916, 708792, 730964, 968141, 439731, 896330, 584198, 729034, 796898, 637152, 575672, 718265, 784565, 561717, 928938, 602116, 1201594, 833997, 937780]
14700I37780r834k40764K91430k24241N6695l10693M27735j45393P0645K96790
14690A150150P0379l3199m64235M4923N3045k18301O17357l37113m097l4147J73485
14679A018247j92041K59092K74911n67224l013J2392J88943k13065N8814J38908
14669I75964J9855n6426j07062L414n6312K63063l7252k297k51049L22117k61159
14658H12856K60242J96320j8905j02951J670N3683j73422k68324K60399k13202
14648H08366L60704J6952K71609m04736Q9765j03661O3109M30568o52902K35134
14638A114908J77909n4197j49744q686J96845k37992j01778M57006J08431l67692
14628A135010q1565Q17049o64614P5533k09415L76422k35877L34490j85404k6803
$$ y = [937780, 927946, 687182, 978612, 754371, 811066, 500373, 928108, 782715, 853360, 1150150, 1220529, 1187330, 723095, 768018, 821063, 602762, 1220119, 883006, 878909, 844762, 1018247, 826206, 1085298, 1360209, 792985, 789972, 802364, 991307, 778242, 837056, 975964, 995819, 939393, 832331, 835745, 779433, 1042496, 1005244, 1002947, 751898, 1074015, 812856, 1073098, 1269418, 1250513, 1147562, 1149232, 1202915, 1029493, 761169, 1021568, 808366, 1169070, 1186022, 1457631, 1052895, 1142660, 1038999, 1102108, 1532676, 879774, 1114908, 1292817, 1238620, 1088876, 1080190, 1277035, 1039043, 937265, 1394271, 1502702, 1135010, 1053445, 1870494, 1205880, 1281413, 1071998, 1448420, 1212543, 1547033, 1361629, 1334826]
14618A334826L36005o06774N56379m22012L77732l01843J55014Q7792j12976k8415
14608A375728j38322k3112K84936j16991J14589J67086K48223l89709k14748J34143
14598A441823J58044K40064j91484l09872N7878L47574L1027n4378j31090K89428
14588A879014m58880N49567p3221m3556N3682j08062J11758r3825O6334L32671
14578B215482r701j55081j92838O3196L44764k94104j08134L67446q453j47827
14568B074750l2409N34190p7260m6841o9419L66856j39988j0412j96286K97606
14558B700787K9967L8625K02108M83727J15010K55455N55068M67513O85047J697268
14548G230575M009089P454320J7282352J1028254B0284858G488824C422976q80342
$$ y = [1334826, 1670831, 1064057, 1620436, 1198424, 1576156, 1274313, 1429327, 1517119, 1404143, 1375728, 1237406, 1214294, 1499230, 1382239, 1496828, 1663914, 1912137, 1522428, 1307680, 1441823, 1599867, 1839931, 1648447, 1338575, 1396453, 1744027, 1775054, 1720676, 1589586, 1879014, 1420134, 1969701, 1896480, 1852924, 1906606, 1798544, 1910302, 1816477, 1882811, 2215482, 2205781, 2050700, 1857862, 1921058, 2265822, 1971718, 1863584, 2231030, 2222577, 2074750, 2042341, 2576531, 2499271, 2452430, 2383011, 2749867, 2609879, 2599467, 2403181, 2700787, 2730754, 2769379, 2971487, 3455214, 3570224, 3825679, 4380747, 4848260, 5533307, 7230575, 11239664, 18693984, 35976336, 47004590, 20284858, 7488824, 3422976, 2542634]
14540B542634n22971L61983k05224l75693J35942k18021J77546L00979j91154
14531B006021j26097K75841l6857R9274j72629J76875N8495l9082j36148N7507
14521B163200K40827K48761m17323L46983j86125K06056r1946K84958K7980m08828
14511B414543M88275L5607m08371N81902k64547N5672r3843L38445J1495K56042
14501C415220p98668K41676N15822l82592j52950K32340J66184k0226K8644N1305
14491C296755K03512k51588K43385k1030J69902j3298K0737K50363p3171J58932
14481C984499m43736M26784j34959o062J34127J44403l3564j38107M66790m40747
14471C959428L31739j43038J68017l56890K92059Q8197j5635j30184L38536K58477
$$ y = [2542634, 2019663, 2381646, 2176422, 1800729, 1936671, 1718650, 1896196, 2197175, 2006021, 1879924, 2155765, 2118908, 2218182, 2045553, 2222428, 2280923, 2241841, 2105693, 2163200, 2404027, 2652788, 2235465, 2582448, 2396323, 2602379, 2510433, 2795391, 2823371, 2414543, 2902818, 2938425, 2530054, 3111956, 2847409, 2903081, 2809238, 3147683, 3159178, 3415220, 2616552, 2858228, 3374050, 2991458, 2838508, 3070848, 3237032, 3216806, 3245450, 3296755, 3500267, 3248679, 3492064, 3471034, 3640936, 3627638, 3648375, 3898738, 3825567, 3984499, 3540763, 3967547, 3832588, 3826526, 3960653, 4105056, 4071492, 3933385, 4400175, 3959428, 4291167, 4148129, 4316146, 3959256, 4251315, 4339512, 4323877, 4193693, 4532229, 4790706]
14461D790706j76480J55018j0429L46234k13841o5839L31684J05133k00624L627
14451E065189k44935L62099K35624r9028J26549J96936M141K18140q8302K54753
14441F031166k16175l43321M10502L35472K63999j70070L26348j92756j0655P363
14431F441873K26569k43710L62941j603K16202p955K51222k06329P15504j68491
14421G586223o9395L7105J76406n589K13740L39567r6214J18711J69341J24191
14411H594086J17743L33231j60058K25357K93679J54651j41078M56065j8191M72947
14401A0328432p852J36808N7992K9506M05990P6077M25927l27703L49234J36737
14391A1611148L94975J18080l3376M91928J95449L26794O3340L65254L38414l38146
$$ y = [4790706, 4614226, 4769244, 4758815, 5105049, 4891208, 4825369, 5157053, 5262186, 5061562, 5065189, 4820254, 5182353, 5417977, 5318949, 5445498, 5642434, 5646575, 5864715, 5776413, 6031166, 5814991, 5471670, 5882172, 6217644, 6481643, 6311573, 6637921, 6445165, 6434510, 6441873, 6668442, 6424732, 6787673, 6786070, 7002272, 6994317, 7245539, 7039210, 7754714, 7586223, 7516828, 7553933, 7730339, 7724750, 7938490, 8278057, 8181843, 8300554, 8469895, 8594086, 8711829, 9045060, 8885002, 9110359, 9404038, 9558689, 9417611, 9873676, 9855485, 10328432, 10320580, 10457388, 10515380, 10544886, 10950876, 11026953, 11452880, 11125177, 11474411, 11611148, 12006123, 12124203, 12090827, 12582755, 12778204, 13104998, 13168338, 13533592, 13872006, 13533860]
14381A3533860N87793L43610M15909J03469O91382J52911q7067L76063M39001
14372A6556931j78043J052862M67942k65048N62772N94460R1851L39959P56774
14363A9980460K0657O40743M07256N71258K44599L70921P73672Q92356N11479
14354B4413401M93071L33288O71714L44275R89666Q00655M92897O07285R70207
14345C0116459O84488J055707N43047J034110Q90194J137074N60694J361493Q60069
14336C8243335J027614J070665J276506J295104J653417J031725J720453J597621
14328D8916440J396333J939153J235529K224149J784860K082602K053940K502148
14320F4135154J810593K738247K708675K484917K892098L304901K524829L081554
$$ y = [13533860, 14121653, 14465263, 14881172, 14984641, 15676023, 15828934, 15741867, 16117930, 16556931, 16378888, 17431750, 17899692, 17634644, 18197416, 18791876, 18883727, 19223686, 19980460, 20001117, 20641860, 21049116, 21620374, 21864973, 22235894, 23009566, 23901922, 24413401, 24906472, 25239760, 25911474, 26255749, 27245415, 28046070, 28538967, 29146252, 30116459, 30800947, 31856654, 32399701, 33433811, 34324005, 35461079, 36021773, 37383266, 38243335, 39270949, 40341614, 41618120, 42913224, 44566641, 45598366, 47318819, 48916440, 50312773, 52251926, 53487455, 55711604, 57496464, 59579066, 61633006, 64135154, 65945747, 68683994, 71392669, 73877586, 76769684, 80074585, 82599414, 85680968]
14312H5680968L734187L234125L752574M262613L985382M368143M719990N026866
14304A18764848N064245N599763O237422O034141O177335P067027P487293P849573
14296A70281647P834868Q571999R031668R670092J0009867J0108821J0689927
14289B36198889J1015768J1652295J2412411J2821101J2589225J3113122J3390061
14282C23192872J3606361J3080269J3369940J3136464J1885548J1698905J0932113
14275D10902472R683728P961466O010635K478871K33066R55702J28593l361497
14267D34993036m123817p098251r586850j1366916j2855487j3725715j4441269
14260C61794731j4638149j4879429j4721734j4510375j4345012j2919623j3643697
$$ y = [85680968, 89415155, 92649280, 96401854, 100664467, 104649849, 109017992, 113737982, 118764848, 123829093, 129428856, 135666278, 141700419, 147877754, 154944781, 162432074, 170281647, 178116515, 186688514, 195720182, 205390274, 215400141, 225508962, 236198889, 247214657, 258866952, 271279363, 284100464, 296689689, 309802811, 323192872, 336799233, 349879502, 363249442, 376385906, 388271454, 399970359, 410902472, 420586200, 428547666, 434558301, 437037172, 437270238, 438225940, 438354533, 434993036, 430869219, 423770968, 414184118, 402817202, 389961715, 376236000, 361794731, 347156582, 332277153, 317555419, 303045044, 288700032, 275780409, 262136712]
14253B62136712j2851613j2587898j1612391j1192864j0449518r970199r485690
14246A83986539r124171q147865p504938p266499p502229o629960o167444n930877
14238A25712556n389356m920441n135657m941065m552223l744829l983533l165059
14230H9880393l944754l421529l188187l100791k701473k903057k465260k256176
14222F5899166k373230k385611j789119j990352k011483j846501j435336j946672
14214E0120862j434605j120854j636533j317527j397458j555097j363126J84638
14206D0480300j508689j287192j247893j069376j003765n10000r51853m77274
14198C2424258j110887j059463o04980j076074k26199o06137o74995q10471o27226
$$ y = [262136712, 249285099, 236697201, 225084810, 213891946, 203442428, 193472229, 183986539, 174862368, 166714503, 159209565, 151943066, 144440837, 137810877, 131643433, 125712556, 120323200, 115402759, 110267102, 105326037, 100773814, 97028985, 93045452, 89880393, 85935639, 82514110, 79325923, 76225132, 73523659, 70620602, 68155342, 65899166, 63525936, 61140325, 59351206, 57360854, 55349371, 53502870, 52067534, 50120862, 48686257, 47565403, 45928870, 44611343, 43213885, 41658788, 40295662, 40480300, 38971611, 37684419, 36436526, 35367150, 34363385, 33853385, 32901532, 32424258, 31313371, 30253908, 29648928, 28572854, 28346655, 27740518, 27065523, 26255052, 25627826]
14189B5627826m21156n97993n87317n74925m82101n83376m99157m33833p45586
14180B0702382k07713m58989p66098K58444l87938q44305P1133k85288o53558
14171A7428070m87168m0831p35844r5269k48211n26061j71630j89065j26205m07779
14161A4400007r8387j92553l15208j37656j49512m53833j30113l95501k94730
14152A2232514l21339o95308M39273J1809p3301k35078j09605k54052m33737k1603
14142A0539573l42970K91072m29038j26065j41450j88117l13186M0622k05030
14133I125411j60797K8807p5234l81459J76404m79332j02905j73801J4711j23925
14123G847880J2677N7031R6574k98295k19303p8528k23549M09154p41693K01451
$$ y = [25627826, 25206670, 24608677, 24021360, 23446435, 22964334, 22380958, 21881801, 21447968, 20702382, 20494669, 20035680, 19269582, 19528026, 19140088, 18295783, 18366916, 18081628, 17428070, 16940902, 16900071, 16164227, 16068958, 15820747, 15294686, 15123056, 14933991, 14807786, 14400007, 14301620, 14109067, 13793859, 13656203, 13506691, 13052858, 12922745, 12527244, 12232514, 11911175, 11215867, 11655140, 11666949, 11593648, 11358570, 11248965, 10994913, 10561176, 10539573, 10196603, 10487675, 10058637, 9932572, 9791122, 9603005, 9289819, 9330441, 9125411, 8964614, 8993421, 8918187, 8536728, 8713132, 8233800, 8130895, 7957094, 7971805, 7847880, 7860557, 7917588, 8014162, 7715867, 7496564, 7418036, 7194487, 7603641, 6861948, 7063399]
14113G063399J39452m61655P4148j630k94283J91875j97218l83801J27452l14551
14103E943188J14567Q9662j70656l00813J06273j11435j34780J75952J13185n78553
14093E246590J62418k89601K09046m8790k16025Q4635l36362O9694j62936K19214
14083D937883n1300j31464J59461k5322k08411J60124l03924n2995r0431N58730
14073D952351l83173k42912j59711l5353O592J20072r4814k28510R2124J81361
14063D208027k25516N1414l2194J83788r3525r1506j52656j26923J43463K4898
14053C889270k80594k08132M20043j29196l01269k8149l9604Q0310j41360j34987
14043C126332K96612l97852L60721l76519J65418k82565K58259p8581m4712K47128
$$ y = [7063399, 7202851, 6741196, 6815344, 6813714, 6519431, 6711306, 6514088, 6130287, 6257739, 5943188, 6057755, 6147417, 5976761, 5675948, 5782221, 5670786, 5536006, 5711958, 5825143, 5246590, 5409008, 5119407, 5328453, 5279663, 5063638, 5148273, 4811911, 4881605, 4718669, 4937883, 4886583, 4755119, 4914580, 4889258, 4680847, 4840971, 4537047, 4484052, 4393621, 4952351, 4569178, 4326266, 4166555, 4131202, 4137794, 4257866, 4163052, 3934542, 4026666, 4208027, 3982511, 4033925, 4001731, 4185519, 4091994, 4000488, 3847832, 3720909, 3864372, 3889270, 3608676, 3400544, 3820587, 3691391, 3390122, 3361973, 3322369, 3402679, 3261319, 3126332, 3422944, 3025092, 3385813, 3009294, 3174712, 2892147, 3150406, 3071825, 3027113, 3274241]
14033C274241m12493K3220O74757n45388k40388R9402P4587j0147j47418j60703
14023B629670k3999K3778k24966J33350J05236j88586K55056o4340j09506l48627
14013B187066K19331k86094K27418l1386r2031L29300j02638j63039l59647K27475
14003B155755R6163j42485P60J32462L79814j61447j28755j06945L93472l93987
13993B224807J98008j62276L14256N03637R72632K585134N248695J5928759J9748422
13984D7562074k1876758A2404201n312158k097106m94333n23984o51115j55565
13976C169940n69744L84965j39643j89209l3367K304l76938K54238M0529j35644
13966B407431m6529k29718N03426l18501m22405K50152l42473K89812m5053l4643
$$ y = [3274241, 2861748, 2884968, 3559725, 3014337, 2773949, 2873351, 2947938, 2937791, 2790373, 2629670, 2605671, 2629449, 2404483, 2537833, 2643069, 2454483, 2709539, 2645199, 2535693, 2187066, 2406397, 2120303, 2347721, 2316335, 2224304, 2553604, 2450966, 2287927, 1928280, 2155755, 2251918, 2109433, 2110193, 2242655, 2622469, 2461022, 2332267, 2225322, 2618794, 2224807, 2422815, 2260539, 2574795, 3078432, 4051064, 6636198, 11884893, 27813652, 47562074, 25685316, 12404201, 7092043, 4994937, 4500604, 3976620, 3325505, 3169940, 2600196, 2985161, 2845518, 2656309, 2622942, 2625246, 2248308, 2502546, 2543075, 2407431, 2360902, 2131184, 2634610, 2316109, 1893704, 2143856, 1801383, 2091195, 2046142, 2011499]
13956B011499j19069n0143K99311k12989J64761j75931p370k40826J61395j00948
13946A729690K46811O462O5897k0117l72203L65296m98141N2725K83145q362k70301
13935A580902K5218K8127m54K42830k93490L6263j87732K93361j99194j10700
13925A415131M89092k26146L1993k419m00652K73053j29351n7530J59669J11322
13915A664162j79242J38276N9418l74064P5917K9922K81930M3340n65480p5273
13905A098906K05273M3896l22563O40698n37003M19361J82958o55482K36210K94747
13895A607001k68876j66338O4897j2288J92858j3236j55754j29299j28548J30491
13885A120908K1008j97166L73028j17028M4256j60499o6511K37305J85549M4706
$$ y = [2011499, 1892430, 1842287, 2141598, 1928609, 2093370, 1917439, 1910069, 1669243, 1830638, 1729690, 1976501, 1982963, 2048860, 2028743, 1656540, 2021836, 1523695, 1576420, 1859565, 1851203, 1580902, 1606120, 1634247, 1633793, 1876623, 1583133, 1619396, 1431664, 1725025, 1525831, 1415131, 1904223, 1678077, 1710070, 1707651, 1306999, 1580052, 1450701, 1393171, 1552840, 1664162, 1484920, 1623196, 1682614, 1308550, 1384467, 1414389, 1696319, 1739659, 1174179, 1098906, 1304179, 1348075, 1025512, 1666210, 1129207, 1548568, 1731526, 1076044, 1312254, 1607001, 1338125, 1171787, 1236684, 1224396, 1417254, 1404018, 1248264, 1118965, 990417, 1120908, 1141916, 944750, 1317778, 1200750, 1245006, 1084507, 1017996, 1255301, 1440850, 1485556]
13875A485556l95019Q5732j27865J78114k30101J59693j02764J10041J78784q4363
13865A257808o2953k31764J40607R680q5798K41844j79863r7665l1348K51328
13855A211876k63053j17939J43664J63878r5711K66597k18833J51170k52260k19567
13845G69822J14791K4585j7072j23325R1042j07096L35374J1936n8670r5637J01217
13834A046967q2527J63428k77405l2094K14701R2961k94309J84279L5402L4076
13824A085479l1531M7402l63362J82960l02827P7553K62614m2399J509Q1526k04934
13813G93990J29531k65673N4381k1637n6849L12789k24444J71059Q5626o2684
13803I16089k49951K12963K31039n04983P6641J61683J21370k92007m2262L05990
$$ y = [1485556, 1090537, 1176269, 1048404, 1226518, 996417, 1156110, 1053346, 1163387, 1342171, 1257808, 1194855, 963091, 1103698, 1113378, 1027580, 1269424, 1089561, 991896, 960548, 1211876, 948823, 830884, 974548, 1138426, 1042715, 1309312, 1090479, 1241649, 989389, 769822, 884613, 909198, 892126, 768801, 859843, 752747, 1088121, 1100057, 1041387, 945750, 1046967, 964440, 1127868, 850463, 818369, 1033070, 1126031, 831722, 1016001, 1051403, 1085479, 1053948, 1101350, 737988, 920948, 618121, 695674, 958288, 915889, 917398, 998924, 793990, 923521, 657848, 712229, 690592, 633743, 946532, 722088, 893147, 978773, 916089, 666138, 879101, 1110140, 605157, 681798, 843481, 964851, 672844, 630582, 936572]
13793I36572J08213j48454j14289K4835j31405J51049k38687J08008o4935K66482
13783H97389k27784j93129K46727k68574N72145n06272K92346k76337R9765K4325
13773F60601J08372j88769O9235M240K32170n4674k70644J40790R6581l61220
13763D36682J44701O22703E99247K24629k64209J97616R7250l07844K31473J0484
13753G88646J307P9507j77485l5056j35429J30231L92158n00135J05244j38544
13743E10444J57677K60652l10294k2914O815J9255k78667J35836L16556r0982
13733G04378r8955L3983j50088k14882M81676k31353J57216j26183J40245j84354
13723E11683j1614p0615K11124d0532E75878l2143M71286l24355j0510J88725
$$ y = [936572, 1044785, 896331, 782042, 806877, 675472, 826521, 587834, 695842, 630907, 897389, 669605, 476476, 723203, 454629, 1026774, 520502, 812848, 536511, 636276, 660601, 768973, 580204, 649439, 653679, 885849, 831175, 560531, 701321, 797902, 436682, 581383, 1204086, 599247, 823876, 559667, 757283, 854533, 546689, 778162, 788646, 789953, 869460, 691975, 656919, 521490, 651721, 1043879, 543744, 648988, 510444, 668121, 928773, 618479, 595565, 602380, 621635, 342968, 478804, 795360, 704378, 605423, 639406, 489318, 274436, 756112, 524759, 681975, 555792, 696037, 511683, 500069, 429454, 640578, -40532, 575878, 543735, 1015021, 690666, 680156, 868881]
13713H68881l05273K23533B69719K10864J8051J97507j72314Q7468k97416K77033
13703E90912j35363J10799k09121K25826r7493K26540j50592R8104k07370p9748
13693C72494K82226q4028m3413j36888J27840J21066L22766m18770B51899K99503
13683E51402j76617l5784L0002k9650K22253j93120M8421K66622B29601K42535
13673D72136q4267M68728C62810J2230L08571P7007k80075J4667k41544N69616
13663H23282C15445m15M5497L00378k6314j53023k10103K39933n0819A61968k988
13652A58980D9707M36458q2874K78498k96982L45071C54191J21731j82593L0015
13642C23344K11879H9077L86664k01500M92146k01902p9222k25776L5778K21123
$$ y = [868881, 563608, 787141, 269719, 480583, 498634, 696141, 523827, 611295, 313879, 590912, 455549, 566348, 357227, 583053, 485560, 712100, 561508, 659612, 452242, 372494, 654720, 570692, 527279, 390391, 518231, 639297, 962063, 543293, 251899, 551402, 374785, 339001, 369003, 339353, 561606, 368486, 416907, 683529, 229601, 472136, 387869, 856597, 362810, 375040, 683611, 760618, 480543, 495210, 253666, 823282, 315445, 315030, 360527, 660905, 634591, 481568, 271465, 511398, 460579, 161968, 158980, 49707, 486165, 403291, 681789, 384807, 729878, 354191, 475922, 293329, 323344, 535223, 89077, 475741, 274241, 766387, 564485, 485263, 259487, 295265, 516388]
13632E16388r8332K0458n9552K09756B78915j09628J54644A11205N14560k1214
13622F04551A41796J12024J1391L73947j26580j58369j75989J03805d5035E38022
13611C71254j13520P113J8642R3934j48213J71575m4835K04380j32377J33780
13601E61733k24866j47138j9976L3602L04340n9500N8337j01053k518I2097L89556
13590D81653L8413K340D8727O53650C39830j6314E3855O16562l15572J40440A52754
13578F39680j75153M4472n8653k19678K26001Q573l0727k8172K28062k08528K37871
13567F63748B51303L59860B83408J84932A92436Q0492j19686K86384A65267M32149
13557E97416B19912K04799p0215A19935I115g8944B17303J23379C6775K86465
$$ y = [516388, 418056, 438514, 378962, 588718, 278915, 169287, 323931, 111205, 625765, 604551, 141796, 253820, 265211, 639158, 512578, 354209, 178220, 282025, -45035, 538022, 371254, 257734, 264847, 283489, 377423, 229210, 400785, 355950, 560330, 427953, 561733, 336867, 189729, 169753, 203355, 507695, 448195, 506532, 405479, 402961, 92097, 481653, 520066, 522406, 48727, 702377, 339830, 323516, 53855, 670417, 354845, 495285, 152754, 639680, 464527, 508999, 450346, 230668, 456669, 465242, 434515, 406343, 634405, 425877, 663748, 251303, 611163, 283408, 468340, 192436, 272928, 153242, 439626, 165267, 597416, 219912, 424711, 354496, 119935, 9115, -78944, 217303, 340682, 36775, 323240]
13547C23240j35624L00527r2003j21197a96871G3323J07112L5322N5522l5836
13537B35443F6337J81245L33193l2624k61249F5531L24340l5181H3223P7211P3525
13526B33959P9251c0739B46499J8573O7783K4642D8609J17592L47663q4957q6275
13515C42632F9948J88651O0367K7522K5550P098K64494a57781O9219k3499C22536
13503D02050o5231A47777P7398O8932P2987j06333j13263L35877B04359K42164
13493D46523j42651A06605J60864O0473O951J22443o4457A30698n2453J91510
13483B69755m5182O4056A13973a00625C07354l5571H9460L94207A96119G3934
13472E27119j28500K40613j55840j5558B16447J2712r6548J26503j607A16224
$$ y = [323240, 187616, 488143, 396140, 274943, -196871, 73323, 180435, 215757, 271279, 235443, 66337, 247582, 580775, 548151, 286902, 65531, 389871, 354690, 83223, 160434, 233959, 313210, -30739, 246499, 265072, 332855, 357497, 48609, 166201, 513864, 428907, 342632, 69948, 258599, 318966, 346488, 372038, 379136, 643630, -157781, -88562, -112061, 322536, 402050, 336819, 147777, 225175, 294107, 367094, 260761, 147498, 483375, 204359, 446523, 303872, 106605, 267469, 327942, 334893, 457336, 392879, 130698, 78245, 269755, 224573, 288629, 113973, -100625, 307354, 271783, 89460, 483667, 196119, 73934, 527119, 398619, 639232, 483392, 467834, 216447, 229159, 132611, 259114, 257507, 116224]
13461F6280J00549L46552A27999L7512J55606n8846J13270A37702J83778j58233
13451A63247M3045h1347G9483a12426I4077L42183A52327l904M6176L27926j38253
13440C84272Q4669A82652M3946E5652J58031N2517a6176H084K71659b2336j34119
13429a56455B84523A10416J99596j7370J7208j43443J48716l029J18722o0940
13419C69876j23821n024H3515f3646C9632J82673J22721C9923K81178J72146B12657
13407B50092I2735K06690n7674P3622A34977N31732B14404n2984J99208j03841
13397B56787o2383k908E9005b19596C20840G5032J99528Q234A37055K5785K70056
13386D32896j87910r927K606p443O7647m9914F7808b1744B34335G0866N3906n2143
$$ y = [66280, 166829, 513381, 127999, 165511, 321117, 262271, 375541, 137702, 321480, 163247, 206292, -81347, 79483, -112426, 94077, 436260, 152327, 148423, 194599, 522525, 384272, 468941, 182652, 226598, 55652, 213683, 266200, -16176, 8084, 279743, -22336, -156455, 284523, 110416, 310012, 292642, 309850, 166407, 315123, 312094, 430816, 369876, 246055, 241031, 83515, -63646, 39632, 222305, 345026, 39923, 321101, 493247, 212657, 250092, 92735, 299425, 241751, 315373, 134977, 666709, 214404, 161420, 360628, 256787, 194404, 191496, 59005, -219596, 320840, 75032, 274560, 282794, 137055, 162840, 432896, 244986, 235059, 237665, 230222, 297869, 247955, 67808, -21744, 234335, 70866, 124772, 72629]
13374G2629J45848m3507a3470D8019M18516A28631K39356R8071l499B15475B8905
13362B34012O3168O5503I3189c3052B62876G655i3808C15477q0768D4820j8941
13351B5879a36905A41277A061J56512K94129j74959P216L4361K59105j36423j17220
13340C23782k6159b87636F0501J18729K74147A04080B1299K92844a95908A13139
13329C01684l5826a42666j3960C35640g8935A07090a0143B33703e5058C7452K97256
13318C34708A51794j8925P0186J1891a0848C34805A34183j0804K74364G1254j0349
13307F0905e7347k1881q6602C48558a5482j12663A41029b33881J01870I0324f4668
13295B57125D0901J89474B5457J8202a46367B01207C7377K59009a60339A41616
$$ y = [72629, 218477, 174970, -13470, 48019, 466535, 128631, 367987, 466058, 462559, 215475, 28905, 234012, 297180, 362683, 93189, -33052, 262876, 7655, -93808, 315477, 234709, 44820, 25879, -136905, 141277, 1061, 157573, 451702, 276743, 283959, 318320, 577425, 441002, 323782, 297623, -287636, 60501, 179230, 453377, 104080, 21299, 314143, -195908, 113139, 301684, 265858, -142666, -156626, 335640, -78935, 107090, -10143, 233703, -55058, 37452, 334708, 151794, 132869, 203055, 214946, -10848, 334805, 134183, 123379, 397743, 71254, 60905, -57347, -79228, -165830, 348558, -15482, -128145, 141029, -233881, -132011, 90324, -64668, 257125, 40901, 230375, 25457, 43659, -146367, 201207, 37377, 296386, -160339, 141616]
13284h1658A94551O4616F3105K7661C2020e0250A26668J22617A18504j8120M2170
13273A42554e1306G9309B5432k213n22G535d0070A23252l3980Q6199Q3347A11547
13260B15242P2544c9493B53976a692A29986J67034j37495a53303J3614C88848
13249C75791c8786j29732O1556B11171J22542j08364N9818i9769j07987E4922
13238A41918b2290D9459a81955A00757a82917A45740N4442g8258B94960C7865
13227b619A59683p7211B7538M8904K25795G6387K21955A16773M1893D3153J52042
13216A95195J13674E9102K84192H867f251A80423i528C32926C562b83057c8087
13204a6358C28175A30164R4038k5787k1541K3017H0797L32489h6991A03958f6621
$$ y = [-81658, 194551, 259167, 63105, 90766, 32020, -50250, 126668, 249285, 118504, 100384, 142554, -51306, 79309, 25432, 23219, 22697, 7535, -40070, 123252, 89272, 175471, 258818, 111547, 215242, 287786, -39493, 253976, -1692, 129986, 297020, 159525, -153303, -139689, 388848, 375791, -38786, -168518, -106962, 211171, 333713, 225349, 285167, -99769, -207756, 54922, 141918, -22290, 49459, -181955, 100757, -182917, 145740, 200182, -78258, 294960, 37865, -2619, 159683, 82472, 27538, 76442, 302237, 76387, 298342, 116773, 158666, 43153, 195195, 308869, 59102, 343294, 8867, -6251, 180423, -9528, 332926, 3562, -283057, -38087, -16358, 328175, 130164, 224202, 198415, 176874, 199891, 80797, 413286, -86991, 103958, -66621]
13192b4846A78132b6366A03624Q5560J35432k6133a94590E3312b26111G0998j8056
13181E2942J29168A6647J70386c5224A53514J13252G026J17003K6672a9848l80229
13170d00077e274j61399B53395b28497c0962B21656P950E2643O3152I03R9188
13159A00091a0377A25972K44088j80444j7562h1976q28B65704G8685N3521b82261
13147a67594E1118a9503n1732a7263I080K88886F9753J07352c8025B08723A4090
13135b11410A78048C4699O2909f0891j61675A42760a53642m9750g5657A76492
13124A56071O0238o0801K99804F5270J46238A3171L65190q8634a62015A57360
13113d3531C65765d8072C89183L7135A06742H644J29668K2490a67903A65544b24074
$$ y = [-24846, 178132, -26366, 103624, 189184, 324616, 298483, -194590, 53312, -226111, 70998, 52942, 182110, 16647, 187033, -35224, 153514, 266766, 7026, 124029, 150701, -19848, -400077, -5274, -166673, 253395, -228497, -30962, 221656, 229606, 52643, 115795, 903, 100091, -10377, 125972, 370060, 189616, 172054, -81976, -82804, 265704, 78685, 132206, -282261, -167594, 51118, -19503, -71235, -17263, 9080, 297966, 69753, 177105, -38025, 208723, 14090, -211410, 178048, 34699, 97608, -60891, -222566, 142760, -153642, -203392, -75657, 176492, 156071, 216309, 155508, 455312, 65270, 211508, 13171, 378361, 289727, -162015, 157360, -43531, 365765, -48072, 389183, 426318, 106742, 8644, 138312, 160802, -167903, 165544, -224074]
13101a73719c5713E8550A493J42562N1636f5219H5032A4332c7722D918L1436L5788
13089G2142K72705b32292g4424H8381k1716K36100j21858K6537b6287A96826b5387
13077A45380n2196P5503J112O3691a79411A25485L1775F9629M7150f5191B06290
13065A77355J17766e7343B79485q4919g7492D95774m0991b9532a278k30556h6482
13053B0506J36070h2507F3240J2065b3556C67107F0393J2666j1682a77813D4152
13041A82669c78377e994C22596A46257b45373H6125C2259J36151J66061A29689
13030A51338c5970A51970B7851K04803j00133b20948C3218K98180A21777h554
13019C47061E1348b56635O2786C44467j56279d2729r1351B75865D515a9832B41187
$$ y = [-173719, -35713, 58550, 1493, 144055, 195691, -65219, 85032, 14332, -37722, 4918, 36354, 72142, 344847, -232292, -74424, 88381, 66665, 302765, 180907, 207444, -26287, 196826, -25387, 145380, 93184, 168687, 169799, 233490, -179411, 125485, 157260, 69629, 116779, -65191, 206290, 177355, 295121, -57343, 279485, 194566, -77492, 495774, 454783, -29532, -1278, -231834, -86482, 20506, 156576, -82507, 63240, 75305, -23556, 367107, 60393, 73059, 61377, -177813, 44152, 182669, -378377, -5994, 322596, 146257, -245373, 86125, 32259, 168410, 334471, 129689, 151338, -35970, 151970, 27851, 232654, 132521, -220948, 33218, 331398, 121777, -8554, 347061, 51348, -256635, -193849, 344467, 188188, -42729, -134080, 275865, 4515, -19832, 241187]
13007C16528K01210c4702C08095b18882F04239a83868G3181a78370j3705J5974
12997a76101B0725e0353A12837P0639E0938e797n7510r7391d4797A56311o0562
12986I5749g2712k5284b2630J893B85427D2183b8665j76814d160l8001m5526o0432
12974a48119E8316K06653c9142m2882b2432G9786K73567a52410A64295J44067
12964C08362j19783h8673A48701m0660f1461j20799A06550h680A6269J74107a14618
12952C32848j34941h918B53957c34362C44404a76920B63224a12871j90106C9759
12941a74207D7515d10268A5095a50110i036j1910B30344J9698j24049l6972h7835
12929g1227A92857a58667e7514h385o0698A8705L976O1605B368J92212a00694
$$ y = [316528, 517738, -34702, 308095, -218882, 604239, -183868, 73181, -178370, -192075, -176101, 20725, -50353, 112837, 183476, 50938, -5797, -63307, -160698, -44797, 156311, 95749, -72712, -97996, -22630, -20737, 285427, 42183, -28665, -205479, -4160, -42161, -87687, -148119, 58316, 264969, -39142, -82024, -22432, 79786, 353353, -152410, 164295, 308362, 188579, -88673, 148701, 108041, -61461, -182260, 106550, -8680, 16269, 190376, -114618, 332848, 197907, -8918, 253957, -334362, 344404, -176920, 263224, -112871, -302977, 39759, -174207, 47515, -410268, 15095, -150110, -9036, -20946, 230344, 250042, 125993, 89021, -87835, -71227, 192857, -158667, -57514, -8385, -69083, 18705, 22681, 84286, 2368, 194580, -100694]
12917a86013A25741A7915R7493a8303o3526C7104i6447E3382b05041F4822Q2864
12906A47686b05226h3852A01889g0590A6032J50379a59540j70493B07165g8181
12895B0577K72768E6140k3224K53018a83057q5908A63913H400K15006a24724a7977
12883c4032C2113d5827A87362r756H1393a15252A71956m0581K88422a57142A53877
12871A84009I837J21013l053n7162N0761a98714g7860E7162M0679J25175g4414
12859A16037O1292b5922A39720n8427J56366E4232a20834A70402c4353k48275
12849b82628C70823n8281a37463A0664a40524d5219D429b24081J9052D7941e2907
12837a62669e8969q1294a522m2579A05782J41561b92485A54732m366o2870C8128
$$ y = [-186013, 125741, 17915, 115408, -18303, -81829, 37104, -96447, 53382, -205041, 64822, 147686, -205226, -83852, 101889, -70590, 16032, 166411, -159540, -330033, 207165, -78181, 20577, 293345, 56140, 32916, 285934, -183057, -268965, 163913, 8400, 223406, -124724, -17977, -34032, 32113, -45827, 187362, 177606, 81393, -115252, 171956, 131375, 419797, -157142, 153877, 184009, 9837, 130850, 127797, 70635, 121396, -198714, -77860, 57162, 97841, 223016, -74414, 116037, 177329, -25922, 139720, 81293, 237659, 54232, -120834, 170402, -34353, -282628, 370823, 312542, -137463, 10664, -140524, -45219, 4429, -224081, -205029, 47941, -52907, -162669, -58969, -140263, -1522, -44101, 105782, 247343, -292485, 154732, 150366, 87496, 38128]
12825B42510g0313J0732j7939q336G2540J14258b14462E2707a67546A10810a86473
12813C0557e5665o4467j97635B89568P6348o0310a00488A65759b62053F0835e5505
12801a362B99791a38693A57364G8310k642f4519F0717i125G6484R8045a41497
12789A93165A3075P0054Q9492B4214c73593A55071j1146h7992C33450j35459K0896
12778B18887F0968a09826A14800C0101J76188q2776a50543d0809j0002B1079O3099
12767H4178a58739B2649K87600a25824C40372A52110a01263G66L87566a12309
12756b26927M7538H8693a04482A50293L2816k1469c87374B7796L0490c8722D379
12744B96250A13186a28206N1051J8307k32920C00621b14167f8580B68141b19808
$$ y = [242510, -70313, -59581, -77520, -85856, 72540, 186798, -214462, 52707, -167546, 110810, -186473, 30557, -55665, -120132, -317767, 289568, 365916, 305606, -100488, 165759, -262053, 60835, -55505, -1362, 299791, -138693, 157364, 78310, 75668, -64519, 60717, -9125, 76484, 174529, -141497, 193165, 13075, 83129, 172621, 24214, -373593, 155071, 143925, -87992, 333450, 197991, 218887, 60968, -109826, 114800, 30101, 206289, 123513, -150543, -40809, -50811, 21079, 84178, -158739, 22649, 310249, -125824, 340372, 152110, -101263, 766, 388332, -112309, -226927, -179389, 88693, -104482, 150293, 183109, 161640, -387374, 27796, 58286, -38722, 4379, 296250, 113186, -128206, -77155, -58848, -291768, 300621, -214167, -68580, 268141, -219808]
12733F6688J29893a02827C43946j23087i1861d1485r5412c5692C73674a84439
12722B256R6725N2532a1809A38707O9959o5459g7448j83680A48796N5621d9610
12710A34482L74711a973B14079o7366Q126C0402Q6844Q3693K8710k0693c54642
12698c31786g4034i798q8469b0241k40490g9637L7471A42673G368a10045B92150
12686B63444a23714C13903J61153I5837J26188f3284A06330c04737a8401B24715
12675C1698J2658Q9349i6367B69507A19385F64J1394J31518J7468h7736j72928
12664b60664A66524B0584N657b16999Q590H0239J39418H1266F117K12493A9555
12652B0004J4418K9861B5365j2133L74305b15077B92235A14086N8401K0481a85264
$$ y = [66688, 196581, -102827, 343946, 220859, -91861, -41485, -136897, -35692, 373674, -184439, 2256, 98981, 151513, -11809, 138707, 208666, 143207, -77448, -261128, 148796, 204417, -49610, 134482, 509193, -1973, 214079, 146713, 154839, 30402, 117246, 200939, 229649, 208956, -354642, -331786, -74034, -9798, -98267, -20241, -260731, -79637, -42166, 142673, 7368, -110045, 292150, 263444, -123714, 313903, 475056, 95837, 222025, -63284, 106330, -304737, -18401, 224715, 31698, 44356, 133705, -96367, 269507, 119385, 664, 12058, 143576, 161044, -87736, -260664, 166524, 20584, 26241, -216999, -208409, 80239, 219657, 81266, 6117, 218610, 19555, 20004, 34422, 64283, 25365, 13232, 387537, -215077, 292235, 114086, 172487, 192968, -185264]
12640d9882a5412P247A70192a48645F7698d69644A38683a43139C72308l2800j1248
12629C28260C7596L09821l4642K68911A70755l6690m6480J54812J46801k9664
12619C59534A32900J8139h9670C34520d2107A05124m6190B5712L81430j56893
12609B50249n6750R4588e4955B28776a983B24257a66086N4534D14089A46260n1233
12598I5027J19009J20027a10676C644b81110B0127c65072g3607j9003D4719e5600
12586a72644A09271N0006J08108A2565b1512C21041i1391k42106E2115f5583A35745
12574C5337b83694A49675m7098a63522I296a02868L237B07835N6550c27589B74362
12562C30822C8439a57579D11550F2660M2926J06661c0469o3041B61937a11847
$$ y = [-49882, -15412, -8165, 170192, -148645, 67698, -469644, 138683, -143139, 372308, 339508, 328260, 37596, 347417, 312775, 581686, 170755, 134065, 87585, 242397, 389198, 359534, 132900, 151039, -89670, 334520, -42107, 105124, 58934, 25712, 407142, 250249, 193499, 288087, -54955, 228776, -1983, 224257, -166086, -111552, 414089, 146260, 95027, 214036, 334063, -110676, 3644, -281110, 20127, -365072, -73607, -92610, 44719, -55600, -172644, 109271, 159277, 267385, 12565, -21512, 321041, -91391, -333497, 52115, -65583, 135745, 35337, -283694, 149675, 102577, -163522, 9296, -102868, -99631, 207835, 264385, -327589, 274362, 330822, 38439, -157579, 411550, 62660, 105586, 212247, -30469, -93510, 261937, -111847]
12551b4956J0971H6427i2381O848n7692D1290g6754l04312J29515h3476A43561
12539A26080b75145O7608A31422A6588K45188b34285p9442E33189A80161H890
12528D0515i3329k6015r2816A98135o4129f2376K5877k23547d1370j50095R4907
12517i6558J234A12860J39912R1407I6961b61091C86851b1467A18432J25442l0362
12506B13512l4943a56618k41330J52990P5303R658g914B60660h7223c3535B87424
12494I236a73653g1543b6153A4317a12512C829P5432c27186A28052B1330J61402
12483A82732D4457b79315J17919d0576k82533a24382I4285J53051a22965r2825
12473b15790F5762g624m9119a3971D4809g9311r8322d2135I660J07316H334J86425
$$ y = [-24956, -13985, 86427, -92381, -85533, -143225, 41290, -76754, -381066, -251551, -83476, 143561, 126080, -275145, -207537, 131422, 16588, 261776, -234285, -313727, 533189, 180161, 8890, 40515, -93329, -119344, -212160, 198135, 134006, -62376, -36499, -260046, -41370, -191465, -96558, -95324, 112860, 252772, 344179, 96961, -261091, 386851, -21467, 118432, 243874, 213512, 178569, -156618, -397948, -244958, -169655, -159997, -7914, 260660, -87223, -33535, 287424, 9236, -173653, -71543, -26153, 14317, -112512, 3829, 79261, -327186, 128052, 21330, 182732, 44457, -279315, -161396, -40576, -323109, -124382, 94285, 247336, -122965, -215790, 65762, -7624, -56743, -13971, 44809, -79311, -177633, -42135, 9660, 116976, 8334, 194759]
12461A94759b01434Q4512N966b4884A04882g7377n7546j4198o8405A8619a24652
12449A80994a24981j49351A7110J37982n629M77m851a57451D52368A78729b52973
12437b6191m9370q5684A42279C5954b6997Q729j73030A09215d54099e6248G7719
12425D18260j32145F8731M6845f1356A34960o4154a34427B09254P3944B8630K59812
12414B88442e041A99184g1721b6522l8722A53750c23351A22367a60460A32608
12403A39106A5603J28028b96991E3349a5183k11049N9962N4502B84619j4324J20117
12392C90412H9863d1681G8266J5601a3340k02198A8229d07020A54209J81991C1005
12380a27587f0183L48B15785j03376M0449d929l86393a32131Q900B77549b00910
$$ y = [194759, -201434, -116922, -110956, -24884, 104882, -77377, -134923, -149121, -217526, 18619, -124652, 180994, -124981, -274332, 17110, 155092, 149463, 149940, 145089, -157451, 452368, 178729, -252973, -26191, -75561, -161245, 142279, 35954, -26997, -18268, -191298, 109215, -454099, -56248, 77719, 418260, 286115, 68731, 115576, -61356, 134960, 70806, -134427, 209254, 283198, 28630, 288442, -5041, 199184, -71721, -26522, -65244, 153750, -323351, 122367, -160460, 132608, 139106, 15603, 143631, -296991, 53349, -15183, -226232, -166270, -111768, 284619, 270295, 390412, 89863, -41681, 78266, 93867, -13340, -215538, 18229, -407020, 154209, 336200, 31005, -127587, -60183, -59835, 215785, 112409, 152858, -4929, -391322, -132131, -123231, 277549, -200910]
12368A1154J89703F287K03508p1581b13975d0221r4930l9584j07003G4932O042
12357H0974M6247d699F0872a44236C75068C2193Q6385b56649A63922j8754b58701
12345a03056A80036G0241d79173e1392P215B24465D4585L35602c8925j1040k6912
12334g6877j07024F770d7426D9367i3471j30573J9242A01014J03485G4051k7092
12323D6959J00273d8338j81174H9771J14156g2219n7413B53682a50390A81760
12312b01212d2212A21367Q017b72555a26557J4657p9423g0502F1392e5231q6697
12301a41928A72588G1633b69667A72267b08550B6741K2576f3258B41539c02862
12290b33257j27672F605N6661A7629Q7836m2837P9492C8712J19451J08945b56336
$$ y = [11154, 200857, 6287, 209795, 138214, -213975, -40221, -135151, -174735, -281738, 74932, 80974, 127221, -4699, 60872, -144236, 375068, 32193, 118578, -256649, 163922, 145168, -258701, -103056, 180036, 70241, -479173, -51392, -44177, 224465, 44585, 380187, -38925, -49965, -76877, -183901, 6770, -47426, 49367, -93471, -224044, -204802, 101014, 204499, 74051, 46959, 147232, -48338, -229512, 89771, 203927, -72219, -129632, 253682, -150390, 181760, -201212, -42212, 121367, 129384, -272555, -126557, -111900, -191323, -70502, 61392, -55231, -141928, 172588, 71633, -269667, 172267, -208550, 26741, 49317, -63258, 241539, -302862, -233257, -360929, 6605, 63266, 17629, 105465, 62628, 142120, 38712, 158163, 267108, -256336]
12278d6546r7786F4672L2895J89534j36161N4050I1100Q9792q0632a3166B29070
12266A46413J87703m2279A8459N5686J27873R4958h1194B2200J56875E0688K71149
12255C21837I3965a60377g7831A00086D8723b5956C4924P3623k0425P8051E9333
12243d0114B95112d5951L255B04960D006N8507a72791C03977o7857n6347l2026
12232A47747J97064e1442j78107B30884a71400C09441g832C00184r5451O130J11654
12221C22517K6642p4298g3907D37566H2249i6241B23669B6000O5857N2063a358
12209H1349g479B53971J90954A77688q2976a56888B26053K8977o1067E1432K80290
12198C31722L0556C3219J70447J36455E0954K20972J7185l4502A0107b74165A52741
$$ y = [-46546, -144332, 64672, 97567, 287101, 150940, 204990, 91100, 180892, 100260, -13166, 229070, 146413, 334116, 291837, 18459, 74145, 202018, 296976, -81194, 22200, 179075, 50688, 321837, 93965, -160377, -77831, 100086, 48723, -25956, 34924, 108547, 88122, 166173, 59333, -40114, 295112, -45951, -42696, 204960, 4006, 62513, -172791, 303977, 236120, 179773, 147747, 344811, -51442, -229549, 230884, -171400, 309441, -7832, 300184, 204733, 210863, 322517, 349159, 274861, -73907, 437566, 82249, -96241, 223669, 26000, 91857, 143920, -1358, 81349, -7479, 253971, 444925, 177688, 94712, -156888, 226053, 255030, 193963, 51432, 331722, 362278, 33219, 203666, 340121, 50954, 271926, 289111, 254609, 10107, -274165, 152741]
12186b8114B37350d472D33414A19613O8188f8609A37299M242K18444o6380C0716
12174C59997a06111B95009m922b7872A47424b30670C13359a1288C66326F4106
12163A92273J85140g2583j18359B07876h4551a9534D9481a7067p04A06761O614
12152A13375b524E6752J00720F3793K6386c1598G1760L27507r5058a97797A77294
12140C2550i035o2963A2196R9448P485N5690F869Q9548E373J03310C2227P1485
12128A03712P8748b05214B8639J11284B0519M61634c94583g0472m1716I0477K97357
12117C87834A53461d0408E151e3667k43151A79751K55161a71896H3947L345l5216
12106E2076f7957c0991F7395d9031o8252c203C1511c7164E5382J63968a62375
$$ y = [-28114, 237350, -4472, 433414, 119613, 187801, -68609, 137299, 141541, 359985, 293605, 30716, 359997, -106111, 295009, 290087, -27872, 147424, -230670, 313359, -11288, 366326, 64106, 192273, 377413, -72583, -190942, 207876, -84551, -19534, 49481, -17067, -17771, 106761, 113375, -2524, 56752, 157472, 63793, 90179, -31598, 71760, 399267, 304209, -197797, 177294, 32550, -9035, -71998, 12196, 111644, 119129, 174819, 6869, 96417, 5373, 108683, 32227, 103712, 182460, -205214, 28639, 139923, 20519, 482153, -394583, -70472, -112188, 90477, 387834, 153461, -40408, 5151, -53667, -296818, 179751, 434912, -171896, 83947, 87292, 52076, -67957, -30991, 67395, -49031, -117283, -3203, 31511, -37164, 55382, 219350, -162375]
12094i7090B39582a5873l53409G5955a36231j94608a14812B55841K0082b31372
12083A23357h5974A32739B6999R0772K83282L16633J351035C46354q337j57367
12073A80650b09664L1803A82402G5756b46117E1953D031b55856A0912M24797l3997
12062D01712l5917h474j24569B89879A24817b36409g0197l46465J53501C14078
12051e234A50347C6224f0239k5523E5078e6233A19423i2455H935K8524G147c274
12038a34195M0501R514A3725Q454P1180e3025A81119d3370F1955J7771a74129
12026B77077b068j3370j3594C03808l6402h1828a104A02039a39197q5979A47137
12014d07280C1239J77699n0186K18800b27943E2008L1705N054c36009B30658a16160
$$ y = [-97090, 239582, -15873, -369282, 75955, -136231, -330839, -114812, 255841, 275923, -231372, 123357, -85974, 132739, 26999, 117771, 401053, 717686, 2068721, 346354, 338017, 180650, -209664, -177861, 182402, 75756, -246117, 51953, 4031, -255856, 10912, 435709, 401712, 365795, -8474, -133043, 289879, 124817, -236409, -70197, -416662, -263161, 314078, -5234, 150347, 36224, -60239, -85762, 55078, -56233, 119423, -92455, 8935, 37459, 7147, -3274, -134195, -93694, -84180, 13725, 22179, 93359, -53025, 181119, -43370, 61955, 79726, -174129, 277077, -2068, -15438, -29032, 303808, 267406, -81828, -1104, 102039, -139197, -225176, 147137, -407280, 31239, 208938, 158752, 377552, -227943, 52008, 83713, 88767, -336009, 230658, -116160]
12002G9685a32515c621r0992p0573B36873b5802k34863A55708a9019A51437B5552
11990E8974a59983f3171r4756F5053a6332k82257B35120a08672j1253M9160F3925
11978B75961b5015G7003C3621K86729g982B90525H1825J57631g3370b9828j07352
11967a37180a471F3769a42571H98J12218C6374a32197k7455C80276c29853N317
11956c24536e480k0638D3482Q8754e2708k16022M9192n4014M2987B29389c36492
11944c4905B87980J09107A0889c17771Q706A18538i8199m5102L095A08004d4425
11932a29036j79598H8110k0866A2789J30419F6845P9332Q370a36336N1733c1784
11920a00693P468J5864j8458A59567J31626k830a95902L2139B11374A04826P5344
$$ y = [79685, -132515, -3621, -94613, -165186, 236873, -25802, -260665, 155708, -19019, 151437, 25552, 58974, -159983, -63171, -157927, 65053, -16332, -298589, 235120, -108672, -119925, -70765, 63925, 275961, -25015, 77003, 33621, 320350, -7982, 290525, 81825, 239456, -73370, -29828, -137180, -1471, 63769, -142571, 898, 113116, 36374, -132197, -159652, 380276, -329853, -324536, -5480, -26118, 43482, 132236, -52708, -268730, -219538, -273552, -230565, 229389, -336492, -34905, 287980, 397087, 10889, -317771, -309065, 118538, -98199, -143301, -140206, 108004, -44425, -129036, -308634, 88110, 67244, 12789, 143208, 66845, 146177, 154547, -136336, -84603, -31784, -100693, -93225, -77361, -95819, 159567, 291193, 288363, -195902, -163763, 211374, 104826, 180170]
11909A80170a02584d7447j63398D16894a07419l45463a26517M1462K2173I8540
11898E658f8427k63616e9496j11559C5087J4639J6679a18947j19950l4820B5164
11886A49731n8303a61930F769J01356R525a99760A37686b90602A87040h8746k83531
11875c72277a61621j62145A72393L9577a84023n6563B7327h6392q9361E7606L18564
11864C76170a45944E9819a59586A70650G9129A372a18086j6710A40863a17488
11853a42297c406D9105g6300B15996a47164H4579k630f2153j88469d820p7210
11842h2030j04006A84665a09101d4080B81555A40403a38352r3721G2116J09087
11832A81203d29717b64j98914C8575a83989A03555C8343b72160A24359a32508
$$ y = [180170, -102584, -47447, -210845, 416894, -107419, -452882, -126517, -85055, -62882, 98540, 5658, -68427, -332043, -59496, -171055, 35087, 49726, 66405, -118947, -238897, -273717, 25164, 149731, 91428, -161930, 6769, 108125, 117650, -199760, 137686, -290602, 187040, -88746, -372277, -161621, -323766, 172393, 211970, -184023, -240586, 27327, -86392, -175753, 57606, 376170, -145944, 59819, -159586, 170650, 79129, 1372, -118086, -134796, 140863, -117488, -142297, -3406, 49105, -76300, 215996, -147164, 84579, 81949, -62153, -250622, -4820, -82030, -186036, 184665, -109101, -44080, 281555, 140403, -138352, -232073, 72116, 181203, -429717, -264, -199178, 38575, -183989, 103555, 38343, -272160, 124359, -132508]
11821A9076b1203p8084C52431i4062d3021h250E3181P0097M1011a26863p2499
11810a99362A46785h8590j45716g0408K4428J7914E0110a3148p2759P487n7921
11799a36341B62092A8266a38127A55073b55087I2516b8803k48920H5490c6455
11788F6015J44170K5951a9437m938k2953B61640H1053K4702a55198b6285j365
11777b7650A18676f095F8846b7821F8408c13622A04730K6514B1498c87712A19211
11765b8512l866A02671D9134a17854j43224E5229d2148k40557c2923j01193B3329
11753h1058B81429a78277I9051a12913d7299A14902a20814B06906D2040b85991
11742b69447L4091A6646K28778K0209D0041b07950j0554A4005a31186C57750A77905
$$ y = [19076, -21203, -99287, 352431, -94062, -43021, -8250, 53181, 123278, 164289, -126863, -199362, 146785, -88590, -234306, -70408, -45980, -28066, 50110, -13148, -85907, -78420, -136341, 262092, 18266, -138127, 155073, -255087, 92516, -28803, -277723, 85490, -36455, 66015, 210185, 236136, -19437, -24375, -47328, 261640, 81053, 105755, -155198, -26285, -27650, 118676, -6095, 68846, -27821, 68408, -313622, 104730, 131244, 21498, -387712, 119211, -28512, -32378, 102671, 49134, -117854, -261078, 55229, -42148, -282705, -32923, -134116, 23329, -81058, 281429, -178277, 99051, -112913, -47299, 114902, -120814, 206906, 42040, -285991, -269447, -235356, 16646, 245424, 265633, 40041, -207950, -218504, 14005, -131186, 357750, 177905]
11730a7778F6790N1808B7808b35219A85467k2491b49247I8163J02594c17342a06315
11718a8378A99039C4092M9892h7678l3451A03187d7658I8620B6655o137R1114
11707A11632A6041i4709c8069A56617h2055A02125J76788A7933b56540B4349J18004
11696A42353O2827P0043a2307m1855A48019K00377d13780E90680e250A65709K62656
11685D28365e1794k9369F9805J66562n6937a68705B62411a34480A23928l8263
11675H5665c9155j17707A56342b94746i2123C54334j59171b77230A01504d1800
11664B54784E4343f5726E8588P208J70296q1230k9534o1673P9530C7317b62210
11652b16100O0062j55012J31801I2664a47565A2283L9257i034A4822M9524d248
$$ y = [-17778, 66790, 118598, 27808, -235219, 185467, 162976, -249247, 98163, 200757, -317342, -106315, -18378, 199039, 34092, 83984, -87678, -121129, 103187, -47658, 98620, 26655, 20518, 111632, 16041, -94709, -38069, 156617, -82055, 102125, 278913, 17933, -256540, 24349, 142353, 205180, 275223, -12307, -54162, 148019, 348396, -413780, 590680, -5250, 165709, 428365, -51794, -81163, 69805, 236367, 179430, -168705, 262411, -134480, 123928, 85665, -39155, -156862, 156342, -294746, -92123, 354334, 195163, -277230, 101504, -41800, 254784, 54343, -65726, 58588, 65796, 236092, 154862, 125328, 63655, 143185, 37317, -262210, -216100, -156038, -311050, -179249, 92664, -147565, 12283, 51540, -9034, 14822, 64346, -4248]
11640A42342i8901C68718C1576c4767H2732a89302d6198C54393j30419J35728
11630C59702e1299A07704b36994d0049A50246h7229A44009f3114C4607K78398
11620C13005c3153G7545g661F0010i5793G9681b53813A95890F9846k1026J14502
11609A63322n9640H677d6486o7053A59673a44818i146C59920A03988c4923l13191
11598c48114E6566J01618C3825J8826M0407P8927i1325B24530K5051b41039h3429
11586B72056a92920C14527p7606l9293a16293K1214B22546b49556H4486j1639
11576G2847K30823j50954J44448F3774M6271D3938j4164b08979i586m4919A03574
11564b1239A70317M7587p7459O187K40987j79285K76219h9249l0899G3831B4282
$$ y = [142342, -98901, 368718, 31576, -34767, 82732, -189302, -46198, 354393, 223974, 359702, -51299, 107704, -236994, -40049, 150246, -87229, 144009, -63114, 34607, 313005, -33153, 77545, -7661, 60010, -95793, 79681, -253813, 195890, 69846, 48820, 163322, 103682, 8677, -46486, -113539, 159673, -144818, -9146, 359920, 103988, -34923, -348114, 56566, 158184, 33825, 52651, 93058, 171985, -91325, 224530, 249581, -241039, -83429, 272056, -192920, 314527, 236921, 197628, -116293, -95079, 222546, -249556, 84486, 72847, 303670, 152716, 297164, 63774, 110045, 43938, 29774, -208979, -9586, -54505, 103574, -21239, 170317, 217904, 140445, 146632, 387619, 208334, 484553, -89249, -120148, 73831, 24282]
11552B6199Q3676h0652F2629b57497C0009J05001o6895J7209K38044j05189F6446
11540g1432A60858a60338n731A95514D234h4482D59180A26911D7384g696j4524
11529b2220B62457c8369B89286j39717L33255a28693A33514b92471a40626B81893
11518a9417o1629C1337a50639C72047j74469D8364a33339C7739M04597b09506
11507B37911a15188A04343e3315A3806a40855A0266J27665G407L9602j2491a27161
11495H7001A5561Q6474e9671r2885A81854l3569h3635B4077J41206K9167g4517
11483B36484a47396B77883H1448J1432b4702C47003E159J26005g8103A28283R6192
11472B24475o7820K24480e295C22411M4831A60851o6120E728i3162C71170d7279
$$ y = [26199, 109875, -80652, 62629, -257497, 30009, 135010, 68115, 85324, 323368, 218179, 66446, -71432, 160858, -160338, -166069, 195514, 4234, -84482, 459180, 126911, 47384, -7696, -22220, 262457, -38369, 289286, 149569, 482824, -128693, 133514, -292471, -140626, 281893, -19417, -81046, 31337, -150639, 372047, 197578, 48364, -133339, 37739, 442336, -209506, 237911, -115188, 104343, -53315, 13806, -140855, 10266, 137931, 7407, 47009, 34518, -127161, 87001, 15561, 102035, -59671, -152556, 181854, 148285, -83635, 24077, 165283, 194450, -74517, 236484, -147396, 277883, 81448, 92880, -24702, 347003, 5159, 131164, -78103, 128283, 224475, 156655, 381135, -5295, 322411, 367242, 160851, 94731, 5728, -93162, 371170, -47279]
11460G4642K43221A19858b915j25706A37687h5995j467C55444p0438c3321j36497
11449a69818a5473F3586R1797h9114K6904A17329D5429g8903A68231M3658d962
11437D36064I7925J62229A1158K5053N9632a04564m8257K2719j92768N9438a13039
11425d259A2243l32J9064b27305Q7934C13884A50871a32827k65477f4780q0271
11414a45051B08163J320c20436N7924A12906b91302g1297A55018J07285i6451
11403g7883G9653a00068r9197D08741j70984j417R201A11646a09252G624J0291
11392A7915a67596C45176a52539N3107D5389J24995J2840a53496A95926i9314
11381H6582J68837e2414I2896b82708A88152K3924b59471a07563p7197H9694J59856
$$ y = [74642, 317863, 119858, -2915, -128621, 137687, -85995, -87462, 355444, 285006, -33321, -169818, -15473, 63586, 155383, -89114, -62210, 117329, 45429, -78903, 168231, 211889, -4962, 436064, 97925, 260154, 11158, 36211, 95843, -104564, -152821, -130102, -322870, -263432, -113039, -4259, 12243, 11911, 30975, -227305, -139371, 313884, 150871, -132827, -398304, -64780, -145051, 208163, 209483, -320436, -262512, 112906, -291302, -71297, 155018, 262303, -96451, -77883, 79653, -100068, -199265, 408741, 237757, 236340, 245541, 111646, -109252, 7624, 17915, -167596, 345176, -152539, -99432, 45389, 170384, 183224, -153496, 195926, -99314, 86582, 255419, -52414, 92896, -282708, 188152, 212076, -259471, -107563, -184760, 89694, 249550]
11370B49550A00334R554c9164m4293K8924k28616B02529a74839E3864M38539c9585
11358b20798B84063a4493A37131L4373B2517b3971A15868d8410C57987K7685a22060
11346G3603a86317J9104k85880B07667a64504a7856A09882K3622a89052A27152
11335A8137a92703d1007m4516k52798g2346p3877C7961j0115c81446g2290L5244
11324c7046B04577b94338l5002A00094J11401a6669k82613D9835B106d12439J07809
11313c04630H8580a03720j44567d310o3765j1700j7151I5795c22940c0967j15451
11302a46418D5882K15058a20790b6160C6787a1103k56572B80273b6312C8859K86121
11291C24980b0827o1747b7874k3998J0439j9600A76944a55517B19828p8214g6255
$$ y = [249550, 100334, 109888, -39164, -83457, -54533, -283149, 202529, -174839, 53864, 492403, -39585, -220798, 284063, -14493, 137131, 171504, 22517, -23971, 115868, -48410, 357987, 385672, -122060, 73603, -186317, -167213, -453093, 207667, -164504, -17856, 109882, 133504, -189052, 127152, 18137, -192703, -41007, -85523, -338321, -72346, -146223, 37961, 27846, -381446, -72290, -37046, 204577, -294338, -329340, 100094, 211495, -16669, -299282, 49835, 2106, -412439, -304630, 88580, -103720, -248287, -4310, -68075, -79775, -96926, 95795, -322940, -30967, -146418, 45882, 260940, -120790, -26160, 36787, -11103, -267675, 280273, -26312, 38859, 324980, -20827, -82574, -27874, -51872, -41433, -61033, 176944, -155517, 219828, 141614, -76255]
11279f6651I4711b600k12460C27284A2537J40664L121f9568B63771d50695D517
11267a47337f8325j63593h5822A37225K00504e8306A18427e9745k79522A45133
11256a66744O3668n5384j91067C11174j40514g9584A26351a09945C0365G716i6333
11244B8387Q4421i3936m2446f2241A07868K861k4661P832R9244f6609b3242I3096
11231b9322A2759h8107J2246j2855F6879K3276a19174G6340a72625j8217l477
11220a94319g5679K4437j27886m1137R7554K0714J8860n8659m9560O7362q7453
11209b11447e8105l59142A88245e370k26203C39024d58476b28269i7175A07200
11198G7703N8070d9160j81828C67697a26674C2299b7365l19820a40909E9796b23005
$$ y = [-66651, 94711, -2600, -215060, 327284, 12537, 153201, 156322, -69568, 263771, -450695, 4517, -147337, -68325, -231918, -85822, 137225, 337729, -58306, 118427, -59745, -339267, 145133, -166744, -103076, -158460, -349527, 311174, 170660, -79584, 126351, -109945, 30365, 7716, -96333, 28387, 112808, -93936, -136382, -62241, 107868, 110729, 86068, 93900, 193144, -66609, -23242, 93096, -29322, 12759, -88107, -75861, -88716, 66879, 90155, -119174, 76340, -172625, -190842, -194319, -75679, -51242, -179128, -220265, -122711, -101997, -83137, -141796, -191356, -123994, -211447, -58105, -417247, 188245, -5370, -231573, 339024, -458476, -228269, -97175, 107200, 77703, 135773, -49160, -230988, 367697, -126674, 32299, -27365, -347185, -140909, 59796, -223005]
11186A59859b44379H0896g0007j0470B4530K24049c7914j8578H3374a70518B63717
11174a18127c1042j2866a0815k21649A33093a14737j2590A62857A3812a09372
11163B1604a07185K7369B35793N9873A39794E7643A502K5922b95492a26141N8206
11152f7935B86324c59257J76323j14391b1150j26506j00083A22319m7409J18952
11142A93862f0837H8818Q1481A7641b06904Q3198g667B2032L91076f9700B00406
11130g159B18802M101b08216B53603I8350j9335J06037e8926B09294F3181K6851
11119I0032J56713f0938B31986l2534e1033j76900B43989D6905g4876j42737A01223
11107B17588j04297D8723J8466a85287b1381A90455o2338M6714n432b07548g8236
$$ y = [159859, -244379, 80896, -70007, -80477, 24530, 248579, -37914, -56492, 83374, -170518, 263717, -118127, -31042, -43908, -10815, -232464, 133093, -114737, -127327, 162857, 13812, -109372, 21604, -107185, -79816, 235793, 295666, 139794, 57643, 1502, 27424, -295492, -126141, -67935, 286324, -359257, -182934, -297325, -21150, -147656, -247739, 122319, 74910, 193862, -60837, 88818, 170299, 17641, -206904, -123706, -7667, 22032, 413108, -69700, 200406, -7159, 218802, 222903, -208216, 253603, 98350, 79015, 185052, -58926, 209294, 63181, 90032, 246745, -60938, 231986, 199452, -51033, -227933, 243989, 46905, -74876, -217613, 101223, 217588, 113291, 48723, 67189, -185287, -21381, 190455, 128117, 174831, 169399, -207548, -78236]
11095B20017J14890b23119C2162P7978i0043B80787A35373K53157j02608j5829
11085B70093e4635C17612e4065A09288L0774K54158O0494A07275L81265D2205
11074C2939K33292L42341k97514j05286N55928B86649N1891b3755D64006M8556
11064E12562H8988R3153K85009K94776l61998M2126j7301l0694O792J56787K30452
11053G88090C8958K69215N54618l02604j29785M0947N37644m54642k34574M71393
11043G91170J11764D28276L72240r3879q62k58768L5180J66998J01069j94051
11033E56203q2859j87793J44375J07088O2855L87315m28559j03362J62998K60194
11023H78455j43163J30205j76422R8241j42483B00563M27533B49818K81516k6821
$$ y = [220017, 334907, -223119, 32162, 110140, -90043, 280787, 135373, 388530, 285922, 270093, -54635, 317612, -54065, 109288, 140062, 394220, 454714, 107275, 488540, 42205, 32939, 266231, 608572, 311058, 205772, 761700, 286649, 338540, -23755, 464006, 512562, 88988, 182141, 467150, 761926, 399928, 442054, 424753, 394059, 400851, 557638, 788090, 38958, 308173, 862791, 560187, 430402, 471349, 1008993, 554351, 319777, 791170, 902934, 428276, 800516, 706637, 705775, 447007, 482187, 649185, 750254, 556203, 473344, 285551, 429926, 537014, 599869, 987184, 558625, 455263, 618261, 878455, 735292, 865497, 689075, 787316, 644833, 200563, 628096, 249818, 531334, 504513]
11013E04513j8416L06030q5108q5177J2597j98396P9157K66917k58305n8744M16539
11002H81607l64273j60201K78198Q4452j49204J68207j28657P285L2608j05597
10992E44425K94667m12158L60219j47624J18345J20236j60127K0152K81054j61912
10982H57277k56769L76910J96386k28689L56458L26324j17135J73689L31929j15405
10972A900975N78840J72021l29485K87954l47008p16929L36161l88033k12741
10963A281755L57813k44719j81191K27378K68882j66742N61230l53396q5869k20200
10953A444941l74716J97679m66075o8996p8298J12322k36764k11329I4415J374
10943I5789K81896O3438A22456J03171a07100A98783r6055e9568o0000F2001O9885
$$ y = [504513, 486097, 792127, 707019, 621842, 634439, 436043, 515200, 782117, 523812, 465068, 881607, 517334, 357133, 635331, 719783, 570579, 738786, 610129, 617414, 650022, 544425, 839092, 426934, 787153, 639529, 757874, 878110, 717983, 738135, 1019189, 857277, 600508, 977418, 1173804, 945115, 1301573, 1627897, 1510762, 1684451, 2016380, 1900975, 2479815, 2651836, 2322351, 2610305, 2263297, 1546368, 1882529, 1494496, 1281755, 1639568, 1394849, 1213658, 1441036, 1709918, 1543176, 2104406, 1751010, 1665141, 1444941, 1070225, 1267904, 801829, 732833, 654535, 766857, 530093, 318764, 94415, 95789, 377685, 441123, 122456, 225627, -107100, 198783, 102728, -59568, -119568, 62001, 131886]
10932A31886P4325q4139C1479b36643d6807A26199a48366p3437A60951A4138a79203
10920b24769A23608b19193d1673D0562K31089I3687l2396a29179k03032A42706
10909g9003Q862l30802B73406D0555b09512E7518a7881E1865B1530a0569A98952
10897A3308K71847c55426G7299m785b13377L595R7251r0757L8935B70500a62313
10885D006a52211C4066O9891i5768k9985j44884j2630P7495B42546A4209a39115
10873A52418A808i9212A63617p4934L47849j80398B1331i15B63165b76088I5673
10861b21243P877Q1958B57552a37804p5423B29393b70473e4215F0769R5142a7406
10849b59347B00867q9693B3888h2980c225F3197a27599c5965E31402c19886B22576
$$ y = [131886, 206211, 122072, 31479, -236643, -46807, 126199, -148366, -221803, 160951, 14138, -179203, -224769, 123608, -219193, -41673, 40562, 271651, 93687, 61291, -129179, -332211, 142706, -79003, -70141, -400943, 273406, 40555, -209512, 57518, -17881, 51865, 21530, -10569, 198952, 13308, 285155, -355426, 77299, 72514, -213377, -209782, -112531, -203288, -164353, 270500, -162313, 4006, -152211, 34066, 103957, -95768, -125753, -270637, -283267, -205772, 242546, 14209, -139115, 152418, 1808, -99212, 163617, 88683, 436532, 256134, 21331, -915, 263165, -276088, 95673, -221243, -213366, -131408, 257552, -137804, -213227, 229393, -270473, -54215, 60769, 155911, -17406, -259347, 200867, 111174, 23888, -82980, -3225, 63197, -127599, -35965, 531402, -319886, 222576]
10837G0664f3689j4024C6046C959b02214a436l12057e8255A63266m38a89959C2600
10824a52540D6537a11048l5227A16784d11660A399K62318a30444l12069b20883
10813A05927b49271a6270A46586a52842a8521A03813A3333J79850p7781c9955
10802D1413H972K13030B9489a39875A92666n1479a98877a6094j1919i075k59724
10791b68799e1471B35875a78418d1959j3888k19243I4080d9412k08684J08466
10781a49630D6029H931J7755a86700k05417h0382c2480l55725a26287C47895a04128
10769A01252J61784q5514b02875B38340c6298A41580b60439R9511j1781G4203
10758I2004R1281c57488R9830H3645K06191N0526B0613J79426m6236a94517N9690
$$ y = [70664, -63689, -77713, 36046, 3959, -202214, -1436, -313493, -58255, 163266, 162828, -189959, 32600, -152540, 46537, -111048, -146275, 116784, -411660, 1399, 263717, -130444, -442513, -220883, 105927, -249271, -16270, 146586, -152842, -18521, 103813, 13333, 193183, 115402, -39955, 41413, 8972, 222002, 29489, -139875, 192666, 141187, -198877, -16094, -28013, -9075, -268799, -51471, 235875, -178418, -41959, -55847, -275090, 94080, -49412, -258096, -149630, 46029, 8931, 26686, -186700, -392117, -80382, -32480, -388205, -126287, 347895, -104128, 101252, 263036, 177522, -202875, 238340, -36298, 141580, -260439, -160928, -172709, 74203, 92004, 183285, -357488, -257658, 83645, 289836, 340362, 20613, 200039, 153803, -194517, -134827]
10747a34827r227H6014a24538H0776Q7592b76980a3664q0352G5025a11258f641
10735b18419f7032o3833j69908a08202r7231l0393A77204b05102a4448A0934D338
10723a51921A94579f5986j88534c467E7383a41691A2464h2029B75108b31A47565
10711A24368j6085a07937r6683n0783J11779G3113R7532h0530k16317B495a0279
10699b37800l3733O0807A36218j548d3185k51093R3869L5564A89073d6989j34864
10688a81853g0953b2032B4198O7590L1606L68580e6657k07934g4007k5531L8136
10677f1402r2463c2168E6112d4107B01937a69162k60877A94192a74178c9940k73084
10666c13024O0217B46638b4395j02241l3897A48376J85455o5161L5575a69372
$$ y = [-134827, -144054, 86014, -124538, 80776, 168368, -276980, -13664, -94016, 75025, -111258, -6641, -218419, -67032, -130865, -300773, -108202, -205433, -235826, 177204, -205102, -14448, 10934, 4338, -151921, 194579, -65986, -254520, -3467, 57383, -141691, 12464, -82029, 275108, -231, 147565, 124368, 108283, -107937, -204620, -255403, -143624, 73113, 170645, -80530, -296847, 2495, -10279, -237800, -271533, -210726, 136218, 134670, -43185, -294278, -200409, -164845, 189073, -46989, -181853, -70953, -22032, 24198, 91788, 123394, 491974, -56657, -264591, -74007, -99538, -61402, -153865, -32168, 56112, -44107, 201937, -169162, -430039, 194192, -174178, -39940, -313024, -252807, 246638, -24395, -126636, -160533, 148376, 333831, 268670, 304245, -169372]
10655g0326j9874m25444K34946e8245j24659a8171k46934B69978f4543q1946p5587
10644b22076h1512A99670I0897a33505H8088b57900A57066n3904c42835E6848
10633a22389A8632d8823j8874I1667l3427b30734k4924K9841N3753c8183e615
10621a04345A09269c13611m897G5617i3256G9035b08207Q7811N6887l6354A56372
10609a70588d8277j6285B48467f6253J1595O49B38824L1097b03843M8058A49802
10597a6301j19438G9461b8984A43086d9647j4047A07907d04j65740k5395j00369
10586b91908J6750Q3126f7145p0517C4793b51227b6748D6994i8933c3464E7296
10574C3043a03587b2678k41013Q9392l5093B3402g9417B13164a67750A50899F0806
$$ y = [-70326, -90200, -515644, -280698, -58245, -182904, -18171, -265105, 269978, -64543, -146489, -222076, -81512, 199670, 90897, -133505, 88088, -257900, 157066, 103162, -342835, 56848, -122389, 18632, -48823, -67697, 91667, 58240, -230734, -255658, -225817, -172064, -38183, -5615, -104345, 109269, -313611, -318508, 75617, -93256, 79035, -208207, -120396, -63509, -99863, 156372, -170588, -48277, -64562, 248467, -66253, -54658, -54009, 238824, 269921, -203843, -155785, 149802, -16301, -135739, 79461, -28984, 143086, -49647, -63694, 107907, -404, -166144, -191539, -291908, -275158, -192032, -67145, -137662, 34793, -251227, -26748, 46994, -98933, -33464, 57296, 33043, -103587, -22678, -263691, -174299, -209392, 23402, -79417, 213164, -167750, 150899, 60806]
10562B1674J13304B1612q158a63974o1080A13087e0768j97378j60058C20251D7336
10550E3092J51962i4101k7516k3763M9141k253j8437j6674k1845B4741d8987m43454
10538d92441e4236G5154c6210j85746d1605k5176k45092a54215B11797d9776A27176
10526A3979o37J94647P5602b77143I2264C7556A6490Q9521a16425A5023g2036
10514A01441D9579j6206a03374A21347f198q5944B71969j17915a73572B74437
10503A60840a31681M50g150A90576o5177l0772O7916l1960F1151o327h8889I6058
10490F9124b33548B64758j16002f8484F5566d1745A65731A5585L50624K58304
10480F24513k21414j84180K56169l2145A89301C1775B711O9295J84705c3132A82942
$$ y = [21674, 134978, 21612, 13454, -163974, -225054, 113087, -50768, -248146, -408204, 320251, 47336, 53092, 205054, -94101, -121617, -145380, -96239, -98492, -116929, -133603, -155448, 24741, -48987, -492441, -54236, 75154, -36210, -221956, -41605, -66781, -311873, -154215, 211797, -49776, 127176, 13979, 13342, 207989, 283591, -277143, 92264, 37556, 16490, 106011, -116425, 15023, -72036, 101441, 49579, 33373, -103374, 121347, -6198, -92142, 271969, 154054, -173572, 274437, 160840, -131681, -131231, -7150, 190576, 125399, 94627, 162543, 130583, 61151, 54824, -88889, 96058, 69124, -233548, 264758, 148756, -68484, 65566, -41745, 165731, 15585, 366209, 624513, 403099, 218919, 475088, 442943, 189301, 31775, 2711, 72006, 256711, -33132, 182942]
10468f9766G7124K96110A4730d9680A27409A2791K33108b48701A35677c49310
10457a03263b7050n0497A7807a92883A33442N192b85785a23261n2979j10749a18487
10445A49713i1513B1798J8253J50859M4990h8739A78291G4105k4352f0665E3017
10433a4301F2391a58201j8526A41915b4996R596k52972E2152c79018A8060c6211
10421g437B00738J34971A5027a74569D515M10526D7004J22662b47192g0862F3735
10409a54748k1484A17221b64680A03858a91315D7153Q044j9219K54a14303d0239
10397g4402a8566A27723C6133K07337b74838a25161B52406a51359F1292Q1343
10387A42635Q9465B1796J32886E9044b54611A43976d7241j518J5331A71131D3316
$$ y = [-69766, 77124, 373234, 14730, -49680, 127409, 12791, 245899, -248701, 135677, -349310, -103263, -27050, -77547, 17807, -192883, 133442, 138634, -285785, -123261, -176240, -286989, -118487, 149713, -91513, 21798, 40051, 190910, 235900, -88739, 178291, 74105, 49753, -60665, 53017, -14301, 62391, -158201, -176727, 141915, -24996, -15400, -268372, 52152, -379018, 18060, -36211, -7437, 200738, 335709, 15027, -174569, 4515, 415041, 47004, 169666, -247192, -70862, 63735, -154748, -176232, 117221, -264680, 103858, -191315, 47153, 55197, 35978, 36232, -114303, -40239, -74402, -18566, 127723, 36133, 243470, -274838, -125161, 252406, -151359, 61292, 142635, 232100, 21796, 154682, 59044, -254611, 143976, -47241, -48759, -33428, 171131, 43316]
10375B28519H8682a09318i969I8409K75131p4971K07049B19337J70060l8204K18550
10364E69743k44714l3404P0027A63910K08371R3784k10698a82655C16896d198
10353H4444K72729R5506I6181L19027j10011J88472a34101B14902L35833r0989
10343D59746J6098A15906B2850a46495g2439C68678E7537L9328A6772J59955G8433
10331b21194C9218e3538F8675N7576f6899j29134Q3253C09806I5329J08465j3969
10320A89825B9899b05212C7568J83036f8263A12411Q9464J35859q8522a93595
10309a20945d2537B05903d64l22139i1733r4840A79678c13222a43136L6677J1363
10298i5096m2367e4006j65287B19944A02934a21706j58961A16421l0904K71544
$$ y = [228519, 88682, -109318, -9969, 98409, 373540, 298569, 505618, 219337, 389397, 351193, 569743, 325029, 291625, 361652, 163910, 372281, 466065, 255367, -182655, 316896, -4198, 84444, 357173, 452679, 96181, 415208, 305197, 493669, -134101, 214902, 550735, 459746, 475844, 115906, 22850, -146495, -72439, 368678, 57537, 96865, 16772, 176727, 78433, -221194, 39218, -53538, 68675, 126251, -66899, -196033, -112780, 309806, 95329, 203794, 189825, 29899, -205212, 37568, 220604, -68263, 112411, 201875, 337734, 249212, -193595, -120945, -42537, 205903, -464, -322603, -91733, -186573, 179678, -313222, -143136, -106459, -95096, -137463, -54006, -219293, 219944, 102934, -121706, -280667, 116421, 85517, 357061]
10288C57061A56403F5579O6336B7112e16149C1264a47117B5194e0849i932j81410
10277a91342b1141j7215C5953e2100F4255a13719E6059h3933i215n4628a8952
10265F1631c895A00073b2522B96841a03864M0006A88762p3288Q0968E8765b5270
10253i2361e429C48209I7980d1468G4534b67652C138a92352A2407a74789m3753
10242b18542D4449L10833b05906j51390G0888f3415m3597d3547j95525E710K29087
10231B34797N4529a88389f6950j86606G724b44066G1677f4867q3850C3868J53776
10220A87644d2829H9473a56667a411B50174d60127g2683B45502a879j21335A0706
10208c89980J40629a17980k0431k37036G4937M530c91498e1666d206B59717A03659
$$ y = [357061, 156403, 65579, 131915, 27112, -516149, 31264, -147117, 25194, -50849, -9932, -191342, -21141, -38356, 35953, -52100, 64255, -113719, 56059, -83933, -9215, -63843, -18952, 61631, -3895, 100073, -22522, 296841, -103864, -63858, 188762, 115474, 196442, 58765, -25270, -92361, -5429, 348209, 97980, -41468, 74534, -267652, 3138, -192352, 12407, -174789, -218542, 44449, 355282, -205906, -357296, 70888, -63415, -107012, -43547, -239072, 5710, 234797, 289326, -188389, -66950, -253556, 7724, -244066, 71677, -64867, -148717, 33868, 187644, -42829, 89473, -156667, -1411, 250174, -460127, -72683, 245502, -1879, -123214, 10706, -389980, -249351, -117980, -138411, -375447, 74937, 79467, -391498, -51666, -4206, 259717, 103659]
10196D1765J59168c30044A62994a74401N6551r9830b4489A99771b70383G187b29648
10184H9385e39564c1886k5512k27714h6086j38496k6117K0225R0491A55651l1405
10173A24246k0117d7154r2939A01375D8908e4955B3158K33942b68879H5062c85241
10161a45696b9981E9237a88989q6878E8766a29613B6113Q9961c13739B85619I8335
10149E8219a28379k5135j41340J43678E8044a34469d5851k85302A0138a11761
10138i4474j60368a24818L4399F1104b99193J5774B21078a29199G9112M36945
10128E16057D7062c40746a10271A28753J19577A8016K9700a23731G8051J94693
10118B72744b12035K8525P1255O949j94500P6119P9522f8120a1228F9308Q7386
$$ y = [41765, 200933, -330044, 162994, -174401, -117850, -217680, -24489, 199771, -270383, 7187, -229648, 89385, -539564, -31886, -57398, -285112, -86086, -224582, -250699, -230474, -139983, 155651, 124246, 104129, -47154, -140093, 101375, 48908, -54955, 23158, 257100, -268879, 85062, -385241, -145696, -29981, 59237, -188989, -275867, 58766, -129613, 26113, 116074, -313739, 285619, 98335, 58219, -128379, -153514, -294854, -151176, 58044, -134469, -45851, -331153, 10138, -111761, -94474, -254842, -124818, -90419, 61104, -299193, -283419, 221078, -129199, 79112, 516057, 47062, -340746, -110271, 128753, 248330, 18016, 47716, -123731, 78051, 272744, -212035, -183510, -112255, -105306, -299806, -223687, -144165, -68120, -11228, 69308, 156694]
10107A56694b91469a22319C3634a69973a4572k22402A0824J04464e1187b4124
10096a1466j22242k27582A13949a20584j49855F9062J2876d15631J59781o8438
10086c24288h1693j50851A87711F9917a82048c2870l3587k65952G1945h8574E673
10074b4746o455q3887K9098C0142Q2878N7443G5972l51j5618a54679j5877C85178
10061c45366J21355A01316c08844a09221b8412B25857a85075a5453B55701F2620
10050a22432J2734p1612p3948A65552l5143o0321A8293e6712o6856A25582m7685
10039G7897b18927P2164A58221C7399a2873k31338A45678a350E4842A0095L55686
10028C65781a40855G6506b55308A13873a22590p544j3346A42411b03538c9548
$$ y = [156694, -291469, -122319, 33634, -169973, -14572, -236974, 10824, 115288, -51187, -24124, -11466, -133708, -361290, 113949, -120584, -270439, 69062, 81938, -415631, -255850, -324288, -81693, -232544, 187711, 69917, -182048, -32870, -66457, -332409, 71945, -88574, 5673, -24746, -31201, -115088, -85990, 30142, 113020, 170463, 75972, 75621, 60003, -154679, -170556, 385178, -345366, -224011, 101316, -308844, -109221, -28412, 225857, -185075, -15453, 255701, 62620, -122432, -109698, -181310, -255258, 165552, 130409, 70088, 18293, -56712, -123568, 125582, 77897, -218927, -146763, 158221, 37399, -12873, -244211, 145678, -1350, 54842, 10095, 365781, -140855, 76506, -255308, 113873, -122590, -130134, -143480, 142411, -203538, -39548]
10017b59695B56968b21823O405A61748l1860d47842A06404c34682k9452b414m22291
10006d24705a26430k18411J54521e2884A92292e2436n45563a02105A06312k7695
9996G8617h8879P645n3834K8730l8421K1394k56524b7519p8247J2001j31368j6582
9984b41715A43686a07512l4696m1229D0800J11872j9788E0546j7002J3060f5663
9972h1351A13416b6174H6792a11039B85253A23951f3019k88980P4550A48966b7619
9960A59236a07162C21393b58101A8237e2615k36948B45280c29640F1219a6964
9949b50842B8882d9570k79632J49889G5591b13335P4262A64528G1178a7685k15682
9938b33367c1339C55828a7906j40801I3393a43637A3482J12222a99301C9803d7984
$$ y = [-259695, 256968, -221823, -215418, 161748, 129888, -447842, 106404, -334682, -364134, -2414, -424705, -126430, -344841, -190320, -52884, 192292, -52436, -597999, -102105, 106312, 78617, -88879, -81234, -135068, -106338, -144759, -123365, -379889, -27519, -105766, -93765, -225133, -241715, 143686, -107512, -142208, -183437, 40800, 152672, 132884, 50546, 33544, 46604, -65663, -81351, 113416, -26174, 86792, -111039, 285253, 123951, -63019, -351999, -277449, 148966, -27619, 159236, -107162, 321393, -258101, 18237, -52615, -289563, 245280, -329640, 61219, -16964, -250842, 28882, -49570, -329202, -179313, 75591, -213335, -139073, 164528, 71178, -17685, -233367, -31339, 355828, -17906, -158707, 93393, -143637, 13482, 125704, -199301, 39803, -47984]
9926f42905b03576n6134Q7885j76812i5484d6026D6607P5462a0028A4415h2778
9914I0353J51692a3781B21277Q9431f4359H584b90673J36210c7728i250j12206
9903a21456A06704e881k3045A00486i1704p3137A06077R6272c33824a28767D5101
9891a16707F998j805a68256B42342I2372k2791f9119o2K685j68602F1620a45639
9878b9808A3197K2943b80453a08323K1441C18658a16194o8363J9096f7762j16058
9867a83820E1545b1691j73378j45428J15467c1241j02194k81639b00410N1322
9857a49088j40656d5996B40316H9484c3582h898j55484C5093J79115H5319L15252
9846D00571A39616d5364m1199B21724c2799k5413A10999a62151A8800a8594j34875
$$ y = [-642905, -203576, -259710, -171825, -348637, -95484, -46026, 46607, 122069, -10028, 14415, -82778, 90353, 242045, -13781, 221277, 310708, -64359, 8584, -290673, -154463, -37728, -9250, -121456, 106704, -5881, -28926, 100486, -91704, -164841, 106077, 202349, -333824, -128767, 45101, -116707, 6998, 5193, -168256, 242342, 92372, 69581, -69119, -69181, -66496, -235098, 61620, -145639, -29808, 13197, 36140, -280453, -108323, -86882, 318658, -116194, -184557, -165461, -67762, -183820, 51545, -21691, -195069, -340497, -225030, -31241, -133435, -415074, -200410, -149088, -289744, -45996, 240316, 89484, -33582, -8898, -164382, 35093, 214208, 85319, 400571, 139616, -45364, -86563, 221724, -32799, -58212, 110999, -162151, 18800, -18594, -153469]
9835a53469b0213A6199a39055k08432j4249a71844Q029P4479k35942a49199e6028
9823e11890a52307A8272a10044j08752B1324h1540A29386g5008b0665k02850A15225
9811A25312J9566F6339d56829g5292j60558a12278k47102A29606o701b95069G5100
9799A41783b3776E2546R02a10629p4208I5057R6909I687L84626b02866B84670
9787a84063g3159H5818i0946A44608C2966a65056g1589J699j74831p8762k27751
9776e51234J46287e7142m37551e2755j89000a19207L4007m4482A22551a16160
9765C77889h2948j33534h5265k1002j86302A18088K5878O2752a31340E8193a6134
9753D4650a55691c8314B8678i7731I2003l8458O3881G680c69564a30309M7984
$$ y = [-153469, -20213, 16199, -139055, -347487, -361736, -171844, -163815, -89336, -325278, -149199, -56028, -511890, -152307, 18272, -110044, -218796, 21324, -81540, 129386, -75008, -20665, -223515, 115225, 125312, 144878, 66339, -456829, -75292, -235850, -112278, -359380, 129606, 122905, -295069, 75100, 141783, -23776, 52546, 53448, -110629, -184837, 95057, 191966, 9687, 394313, -202866, 284670, -184063, -73159, 85818, -90946, 144608, 32966, -165056, -71589, -69890, -244721, -323483, -551234, -404947, -57142, -494693, -52755, -241755, -119207, -85200, -129682, 122551, -116160, 377889, -82948, -216482, -85265, -106267, -292569, 118088, 143966, 206718, -131340, 58193, -16134, 44650, -155691, -38314, 28678, -97731, 92003, 53545, 117426, 7680, -369564, -130309, -82325]
9742h2325A50766K3866k8827b02567A66303D4800J65017c52441f4453G6561a25666
9730a11194K5415A03521A3841J11621a64027k74470A13750l1012b01658d3505
9719b9448B12734e18167a48485H3525b11830D3453M9695l461b74014a14136q3575
9708a97711j6578B9708i1423A41420l6798B1271b07349D2385a80242A60505J63643
9697C24148A31678c5823k38202c0497C07205j30958J4255C864a01840B54109a92555
9685g5702j73118H5376h5427k0359a5628A41490D8622O0353a07969A4533c04761
9673A18452n4869a08505J2013m2766A16531a61886J5940o3529a02192a8783r0264
9662a09047j54146f4276j24356n3486A98463C2733J10626k0661n2699b2437L70
$$ y = [-82325, 150766, 174632, 145805, -202567, 166303, 44800, 209817, -352441, -64453, 76561, -125666, -111194, -85779, 103521, 13841, 125462, -164027, -438497, 113750, 82738, -201658, -43505, -29448, 212734, -518167, -148485, 83525, -211830, 43453, 93148, 89687, -274014, -114136, -197711, -214289, 29708, -91423, 141420, 104622, 21271, -207349, 42385, -180242, 160505, 324148, 131678, -35823, -274025, -30497, 307205, 176247, 190502, 3864, -101840, 254109, -192555, -75702, -248820, 85376, -85427, -105786, -15628, 141490, 48622, 108975, -107969, 14533, -304761, 118452, 63583, -108505, -96492, -139258, 116531, -161886, -145946, -209475, -102192, -18783, -109047, -263193, -64276, -188632, -242118, 198463, 32733, 143359, 122698, 69999, -22437, -22067]
9651b2067k21767e1542m9148A16718c50565a16826l27652A1601a59314A22031
9640a62759L128A29862J4943a15923B15516m6680c55362F9209O5983l4060J08562
9629B09694p1828c55744a43025N2896j94874C24754a57144C3410F900b25053e513
9617c41617k3305a41019L3776L2721m9296a2840k15551L8410K593M1639D975b0397
9604g3932j27320A07890l0057e02001H998d81F7133b6127k08299A5599k304i8642
9591h3352q2807k7293k00009a4199A08941a80325A04886a93662c4650C7852c09540
9579a03236A18708b42338f6439G9636b24511J10593B46470b16949G1731a15095
9568B19573a07388o754G0722b74040a13957A2399d80557e9126r9814M9577G5370
$$ y = [-22067, -243834, -51542, -100690, 116718, -350565, -116826, -444478, 11601, -159314, 122031, -162759, -159631, 129862, 144805, -115923, 215516, 168836, -355362, 69209, 135192, 101132, 209694, 137866, -355744, -143025, -90129, -285003, 324754, -157144, 33410, 6900, -225053, -5513, -341617, -364922, -141019, -107243, -74522, -123818, -12840, -228391, -189981, -187388, -145749, 4975, -20397, -73932, -201252, 107890, 77833, -502001, 8998, -481, 67133, -26127, -234426, 15599, 13295, -98642, -83352, -166159, -193452, -393461, -14199, 108941, -180325, 104886, -193662, -34650, 37852, -309540, -103236, 118708, -242338, -66439, 79636, -224511, -113918, 246470, -216949, 71731, -115095, 219573, -107388, -114142, 70722, -274040, -113957, 12399, -480557, -59126, -158940, -109363, 75370]
9556b15842k20072J25676G3857b20684A82822a956E5705b28885Q6129A6742i7787
9544c6728l45081a07184C95602a11089j17449a2216p0344j90395A6544J80897
9534A97441b58167a2991j65368B50782c40897J39170E13606c2383k8834F6748
9523e4494A2871h4616B4259K12951b04777j39018j1736J64583B06412b71267A5218
9511a98480A23966c40841i4589c7364A20882k3925g0805A28560n5403a69241N688
9500a63553p2503B83L14803a97745b2684A7430J33030a03680C9801d09027h0176
9488h0161H6961c45748F4401R1094c00522m7793a63917d3806A14924i76j95465
9477a96441A4650K49702a59473l53139a68365n8783I6119b66250B0986e2775J3291
$$ y = [-215842, -435914, -310238, 73857, -220684, 182822, -1956, 55705, -228885, -142756, 16742, -97787, -36728, -381809, -107184, 395602, -111089, -228538, -12216, -82560, -272955, 16544, 197441, -258167, -12991, -178359, 250782, -340897, -201727, 513606, -32383, -61217, 66748, -54494, 12871, -84616, 24259, 237210, -204777, -343795, -355531, -190948, 206412, -271267, 15218, -198480, 123966, -340841, -94589, -37364, 120882, 96957, -70805, 128560, 73157, -169241, -163553, -236056, 283, 315086, -197745, -22684, 17430, 150460, -103680, 39801, -409027, -80176, -80161, 86961, -345748, 64401, 155495, -300522, -348315, -163917, -43806, 114924, -976, -196441, 14650, 264352, -159473, -512612, -168365, -227148, 96119, -266250, 20986, -52775, -39484]
9466c9484A2140b09356C7139K6607O1136c7813I0051b92033J1825B6225J79327
9455B05552a37584I7123K6859b58563K725E6628J85526b19672e3939B62719i6032
9443b8861r3567K7906J5121k4927b3177k9079A81450n6926E9893g8842A9872f5596
9430a65806E5047A5480f4609j86295c1174k21208q7810H3175l792i1191A25997
9418a90652B39752a02641c8702A19579b59191n8702a15912A47297a18430j68515
9408b86945i0615H8990c07649F0358b19350n6631A45952h1819A8603b7022F1044
9396B09550b52241j53946B13367B0488a18427D2762b40745F4891a1201A13932
9385c7931j98378e3437k15297j67140a16717B10121F926b8545j06173M5933k955
$$ y = [-39484, 12140, -209356, 37139, 63746, 124882, -37813, 90051, -292033, -280208, 26225, 205552, -137584, 97123, 123982, -258563, -255838, 56628, 242154, -219672, -53939, 262719, -96032, -28861, -122428, -94522, -79401, -104328, -23177, -52256, 181450, 124524, 59893, -78842, 19872, -65596, -165806, 55047, 15480, -64609, -250904, -31174, -252382, -340192, 83175, 79383, -91191, 125997, -190652, 239752, -102641, -38702, 119579, -259191, -317893, -115912, 147297, -118430, -286945, -90615, 88990, -307649, 60358, -219350, -275981, 145952, -81819, 18603, -27022, 61044, 209550, -252241, -406187, 213367, 20488, -118427, 42762, -240745, 64891, -11201, 113932, -37931, -236309, -53437, -268734, -435874, -116717, 210121, 6926, -28545, -134718, -88785, -91740]
9374i1740o987k17991P9784A1323a3813n8858H6874c37303j15697A99468g5581
9362a2019o7458j27554P4168A18024c63983J81807A86282o9949E806f5475j57639
9351b23114J7979a3628A24812L7507a80267L6367B03583a5878H8680a47934L7910
9340a10024p453F6305c43311F1429b61734Q5753n282F0825L01c22559c2321k54608
9328b86929a37660e6227j61622i5030j56032A78428b50761A31986Q2461b21672
9317e8313r8647j48820I5701a16577j36277r2880O1376A52060f0672E2943c77156
9305i5114L9553A1219L9736N4228A5496K41679F99f1988A64519i114l4559o1013
9293a04686A91472j3593e5940j37039F7771K06139D5977K68845a80683j26625
$$ y = [-91740, -98727, -316718, -236934, 11323, -13813, -72671, 86874, -337303, -453000, 199468, -75581, -12019, -79477, -207031, -132863, 118024, -363983, -182176, 186282, 116333, 5806, -65475, -223114, -205135, -13628, 124812, 162319, -180267, -143900, 203583, -15878, 88680, -147934, -110024, -117477, 66305, -343311, 61429, -261734, -175981, -181263, 60825, 61126, -322559, -32321, -286929, -137660, -56227, -217849, -95030, -251062, 178428, -250761, 131986, 214447, -221672, -58313, -156960, -305780, 95701, -116577, -252854, -345734, -284358, 152060, -60672, 52943, -377156, -95114, -55561, 11219, 50955, 105183, 15496, 257175, 699, -61988, 164519, -9114, -43673, -104686, 191472, 177879, -55940, -192979, 67771, 273910, 45977, 314822, -180683, -307308]
9283c07308Q7128B512c11l0300B92717h3553b7368A24249J6983F500g219k32441
9271b39660J01563O290k09605f785r177k16099F8436i1531J5156n483A90477G3169
9258C6476a61710G4377j7397K01001b04883a5272A00252b37163R2155B31618m5833
9247A85785c59038a30720A99785l6202e2245n342l35167J33039L2793j79064R9669
9236c06317e9906A92609H2255b93026N1376j47250k5059B56874b99116B19496
9225b44035a08965k0763C08448A40168G130f178j27461k7046A90582B3017a09262
9213A40802H47N7899a57249A47932a62522N5763l09100f1614A16911E4278b57659
9201g5101l535l67353i6757c6298F0796j1305b7441l95336J05139I2948Q8705
$$ y = [-307308, -220180, 2512, -311, -30611, 292717, -83553, -27368, 124249, 141232, 6500, -7219, -239660, -138097, -131807, -341412, -6785, -15962, -232061, 68436, -91531, -76375, -81858, 190477, 73169, 36476, -161710, 74377, 56980, 257981, -204883, -15272, 100252, -237163, -145008, 231618, 185785, -359038, -130720, 199785, 163583, -52245, -57587, -392754, -259715, -226922, -405986, -306317, -59906, 192609, 82255, -293026, -241650, -388900, -413959, 256874, -299116, 219496, -244035, -108965, -129728, 308448, 140168, 7130, -6178, -133639, -160685, 190582, 23017, -109262, 140802, 847, 58746, -157249, 147932, -162522, -106759, -415859, -61614, 116911, 54278, -257659, -75101, -78636, -445989, -96757, -36298, 60796, 49491, -27441, -422777, -317638, 92948, 181653]
9190A81653c68744I6526a33696k54781a57077r5548l2359J04762j27066b4573
9179a38555A01471j522f3705r3171d5035m8132j93915e6599I2066a98627j6423
9168b15050k4020O6377B0114b06523A44958P8406E7335b93592c100A04500K51499
9157C55999a62849A56162F6169j6637e9532j73776l1848I7512b01478h8046l5993
9146a24039A08472M8740F1016O9657Q3715b031A03507g3700j7840m1624b9811
9134A04624b07226C1330h7026b7211A47220B1204a53371D9536a29696K5727C7091
9122a2109q2432b3434j87241A78904D6017p929c40078K9920A35033b50294n445
9111b55739I1447c93433J38600h3250A03126B8870N4447J86368C419a20624j41169
$$ y = [181653, -368744, 96526, -133696, -388477, -157077, -252625, -284984, -180222, -307288, -24573, -138555, 101471, 99949, -63705, -156876, -45035, -93167, -287082, -56599, 92066, -198627, -215050, -239070, -172693, 20114, -206523, 144958, 223364, 57335, -293592, -3100, 104500, 355999, -162849, 156162, 66169, 49532, -59532, -233308, -265156, 97512, -201478, -88046, -124039, 108472, 157212, 61016, 130673, 214388, -2031, 103507, -73700, -91540, -133164, -29811, 104624, -207226, 31330, -87026, -27211, 147220, 21204, -153371, 49536, -129696, -103969, 37091, -12109, -94541, -23434, -210675, 178904, 46017, 38088, -340078, -310158, 135033, -250294, -255739, 91447, -393433, -254833, -83250, 103126, 28870, 83317, 269685, 3419, -120624, -261793]
9100b61793a10118E3667b77425A95215N4141r6265G2868a16880D1591c44099f3971
9088C7379L55436a85148A0143a55711H4123a63877L7706L0615A24581d2222j75771
9077b17993d2939o924A2052c32399i1101d1541l9907B06456L5628f646K091r5858
9065a00413j74519D5245a15239A5677d5104k53987A24953A2345b0934m7864A63594
9053a6894B45461h9752l711j6293M4618F4207a82207l7054f0868J7577A71601
9041A33472m4368a1651k15463A95097e3721j17146C59648b27034j185A10159k3964
9030H6195c5337A9584B136c23210a43243j33112i6391A34684h9569j95074h7288
9018c3734B93397p2668I778i2420K4297j63836B39013B9918b23759A04243h2753
$$ y = [-261793, -110118, 53667, -277425, 195215, 249356, 153091, 72868, -116880, 41591, -344099, -63971, 37379, 392815, -185148, 10143, -155711, 84123, -163877, -126171, -95556, 124581, -42222, -217993, -42939, -49863, 12052, -332399, -91101, -41541, -81448, 206456, 242084, -6646, -4555, -100413, -274932, 45245, -115239, 15677, -45104, -299091, 124953, 12345, -20934, -68798, 163594, -16894, 245461, -89752, -93463, -109756, -65138, 64207, -182207, -219261, -60868, -43291, 171601, 133472, 89104, -11651, -227114, 195097, -53721, -170867, 359648, -227034, -228219, 110159, 86195, -35337, 19584, 2136, -323210, -143243, -276355, -96391, 134684, -89569, -284643, -87288, -33734, 293397, 220729, 9778, -92420, -68123, -231959, 239013, 29918, -223759, 104243, -82753]
9006a98845A34862a08559j13204Q0319l64017A95978b18548B23674e1311B84020
8995i6269J8509A88048R7617a59804d8476D1427A4799b34033B15789b18047J08622
8984a09425B20119b10721A27216c5728k04487d8921j55510k4660A1201J00682
8974A11883J21842b85066E9293P9185b53584F7479a6987o1674E9766J19791m6062
8963A33495k8123c88501D6230R114e921j8308p6668D2782c50923f4801o2401G5164
8950G7618a35773C8872e4661C0165J05382l8072c58259a59391c9231l11032a44398
8938B6364e20782a90069A68826D8978M4030b39512d5178j38838j90999a8381B49122
8926D53673h7731B70229K2687O66585K223507N879659B273303G60317A50664Q5826
$$ y = [-198845, 134862, -108559, -221763, -141444, -505461, 195978, -218548, 223674, -51311, 284020, -96269, -77760, 188048, 285665, -159804, -48476, 41427, 14799, -234033, 215789, -218047, -109425, 220119, -210721, 127216, -35728, -240215, -48921, -204431, -229091, 11201, 111883, 233725, -285066, 59293, 138478, -253584, 67479, -16987, -78661, 59766, 179557, 133495, 105372, -388501, 46230, 55344, -5921, -24229, -100897, 42782, -350923, -64801, -127202, 75164, 77618, -135773, 38872, -54661, 30165, 135547, 97475, -358259, -159391, -39231, -350263, -144398, 26364, -520782, -190069, 168826, 48978, 93008, -239512, -45178, -184016, -375015, -18381, 249122, 453673, -87731, 270229, 292916, 959501, 3183008, 9062667, 2273303, 760317, 150664, 236490]
8916B36490F81K9391K04915F1038A6907K67645K8038a03517B92050b92668B18539
8904g2414m2622A17945l3362b21574i9089j87482B13292o2969a11267J5039j92795
8893b89023J16552f4037A62962b56689a10639B61849A06647J8407a47904K7735
8883a20169p01L7114j90396m5732A59139l1621c43279J25263m6846B5332a19245
8871d572F4699a58940o4462e4755j58992D667J4468a41207K194d5235n7899q9924
8859a93058d5827n4781a0071B08015b7925C6539a2854q0045j04739B6936K3766
$$ y = [236490, 681, 30072, 234987, 61038, 16907, 284552, 312590, -103517, 292050, -292668, 218539, -72414, -115036, 117945, 84583, -221574, -99089, -286571, 213292, 150323, -111267, -96228, -289023, -172471, -64037, 162962, -256689, -110639, 261849, 106647, 125054, -147904, -120169, -120870, -83756, -274152, -319884, 159139, 127518, -343279, -218016, -264862, 25332, -119245, -4572, 64699, -158940, -223402, -54755, -213747, 4667, 19135, -141207, -139013, -45235, -103134, -193058, -45827, -100608, -10071, 208015, -27925, 36539, -12854, -92899, -197638, 26936, 50702]
$$ [...]
##END NTUPLES=NMR SPECTRUM
##END=
