##TITLE=AC1684_PANAN14365_8637509_Men9rfclpd
##JCAMPDX= 6.0         $$ Bruker NMR JCAMP-DX V2.0
##DATA TYPE= NMR SPECTRUM
##DATA CLASS= NTUPLES
##ORIGIN= BRUKER
##OWNER= Administrator
$$ 1.72 TOPSPIN		Version 2.1
$$ 2014-05-30 23:37:17.392 -0700  Administrator@X
$$ Compression mode = diff/dup
##.OBSERVE FREQUENCY= 400.02188249412
##.OBSERVE NUCLEUS= ^1H
##.ACQUISITION MODE= SIMULTANEOUS (DQD)
##.ACQUISITION SCHEME= undefined
##.AVERAGES= 64
##.DIGITISER RES= 22
##SPECTROMETER/DATA SYSTEM= spect
##.PULSE SEQUENCE= noesygpps1d.comp
##.SOLVENT NAME= COFFEE_meoh
##.SHIFT REFERENCE= INTERNAL, COFFEE_meoh, 1, 14.9611
##AUDIT TRAIL= $$ (NUMBER, WHEN, WHO, WHERE, PROCESS, VERSION, WHAT)
$$ ##TITLE= Audit trail, TOPSPIN		Version 2.1
$$ ##JCAMPDX= 5.01
$$ ##ORIGIN= Bruker BioSpin GmbH
$$ ##OWNER= Administrator
$$ $$ E:\/data/COFFEE/nmr/AC1684_PANAN14365_8637509_Men9rfclpd/12/pdata/1/auditp.txt
$$ ##AUDIT TRAIL=  $$ (NUMBER, WHEN, WHO, WHERE, PROCESS, VERSION, WHAT)
(   1,<2014-05-30 23:37:12.251 -0700>,<Administrator>,<X>,<go>,<TOPSPIN 2.1>,
      <created by zg
	started at 2014-05-30 23:25:41.843 -0700,
	POWCHK enabled, PULCHK disabled,
       configuration hash MD5:
       C8 4E 4E 5D D3 5C D8 9E 9F 52 82 E0 59 8A DE 15
       data hash MD5: 64K
       B0 89 8A 67 BC A2 29 81 43 2A AB 24 62 8E D9 31>)
(   2,<2014-05-30 23:37:15.251 -0700>,<Administrator>,<X>,<proc1d>,<TOPSPIN 2.1>,
      <Start of raw data processing
       efp LB = 0.3 FT_mod = 6 PKNL = 1 PHC0 = 0 PHC1 = 0 SI = 128K 
       data hash MD5: 128K
       6C 9E 2C 11 BC 67 D6 D6 2A 53 75 00 EF 51 2E AE>)
(   3,<2014-05-30 23:37:16.314 -0700>,<Administrator>,<X>,<proc1d>,<TOPSPIN 2.1>,
      <pk PHC0 = -85.53406 PHC1 = 0 
       data hash MD5: 128K
       5B 1F 32 8C EA 81 73 8C 2E E0 CA 3B 74 53 D9 9D>)
(   4,<2014-05-30 23:37:16.783 -0700>,<Administrator>,<X>,<proc1d>,<TOPSPIN 2.1>,
      <abs ABSG = 1 
       data hash MD5: 128K
       E9 F4 50 EA A7 EE 9E 4C 24 E5 5B 36 C0 BA CE 02>)
(   5,<2014-05-30 23:37:16.892 -0700>,<Administrator>,<X>,<proc1d>,<TOPSPIN 2.1>,
      <abs ABSG = 2 
       data hash MD5: 128K
       1F C0 E2 39 D8 E8 63 44 24 25 5A 76 50 B6 CF C1>)
(   6,<2014-05-30 23:37:17.001 -0700>,<Administrator>,<X>,<proc1d>,<TOPSPIN 2.1>,
      <abs ABSG = 3 
       data hash MD5: 128K
       C8 07 E8 5C D7 7D 41 B9 F4 98 E2 DA 63 7E EB DA>)
(   7,<2014-05-30 23:37:17.095 -0700>,<Administrator>,<X>,<proc1d>,<TOPSPIN 2.1>,
      <abs ABSG = 4 
       data hash MD5: 128K
       3E EA 3C 52 35 A1 62 18 1A 6A 38 26 6F 19 31 D7>)
(   8,<2014-05-30 23:37:17.189 -0700>,<Administrator>,<X>,<proc1d>,<TOPSPIN 2.1>,
      <abs ABSG = 5 
       data hash MD5: 128K
       53 6F 29 A4 6C 21 27 22 F7 9D F2 4B DD FB F1 CE>)
$$ ##END=
$$ 
$$ $$ hash MD5
$$ $$ 9F 4B FB 2D A2 5A 6B 2B 46 78 D3 8B AA 8F B5 6A
##$RELAX= 
##$RELAX= 
##$RELAX= 
##$RELAX= 
##$RELAX= 
##$RELAX= 
##$RELAX= 
##$RELAX= 
$$ Bruker specific parameters
$$ --------------------------
##$DU= <E:\>
##$EXPNO= 12
$$ [...]
150 150 150 150 150 150 150 150
##$TP07= 0
##$TPNAME0= <>
##$TPNAME1= <>
##$TPNAME2= <>
##$TPNAME3= <>
##$TPNAME4= <>
##$TPNAME5= <>
##$TPNAME6= <>
##$TPNAME7= <>
##$TPOAL= (0..7)
0.5 0.5 0.5 0.5 0.5 0.5 0.5 0.5
##$TPOFFS= (0..7)
0 0 0 0 0 0 0 0
##$TUNHIN= 0
##$TUNHOUT= 0
##$TUNXOUT= 0
##$USERA1= <user>
##$USERA2= <user>
##$USERA3= <user>
##$USERA4= <user>
##$USERA5= <user>
##$V9= 5
##$VALIST= <valist>
##$VCLIST= <CCCCCCCCCCCCCCC>
##$VD= 0
##$VDLIST= <DDDDDDDDDDDDDDD>
##$VPLIST= <PPPPPPPPPPPPPPP>
##$VTLIST= <TTTTTTTTTTTTTTT>
##$WBST= 2048
##$WBSW= 25
##$XGAIN= (0..3)
0 0 0 0
##$XL= 0
##$YL= 0
##$YMAX_a= 6229565
##$YMIN_a= -12597454
##$ZGOPTNS= <>
##$ZL1= 120
##$ZL2= 120
##$ZL3= 120
##$ZL4= 120
##$ABSF1= 14.9611
##$ABSF2= -5.597082
##$ABSG= 5
##$ABSL= 3
##$ALPHA= 0
##$AQORDER= 0
##$ASSFAC= 0
##$ASSFACI= 0
##$ASSFACX= 0
##$ASSWID= 0
##$AUNMP= <proc_prof1d_extract.lims>
##$AXLEFT= 0
##$AXNAME= <>
##$AXNUC= <1H>
##$AXRIGHT= 0
##$AXTYPE= 0
##$AXUNIT= <>
##$AZFE= 0.1
##$AZFW= 0.1
##$BCFW= 0
##$BC_mod= 0
##$BYTORDP= 0
##$COROFFS= 0
##$CY= 15
##$DATMOD= 1
##$DC= 0
##$DFILT= <>
##$DTYPP= 0
##$F1P= 0
##$F2P= 0
##$FCOR= 0.5
##$FTSIZE= 131072
##$FT_mod= 6
##$GAMMA= 0
##$GB= 0
##$INTBC= 1
##$INTSCL= 1
##$ISEN= 128
##$LB= 0.3
##$LEV0= 0
##$LPBIN= 0
##$MAXI= 10000
##$MC2= 0
##$MEAN= 0
##$ME_mod= 0
##$MI= 0
##$NCOEF= 0
##$NC_proc= -2
##$NLEV= 6
##$NOISF1= 0
##$NOISF2= 0
##$NSP= 0
##$NTH_PI= 0
##$NZP= 0
##$OFFSET= 14.9611
##$PC= 1
##$PHC0= -85.53406
##$PHC1= 0
##$PH_mod= 1
##$PKNL= yes
##$PPARMOD= 0
##$PPDIAG= 0
##$PPIPTYP= 0
##$PPMPNUM= 2147483647
##$PPRESOL= 1
##$PSCAL= 4
##$PSIGN= 0
##$PYNMP= <proc.py>
##$REVERSE= no
##$SF= 400.02000959654
##$SI= 131072
##$SIGF1= 0
##$SIGF2= 0
##$SINO= 400
##$SIOLD= 131072
##$SPECTYP= <>
##$SREGLST= <1H.CDCl3>
##$SSB= 0
##$STSI= 131072
##$STSR= 0
##$SW_p= 8223.68421052631
##$SYMM= 0
##$S_DEV= 0
##$TDeff= 65536
##$TDoff= 0
##$TI= <>
##$TILT= no
##$TM1= 0
##$TM2= 0
##$TOPLEV= 0
##$USERP1= <user>
##$USERP2= <user>
##$USERP3= <user>
##$USERP4= <user>
##$USERP5= <user>
##$WDW= 1
##$XDIM= 131072
##$YMAX_p= 460341484
##$YMIN_p= -11879
##$CURPLOT= <Network HP LaserJet P1505>
##$CURPRIN= <$Network HP LaserJet P1505>
##$DFORMAT= <normdp>
##$LAYOUT= <+/1D_H.xwp>
##$LFORMAT= <normlp>
##$PFORMAT= <normpl>
##$SURQMSG= 1
$$ End of Bruker specific parameters
$$ ---------------------------------
##NTUPLES= NMR SPECTRUM
##VAR_NAME=  FREQUENCY,     SPECTRUM/REAL,   SPECTRUM/IMAG
##SYMBOL=    X,             R,               I
##VAR_TYPE=  INDEPENDENT,   DEPENDENT,       DEPENDENT
##VAR_FORM=  AFFN,          ASDF,            ASDF
##VAR_DIM=   131072,        131072,          131072
##UNITS=     HZ,            ARBITRARY UNITS, ARBITRARY UNITS
##FACTOR=    0.0627417313425164, 1,          1
##FIRST=     8223.62146879497, -970,         -59814
##LAST=      0,             2467,            -59952
##MIN=       0,             -11879,          0
##MAX=       8223.62146879497, 460341484,    0
$$ Real data points
##PAGE= N=1
##DATA TABLE= (X++(R..R)), XYDATA
$$ [...]
63791B49816j147j404k683l812l741k570j294o26m57m29n11p15p85m97j21n3k44
63774B28727k65N0L53K16l32p97p14j75K70K90J27N4j44p49j392j429r22o13q48
63755B21707j218j336j291j171p91j42N00J106J880K477K115Q74N8O27J919K594
63739B29908K332J886J849K128K341K181J569Q96Q11J355J779J637J536K234L457
63724B57899M290M376M072L721L426L273L149K645J735J163J440J856J281l14
63710B94012j919k801l007k702j972j173p15m37J11Q31J264J478J964K690L099
63695B90723L043K950L007L000L012L376L860L761L032K437K298J982R96k13j017
63680C26247j415j574j322o94l72q76j725j987j445o64j75p9k61n43o98o14l68
$$ plain form
63791 249816 248669 247265 244582 240770 237029 234459 233165 232539 232082 231653 231142 230427 229642 229145 229024 228971 228727
63774 228727 228462 228512 228865 229081 228749 227952 227238 227063 227333 227623 227750 227804 227660 226911 225519 224090 223168 222555 221707
63755 221707 220489 219153 217862 216691 215900 215758 216258 217364 219244 221721 223836 224710 224768 225395 227314 229908
63739 229908 232240 234126 235975 238103 240444 242625 244194 245090 245901 247256 249035 250672 252208 254442 257899
63724 257899 262189 266565 270637 274358 277784 281057 284206 286851 288586 289749 291189 293045 294326 294012
63710 294012 292093 289292 286285 283583 281611 280438 279723 279286 279397 280228 281492 282970 284934 287624 290723
63695 290723 293766 296716 299723 302723 305735 309111 312971 316732 319764 322201 324499 326481 327477 327264 326247
63680 326247 324832 323258 321936 321242 320870 319994 318269 316282 314837 314173 313998 313919 313658 313115 312417 311803 311435
63663C11435m4L14M40r0j276k509l157l081k493j752j392j790k496k521j642q64
63647B87082j030j628j622j016n80m33J36J308K240K246J751J591J950K501L195
63632B97691M203N261N740N531N315N752O666P427P823Q238Q946R761J0464J1220
63618D00038J2321J3741J5217J6642J8106J9700K1532K3794K6473K9070L1034
63607F27668L2370L3438L4057L3239L0037K4435J7299R768K837k760o648q838
63595H26902r609r334q396p231o442o873r143j2906j6843j9879k2216k4592k6745
63582F46693k7337k5659k2663j9920j8005j6333j4255j1745r236p112n384l668
63570D65376j538R08L075M529N424O146O846P540Q320R150R721R817R642R531
$$ plain form
63663 311435 311391 311705 312145 312055 310779 308270 305113 302032 299539 297787 296395 294605 292109 289588 287946 287082
63647 287082 286052 284424 282802 281786 281206 280773 280909 282217 284457 286703 288454 290045 291995 294496 297691
63632 297691 301894 307155 312895 318426 323741 329493 336159 343586 351409 359647 368593 378354 388818 400038
63618 400038 412359 426100 441317 457959 476065 495765 517297 541091 567564 596634 627668
63607 627668 660038 693476 727533 760772 790809 815244 832543 842311 845148 842388 835740 826902
63595 826902 817293 807959 799563 792332 785890 779017 769874 756968 740125 720246 698030 673438 646693
63582 646693 619356 593697 571034 551114 533109 516776 502521 490776 481540 474428 469044 465376
63570 465376 463838 464746 467821 472350 477774 483920 490766 498306 506626 515776 525497 535314 544956 554487
63556E54487R613J0086J1480J4110J7471K0717K3651K6744L0152L3332L5795L7605
63544H25243L8710L8015L3821K5381J3988K407o812j2687j5765j6996j6750j4934
63532H93621j1833q519o309n953p456j0462j4631j9570k4640k8994l1922l3119
63520F90213l2737l1246k9207k7033k4851k2599k0291j8067j5999j4021j2161
63509D42001j0612r364q031o373m916m510n156n719n143l636k340k026k452k915
63495C68808k957k507j707q73l98l95n38n00m29o98j158j103j67J052J687J687
63479C59804J725K084K342K237K228K694L087K594J317J64l35n39r16j372j550
63464C75564j339r12m65j27R0L44O94Q68O16K61N10J584L018M394N777P226Q413
$$ plain form
63556 554487 564100 574186 585666 599776 617247 637964 661615 688359 718511 751843 787638 825243
63544 825243 863953 901968 935789 961170 975158 977565 970753 958066 942301 925305 908555 893621
63532 893621 881788 873269 866960 861007 853551 843089 828458 808888 784248 755254 723332 690213
63520 690213 657476 626230 597023 569990 545139 522540 502249 484182 468183 454162 442001
63509 442001 431389 422025 413994 407621 402705 398195 393039 387320 382177 378541 376201 374175 371723 368808
63495 368808 365851 363344 361637 360764 360366 359971 359433 358933 358504 357806 356648 355545 355378 356430 358117 359804
63479 359804 361529 363613 365955 368192 370420 373114 376201 378795 380112 380276 379941 379402 378486 377114 375564
63464 375564 374225 373313 372848 372721 372811 373155 373849 374717 375333 375594 376104 377688 380706 385100 390877 398103 406516
63447D06516R075R450R843J0123J0047R784R671R700R715R899J0634J1950J3614
63434E40021J5667J8302K1116K2954K2728K0290J6499J2724J0239R675J0705J2435
63422G33355J4251J6245J8834K2218K6248L0616L4875L8394M0372L9929L6307
63411A051644K9351J9994J0102J456n175r976j3216j4769j4491j2834j0872r744
63399A021470j0123j2114j5470j9782k4609k9492l3854l6912l7901l6638l3786
63388G30789l0451k7418k4834k2514k0282j7939j5174j1828q239n051k565l65
63376E44129K209N330Q532J1305J3602J5585J7105J7698J7137J5769J4266J3230
63364F95897J2971J3387J4067J4786J6014J8483K2113K5814K8712L1068L3468
$$ plain form
63447 406516 415591 425041 434884 445007 455054 464838 474509 484209 493924 503823 514457 526407 540021
63434 540021 555688 573990 595106 618060 640788 661078 677577 690301 700540 710215 720920 733355
63422 733355 747606 763851 782685 804903 831151 861767 896642 935036 975408 1015337 1051644
63411 1051644 1080995 1100989 1111091 1112547 1107372 1097396 1084180 1069411 1054920 1042086 1031214 1021470
63399 1021470 1011347 999233 983763 963981 939372 909880 876026 839114 801213 764575 730789
63388 730789 700338 672920 648086 625572 605290 587351 572177 560349 552110 547059 544494 544129
63376 544129 546338 551668 560200 571505 585107 600692 617797 635495 652632 668401 682667 695897
63364 695897 708868 722255 736322 751108 767122 785605 807718 833532 862244 893312 926780
63353I26780L5357L5127L1705K5467J7635R304J313n549j0640j3683j4702j4048
63341A024066j2546j1225j0712j1082j2420j5091j9208k4082k8562l1800l3489
63330H13849l3655l2537l0556k8019k4920k1254j7395j3879j0790p620l930j47
63318E89147K371K202r85o083j1367j5608j8250j8876j7305j4307j1515r948r011
63305D60465p477n185k989j217Q73L729O387P467O891N858N052L638M75m119q455
63290D71393j1198j2422j2875j2816j2014j0585r166q208p582o953o194n331m353
63277C51696l303k396j802j510j374j246r67m65J43O64J043J274J230Q90O65J004
63261C45546J715K219K567L509N204O559O493N405M646M791N223N418N797O919
$$ plain form
63353 926780 962137 997264 1028969 1054436 1072071 1081375 1082688 1077139 1066499 1052816 1038114 1024066
63341 1024066 1011520 1000295 989583 978501 966081 950990 931782 907700 879138 847338 813849
63330 813849 780194 747657 717101 689082 664162 642908 625513 611634 600844 593224 589294 589147
63318 589147 591518 593720 592735 586652 575285 559677 541427 522551 505246 490939 479424 469476 460465
63305 460465 452988 447803 444814 443597 444470 448199 454586 462053 468944 474802 479854 483492 483967 479848 471393
63290 471393 460195 447773 434898 422082 410068 399483 390317 382109 374527 367574 361380 356049 351696
63277 351696 348393 345997 344195 342685 341311 340065 339098 338633 338776 339440 340483 341757 342987 343877 344542 345546
63261 345546 347261 349480 352047 355556 360760 367319 373812 379217 383863 388654 393877 399295 405092 412011
63247D12011Q408R216Q854Q033Q004R436J1906J4460J6527J8238J9887K1436K2642
63234E89058K3469K4161K5027K6295K7921K9380K9912K9338K8389K7790K7313
63223H88053K6267K4865K4283K5188K6780K7789K7960K8008K8277K8092K6594
63212A182156K3767K0276J6495J2064O504J2o584j2565j7778k2313k6107k8999
63200A146928l0956l1910l1494k9339k5701k1576j8042j5504j3698j2215j0966
63189I05527j0074r418q417o455l538l30K512M883O977Q859J0557J2320J4300
63176I27703J6058J6886J6656J5952J5261J4551J3759J3143J2776J2063J0324
63165A085132P580M352P91l400q282j3414j8305k2642k6055k8237k9475l0487
$$ plain form
63247 412011 420419 429635 438489 446522 454526 463962 475868 490328 506855 525093 544980 566416 589058
63234 589058 612527 636688 661715 688010 715931 745311 775223 804561 832950 860740 888053
63223 888053 914320 939185 963468 988656 1015436 1043225 1071185 1099193 1127470 1155562 1182156
63212 1182156 1205923 1226199 1242694 1254758 1261262 1261274 1254690 1242125 1224347 1202034 1175927 1146928
63200 1146928 1115972 1084062 1052568 1023229 997528 975952 957910 942406 928708 916493 905527
63189 905527 895453 886035 877618 871163 867625 867295 869807 874690 881667 890526 901083 913403 927703
63176 927703 943761 960647 977303 993255 1008516 1023067 1036826 1049969 1062745 1074808 1085132
63165 1085132 1092712 1097064 1097855 1094455 1086173 1072759 1054454 1031812 1005757 977520 948045 917558
63153I17558l1381l1294k9586k6964k4757k3325k1871j9741j7199j4819j2798
63142F63823j1117r817q735p459n927m646l915l249j989k84J127J915K482L417
63128F15626N042P429J0338J3138J5164J6196J6388J5832J4539J2673J0344P315
63116G60024L406p84m157o195p343q166q600q241p034n439m122l519l455l226
63102F93149k388j407j106j564k105k358k618k984k931k140j118n55m80m80l07
63087F68608J50J028K122K800K783K689L263M332N159N545N937O631P437Q161
63073G26645Q810R307R532R699J0270J1361J2626J3799J4988J6325J7700J9048
63061H80110K0663K2941K5877K8977L1743L4221L7007M0609M4824M8925N2429
$$ plain form
63153 917558 886177 854883 825297 798333 773576 750251 728380 708639 691440 676621 663823
63142 663823 652706 642889 634154 626695 620768 616122 612207 608958 606969 606685 607812 609727 612209 615626
63128 615626 620668 628097 638435 651573 666737 682933 699321 715153 729692 742365 752709 760024
63116 760024 763430 762646 758489 752294 744951 736785 728185 719944 712910 707471 703349 699830 696375 693149
63102 693149 690761 689354 688248 686684 684579 682221 679603 676619 673688 671548 670430 669875 669395 668915 668608
63087 668608 668758 669786 671908 674708 677491 680180 683443 687775 692934 698479 704416 711047 718484 726645
63073 726645 735455 744762 754294 763993 774263 785624 798250 812049 827037 843362 861062 880110
63061 880110 900773 923714 949591 978568 1010311 1044532 1081539 1122148 1166972 1215897 1268326
63050A268326N5423N8152O0688O3063O5299O7046O7632O6894O5570O4494O3666
63039A966253O2576O1193O0039N9454N9257N9156N9001N8488N6858N3084M6401
63028B601760L6876K5385J2753j161j6876l3638m9145o1587p1321p9740q6934
63017B276372r1545r2642r0684q6604q0940p4104o6533n8308m9303m0009l1371
63006A514329k3532j5608p237M89O398J0873J5202J9688K3406K5747K7224K8528
62994A625507K9560K9870K9620K9479K9715K9821K9124K7469K5128K2288J8894
62983A926475J4896J0275M790j953r917j8412k6709l4684m2542n0105n6692o1648
62971A653774o4611o5472o4441o2149n9254n5942n2106m7900m3802m0125l6909
$$ plain form
63050 1268326 1323749 1381901 1442589 1505652 1570951 1637997 1705629 1772523 1838093 1902587 1966253
63039 1966253 2028829 2090022 2150061 2209515 2268772 2327928 2386929 2445417 2502275 2555359 2601760
63028 2601760 2638636 2664021 2676774 2675613 2658737 2625099 2575954 2514367 2443046 2363306 2276372
63017 2276372 2184827 2092185 2001501 1914897 1833957 1759853 1693320 1635012 1585709 1545700 1514329
63006 1514329 1490797 1475189 1467952 1468441 1474839 1485712 1500914 1520602 1544008 1569755 1596979 1625507
62994 1625507 1655067 1684937 1714557 1744036 1773751 1803572 1832696 1860165 1885293 1907581 1926475
62983 1926475 1941371 1951646 1956436 1954483 1944566 1926154 1899445 1864761 1822219 1772114 1715422 1653774
62971 1653774 1589163 1523691 1459250 1397101 1337847 1281905 1229799 1181899 1138097 1097972 1061063
62960A061063l4196l1963k9873k7625k5551k4259k3650k2911k1693k0533j9884
62949G78925j9364j8477j7431j6617j5837j4687j3379j2466j1890j1084r989r216
62937F08488q991q558p069m752k816k220k760l336l032j850m33P68J810K707K984
62922E70940K173N99p97j463j697k035k520k884l167l757m746n612n734n124m445
62907E29731m241m381m344l915l356k940k649k402k292k369k374k042j515j210
62893D89701j245j315j191j005r39q91o69k63K55Q62J346J264N61k2K94J233J813
62876D89789J761J813K310K464J583K94l49m51r08j797k309k297k597l499l992
62861D81815l175j548j91O09J144J271O38l87q22j90R88J788J645P03k46m43n0
$$ plain form
62960 1061063 1026867 994904 965031 937406 911855 887596 863946 841035 819342 798809 778925
62949 778925 759561 741084 723653 707036 691199 676512 663133 650667 638777 627693 617704 608488
62937 608488 599497 590939 583870 579118 576302 574082 571322 567986 564954 563104 562671 563439 565249 567956 570940
62922 570940 573113 573712 572915 571452 569755 567720 565200 562316 559149 555392 550646 545034 539300 534176 529731
62907 529731 525490 521109 516765 512850 509494 506554 503905 501503 499211 496842 494468 492426 490911 489701
62893 489701 488456 487141 485950 484945 484006 483115 482446 482183 482438 483300 484646 485910 486471 486449 486743 487976 489789
62876 489789 491550 493363 495673 498137 499720 500014 499665 499214 498306 496509 494200 491903 489306 485807 481815
62861 481815 478640 477092 476901 477510 478654 479925 480563 480176 479354 479164 480152 481940 483585 484288 484042 483599 483549
62844D83549Lo52j204r38m82r03k003k544k022j203q50q25p19n36m24k85l0K37
62826D68169M92Q55J274J536J666J922K321K657K995L581M303M780N131N969P375
62811E15026Q543Q734Q138P515P353P677Q244Q703Q836Q891R259R852J0201J0310
62797F37282J0797J1960J3347J4526J5774J7576J9971K2769K5952K9421L2856
62786H52231L6350M0709M6494N3080N9321O5022P1027P7888Q5082R1697R7408
62775A576309J02430J06776J09831J10662J08573J03326R4938Q3417O8906N1926
62765B517094L3252J3536o660k6468m4751o0756p4508q6294r5956j02901j06772
62754A958816j07833j06734j04012r9914r4712q8974q3301p7772p2013o5893n9863
$$ plain form
62844 483549 483552 482900 481696 480758 480276 479373 477370 474826 472804 471601 470751 469926 469207 468671 468247 467962 467932 468169
62826 468169 468661 469516 470790 472326 473992 475914 478235 480892 483887 487468 491771 496551 501682 507651 515026
62811 515026 523569 532303 540441 547956 555309 562986 571230 579933 588769 597660 606919 616771 626972 637282
62797 637282 648079 660039 673386 687912 703686 721262 741233 764002 789954 819375 852231
62786 852231 888581 929290 975784 1028864 1088185 1153207 1224234 1302122 1387204 1478901 1576309
62775 1576309 1678739 1785515 1895346 2006008 2114581 2217907 2312845 2396262 2465168 2517094
62765 2517094 2550346 2563882 2557222 2530754 2486003 2425247 2350739 2264445 2168489 2065588 1958816
62754 1958816 1850983 1744249 1640237 1540323 1445611 1356637 1273336 1195564 1123551 1057658 997795
62743I97795n4315m9002m3511l8029l3155k9137k5735k2683j9877j7219j4825
62732F50307j3149j2364j1806j0591q689o750n094l571k209j165j78J060K054
62719E77855K033J370J418K721M471O000P692R936J2274J4280J6328J8789K1240
62706F96407K3274K5374K8212L1673L5341L9359M4042M9068N3830N8217O2450
62695A147247O6488P0136P3269P5460P5928P4355P1190O6512N9343M8876L5825
62684A864629K1724P377p108k1311l4527m6482n7085o5713p1667p5128p6825p6949
62672A360935p5297p2257o8709o5023o1001n6737n2596m8448m3775l8694l4038
62661G44360l0384k7647k5602k4013k2275j9799j6916j4557j3010j1733j0560
$$ plain form
62743 997795 943480 894478 850967 812938 779783 750646 724911 702228 682351 665132 650307
62732 650307 637158 624794 612988 602397 593708 586958 581864 578293 576084 574919 574741 575801 577855
62719 577855 579888 581258 582676 585397 589868 595868 603560 613496 625770 640050 656378 675167 696407
62706 696407 719681 745055 773267 804940 840281 879640 923682 972750 1026580 1084797 1147247
62695 1147247 1213735 1283871 1357140 1432600 1508528 1582883 1654073 1720585 1779928 1828804 1864629
62684 1864629 1886353 1893730 1886622 1865311 1830784 1784302 1727217 1661504 1589837 1514709 1437884 1360935
62672 1360935 1285638 1213381 1144672 1079649 1018648 961911 909315 860867 817092 778398 744360
62661 744360 713976 686329 660727 636714 614439 594640 577724 563167 550157 538424 527864
62650E27864j0050j0299j0275r033p038n651n510n952n895m952l654k688k130
62637D44737j479m53O13J254J274N58r15k444k765j609m74q52k124k410j203J56
62621D31864N82N57R41J774K768L997N443O541O868O725O554O363O241O766Q229
62606E02213R901J0854J1265J2272J4553J7582K0339K2389K4167K6484K9890L4392
62594G36301L9541M4585M8628N1108N2348N3276N4220N4231N1956M6918L9546
62583A272658L0415K0147R716n3r213j8227k6858l4263m0125m4774m8205m9956
62571A061262n0080m9301m7920m5540m2228l8980l6512l4356l1723k8522k5052
62560F31048k1442j8035j5559j4156j2882j0901q664p125o280n326l922k421j123
$$ plain form
62650 527864 517814 507515 497240 488207 481169 475518 470008 464056 458161 453209 449555 446867 444737
62637 444737 443258 442805 443418 444672 445946 446504 445589 443145 440380 438771 438297 437445 435321 432911 431708 431864
62621 431864 432446 433003 433944 435718 438486 442483 447926 454467 461335 468060 474614 480977 487218 493984 502213
62606 502213 512114 522968 534233 546505 561058 578640 598979 621368 645535 672019 701909 736301
62594 736301 775842 820427 869055 920163 972511 1025787 1080007 1134238 1186194 1233112 1272658
62583 1272658 1303073 1323220 1332936 1332883 1323670 1305443 1278585 1244322 1204197 1159423 1111218 1061262
62571 1061262 1011182 961881 913961 868421 826193 787213 750701 716345 684622 656100 631048
62560 631048 609606 591571 576012 561856 548974 538073 529409 522284 516004 510678 506756 504335 503212
62547E03212q2M21Q3p64j335j282q47k27N84J289J319N59m41j129j363j098k33
62530D98666R70J888K365L136M896P167Q759R367J0112J2161J5289J8306K0665
62517F13747K2933K5673K8618L1297L3908L6879L9980M2507M4266M5638M6658
62506A012104M6680M5073M1729L6831L0607K3538J6281R258K586l519q776j3148
62494A239244j6571j8342j7632j4798j1347q205m704J41O152J2311J8004K3123
62482A207376K7521L1177L4552L7832L9888L8849L3857K5796J6387P157r38p884
62470A491570j4867k3420l3724m4097n2405n7625n9936n9941n8402n6349n4483
62459I76321n2427m9091m4086l8343l3070k8471k3953j9325j5133j1748q804n836
$$ plain form
62547 503212 503130 503551 503634 502870 501535 500253 499406 499179 499763 501052 502371 502930 502489 501360 499997 498899 498666
62530 498666 499636 501524 503889 507025 511921 519088 527847 537214 547326 559487 574776 593082 613747
62517 613747 636680 662353 690971 722268 756176 793055 833035 875542 919808 965446 1012104
62506 1012104 1058784 1103857 1145586 1182417 1213024 1236562 1252843 1262101 1264687 1261168 1252392 1239244
62494 1239244 1222673 1204331 1186699 1171901 1160554 1152349 1147645 1147786 1153938 1166249 1184253 1207376
62482 1207376 1234897 1266074 1300626 1338458 1378346 1417195 1451052 1476848 1493235 1500392 1499454 1491570
62470 1491570 1476703 1453283 1419559 1375462 1323057 1265432 1205496 1145555 1087153 1030804 976321
62459 976321 923894 874803 830717 792374 759304 730833 706880 687555 672422 660674 651870 646034
62447F46034k988o66J097K491L502M214N245P158R536J1341J2217J2715J3145
62434G25041J2954J1599R352O809M032P60k888o302q887j0387j0863j0677j0376
62421G10167j0378j0731j1214j1583j1785j1984j2291j2376j1753j0686j0251
62410E85135j0877j1401j0503q621p243o524n221l130j792k020k367j294M25J050
62396E15617O30P30J888L042L422L445L516L317K773K528K959L584M024M708O086
62381E62269P689Q699R013R143R323R407R471R980J1089J2202J2570J2230J2073
62368F95158J2816J4181J5398J6306J7470J9317K1779K4971K9357L4810M0195
62357I41758M4582M8405N2580N6964O0349O1740O0774N7221N1116M3209L4379
$$ plain form
62447 646034 643046 642380 643477 645968 649470 653684 658929 666087 675623 686964 699181 711896 725041
62434 725041 737995 749594 758946 765755 769787 770547 767659 761357 752470 742083 731220 720543 710167
62421 710167 699789 689058 677844 666261 654476 642492 630201 617825 606072 595386 585135
62410 585135 574258 562857 552354 543733 536490 529966 524745 521615 519823 517803 515436 514142 514567 515617
62396 515617 516247 516977 518865 521907 525329 528774 532290 535607 538380 540908 543867 547451 551475 556183 562269
62381 562269 569958 578657 587670 596813 606136 615543 625014 634994 646083 658285 670855 683085 695158
62368 695158 707974 722155 737553 753859 771329 790646 812425 837396 866753 901563 941758
62357 941758 986340 1034745 1087325 1144289 1204638 1266378 1327152 1384373 1435489 1478698 1513077
62346A513077K4641J3803L050n484j1212j6034k1997k8906l4989l9185m1835m3537
62334A311392m4369m4157m2783m0123l6267l1783k7382k3338j9642j6641j4930
62323I69977j4590j4927j5255j5587j6410j7955j9834k1260k1507k0386j8455
62312G73811j6654j5517j4647j3147j0598p644n455m638m713m725m219l529l230
62299F65095l510m049m278l734k338n34Q59J155L56o69p28O28K510L515L303L020
62283F60601L777N169N922N691N379N636O133O678Q010J0519J2963J3644J2765
62270G62887J2286J3296J4684J4965J4355J4087J4474J4866J5250J6615J9500
62259I27265K3262K7285L2035L8224M5411N2210N7615O1468O3718O3794O0865
$$ plain form
62346 1513077 1537718 1551521 1554571 1549087 1537875 1521841 1499844 1470938 1435949 1396764 1354929 1311392
62334 1311392 1267023 1222866 1180083 1139960 1103693 1071910 1044528 1021190 1001548 984907 969977
62323 969977 955387 940460 925205 909618 893208 875253 855419 834159 812652 792266 773811
62312 773811 757157 741640 726993 713846 703248 695604 690149 685511 680798 676073 671854 668325 665095
62299 665095 661585 657536 653258 649524 647186 646652 647511 648666 649022 648353 647625 648253 650763 654278 657581 660601
62283 660601 664378 669547 675469 681160 686539 692175 698308 704986 712996 723515 736478 750122 762887
62270 762887 775173 788469 803153 818118 832473 846560 861034 875900 891150 907765 927265
62259 927265 950527 977812 1009847 1048071 1093482 1145692 1203307 1264775 1328493 1392287 1453152
62248A453152N4501M5159L4352K4061J5473Q260J315o017j3791k2129l1138m0166
62236A523032m7884n3473n7177n9441o0105n8841n5948n2183m8016m3517l8766
62225I47681l4031k9510k5198k1040j7143j3888j1738j0716j0084q916p125n566
62213G52726m936m866m376k961j006P27J782K340K987M041N191O065P100R158
62199G73972J2104J4421J4804J3690J2576J2090J1423R701P273N375M764N028
62187H97221N128M553L763L530M040M857N615O295O867P142P106O935O592N893
62173I75537N214N526P362J0161J3015J5696J8602K2091K6365L1500L7064M1857
62161A209990M4575M4691M2429L8211L2501K5852J8620J0880K916m442j0455j5108
$$ plain form
62248 1453152 1507653 1552812 1587164 1611225 1626698 1634958 1636273 1630256 1616465 1594336 1563198 1523032
62236 1523032 1475148 1421675 1364498 1305057 1244952 1186111 1130163 1077980 1029964 986447 947681
62225 947681 913650 884140 858942 837902 820759 806871 795133 784417 774333 765417 758292 752726
62213 752726 747790 742924 738548 735587 734581 735308 737090 739430 742417 746458 751649 757714 764814 773972
62199 773972 786076 800497 815301 828991 841567 853657 865080 874781 882054 887429 892193 897221
62187 897221 902349 906902 910665 914195 918235 923092 928707 935002 941869 949011 956117 963052 969644 975537
62173 975537 980751 986277 993639 1003800 1016815 1032511 1051113 1073204 1099569 1131069 1168133 1209990
62161 1209990 1254565 1299256 1341685 1379896 1412397 1438249 1456869 1467749 1470665 1466223 1455768 1440660
62149A440660j8807k1878k4788k8270l2428l6067l7769l7447l6051l4105l1444
62138A101606k8243k5159k2239j8710j4328j0105p230n845n360n423o026p008
62126I45930q051q996r746r995r365p814n632l174p44J353K758L098K031m67l770
62111H87416o704q203p952o403m376k697k017k720m759p578j0242j1961j2567
62098G99237j2417j1765j0495q544o320m395k943j739o81K0J51j16k01M37J705
62083G41934K788L015K749L087M550O536Q277R695J1047J2292J3293J4247J5311
62070H48821J6194J6668J7175J8332K0091K2059K4380K7518L1223L4354L5856
62059A112671L5392L2990K8682K2705J5741Q699K384k764o898j0706j4867j9610
$$ plain form
62149 1440660 1421853 1399975 1375187 1346917 1314489 1278422 1240653 1203206 1167155 1133050 1101606
62138 1101606 1073363 1048204 1025965 1007255 992927 982822 975592 969747 964387 958964 952938 945930
62126 945930 937879 928883 919137 909142 899777 891963 886331 883157 882413 883766 886524 889622 891653 891186 887416
62111 887416 880712 872509 864557 858154 853778 851081 849064 846344 841585 834007 823765 811804 799237
62098 799237 786820 775055 764560 756016 749696 745301 742358 740619 739938 739958 740109 739993 739792 740229 741934
62083 741934 744722 747737 750486 753573 758123 764659 772936 782631 793678 805970 819263 833510 848821
62070 848821 865015 881683 898858 917190 937281 959340 983720 1011238 1042461 1076815 1112671
62059 1112671 1148063 1181053 1209735 1232440 1248181 1256880 1259264 1256500 1249602 1238896 1224029 1204419
62047A204419k4786l0112l5036l8806m1024m1909m1822m0908l9492l8155l6911
62036G95458l4936l1826k8468k5845k3593k0791j7680j5383j4056j2752j1083
62025E59045r729r030q290p009n718n084n004n101n349n653n496m578l361k440
62011D77203j896j590j574j762j765j452j227j309j236o11J71M86M86R08J967
61996D66799K949K992K047R64O48J112J417P62o17j940k993m170n554o677p319
61981D50420p806q222q032o843n115l650k791k378k165j937j492p93M4R94K045
61966D02279K867K963K302J413P41K91l7j93k27l40n30n32k25K56P72J182J114
61949D14096L56n27n53N63K158L503M400M884N043N232N861O787P515P996Q513
$$ plain form
62047 1204419 1179633 1149521 1114485 1075679 1034655 992746 950924 910016 870524 832369 795458
62036 795458 760522 728696 700228 674383 650790 629999 612319 596936 582880 570128 559045
62025 559045 549316 540286 531996 524987 519269 514185 509181 504080 498731 493078 487582 483004 479643 477203
62011 477203 475307 473717 472143 470381 468616 467164 465937 464628 463392 462781 462952 463438 463924 464832 466799
61996 466799 469748 472740 474787 475751 476399 477511 478928 479690 479073 477133 474140 469970 464416 457739 450420
61981 450420 442614 434392 426360 419517 414402 410752 407961 405583 403418 401481 399989 399196 399240 400234 402279
61966 402279 405146 408109 410411 411824 412565 412856 412819 412626 412399 412059 411529 410997 410772 411028 411800 412982 414096
61949 414096 414452 413925 413372 413935 416093 419596 423996 428880 433923 439155 445016 451803 459318 467314 475827
61934D75827Q859Q517P796P714Q431Q793P919O326M899L681K358J155M21n1o11
61919E52034j133j492k064l065l836l536k205m86J376L591O150Q663J0709J2003
61905E76709J2476J2500J2592J2663J2121J1017J0305J0462J0692J0251R773J0313
61893G11874J1674J2768J3331J4175J5810J7760J9196J9491J8166J5151J1117
61882H80513O875K389k959r106j5014j9741k3149k5401k6410k6169k5144k3878
61870F92806k2354k0112j7048j3926j1869j1198j0907r660p240m689k935j835
61858E59033p66M71J728L055M569O080P323Q379R496J0648J1556J2023J2018J1706
61844F57319J1505J1681J1769J0841Q680O057L574R53k050m640n799n653n258
$$ plain form
61934 475827 484686 493203 500999 508713 517144 525937 533856 540182 545081 548762 551120 552275 552696 552645 552034
61919 552034 550901 549409 547345 544280 540444 536908 534703 534217 535593 539184 545334 553997 564706 576709
61905 576709 589185 601685 614277 626940 639061 650078 660383 670845 681537 691788 701561 711874
61893 711874 723548 736316 749647 763822 779632 797392 816588 836079 854245 869396 880513
61882 880513 887388 889777 886818 877712 862698 842957 819808 794407 767997 741828 716684 692806
61870 692806 670452 650340 633292 619366 607497 596299 585392 575732 568492 563803 560868 559033
61858 559033 558267 558738 560466 563521 568090 574170 581493 589872 599368 610016 621572 633595 645613 657319
61844 657319 668824 680505 692274 703115 711795 717852 721426 722379 720329 715689 709890 704237 698979
61831F98979n192n055m265k763q67J141L195N399P648R352R895R475Q903Q427
61817G44272P485N864M279L230K248J025N17J759M138N922O222N385L648N80l901
61802G92673q880j3144j6103j7825j8567j8397j7151j4839j2140j0030q637p086
61790F29874m929l007k243k189j730p08J67P04J420K389L016L076L105L539M146
61775F36630M615N090N875O986Q254R609J1119J2874J4837J6812J8715K0866K3611
61762G95893K6653K9359L1776L4553L7585L9695M0070L9038L6832L2730K6228
61751A170412J8054R008j064j2017k2173k9871l5373l9711m2554m2933m1407l9470
61739H90901l7253l3839k9646k6322k4234k2203j9880j8205j7110j5057j1668
$$ plain form
61831 698979 693787 688732 684467 681704 680837 681978 685173 690572 698220 707572 717467 726942 735845 744272
61817 744272 751757 757621 761900 765130 767378 768403 768920 770679 774817 780739 786961 792346 795994 796574 792673
61802 792673 783793 770649 754546 736721 718154 699757 682606 667767 655627 645597 636960 629874
61790 629874 624945 621938 619695 617506 615776 615068 615235 615939 617359 619748 622764 625840 628945 632484 636630
61775 636630 641245 646335 652210 659196 667450 677059 688178 701052 715889 732701 751416 772282 795893
61762 795893 822546 851905 883681 918234 955819 995514 1035584 1074622 1111454 1144184 1170412
61751 1170412 1188466 1197474 1196410 1184393 1162220 1132349 1096976 1057265 1014711 971778 930371 890901
61739 890901 853648 819809 790163 763841 739607 717404 697524 679319 662209 647152 635484
61728F35484q702p339o451m796l110k535k596k343k202k861l445k704j357j242
61714E83801k463l197k348q36J8j1n02j212j889k124j912j773j970k151k139k507
61698E56785l832n718p037p146o453n758n379n144n013n195n626n810n451m938
61684D78285m809m995n048m818m501m140l584k881k143j282k63M89N33Q3l14n39
61668D40073p15n67K24J269J985K711M205O180P456P763Q110R064R859R716Q934
61653E16267Q004O604M323J633p09k648m496o036o673o185m794k839p59R42K132
61638E04766L161M293N388O374P472Q708R677R943R194O992L162j399n208p819
61624E64704j0123j2674j4626j4945j3774j1963j0009q175o912o316n714m580
$$ plain form
61728 635484 626782 619443 612992 608196 605086 602551 599955 597612 595410 592549 589104 586400 585043 583801
61714 583801 581338 578141 575793 574957 574975 574964 574462 573250 571361 569237 567325 565552 563582 561431 559292 556785
61698 556785 552953 547235 540198 533052 526599 520841 515462 510318 505305 500110 494484 488674 483223 478285
61684 478285 473476 468481 463433 458615 454114 449974 446390 443509 441366 440084 439821 440310 440843 440926 440612 440073
61668 440073 439358 438791 439015 440284 442269 444980 449185 455365 462821 470584 478694 487758 497617 507333 516267
61653 516267 524271 530875 535198 536831 536122 533474 528978 522942 516269 510084 505290 502451 501692 502634 504766
61638 504766 507927 512220 517608 523982 531454 540162 549839 559782 568976 575968 579130 577731 572523 564704
61624 564704 554581 541907 527281 512336 498562 486599 476590 468415 461503 455187 449473 444893
61612D44893l391k921l133l457l662l799l759l524l471l784l967l568k922k598
61598C96937k572k544k564k692k507j786j222j639k742l452l277k674k207j959
61584C63100j717j211l59M41N89J52k7M79J006R11O08P73J162J154J010J497K527
61567C72095L234L284L187L316L438L335L185L281L886N176O803P711P061N280
61553D34272L575K601K182K006J851J357L70n77q71p90j064j676j956j771j631
61538D37878j616j130L2J203J751J725J328M62q10j932k450k556k722l050l239
61523D24874k993k363j811j847k342k457j620l24N86J135J983L137L854L884L915
61508D27611M446N044N202N271N958P326Q808R970J0846J1747J2948J4413J5689
$$ plain form
61612 444893 441502 438581 435448 431991 428329 424530 420771 417247 413776 409992 406025 402457 399535 396937
61598 396937 394365 391821 389257 386565 384058 382272 381050 379411 376669 373217 369940 367266 365059 363100
61584 363100 361383 360172 359813 360254 360843 360995 360968 361447 362453 363364 363972 364745 365907 367061 368071 369568 372095
61567 372095 375329 378613 381800 385116 388554 391889 395074 398355 402241 407417 414220 421931 428992 434272
61553 434272 437847 440448 442630 444636 446487 447844 448214 447637 446766 445976 444912 443236 441280 439509 437878
61538 437878 436262 435132 435164 436367 438118 439843 441171 441633 440823 438891 436441 433885 431163 428113 424874
61523 424874 421881 419518 417707 415860 413518 411061 409441 409117 409703 410838 412821 415958 419812 423696 427611
61508 427611 432057 437101 442303 447574 453532 460858 469666 479636 490482 502229 515177 529590 545279
61495E45279J6282J6292J6218J6067J5162J3181J0874R211Q143O800M728K383
61483F80620M53p98j376j313q54n52p87j394k034k792m001n503o572o703o068
61468F40326n030l667k170j309j848l647n790p475q361q300p449o500o080n898
61454E66802n196m006l105k685k072r89l4N80J644L562N328N863N632N862O716
61439E83902P274O944N856M103J682q20k450k914k713k285j655r71o32p08p35
61424E93878k37Q65K294L631M609N377O233O883O530N034L327K110Q72j010k955
61409F37441l963m135m318m639m583m168l781l185k031j092j487k674k857j627
61395E92901m84l66l47M19J140R44N94J245K480L068L005L377M491N601O240O691
$$ plain form
61495 545279 561561 577853 594071 610138 625300 638481 649355 658566 666709 673509 678237 680620
61483 680620 681073 680275 678899 677586 676732 676180 675393 673999 671965 669173 665172 659669 653097 646394 640326
61468 640326 635296 631629 629459 628150 626302 622655 616865 609390 601029 592729 585280 578780 572700 566802
61454 566802 561606 557600 554495 551810 549738 548749 548715 549295 550939 554501 559829 565692 571324 577186 583902
61439 583902 591176 598120 603976 608079 609761 608941 606491 603577 600864 598579 596924 595953 595321 594613 593878
61424 593878 593641 594506 596800 600431 605040 610417 616650 623533 630063 635097 638424 640534 641406 640396 637441
61409 637441 633478 629343 625025 620386 615803 611635 607854 604669 602638 601546 600059 597385 594528 592901
61395 592901 592417 592051 591704 592123 593263 594207 594801 596046 598526 601594 604599 607976 612467 618068 624308 630999
61379F30999P108P227P146P384Q002Q469Q592Q782R111Q835P379N203L146J296
61365G28679r08l616o205p998q970r577j0160j0716j1034j0844r944q416o766
61352F23525n561m861m221l326k468k185k568l181l540l533l347l140k825k180
61338E76589j243m63j74L2R44K573L860L898L047K338K134K003J711J670K287
61323F01206L359M337M900N146N425N957O546O804O797P178Q329R699J0429J0420
61309F96532J0332J0675J1437J2460J3636J4704J5316J5324J4672J3152J0732
61298H38972P926N307K808O0k677m711n978p144q530r761j0685j1782j3196j4077
61284G66532j3577j2094j0846j0410j0238r614q573p678p194o670n441l533j917
$$ plain form
61379 630999 638107 645334 652480 659864 667866 676335 684927 693709 702820 711655 719034 724237 727383 728679
61365 728679 727771 724155 717950 709952 700982 691405 681245 670529 659495 648651 638707 630291 623525
61352 623525 617964 613103 608882 605556 603088 600903 598335 595154 591614 588081 584734 581594 578769 576589
61338 576589 575346 574883 574709 574741 575685 578258 582118 586016 589063 591401 593535 595538 597249 598919 601206
61323 601206 604565 608902 613802 618948 624373 630330 636876 643680 650477 657655 665984 675683 686112 696532
61309 696532 706864 717539 728976 741436 755072 769776 785092 800416 815088 828240 838972
61298 838972 846898 852205 855013 855073 852396 847685 841707 834563 826033 816272 805587 793805 780609 766532
61284 766532 752955 740861 730015 719605 709367 699753 691180 683502 676308 669638 664197 660664 658747
61271F58747j637k665l906m349l995l506l220k814j845l40J287K713L872M650
61257F42992M777M270L668L383L054K166J175J224K671M636O333P899R470J0433
61243G08151J0391J0035J0062R779P932M569J002j835l966n421n905n507m807
61230G34480m010k757r97P87K322L851N433O751P811R186J1118J2847J3243J1861
61216H11926R308O886N645N470N124L691J706L49r7k08j98K37R84J425J419J449
61200H55116J726K059K671M093O133P959R358J0776J1828J1122Q162M355J313
61187I36671r09l073n233o891q012q883r411r440r437j0040j1134j2077j2621
61174H29510j3018j3438j3853j4294j4667j4532j3615j2344j1394j0817j0190
$$ plain form
61271 658747 657110 654445 650539 646190 642195 638689 635469 632655 630810 630470 631757 634470 638342 642992
61257 642992 647769 652039 655707 659090 662144 664310 665485 666709 669380 674016 680349 688248 697718 708151
61243 708151 718542 728577 738639 748418 756350 760919 761921 760086 756120 750699 744794 739287 734480
61230 734480 730470 727713 726716 727503 729825 733676 739109 745860 753671 762857 773975 786822 800065 811926
61216 811926 821234 828120 833765 839235 844359 848050 849756 850105 850008 849800 849602 849839 850823 852248 853667 855116
61200 855116 856842 858901 861572 865665 871798 879757 889115 899891 911719 922841 931003 935358 936671
61187 936671 935762 932689 927456 920565 912553 903670 894259 884819 875382 865342 854208 842131 829510
61174 829510 816492 803054 789201 774907 760240 745708 732093 719749 708355 697538 687348
61163F87348r467r107r284r463q967p759o500n842n704n331m136k361o73P01K076
61148F05531L471M262L818K217Q4j948l506m442m802m672m057l036j914r46mJ186
61132E91242K578L896N062O133P037P799Q785J0219J1653J2552J3217J4441J6339
61119G10953J8267J9750K0735K1139K1011K1090K2193K3868K4655K3916K2590
61108I50167K1805K1633K1491K0969J9889J8230J6310J4504J2553R867O627L764
61096A137809J667k03k151l659m285m304l998l160j801m82N53J913M131O875R477
61081A138382J1696J3533J4922J6033J7184J8216J8542J8089J7398J6486J4533
61070A315014J1200P369M032J169j688m557p285r994j2644j4656j5619j5912j6227
$$ plain form
61163 687348 677881 668774 659490 650027 641060 633301 626801 620959 615255 609924 605788 603427 602754 603455 605531
61148 605531 609002 613264 617082 619299 619383 617435 613929 609487 604685 600013 595956 592920 591006 590060 590056 591242
61132 591242 593820 597716 602778 608911 615948 623747 632532 642751 654404 666956 680173 694614 710953
61119 710953 729220 748970 769705 790844 811855 832945 855138 879006 903661 927577 950167
61108 950167 971972 993605 1015096 1036065 1055954 1074184 1090494 1104998 1117551 1127418 1134045 1137809
61096 1137809 1139476 1139273 1137122 1133463 1129178 1124874 1120876 1117716 1115915 1115433 1115986 1117899 1122030 1128905 1138382
61081 1138382 1150078 1163611 1178533 1194566 1211750 1229966 1248508 1266597 1283995 1300481 1315014
61070 1315014 1326214 1333583 1337615 1338784 1337096 1332539 1325254 1315260 1302616 1287960 1272341 1256429 1240202
61057A240202j6787j7354j7536j6948j5568j4020j2901j1839j0014p495n129l171
61045A091440j107J110K957M475O225P960Q875R431J1165J4253J6937J8146J8965
61032A210832K0650K2790K4563K6325K8767L1602L4111L5995L6994L7011L7251
61021A546891L9728M4886N1317N8430O7332P8180Q8961R8272J07242J17559J30107
61010B428905J47032J72178K07336K50885L02365L65099M41550N30279O32081
61001E477710P55575R12083J108962J351293J634920J912581K065816J946942
60993A7165882J492699Q09264J28005l40268n15584m35617j77350J72238M81910
60984A8781179N75164L23786k40284r23020j494035j822586j910473j830078j655962
$$ plain form
61057 1240202 1223415 1206061 1188525 1171577 1156009 1141989 1129088 1117249 1107235 1099740 1094611 1091440
61045 1091440 1090333 1091443 1094400 1098875 1105100 1113060 1121935 1131366 1142531 1156784 1173721 1191867 1210832
61032 1210832 1231482 1254272 1278835 1305160 1333927 1365529 1399640 1435635 1472629 1509640 1546891
61021 1546891 1586619 1631505 1682822 1741252 1808584 1886764 1975725 2073997 2181239 2298798 2428905
61010 2428905 2575937 2748115 2955451 3206336 3508701 3873800 4315350 4845629 5477710
61001 5477710 6233285 7145368 8254330 9605623 11240543 13153124 15218940 17165882
60993 17165882 18658581 19467845 19595850 19255582 18739998 18304381 18127031 18299269 18781179
60984 18781179 19356343 19680129 19439845 18516825 17022790 15200204 13289731 11459653 9803691
60975I803691j442063j225665j028229q55036p03876n74625m68450l82655l12107
60966B810985k54180k08659j74147j47886j27934j12869j00415q8856p8786p1260
60956A445993o5049n7850m9353m1069l3873k7723k3177k1206k1626k3170k4841
60945A057056k5991k5738k3792k1412k0097j9726j9166j8246j7718j7688j7516
60934H29966j7092j6906j6918j6527j5605j4572j3505j2154j0729r687q854p670
60922F69747o258n396n275n151m357l109k122j888k347k930k923k103r70k34j92
60907F24492p11j408j813j783j906k871m284m907m374l806m206n059n349n173
60893E76842n457o446p380p488o665n280l808k627j814j286j227j980l345m567
$$ plain form
60975 9803691 8361628 7135963 6107734 5252698 4548822 3974197 3505747 3123092 2810985
60966 2810985 2556805 2348146 2173999 2026113 1898179 1785310 1684895 1596039 1517253 1445993
60956 1445993 1380944 1323094 1273741 1232672 1198799 1171076 1147899 1126693 1105067 1081897 1057056
60945 1057056 1031065 1005327 981535 960123 940026 920300 901134 882888 865170 847482 829966
60934 829966 812874 795968 779050 762523 746918 732346 718841 706687 695958 686271 677417 669747
60922 669747 663489 658093 652818 647667 643310 640201 638079 636191 633844 630914 627991 625888 624918 624684 624492
60907 624492 623781 622373 620560 618777 616871 614000 609716 604809 600435 596629 592423 587364 582015 576842
60893 576842 571385 564939 557559 550071 543406 538126 534318 531691 529877 528591 527364 525384 522039 517472
60879E17472n246n697o098o036n257m181l178k059p51K19N80R59J943L088L615
60864D89373L603L751M316M990N522N792N556M705L571K568J780J213J048J237
60850E39025J371J288J303J459J155M2j310k143k386k368k245k295l085m637o089
60835E19085o737o909p173p349p073o690o693o776o361n627n133m797m147l295
60821D34325k849k969l252l374l211k661j920j638k145k818k869k436k213k332
60807C97638k326j903j157k68M47N85L14M46J205J612R08n3J05J288K252K546
60791D03639K843L391L524K870K000J445R95L17m26q84r58p54n72q99j840k639
60775D12052k478j646j188j413j606j339j125j440j870j780j200n94j13M02R11
$$ plain form
60879 517472 512226 506529 500431 494395 489138 484957 481779 479720 478969 479188 479768 480727 482670 485758 489373
60864 489373 492976 496727 501043 506033 511555 517347 522903 527608 531179 533747 535527 536740 537788 539025
60850 539025 540396 541684 542987 544446 545601 545643 544333 542190 539804 537436 535191 532896 529811 525174 519085
60835 519085 512348 505439 498266 490917 483844 477154 470461 463685 457324 451697 446564 441767 437620 434325
60821 434325 431476 428507 425255 421881 418670 416009 414089 412451 410306 407488 404619 402183 399970 397638
60807 397638 395312 393409 392252 391984 392431 393016 393330 393776 394981 396593 397501 397448 397553 398841 401093 403639
60791 403639 406482 409873 413397 416267 418267 419712 420707 421024 420598 419714 418756 418002 417430 416531 414691 412052
60775 412052 409574 407928 406740 405327 403721 402382 401257 399817 397947 396167 394967 394373 394260 394662 395573
60760C95573J083P31J14j77K60J127J553J001j17r59j195j061p20j14O21J112
60744C98832J318J639K285K834K617J430k41j625k289k402k366k241j787j067
60730C96937n56m63m03k0M17M96L92O50J382K177K691K943L044K972K678K206
60714D17543J699J257Q10J86m86o35N0R15R44J3j065j705k022k139k013k074k955
60697D08323m219m481l410k396k534l029k655j728j322j379j051l44j2n3K92J176
60681C81178J970K471L102L927M395M251L817L444L370L942N121N933N384L735
60667D36040J971K31j998m321n404m819l605k661j704m12N26L26n84j043n70K87
60651D12260Q82J192J665K546L423L527K622J332L74k07p43j232j529j868k532
$$ plain form
60760 395573 396656 397387 397501 397324 397584 398711 400264 401265 401148 400189 398994 397933 397213 397099 397720 398832
60744 398832 400150 401789 404074 406908 409525 410955 410714 409089 406800 404398 402032 399791 398004 396937
60730 396937 396381 395918 395515 395495 395912 396408 396800 397450 398832 401009 403700 406643 409687 412659 415337 417543
60714 417543 419242 420499 421309 421495 421009 420374 420424 421339 422283 422296 421231 419526 417504 415365 413352 411278 408323
60697 408323 404104 399623 396213 393817 391283 388254 385599 383871 382549 381170 380119 379775 379763 379710 380002 381178
60681 381178 383148 385619 388721 392648 397043 401294 405111 408555 411925 415867 420988 426921 432305 436040
60667 436040 438011 438242 436244 431923 426519 421700 418095 415434 413730 413318 413844 414170 413586 412543 411973 412260
60651 412260 413142 414334 415999 418545 421968 425495 428117 429449 429823 429616 428873 427641 426112 424244 421712
60636D21712l258l599l644l624l130j631L78J658J740J285R45P16N60P40J274
60621D12122J725J766J489J072O92O81J095J277N89m56o83J58J179J771K182K540
60605D29199K335J342K15l30k73R5O51J138J094M88k5J42R18J876K622K717J900
60588D46104O35j72j82P0R3Mk2j76n24o59k00P01J591K159K337K346K718L793
60570D60616N252O550P638Q697R433R436R081R066R131Q284O390M367K694R01
60556E57536j138k588k933k754k632k253j310k73N35J725L754N867P083P706Q784
60541E77109J0488J1948J2579J2738J3196J4540J6949J9983K2717K4451K5098
60530G61796K4584K2392J8193J2492O166k85o482j1667j5139j6982j7799j7852
$$ plain form
60636 421712 418454 414855 411211 407587 404457 402826 403204 404862 406602 407887 408832 409548 410108 410848 412122
60621 412122 413847 415613 417102 418174 418866 419547 420642 421919 422508 422052 421369 421527 422706 424477 426659 429199
60605 429199 431534 432876 433091 432761 432488 432583 433234 434372 435466 435954 435929 436071 436989 438865 441487 444204 446104
60588 446104 446739 446567 446385 446455 446548 446552 446530 446354 445830 445171 444971 445672 447263 449422 451759 454105 456823 460616
60570 460616 465868 472418 480056 488753 498186 507622 516703 525769 534900 543184 549574 553941 556635 557536
60556 557536 556398 553810 550877 548123 545491 543238 541928 541655 542190 543915 547669 553536 560619 568325 577109
60541 577109 587597 599545 612124 624862 638058 652598 669547 689530 712247 736698 761796
60530 761796 786380 808772 826965 839457 845623 845338 838856 827189 812050 795068 777269 759417
60518G59417j7007j5330j3222j1061r050p254n505l545j486J58J212K203L645
60505F83175N428P274R347J1832J4469J7095K0282K4613K9529L3639L6126L7181
60493I29990L7160L6046L3845L0911K7625K4193K1004J8794J8182J9088K0693
60482A217531K1786K1219J8179J2313L680p253j9503l1728m2722n1703n8050o1044
60470A022705o0214n6050n0117m4261l9509l5644l1862k7831k3995k0872j8437
60459F13913j6388j4701j3424j2261j0840r337q219p459o553n303m083l300l070
60446D98975l386m001m259l669k667k084j935j528q33o30j115j390r02l07k95
60431D69974m80k70n4n39j406j666j006L1R79J711K004J721J417J880K890L219
$$ plain form
60518 759417 742410 727080 713858 702797 693747 686493 680988 677443 675957 676115 677327 679530 683175
60505 683175 688603 695877 705224 717056 731525 748620 768902 793515 823044 856683 892809 929990
60493 929990 967150 1003196 1037041 1067952 1095577 1119770 1140774 1159568 1177750 1196838 1217531
60482 1217531 1239317 1260536 1278715 1291028 1294708 1287455 1267952 1236224 1193502 1141799 1083749 1022705
60470 1022705 962491 906441 856324 812063 772554 736910 705048 677217 653222 632350 613913
60459 613913 597525 582824 569400 557139 546299 536962 528743 521284 514731 509428 505345 502045 498975
60446 498975 495589 491588 487329 483660 480993 478909 476974 475446 474613 473983 472868 471478 470576 470269 469974
60431 469974 469494 469224 469170 468631 467225 465559 464553 464584 465563 467274 469278 470999 472416 474296 477186 480405
60415D80405K171N91o2O05J562J657R38M97J076K179K753K486J986J862K135K588
60399E05429L165L874M636N328N707N396M448L724M088N237O078O215O191O226
60385E75742N786M661L462K624J881J215J266K091K544J749M34j51P9M35Q01J480
60369F06099K110J947J046K12r2O0O73J787K952L656M121M870N714O081O295P413
60353F54944R611J1620J2125J1072R329P610O080M538K661L24k271m848p350r600
60339G05845j0949j0834r569q055o777n610m519l782l423l029k408j951k154l028
60325F29757m168n084n431n153m495l638k408n96J497L195M076M362M686N746
60311F22346P796J0111J1224J0309Q223O588N957N556M784M097M005L969K993
$$ plain form
60415 480405 482576 483167 483105 483710 485272 486929 487867 488364 489440 491619 494372 496858 498844 500706 502841 505429
60399 505429 508594 512468 517104 522432 528139 533535 537983 541707 545795 551032 557110 563325 569516 575742
60385 575742 581528 586189 589651 592275 594156 595371 596637 598728 601272 603021 603455 603304 603383 603818 604619 606099
60369 606099 608209 610156 611202 611414 611322 611382 612055 613842 616794 620450 624571 629441 635155 641236 647531 654944
60353 654944 664555 676175 688300 699372 708701 716311 722391 726929 729590 729914 727643 722795 715445 705845
60339 705845 694896 684062 674493 666438 659661 654051 649532 645750 642327 639298 636890 634939 632785 629757
60325 629757 625589 620505 615074 609921 605426 601788 599380 598784 600281 603476 607552 611914 616600 622346
60311 622346 630142 640253 651477 661786 670009 676597 682554 688110 692894 696991 700996 704965 707958
60298G07958J026r80k440l956o472r903j2951j4324j3822j2181j0168q125o201
60285F07461m625l574k950k435j732q99n14j208k823m295m792m643m666m943m950
60270E58412m692m715n006m867m070l241k799k458k004j641j223k12J081J417
60256E23982N45k6Q69K188K264J367J200K280L397L557L062K524J965J274O31
60241E51079K09J1J69P49J327J360R46N87L70J72M38J829M020N733O233O032O002
60224E87266O497P547R158J1015J2411J2921J2821J2705J2963J3649J4461J4845
60212G28259J4508J3815J3315J2997J2460J1664J0906J0148R073P856P155P258
60200H59414P763Q211Q481Q439P778O406M621K783J132j60j155k202l395m191
$$ plain form
60298 707958 708984 708004 705564 701608 695136 685233 672282 657958 644136 631955 621787 613662 607461
60285 607461 602836 599262 596312 593877 592145 591246 590732 589524 586701 582406 577614 572971 568305 563362 558412
60270 558412 553720 549005 543999 539132 535062 531821 529022 526564 524560 522919 521696 521484 522565 523982
60256 523982 524527 524501 525370 527558 529822 531189 532389 534669 538066 541623 544685 547209 549174 550448 551079
60241 551079 551288 551299 551468 552217 553544 554904 555850 556437 556807 556979 557417 559246 563266 568999 575232 581264 587266
60224 587266 593763 601310 610468 621483 633894 646815 659636 672341 685304 698953 713414 728259
60212 728259 742767 756582 769897 782894 795354 807018 817924 828072 837145 845001 852156 859414
60200 859414 867177 875388 883869 892308 900086 906492 911113 913896 915028 914868 913713 911511 908116 903925
60186I03925m215m109m750n739n749m419k877k113j849j471j087j009q64j41Q19
60171H64352J132M75o57j660k386l067m068n561p235q462q979r210r639j0119
60157G94916j0035r001p169m953k791j117k88k84n19j38J218K915L812L496K754
60142G72816K616L150L616L644L637M008M494M561M123L604L329L211L080L095
60128H22984L573M295M443L578K454K211K907L545L687M060N286O907Q303R737
60114H87970J1624J3413J4236J4192J4073J4059J3719J3137J2991J3483J3958
60103A036855J3737J2696J1100R409Q208P647P096N920M337K858J287q88l396
60090A116866n481p135q991j1135j3074j4757j6511j8031j8623j8503j8558j8619
$$ plain form
60186 903925 899710 895601 890851 885112 879363 874944 872067 869954 868105 866634 865547 864538 863674 863533 864352
60171 864352 865484 865959 865302 863642 861256 858189 854121 848560 841325 832863 823884 814674 805035 794916
60157 794916 784881 775880 768711 763758 760967 759850 759562 759278 758759 758621 759839 762754 766566 770062 772816
60142 772816 775432 778582 782198 785842 789479 793487 797981 802542 806665 810269 813598 816809 819889 822984
60128 822984 826557 830852 835295 838873 841327 843538 846445 849990 853677 857737 863023 869930 878233 887970
60114 887970 899594 913007 927243 941435 955508 969567 983286 996423 1009414 1022897 1036855
60103 1036855 1050592 1063288 1074388 1083797 1092005 1099652 1106748 1112668 1117005 1119863 1121150 1120262 1116866
60090 1116866 1111385 1104250 1095259 1084124 1071050 1056293 1039782 1021751 1003128 984625 966067 947448
60078I47448j7424j4729j2053j0655r985q990p824p274p307p247o839o270n573
60065H25278m826m466m667m846m450l882l871m318m510m278m181m586n194n470
60051G61733n125m233l203k553k404k276j621m34P74J465J464J078R11J225J521
60036G48322J161L62p8m9k65q96r70K45J979K875K598J832J108M06l22j008j774
60019G55526k781l782m353m501m595m757m754m496m198m067m127m406m899n436
60005F94374n843o203o721p289p491o987n778m149k581j589j312j249o64O53K213
59990F39384L464M422N587P228Q983J0165J0486J0309J0174J0181R916Q918P118
59977G46335M891K780J060l84j682k562k703k476k772l867m938n150m740m503
$$ plain form
60078 947448 930024 915295 903242 892587 882602 873612 865788 858514 851207 843960 837121 830851 825278
60065 825278 820452 815986 811319 806473 802023 798141 794270 789952 785442 781164 776983 772397 767203 761733
60051 761733 756608 752375 749172 746619 744215 741939 740318 739884 740658 742123 743587 744665 745576 746801 748322
60036 748322 749483 749845 749767 749718 749453 748557 747587 747832 749811 752686 755284 757116 758224 758630 758308 757300 755526
60019 755526 752745 748963 744610 740109 735514 730757 726003 721507 717309 713242 709115 704709 699810 694374
60005 694374 688531 682328 675607 668318 660827 653840 648062 643913 641332 639743 638431 637182 636518 637171 639384
59990 639384 642848 647270 652857 660085 669068 679233 689719 700028 710202 720383 730299 739217 746335
59977 746335 751226 754006 755066 754682 753000 750438 747735 745259 742487 738620 733682 728532 723792 719289
59963G19289m611m542l930k832j326M91K214L332L684L326K258P34m49o97l61
59948G16580p2L46J482L066M088M132L689L164K503J894J865K444L004L214L396
59933G54795L812M298M796N493O407P479R052J1314J3318J3671J2323J0590R181
59920H66529P526N500M408N353P666R955J1843J3754J5598J6743J6928J6331J4940
59907A013074J2531R056M704j67m841q485j0969j2931j4726j5904j6189j6211
59895I38942j6572j6685j5433j2714r655p329n761m217k118L43K420L663M411
59882H59295N248O306P511R111J1191J2935J3422J2962J2582J2282J1072Q865
59870I82782O840N622M439K668Q01p57k434m256n226m941m570n010n301m169k087
$$ plain form
59963 719289 714678 710136 706206 703374 702048 702539 704753 708085 711769 715095 717353 718087 717638 716941 716580
59948 716580 716508 716854 718336 721402 725490 729622 733311 736475 738978 740872 742737 745181 748185 751399 754795
59933 754795 758607 762905 767701 773194 779601 787080 796132 807446 820764 834435 846758 857348 866529
59920 866529 874055 879555 883963 889316 896982 906937 918780 932534 948132 964875 981803 998134 1013074
59907 1013074 1025605 1034661 1039365 1039198 1034357 1025872 1014903 1001972 987246 971342 955153 938942
59895 938942 922370 905685 890252 877538 867883 860554 854793 850576 848458 848801 851221 854884 859295
59882 859295 864543 870849 878360 887471 898662 911597 925019 937981 950563 962845 973917 982782
59870 982782 989622 995244 999683 1002351 1003152 1002395 999961 995705 990479 985538 980968 975958 970657 966488 964401
59855I64401l43J035K819M675N304M330K675J240L24J9P1m85k433n165p260q046
59839I63161p745o571m669k780j823j971k856m371o379p961q138p068n591l920
59825H91318j865L4R55J221J936L206M027M153M739O694R536J2299J4566J6042
59811I68861J6042J4175J0976P393L964Q83j600l262m082m120l505k697k420l050
59797I97558m311n630o688p579q571r665j0321r916q604p407p116p557q167q818
59783H87208r533r936r678r038q459p768o568n075l857k902j717k16J185K378
59769H16024L801N740P788R113R115Q073P296Q132J0493J2882J4203J4944J6069
59756I43673J7654J9331K1221K3386K4948K4961K3675K1811J8984J4282Q153K467
$$ plain form
59855 964401 964058 965093 967912 972587 977891 982221 984896 986136 986460 986479 986550 986065 983632 978467 971207 963161
59839 963161 955416 948845 944176 941396 939573 937602 934746 930375 923996 916035 907897 900829 895238 891318
59825 891318 889453 889487 890442 891663 893599 896805 900832 904985 909724 916418 925954 938253 952819 968861
59811 968861 984903 999078 1010054 1017447 1021411 1022294 1020694 1017432 1013350 1009230 1005725 1003028 1000608 997558
59797 997558 993247 987617 980929 973350 964779 955114 944793 934877 926273 918866 911750 904193 896026 887208
59783 887208 877675 867739 858061 849023 840564 832796 826228 821153 817296 814394 812677 812461 813646 816024
59769 816024 819825 825565 833353 842466 851581 859654 866950 875082 885575 898457 912660 927604 943673
59756 943673 961327 980658 1001879 1025265 1050213 1075174 1098849 1120660 1139644 1153926 1162079 1164546
59744A164546j466l865n466o605p474q279q830q769q288p975p924p752p427p292
59730A067134p239o748n712m514l301j967q00l21m54o22o12n68k81N90J713K436
59714A038734K956M154O272Q685J1028J3515J6141J8586K1086K4272K7975L1205
59702A224609L3550L5571L7531L8784L8836L8023L6752L4941L2760L0942K9737
59691A612036K8204K5241K0816J5833J1217P507M783K607L86j960m146o249q731
59678A707544j1591j4240j6344j8163j9777k0669k0282j8505j5561j2011q823
59667A531578o656m920k355J409N630R770J4070J8592K2690K5872K8387L0563
59655A674630L2252L3243L3520L2884L1001K7960K3991J8531J0626N80r860j9430
$$ plain form
59744 1164546 1163080 1159215 1153749 1147144 1139670 1131391 1122561 1113792 1105504 1097529 1089605 1081853 1074426 1067134
59730 1067134 1059895 1053147 1047435 1042921 1039620 1037653 1036853 1036532 1036078 1035456 1034844 1034276 1033995 1034585 1036298 1038734
59714 1038734 1041690 1045844 1052116 1060801 1071829 1085344 1101485 1120071 1141157 1165429 1193404 1224609
59702 1224609 1258159 1293730 1331261 1370045 1408881 1446904 1483656 1518597 1551357 1582299 1612036
59691 1612036 1640240 1665481 1686297 1702130 1713347 1720854 1725637 1728244 1728630 1726670 1722524 1716275 1707544
59678 1707544 1695953 1681713 1665369 1647206 1627429 1606760 1586478 1567973 1552412 1540401 1531578
59667 1531578 1524922 1520002 1517647 1519056 1524686 1534456 1548526 1567118 1589808 1615680 1644067 1674630
59655 1674630 1706882 1740125 1773645 1806529 1837530 1865490 1889481 1908012 1918638 1919218 1909358 1889928
59643A889928k8414l7257m5157n0819n3862n4725n3827n1545m8477m4941m0662
59632A380242l5482l0018k5123k1198j8457j7297j7883j9724k2168k4890k7597
59621A120405k9745l0970l1289l0617k8734k6055k3739k2334k0960j8452j4876
59610H42634j1336q696p010n920n010l998k996k388k213j987j393p01k77n2K22
59595G88879O50J290K131K706K325R42o70j820k406k473k043j620k037l354m661
59580G77839n343n765o206o139n240m329m394n278o099o438o290n455l889k310
59566G04664j516j376j174p49m66l88k39k4J39N96J757L168L870L674L395L662
59550G18993M308N080O148P535Q673R092R180R739J1058J2834J4815J7025J9505
$$ plain form
59643 1889928 1861514 1824257 1779100 1728281 1674419 1619694 1565867 1514322 1465845 1420904 1380242
59632 1380242 1344760 1314742 1289619 1268421 1249964 1232667 1214784 1195060 1172892 1148002 1120405
59621 1120405 1090660 1059690 1028401 997784 969050 942995 919256 896922 875962 857510 842634
59610 842634 831298 822602 815592 809672 804662 800664 797668 795280 793067 791080 789687 788986 788709 788657 788879
59595 788879 789529 790819 792950 795656 797981 798923 798253 796433 794027 791554 789511 787891 785854 782500 777839
59580 777839 772496 766731 760525 754386 749146 744817 740423 735145 729046 722608 716318 710863 706974 704664
59566 704664 703148 701772 700598 699849 699383 698995 698756 698732 698871 699467 701224 704392 708262 711936 715331 718993
59550 718993 723301 728381 734529 742064 750737 759829 769009 778748 789806 802640 817455 834480 853985
59537H53985K2369K5955K9983L2325K9718K0967R115p17n777p110o890n933m340
59524I93650k862k140j625p08k52j522m094o394q011r833j2021j3534j3947j4084
59510I02623j4377j4053j2614j0845r669r019q523q206p905o940n116l106j335
59497G90915N76K670M076M374M571N817P969J0276J2527J4643J5930J6001J5753
59484I06098J6263J7136J7008J5442J3259J1164R010O490L764J254p32k179l501
59471A010476n280p529r478j0444j0604j0509j0188r239p586n682m052k781j423
59458I15681O30L340N691O662O560O665P520Q366Q474Q075P579O636M644J627
59444I98150j840n154p889r980j1925j4183j6185j6700j5421j3381j1539r890
$$ plain form
59537 853985 876354 902309 932292 964617 994335 1015302 1024417 1023700 1017923 1010813 1003923 997990 993650
59524 993650 990788 988648 987023 986315 986063 984541 980447 974053 966042 956209 944188 930654 916707 902623
59510 902623 888246 874193 861579 850734 841065 832046 823523 815317 807412 800472 795356 792250 790915
59497 790915 791491 794161 798237 802611 807182 812999 820968 831244 843771 858414 874344 890345 906098
59484 906098 922361 939497 956505 971947 985206 996370 1005380 1011870 1015634 1016888 1016156 1013977 1010476
59471 1010476 1005196 997667 988189 977745 967141 956632 946444 937205 929619 923937 919885 917104 915681
59458 915681 916311 919651 925342 932004 938564 945229 952749 961115 969589 977664 985243 991879 996523 998150
59444 998150 996310 991156 983267 973287 961362 947179 930994 914294 898873 885492 873953 864063
59432H64063q212o757n725m897m188l757l268k094m56P20J476L083O077R326J1792
59417H57183J3843J6003J7759J8726J9937K2800K7361L2114L4585L1705K1687
59406A113703O923o374j3197j3623j0788o524o58O805J5006K2880K8354K7831
59394A170338J9035M560r454j8526k2352k2673k0840j7890j4986j2657j0516q360
59382A035679o705n886n460m852l912k742j499n09M3M03P69Q84O72P89J676K630
59366A011980K786K524K853L826M769N673P019Q524R469J0120J1504J3678J5578
59353A110303J6713J7750J9250K0965K2681K4708K7198K9890L2678L5584L8029
59342A395749L9101L8694L7574L6139L3958L0615K6231K1029J5194R256L805j232
$$ plain form
59432 864063 855851 849094 843369 838472 834284 830527 827259 825165 824709 825429 826905 829988 836065 845391 857183
59417 857183 871026 887029 904788 923514 943451 966251 993612 1025726 1060311 1092016 1113703
59406 1113703 1120626 1114252 1101055 1087432 1076644 1070120 1069462 1076267 1091273 1114153 1142507 1170338
59394 1170338 1189373 1193933 1184479 1165953 1143601 1120928 1100088 1082198 1067212 1054555 1044039 1035679
59382 1035679 1028974 1023088 1017628 1012776 1008864 1006122 1004623 1004114 1004157 1004560 1005329 1006213 1006885 1007674 1009350 1011980
59366 1011980 1014766 1017290 1020143 1023969 1028738 1034411 1041430 1049954 1059423 1069543 1081047 1094725 1110303
59353 1110303 1127016 1144766 1164016 1184981 1207662 1232370 1259568 1289458 1322136 1357720 1395749
59342 1395749 1434850 1473544 1511118 1547257 1581215 1611830 1638061 1659090 1674284 1683540 1687345 1686113
59330A686113o353j1459j5910j9496k2593k5279k7210k8448k9647l1240l3050
59319A435428l4676l5695l5728l4910l4095l3780l3213l1469k9059k7312k6324
59308A079167k4825k2056j8707j5712j3248j1074q892o073j997K801O388O703
59296I72475K950l919j1474j6940j9019j8633j7388j5740j3411j0827q757o903
59284H32414m331j249J108K430L749N652P462Q622R621J1097J2973J4910J6664
59271I21122J7688J7402J6310J5810J6425J7133J6903J5942J4879J3620J1724
59260A094958R362P151N391L888K320N20j391l044m207n049n758o136n994n623
59246A086388n348m990m348l761l540l356k901k683l158l774l983m518o312q580
$$ plain form
59330 1686113 1679760 1668301 1652391 1632895 1610302 1585023 1557813 1529365 1499718 1468478 1435428
59319 1435428 1400752 1365057 1329329 1294419 1260324 1226544 1193331 1161862 1132803 1105491 1079167
59308 1079167 1054342 1032286 1013579 997867 984619 973545 964653 958580 956583 959384 965772 972475
59296 972475 975425 971506 960032 943092 924073 905440 888052 872312 858901 848074 839317 832414
59284 832414 828083 826834 827942 830372 834121 839773 847235 855857 865478 876575 889548 904458 921122
59271 921122 938810 956212 972522 988332 1004757 1021890 1038793 1054735 1069614 1083234 1094958
59260 1094958 1104320 1111471 1116862 1120750 1123070 1123590 1122199 1119155 1114948 1109899 1104141 1098005 1092011 1086388
59246 1086388 1081040 1076050 1071702 1067941 1064401 1061045 1058144 1055461 1052303 1048529 1044546 1040028 1033716 1025136
59232A025136r641r378r345j0396j1768j2623j2974j2868j2115j1102j0650j0735
59220H91541j0461r483q282p076n735m754m794n128m176j849J96J006J393K195
59206H34593L116L933N186O883Q017Q247Q692J0148J1888J3103J4295J6083J7862
59193I62046J8702J8834J9135J9876K0697K1232K1105K0068J8602J7536J6590
59182A174423J4355J0268N495J213k883p512j2368j6678k0300k3317k5289k5798
59170A071609k5192k4068k2599k0880j9222j7602j5653j3574j2173j1530j0663
59159H78453r138p901p751q008p612o591n623m883m222l693l192k274j071o21
59145H05873j566l238m711n909p061p910q263q557r044r131q287o884n511m170
$$ plain form
59232 1025136 1015495 1006117 996772 986376 974608 961985 949011 936143 924028 912926 902276 891541
59220 891541 881080 871597 863315 856239 850504 845750 840956 835828 831652 829803 829999 831005 832398 834593
59206 834593 837709 841642 846828 853711 861728 869975 878667 888815 900703 913806 928101 944184 962046
59193 962046 980748 999582 1018717 1038593 1059290 1080522 1101627 1121695 1140297 1157833 1174423
59182 1174423 1188778 1199046 1204541 1205754 1202871 1195359 1182991 1166313 1146013 1122696 1097407 1071609
59170 1071609 1046417 1022349 999750 978870 959648 942046 926393 912819 900646 889116 878453
59159 878453 869315 861414 853663 845655 838043 831452 825829 820946 816724 813031 809839 807565 806494 805873
59145 805873 804307 801069 796358 790449 783388 775478 767215 758658 749614 740483 732196 725312 719801 715631
59131G15631k789j697r04K43K045L859N192O473Q052R367R986J0476J1389J2247
59117G89570J2446J2390J2708J3064J2689J1514R934Q089O149M599L496K108N8
59104H98814j935l151l963n014o125o857p353p803p843p328o848o694o182m935
59090H16783l837l697l872l314k188j282n71K95Q65N19k56m91k29k08m42k75M40
59073G98240J255J977K676L132L087K719K175J122n44k148l121l832m731n415
59059G96592n507n615o364p179p189o712o570o517n715m346l329k685j557J95
59045G27502J623K067J873J636J536J554J651J612J213N46j04n37o67o42j000
59030G39863j983k601j435J199L226L536L555N102P902J0407J1913J2549J2119
$$ plain form
59131 715631 712842 711145 710241 710484 712529 716388 721580 728053 736105 745472 755458 765934 777323 789570
59117 789570 802016 814406 827114 840178 852867 864381 874315 882404 888553 893152 896648 898756 898814
59104 898814 896879 893728 889765 884751 878626 871769 864416 856613 848770 841442 834594 827900 821718 816783
59090 816783 812946 809249 805377 802063 799875 798593 798022 798317 799182 799701 799445 798954 798725 798517 798075 797800 798240
59073 798240 799495 801472 804148 807280 810367 813086 815261 816383 815839 813691 810570 806738 802007 796592
59059 796592 791085 785470 779106 771927 764738 758026 751456 744939 739224 734878 731549 728864 727307 727502
59045 727502 729125 731192 733065 734701 736237 737791 739442 741054 742267 742813 742709 742172 741505 740863 739863
59030 739863 737880 735279 733844 735043 738269 741805 745360 750462 758364 768771 780684 793233 805352
59017H05352J0532Q642P175N418K382j286m024n490o518p316p303o475n513m541
59003G91035l104j377j35M76J170K368L748M841N321M910L730K541J922J667J524
58988H20637J820K511K598J617R07K028M524O628P680Q428R473J0894J3024J6100
58974I08869J9305K1542K2950K4338K5519K5642K4829K3853K2358J9176J4459
58963A152840R916O581L804P97k148m496o369q125r886j1802j4043j6325j8069
58950A082675j9087j9546j9506j9078j8751j8690j8180j6667j4810j3462j2141
58939H92757r806o755m291k735j199O66K094K493K167J667J403J812K857L537
58925H86667K973J764J178J294J217Q28Q09J134J065P14J068K306L490M149M826
$$ plain form
59017 805352 815884 824526 831701 837119 839501 838215 834191 828701 822183 814867 807564 801089 795576 791035
59003 791035 787931 786554 786419 786895 788065 790433 794181 799022 804343 809253 812983 815524 817446 819113 820637
58988 820637 822457 824968 827566 829183 830090 832118 836642 843270 850950 859378 868851 879745 892769 908869
58974 908869 928174 949716 972666 997004 1022523 1048165 1072994 1096847 1119205 1138381 1152840
58963 1152840 1162756 1169337 1173141 1173938 1171790 1167294 1160925 1152800 1142914 1131112 1117069 1100744 1082675
58950 1082675 1063588 1044042 1024536 1005458 986707 968017 949837 933170 918360 904898 892757
58939 892757 882951 876196 871905 869170 867971 868637 870731 873224 875391 877058 878461 880273 883130 886667
58925 886667 889640 891404 892582 893876 895093 895921 896730 897864 898929 899643 900711 903017 906507 910656 915482
58910I15482N814O643P268Q484J0735J3461J5921J7797J8868J9061J8909J9066
58898A077509J9275J8785J7677J6807J6483J6312J6251J6720J7689J8909K0817
58887A273234K3953K7451K9568K9842K9395K8951K7977K6122K4162K2944K2434
58876A566033K2163K1688K0364J7684J4102J0622P365L545j057n568r256j2288
58864A655397j5105j7855k0587k3258k5559k7367k9155l1036l1919l0838k8759
58853A373959k7630k7888k8204k7586k6233k4461k2378k0768k0585k1348k1520
58842A105358k0769k0354k0965k1633k1374k0496j9619j8571j6978j4998j2926
58831H96675j0760q567o590m820l078j553n12L43J457K667L667M761O143P062
$$ plain form
58910 915482 921296 927939 935207 943691 954426 967887 983808 1001605 1020473 1039534 1058443 1077509
58898 1077509 1096784 1115569 1133246 1150053 1166536 1182848 1199099 1215819 1233508 1252417 1273234
58887 1273234 1297187 1324638 1354206 1384048 1413443 1442394 1470371 1496493 1520655 1543599 1566033
58876 1566033 1588196 1609884 1630248 1647932 1662034 1672656 1680021 1683566 1682509 1676941 1667685 1655397
58864 1655397 1640292 1622437 1601850 1578592 1553033 1525666 1496511 1465475 1433556 1402718 1373959
58853 1373959 1346329 1318441 1290237 1262651 1236418 1211957 1189579 1168811 1148226 1126878 1105358
58842 1105358 1084589 1064235 1043270 1021637 1000263 979767 960148 941577 924599 909601 896675
58831 896675 885915 877348 870758 865938 862860 861307 860795 861138 862595 865262 868929 873690 879833 886895
58817H86895O968O796P610Q605Q256O886O095N980N186L582K546K357J603k65
58803I59100j995k794l527m800n771n729n250m845m004k443r48m7Q80K454M368
58788I24649O199Q030R868J1510J3293J5833J8862K1590K4127K7056K9650L0400
58776A141067K9422K8379K7731K6024K2223J6811J0137J967o725j3753j8385k2035
58764A242863k5520k7784k8224k8077k8254k7866k6254k4489k3428k2085j9511
58753I61371j6674j4916j3966j2900j1833j1158j0433r232q045p148n826l799
58741H35441k065j274n38R11K316K844L110L938M845N098N090N372N384M458L126
58726H78056K151J270Pj147j385o77O17K340M170N684P284R752J2494J3755J3143
$$ plain form
58817 886895 893863 900659 908269 916874 925130 932016 938111 944091 949277 952859 955405 957762 959365 959100
58803 959100 957105 954311 950784 945984 940213 934484 929234 924389 920385 917942 916994 916947 917827 920281 924649
58788 924649 930848 938878 948746 960256 973549 989382 1008244 1029834 1053961 1081017 1110667 1141067
58776 1141067 1170489 1198868 1226599 1252623 1274846 1291657 1301794 1303761 1297036 1283283 1264898 1242863
58764 1242863 1217343 1189559 1161335 1133258 1105004 1077138 1050884 1026395 1002967 980882 961371
58753 961371 944697 929781 915815 902915 891082 879924 869491 860259 852214 845066 839240 835441
58741 835441 833376 832102 831564 832475 834791 837635 840745 844683 849528 854626 859716 865088 870472 874930 878056
58726 878056 880207 881477 881484 880337 878952 878275 878892 881232 885402 891086 898370 908122 920616 934371 947514
58711I47514J2215J1772J0571P659M053P32l091q189j3438j7353k0123k2625k4725
58698H84972k5964k6642k6910k6025k3748k1215j9212j7070j4383j2169j0989
58687F60645r717p607n895n702o027n531m719m431l850k005J48J249J823K960
58673F11341L922L322J651N59M38P17J625L684O178Q118R924J2247J3873J2891
58659F90490R375N006N56m336r287j2971j4714j4886j3991j2527j1293j0574r645
58646E91203q100o817o486o236n090l664k875k156o53P78P38l13o70J43J180J839
58630E52821K274K401K024J499J130M22r52k159k284j595p51K71J435K036J977
58615E60549K377L668M564M247M021N065O211N827M552L999M040L555K902L385
$$ plain form
58711 947514 959729 971501 982072 989731 993784 994516 991425 983236 969798 952445 932322 909697 884972
58698 884972 859008 832366 805456 779431 755683 734468 715256 698186 683803 671634 660645
58687 660645 650928 643321 637426 631724 625697 620166 615447 611016 607166 605161 605309 606558 608381 611341
58673 611341 615263 618585 620236 620795 621233 621950 623575 627259 633437 641555 651479 663726 677599 690490
58659 690490 699865 704871 705427 701091 691804 678833 664119 649233 635242 622715 611422 600848 591203
58646 591203 583103 576286 569800 563564 558474 554810 551935 549779 549126 549904 550642 550329 549659 549802 550982 552821
58630 552821 555095 557496 559520 561019 562149 562571 561619 559460 557176 555581 554830 555101 556536 558572 560549
58615 560549 562926 566594 571158 575405 579426 584491 590702 596529 601081 605080 609120 612675 615577 618962
58601F18962M890O033O168N605M558L253K337J875J066L6M65K995N760P149Q226
58586F79378J0401J2732J3801J4521J6361J8375J8654J7471J6269J4835J2276
58575H45074R607Q389P844O190M059L580M830O095P060Q918J1804J4761J7787
58562I55998K1311K4308K5499K5709K6286K5975K2364J5872R298L899j137n658
58550A149724q263q982r411j0008r909r286r309r952j0426j1495j4578j8829k1936
58537I97340k3632k5497k7488k7687k5681k3220k1282j9179j6769j4914j3490
58526G58501j1546r531q805q895p970o075n170n802o409o134n678n190l950k370
58512F64976j748j862j323k77j64q14o17M20O80N6J74J298J967J896K302L058
$$ plain form
58601 618962 623852 629885 636053 641658 646216 649469 651806 653681 654747 654783 655248 658243 664003 671152 679378
58586 679378 689779 702511 716312 730833 747194 765569 784223 801694 817963 832798 845074
58575 845074 854681 863070 870914 877104 881163 884743 889573 895668 902728 911646 923450 938211 955998
58562 955998 977309 1001617 1027116 1052825 1079111 1105086 1127450 1143322 1152620 1156519 1155382 1149724
58550 1149724 1141461 1132479 1123068 1113060 1103151 1093865 1084556 1074604 1064178 1052683 1038105 1019276 997340
58537 997340 973708 948211 920723 893036 867355 844135 822853 803674 786905 771991 758501
58526 758501 746955 737424 728619 719724 711754 705679 700509 694707 688298 682164 676486 671296 667346 664976
58512 664976 663228 661366 660043 659766 659602 658788 658171 658591 659271 659327 659501 660799 662766 664662 666964 670022
58496F70022K587R83K84J187K302L090M601O810Q245Q787R926J1766J2680J2529
58482G55799J3158J5047J6487J6845J7636J9395K0360J9281J6994J4199J0263
58471I35464N103j13m857r507j3359j4854j4183j3039j1634q739m873k210r15
58458H42284J163M557P222Q333R696J2295J4549J5157J4706J3314R634L480l151
58445I53239q719j3357j6804j7922j7091j6321j6132j4970j2297r532p355m991
58433G97748k624j487j105L80K742L876L869N139P926R503Q794P835P647O572
58419H56815M011J891R32q18m131o937p986q601r348q703o591n442o027n967m099
58404G88999k543k553k254m99Q18M97M42K044L623L720L620M377M692L869L615
$$ plain form
58496 670022 672609 673592 673876 675063 677365 680455 685056 691866 700111 708898 718824 730590 743270 755799
58482 755799 768957 784004 800491 817336 834972 854367 874727 894008 911002 925201 935464
58471 935464 940567 940454 935597 926090 912731 897877 883694 870655 859021 850282 845409 843199 842284
58458 842284 843447 848004 855226 863559 873255 885550 900099 915256 929962 943276 952910 956390 953239
58445 953239 944520 931163 914359 896437 879346 863025 846893 831923 819626 810094 802739 797748
58433 797748 795124 793637 792532 792912 795654 799530 803399 808538 816464 825967 834761 842596 850243 856815
58419 856815 860826 862717 863649 862831 858700 851763 843777 835176 825828 817125 810534 805092 799065 793098 788999
58404 788999 786456 783903 781649 781150 781968 782465 782907 784951 788574 792294 795914 800291 804983 808852 812467
58389H12467M717N324M524M208N290N596L859K311K910M281M729N088O259P179
58375H78742P358Q190R765R816P899O943Q508J0233J0193R940J0879J1531J0975
58362A000972J1189J3254J4901J4464J3617J3661J2933J0459Q218P151N000R07
58350A126726j912j190P07J135J265K745M294M733N643P851R203Q772R220J1987
58336A191179J4384J4554J4930J7407J9634J9558J9164K0067J9925J6983J3649
58325A381434J1832R390N071K161K963M502L903L364N256P289P221P513J0390
58312A462289J3061J2923J2730J5405J8427J8729J8508K0644K2937K2556K1656
58301A659865K2929K4051K2376K0662K2220K4713K4671K3828K5021K6346K5391
$$ plain form
58389 812467 817184 822508 827032 831240 836530 842126 845985 848296 851206 855487 860216 865304 871563 878742
58375 878742 886100 894290 904055 913871 921770 928713 937221 947454 957647 967587 978466 989997 1000972
58362 1000972 1012161 1025415 1040316 1054780 1068397 1082058 1094991 1105450 1113668 1120819 1125819 1126726
58350 1126726 1124814 1123624 1124331 1125466 1126731 1129476 1133770 1138503 1144146 1151997 1161200 1169972 1179192 1191179
58336 1191179 1205563 1220117 1235047 1252454 1272088 1291646 1310810 1330877 1350802 1367785 1381434
58325 1381434 1393266 1402656 1407727 1409888 1412851 1417353 1421256 1424620 1429876 1437165 1444386 1451899 1462289
58312 1462289 1475350 1488273 1501003 1516408 1534835 1553564 1572072 1592716 1615653 1638209 1659865
58301 1659865 1682794 1706845 1729221 1749883 1772103 1796816 1821487 1845315 1870336 1896682 1922073
58290A922073K4746K7135K9701K9270K8671L1390L4869L5543L5502L7484L8525
58279B274909L5796L3383L5635L9046L8674L7445M0602M5886M7976M8152N0807
58268B728311N4638N6127N7522O2484O8079O9868P0710P5595Q2065Q4898Q5743
58257C496040Q8825R1765R0332Q7814Q9674R3406R3754R3477R8480J06675J12322
58246D542564J16906J25113J34571J40417J45414J54599J64876J71042J76690
58237E872192J87700K00705K10017K19705K36032K54485K67799K80183K99356
58228H028174L21546L39339L57120L82772M11516M35011M58940M93662N35085
58219A1763165N73728O14776O68934P31395P91569Q55667R36892J031460J128527
$$ plain form
58290 1922073 1946819 1973954 2003655 2032925 2061596 2092986 2127855 2163398 2198900 2236384 2274909
58279 2274909 2310705 2344088 2379723 2418769 2457443 2494888 2535490 2581376 2629352 2677504 2728311
58268 2728311 2782949 2839076 2896598 2959082 3027161 3097029 3167739 3243334 3325399 3410297 3496040
58257 3496040 3584865 3676630 3766962 3854776 3944450 4037856 4131610 4225087 4323567 4430242 4542564
58246 4542564 4659470 4784583 4919154 5059571 5204985 5359584 5524460 5695502 5872192
58237 5872192 6059892 6260597 6470614 6690319 6926351 7180836 7448635 7728818 8028174
58228 8028174 8349720 8689059 9046179 9428951 9840467 10275478 10734418 11228080 11763165
58219 11763165 12336893 12951669 13620603 14351998 15143567 15999234 16936126 17967586 19096113
58210A9096113J235551J368000J522763J689347J878281K108793K378416K677796
58202C3955060L026097L457327L983539M611349N383384O359626P569600R030150
58194G7376132J0794810J2930619J5467960J8447318K2002183K6307487L1421260
58187B14747769L7152434M2843829M6947484M6888607M0043021K5652566O065774
58180D60341484j4129972l0535114m0891846m5277704m5072313m1932449l7294293
58173B05207793l2197367k7245791k2720289j8754580j5409094j2654556j0400377
58166F5825739q567771p102648n935958m987406m207890l577837l068214k640345
58158B5737670k278448j985559j749793j546130j367508j223168j108509j004846
$$ plain form
58210 19096113 20331664 21699664 23222427 24911774 26790055 28898848 31277264 33955060
58202 33955060 36981157 40438484 44422023 49033372 54416756 60776382 68345982 77376132
58194 77376132 88170942 101101561 116569521 135016839 157019022 183326509 214747769
58187 214747769 251900203 294744032 341691516 388580123 428623144 454275710 460341484
58180 460341484 446211512 415676398 374784552 329506848 284434535 242502086 205207793
58173 205207793 173010426 145764635 123044346 104289766 88880672 76226116 65825739
58166 65825739 57257968 50155320 44219362 39231956 35024066 31446229 28378015 25737670
58158 25737670 23459222 21473663 19723870 18177740 16810232 15587064 14478555 13473709
58150A3473709r06843q23552p53770o85308o17546n61171n16025m70865m24516
58141G714113l86813l59019l32751l07646k91270k81707k68259k49567k34170
58132E002911k23247k09289j91892j78757j70504j59767j46026j36537j31840
58123C455052j24477j13259j05149j01738r6896q9151q3968q2269p8569p2070
58113B507506o8263o8022o5917o0707n7138n6118n3189m7990m5412m6108m5355
58102A893287m2341m1402m3063m2878m0147l8925l9553l7935l4037l2404l3440
58091A467162l2647k9411k7966k8781k7520k3648k1647k2488k2028j9237j7957
58080A193832j9086j8948j6910j6894j9629k0904j9208j7889j8170j7165j4514
$$ plain form
58150 13473709 12566866 11743314 10989544 10304236 9686690 9125519 8609494 8138629 7714113
58141 7714113 7327300 6968281 6635530 6327884 6036614 5754907 5486648 5237081 5002911
58132 5002911 4779664 4570375 4378483 4199726 4029222 3869455 3723429 3586892 3455052
58123 3455052 3330575 3217316 3112167 3010429 2913533 2824382 2740414 2658145 2579576 2507506
58113 2507506 2439243 2371221 2305304 2244597 2187459 2131341 2078152 2030162 1984750 1938642 1893287
58102 1893287 1850946 1809544 1766481 1723603 1683456 1644531 1604978 1567043 1533006 1500602 1467162
58091 1467162 1434515 1405104 1377138 1348357 1320837 1297189 1275542 1253054 1231026 1211789 1193832
58080 1193832 1174746 1155798 1138888 1121994 1102365 1081461 1062253 1044364 1026194 1009029 994515
58069I94515j3787j5510j5686j3039j1107j1376j1033r176q637r834r436p027
58057H58867o571r225j1124j0441j0288j2289j3510j2314j1291j1872j1598r359
58045G28985p839q317q337o917o747q751r744q092o610p196p561o045m824n491
58031F26514n998m949m657o923r710j0745j0847j1114j0424q203o363o152o184
58018E24245n358m619m319l254j715j820l511m008k613j926k924l147j560p20
58004D82751j983k836j418K93L33j6O20R94K17j8J206J775K86j140l51J378J911
57987D84002J548J375J010J72Q2J167J795J103N98J342K220K514L362N054N881
57972E13225N396N742P931R888J0043R736J0030R205N818J425k034m978q205j0764
$$ plain form
58069 994515 980728 965218 949532 936493 925386 914010 902977 893801 885164 875330 865894 858867
58057 858867 852296 843071 831947 821506 811218 798929 785419 773105 761814 749942 738344 728985
58045 728985 721146 712829 704492 697575 690828 682077 672333 664241 657631 650435 642874 636829 632005 626514
58031 626514 620516 615567 610910 603987 594277 583532 572685 561571 551147 542944 536581 530429 524245
58018 524245 518887 514268 509949 506695 504980 503160 499649 495641 493028 491102 488178 485031 483471 482751
58004 482751 480768 477932 476514 476807 477140 477124 477744 478738 478955 478937 480143 481918 482204 481064 480713 482091 484002
57987 484002 485550 486925 487935 488107 488189 489356 491151 492254 492852 494194 496414 498928 502290 507344 513225
57972 513225 518621 524363 532294 542182 552225 561961 571991 581196 587014 588439 586405 581427 573222 562458
57958E62458j1865j2491j3214j2885j1279j0294j0743j0724r069p486p293o976
57946D38139n254l653l625l833k819j641j426q59J224L261L576L352M346N810
57932D36598O263O275O807O793M922K188J88j371l372n168n963o519p488p861
57918D32292p011o227o270n637l402j473j564k139r35J434L058M001N261O161
57904D17549N499L884K492Q81j609l906m968n875p737r168q400o339m969m134
57890C73200k544o27K80M54J011J641J484J095J311J346L37n27J99J533J626P99
57874C82618N88R05O67K05N25J175J237J460K945M668M858L899L374L137J970
57859D14231M01J73J343K330K464K247J657M68l55J68J006N06q47j289q02q39
$$ plain form
57958 562458 550593 538102 524888 512003 500724 490430 479687 468963 459894 452408 445115 438139
57946 438139 432885 429232 425607 421774 418955 417314 415888 415029 416253 419514 423090 426442 430788 436598
57932 436598 442861 449136 455943 462736 467658 469846 470034 468663 465291 460123 454160 447641 440153 432292
57918 432292 425281 419054 412784 407147 403745 402272 400708 398569 397634 399068 402126 406127 411388 417549
57904 417549 423048 426932 429424 430305 428696 424790 419822 413947 406210 397042 388642 382303 377334 373200
57890 373200 370656 370029 370309 370763 371774 373415 374899 375994 377305 378651 378988 378461 378660 380193 381819 382618
57874 382618 383206 384111 384778 384983 385508 386683 387920 389380 392325 396993 401851 405750 409124 412261 414231
57859 414231 414632 414805 416148 418478 420942 423189 424846 425314 424959 425127 426133 426639 425792 424503 423701 422862
57843D22862j594j915j669j799k293k269j899k094k549k122r20J5O32J575K414
57828D06375K310J945K543L488L262K359K717M381N375M929M351M341L891K465
57814D54732J002J08r60k718m608o217p870r495j0290r983r124p970o329m659
57800C75619l848l706l053j558j63N62J162K131L179M007M710N140M797L599K050
57785C94628N60p57j764k447l026l352k777j317j53m1j05P01J772J802P20o36
57769C83808j924l040l312k463j638j866k406k120j573j895k564k378j804k120
57755C52705k822k283n66P66J449K611M222M884M493M668N954O794O082M765M122
57740C97844L999L670L105K557J954J241O09R1l10k89J51J06r84k039j633k23
$$ plain form
57843 422862 421268 419353 417684 415885 413592 411323 409424 407330 404781 402659 401739 401754 402386 403961 406375
57828 406375 408685 410630 413173 416661 419923 422282 424999 429380 434755 439684 444035 448376 452267 454732
57814 454732 455734 455842 454882 452164 447556 441339 433469 423974 413684 403701 394577 386607 380278 375619
57800 375619 371771 368065 365012 363454 363291 363853 365015 367146 370325 374332 379042 384182 388979 392578 394628
57785 394628 395188 394431 392667 390220 387194 383842 381065 379748 379595 379554 379449 380150 381922 383724 384444 383808
57769 383808 381884 378844 375532 373069 371431 369565 367159 365039 363466 361571 359007 356629 354825 352705
57755 352705 349883 347600 347034 347800 349249 351860 356082 360966 365459 370127 376081 382875 388957 393722 397844
57740 397844 401843 405513 408618 411175 413129 414370 414979 415070 414760 414471 414622 414728 413744 411705 410072 409849
57724D09849M48q1o80o44l69j00L21N08j38j143j517j392j626k042j789j241j581
57707C96783k585k739j701p36n50n17k74k75m30N8J160J947K285K904L661L493
57691D02484K404J659J677J521P96K69J89j51o65j91J473L045L922N072P096R182
57675D39782J0919J3447J7736K3152K8791L5048M2888N2608O4058P6867Q9143
57664H94439R6407R2739P3716L9538l196m3367p1349q4372q5940q0815p2061o1866
57652F93873n2116m3267l4566k6140j9279j4285r978n864k984j855j386o50j28
57639D81375m07j142k008l205m434m877m727n149o250o727o059n281n087m962
57625D21060m813n370o284n955m173k915l354m149l869l072k652k108j042n27
$$ plain form
57724 409849 410297 410216 409536 408892 408523 408423 408744 409252 409114 407971 406454 405062 403436 401394 399605 398364 396783
57707 396783 394198 391459 389758 389022 388472 387955 387681 387406 386976 387034 388194 390141 392426 395330 398991 402484
57691 402484 404888 406547 408224 409745 410541 410810 410999 410848 410183 409992 411465 414510 418432 423504 430600 439782
57675 439782 450701 464148 481884 505036 533827 568875 611763 664371 728429 805296 894439
57664 894439 990846 1083585 1157301 1196839 1193643 1150276 1078927 994555 908615 827800 755739 693873
57652 693873 641757 598490 563924 537784 518505 504220 494242 488378 485394 483539 482153 481503 481375
57639 481375 480968 479826 477818 474613 470179 465302 460575 455426 449176 442449 436390 431109 426022 421060
57625 421060 416247 410877 404593 398638 394465 391550 388196 384047 380178 377106 374454 372346 371304 370777
57611C70777j310k221k001j221q17k84R09J604O35r24j141J9J095J454J538J439
57595C69551Q98L10L34Q35J301J753K369K894L227L825M679M942M311L708L624
57580D08561L103J424m32j347j822k815m004m635n146o286p524p729o885n805
57566C58658m871m132l926m282m488m227m189m648m607l476k287j940j610l67
57552C09608R65J216R39J296J973K066J990K541K965J992J67q47p40l97P8J166
57536C26978K218J974O85k78o27j164j801j589p00m20j012j335q54k61J54J070
57520C23038K576L574L315K418J819J723J971K439K818K768K490K505K744K696
57506C58894K318K071K149K367K609K672K107R97L86R24J648J223p2p84l17P69
$$ plain form
57611 370777 369467 367246 365245 364024 363207 362923 363832 365436 366071 365147 364006 364025 365120 366574 368112 369551
57595 369551 370449 370759 371093 371928 373229 374982 377351 380245 383472 387297 391976 396918 401229 404937 408561
57580 408561 411664 413088 412656 411309 409487 406672 402668 398033 392887 386601 379077 371348 364463 358658
57566 358658 353787 349655 345729 341447 336959 332732 328543 323895 319288 315812 313525 311585 309975 309608
57552 309608 310573 311789 312728 314024 315997 318063 320053 322594 325559 327551 327718 326871 326131 325734 325812 326978
57536 326978 329196 331170 331855 331577 330950 329786 327985 326396 325696 325276 324264 322929 322075 321814 321968 323038
57520 323038 325614 329188 332503 334921 336740 338463 340434 342873 345691 348459 350949 353454 356198 358894
57506 358894 361212 363283 365432 367799 370408 373080 375187 376184 376570 377494 379142 380365 380293 379509 379192 379961
57490C79961K066L489M448M212L135K268J830J176J44q24j735k922l952l914k901
57475C86481k070k140k802l599m329m625m202l525l301l417l243k780k426j951
57461C42071q28N83J380J511J654J889J670J080Q92J318J816K048K113J924J361
57446C62482R30J173J656J577J162J395K514L821M784N264N031M180L646M182
57432D03797N194N710N921O417O661N796M457L942M018L382K033J159R14K61r44
57417D58718j809k294l177m016l386j521l83o07n71P19K021K167J821J699J004
57402D50385q69k620k706j520m93k5L40N97M51K93Q05K014L321M089L800K472
57386D60334J177J215K412L356L668M524O301P397O451M434L222L184L449L609
$$ plain form
57490 379961 382027 385516 389964 394176 397311 399579 401409 402585 402729 401905 400170 397248 393296 389382 386481
57475 386481 384411 382271 379469 375870 371541 366916 362714 359189 355888 352471 349228 346448 344022 342071
57461 342071 341243 341826 343206 344717 346371 348260 349930 351010 351902 353220 355036 357084 359197 361121 362482
57446 362482 363412 364585 366241 367818 368980 370375 372889 376710 381494 386758 391789 395969 399615 403797
57432 403797 408991 414701 420622 427039 433700 439496 443953 447895 451913 455295 457328 458487 459401 459662 458718
57417 458718 456909 454615 451438 447422 444036 442515 442132 441525 440954 441673 443694 445861 447682 449381 450385
57402 450385 449516 446896 444190 442670 442177 442152 442492 443089 443540 443833 444638 446652 449973 454062 457862 460334
57386 460334 461511 462726 465138 468494 472162 476686 482987 490384 496835 501269 504491 507675 511124 514733
57372E14733L780L644K858K038K039K554K483J596Q79J221K446L638L994L374
57358E51277K476K319L330M953O193O382N566M587M479N340O060N864N610O464
57344F20900P742P589N728L964L662M248M708N074N700O292O510O573O612O322
57330G01624N848N996O988P961Q221Q153Q278Q439Q361Q143P811P346P377Q643
57316H09189J0467J1163J0454J0010J0996J2563J3556J4121J4717J5009J4885
57305I47130J5222J6456J7613J7941J8229J9272K0264K0161J9566J9753K0700
57294A152307K1586K2409K3609K4778K5285K5640K6782K8414K9449K9799L0380
57283A440438L1541L2718L3571L4459L5935L8543M2783M8410N4085N8575O1954
$$ plain form
57372 514733 518513 522157 525015 527053 529092 531646 534129 535725 536604 537825 540271 543909 547903 551277
57358 551277 553753 556072 559402 564355 570548 576930 582496 587083 591562 596902 602962 608826 614436 620900
57344 620900 628642 636231 641959 645923 649585 653833 658541 663615 669315 675607 682117 688690 695302 701624
57330 701624 707472 713468 720456 728417 736638 744791 753069 761508 769869 778012 785823 793169 800546 809189
57316 809189 819656 830819 841273 851283 862279 874842 888398 902519 917236 932245 947130
57305 947130 962352 978808 996421 1014362 1032591 1051863 1072127 1092288 1111854 1131607 1152307
57294 1152307 1173893 1196302 1219911 1244689 1269974 1295614 1322396 1350810 1380259 1410058 1440438
57283 1440438 1471979 1504697 1538268 1572727 1608662 1647205 1689988 1738398 1792483 1851058 1913012
57272A913012O4900O7348O8826O9658P0741P2241P3319P3066P1140O7816O3967
57261B676034O0635N8102N5862N3850N3012N4019N6224N8582O0827O2932O4200
57250C314279O3831O1833N8565N4061M8609M3364L9496L7200L6194L6453L7808
57239C831693L9690M2018M5452M9941N4046N6760N8912O1736O4943O7492O9332
57228D442015P0962P2071P2032P1150P0140O8924O7316O6129O6192O6877O7023
57217E200831O6856O7432O8678O9636P0311P1609P3442P4443P3798P2211P0919
57206E980166P0636P1456P2839P3806P3951P4001P4583P4960P4039P2096P0427
57195F782960O9516O8797O7932O7312O7476O8790P1356P4389P6300P6337P5548
$$ plain form
57272 1913012 1977912 2045260 2114086 2183744 2254485 2326726 2400045 2473111 2544251 2612067 2676034
57261 2676034 2736669 2794771 2850633 2904483 2957495 3011514 3067738 3126320 3187147 3250079 3314279
57250 3314279 3378110 3439943 3498508 3552569 3601178 3644542 3684038 3721238 3757432 3793885 3831693
57239 3831693 3871383 3913401 3958853 4008794 4062840 4119600 4178512 4240248 4305191 4372683 4442015
57228 4442015 4512977 4585048 4657080 4728230 4798370 4867294 4934610 5000739 5066931 5133808 5200831
57217 5200831 5267687 5335119 5403797 5473433 5543744 5615353 5688795 5763238 5837036 5909247 5980166
57206 5980166 6050802 6122258 6195097 6268903 6342854 6416855 6491438 6566398 6640437 6712533 6782960
57195 6782960 6852476 6921273 6989205 7056517 7123993 7192783 7264139 7338528 7414828 7491165 7566713
57184G566713P5244P5284P4919P4383P4211P3854P2461P0391O8418O6203O3151
57173H355232O0184N8687N8190N6949N4701N2948N2590N2886N2721N1298M7682
57162H954068M1330L3225K5091J7458R743J874n606j2769k0008k6756l2070l6139
57150H949441l9753m2662m4343m5863m8801n2473n4358n3249m9967m5028l8028
57139H434916k9718k2298j6965j3093j0257r069r356r551q678p227n423k498J503
57126H292286M873O114N212K532j889p240j1605j3488j2454q149l49R611J9328
57113H284782K7815L5986M4592N3761O4878Q0525J01601J26457J53726J84294
57103I158417K19969K62413L14096L78197M56796N51251O64898Q02924R68906
$$ plain form
57184 7566713 7641957 7717241 7792160 7866543 7940754 8014608 8087069 8157460 8225878 8292081 8355232
57173 8355232 8415416 8474103 8532293 8589242 8643943 8696891 8749481 8802367 8855088 8906386 8954068
57162 8954068 8995398 9028623 9053714 9071172 9080915 9082789 9077183 9064414 9044406 9017650 8985580 8949441
57150 8949441 8909688 8867026 8822683 8776820 8728019 8675546 8621188 8567939 8517972 8472944 8434916
57139 8434916 8405198 8382900 8365935 8352842 8342585 8333516 8324160 8314609 8305931 8298704 8293281 8290783 8292286
57126 8292286 8297159 8303273 8308485 8311017 8309128 8301888 8290283 8276795 8264341 8256192 8255843 8265454 8284782
57113 8284782 8312597 8348583 8393175 8446936 8511814 8592339 8693940 8820397 8974123 9158417
57103 9158417 9378386 9640799 9954895 10333092 10789888 11341139 12006037 12808961 13777867
57094A3777867J163990J389759J648242J937737K251877K584237K930330L283347
57086C0967386L631472L960722M255940M497284M661986M731796M688138M489740
57078F5884464M064175L343850K324143J086012k39025j523456k672541l624787
57070F8642835m347648m836703n109352n192248n113307m902296m592082m215506
57062C0333693l801836l376368k960597k570589k215721j899897j623715j385601
57054A0499369j182416j010366q65701p44585o43000n57327m84941m23985l72643
57045D214405l28856k90833k57661k29168k05059j84448j66332j50171j35628
57036B266249j22119j09081r6459q4346p2377o0178m8004l5926k2570o650R083
$$ plain form
57094 13777867 14941857 16331616 17979858 19917595 22169472 24753709 27684039 30967386
57086 30967386 34598858 38559580 42815520 47312804 51974790 56706586 61394724 65884464
57078 65884464 69948639 73292489 75616632 76702644 76463619 74940163 72267622 68642835
57070 68642835 64295187 59458484 54349132 49156884 44043577 39141281 34549199 30333693
57062 30333693 26531857 23155489 20194892 17624303 15408582 13508685 11884970 10499369
57054 10499369 9316953 8306587 7440886 6696301 6053301 5495974 5011033 4587048 4214405
57045 4214405 3885549 3594716 3337055 3107887 2902828 2718380 2552048 2401877 2266249
57036 2266249 2144130 2035049 1938590 1854244 1781867 1721689 1673685 1637759 1615189 1608539 1617622
57025A617622J6699Q388j6086m7705p4576q9979r4618r2631q7099p9301p0383
57014I90331o1848n4419m7633m1041l5145l0735k7821k5727k3874k2053k0144
57003E99891j8074j5965j4015j2284j0748r469q534p888p334o569n336l702k097
56990D77876p24Q18K890N016O467P503R229J1904J4276J4738J2519P574L05q028
56976E62363j5443k0450k2864k3160k1747j9236j6561j4192j1766r032o485m510
56964C76917k599r9K825N696Q625J1895J5188J7953K0129K1546K0960J6638Q168
56951E23842k728j3144k0532k3842k3813k2111j9877j7263j4307j1527r233o887
56939C38578l829j68L562P129J0432J3198J5547J8485K2986K8541L2945L3340
$$ plain form
57025 1617622 1634321 1642709 1626623 1578918 1504342 1414363 1319745 1227114 1140015 1060714 990331
57014 990331 928483 874064 826431 785390 750245 719510 691689 665962 642088 620035 599891
57003 599891 581817 565852 551837 539553 528805 519336 510802 502914 495580 489011 483675 479973 477876
56990 477876 477152 477970 480860 485876 492343 499846 509075 520979 535255 549993 562512 570086 570391 562363
56976 562363 546920 526470 503606 480446 458699 439463 422902 408710 396944 387912 381427 376917
56964 376917 374318 374219 377044 382740 391365 403260 418448 436401 456530 478076 499036 515674 523842
56951 523842 521114 507970 487438 463596 439783 417672 397795 380532 366225 354698 345465 338578
56939 338578 334749 334581 338143 345272 355704 368902 384449 402934 425920 454461 487406 520746
56927E20746K7542J5370n45j5806k6914l2970l4841l3630l0473k6829k3683k0814
56915C17153j7542j4042j1159r299q181p396o619n598m376l308k472j601q15p00
56901B24045j187j251l49P06J074J229K063L419M593N599O838Q126R140J0382
56887B74427J2530J5220J7493J8898J9073J6854J1350L712l527q867j2433j4464
56875C50266j4612j2990j0524p889m941j587J721M657P468J0384J3276J6183J9643
56862C71055K4197K9840L6080M2046M6376M7173M2414L0915J3741n295k1443l2016
56850F25083l7330l8607l6269l0802k4014j7816j2405o818p73N207J1052J7151
56838D53659K3465K9792L6761M5256N5022O4646P2402P5733P0563N3463K5491
$$ plain form
56927 520746 548288 563658 563113 547307 520393 487423 452582 418952 388479 361650 337967 317153
56915 317153 299611 285569 274410 265111 256930 249534 242915 237317 232941 229633 227161 225560 224745 224045
56901 224045 222858 221607 221258 221964 223038 224267 226330 229749 234342 239941 246779 254905 264045 274427
56887 274427 286957 302177 319670 338568 357641 374495 385845 389557 386030 377163 364730 350266
56875 350266 335654 322664 312140 304251 299310 297723 299444 304101 311569 321953 335229 351412 371055
56862 371055 395252 425092 461172 503218 549594 596767 639181 670096 683837 678542 657099 625083
56850 625083 587753 549146 512877 482075 458061 440245 427840 421022 420249 425456 436508 453659
56838 453659 477124 506916 543677 588933 643955 708601 781003 856736 927299 980762 1006253
56827A006253p093l6597n7991o9861p3165o9998o2779n3570m3890l4826k6767
56816D69716j9240j1655m187K661R068J5729K2860L0108L7377M4806N1723N5987
56804G04953N4419M4067K4267j536k6658m5189n5346n8706n7261n2377m5577l8421
56792D46635l1485k4655j8315j3076q579l884R95N238Q783J2593J7239K2263K6825
56779D40577K9793K9318K3703J3087m27j4151k5615l2719l4789l3446l1136k8721
56767C35474k5625k1923j8686j6259j3900j1329r183p653o208m891m502n057n444
56754A84814m995m172l371k362j328j037j519j760j243o86p48j172j578k037k375
56739A54431k092j349r88j148j001j74P14J230J613J780J207J94j41L48M84k15
$$ plain form
56827 1006253 999160 962563 904572 834711 761546 691548 628769 575199 531309 496483 469716
56816 469716 450476 438821 434634 437295 446363 462092 484952 515060 552437 597243 648966 704953
56804 704953 759372 803439 827706 826170 799512 754323 698977 640271 583010 530633 485056 446635
56792 446635 415150 390495 372180 359104 350525 346641 347636 352874 361657 374250 391489 413752 440577
56779 440577 470370 499688 523391 536478 536051 521900 496285 463566 428777 395331 364195 335474
56767 335474 309849 287926 269240 252981 239081 227752 218569 210916 204708 199817 195315 190258 184814
56754 184814 179819 175647 172276 169914 168586 167549 166030 164270 163027 162341 161593 160421 158843 156806 154431
56739 154431 152339 150990 150002 148854 147853 147679 148393 149623 151236 153016 154223 154417 154276 154624 155108 154893
56723A54893o31N7R66J075Q34J043J260O29m16o39J71R40P75q1o92l99N56J312
56705A61653J432J465J977K423J973J100R96J539J408M25P3J099K220K109J288
56690A83180Q94P99J82p87j153o17J85O91R73J426K267L198L532K975K126J657
56674B01528J206L8j488k266k145k009k098j665n30M50P93R58J143Q61J31k59
56658A94648j54k69o46l75O11J052L74l81m10l24n57k52J074K264K207J560J423
56641B01845J510R91J89m0J81J73l2nN0k70o70p08o54r30j275j305j326j719k130
56622A93875k016j526j114q80q59j299k028k302j823j163o78QR32J259N68k95
56606A80659m39p3K58O16J042J019L18l61m73m12n87o52l12QK4J02L47K41j71
$$ plain form
56723 154893 154262 154319 155285 156360 157194 158237 159497 160126 159710 159071 159242 160182 160957 160876 160184 159785 160341 161653
56705 161653 163085 164550 166527 168950 170923 172023 173019 174558 175966 176391 176464 177563 179783 181892 183180
56690 183180 184074 184873 185055 184268 183115 182498 182683 183374 184347 185773 188040 191238 194770 197745 199871 201528
56674 201528 202734 202772 201284 199018 196873 194864 192766 191101 190571 191021 191814 192772 193915 194776 194907 194648
56658 194648 194494 194225 193579 193204 193815 194867 195241 194860 194450 194126 193569 193317 194391 196655 198862 200422 201845
56641 201845 203355 204346 204535 204495 204676 204849 204817 204812 204862 204592 203922 203214 202560 201630 200355 199050 197724 196005 193875
56622 193875 191859 190333 189219 188339 187480 186181 184153 181851 180028 178865 178187 178195 179127 180386 180954 180659
56606 180659 180220 180147 180405 181021 182063 183082 183400 183039 182566 182154 181567 180915 180603 180611 180635 180737 181084 181325 181154
56587A81154k5Q40J320Q41L77P78J403J354Q69M82N8l51K0J262K140J890J404
56570A95816J624K101K297K800L954M652M015L027L105M134N356O922R050J0772
56556B59625J1037J0020Q092M727R0l730m898m287l998m438m551l986l213k311
56542B58179j354j159k042k692j977q97j036k021k388k027j781j482m98M22O7
56527B37314r90j114k56J25m72j112j273j298j208o75j40m74j644k938m043m708
56511B15094m132k249p63j154k378k399j290p40j140j358j061j064j445j405r95
56496A91521j035j366j004j21Q1m89o22J03P15O10L54N03R29J445J831J422p5
56479A94802j563j723r09m15l68J13R78J287R83R01J174J155Q55Q64J056Q94O46
$$ plain form
56587 181154 181129 181969 183289 184130 184507 185285 186688 188042 188911 189393 189451 189100 189120 190382 192522 194412 195816
56570 195816 197440 199541 201838 204638 208592 213244 217259 220286 223391 227525 232881 239803 248853 259625
56556 259625 270662 280682 288774 293501 293591 289861 284963 280676 276678 272240 267689 263703 260490 258179
56542 258179 256825 255666 253624 250932 248955 248058 247022 245001 242613 240586 238805 237323 236825 237247 237314
56527 237314 236324 235210 234954 235079 234607 233495 232222 230924 229716 229041 228901 228427 226783 223845 219802 215094
56511 215094 210962 208713 207950 206796 204418 202019 200729 199989 198849 197491 196430 195366 193921 192516 191521
56496 191521 190486 189120 188116 187995 188076 187587 186965 187068 187783 188393 188747 189250 190179 191624 193455 194877 194802
56479 194802 193239 191516 190607 190192 189824 189937 190915 192202 193185 194086 195260 196415 197270 198134 199190 200084 200730
56462B00730P77O30n41j725j365J8N32kM7J159J948J695J339J449J229K41n75
56445B07586m04L50J031J561J917J865J510J185Q00K09j78j44m53j509k083j033
56429B12210M81M73p86j398r79q17j112o38P42J632J544J548K046K020J019K2
56413B18007l07m12n07j13O63J017Q68Q50Q33J53p16n62L91P18K55K48Q96R01
56395B23183q1p05j99N39P46Q24J024Q79M67N92J255J556J459J863K671K571J230
56378B39874p0m18k50L3O76J458J593J184J131J409J089J99j51K74N61N03R00
56361B49995J783K133J677J235J155J051J096J774K430K037J204J377K194J993
56347B73134Q11L84J068J321N05k36k79l13m61J18J363K207K535L071L473K933
$$ plain form
56462 200730 201507 202137 201596 199871 198506 198524 199056 199054 199101 200260 202208 203903 205242 206691 207920 208161 207586
56445 207586 207182 207532 208563 210124 212041 213906 215416 216601 217401 217610 217432 217288 216835 215326 213243 212210
56429 212210 212691 213164 212378 210980 210001 209184 208072 207434 208176 209808 211352 212900 214946 216966 217985 218007
56413 218007 217700 217288 216781 216668 217331 218348 219216 220066 220899 221052 220336 219774 220165 220883 221138 221386 222282 223183
56395 223183 223102 222397 222198 222737 223483 224307 225331 226210 226677 227269 228524 230080 231539 233402 236073 238644 239874
56378 239874 239804 239386 239136 239169 239845 241303 242896 244080 245211 246620 247709 247908 247757 248031 248592 249095 249995
56361 249995 251778 253911 255588 256823 257978 259029 260125 261899 264329 266366 267570 268947 271141 273134
56347 273134 273945 274329 275397 276718 277223 276987 276708 276395 275934 276052 277415 279622 282157 285228 288701 291634
56331B91634K390L350M764M237K304K013L938N302M641L674L578L083J653J027
56317C37588J948K550J689Q71J194J364N43K75J613L019L011K517K768L227L369
56302C67546M148N982P484P784P937Q546Q395O927N630N484N429M854N016O486
56288D57648P787Q206R193J1265J2377J1367J0239J0872J2036J2001J1594J2229
56276E86814J3193J3382J3652J5059J6607J7062J7257J8434K0020K1116K2480
56265G75076K5077K8282L1350L4934L9449M3708M7014N0800N6591O4000P2199
56254A268480Q1470R1896J02538J13328J25655J39725J53568J65913J77587J88765
56244B608925J97630K03217K06701K08147K04938J95287J80420J61393J36868
$$ plain form
56331 291634 294024 297374 302138 306375 308679 310692 314630 319932 324573 328247 331825 334908 336561 337588
56317 337588 339536 342086 343775 344646 345840 347204 347747 348022 349635 352654 355665 358182 360950 364177 367546
56302 367546 371694 377676 385160 392944 400881 409427 417822 424749 430379 435863 441292 446146 451162 457648
56288 457648 465435 473641 482834 494099 506476 517843 528082 538954 550990 562991 574585 586814
56276 586814 600007 613389 627041 642100 658707 675769 693026 711460 731480 752596 775076
56265 775076 800153 828435 859785 894719 934168 977876 1024890 1075690 1132281 1196281 1268480
56254 1268480 1349950 1441846 1544384 1657712 1783367 1923092 2076660 2242573 2420160 2608925
56244 2608925 2806555 3009772 3216473 3424620 3629558 3824845 4005265 4166658 4303526
56235D303526J06334P2422L7691K016l4470o8867r8624j24334j46835j64362j75429
56224C709068j81780j85675j86736j84228j79665j74362j67070j57004j46456
56215B146092j37432j28440j17749j07105r8875r2027q4398p6612p0325o4820
56205A168309n8709n2893m8610m4648l9671l5062l2326k9968k6185k2288k0128
56194G57821j8598j6045j3792j3537j3656j1776q963p641p372o435n477n974o867
56181F21688o371n196m647l647j113R78O00o01k20O53Mq31K80J937J750J076K603
56164F08943N179N764M841N277P231Q630R375J0745J2024J1896J1774J3641J6105
56151G31425J6737J6668J8687K2397K5489K8205L2152L6389L9188M2129M8015
$$ plain form
56235 4303526 4409860 4482282 4519973 4521989 4487519 4418652 4320028 4195694 4048859 3884497 3709068
56224 3709068 3527288 3341613 3154877 2970649 2790984 2616622 2449552 2292548 2146092
56215 2146092 2008660 1880220 1762471 1655366 1556491 1464464 1380066 1303454 1233129 1168309
56205 1168309 1109600 1056707 1008097 963449 923778 888716 856390 826422 800237 777949 757821
56194 757821 739223 723178 709386 695849 682193 670417 661454 653813 646441 640006 634529 628555 621688
56181 621688 615317 610121 605474 601827 600714 601692 602292 601691 601471 602124 602128 601297 601577 603514 605264 606340 608943
56164 608943 614122 619886 624727 630004 637235 645865 655240 665985 678009 689905 701679 715320 731425
56151 731425 748162 764830 783517 805914 831403 859608 891760 928149 967337 1009466 1057481
56140A057481N6129O3838P1137P9002Q4963Q5149P9549P1002O0597M8546L7854
56129A795247L2042L0400K9665K8702K7239K2394J1913q56j0377j5828j9851k2655
56117A908035k3089k3835k9447l9968n1613o2609p3082q0645q1885p7563p1321
56106A292978o4224n5362m6227l9210l3232k6008j9025j4972j2291p911l340k013
56094I69163k579j086J939K980K409L361N323N405M489N613P791Q000P525R507
56080A029840J2128J1429R106R911J2990J3709J2522J3821J7187J8204J7092J8107
56068A196046K0984K1423J9659K0083K2684K3225K1675K2002K3849K3022K0124
56057A434776J9940K2272K2105J9078J7989J9618J9874J8348J8945K1654K2441
$$ plain form
56140 1057481 1113610 1177448 1248585 1327587 1412550 1497699 1577248 1648250 1708847 1757393 1795247
56129 1795247 1827289 1857689 1887354 1916056 1943295 1965689 1977602 1976746 1966369 1950541 1930690 1908035
56117 1908035 1884946 1861111 1831664 1791696 1740083 1677474 1604392 1523747 1441862 1364299 1292978
56106 1292978 1228754 1173392 1127165 1087955 1054723 1028715 1009690 994718 982427 974516 971176 969163
56094 969163 966584 965498 967437 970417 972826 976187 981510 986915 991404 997017 1004808 1012808 1020333 1029840
56080 1029840 1041968 1053397 1062503 1072414 1085404 1099113 1111635 1125456 1142643 1160847 1177939 1196046
56068 1196046 1217030 1238453 1258112 1278195 1300879 1324104 1345779 1367781 1391630 1414652 1434776
56057 1434776 1454716 1476988 1499093 1518171 1536160 1555778 1575652 1594000 1612945 1634599 1657040
56046A657040K1535K3117K6694K7685K6408K7349K9835K9123K6355K7400L1925
56035A954466L3984L3409L5911M1689M5049M5665M9015N4997N7540N6199N6631
56024B464555N8952N7614N3640N4497O0646O4783O5638O9659P7544Q2335Q2720
56013C192583Q5031R0277R2646R2566R7288J06585J12238J13482J18306J27546
56003D228548J33255J34934J41168J52645J60362J63488J71646J86211J97298
55994E669555K02997K13194K30159K44328K53755K68365K90091L08766L22744
55985H003954L42859L70849L95354M14819M41809M78935N14118N45755N87677
55976A2096129O42676O97432P50583Q17920R02459R89308J078268J189499J327828
$$ plain form
56046 1657040 1678575 1701692 1728386 1756071 1782479 1809828 1839663 1868786 1895141 1922541 1954466
56035 1954466 1988450 2021859 2057770 2099459 2144508 2190173 2239188 2294185 2351725 2407924 2464555
56024 2464555 2523507 2581121 2634761 2689258 2749904 2814687 2880325 2949984 3027528 3109863 3192583
56013 3192583 3277614 3367891 3460537 3553103 3650391 3756976 3869214 3982696 4101002 4228548
56003 4228548 4361803 4496737 4637905 4790550 4950912 5114400 5286046 5472257 5669555
55994 5669555 5872552 6085746 6315905 6560233 6813988 7082353 7372444 7681210 8003954
55985 8003954 8346813 8717662 9113016 9527835 9969644 10448579 10962697 11508452 12096129
55976 12096129 12738805 13436237 14186820 15004740 15907199 16896507 17974775 19164274 20492102
55967B0492102J476117J634301J828140K067933K338930K646166L025883L498333
55959C9007905M057472M725059N563405O615130P886578R410484J1259439J3477046
55951A02002518J6079944J9163561K2911685K7435523L2622930L8004574M2392235
55944C00612970M3521756L8631000K6314611Q258558j1098205k7039945l7024911
55937C42175834m1161133m0981208l8144803l3953944k9342629k4877606k0802040
55930A12912471j7205903j4148924j1633489r579308p897117o541797n469096
55923D0436837m603721l885565l299810k833937k448526k113912j834272j611818
55915A7805276j423170j251147j105515r92557q95208q01171p21260o62577o10802
$$ plain form
55967 20492102 21968219 23602520 25430660 27498593 29837523 32483689 35509572 39007905
55959 39007905 43065377 47790436 53353841 59968971 67855549 77266033 88525472 102002518
55951 102002518 118082462 137246023 160157708 187593231 220216161 258220735 300612970
55944 300612970 344134726 382765726 409080337 417338895 406240690 379200745 342175834
55937 342175834 301014701 260033493 221888690 187934746 158592117 133714511 112912471
55930 112912471 95706568 81557644 69924155 60344847 52447730 45905933 40436837
55923 40436837 35833116 31947551 28647741 25813804 23365278 21251366 19417094 17805276
55915 17805276 16382106 15130959 14025444 13032887 12137679 11336508 10615248 9952671 9341869
55906I341869n55335n06426m71801m40265m03217l69780l46539l23652k94590
55897E630264k69182k54053k39522k18416j99354j89132j79739j64772j51719
55888C764375j46200j40133j27020j13784j06613r9919q9824q4030q7418r1515
55878B677919q8697q3952q2729p9991p1530o3930o3145o4269o2021o0353o2623
55867A894679o3131n7550n1579n0435m9660m4787m0269m0410m0845l7372l4162
55856A384479l5124l5969l2708k9401k9967l0696k8271k6705k9124l1036k8965
55845A046513k7311k9433l0457k6375k1975k1958k2369j8705j4799j5394j7210
55834H00527j5522j2934j3506j4568j2244r246r404j0178q000n593o605q310o882
$$ plain form
55906 9341869 8786534 8280108 7808307 7368042 6964825 6595045 6248506 5924854 5630264
55897 5630264 5361082 5107029 4867507 4649091 4449737 4260605 4080866 3916094 3764375
55888 3764375 3618175 3478042 3351022 3237238 3130625 3030706 2940882 2856852 2769434 2677919
55878 2677919 2589222 2505270 2422541 2342550 2271020 2207090 2143945 2079676 2017655 1957302 1894679
55867 1894679 1831548 1773998 1722419 1671984 1622324 1577537 1537268 1496858 1456013 1418641 1384479
55856 1384479 1349355 1313386 1280678 1251277 1221310 1190614 1162343 1135638 1106514 1075478 1046513
55845 1046513 1019202 989769 959312 932937 910962 889004 866635 847930 833131 817737 800527
55834 800527 785005 772071 758565 743997 731753 722507 713103 702925 694925 689332 682727 674417 667535
55821F67535m883o388r392j0023r673j1251j2753j1056p989o576n465k826j282
55808E67978l063m715k586P27J250O17K230M706N089M706O028P315N875L111J204
55793F00472j389o134j0173j1001j1186j3359j4825j2578r262q506q498o186l898
55780D83477n525r542j1792j2182j2945j3238j1179q400p252o266l323l43J73
55767C81663j4J384K163k68l253l081j606k702n183n281l646l580m588l774j871
55752C46363j942l570l849k857k858l451k598j124j294k363k221j899l653o164
55738C06520o499n415n839p497p818o858o555o364m388j772j340k790l582l491
55724B36312m071m750l891k532k872m044l670k352k340l021k132l60k49j461j537
$$ plain form
55821 667535 662652 656264 646872 636849 627176 615925 603172 592116 584127 577551 572086 569260 567978
55808 567978 564915 560200 557614 558341 559591 560208 562438 567144 572233 576939 582967 590282 596157 599268 600472
55793 600472 599083 592949 582776 571775 560589 547230 532405 519827 510565 502059 493561 487375 483477
55780 483477 477952 468410 456618 444436 431491 418253 407074 398674 391422 385156 381833 381490 381663
55767 381663 381649 383033 385196 384928 381675 378594 376988 374286 369103 363822 360176 356596 352008 348234 346363
55752 346363 344421 340851 337002 334145 331287 327836 325238 324114 322820 320457 318236 316337 312684 306520
55738 306520 300021 294606 288767 281270 273452 266594 260039 253675 249287 247515 246175 243385 239803 236312
55724 236312 232241 227491 223600 221068 218196 214152 210482 208130 205790 202769 200637 200277 200028 198567 197030
55709A97030m84k77o56K21J707J543K03Q4R18K37k058l625l826m037m231l219
55693A79530j841k039l130k739j047l39p71m72N16L28q88r81L82J492K029L172
55677A73202M360L653J382J9K60M03l57j132j732k758l376k103K86J561J528J716
55661A76912K093J276j78j11J537K564K159J796K263K695K693K764K528J059r50
55646B01100j779j343j082j480j981k773m263n427n156m451m793n273m209k521
55632A54569k369l243k757p22Q59J405K139L169L469L434M304N301M496K298Q86
55617A77238M78o44k537l449l150l207l774l340j830r23j048j012o56j011j721
55602A49414j285O1N75J44K34P05j94k508m272m766n156n667n143l662k732k607
$$ plain form
55709 197030 196546 196269 195613 195834 197541 199084 199287 199371 200289 200526 198468 194843 191017 186980 182749 179530
55693 179530 177689 175650 172520 169781 168734 168395 167624 167152 167668 167996 167108 166127 166509 168001 170030 173202
55677 173202 177562 181215 182597 182616 182876 183279 182922 181790 180058 177300 173924 171821 172107 173668 175196 176912
55661 176912 179005 180281 180103 179992 181529 184093 186252 188048 190311 193006 195699 198463 200991 202050 201100
55646 201100 199321 197978 196896 195416 193435 190662 186399 180972 175816 171365 166572 161299 157090 154569
55632 154569 152200 148957 146200 145478 146337 147742 149881 153050 156519 159953 164257 169558 174054 176352 177238
55617 177238 177716 177072 174535 171086 167936 164729 160955 157615 155785 154862 153814 152802 152146 151135 149414
55602 149414 148129 148190 148765 148909 149143 149848 149654 147146 142874 138108 132952 127285 122142 118480 115748 113141
55586A13141k137j427j734k634k266o46K40j13j50O01Q76N23R15K078K318J304
55570A10889O34R10J090J158K370M284M575K610M14n93j186k008k439k430k875
55555A17403l554l305k544k849l773l115q97K45o26j356n71K32j85o58p1O98P70
55538I5844P74J056O98m79j124o84l61q44j261j262j686k374j792K05J645J455
55522H9810Q31O60J54r78j529j096r61j609j836j253j204k064k294j320p17j159
55506G3435j008N50J689J019n1O1N23J05l72K34J106R48K49J13L23K24K15P69
55488H0132J260J139J034J505K018K199K634L433L633K998K730L315L508K505
55474A14043J276O03k73j785k816k732k779l924n084n022m306l861l243j961r50
$$ plain form
55586 113141 111004 109577 107843 105209 102943 102297 102537 102424 102274 102875 103751 104274 105189 107267 109585 110889
55570 110889 111523 112433 113523 114681 117051 121335 125910 128520 128934 128341 127155 125147 122708 120278 117403
55555 117403 113849 110544 108000 105151 101378 98263 97366 97611 96985 95629 95058 95290 95105 94447 94376 95074 95844
55538 95844 96618 97674 98372 97893 96769 96085 95724 94880 93619 92357 90671 88297 86505 86710 88355 89810
55522 89810 90641 91301 91455 90477 88948 87852 86891 85282 83446 82193 80989 78925 76631 75311 74594 73435
55506 73435 72427 72977 74666 75685 75634 75695 76218 76323 75951 76185 77291 78239 78488 78601 78924 79148 79363 80132
55488 80132 81392 82531 83565 85070 87088 89287 91921 95354 98987 101985 104715 108030 111538 114043
55474 114043 115319 115922 115649 113864 111048 108316 105537 101613 96529 91507 87201 83340 80097 78136 77186
55459G7186j045j378q06K32P62Q80J019Q39J44k86m2J2o96j223o79K45M29p6o98
55440G4819j332j851j748j125p81p78l27M31L44n53p12K65Q30K33j91L82P30J4
55422F8650n29P6O21l3q17m41L33L07N5N18J006N22k10pP38R82Q24P92N56j28
55402G3815n01k54m56j520j979q92K49j42j159j218q15j185j588n04J451K235
55386F5537J417L86K7N3K41N25L51n53j224p48K46O21N17O07N88j29r41q95k44
55367F6382J50K23K54o5q31j146n01J04j81m88K32J243J257O05M10O03M58J86
55349F8895L08L06m28j150r52m47o22r71n72m6m73j200p62N64J184O74N1j42k37
55330F3980l13j57j03m53o15r2L84L9m08kN71J34p91q12j0M11K75L74P04O32L66
$$ plain form
55459 77186 76141 74763 73957 74189 74951 75831 76850 77689 77833 77547 77505 77517 76821 75598 74919 75164 75593 75517 74819
55440 74819 73487 71636 69888 68763 67982 67204 66877 67308 67652 67099 66387 66652 67482 67715 67524 67906 68636 68650
55422 68650 68121 68197 68818 68785 67968 67527 67860 68167 68222 68740 69746 70268 70058 70051 70789 71771 72595 73387 73943 73815
55402 73815 73314 73060 72604 71084 69105 68213 68462 68320 67161 65943 65128 63943 62355 61851 63302 65537
55386 65537 66954 67340 67367 67420 67661 68186 68537 67984 66760 66012 66258 66879 67396 68003 68591 68462 67521 66626 66382
55367 66382 66532 66755 67009 66944 66113 64967 64466 64570 64389 63901 64133 65376 66633 67238 67648 68251 68709 68895
55349 68895 69203 69509 69081 67931 66979 66532 65910 64939 64367 64321 63848 62648 61886 62450 63634 64308 64359 64217 63980
55330 63980 63667 63510 63407 62954 62339 62247 62631 62670 62262 62260 62831 62965 62174 61362 61352 61763 62038 62412 63116 63748 64114
55309F4114N33P16J35o45m75L44N61J04q9l5n95j545j644o06N43J104J289J289
55291F5098J084J017J262J152K86l78O2O76J09j030j125l30k07r03r49Q1Q83O54
55273F7442J25k5j04l80n47m56k22M19J585K343J766N95L15Q18P55J3k07K56J31
55254G4622r47j693j304o39n22m91JM77L53l8q3J88M02L28j20p78j020m27M45
55235F8754O70K41j50l23o07q66o79l55o46j482k027j888j334n12N43J269J066
55218F1674K96j19R4O37J400K168K165J116J22K50P90M29n48q00k02K12K17M67
55200G0368Q39N17l17o53m51n79r96p31K15P95P86R72J355R56k13q14k83L55K85
55181G2406k9p2j40l88l96j09m6j33L14J200J479Q42J99J59K50O5n9J16L30O00
$$ plain form
55309 64114 64647 65363 65498 64853 64378 64722 65283 65387 65298 65263 64668 63123 61479 60873 61416 62520 63809 65098
55291 65098 66182 67199 68461 69613 69899 69521 69583 70259 70368 69338 68213 67883 67676 66773 65824 65905 66788 67442
55273 67442 67567 67542 67438 67058 66511 66055 65833 66252 67837 70180 71946 72541 72856 73674 74429 74442 74235 74491 74622
55254 74622 73675 71982 70678 70039 69517 69026 69027 69504 69857 69819 69736 69924 70326 70654 70534 69756 68736 68309 68754
55235 68754 69424 69665 69515 69192 68585 67719 67040 66685 66039 64557 62530 60642 59308 58796 59339 60608 61674
55218 61674 61970 61851 61945 62582 63982 66150 68315 69431 69553 69803 70593 71022 70474 69674 69472 69684 69901 70368
55200 70368 71207 71724 71407 70754 70303 69724 68728 67997 68212 69007 69793 70765 72120 73076 72863 72049 71766 72121 72406
55181 72406 72377 72305 72165 71777 71381 71272 71226 71093 71407 72607 74086 74928 75127 75286 75536 75601 75542 75658 75988 76588
55161G6588J225J805J413J19q88q94l18L43R82J209N28o09j176j090j103j223
55145G6911p52M9M4q14j225o74j43k74m31j70o6m26o01l07k02n62p39m75m23o93
55125F8027m02O04J054K17q01p03J82P28P08O17N93M18N7l69p09n58L72J549K129
55106G3713K167K318K393J516j15j103q04p8K99N33P69O11K13L80J038J022M2
55089H4914o41j67O83J007J050J166R17J29l83j19K47R9j36n3n4l17k27L11L67
55070H8793l48o34K61J241J098L48O2K0n26j185j024j62N05O81O03K13n22r90
55052H8434o60k8N7m07q09q59n93l4N08M21l14q79q07o02o26l79M11J007P89K63
55032H4893M3j41n52n81J27O05j05j306j556o84L04P95R48Q84N31Q4k83p34j254
$$ plain form
55161 76588 77813 79618 81031 81150 80262 79368 79050 79393 80375 81584 82112 81503 80327 79237 78134 76911
55145 76911 76159 76208 76252 75438 74213 73539 73396 73122 72691 72521 72455 72029 71428 71121 70919 70357 69618 69143 68720 68027
55125 68027 67625 68229 69283 69500 68699 67996 68178 68906 69614 70231 70824 71242 71299 70930 70221 69663 70035 71584 73713
55106 73713 75880 78198 80591 82107 81992 80889 80085 80007 80306 80839 81608 82219 82432 82812 83850 84872 84914
55089 84914 84273 84106 84789 85796 86846 88012 88929 89058 88675 88556 88803 88902 88766 88713 88659 88342 88115 88426 88793
55070 88793 88445 87811 88072 89313 90411 90759 90821 90841 90315 89130 88106 87944 88449 89130 89733 89946 89424 88434
55052 88434 87774 87746 87803 87396 86587 85728 85135 85101 85609 86030 85716 84837 84030 83428 82802 82423 82834 83841 84630 84893
55032 84893 84936 84795 84243 83662 83789 84394 84289 82983 81427 80743 81047 81842 82790 83674 84205 84289 84006 83272 82018
55013H2018j317q07m78p52q05J52J405J715J132O51M95L4q14j373j373j265j240
54996G7378q46J70J315J912J792J300Q68P07P48Q15Q36P42L93n8m5O22J141O71
54978I0461l58q21n61l08j72L94J087Q59j61m98L80J121O16m30r21q89p34k64
54960H8801M67O59J30j9Q28J626J382O85L89P1p85j315o03N39P99M09M13O91M34
54941I5601j02l9M46N02K44M39R41R07L59J19L66O34R03J535K293K704L083M051
54923A14986N314O126O615P409Q323Q660Q386P792O388L638M16j766k899m275
54909A75113o265p791q177p998p776p086n553l724k431j964k063k242j995j283
54895A08765o56m46k08L83P14K60j81N11J947K705K435K188K698L597M360M944
$$ plain form
55013 82018 80701 79894 79416 78664 77859 78011 79416 81131 82263 82914 83409 83443 82629 81256 79883 78618 77378
54996 77378 76532 76702 78017 79929 81721 83021 83889 84596 85344 86159 86995 87737 88130 88072 88027 88649 89790 90461
54978 90461 90103 89282 88721 88413 88241 88635 89722 90581 90420 89922 90302 91423 92039 91609 90688 89799 89065 88801
54960 88801 89268 89927 90057 90038 90866 92492 93874 94559 94948 95019 94234 92919 92316 92855 93654 94063 94476 95167 95601
54941 95601 95499 95460 95906 96408 96652 97091 98032 98939 99298 99417 99783 100417 101320 102855 105148 107852 110935 114986
54923 114986 120300 126426 133041 140450 148773 157433 165819 173611 179999 183637 184053 182287 179388 175113
54909 175113 168848 161057 152880 144882 137106 130020 124467 120743 118312 116348 114285 112043 110048 108765
54895 108765 108109 107663 107455 107838 108552 108812 108631 109142 111089 113794 116229 118417 121115 124712 129072 134016
54879A34016N369N630O060O917P677P645O943O049M682K331m84k793m716o951
54865A78375q969r422q435p690p856p650o146m393l697l652l078j965j241j159
54851A03022j104q33q57j555k522k988k564j525m89L7l9m63p76n28L30J112J004
54834H9262J63l09J82Q82P58j53j088j580j574j047k27L39N85J086J841J785N12
54817I1417n63n8J152J249L18O0R34J508Q70j45n19m11l29k49o1P5L22J088J994
54798I8652J919N33j041j561q88L20J352J608R51J58K30J018J333O43k16l24K16
54781A04903P79J041R79P32O96J112J529J403J233K086L862N147N088M438M312
54766A39340M907N904P207Q572R242Q627O956M829K494p2k808n501p747q928q781
$$ plain form
54879 134016 139385 145015 151075 157992 165669 173314 180257 186306 190988 193319 192835 190042 185326 178375
54865 178375 169406 159984 151549 143859 136003 128353 122207 117814 114117 110465 107387 105422 104181 103022
54851 103022 101918 101085 100228 98673 96151 93163 90599 89074 88585 88622 88583 88120 87344 86816 87146 88258 89262
54834 89262 89425 89116 89298 90180 90938 90785 89697 88117 86543 85496 85269 85608 86193 87279 89120 90905 91417
54817 91417 90854 90796 91948 93197 93515 93575 94509 96017 96887 96742 96223 95812 95483 95234 95173 95248 95570 96658 98652
54798 98652 100571 101104 100063 98502 97614 97934 99286 100894 101845 102003 102233 103251 104584 105227 105011 104687 104903
54781 104903 105682 106723 107702 108434 109130 110242 111771 113174 114407 116493 120355 125502 130590 135028 139340
54766 139340 144247 150151 157358 165930 175172 183799 190755 195584 198078 198006 195198 189697 181950 173022 164241
54751A64241p973p439p211o568n350m178l331k404j272m18k5L16O60M82k59o88
54735A18583k86K92K68r2N9J038K487L807M397M033L345L372M357N515O261O809
54719A64245P276P073N758L763J670o15l321n978p811q583q533p797o538n291
54705A35318m624m464m211l460k371j451j101j316j705j865j694j244n78K1P6
54690A05331m10p20m05n6l40q54q23n35q18j409j200j90L79l5n24m08k58o21r98
54671I5106q33m89m60n01k90n4J37P69J763J936O10j048j450o81p5j39j49L57
54653I4509Q41P36K22j54j03L38R03J173Q80K14l27m08o6M46Q46R88R35P89M84
54634A03246J0l10j33L50N92M23J51j5j26j56p0k00q72j627j589p27L7Q9k21l54
$$ plain form
54751 164241 156268 148829 141618 135050 129700 125522 122191 119787 118515 118097 118072 118388 119048 119530 119271 118583
54735 118583 118297 118589 118857 118765 118824 119862 122349 126156 130553 134586 137931 141303 145660 151175 157436 164245
54719 164245 171521 178594 184352 188115 189785 189170 185849 179871 172060 163477 154944 147147 140609 135318
54705 135318 130694 126230 122019 118559 116188 114737 113636 112320 110615 108750 107056 105812 105234 105255 105331
54690 105331 104921 104201 103796 103740 103400 102546 101723 101188 100370 98961 97761 97571 97950 97915 97391 96983 96725 96104 95106
54671 95106 94273 93784 93324 92823 92533 92479 92616 93385 95148 97084 97694 96646 95196 94515 94440 94301 94152 94509
54653 94509 95350 96086 96308 96154 96051 96389 97292 98465 99345 99559 99232 98824 98758 99204 100050 101038 101973 102762 103246
54634 103246 103256 102946 102813 103163 103755 104178 104329 104314 104188 104032 103962 103762 102890 101263 99674 98947 98984 99073 98852 98498
54614I8498k45N2O04J178J310J033P96N09m07j708k133j098L58R47O28P6m41q34
54596I9123o01N24J748J954J046j31r58j431j678j659j338p16J11P31O52L3l30
54579I7080p6K05j4k91J08J053J750J757J224L65o60j490j652j007J35J210J659
54562A01356J272M37k35n55o92o00l8P48J102Q99P38R46J139R86P42O43M96K42
54544A09626K09M90O68O01O76R05O30l46j100q13L8L66j53j034j774k013j477
54527A05499l67N25O29K13j56k46M0P71J442J124j85j115n57Q54J660J371N93
54510A12095q7m80m73k01j88o81j136r94o04o85j189j414r87j91M65N87R2n72
54492A03357p07j92M12P33R73J129P78K0k77K35P51O31M05O38Q67N68L37Q98J718
$$ plain form
54614 98498 98253 98305 98909 100087 101397 102430 103226 103735 103328 101620 99487 98389 98747 99694 100322 100398 99957 99123
54596 99123 98522 99046 100794 102748 103794 103663 102705 101274 99596 97937 96599 95883 95994 96725 97377 97410 97080
54579 97080 97004 97209 97195 96904 97012 98065 99815 101572 102796 103161 102501 101011 99359 98352 98487 99697 101356
54562 101356 102628 103065 102830 102275 101583 100983 100945 101693 102795 103694 104432 105378 106517 107503 108245 108888 109384 109626
54544 109626 109835 110325 110993 111594 112270 113175 113805 113459 112359 111546 111584 111950 111797 110763 108989 106976 105499
54527 105499 105132 105657 106286 106499 106343 106097 106137 106908 108350 109474 109289 108174 107617 108471 110131 111502 112095
54510 112095 112008 111528 111055 110854 110666 109985 108849 107855 107251 106566 105377 103963 102976 102785 103250 103837 103929 103357
54492 103357 102650 102458 102870 103603 104576 105705 106483 106503 106226 106461 107212 107843 108248 108886 109753 110321 110658 111556 113274
54473A13274J839J459J434J796J973K105K723L467L380K363J234N01Q1J1L06L38
54457A38284n22j743k239j970j865k273k607k508k224j836j194o25o28q82o24
54442A14544j6R9j91J28J094J330P8j498j909j191l81P9N08R75J075N86j83p13
54424A14414o70j12N29Q00O60L98K50L24P01J232J425R60J73m25q76j445j794
54407A16544j304j48P34P99M18J79L56J028K009K624K269J428J282K081K597J672
54391A34568k70j711j708o97J33j1q25j326r84l15o6j23K57J203J943J844J212
54374A33124P90Q75J166J255J065R46J314K081K634K576K206J956J730J262P94
54359A55774P39R36Q61M51O9k41p60j378j541j125p53j056j956k827l166k995
$$ plain form
54473 113274 115113 116572 118006 119802 121775 123880 126603 130070 133450 135813 137047 137548 137629 137640 137946 138284
54457 138284 137762 136019 133780 131810 129945 127672 125065 122557 120333 118497 117303 116678 116050 115168 114544
54442 114544 114528 114627 114436 114564 115658 116988 117066 115568 113659 112468 112087 112166 112674 113649 114724 115310 115127 114414
54424 114414 113744 113632 114161 114961 115621 116019 116269 116593 117294 118526 119951 120911 121084 120659 119783 118338 116544
54407 116544 115240 115092 115826 116625 117043 117222 117578 118606 120615 123239 125508 126936 128218 130299 132896 134568
54391 134568 134298 132587 130879 130182 130315 130304 129479 128153 127169 126854 126788 126665 126922 128125 130068 131912 133124
54374 133124 133914 134789 135955 137210 138275 139221 140535 142616 145250 147826 150032 151988 153718 154980 155774
54359 155774 156513 157449 158310 158761 158830 158589 157829 156451 154910 153785 153032 151976 150020 147193 144027 141032
54343A41032k749k680k430j550m77k63j021j511q99l3p4o66o39M7M32K88K45L76
54325A27428O4o06p10n3M37J81l22o50j083j574j256K22J801K193J332oj212j941
54307A24245j817q52K87J014J357J467J097J64p40r98p47m45j38L86R74J234J038
54290A27526N31j07n81m77K11Q69R07M62N8j45l54n74m59J78R86J332R32K27L9
54271A31561O64J440J462O29k91n61r8O39J038P84K54L41J366K427K416J467O49
54254A46187L39j19j036j701j495q60n71o54o10l69l43p81j399j645j166j57P30
54237A34350J029R48R45R66O61K22K55P32Q48K01n66p00l25r2k80p11j199j612
54219A35672j795j674j366r73n01o9J34J35J53K18J88J67M28Q35Q43K60m64q34
$$ plain form
54343 141032 138283 135603 133173 131623 131146 130883 129862 128351 127452 127419 127345 126679 126040 126087 126519 126807 127052 127428
54325 127428 127492 126886 126176 126123 126560 126741 126419 125769 124686 123112 121856 122078 123879 126072 127404 127398 126186 124245
54307 124245 122428 121576 121863 122877 124234 125701 126798 126962 126222 125224 124477 124032 123894 124280 125254 126488 127526
54290 127526 128057 127950 127369 126892 127103 127972 128879 129341 129399 129254 128900 128326 127867 128045 129031 130363 131295 131522 131561
54271 131561 132225 133665 135127 135756 135465 134904 134806 135445 136483 137267 137521 137862 139228 141655 144071 145538 146187
54254 146187 146526 146407 145371 143670 142175 141315 140744 140090 139480 139111 138768 137987 136588 134943 133777 133620 134350
54237 134350 135379 136327 137272 138238 138899 139121 139376 140108 140956 141157 140591 139891 139566 139474 139194 138483 137284 135672
54219 135672 133877 132203 130837 129864 129363 129294 129428 129563 129716 129934 130122 130289 130717 131552 132395 132655 132191 131357
54201A31357p95m70R8P80J263J341J049M58k62o98n47q3K30M56Q94J216P32l92
54183A36627j053n73O07J798K766L296K936J770P42O09J083J430J399J042K72
54168A54751q65j860k262k150j752j094m14l55j110j884j798j011l56j38m3K8
54152A37687k48r02j410j345r62q41j118j271q37j51n4p14j217p43K08N21J19
54135A26722O9R45K015K340J861J051J72n48o43M2Q54R05K9j109j592q44R18K602
54117A35789L086K431J840K193L151L883M080L852L243K396J701J240M92q66k194
54102A66317k563k012j566j978k915l461l157k436k068k226k316j792r24k87J61
54087A36777Q94J777K009J286L09j63j85j89k12J04R84K267L422L772L079J980
$$ plain form
54201 131357 130562 130092 130190 130970 132233 133574 134623 135081 134819 134121 133574 133491 133721 134177 135071 136287 137019 136627
54183 136627 135574 135001 135608 137406 140172 143468 146404 148174 148916 149525 150608 152038 153437 154479 154751
54168 154751 153886 152026 149764 147614 145862 144768 144354 143999 142889 141005 139207 138196 137840 137702 137659 137687
54152 137687 137439 136537 135127 133782 132820 131979 130861 129590 128753 128602 128548 127834 126617 125874 126082 126603 126722
54135 126722 126791 127736 129751 132091 133952 135003 135175 134627 133984 134026 134880 135785 135814 134705 133113 132269 133187 135789
54117 135789 138875 141306 143146 145339 148490 152373 156453 160305 163548 165944 167645 168885 169377 168511 166317
54102 166317 163754 161742 160176 158198 155283 151822 148665 146229 144161 141935 139619 137827 136903 136616 136777
54087 136777 137671 139448 141457 142743 143052 142889 142704 142515 142303 142407 143391 145658 149080 152852 155931 157911
54071A57911J410J613K065K303K249J878J212O44M88L02n75j826k384j909j102
54056A64279m70J94R19J218J018R14J165J408J560J972K379K016J162J240K774
54041A83748M544N562O391P550Q059O956N207M555N222O080O453O336N481L758
54027B65902K126J744K309K456J720R23O80O81N14K22j14n58j031j427k008l112
54011B71027m523n728o479o676o056m757l713l699m229m269l745l464l702l834
53997B06153l320k348j404q53p94r52q11l10p2m32p77m82J4r9o85r50o96l20J16
53978A90978R07J939K846L699M689N265M609K848R76m41j676k996m169m785m498
53963B00191l200j523p27j231j696o16J462K524J749L43l42k10K61R62J842K510
$$ plain form
54071 157911 159321 160934 162999 165302 167551 169429 170641 171285 171773 172075 171500 169674 167290 165381 164279
54056 164279 163809 164003 164922 166140 167158 168072 169237 170645 172205 174177 176556 178572 179734 180974 183748
54041 183748 188292 193854 200245 207795 215854 222810 228017 232572 237794 243874 250327 256663 262144 265902
54027 265902 268028 269772 272081 274537 276257 277180 277860 278541 279055 279277 279163 278605 277574 276147 274139 271027
54011 271027 266504 260776 254297 247621 241565 236808 233095 229396 225167 220898 217153 213689 209987 206153
53997 206153 202833 200485 199081 198228 197434 196482 195671 195361 195289 194857 194080 193598 193612 193513 192828 191878 191182 190862 190978
53978 190978 191885 193824 196670 200369 205058 210323 214932 217780 218756 218315 216639 213643 209474 204689 200191
53963 200191 196991 195468 194741 193510 191814 191198 192660 195184 196933 197276 196934 196724 196985 197947 199789 202299
53947B02299K692K611K605K834L412M261M829M576L817L471L918M717N355N661
53933B57058N569N115M681M496M052K833J443J116K075L336M140M662N108N183
53919C10867M808M505M612M813M884N218O181P416Q197Q120P245N919M545L285
53905C90615J929M16p97j325j581k193k957l224l127l490m477n408n962o557p313
53890C44549p623p262o968p389q109q313p898p365o987o551n758m599l464k849
53876B53414k764k618k096j849k639m011m626l984k951k475k519k565k432k263
53862B13622k157k103k014j807j625j818k332k521k066j627j739j678n25J021
53848A90631J297P5j116j223q23p04o47k68O0p5l36k88m9J53M02O04L50k72n11
$$ plain form
53947 202299 204991 207602 210207 213041 216453 220714 225543 230119 233936 237407 241325 246042 251397 257058
53933 257058 262627 267742 272423 276919 280971 283804 285247 286363 288438 291774 295914 300576 305684 310867
53919 310867 315675 320180 324792 329605 334489 339707 345888 353304 361501 369621 376866 382785 387330 390615
53905 390615 392544 392960 392163 390838 389257 387064 384107 380883 377756 374266 369789 364381 358419 351862 344549
53890 344549 336926 329664 322696 315307 307198 298885 290987 283622 276635 270084 264326 259727 256263 253414
53876 253414 250650 248032 245936 244087 241448 237437 232811 228827 225876 223401 220882 218317 215885 213622
53862 213622 211465 209362 207348 205541 203916 202098 199766 197245 195179 193552 191813 190135 189610 190631
53848 190631 191928 192003 190887 189664 188841 188137 187490 187222 187282 187207 186871 186583 186534 186687 187089 187693 188043 187771 187260
53829A87260o4L77K43n9O0M28O25P77J161J579J699J613J516J307R56Q24J149
53812B01451J601J785J779J919K367L121L993M495M297L885M166N197O070O193
53798B52319N917N705N456N039M640M192L308K074J225J105J247J258J292J298
53784B96075P92j97r71j434k441m225n546n328m237l707m122m866n459n730n450
53769B43154m706m155m155m131l508k699k373k348k094j737j669j628j117m04
53755B06430k08o63j323j921k393k476k014j378r65o11o8L75L68J84K22L07P3
53738A93939l44o60r28j088o42M57J319J325J142J528J907J297J07l76K8L00j9
53721A99292l36k13R7N25J368K386K760K264J691J757K290K724K712K123J082
$$ plain form
53829 187260 187196 187573 187816 187757 187817 188245 188870 189647 190808 192387 194086 195699 197215 198522 199478 200302 201451
53812 201451 203052 204837 206616 208535 210902 214023 218016 222511 226808 230693 234859 240056 246126 252319
53798 252319 258236 263941 269397 274436 279076 283268 286576 288650 289875 290980 292227 293485 294777 296075
53784 296075 296867 296670 295699 294265 291824 287599 282053 276725 272488 268781 264659 259793 254334 248604 243154
53769 243154 238448 234293 230138 226007 222499 219800 217427 215079 212985 211248 209579 207951 206834 206430
53755 206430 206222 205559 204236 202315 199922 197446 195432 194054 193089 192478 192410 192785 193153 193337 193559 193866 193939
53738 193939 193595 192935 192007 190919 190277 190734 192053 193378 194520 196048 197955 199252 199359 198983 199011 199311 199292
53721 199292 198956 198743 198840 199365 200733 203119 205879 208143 209834 211591 213881 216605 219317 221440 222522
53706B22522J44j01L04R60J874L232M578N135M948M826M997M782L861K901K494
53691B67457K237J475L85k79k35N4O9j38n5O02J318J182L3j100j151l34K74J32
53673B71926m05r55j442j574q65M97J568J712J279Q87N96J81j82l7O81J428J522
53656B76817P77l02r08o89k7M87P33R90J390J729J788J534J115P81P10P89P63
53639B88477P40J144J977K597K552K175J934J741J424J332J782K357K500K415
53625C15147K627L002L062K904K896K801K196J530J606K146K111J426J136J626
53611C46216K062K039K429L744M867M473L021K164K578L409L697L403K913K345
53597C89360J614Q47L29K21M02N48L69j71q91j566k039k245k292k421k698k868
$$ plain form
53706 222522 222666 222565 222869 223829 225703 228935 233513 238648 243596 248422 253419 258201 262062 264963 267457
53691 267457 269694 271169 271554 271275 271040 271094 271163 271025 270970 271572 272890 274072 274105 273005 271854 271520 271794 271926
53673 271926 271521 270566 269124 267550 266685 267182 268750 270462 271741 272628 273224 273405 273223 273186 273867 275295 276817
53656 276817 277594 277292 276384 275695 275668 276155 276888 277878 279268 280997 282785 284319 285434 286215 286925 287714 288477
53639 288477 289217 290361 292338 294935 297487 299662 301596 303337 304761 306093 307875 310232 312732 315147
53625 315147 317774 320776 323838 326742 329638 332439 334635 336165 337771 339917 342028 343454 344590 346216
53611 346216 348278 350317 352746 356490 361357 365830 368851 371015 373593 377002 380699 384102 387015 389360
53597 389360 390974 391821 392150 392371 392773 393321 393690 393519 392628 391062 389023 386778 384486 382065 379367 376499
53581C76499k705k390k235k202k021j711j545j585j642j702j967k394k630k440
53567C47330j919j217l65N71J403J884J764R69m7m77l4O01O80L80L36N31M07o5
53549C52732k89L8O53J360K181K805K744K158J822K025K308K475L018M174N294
53534C85498N721N660N675N918O266O819P615Q353Q823R369J0413J1742J2727
53521D90599J3089J3061J3037J3285J3873J4582J5054J5283J5762J6937J8636
53510F53198K0252K1341K1971K2567K3464K4472K4967K4652K3998K3572K3113
53499I07567K1910J9999J8274J7385J7155J7238J7551J7824J7512J6621J5960
53488A104996J6134J6783J7309J7730J8229J8440J7964J7227J7066J7569J7937
$$ plain form
53581 376499 373794 371404 369169 366967 364946 363235 361690 360105 358463 356761 354794 352400 349770 347330
53567 347330 345411 344194 343829 344400 345803 347687 349451 350420 350373 349896 349862 350463 351143 351523 351859 352390 352797 352732
53549 352732 352443 352481 353134 354494 356675 359480 362224 364382 366204 368229 370537 373012 376030 380204 385498
53534 385498 391219 396879 402554 408472 414738 421557 429172 437525 446348 455717 466130 477872 490599
53521 490599 503688 516749 529786 543071 556944 571526 586580 601863 617625 634562 653198
53510 653198 673450 694791 716762 739329 762793 787265 812232 836884 860882 884454 907567
53499 907567 929477 949476 967750 985135 1002290 1019528 1037079 1054903 1072415 1089036 1104996
53488 1104996 1121130 1137913 1155222 1172952 1191181 1209621 1227585 1244812 1261878 1279447 1297384
53477A297384J7506J6384J5064J3786J2387J0529Q124N591L506J868Pk564n510
53464A394062q146j0230j2020j3740j5319j6406j6479j5261j3341j2024j2251
53453A248845j3800j5813j7655j8976j9411j8830j7739j6838j6321j5991j5811
53442A061660j5856j5857j5270j3829j1674r021o053l133p17R01J621J444P32
53429I74948K98Q26K229L896N413O704P704Q395R129J0367J2078J3845J5474J7130
53415A088436J8826K0323K1538K2582K3345K3613K3711K4490K6289K8439L0118
53404A351710L1325L2587L4069L5461L6550L7522L8747M0633M3370M6555M9168
53393A777697N0545N1161N2016N3248N3989N3630N2576N1564N0813N0196M9621
$$ plain form
53477 1297384 1314890 1331274 1346338 1360124 1372511 1383040 1391164 1396755 1400261 1402129 1402136 1399572 1394062
53464 1394062 1385916 1375686 1363666 1349926 1334607 1318201 1301722 1286461 1273120 1261096 1248845
53453 1248845 1235045 1219232 1201577 1182601 1163190 1144360 1126621 1109783 1093462 1077471 1061660
53442 1061660 1045804 1029947 1014677 1000848 989174 980153 974100 970967 970250 971151 972772 974216 974948
53429 974948 975246 976072 978301 982197 987610 994314 1002018 1010413 1019542 1029909 1041987 1055832 1071306 1088436
53415 1088436 1107262 1127585 1149123 1171705 1195050 1218663 1242374 1266864 1293153 1321592 1351710
53404 1351710 1383035 1415622 1449691 1485152 1521702 1559224 1597971 1638604 1681974 1728529 1777697
53393 1777697 1828242 1879403 1931419 1984667 2038656 2092286 2144862 2196426 2247239 2297435 2347056
53382B347056M8784M7044M4182M0944L8142L5534L2305K8430K4607K0857J6237
53371B724122J0396M459k53l865p604j2301j7847k3843l0024l6008m1178m5030
53359B521024m7472m8883m9890n0834n1336n0773m9317m7903m6841m5238m2417
53348A990120l9222l7016l5872l4839l3741l3458l4333l5440l5762l5193l4030
53337A601214l2265k9961k7576k5443k3375k1272j9475j8090j6467j4027j1274
53326A361989r408r082r973j1375j2756j3844j4659j5420j6159j6489j5988j4779
53314A202057j3418j2329j1484j0567r254p467n460l588j881l0K033L773M566
53301A136951M518M510N420P387R833J2049J3717J5028J6356J7959J9872K1956
$$ plain form
53382 2347056 2395840 2442884 2487066 2528010 2566152 2601686 2633991 2662421 2687028 2707885 2724122
53371 2724122 2734518 2738977 2738724 2734859 2727255 2714954 2697107 2673264 2643240 2607232 2566054 2521024
53359 2521024 2473552 2424669 2374779 2323945 2272609 2221836 2172519 2124616 2077775 2032537 1990120
53348 1990120 1950898 1913882 1878010 1843171 1809430 1775972 1741639 1706199 1670437 1635244 1601214
53337 1601214 1568949 1538988 1511412 1485969 1462594 1441322 1421847 1403757 1387290 1373263 1361989
53326 1361989 1352581 1343499 1333526 1322151 1309395 1295551 1280892 1265472 1249313 1232824 1216836 1202057
53314 1202057 1188639 1176310 1164826 1154259 1145005 1137538 1132078 1128490 1126609 1126579 1128612 1132385 1136951
53301 1136951 1141469 1145979 1151399 1158786 1168619 1180668 1194385 1209413 1225769 1243728 1263600 1285556
53289A285556K3887K5215K5651K5281K4439K3379K2125K0576J8629J6408J4312
53278A525458J2550J0622P701L839K33k178l878o006q741j1328j3402j5361j7403
53265A482106j9101k0254k1371k2932k4669k5993k6635k6635k6084k5350k5159
53254A217923k5978k7385k8329k8038k6592k4763k3322k2443k1787k1171k0882
53243I47233k1129k1550k1651k1379k0843j9858j8461j7400j7287j7499j6891
53232G33285j5479j4305j3616j2400j0068p537o029n626n632n701o045o986q661
53219F15200j0763j2455j3103j3211j3839j4937j5281j4403j3445j3511j4116
53208D66136j4049j2997j1459r780q191p223p219p717q055q219q527q911r171
$$ plain form
53289 1285556 1309443 1334658 1360309 1385590 1410029 1433408 1455533 1476109 1494738 1511146 1525458
53278 1525458 1538008 1548630 1556331 1560170 1560403 1558225 1554347 1548341 1539600 1528272 1514870 1499509 1482106
53265 1482106 1463005 1442751 1421380 1398448 1373779 1347786 1321151 1294516 1268432 1243082 1217923
53254 1217923 1191945 1164560 1136231 1108193 1081601 1056838 1033516 1011073 989286 968115 947233
53243 947233 926104 904554 882903 861524 840681 820823 802362 784962 767675 750176 733285
53232 733285 717806 703501 689885 677485 667417 659880 653851 648225 642593 636892 630847 623861 615200
53219 615200 604437 591982 578879 565668 551829 536892 521611 507208 493763 480252 466136
53208 466136 452087 439090 427631 417851 409660 402437 395218 387501 379446 371227 362700 353789 344618
53195C44618r397r522r018p753o617o439o730o421n420m594m368m321m024l509
53181B56485k986k690k862l371l538k922j935j206p32l38l79j124j868j707q98
53166B27929m48n17l61K69O86M46p5m40o21n43j2O27N67l84j386j592j064m43
53148B22638j94l37n55m51l4J27k92o39r4R65J331P28J94M31P58K99o25j019n95
53129B22636J03O40J024J240J098O43L47O94J687K795L363L147K495J984J849
53114B45745J878J690J088J76o71j100j168j250j489j631j604j787k296k482j782
53099B33317p45m33r72j445j243p57n86p63j022j289j529j573j362j137j139j349
53083B15973j580j621j347r65r65j474j802j194PO92M23j05l10n25j148j689j368
$$ plain form
53195 344618 335221 325699 316681 308928 302311 295872 289142 282721 277301 272707 268339 264018 259994 256485
53181 256485 253499 250809 247947 244576 241038 238116 236181 234975 234243 233905 233526 232402 230534 228827 227929
53166 227929 227481 226964 226603 226872 227558 228004 227929 227489 226868 226325 226313 226940 227507 227123 225737 224145 223081 222638
53148 222638 222444 222107 221552 221101 221067 221194 220902 220263 220169 221134 222465 223193 223387 223818 224576 224875 224250 223231 222636
53129 222636 222739 223379 224403 225643 226741 227384 227731 228425 230112 232907 236270 239417 241912 243896 245745
53114 245745 247623 249313 250401 250577 249906 248806 247638 246388 244899 243268 241664 239877 237581 235099 233317
53099 233317 232572 232139 231167 229722 228479 227722 227136 226373 225351 224062 222533 220960 219598 218461 217322 215973
53083 215973 214393 212772 211425 210460 209495 208021 206219 205025 205032 205724 206147 206042 205732 205207 204059 202370 201002
53066B01002l26M85M95Q0r5J60N65Q28Q00L87l97j221j496r39j0N33M89L36M28
53047B02104N73N28M57M89L11l02q59p07oM11M6q56j748k201j988j264n55j95
53029A94238N3M39O70M41J97N65J289J574J308J096J124Q94K81j24J6K60J35j72
53011B04284l39m34o24p99p89n78o5Q59J824K126J591Q18K91j31o39r65q33m71
52993B05126j82J16N50Q92Q66O20N58R02J598K416K944K880K445K162K164K121
52977B28178J895J686J394N33q20j693j331k40M65L96Q0KR5O1j80m59n45l62r2
52958B29063Or1k29l62n87q18q52p24o78o84m58k5J38k66q89j106o76P2M93J93
52938B21520m39n13K38R38P11k2k69q1l46j041j116l44Q0n25j112n80M18N20k12
$$ plain form
53066 201002 200676 201161 201656 201736 201641 201801 202366 203194 203994 204381 203984 202763 201267 200328 200318 200851 201340 201676 202104
53047 202104 202677 203205 203662 204151 204462 204160 203301 202594 202588 202999 203045 202189 200441 198240 196252 194988 194433 194238
53029 194238 194291 194730 195400 195841 196038 196603 197892 199466 200774 201870 202994 203888 204169 204045 204061 204321 204456 204284
53011 204284 203945 203511 202887 202088 201299 200721 200656 201515 203339 205465 207056 207874 208165 208034 207395 206430 205597 205126
52993 205126 204944 205060 205610 206502 207368 207988 208546 209448 211046 213462 216406 219286 221731 223893 226057 228178
52977 228178 230073 231759 233153 233686 232866 231173 229842 229602 230067 230463 230543 230545 230640 230701 230521 230062 229517 229155 229063
52958 229063 229069 228978 228749 228387 227800 226982 226130 225406 224728 224044 223586 223561 223699 223433 222544 221438 220762 220834 221327 221520
52938 221520 221081 220568 220806 221744 222455 222433 222164 222083 221737 220696 219580 219236 219316 218791 217679 217099 217517 218037 217825
52919B17825n26O3P40P48K77j51l55l91l05j62rK29N19N94K80k16o13q97j043
52900B16607q45l40l9k36m83k03M48Q85R69R74R56P60M45J95n8m03n25q4O12R29
52880B20564P96P48J018J187Q37K01n5N33J780K966L422L147K658K211J613R29
52864B44555P22J140J378P17m10j185j747k819m154m580l642k321j741k018k643
52849B21252l251l554l171k111j037n73o14p08p78j008j306j389j293j270j185
52834A98004n86N04J282J022P0m64K1R71J441J204P94O75P02M52k34j100j694
52817B03064j687j131m50P4O12J352J922J717Q22Pk78l77o61r35r37r35j281j834
52799A99064k250k470k527k139j085J92R03P01j57j178j816j587n32O12J133J077
$$ plain form
52919 217825 217299 217362 218102 218850 219127 218976 218621 218230 217925 217763 217754 217983 218502 219096 219376 219160 218547 217650 216607
52900 216607 215762 215422 215383 215147 214664 214461 214909 215794 216763 217737 218693 219453 219898 220093 220035 219632 219107 219023 219635 220564
52880 220564 221360 222108 223126 224313 225150 225351 225296 225829 227609 230575 233997 237144 239802 242013 243626 244555
52864 244555 245277 246417 247795 248512 248102 246917 245170 242351 238197 233617 229975 227654 225913 223895 221252
52849 221252 218001 214447 211276 209165 208128 207555 206941 206233 205455 204447 203141 201752 200459 199189 198004
52834 198004 197418 197922 199204 200226 200296 199832 199853 200824 202265 203469 204263 204938 205640 206092 205858 204758 203064
52817 203064 201377 200246 199796 199870 200482 201834 203756 205473 206295 206302 206024 205647 204986 204051 203114 202179 200898 199064
52799 199064 196814 194344 191817 189678 188593 188785 189688 190389 190232 189054 187238 185651 185119 185731 186864 187941
52783A87941R23Q26O73N35N08L24k23o74m59P7k9r39j697j516p12n1K01K06O6
52764A85980p6J94J041J839J684N74m04k62P47J481J302P74P31J071R08q1j038
52747A96465r39J70J337J882J957K046K305K484K304J737J007L64j26m47n03l03
52731B11740k19n40q77n38L28O82k4r87j157o18k10k29k52j05j47m91o48j64P43
52712B06287J426J405P54N6j36O5j6o29j067n95L87P11n1j090j392q06L2M22J37
52693B05900m51o37p1Q37J344J201Q01N92O13O58N70L86K56J71j47q52j435j103
52675B08633O1R14O04l25p19k59M66R08Q72K94m94o37K84J303J078j89q36J39
52657B12097J930L197L602L578L325K713J819R30J34p05j558k079j935j237n80
$$ plain form
52783 187941 188864 189690 190363 190898 191406 191730 191507 190833 190374 190451 190422 189483 187786 186270 185558 185507 185708 185914 185980
52764 185980 185904 186098 187139 188978 190662 191236 190832 190570 191317 192798 194100 194874 195605 196676 197584 197503 196465
52747 196465 195526 195696 197033 198915 200872 202918 205223 207707 210011 211748 212755 213119 212993 212546 212043 211740
52731 211740 211521 210981 210104 209566 209894 210576 210552 209565 208408 207790 207580 207351 207099 206994 206847 206356 205708 205544 206287
52712 206287 207713 209118 209872 209928 209792 209857 209841 209212 208145 207550 207937 208648 208597 207507 206115 205309 205341 205763 205900
52693 205900 205449 204812 204741 205578 206922 208123 208924 209516 210129 210787 211357 211743 211999 212170 212023 211171 209736 208633
52675 208633 208694 209608 210212 209887 209168 208909 209375 210283 211155 211449 210955 210318 210602 211905 212983 212794 211958 212097
52657 212097 214027 217224 220826 224404 227729 230442 232261 233191 233325 232620 231062 228983 227048 225811 225231
52642B25231n32r99j391j439j458j574j309l93N70R08R10J271J948K402K720L409
52626B30274M223M321L548K557J556J03j633k582k247j502j294j405j183o85m11
52611B33640m87p16j030j238q93KO66N32J39L61J121J599J473J195J128J098Q77
52594B39467N88N03O79R36J032Q97P65Q97J169J172Q74P34R49J057O38Ok51j71
52576B51941k76o90r45p22l24k10l47k56K70P75N92l25j285j686j622j434j091
52559B42365n32k17o16j288j330q64r83j972k583j749j81O04L45R5N11J088J204
52542B33897J012R21Q02L39j65LR36J746J626R05N45P24O42j03p86o82k23j99
52524B41940l75O8R97J431J108P83Q57Q53N90O89J438K169K408K648L275L702
$$ plain form
52642 225231 224699 223700 222309 220870 219412 217838 216529 216136 216706 217614 218524 219795 221743 224145 226865 230274
52626 230274 234497 238818 242366 244923 246479 246582 244949 242367 240120 238618 237324 235919 234736 234051 233640
52611 233640 233153 232437 231407 230169 229276 229278 229944 230476 230615 230976 232097 233696 235169 236364 237492 238590 239467
52594 239467 240055 240558 241237 242173 243205 244102 244867 245764 246933 248105 248979 249713 250662 251719 252357 252363 252112 251941
52576 251941 251665 250975 250030 249308 248984 248774 248427 248171 248441 249216 249808 249483 248198 246512 244890 243456 242365
52559 242365 241833 241616 241000 239712 238382 237518 236535 234563 231980 230231 230050 230654 230999 231094 231605 232693 233897
52542 233897 234909 235830 236632 236971 236806 236809 237745 239491 241117 242022 242567 243291 243933 243830 243044 242362 242139 241940
52524 241940 241565 241633 242630 244061 245169 245952 246809 247662 248252 248941 250379 252548 254956 257604 260879 264581
52508B64581L389K893K884K840J834R3j265j844k250k950l702m084l840k884j557
52493B54138p51j035j819k060j627j248j255j220p76j06M57P04M34l29r79q30
52477B41698J8Q51J323J644J866J749J395J240J268R96M85N97J778L178L594K995
52461B66675K530L041L961L914K260j28j761k101j936k190k869l462l812l987
52447B60135l715k691j292l05L8J35K19J34j03k27k53m18n48j84M97P02J49m34
52429B51839l72Q8L64L72L09R4l94q34p46n6Q96J712K045J681R16M88Q00J454
52411B60656J923K306K979L822M424M867N665O827P528O924M965K304l10k420
52397C12460l895m802n198n028m346l462k723k122j409n49J78N97Q42J062J145
$$ plain form
52508 264581 267970 270863 273747 276587 278421 278514 277249 275405 273155 270205 266503 262419 258579 255695 254138
52493 254138 253387 252352 250533 248473 246846 245598 244343 243123 242347 242241 242698 243402 243836 243507 242528 241698
52477 241698 241716 242567 243890 245534 247400 249149 250544 251784 253052 254048 254533 255130 256908 260086 263680 266675
52461 266675 269205 272246 276207 280121 282381 282253 280492 278391 276455 274265 271396 267934 264122 260135
52447 260135 256420 253729 252437 252132 252170 252305 252524 252658 252555 252328 252075 251657 251109 250925 251422 252124 252273 251839
52429 251839 251467 251555 251919 252291 252600 252694 252300 251466 250720 250664 251560 253272 255317 256998 257914 258402 259202 260656
52411 260656 262579 264885 267864 271686 276110 280977 286642 293469 300997 307921 312886 315190 314880 312460
52397 312460 308565 303763 298565 293537 289191 285729 283006 280884 279475 278926 279104 279701 280543 281605 282750
52382B82750R60O81O70J076J734K414L007L464L737L791L710L697L977M576N158
52367C25402N216M564L548K587J671N76n31j142j128r15p83m62K19P58O32K33
52351C40445M38J371K282K702K963L357L531L190K765K823L214L445L568M027
52337C80121M765N219N304N762P144Q944J0194J0735J1363J2633J4042J4835J5292
52324E06353J6503J8696K0555K0830K0112K0077K1177K2118K1833K0913K0498
52313G29665K0675K0802K0754K0867K0964K0496J9566J8876J8565J7939J6590
52302I45759J5054J3982J3253J2361J1294J0429R697Q354N723J946k063n354p560
52289A032875q894r760j0487j1240j1911j2019j1114r414p751o643n729m367k452
$$ plain form
52382 282750 283710 284391 285061 286137 287871 290285 293292 296756 300493 304284 307994 311691 315668 320244 325402
52367 325402 330618 335182 338730 341317 342988 343564 343033 341891 340763 339848 339065 338603 338822 339580 340212 340445
52351 340445 340883 342254 344536 347238 350201 353558 357089 360279 363044 365867 369081 372526 376094 380121
52337 380121 384886 390105 395409 401171 408315 417259 427453 438188 449551 462184 476226 491061 506353
52324 506353 522856 541552 562107 582937 603049 623126 644303 666421 688254 709167 729665
52313 729665 750340 771142 791896 812763 833727 854223 873789 892665 911230 929169 945759
52302 945759 960813 974795 988048 1000409 1011703 1022132 1031829 1040183 1045906 1047852 1045789 1040435 1032875
52289 1032875 1023981 1014221 1003734 992494 980583 968564 957450 948036 940285 933642 927913 923546 921094
52276I21094l68J618L508N352P224R274J1380J2918J3386J3111J2982J3469J4317
52263A039265J5077J5594J5920J6097J6089J5771J5104J4439J4323J4717J4773
52252A207169J3838J2317J0935R465O984L347m53l532o024q469j0943j3131j4861
52239A206642j6201j7280j8196j8939j9304j9158j8734j8337j7807j6686j4970
52228A011030j3232j1935j0993j0093r069p888o667n688n032m266k978j569q19
52215I20801p32m49N26J768K735L405L730L395K511J964K352L125L391L192L307
52200I55021M137N268O064O199N789N347N357N696N827N731O000O591O326M382
52186A033735J649l90j686l376n697p446p735p230p114p656q377q879q996q444
$$ plain form
52276 921094 920726 922344 925852 931204 938428 947702 959082 972000 985386 998497 1011479 1024948 1039265
52263 1039265 1054342 1069936 1085856 1101953 1118042 1133813 1148917 1163356 1177679 1192396 1207169
52252 1207169 1221007 1233324 1244259 1253724 1260708 1264055 1263602 1260070 1254046 1245577 1234634 1221503 1206642
52239 1206642 1190441 1173161 1154965 1136026 1116722 1097564 1078830 1060493 1042686 1026000 1011030
52228 1011030 997798 985863 974870 964777 955708 947820 941153 935465 930433 926167 923189 921620 920801
52215 920801 920069 919620 920146 921914 924649 928054 931784 935179 937690 939654 942006 945131 948522 951714 955021
52200 955021 959158 964426 970490 976689 982478 987825 993182 998878 1004705 1010436 1016436 1023027 1029353 1033735
52186 1033735 1035384 1034994 1033308 1029932 1024235 1016789 1009054 1001824 994710 987054 978677 969798 960802 952358
52172I52358p126n510m274l612l194k621j620p0J797L326L911L588K906K383K239
52157I44481K497K960L171K758J842Q68O8o16j084j002k93N96J199J549J973K536
52141I63503K973L041K792K538K738L676N074O197O665P015Q083R962J2061J4103
52127A050421J6412J9114K1667K3589K5142K6824K8522K9662L0005K9829K9427
52116A330614K8850K8123K7271K6199K4775K2991K0825J8167J5141J2266R947
52105A565169Q014O159M527L353K276P12j242l012m648o886r914j2869j4917j6285
52091A520437j7777j9744k1912k3698k4400k3493k1323j9061j7520j6282j4398
52080A300829j1666q669n918l573j787n89N96K651N733Q914J1177J2490J3688
$$ plain form
52172 952358 945232 939722 935448 931836 928642 926021 924401 924331 926128 929454 933365 936953 939859 942242 944481
52157 944481 946978 949938 953109 955867 957709 958577 958645 958029 956945 955943 955650 956246 957445 958994 960967 963503
52141 963503 966476 969517 972309 974847 977585 981261 986335 992532 999197 1006212 1014295 1024257 1036318 1050421
52127 1050421 1066833 1085947 1107614 1131203 1156345 1183169 1211691 1241353 1271358 1301187 1330614
52116 1330614 1359464 1387587 1414858 1441057 1465832 1488823 1509648 1527815 1542956 1555222 1565169
52105 1565169 1573183 1579342 1583869 1587222 1589498 1590210 1588968 1585956 1581308 1574422 1564508 1551639 1536722 1520437
52091 1520437 1502660 1482916 1461004 1437306 1412906 1389413 1368090 1349029 1331509 1315227 1300829
52080 1300829 1289163 1280494 1274576 1271003 1269216 1268627 1269223 1271874 1277607 1286521 1297698 1310188 1323876
52067A323876J5415J7415J8899J9421J9288J9065J8808J8100J6805J5455J4591
$$ plain form
52067 1323876 1339291 1356706 1375605 1395026 1414314 1433379 1452187 1470287 1487092 1502547 1517138
$$ [...]
##END NTUPLES=NMR SPECTRUM
##END=
