##TITLE=AC1684_PANAN14365_8637509_Men9rfclpd
##JCAMPDX= 6.0         $$ Bruker NMR JCAMP-DX V2.0
##DATA TYPE= NMR SPECTRUM
##DATA CLASS= NTUPLES
##ORIGIN= BRUKER
##OWNER= Administrator
$$ 1.72 TOPSPIN		Version 2.1
$$ 2014-05-31 03:06:02.700 -0700  Administrator@X
$$ Compression mode = diff/dup
##.OBSERVE FREQUENCY= 400.02188249412
##.OBSERVE NUCLEUS= ^1H
##.ACQUISITION MODE= SIMULTANEOUS (DQD)
##.ACQUISITION SCHEME= undefined
##.AVERAGES= 8
##.DIGITISER RES= 22
##SPECTROMETER/DATA SYSTEM= spect
##.PULSE SEQUENCE= zg30
##.SOLVENT NAME= COFFEE_meoh
##.SHIFT REFERENCE= INTERNAL, COFFEE_meoh, 1, 14.98509
##AUDIT TRAIL= $$ (NUMBER, WHEN, WHO, WHERE, PROCESS, VERSION, WHAT)
$$ ##TITLE= Audit trail, TOPSPIN		Version 2.1
$$ ##JCAMPDX= 5.01
$$ ##ORIGIN= Bruker BioSpin GmbH
$$ ##OWNER= Administrator
$$ $$ E:\/data/COFFEE/nmr/AC1684_PANAN14365_8637509_Men9rfclpd/20/pdata/1/auditp.txt
$$ ##AUDIT TRAIL=  $$ (NUMBER, WHEN, WHO, WHERE, PROCESS, VERSION, WHAT)
(   1,<2014-05-31 03:05:55.388 -0700>,<Administrator>,<X>,<go>,<TOPSPIN 2.1>,
      <created by zg
	started at 2014-05-31 03:04:49.653 -0700,
	POWCHK enabled, PULCHK disabled,
       configuration hash MD5:
       C8 4E 4E 5D D3 5C D8 9E 9F 52 82 E0 59 8A DE 15
       data hash MD5: 64K
       34 EF 90 5A AD 9F 3C B0 C5 3F 8D BE D2 A4 88 06>)
(   2,<2014-05-31 03:05:58.544 -0700>,<Administrator>,<X>,<proc1d>,<TOPSPIN 2.1>,
      <Start of raw data processing
       efp LB = 0 FT_mod = 6 PKNL = 1 PHC0 = 0 PHC1 = 0 SI = 32K 
       data hash MD5: 32K
       A4 A0 73 42 44 6C 0C 72 54 22 3A 36 C6 01 68 61>)
(   3,<2014-05-31 03:05:58.857 -0700>,<Administrator>,<X>,<proc1d>,<TOPSPIN 2.1>,
      <pk PHC0 = 91.8457 PHC1 = 0 
       data hash MD5: 32K
       00 12 E5 1D 0D 56 B0 FB 2F 52 0A 31 48 85 E2 89>)
(   4,<2014-05-31 03:05:59.091 -0700>,<Administrator>,<X>,<proc1d>,<TOPSPIN 2.1>,
      <abs ABSG = 1 
       data hash MD5: 32K
       8A 98 BC 70 53 42 D7 4F D6 CC 9F A1 FB D0 2F 8B>)
(   5,<2014-05-31 03:05:59.153 -0700>,<Administrator>,<X>,<proc1d>,<TOPSPIN 2.1>,
      <abs ABSG = 2 
       data hash MD5: 32K
       07 55 A4 FC 68 DD DD 89 0C 7A 99 5C 59 22 0D ED>)
(   6,<2014-05-31 03:05:59.232 -0700>,<Administrator>,<X>,<proc1d>,<TOPSPIN 2.1>,
      <abs ABSG = 3 
       data hash MD5: 32K
       7E 9E 04 81 3E B7 60 53 0C 8F 60 70 EC 9D 9F 7F>)
(   7,<2014-05-31 03:05:59.278 -0700>,<Administrator>,<X>,<proc1d>,<TOPSPIN 2.1>,
      <abs ABSG = 4 
       data hash MD5: 32K
       74 8A F8 F4 0D 82 21 CF F8 9D 85 78 9C E5 A7 5F>)
(   8,<2014-05-31 03:05:59.325 -0700>,<Administrator>,<X>,<proc1d>,<TOPSPIN 2.1>,
      <abs ABSG = 5 
       data hash MD5: 32K
       C4 92 B7 6C A2 61 4D B0 9D 5C 42 2A 40 83 86 BA>)
$$ ##END=
$$ 
$$ $$ hash MD5
$$ $$ A7 11 24 3E F3 AD 65 59 2D 27 CF F4 C4 72 97 B3
##$RELAX= 
##$RELAX= 
##$RELAX= 
##$RELAX= 
##$RELAX= 
##$RELAX= 
##$RELAX= 
$$ Bruker specific parameters
$$ --------------------------
##$DU= <E:\>
##$EXPNO= 20
##$NAME= <AC1684_PANAN14365_8637509_Men9rfclpd>
$$ [...]
##$TP= (0..7)
150 150 150 150 150 150 150 150
##$TP07= 0
##$TPNAME0= <>
##$TPNAME1= <>
##$TPNAME2= <>
##$TPNAME3= <>
##$TPNAME4= <>
##$TPNAME5= <>
##$TPNAME6= <>
##$TPNAME7= <>
##$TPOAL= (0..7)
0.5 0.5 0.5 0.5 0.5 0.5 0.5 0.5
##$TPOFFS= (0..7)
0 0 0 0 0 0 0 0
##$TUNHIN= 0
##$TUNHOUT= 0
##$TUNXOUT= 0
##$USERA1= <user>
##$USERA2= <user>
##$USERA3= <user>
##$USERA4= <user>
##$USERA5= <user>
##$V9= 5
##$VALIST= <valist>
##$VCLIST= <CCCCCCCCCCCCCCC>
##$VD= 0
##$VDLIST= <DDDDDDDDDDDDDDD>
##$VPLIST= <PPPPPPPPPPPPPPP>
##$VTLIST= <TTTTTTTTTTTTTTT>
##$WBST= 2048
##$WBSW= 25
##$XGAIN= (0..3)
0 0 0 0
##$XL= 0
##$YL= 0
##$YMAX_a= 643707
##$YMIN_a= -549088
##$ZGOPTNS= <>
##$ZL1= 120
##$ZL2= 120
##$ZL3= 120
##$ZL4= 120
##$ABSF1= 14.98509
##$ABSF2= -5.573092
##$ABSG= 5
##$ABSL= 3
##$ALPHA= 0
##$AQORDER= 0
##$ASSFAC= 0
##$ASSFACI= 0
##$ASSFACX= 0
##$ASSWID= 0
##$AUNMP= <proc_prof1d_extract_pilot.lims>
##$AXLEFT= 0
##$AXNAME= <>
##$AXNUC= <1H>
##$AXRIGHT= 0
##$AXTYPE= 0
##$AXUNIT= <>
##$AZFE= 0.1
##$AZFW= 0.1
##$BCFW= 0
##$BC_mod= 0
##$BYTORDP= 0
##$COROFFS= 0
##$CY= 15
##$DATMOD= 1
##$DC= 0
##$DFILT= <>
##$DTYPP= 0
##$F1P= 0
##$F2P= 0
##$FCOR= 0.5
##$FTSIZE= 32768
##$FT_mod= 6
##$GAMMA= 0
##$GB= 0
##$INTBC= 1
##$INTSCL= 1
##$ISEN= 128
##$LB= 0
##$LEV0= 0
##$LPBIN= 0
##$MAXI= 10000
##$MC2= 0
##$MEAN= 0
##$ME_mod= 0
##$MI= 0
##$NCOEF= 0
##$NC_proc= -8
##$NLEV= 6
##$NOISF1= 0
##$NOISF2= 0
##$NSP= 0
##$NTH_PI= 0
##$NZP= 0
##$OFFSET= 14.98509
##$PC= 1
##$PHC0= 91.8457
##$PHC1= 0
##$PH_mod= 1
##$PKNL= yes
##$PPARMOD= 0
##$PPDIAG= 0
##$PPIPTYP= 0
##$PPMPNUM= 2147483647
##$PPRESOL= 1
##$PSCAL= 4
##$PSIGN= 0
##$PYNMP= <proc.py>
##$REVERSE= no
##$SF= 400.02
##$SI= 32768
##$SIGF1= 0
##$SIGF2= 0
##$SINO= 400
##$SIOLD= 32768
##$SPECTYP= <>
##$SREGLST= <1H.CDCl3>
##$SSB= 0
##$STSI= 32768
##$STSR= 0
##$SW_p= 8223.68421052631
##$SYMM= 0
##$S_DEV= 0
##$TDeff= 65536
##$TDoff= 0
##$TI= <>
##$TILT= no
##$TM1= 0
##$TM2= 0
##$TOPLEV= 0
##$USERP1= <user>
##$USERP2= <user>
##$USERP3= <user>
##$USERP4= <user>
##$USERP5= <user>
##$WDW= 1
##$XDIM= 32768
##$YMAX_p= 463284641
##$YMIN_p= -730365
##$CURPLOT= <Network HP LaserJet P1505>
##$CURPRIN= <$Network HP LaserJet P1505>
##$DFORMAT= <normdp>
##$LAYOUT= <+/1D_H.xwp>
##$LFORMAT= <normlp>
##$PFORMAT= <normpl>
##$SURQMSG= 1
$$ End of Bruker specific parameters
$$ ---------------------------------
##NTUPLES= NMR SPECTRUM
##VAR_NAME=  FREQUENCY,     SPECTRUM/REAL,   SPECTRUM/IMAG
##SYMBOL=    X,             R,               I
##VAR_TYPE=  INDEPENDENT,   DEPENDENT,       DEPENDENT
##VAR_FORM=  AFFN,          ASDF,            ASDF
##VAR_DIM=   32768,         32768,           32768
##UNITS=     HZ,            ARBITRARY UNITS, ARBITRARY UNITS
##FACTOR=    0.250966925370066, 1,           1
##FIRST=     8223.43324360094, 92980,        -31498
##LAST=      0,             -42795,          142252
##MIN=       0,             -730365,         0
##MAX=       8223.43324360094, 463284641,    0
$$ Real data points
##PAGE= N=1
##DATA TABLE= (X++(R..R)), XYDATA
$$ [...]
$$ plain form
19541 -93903 -191599 -250816 -421370 40256 125586 307130 182951 -178666 -25215 -76808 188076
19529 -81255 192086 172103 146612 80749 -266154 318893 7935 -132194 -11295 42361 259252
19518 259252 -424864 -309149 -209896 69157 26939 37834 -158355 203686 80595 112196 -368881
19506 -178919 43582 -223358 86581 -235083 -202139 -275674 82150 -95104 -220343 -5341 -202837
19495 -202837 29065 169070 -183954 -255836 18641 20271 -307668 299742 130874 249234
19485 249234 48297 -310558 87173 -142553 41919 -89049 -111920 -46261 -219166 21488 -50240
19473 -88071 -30002 165861 -403898 264989 -158009 372054 -30176 35947 204397 82061
19462 121196 -256825 10029 -44760 176857 -92894 -118297 -20972 -142514 4489 125983 -42710
$$ packed form
19541i3903r7696n9217j70554D0256Q5330J81544j24179a78666b5215n1593A88076
19529h1255A92086j9983k5491o5863b66154C18893G935a32194a1295D2361K16891
19518B59252d24864J15715R9253F9157B6939J0895a58355B03686H0595L1601c68881
19506a78919D3582b23358H6581b35083L2944p3535H2150i5104j25239e341j97496
19495b02837B9065J40005a83954p1882A8641J630c07668B99742A30874J18360
19485B49234D8297c10558H7173a42553D1919h9049k2871d6261j72905B1488e0240
19473h8071c0002A65861d03898B64989a58009C72054c0176C5947J68450H2061
19462A21196b56825A0029d4760A76857i2894k5403b0972j21542D489J21494d2710
$$ plain form
19450 65674 -536 64407 -36121 -63905 74958 -170890 96955 34384 -496514 -60447 -361286
19439 -361286 -180637 -135041 -390449 -23321 -101382 -150825 -196463 -23294 -212795 195624 -221655
19427 -406325 -217569 -294919 -477133 7055 -27838 -12356 -240858 131836 -81458 146321 -315127
19415 -95876 -285956 -98979 50883 -111698 4135 -144907 -16101 -163586 58960 -154266 -10370
19403 -353709 40645 -254450 130387 19051 311102 -223793 -58762 -18408 227912 97381
19392 311780 -67627 -365862 -71596 -79556 -118385 96370 -74424 -186168 183119 -155171 -263801
19381 -263801 -14198 -33354 -280939 -244853 -197684 150002 -157235 -422611 -47540 -134683 172844
19369 24243 4826 -338973 -222232 247171 -42975 304389 52832 -157 133419 -236810 -119624
$$ packed form
19450F5674e36F4407c6121k7784G4958a70890I6955C4384d96514f0447l00839
19439c61286a80637M5596k55408b3321p8061m9443m5638b3294j89501A95624b21655
19427d06325J88756p7350j82214G055b7838a2356k28502A31836h1458A46321c15127
19415i5876j90080i8979E0883a11698D135a44907a6101j47485E8960a54266a0370
19403c53709D0645b54450A30387A9051K92051b23793e8762a8408B27912I7381
19392C11780f7627k98235g1596p960l8829I6370g4424j11744A83119a55171j08630
19381b63801a4198j9156k47585L6086M7169A50002a57235k65376d7540q7143A72844
19369B4243D826c38973J16741B47171d2975C04389E2832a57A33419b36810J17186
$$ plain form
19358 -119624 -6702 -224977 321408 -60474 153231 -136587 -212915 -244073 -251755 -86984 -248922
19347 -248922 -149115 -206781 -215531 -43422 -73978 -406689 57259 117876 49043 -206145 -336492
19336 -336492 -180836 -226074 80691 -48993 -196217 1660 -188391 -8941 -123112 18987 -88729
19324 189925 -86057 -393125 -218889 66404 -277485 -398932 -31336 83628 -222960 -291240
19314 -291240 -131431 -258892 -79069 19261 22764 267533 -49590 -13769 -154257 -13406 -148956
19303 -148956 -136222 1010 -279973 157516 23285 -131812 -226227 -224207 -28652 -23166 -126540
19292 -126540 -471157 -68136 128754 283227 389423 -265785 -355504 68297 -9882 -67995 -147188
19281 -147188 260953 215486 -224320 -71474 -224388 4159 -108983 115242 89770 -197540
$$ packed form
19358a19624f702k18275C21408f0474A53231a36587p6328l1158p682h6984j61938
19347b48922R9807n7666q750d3422l0556l32711E7259O0617D9043b06145j30347
19336c36492J55656m5238H0691d8993j47224A660a88391h941j14171A8987h8729
19324A89925h6057l07068J74236F6404b77485j21447c1336H3628b22960o8280
19314b91240a31431j27461g9069A9261L503K44769d9590a3769j40488a3406j35550
19303a48956J2734A010b79973A57516B3285a31812r4415K020b8652N486j03374
19292a26540l44617f8136A28754J54473J06196b65785q9719F8297i882n8113p9193
19281a47188B60953m5467b24320g1474j52914D159a08983A15242k5472a97540
$$ plain form
19270 -228092 -5850 172541 59200 -169271 -97490 -29827 459480 159520 87589 61114 -78611
19258 -70463 -77080 136030 -28297 12448 -69240 7206 -272869 -76501 -406163 -93303 148801
19246 120962 -248296 -114845 -84513 168343 51938 102427 3530 -59185 -12422 -36548 -37390
19235 -37390 55191 -216072 -34299 -305473 -11079 -5230 -137089 122 -123205 -20772 -45058
19224 -45058 -26771 234008 69656 8447 21940 -186214 -55906 80018 -197667 -148240 191971
19212 145915 -251999 -69708 -104889 211052 33433 -44057 -2221 30276 -112077 -188475 88078
19200 -184339 11616 -181662 69408 2301 -150619 143475 -167538 -162059 8422 -140812 -153973
19189 -153973 -118540 65883 90297 58079 -464840 154318 -443261 -55468 123373 -115302
$$ packed form
19270b28092e850A72541E9200a69271P1781b9827D59480A59520p1931k6475g8611
19258g0463o617A36030b8297A2448f9240G206b72869g6501l29662i3303A48801
19246A20962b48296a14845L0332A68343E1938N0489C530e9185a2422k4126q42
19235c7390E5191b16072c4299k71174a1079e230j31859A22a23205b0772k4286
19224d5058J8287B34008F9656H447J3493a86214e5906H0018a97667M9427A91971
19212A45915b51999f9708l5181B11052C3433d4057b221C0276a12077p6398H8078
19200a84339A1616a81662F9408B301a50619A43475a67538N479H422a40812j3161
19189a53973L5433F5883K4414l2218d64840A54318d43261e5468A23373a15302
$$ plain form
19178 -308014 -211096 -44076 38319 -301072 -302193 -125426 -326766 71496 135307 -114673 43202
19166 106941 156199 7562 111872 -204405 87628 -22414 -247274 -117736 167033 -111375
19155 -30727 -38109 16440 -225824 41456 130768 -229523 -75873 -246351 -93382 204476 -113406
19143 -284729 -265812 -189458 -273682 -211415 222835 -113687 -146546 -325988 -78880 -225928 145490
19131 -67582 16750 -54017 146511 -66098 60278 -100029 -282704 -327197 -367639 -183968 -62207
19119 -290653 -135560 -290713 -231824 -250901 282675 127162 -107849 -260261 -210245 481719
19108 -171467 89766 110357 188772 -217326 -275799 131935 127319 55645 127508 354992 84011
19096 21630 -51012 -369258 -99862 -198391 39917 -67798 112892 -110045 45012 -29368 -117392
$$ packed form
19178c08014R6918d4076C8319c01072j121a25426k01340G1496O3811a14673D3202
19166A06941M9258G562J04310b04405H7628b2414k24860a17736A67033a11375
19155c0727p382A6440b25824D1456Q9312b29523g5873j70478i3382B04476a13406
19143b84729J8917P6354q4224O2267B22835a13687l2859j79442g8880j47048A45490
19131f7582A6750e4017A46511f6098F0278a00029j82675m4493m0442J83671f2207
19119b90653a35560j55153N8889j9077B82675A27162a07849j52412N0016D81719
19108a71467H9766K0591P8415b17326n8473A31935m616E5645P1863K27484H4011
19096B1630e1012l18246i9862r8529C9917f7798A12892a10045D5012b9368q8024
$$ plain form
19085 -117392 -279062 -370756 -99067 228160 -84731 -238614 -270110 -279406 -219489 15104 -931
19073 -144180 -397676 111186 -342420 -87113 -124256 -472167 65669 186009 -109620 155257
19062 -37731 -340522 31926 19723 3763 -79775 -264797 8115 -273250 -208984 -127570 229084
19050 9523 -37572 -90724 -23529 -101126 150489 -398148 -58025 180873 -188508 -300550 213715
19038 -35477 -141397 -139960 -31589 -276562 -130776 117176 -52724 162206 290416 30947 116035
19027 116035 -99551 -204046 207868 -50384 -142391 135628 255513 -138020 -65348 287254
19016 -247068 40289 -317243 -96005 -403703 -334414 -130417 36620 -369645 -167410 322823
19005 -347689 -25200 -157426 -273301 106553 40471 153642 -172696 -269468 -62845 300443
$$ packed form
19085a17392j61670r1694i9067B28160h4731j53883l1496r296N9917A5104i31
19073a44180k53496A11186c42420h7113l7143l47911F5669J20340a09620A55257
19062c7731l02791C1926j2203C763g9775j85022H115b73250O4266Q1414B29084
19050I523c7572n3152b3529p7597A50489c98148e8025A80873a88508j12042B13715
19038c5477j05920J437c1589k44973a30776A17176e2724A62206J28210C0947Q5088
19027A16035i9551j04495B07868e0384r2007A35628J19885a38020f5348B87254
19016b47068D0289c17243i6005l07698O9289a30417C6620c69645a67410C22823
19005c47689b5200j32226j15875A06553D0471J13171a72696r6772f2845C00443
$$ plain form
18994 -255859 -436594 52598 -211673 209254 51760 77169 140744 4526 223656 89112 -64258
18982 -325123 -75547 202431 -161878 -51812 33331 154753 -243506 -111710 -13397 63679
18971 -125952 176766 -106743 -348903 44218 -31962 10817 -103468 164802 -250592 -223674
18961 -223674 283978 1665 -305485 144320 113134 -36738 37849 53881 151067 240325 352093
18950 352093 -410090 -364441 -22505 174114 -8361 46101 -56955 -194749 -5103 -85320 -64916
18939 -64916 -85040 -301247 -247330 -349444 -210367 -268073 -340521 -76865 -85946 210345 29574
18927 230591 -315060 -264634 -181781 -164654 -103584 -203946 -332842 -220085 26723 33904 -372602
18915 395802 93687 65311 -185148 322491 196112 -161707 -152871 -26840 280555 -9007 150678
$$ packed form
18994b55859j80735E2598b11673B09254E1760K5409O3575D526K19130H9112f4258
18982c25123g5547B02431a61878e1812C3331J21422b43506a11710a3397F3679
18971a25952A76766a06743k42160D4218c1962A0817a03468A64802b50592K6918
18961b23674B83978A665c05485A44320l1186c6738C7849J6032R7186Q9258J11768
18950C52093d10090M5649b2505A74114h361D6101e6955j37794e103q0217K0404
18939f4916k0124k16207N3917j02114J39077n7706p2448g6865r081B10345B9574
18927B30591c15060N0426Q2853J7127O1070j00362j28896J12757B6723P181c72602
18915C95802I3687k8376a85148C22491j26379a61707Q836b6840B80555i007A50678
$$ plain form
18903 64732 10167 -52298 22290 39114 -69410 -94428 -104829 142602 -154540 -75211 -146098
18892 -146098 81206 -79118 -288638 281953 -112842 -346898 131631 -156510 -91083 -364616
18882 -364616 18264 -515368 -206248 276672 -329993 -79043 343668 168771 -343578 136624
18871 -25602 200934 -32942 -185229 114987 -56642 41456 -46928 -279141 -256306 -142455 -156513
18860 -156513 68714 216065 3510 -235041 -74703 -16573 -42627 -63465 -68078 -14300 -101773
18849 -101773 42050 191664 -134126 288739 -43641 107832 -119943 178902 21255 -201998
18838 163866 -143183 -197262 -94279 -11199 -203912 -13913 31114 -170242 353687 -74976 2354
18826 -270771 186054 -164003 -45576 -69144 -17864 63031 -8804 250701 -293796 -125758 13751
$$ packed form
18903F4732A0167e2298B2290J6824f9410k5018j0401A42602a54540g5211p0887
18892a46098H1206g9118k09520B81953a12842k34056A31631a56510O5427k73533
18882c64616A8264e15368b06248B76672c29993g9043C43668A68771c43578A36624
18871b5602B00934c2942j52287A14987e6642D1456d6928k32213K2835J13851j4058
18860a56513F8714J47351C510b35041g4703a6573k6054k0838m613a4300q7473
18849a01773D2050J49614a34126B88739d3641A07832a19943A78902B1255b01998
18838A63866a43183n4079i4279a1199j92713a3913C1114a70242C53687g4976B354
18826b70771A86054a64003d5576k3568a7864F3031h804B50701b93796a25758A3751
$$ plain form
18814 -83225 164619 287329 81372 75055 -8114 -149898 80034 -16238 -182573 -205388 114370
18802 -143024 151235 -220516 243459 36785 245202 -335534 -267905 97731 225303 169765
18792 169765 -156949 38342 -204869 -78319 -30851 -89153 -126998 -230119 87363 35143 -467115
18780 -207363 -6929 -136008 92721 197203 82716 -156288 81021 58176 63170 -309016 -53282
18768 338855 110897 -25567 -207208 -145592 -220633 -114745 -550664 169275 36500 -171346
18757 -31031 28488 204115 -93739 -182519 -204091 32703 -266476 -181826 83967 312200 48959
18745 13802 4371 -14584 -147169 129127 -81134 67325 -124535 202405 43622 -192549 115351
18733 189098 -192387 -67070 -7465 43553 -177985 -65476 -58458 -69752 -80439 79762 -117499
$$ packed form
18814h3225A64619J22710H1372o317h114j41784H0034a6238j66335k2815A14370
18802a43024A51235b20516B43459C6785K08417c35534O7629I7731J27572n5538
18792A69765a56949C8342b04869g8319c0851n8302l7845j03121H7363C5143d67115
18780b07363f929j29079I2721J04482H2716a56288H1021k2845M994c09016e3282
18768C38855A10897b5567j81641O1616p5041J05888m35919A69275C6500a71346
18757c1031B8488J75627i3739q8780k1572C2703b66476Q4650H3967K28233D8959
18745A3802D371a4584j32585A29127h1134F7325a24535B02405D3622a92549A15351
18733A89098a92387f7070g465D3553a77985f5476P018j1294j0687G9762a17499
$$ plain form
18721 -103573 -380624 -60981 -103896 -235998 132397 9567 82700 -215556 -50084 -493068 210444
18709 197569 -251715 204303 23977 157481 27851 88854 115773 -12047 -249177 -4980 -136895
18698 -136895 32901 114731 -471936 -161768 205818 -219556 255239 -206260 209692 -115422
18687 -231272 46203 174683 57302 -146408 -280598 -213018 -224632 20400 85305 -6514 -201623
18676 -201623 68503 254270 226822 -112047 -249234 -61213 -57312 -100940 -59114 130571 -135310
18664 -304099 -121911 -196264 32857 -154668 -341333 251972 -130519 3245 32311 -83486 -133913
18653 -133913 -266074 -269754 166437 -324512 67728 -356101 -166652 74772 -381595 -135834
18642 110327 -890 5806 -253458 -135834 -57819 -373755 -159518 -103264 -173346 -19289 -191636
$$ packed form
18721a03573k77051f0981m2915j32102A32397I567P3133b15556e0084m42984B10444
18709A97569b51715B04303B3977J33504B7851O1003K6919a2047k37130d980j31915
18698a36895C2901Q1830d71936a61768B05818b19556B55239b06260B09692a15422
18687b31272D6203J28480E7302a46408j34190O7580j1614B0400O4905f514j95109
18676b01623F8503J85767k7448a12047j37187f1213L901m3628M1826A30571a35310
18664c04099a21911p4353C2857a54668j86665B51972a30519C245K9066h3486n0427
18653a33913j32161l680A66437c24512F7728c56101a66652G4772c81595a35834
18642A10327h90E806b53458J17624e7819l15936a59518N6254p0082a9289j72347
$$ plain form
18631 -191636 -79454 -67526 -75181 -114884 104481 152641 -141521 -207081 105548 -84930 -230849
18620 -230849 -59521 133792 96552 58224 -269916 57646 18420 -114471 -298421 -196911
18610 -196911 7195 -64214 24722 -30041 -158670 274145 69132 386663 247203 216229 -262136
18598 -241289 45611 86252 151198 107012 -193638 343288 -115149 -64169 -76514 56527 278939
18587 278939 55839 83844 -99558 10558 38485 107059 -219801 21200 153653 -88677 213760
18575 -130873 202688 -74519 -119473 -136969 -31022 -71448 -209184 -79499 -31844 -51905 -171725
18564 -171725 12971 -29866 45667 -226306 -33741 49679 -306595 54056 59742 247506 -31023
18552 -124294 -77845 50052 -236734 -1691 -70615 33252 -19379 -19144 -32290 30292 -211458 -76734
$$ packed form
18631a91636g9454J1928p655l9703A04481M8160a41521o5560A05548h4930j45919
18620b30849e9521A33792l7240l8328b69916E7646A8420a14471j83950J01510
18610a96911G195f4214B4722c0041j28629B74145F9132L17531j39460l0974b62136
18598b41289D5611M0641O4946m4186a93638C43288a15149N0980j2345E6527K22412
18587B78939E5839K8005i9558A0558K7927O8574b19801B1200J32453h8677B13760
18575a30873B02688g4519m4954j7496c1022m0426j37736g9499c1844k0061j19820
18564a71725A2971b9866D5667b26306c3741D9679c06595E4056N686J87764c1023
18552a24294M6449E0052b36734a691o8924C3252a9379K35j3146C0292b11458g6734
$$ plain form
18539 -145722 -10781 -132510 -5322 -76525 -30124 -3635 63025 287458 12730 136422 9104
18527 -52939 -144427 -340179 -272393 -175465 -78601 -129769 -231471 -231698 -47095 134951 42796
18515 -60024 -12828 -216776 183923 229293 95729 -246780 -238500 4677 385041 -90138 -29133
18503 -260618 -16647 6580 -256243 22495 122323 -69263 -164870 163746 -6357 -78687 12866
18491 147741 -247319 -294882 328716 -77860 -91951 -346118 -223692 -73693 11986 -79684 82216
18479 -249570 249805 -124855 83607 -228471 -199403 -177239 -7623 -164610 -58279 -252399 -6873
18467 213434 -195577 30288 148064 -5284 -330182 -37562 59532 -327984 -269955 -251239 19607
18455 26769 -121958 209738 -86343 -1068 -346036 -124758 7786 176394 10002 283791 -239771
$$ packed form
18539a45722a0781j21729e322p1203c0124c635F3025K24433A2730J23692I104
18527e2939r1488j95752O7786R6928g8601n1168j01702k27d7095A34951D2796
18515f0024a2828k03948A83923M5370I5729b46780Q280D677L80364i0138b9133
18503b60618a6647F580b56243B2495R9828f9263r5607A63746f357p2330A2866
18491A47741b47319m7563C28716g7860j4091k54167J22426g3693A1986g9684H2216
18479b49570B49805a24855H3607b28471K9068K2164g623j56987e8279j94120f873
18467B13434a95577C0288J17776e284l24898c7562E9532c27984N8029J8716A9607
18455B6769a21958B09738h6343a068l44968a24758G786J68608A0002K73789b39771
$$ plain form
18443 -308145 -101610 -22298 43881 -24602 -373502 68627 50434 -52795 -431513 132204 -247696
18431 111504 335730 189631 -23450 77904 101976 -415336 -442174 -201350 -111394 292176
18420 155719 -38401 253462 -41566 -38126 42292 -31817 -19148 -562064 -1619 49892 -324416
18408 -148001 -86278 -25515 -27930 -320041 84334 -71730 -33716 -11990 56576 64851 -95658 181342
18395 -191251 -357071 119246 158153 -137682 145755 -80624 -68546 -218427 108493 149918
18385 149918 84604 -91809 -57117 -161511 48098 101339 -341508 -73131 -155176 -32571 -12613
18373 113772 -218142 -103421 102688 -280245 106240 108313 -262018 176467 147352 113019
18363 113019 294142 -9383 -13065 -141066 59605 118245 222103 -132582 182131 -85350 -26679
$$ packed form
18443c08145a01610b2298D3881b4602l48900F8627j8193e2795l78718A32204b47696
18431A11504K24226j46099b3450G7904K4072d15336k6838b01350Q9956B92176
18420A55719c8401B53462d1566L440D2292c1817J2669n42916a619D9892c24416
18408a48001O1723b5515k415k92111H4334g1730c3716a1990E6576Q275i5658A81342
18395a91251j65820A19246L8907a37682A45755h0624J2078j49881A08493M1425
18385A49918o5314i1809L4692j04394D8098N3241c41508g3131q2045c2571a2613
18373A13772b18142a03421A02688b80245A06240K073b62018A76467k9115l4333
18363A13019J81123i383l682j28001E9605N8640J03858a32582A82131h5350b6679
$$ plain form
18351 -97766 73446 125435 -93510 -349032 13376 177674 -41871 112371 -9884 -29226 164294
18339 -133171 11605 147200 11713 70311 -38963 -351530 -33517 -382465 -175622 824 52163
18328 52163 -252131 -206062 -5734 -279502 36209 -203479 -269001 -77769 235284 30412 -19531
18316 -98020 133374 212999 -179679 163217 -515789 -157273 -358639 169247 122562 72258
18306 72258 40770 -68003 -92075 -147297 -273186 -135531 -71012 253928 -89422 -55430 -156619
18295 -156619 -400457 -13907 326953 115320 208351 -38426 73856 12857 131618 275506
18285 275506 -13198 75220 -165773 98468 164521 26726 254440 -114412 -150374 62088 88896
18274 88896 34954 182473 -124998 -61669 252618 35701 822 -58652 -30720 -241636 -159690
$$ packed form
18351i7766G3446N1989i3510k55522A3376J64298d1871A12371i884j9342A64294
18339a33171A1605J35595A1713N8598c8963l12567c3517l48948a75622H24N1339
18328E2163b52131M6069e734k73768C6209b03479o5522g7769B35284C0412a9531
18316i8020A33374P9625a79679A63217e15789a57273k01366A69247m6685n0304
18306G2258l1488f8003k4072n5222j25889a35531O4519B53928h9422L3992j01189
18295a56619k43838a3907C26953A15320R3031c8426G3856A2857J18761J43888
18285B75506a3198G5220a65773I8468O6053B6726K27714a14412l5962F2088K6808
18274H8896C4954J47519a24998f1669B52618C5701H22e8652K7932k10916Q1946
$$ plain form
18263 -159690 -117004 -124127 189461 -123971 -64936 -125800 139721 -309255 -118534 172855
18252 -496551 -411313 -356923 -93446 78925 104983 -275860 32085 89039 -204322 -141783 -69011
18240 31173 148326 -186031 163910 -117186 -39741 21713 198670 -73761 161972 120585
18230 120585 53959 -219500 -48723 108764 17663 77793 -41842 -172964 -239 -111557 130364
18218 -103764 -456766 -272895 61798 31608 -251843 -189074 207338 -96564 -52281 345992
18207 -114115 -115978 -117596 -78667 262678 125076 -153532 -190555 -141323 -3275 164324 -602 -204036
18195 -204036 -170349 -46976 76279 -103047 20202 -149540 173364 -157884 232189 -292395
18184 142354 81326 -185578 -64001 191512 -181980 -52074 -58238 147384 106900 6479 -112443
$$ packed form
18263a59690M2686p123A89461a23971N9035o0864A39721c09255a18534A72855
18252d96551Q5238N4390i3446G8925K6058b75860C2085N6954b04322O2539f9011
18240C1173J17153a86031A63910a17186c9741B1713J76957g3761A61972m1387
18230A20585E3959b19500d8723A08764A7663O0130d1842j31122b39j11318A30364
18218a03764l53002J83871F1798l0190b51843O2769B07338i6564M4283C45992
18207a14115j863j618L8929B62678A25076a53532l7023M9232c275A64324f02k03434
18195b04036L3687d6976G6279a03047B0202a49540A73364a57884B32189b92395
18184A42354o1028a85578f4001A91512a81980e2074o164A47384m0484F479a12443
$$ plain form
18172 -111652 31517 163861 -179848 -281537 -324701 -16679 -66746 -141648 -64916 110719 -115458
18160 158988 170781 -365141 8946 173700 537598 178057 -82186 -272219 296625 -177521
18149 -222493 -218256 -31076 152829 194970 -138168 -121440 -339305 -48940 -27432 -126162 -203504
18138 -203504 -14018 204191 -119392 42548 11693 -150670 -285735 23494 -154399 40383
18127 -27472 -112207 -102885 -42831 -259829 2440 46224 34129 -52949 -112987 -9141 170561 -128708
18114 -145162 -374516 80424 45154 14955 -474084 -369021 63971 -221868 -54866 216215
18103 80400 120534 -201528 -199723 18953 -230682 -54189 92268 224349 9314 4450 187878
18092 187878 -201675 -276553 240170 57259 348184 -90239 232066 -84155 -149675 -18525 269202
$$ packed form
18172a11652C1517J32344a79848j01689m3164a6679n0067p4902f4916A10719a15458
18160A58988J1793c65141H946J64754L63898A78057h2186j90033B96625a77521
18149b22493M237c1076A52829M2141a38168J6728k17865d8940K1508r8730p7342
18138b03504a4018B04191a19392D2548A1693a50670j35065B3494a54399D0383
18127b7472q4735R322d2831k16998B440M3784j2095e2949o0038i141A70561a28708
18114a45162k29354H0424l5270A4955d74084J05063F3971b21868e4866B16215
18103H0400M0134b01528J805A8953b30682e4189I2268J32081I314D450J83428
18092A87878b01675p4878B40170E7259K90925i0239B32066h4155o5520a8525B69202
$$ plain form
18080 97426 -58362 -256385 124509 7265 295723 102529 158531 -102825 323339 -54784 -112247
18069 -112247 287642 -130964 -506636 -12611 -474173 121606 244012 146951 -418076 520269
18058 -176528 125959 364252 245252 86377 43321 168513 78775 -11466 -43352 -265067
18048 -265067 -510607 -168381 249036 -267905 -143280 -310001 -69069 -104986 83908 -247430
18037 233163 -124706 -185991 -193691 -16877 -150031 -30833 -260885 -198731 22324 -123408 6229
18025 -43936 -308858 155718 -133326 207782 -132394 -78180 -297821 -125520 54471 818 -390762
18013 -227371 -182830 -118814 -163938 -163795 -41924 -290532 -266097 -236487 -110499 -227281 -280826
18002 -280826 49051 -29501 4456 27315 95916 -125824 68203 12511 -268480 64467 -31824
$$ packed form
18080I7426e8362j98023A24509G265K88458A02529N6002a02825C23339e4784n7463
18069a12247B87642a30964l75672a2611m61562A21606J22406r7061d18076E20269
18058a76528A25959K38293j19000H6377m3056J25192G8775a1466l1886k21715
18048b65067k45540a68381B49036b67905J24625j66721f9069l5917H3908b47430
18037B33163a24706o1285p700a6877j33154c0833k30052O2154B2324a23408F229
18025d3936k64922A55718a33326B07782a32394N4214k19641a25520E4471H18c90762
18013b27371M4541O4016m5124J43d1924k48608K4435K9610a10499j16782n3545
18002b80826D9051b9501D456K2859O8601a25824F8203A2511b68480F4467c1824
$$ plain form
17990 -92033 -361616 380287 -197559 42979 84729 14096 459926 -65667 23923 333427 -134182
17978 -78106 11100 -2623 -162532 -125088 -134820 -346530 44901 -188215 32274 -329467 320955
17966 56696 291294 11965 115121 -18583 155558 -130718 9070 8465 13106 -159722 337799
17954 230937 -258721 19550 -66102 -55457 -415111 -117559 -113211 8358 -76816 90422 -9372
17942 126176 -77937 -95799 143295 297823 184089 -163194 -157107 -265704 -121866 -3949 139004
17930 -182675 -148894 -16016 -155433 -6325 134673 154892 203420 119301 19891 -238626 96460
17918 234 -141212 177550 377013 22394 27378 17592 16491 -275339 -56870 -95948 -104868 18977
17905 136281 295297 -14817 163854 -105886 27053 -198354 -49274 -269716 -452540 14708
$$ packed form
17990i2033k69583C80287a97559D2979M1750A4096M45830f5667B3923L09504a34182
17978g8106A1100b623j59909L7444r732k11710D4901a88215C2274c29467C20955
17966E6696K34598A1965J03156a8583A55558a30718I070o05M641a59722C37799
17954B30937b58721A9550f6102J0645l59654a17559M348H358g6816I0422i372
17942A26176g7937j7862A43295J54528j13734a63194O087j08597a21866c949A39004
17930a82675L3781a6016j39417f325A34673K0219M8528q4119A9891b38626I6460
17918B34a41212A77550J99463B2394M984r786j101b75339e6870l9078q920A8977
17905A36281J59016a4817A63854a05886B7053a98354d9274k20442j82824A4708
$$ plain form
17894 170865 4463 148595 -181428 210376 -158344 -53391 -98302 69548 -42428 186679 -141071
17882 19279 -444099 161500 -191213 -62177 -347015 -223860 174081 -87155 126100 106155
17872 106155 -32726 -347149 212760 44486 77557 -32995 32606 -275975 -240607 220372 -37422
17860 -123223 67867 35981 28449 3883 -41452 -169 65287 127552 -96284 -257809 -452296 487
17847 -274823 -22060 212781 56255 60033 31100 22935 160036 154951 -384622 -55512 98598
17835 -178096 -93 -143201 -74232 326176 -146014 -269231 37190 111833 -189717 268468 -181480
17823 -61028 -188034 337855 -486568 -247752 -97059 -319002 -225570 157274 -116202 -100657
17813 -100657 153743 -51177 -217100 186449 40242 38362 -144162 -140231 43821 -336758 -23148
$$ packed form
17894A70865D463J44132a81428B10376a58344e3391m4911F9548d2428A86679a41071
17882A9279d44099A61500a91213f2177k84838J23155A74081h7155A26100j9945
17872A06155c2726l14423B12760D4486L3071c2995C2606b75975L5368B20372c7422
17860a23223F7867l1886p532C883d1452a69F5287O2265i6284j61525j94487D87
17847b74823b2060B12781E6255L778k8933q165J37101n085c84622e5512I8598
17835a78096i3j43108O8969C26176a46014j23217C7190P4643a89717B68468a81480
17823f1028j27006C37855d86568K38816i7059k21943R3432A57274a16202J5545
17813a00657A53743e1177j65923A86449D0242j880a44162L931D3821c36758b3148
$$ plain form
17801 -21719 -206873 62088 -42532 24531 -82207 85561 95921 -61704 -105523 132287 20516
17789 22356 -78055 -6891 51352 298071 282098 32532 13091 -242816 80281 59339 -387540
17777 48689 41184 175770 -264572 154434 -109939 -119500 -41461 1150 34362 108205 248453
17766 248453 -8625 13678 125281 10251 1696 373369 228866 152975 22103 -239171 89553
17754 -108911 -7035 105358 42930 55831 116235 -154250 -8938 -206838 311541 -47986 -307352
17743 -307352 -56014 -66697 -10676 175344 -51239 136048 41896 -60329 -36587 -146065 195476
17731 50364 92492 242177 254932 -105161 -109357 68050 -3006 -157460 188591 220038 450475
17720 450475 112909 155154 158551 -132023 119415 130209 177847 356006 315161 32333 -249059
$$ packed form
17801b1719j85154F2088d2532B4531h2207H5561J0360f1704m3819A32287B0516
17789B2356g8055f891E1352K46719j5973C2532A3091b42816H0281k0942c87540
17777D8689p505J34586b64572A54434a09939r561d1461A150L3212P3843J40248
17766B48453h625A3678J11603A0251A696L71673j44503p5891B2103b39171H9553
17754a08911g035A05358D2930J2901O0404a54250h938j97900C11541d7986k59366
17743c07352e6014j0683a0676A75344e1239A36048D1896f0329K3742j09478A95476
17731E0364M2128J49685J2755a05161m196F8050c006j54454A88591L1447K30437
17720D50475A12909M2245L397a32023A19415J0794M7638J78159m0845C2333b49059
$$ plain form
17708 -41324 29022 66744 79855 164963 263509 -8054 61737 141162 -77911 64392 -39275 259544
17695 -54208 -64132 -128454 -122226 119652 195688 148414 -36877 122419 247407 23427 236041
17684 236041 -22833 -51710 174056 111821 238523 -26725 235249 -225868 135972 22176
17673 -39808 185590 177126 139174 -261211 -45023 -192908 193360 118799 -73369 98763 -142154
17661 -188011 -19754 -83828 238485 35519 73942 89785 -109749 205831 194519 -3165 -69361
17650 -69361 71668 -155558 -67434 105956 -280302 106343 151777 -191663 -21116 -233667
17640 -233667 -360630 6652 126983 -3985 37601 -196252 116830 -543513 46591 -249003 51684
17628 285064 158314 114139 371403 56454 24432 -86397 325893 382287 -218053 -87795 -163209
$$ packed form
17708d1324B9022L7722J3111Q5108R8546h054F1737P9425g7911F4392c9275B59544
17695e4208r924o4322O228A19652P6036m7274c6877A22419J24988B3427K12614
17684B36041b2833k8877A74056o2235J26702b6725B35249b25868A35972B2176
17673c9808A85590q464l7952b61211d5023j47885A93360p4561g3369I8763a42154
17661a88011a9754o4074B38485C5519L8423J5843a09749B05831j1312c165o6196
17650f9361G1668a55558f7434A05956b80302A06343M5434a91663b1116k12551
17640b33667j26963F652J20331c985C7601a96252A16830e43513D6591b49003E1684
17628B85064j26750m4175K57264E6454B4432h6397C25893N6394b18053h7795p5414
$$ plain form
17617 -163209 -183594 -18902 8831 -168213 146985 -110306 -126554 -45068 226469 -194290 -379310
17606 -379310 -168839 346497 193346 4229 -95594 -257472 119105 50521 49814 37137 88162
17595 88162 -124058 58692 -215326 -141079 -7465 -63004 -150606 262538 104970 -60617 -123677
17584 -123677 -278467 33462 249498 164167 -104306 -8591 -132792 50352 -353000 127367
17573 342976 -29845 -17686 324002 167305 183344 -13400 -237359 138825 42947 -243119
17562 76846 13878 163861 -11747 190100 -323343 357417 208453 -64733 -211478 -4744 -170847
17551 -170847 -192503 -124590 -24831 9419 171905 89154 28107 -6626 249054 112283 -184788
17539 396949 94501 161485 -17521 -213327 86336 -233111 -100379 5491 291165 61348 -127369
$$ packed form
17617a63209k0385a8902H831a68213A46985a10306j6248d5068B26469a94290j85020
17606c79310a68839C46497j53151D229i5594j61878A19105E0521p07j2677N1025
17595H8162a24058E8692b15326P4247g465n5539q7602B62538A04970f0617o3060
17584a23677j54790C3462K16036q5331a04306h591j24201E0352c53000A27367
17573C42976b9845J2159C24002j56697J6039a3400k23959A38825D2947b43119
17562G6846A3878J49983a1747A90100c23343C57417j48964f4733j46745d744j66103
17551a70847k1656O7913b4831I419J62486q2751B8107f626B49054A12283a84788
17539C96949I4501O6984a7521j95806H6336b33111a00379E491K85674F1348a27369
$$ plain form
17527 245986 366841 -120177 -133314 257675 -79143 89921 67746 507592 -6935 446716 413627
17516 413627 78516 124696 51032 293213 -207960 98371 89363 -245925 -66569 -214331 63918
17504 301895 36480 174727 -32287 -43415 115036 61473 -211151 -74676 -70695 16536 223318
17493 223318 -87976 98687 -339743 -216956 3176 -2885 259769 306812 426606 -116180 366745
17481 128068 79364 -248446 317286 -199328 17801 -7568 20950 227191 36821 177560 -84666
17469 104722 317030 -36408 302857 548711 2058 240426 2000 -116712 320999 26991 412359
17458 412359 133422 -357803 258491 263410 441233 -229500 83881 -41764 605604 -114136
17447 426654 275340 334001 454351 336299 310892 414007 -40932 222211 180373 21708
$$ packed form
17527B45986J20855a20177j3137B57675g9143H9921k2175M39846f935D46716l3089
17516D13627G8516M6180E1032K42181b07960I8371r008b45925f6569j47762F3918
17504C01895C6480J38247c2287j1128A15036n3563b11151g4676L981A6536K06782
17493B23318h7976I8687c39743J22787C176b885B59769M7043J19794a16180C66745
17481A28068m8704b48446C17286a99328A7801g568B0950K06241C6821J40739h4666
17469A04722K12308c6408C02857K45854B058K38368B000a16712C20999B6991L85368
17458D12359A33422c57803B58491M919J77823b29500H3881d1764F05604a14136
17447D26654j51314N8661J20350j18052k5407J03115d0932B22211m1838B1708
$$ plain form
17436 139915 377004 -81918 299393 448858 413695 450128 229158 38251 64109 188279
17426 188279 26406 187055 466018 285443 118979 352424 9823 401820 261319 603922
17416 603922 250596 386277 550872 190426 -16035 -46623 32070 108909 217681 511126
17406 511126 140587 157208 136927 -159994 287520 61092 -200108 158190 144088 190920
17396 190920 40144 104364 112969 237326 324507 350793 410399 142761 -56086 -90390 84745
17384 99593 387692 152457 396943 97072 95318 143798 70850 218254 262594 216177 289340
17373 289340 125219 348644 -60835 114357 221431 259897 -29035 79476 -266500 127959
17362 99749 390848 -236738 -22186 89550 -25364 132645 354285 -114068 150762 344495
$$ packed form
17436A39915K37089h1918B99393J49465l5163L6433k20970C8251K5858J24170
17426A88279B6406J60649K78963j80575A18979K33445I823L91997j40501L42603
17416F03922B50596J35681J64595A90426a6035l0588C2070P6839J08772K93445
17406E11126A40587J6621k0281a59994B87520F1092b00108A58190j4102M6832
17396A90920D0144O4220Q605J24357Q7181K6286N9606A42761e6086l4304H4745
17384I9593K88099A52457K44486I7072j754M8480G0850J47404M4340m6417P3163
17373B89340A25219K23425f0835A14357J07074L8466b9035G9476b66500A27959
17362I9749K91099b36738b2186H9550b5364A32645K21640a14068A50762J93733
$$ plain form
17352 344495 93150 -25397 -314983 257159 -11916 -120034 560916 148199 142696 317851
17342 317851 6077 35180 120224 355287 -51673 24059 209524 82901 173701 54687 276087
17331 276087 99683 313517 124360 -71834 497263 219521 259628 -130216 -47125 39924
17320 -228923 162651 487613 16945 140428 -75272 3714 168740 100290 -47933 164235 -54945
17308 181062 194141 309594 458027 348699 553044 198517 192271 404653 16338 273979
17298 273979 -332928 197677 33927 68492 151002 46947 -24312 -51066 83504 152007 143869
17287 143869 57651 194935 141127 288275 177614 -79434 117655 189363 -5346 348869 209237
17276 209237 204652 67117 133884 168106 200551 380559 13297 463830 143533 202790 373834
$$ packed form
17352C44495I3150b5397k89586B57159a1916j08118E60916A48199n503J75155
17342C17851F077K9103Q5044K35063e1673B4059J85465H2901R0800E4687K21400
17331B76087I9683K13834A24360g1834D97263B19521M0107a30216d7125C9924
17320b28923A62651L24962A6945J23483g5272C714J65026o8450d7933A64235e4945
17308A81062J3079J15453J48433j09328K04345A98517o246K12382A6338K57641
17298B73979c32928A97677C3927L4565Q2510D6947b4312k6754H3504O8503q138
17287A43869E7651J37284n3808J47148j10661g9434A17655P1708e346C48869j39632
17276B09237m585F7117O6767L4222L2445J80008A3297M50533A43533N9257J71044
$$ plain form
17265 373834 404187 195313 -30111 100437 327279 21636 9292 -157477 308720 608117
17255 608117 -21549 446307 245220 280947 -114616 42175 185403 278209 486791 418695
17245 418695 250270 4651 425679 42191 328128 220972 323615 179762 -122169 189717
17234 -105224 179042 -93211 239768 95891 415303 357163 210529 40306 263373 451662
17224 451662 259218 427141 441608 264110 -26172 310381 342974 433306 332955 345741
17214 345741 75475 229801 420139 395908 624772 48345 -166254 337013 498323 384569
17204 384569 564316 194059 -60138 345392 -166446 104319 68898 450469 174556 367229
17194 367229 160965 239222 59201 194420 60799 294378 406017 29286 157458 487932
$$ packed form
17265C73834L0353A95313c0111A00437K26842B1636I292a57477C08720K99397
17255F08117b1549D46307k01087L5727a14616D2175J43228R2806K08582o8096
17245D18695j68425D651M21028D2191K85937j07156J02643j43853a22169A89717
17234a05224A79042i3211B39768I5891L19412n8140j46634D0306K23067J88289
17224D51662j92444J67923J4467j77498b6172C10381L2593R0332j00351J2786
17214C45741G5475J54326J90338k4231K28864D8345a66254C37013J61310j13754
17204C84569J79747A94059f0138C45392a66446A04319l5421L81571A74556J92673
17194C67229A60965P8257E9201J35219F0799K33579J11639B9286J28172L30474
$$ plain form
17184 487932 146391 170663 478287 646074 507074 95658 277064 196034 257068 637749
17174 637749 142345 593118 332044 427775 303200 531612 368156 309369 -49084 331004
17163 -93159 155194 280104 302927 279524 214391 392799 191540 228002 111442 -229557
17152 88649 376689 123895 67792 -33163 587390 582233 509219 613735 436253 161896 463075
17141 463075 119376 312615 426351 370198 438005 107005 66839 295330 146998 145946
17131 145946 309898 260102 457831 242989 461304 -27910 417502 372955 480092 145676
17120 375889 209312 626976 234169 246002 472909 172688 487584 412935 449817 630791
17110 630791 318293 403886 446979 469647 81524 515373 780958 267573 650143 268795
$$ packed form
17184D87932A46391K4272L07624J67787j39000I5658J81406q1030O1034L80681
17174F37749A42345M50773k61074R5731j24575K28412j63456n8787d9084C31004
17163i3159A55194J24910K2823k3403o5133J78408A91540L6462A11442b29557
17152H8649K88040A23895n6103c3163E87390n157p3014J04516j77482A61896L01179
17141D63075A19376J93239J13736n6153O7807A07005m0166K28491A46998j052
17131A45946J63952m9796J97729k14842K18315b7910D17502m4547J07137A45676
17120C75889j66577M17664B34169J1833K26907A72688L14896p4649L6882J80974
17110F30791l12498Q5593M3093K2668H1524M33849K65585B67573L82570B68795
$$ plain form
17099 614092 395843 367664 387072 445354 502773 442078 335788 -49526 301237 680678 321251
17087 370745 430632 365856 224319 139367 379794 487775 277316 492089 311480 596485
17077 596485 381645 631908 262801 627693 840 356140 718573 283763 513920 725183
17067 725183 574117 703531 382921 558971 400960 347976 375777 624830 443701 612184
17057 612184 684140 718006 737407 485182 496333 763510 692936 525158 358217 706739
17047 706739 716485 529304 310979 361311 691074 683639 497867 230162 738027 518854
17037 518854 682493 663246 436227 550460 793668 628984 349082 614917 174963 517188
17027 517188 606801 710740 735945 734646 307680 619612 546427 987909 476256 666647
$$ packed form
17099F14092k18249k8179J9408N8282N7419o0695j06290d9526C01237L79441C21251
17087C70745N9887o4776j41537q4952K40427J07981k10459K14773j80609K85005
17077E96485k14840K50263B62801L64892H40L55300L62433B83763K30157K11263
17067G25183j51066J29414l20610J76050j58011n2984K7801K49053j81129J68483
17057F12184P1956L3866J9401k52225J1151K67177p0574j67778j66941L48522
17047G06739R746j87181k18325N0332L29763p435j85772B30162N07865k19173
17037E18854J63639j9247k27019J14233K43208j64684k79902K65835A74963L42225
17027E17188Q9613J03939K5205j299C07680L11932p3185M41482D76256J90391
$$ plain form
17017 666647 709584 679132 540793 818225 460012 872404 733101 522811 741936 670574
17007 670574 917375 925769 778459 813580 1062384 675120 677887 984374 791332 499531
16997 499531 790658 856230 616932 634902 1125237 480122 606499 943558 892220 636033
16987 636033 750210 893114 1240210 786718 624761 990287 942126 1047728 1017740 930826
16977 930826 711278 1019339 924456 719351 915397 864421 1006184 857290 1003548 1125953
16967 1125953 769901 1003787 967955 1021549 1184341 955543 1064372 840049 1155597 1063189
16957 1063189 969340 947946 799551 943415 1088006 1491780 1108984 1007438 943708 1150147
16947 1150147 1237353 1063110 1069428 1238024 1158816 1412032 1184741 1055801 1410969 1262790
$$ packed form
17017F66647M2937l0452j38339K77432l58213M12392j39303k10290K19125p1362
17007F70574K46801Q394j47310L5121K48804l87264K767L06487j93042k91801
16997D99531K91127O5572k39298J7970M90335D80122J26377L37059n1338k56187
16987F36033J14177J42904L47096m53492j61957L65526m8161J05602k9988q6914
16977I30826k19548L08061r4883k05105J96046n0976J41763j48894J46258J22405
16967A125953l56052K33886l5832N3594J62792k28798J08829k24323L15548r2408
16957A063189r3849k1394j48395J43864J44591M03774l82796j01546o3730K06439
16947A150147Q7206j74243O318J68596p9208K53216k27291j28940L55168j48179
$$ plain form
16937 1262790 1269013 1002491 1090530 1158328 1225996 1428179 1663022 1331591 1466589 1158105
16927 1158105 1311462 1338029 1179720 1419089 1485166 1605241 1541572 1754790 1497852 1800714
16917 1800714 1514987 1663870 1567090 1573556 1526301 1346862 1764986 1755393 1690500 1814939 1865851
16906 1865851 1991562 2047178 1894229 1991527 1944819 1862660 1822594 1785441 1917826 2117364
16896 2117364 1779703 2039756 1712033 1618198 2330704 2310611 2275239 1912378 2158983 2245313
16886 2245313 2212300 1777153 2135128 1984810 2081508 2432250 1893039 2290614 2579488 2291872
16876 2291872 2371743 2532716 2527783 2661508 2638969 2567734 2403475 2797893 2848986 2589488
16866 2589488 2890402 2696559 2814747 2788236 2870569 2758014 2935311 3198822 3125070 3061520
$$ packed form
16937A262790O223k66522Q8039O7798O7668K02183K34843l31431J34998l08484
16927A158105J53357K6567j58309K39369O6077J20075o3669K13218k56938L02862
16917A800714k85727J48883r6780O466m7255j79439M18124r593o4893J24439N0912
16906A865851J25711N5616j52949R7298m6708q2159m0066l7153J32385J99538
16896B117364l37661K60053l27723r3835P12506k0093l5372l62861K46605Q6330
16886B245313l3013m35147L57975j50318R6698L50742n39211L97575K88874k87616
16876B291872P9871J60973m933J33725k2539p1235j64259L94418N1093k59498
16866B589488L00914j93843J18188k6511Q2333j12555J77297K63511p3752o3550
$$ plain form
16856 3061520 3386910 2970443 3263284 3298902 3572010 3366345 3517690 3486540 3764367 3700007
16846 3700007 3688378 3680157 3926575 4020461 3873491 3667361 4118947 3966645 3906970 4003294
16836 4003294 4305248 4458948 4607399 4499931 4663524 4744682 4486445 4845922 4645376 5028340
16826 5028340 5247000 5187465 4907523 5319821 5238415 5683137 5828018 5494125 5643958 5829343
16816 5829343 6111571 6001079 6271015 6713263 6609472 6627972 6659705 6992018 7191508 7470881
16806 7470881 7279211 7269753 7876881 7751643 8321630 8299714 8518774 8513691 8608486 8995605
16796 8995605 9351660 9434245 9674610 9677422 10207919 10353047 10659020 10853638 11305814 11604786
16786 11604786 11583678 12313399 12356769 12903015 13038647 13564512 14084710 14812089 14931433 15469676
$$ packed form
16856C061520L25390m16467K92841L5618K73108k05665J51345l1150K77827o4360
16846C700007j1629q221K46418R3886j46970k06130M51586j52302n9675R6324
16836D003294L01954J53700J48451j07468J63593Q1158k58237L59477k00546L82964
16826E028340K18660n9535k79942M12298q1406M44722J44881l33893J49833J85385
16816E829343K82228j10492K69936M42248j03791J8500L1733L32313J99490K79373
16806G470881j91670r458O07128j25238N69987k1916K19060n083R4795L87119
16796H995605L56055Q2585K40365K812N30497J45128L05973J94618M52176K98972
16786A1604786k1108P29721M3370N46246J35632N25865N20198P27379J19344N38243
$$ plain form
16776 15469676 15578750 16293681 16711856 17208393 17596599 18782645 19353948 19967790 20345584
16767 20345584 21037581 21936653 22682191 23450547 24379667 25397504 26278955 27374918 28277951
16758 28277951 29756134 30892660 32090620 33685234 34898103 36480099 38015628 39544444
16750 39544444 41748432 43608483 45998238 48269295 50201033 52823290 55588014 58885467
16742 58885467 61924993 65426417 68657771 72448284 76304287 80754655 85183757 90132627
16734 90132627 95203883 99868996 105480383 111462460 117514907 123957270 130262796 136763410
16726 136763410 143202281 149354167 155820033 161989390 167264605 172016492 176603132 179803647
16718 179803647 181728221 183654547 183682102 183058525 181005389 178623904 174866150 170498343
$$ packed form
16776A5469676J09074P14931M18175M96537L88206J186046N71303O13842L77794
16767B0345584O91997Q99072P45538P68356R29120J017837Q81451J095963R03033
16758B8277951J478183J136526J197960J594614J212869J581996J535529J528816
16750C9544444K203988J860051K389755K271057J931738K622257K764724L297453
16742E8885467L039526L501424L231354L790513L856003M450368M429102M948870
16734I0132627N071256M665113N611387N982077O052447O442363O305526O500614
16726A36763410O438871O151886O465866O169357N275215M751887M586640L200515
16718A79803647J924574J926326K7555o23577k053136k381485l757754m367807
$$ plain form
16710 170498343 165250694 159438588 153294882 146877794 140310577 133439421 127072471 120972182
16702 120972182 114581890 108022501 102403021 97116287 91752624 86643419 81950171 77895452
16694 77895452 73471392 69307231 65529663 62388540 59104263 56088760 53029417 50613486
16686 50613486 48024052 45680856 43807835 41748178 39820706 37893684 36085841 34743817
16678 34743817 32799835 31832180 30449062 29059319 27989910 27103039 26062716 24689636
16670 24689636 23698903 22906864 21996875 21290923 20423050 20031082 19362176 18506627 18059167
16661 18059167 17032828 16468227 16014388 15546847 15033451 14647072 14054455 13848076 13332769
16652 13332769 12835410 12857905 12119958 11871911 11371410 11318208 10868879 10421962 10081224 10098895
$$ packed form
16710A70498343n247649n812106o143706o417088o567217o871156o366950o100289
16702A20972182o390292o559389n619480n286734n363663n109205m693248m054719
16694G7895452m424060m164161l777568l141123l284277l015503l059343k415931
16686E0613486k589434k343196j873021k059657j927472j927022j807843j342024
16678C4743817j943982r67655j383118j389743j069409q86871j040323j373080
16670B4689636r90733p92039r09989p05952q67873l91968o68906q55549m47460
16661A8059167j026339n64601m53839m67541n13396l86379n92617k06379n15307
16652A3332769m97359K2495p37947k48047n00501n3202m49329m46917l40738J7671
$$ plain form
16642 10098895 9851747 9367634 8994471 8955863 8641136 9064715 8360724 7945467 7930720 7684349
16632 7684349 7256438 7446327 7135464 6684774 7013689 6421432 6280075 6308229 6163433 6171534
16622 6171534 5952543 6279969 5827309 5382361 5431595 5547917 5245558 5078191 5127016 4930184
16612 4930184 5182412 5108920 4603558 4245158 4562426 4142495 4240010 4477729 4241337 3979312
16602 3979312 4351500 4157028 3911792 3994513 3807280 3654052 3472514 3393236 3637541 3470568
16592 3470568 3585116 3251217 3224216 3350235 3016004 2921101 3326026 3101189 2794607 2620802
16582 2620802 2824910 2552922 2704407 2519279 2769000 2499229 2913879 2385684 2299790 2341198
16572 2341198 2284351 2246380 2155574 2567728 2196049 2469952 2446296 2482185 2327463 2325672 2493900
$$ packed form
16642A0098895k47148m84113l73163l8608l14727M23579p03991m15257j4747k46371
16632G684349m27911J89889l10863m50690L28915n92257j41357K8154j44796Q101
16622F171534k18991L27426m52660m44948M9234J16322l02359j67367M8825j96832
16612D930184K52228p3492n05362l58400L17268m19931R7515K37719k36392k62025
16602C979312L72188j94472k45236Q2721j87233j53228j81538p9278K44305j66973
16592C470568J14548l33899k7001J26019l34231r4903M04925k24837l06582j73805
16582B620802K04108k71988J51485j85128K49721k69771M14650n28195q5894M1408
16572B341198n6847l7971r0806M12154l71679K73903k3656L5889j54722j791J68228
$$ plain form
16561 2493900 2249974 2072495 2236427 1786323 1933342 2033579 1881865 1743957 1661225 1826758
16551 1826758 1782550 1745577 1672448 1564849 1637053 1514202 1841371 1808300 1849527 1527695
16541 1527695 1755178 1674673 1806849 1493350 1578171 1625636 1558268 1693293 1889858 1323691
16531 1323691 1388988 1184959 1374292 1062560 1632044 1363513 1398093 1448540 1109612 1361313
16521 1361313 1538264 1201579 1123333 1748323 1134751 1301706 1370088 1018536 1079338 1454593
16511 1454593 1115677 1451844 1510340 759991 1171185 774380 1128761 754792 1208185 731859
16501 731859 1099985 1121671 1350280 987106 453282 1098760 1108203 1127644 1116852 1047929 1080277
16490 1080277 1141118 1654071 635985 610337 957461 795240 853757 705853 965909 875728
$$ packed form
16561B493900k43926j77479J63932m50104J47019J00237j51714j37908q2732J65533
16551A826758m4208l6973p3129j07599P2204j22851L27169l3071M1227l21832
16541A527695K27483q0505J32176l13499Q4821M7465o7368J35025J96565n66167
16531A323691O5297k04029J89333l11732N69484k68531L4580N0447l38928K51701
16521A361313J76951l36685p8246O24990o13572J66955O8382l51552O0802L75255
16511A454593l38916L36167N8496p50349M11194l96805L54381l73969M53393m76326
16501G31859L68126K1686K28609l63174D53282O45478R443J9441j0792o8923L2348
16490A080277O0841N12953F35985k5648L47124j62221N8517j47904K60056r0181
$$ plain form
16480 875728 1143532 957171 969129 1406764 1061328 823774 672288 516008 778498 1098935
16470 1098935 1123768 774596 794025 728551 1190132 483459 828022 765654 728427 694669
16460 694669 727428 689841 793514 366438 789720 645122 617275 969831 883357 373174
16449 638375 766900 499267 781750 698297 537313 516211 666041 295681 491345 551641
16439 551641 884753 633377 711859 690078 103920 762921 566141 587659 811091 637843
16429 637843 785706 465273 294904 419226 657075 599323 628082 519572 294772 636004
16419 636004 740950 342919 450126 457105 590483 464071 521095 408927 674033 488158
16409 488158 334011 85452 686252 504140 190140 318389 589597 490535 205806 356429
$$ packed form
16480H75728K67804j86361J1958M37635l45436k37554j51486j56280K62490L20437
16470A098935K4833l49172J9429o5474M61581D83459L44563o2368l7227l3758
16460F94669L2759l7587J03673C66438M23282j44598k7847L52556q6474C73174
16449F38375J28525k67633K82483q3453j60984k1102J49830B95681J95664O0296
16439E51641L33112k51376P8482k1781A03920O59001j96780K1518K23432j73248
16429F37843J47863l20433j70369J24322K37849n7752K8759j08510k24800L41232
16419F36004J04946C42919J07207O979J33378j26412N7024j12168K65106j85875
16409D88158j54147H5452O00800j82112A90140J28249K71208r9062B05806J50623
$$ plain form
16399 356429 425839 383656 291802 619286 163027 80767 378573 445085 104036 564921
16389 564921 428201 125513 347743 352580 138441 374805 265580 195957 -7436 385229
16378 441139 447376 185880 443425 441076 340485 536707 360074 -7195 331307 665349 174426
16366 21972 231793 27473 266536 300846 483364 162971 477426 346130 318970 95073
16355 213732 438853 438724 12925 76703 132980 -4301 267925 323164 253995 304326 -13898 122543
16342 84376 277892 211014 432192 360725 46508 289075 347444 348373 532591 167675 469443
16331 469443 217511 -20298 155135 276756 325757 241716 242313 285174 455691 389303 251382
16320 251382 188614 250619 227534 254063 379410 41670 400314 255502 265761 176978 130657
$$ packed form
16399C56429O9410m2183r1854L27484A63027H0767K97806O6512A04036M60885
16389E64921j36720A25513K22230M837A38441K36364j09225o9623g436C85229
16378D41139O237A85880K57545k349j00591J96222j76633g195C31307L34042A74426
16366B1972K09821B7473K39063L4310J82518A62971L14455j31296k7160I5073
16355B13732K25121j29A2925O3778N6277d301B67925N5239o9169N0331a3898A22543
16342H4376J93516o6878K21178p1467D6508K42567N8369R29J84218A67675L01768
16331D69443B17511b0298A55135J21621M9001q4041N97M2861J70517o6388j37921
16320B51382o2768O2005k3085K6529J25347D1670L58644j44812J0259q8783m6321
$$ plain form
16309 130657 445494 69817 250104 -189182 121088 397354 205126 124769 235628 337819
16299 337819 359369 180477 406950 443471 340681 276297 -273042 40212 252353 60681
16288 237965 130500 239736 212665 266893 147905 -964 -81861 347210 258270 522744 178007
16276 -26680 112740 -83273 196292 146448 36784 68662 248206 542890 169034 286616
16266 286616 221413 321477 -199039 86727 222540 170978 101269 199019 213484 41114 309914
16255 309914 171758 -264395 -5435 95308 49944 -80589 307522 442713 -79900 15733 -67758
16243 199679 -232440 -96155 80251 -18104 477081 -166013 331201 129393 267864 -58887
16232 159899 306248 -83698 -53947 87801 -123565 1226 -7943 88242 44381 69634 -78525
$$ packed form
16309A30657L14837F9817J80287a89182A21088K76266j92228q0357J10859J02191
16299C37819K1550j78892K26473L6521j02790o4384b73042D0212K12141F0681
16288B37965j07465J09236k7071N4228j18988i64q0897C47210q8940K64474A78007
16276b6680A12740h3273A96292m9844C6784L1878J79544K94684A69034J17582
16266B86616o5203J00064a99039H6727J35813n1562o9709R7750J4465D1114K68800
16255C09914j38156b64395e435I5308m5364h0589C07522J35191g9900A5733f7758
16243A99679b32440i6155H0251a8104D77081a66013C31201A29393J38471e8887
16232A59899J46349h3698K9751H7801a23565A226g943H8242m3861K5253g8525
$$ plain form
16220 -180505 133215 105751 24338 -135965 256347 147583 158803 -25773 -214410 353806
16209 319459 318738 236358 -119883 265797 -90774 423967 -110483 -133285 -40257 -336644 356767
16197 105901 -39191 457938 210146 -111310 207329 104861 68977 4495 70885 217828
16187 217828 76040 377821 191241 80465 -172421 -116994 366994 -39618 282609 83605
16176 177059 -277825 -253160 -198045 382100 148424 -86823 74174 252963 -102857 -128260
16166 -128260 219114 -143066 -33871 119347 49029 96756 -221499 209651 -180516 21343
16155 -167889 -204487 -182804 -101958 268819 326653 -21412 289999 65519 -378923 -7988 99174
16143 -187739 87581 116034 -172368 -181439 18031 -115777 250031 -48180 -34939 205942 301113
$$ packed form
16220a80505A33215k7464B4338a35965B56347j08764J1220b5773j88637C53806
16209C19459p21q2380a19883B65797i0774D23967a10483k2802d0257k96387C56767
16197A05901c9191D57938B10146a11310B07329j02468l5884D495O6390J46943
16187B17828G6040L01781j86580H0465a72421N5427C66994c9618B82609H3605
16176A77059b77825K4665N5115C82100A48424h6823G4174J78789a02857k5403
16166a28260B19114a43066c3871A19347D9029M7727b21499B09651a80516B1343
16155a67889l6598K1683Q0846B68819N7834b1412B89999F5519c78923g988I9174
16143a87739H7581K8453a72368r071A8031a15777B50031d8180J3241B05942R5171
$$ plain form
16132 301113 276608 -231607 146877 -64416 116058 23076 194314 -463484 59566 -95633
16121 -241683 -107122 45577 115869 77048 -149024 138328 214006 528 -278521 -124844 139840
16109 248006 162506 51743 -103172 107555 -43064 126611 101773 -360512 86826 25970 179909
16098 179909 -99491 279874 245047 161663 365311 -467761 312507 104941 325297 -77718
16087 181085 -203633 -34296 146364 -138478 97187 -178959 -51271 -412977 108441 186379
16077 186379 -314608 219567 68052 -128014 29583 128791 -121425 97433 -56393 3463 124233
16066 124233 -199361 -21629 271375 167882 143698 -258582 57301 -19262 -235582 -94618
16055 37147 162318 220986 -77085 17728 -217049 -5899 250674 -87954 47652 240974 -92940
$$ packed form
16132C01113k4505b31607A46877f4416A16058B3076J71238d63484E9566i5633
16121b41683a07122D5577P0292l8821a49024A38328P5678E28b78521a24844A39840
16109B48006q5500E1743a03172A07555d3064A26611k4838c60512H6826B5970J53939
16098A79909i9491B79874l4827q3384K03648d67761C12507A04941K20356g7718
16087A81085b03633c4296A46364a38478I7187a78959e1271l61706A08441P7938
16077A86379c14608B19567F8052a28014B9583R9208a21425I7433e6393C463J20770
16066A24233a99361b1629B71375j03493k4184b58582E7301a9262k16320i4618
16055C7147J25171N8668g7085A7728b17049e899B50674h7954D7652J93322i2940
$$ plain form
16043 12670 -180094 89911 -127917 -354356 -30946 -136090 89745 -157998 83858 -640768
16032 -57414 61105 -160005 48798 105781 67959 14637 429135 124649 -76107 -167049 32002
16020 -70070 -47309 132177 -166274 155930 147490 -366885 -55631 114634 -271723 53851 27472
16009 27472 -111150 32004 141285 -16291 -261163 16842 -132164 -10485 224349 -126559
15998 -301344 32055 -86657 160622 -15069 -78920 -148840 -9460 64046 -19697 -31326 163669
15986 -15356 -52297 458678 104757 389429 296690 530156 316717 393494 -5820 314189 154242
15974 -36344 41672 -124118 -154239 453206 -144174 -194488 -26474 10319 -178784 125358 -282546
15962 -97528 204830 109693 -304823 62245 260037 -146042 -80652 -115817 -188523 200060 116042
$$ packed form
16043A2670a80094H9911a27917k26439c0946j05144H9745a57998H3858f40768
16032e7414F1105a60005D8798N6983l7822A4637M14498A24649g6107r0942C2002
16020g0070K2761A32177a66274A55930q440c66885e5631A14634b71723E3851k6379
16009B7472a11150C2004J09281a6291k44872A6842a32164a0485B24349a26559
15998c01344C2055h6657A60622a5069o3851o9920i460F4046a9697j1629A63669
15986a5356l6941D58678A04757K84672r2739K33466k13439P6777e820C14189A54242
15974c6344D1672a24118l0121D53206a44174n0314b6474A0319a78784A25358b82546
15962i7528B04830r5137c04823F2245J97792a46042O5390l5165p2706B00060q4018
$$ plain form
15951 116042 40658 28023 -83322 338725 -233933 -270967 582362 -60890 -46375 79329 95977
15940 95977 196934 -156962 54083 22552 26594 164482 119042 -212964 -166202 -117827 -317143
15929 -317143 -116291 120165 86167 -147194 -187103 -224619 8979 -73418 121919 -31662 13461
15917 -263025 86076 42830 -354101 53437 61545 18761 -211379 37111 -168415 -54239 -17900
15905 -237351 -2382 127114 -183885 104640 3285 9329 22907 -245200 3555 -185442 -128865
15894 -128865 87151 60064 -157089 -120502 139928 -9265 -179712 91113 -61568 -217738 -985
15882 -141177 1957 -254882 -240990 252470 -158413 97983 58178 -83672 -118613 306520 49067
15870 -209566 -83421 -63608 -34275 -25106 324346 -108317 -53420 -5539 -137231 181673 91518
$$ packed form
15951A16042D0658j2635h3322C38725b33933l7034E82362f0890J4515G9329J6648
15940I5977J00957a56962E4083B2552M042J37888m5440b12964M6762M8375j99316
15929c17143a16291A20165l3998a47194l9909l7516H979g3418A21919c1662A3461
15917b63025H6076D2830c54101E3437Q108A8761b11379C7111a68415e4239a7900
15905b37351b382A27114a83885A04640C285O044J3578b45200C555a85442N6577
15894a28865H7151k7087a57089L6587A39928i265j70447I1113f1568j56170i85
15882a41177A957b54882J3892B52470a58413I7983l9805h3672l4941C06520D9067
15870b09566h3421J9813K9333R169C24346a08317e3420e539j31692A81673r0155
$$ plain form
15859 91518 14825 28982 180511 -13417 -8469 49496 -333152 -190532 198488 -296257 -216377
15848 -216377 226066 -50794 45690 212733 -459139 148354 -117880 -260493 76313 128091
15838 128091 -56394 1790 207130 -49679 218865 -106155 513303 -243397 -128544 -127376 286804
15826 -167881 39338 -436242 291281 20968 -154043 -179945 25283 139635 74484 -118782
15815 -61556 -262306 163352 -289642 4357 -89041 16247 -9986 59486 -271247 89835 -117710
15803 200162 53616 -145373 141626 -236653 -30107 -18139 19991 166153 -213928 -70934
15792 105568 -55495 -111007 -9062 125386 -89030 37214 455 -499568 -185058 -293529 203704
15780 -18844 73432 -263816 -178111 18069 -141083 158441 -117984 -33628 -206270 -162279 42227
$$ packed form
15859I1518A4825J4157J51529a3417M948D9496c33152J42620A98488b96257P9880
15848b16377B26066e0794D5690J67043d59139A48354a17880j42613G6313N1778
15838A28091e6394A790K05340d9679B18865a06155E13303b43397J14853J168B86804
15826a67881C9338d36242B91281B0968a54043k5902B5283J14352o5151a18782
15815f1556k00750A63352b89642D357h9041A6247i986E9486b71247H9835a17710
15803B00162E3616a45373A41626b36653c0107J1968A9991J46162b13928g0934
15792A05568e5495n5512i062A25386h9030C7214D55d99568a85058j08471B03704
15780a8844G3432b63816Q5705A8069a41083A58441a17984c3628j72642M3991D2227
$$ plain form
15768 -82638 -249567 -53527 -97658 15357 125627 -331427 390815 131782 142209 158717 71105
15756 -67566 223442 142482 -61081 73360 233835 -88533 256378 -276411 95930 -74309 32268
15744 -55707 290328 -64958 -241879 90937 57361 -99710 -78272 130495 158990 -52367 -14244
15732 126520 -147116 -278069 -175583 98854 117379 128325 99455 636 296041 -24288 -70208
15721 -70208 1406 -262725 -178879 -93951 147312 287618 -143787 205641 60120 -127454 -45845
15709 103757 69838 -160086 -21544 -82284 82018 -33216 -180372 -54255 312415 475310 -48633
15697 -107555 149301 -42165 88253 -70450 156406 33118 -152975 48199 89436 -159227 45440
15685 11761 -174176 -431562 -98742 29802 105526 72439 57246 -213244 398411 144099 -58979
$$ packed form
15768h2638j66929e3527m4131A5357J10270c31427C90815A31782J0427J6508G1105
15756f7566B23442q0960f1081G3360J60475h8533B56378b76411I5930g4309C2268
15744e5707B90328f4958j76921I0937l3576i9710K1438A30495K8495e2367a4244
15732A26520a47116j30953J02486I8854J8525J0946k8870F36K95405b4288m5920
15721g0208A406b62725Q3846Q4928A47312J40306a43787B05641F0120a27454d5845
15709A03757l3919a60086b1544o0740H2018c3216j47156e4255C12415J62895d8633
15697a07555A49301d2165H8253g0450A56406C3118a52975D8199M1237a59227D5440
15685A1761a74176k57386i8742B9802P5724l3087j5193b13244C98411A44099e8979
$$ plain form
15673 65936 139892 -240395 -222682 -209174 8795 -212288 -321262 185748 -112259 119186 -198045
15661 180751 -108147 -379825 -245791 -155458 -110141 134408 -166520 162800 -28877 -23366
15651 -23366 -54693 -95434 336663 -158477 188908 -25891 210053 -101784 105011 78502
15641 78502 -160820 324179 68766 186741 -85170 179224 76590 39243 -72240 -117950 7269
15629 -350704 237306 214073 244089 -315104 -28099 95301 -93655 107318 -508430 -255744
15619 -255744 213564 337197 124384 -115459 184159 55188 283267 -192816 -60833 -146458
15609 -146458 -49902 -7798 44656 56452 -161984 -5187 -192283 -149358 -329461 -198968 -80709
15597 -361428 -450648 456141 -283042 -156249 248664 -434740 -55266 37838 -83648 107502
$$ packed form
15673F5936P3956b40395J7713J3508H795b12288j08974A85748a12259A19186a98045
15661A80751a08147k71678J34034R0333M5317A34408a66520A62800b8877N511
15651b3366l1327m0741C36663a58477A88908b5891B10053a01784A05011k6509
15641G8502a60820C24179F8766J17975h5170A79224G6590l7347g2240m5710G269
15629c50704B37306k3233L0016c15104b8099I5301i3655A07318e08430K52686
15619b55744B13564J23633A24384a15459A84159E5188K28079a92816f0833q5625
15609a46458d9902g798D4656J1796a61984e187j87096M2925j80103J30493h0709
15597c61428q9220D56141b83042J26793B48664d34740e5266C7838h3648A07502
$$ plain form
15586 -192062 52595 -282826 187845 205564 -75825 101144 122806 167069 3323 -48482 69633
15574 -150498 -278253 179469 68302 41756 -69528 -9656 134662 -29693 241744 209971 -22039
15562 -35928 -9451 -233104 88274 -17694 64160 -340280 -118954 -164751 138759 -663 -367075
15551 -367075 103116 -341575 -228984 -395608 -20247 63302 -178351 -531492 72364 -92477
15540 -39939 -25068 -59496 103350 71529 -69032 130318 214454 -90625 -161434 -187047 130079
15528 -21235 62100 -113779 93720 17693 91149 -17831 131671 -65890 -29062 251070 18488
15516 -167851 -369128 223676 41158 -103569 177188 103688 -271979 103249 -190034 -276137
15506 -276137 -45539 152646 262567 197079 167372 -67583 -125401 -255464 -60636 -72253 -136564
$$ packed form
15586a92062E2595b82826A87845J7719g5825A01144K1662M4263C323d8482F9633
15574a50498j27755A79469F8302k6546f9528i656A34662b9693B41744l1773b2039
15562c5928i451k23653H8274a7694F4160c40280a18954m5797A38759f63l66412
15551c67075A03116c41575J12591j66624b0247F3302a78351l53141G2364i2477
15540c9939J4871l4428A03350l1821f9032A30318Q4136i0625p0809k5613A30079
15528b1235F2100a13779I3720A7693P3456a7831A31671f5890b9062B51070A8488
15516a67851k01277B23676D1158a03569A77188p3500b71979A03249a90034q6103
15506b76137d5539A52646J09921o5488k9707f7583n7818j30063f0636j1617o4311
$$ plain form
15495 -136564 -158688 -183569 -156531 -90377 -313095 71458 -478287 -381458 -267665 -174028 -33522
15483 -74167 15410 194009 377617 68501 119475 -167492 -6573 -144544 69867 -199825 327448
15471 -262301 370488 112471 13503 80167 175392 -132411 -43286 -205332 -70513 161572
15460 119425 -34914 -124477 6995 -110496 15180 46876 -131860 370199 213466 272240 -39970
15448 -57003 175410 167180 13256 -71520 -92088 -440405 191629 13361 15940 -23590 379928
15436 -50975 -213442 23640 9037 -160851 -161416 -110182 393520 192847 -77357 -190611 25889
15424 5043 -216070 -150956 307173 -98315 29738 146515 -84190 -215705 -360328 -13729 -254886
15413 -254886 -264994 -59046 -88982 162508 165214 266339 -137911 432309 -32631 51693 279515
$$ packed form
15495a36564k2124k4881K7038O6154k22718G1458d78287R6829J13793R3637c3522
15483g4167A5410J78599J83608F8501N0974a67492f573j37971F9867a99825C27448
15471b62301C70488A12471A3503O6664R5225a32411d3286j62046g0513A61572
15460A19425c4914q9563F995a10496A5180L1696a31860C70199j56733N8774c9970
15448e7003A75410q230A3256g1520k0568l48317A91629A3361K579b3590C79928
15436e0975j62467B3640I037a60851n65N1234C93520A92847g7357j13254B5889
15424E043b16070O5114C07173i8315B9738J16777h4190j31515j44623a3729k41157
15413b54886j0108e9046k9936A62508K706J01125a37911D32309c2631E1693K27822
$$ plain form
15402 279515 70639 78238 91927 -79457 -104234 294007 -161346 6176 183027 -256887 142724
15390 -329549 105897 -19981 66074 -73286 17989 225924 92337 142500 -59203 153430 -311890
15378 313362 -204482 -232118 145025 -8151 -133881 334284 -48114 142310 143634 277431 -81027
15366 -16861 -142955 194437 -133387 -124534 104546 190909 40938 -468 -78842 117825 -41497
15354 48360 -46786 -288847 -338864 46921 -13298 139335 -174563 -46567 397644 257767 26928
15342 174785 -178330 -116558 -132548 -71516 87865 99745 -109676 63487 -9363 253662 245194
15331 245194 316768 150325 -175569 -297563 -118950 -175012 285113 242951 -178608 -125329
15321 -125329 -174123 -8940 7860 -61902 -121250 -96066 42447 76129 167378 68615 166121 184441
$$ packed form
15402B79515G0639P599J3689g9457k4777B94007a61346F176J76851b56887A42724
15390c29549A05897a9981F6074g3286A7989K07935I2337N0163e9203A53430c11890
15378C13362b04482k7636A45025h151j25730C34284d8114A42310J324J33797h1027
15366a6861j26094A94437a33387Q853A04546Q6363D0938d68p8374A17825d1497
15354D8360d6786k42061n0017D6921a3298A39335a74563d6567C97644j39877B6928
15342A74785a78330O1772j5990O1032H7865J1880a09676F3487i363B53662q468
15331B45194P1574A50325a75569j21994a18950n6062B85113m2162a78608N3279
15321a25329m8794h940G860f1902n9348K5184D2447L3682R1249F8615R7506J8320
$$ plain form
15309 184441 208190 -188248 -151320 27655 -119756 275442 227385 202633 208764 115022 38726
15297 195172 33674 327481 -140811 -130628 230771 -81773 350703 -123922 -156181 59123
15286 108339 -72535 -333710 119860 -179411 334243 67552 16978 80838 -27606 156766
15275 -185640 -59157 205577 -166812 124832 370708 -134642 73718 -235193 29042 46449
15265 46449 -400747 383083 131390 95809 -87877 278927 94538 331556 273808 7576 326078
15254 326078 105973 301539 -202 308869 231131 646460 1086113 712934 1180889 1177332 469682
15242 162317 -172407 -47972 157639 -265256 215069 308167 78432 -191790 373741 65820
15231 -156862 -259812 -3095 5589 -115092 125289 -70485 -63770 316598 -23947 -126808 205001
$$ packed form
15309A84441K3749a88248L6928B7655a19756B75442m8057k4752O131r3742C8726
15297A95172C3674K93807a40811J0183B30771h1773C50703a23922l2259E9123
15286A08339g2535k61175A19860a79411C34243F7552A6978O3860b7606A56766
15275a85640e9157B05577a66812A24832K45876a34642G3718b35193B9042J7407
15265D6449d00747C83083A31390l5581h7877B78927I4538K37018n7748G576L18502
15254C26078A05973J95566b02C08869p7738M15329M39653l73179M67955l557D69682
15242A62317a72407d7972A57639b65256B15069R3098G8432a91790C73741F5820
15231a56862j02950c095E589a15092A25289g0485O715C16598b3947j02861B05001
$$ plain form
15219 10066 -102414 -133867 -303248 20119 170469 145290 29512 -63219 22021 -167218 32851
15207 -75052 -57944 366396 98724 -174296 178087 -199207 348950 116757 -164298 81564
15196 -51993 44183 -117435 -171692 182030 -217583 161119 -340195 81176 -22636 301385
15185 150123 -152998 56618 -433686 -16946 65656 37761 -334932 -140023 -37346 -192882
15175 -192882 551039 -146245 -28318 -4695 343243 218193 -96566 144566 -197996 -336839
15165 -336839 128107 340109 24234 181255 -113612 287082 100978 -279091 63317 -38259
15154 418819 -162429 110590 135811 30761 -63229 -1631 190473 -60028 438 -217249 -184688
15143 -184688 -298878 39661 -254571 76638 -61804 448634 168590 117681 -68444 -137595 253627
$$ packed form
15219A0066a02414l1453j69381B0119J50350k5179B9512f3219B2021a67218C2851
15207g5052J7108C66396I8724a74296A78087a99207C48950A16757a64298H1564
15196e1993D4183a17435n4257A82030b17583A61119c40195H1176b2636C01385
15185A50123a52998E6618d33686a6946F5656k7895c34932a40023c7346j55536
15175a92882E51039a46245b8318d695C43243j25050i6566A44566a97996j38843
15165c36839A28107K12002B4234J57021a13612B87082A00978b79091F3317c8259
15154D18819a62429A10590K5221C0761f3229a631A90473f0028D38b17249L2561
15143a84688j14190C9661b54571G6638f1804D48634A68590n0909f8444o9151B53627
$$ plain form
15131 461339 48142 397157 164098 -125735 347512 238152 339998 -106359 341172 251612
15121 251612 -58921 47428 -144938 61616 228590 -125913 224832 225896 1135 -234918 -21557
15109 57703 497724 -59568 264811 172773 175686 87593 460658 120306 164333 396261 201841
15098 201841 164049 99872 195682 -6907 303142 324254 119502 93335 272026 72275 141586
15087 141586 -223556 79629 168937 206897 247536 96833 65431 -33176 155172 310189 224167
15076 224167 128413 285181 387784 -173239 398379 -65450 369927 192652 163702 237297
15066 237297 289840 -67785 43758 321452 54940 291297 436081 -137465 -48527 -73884 -102162
15055 -102162 528488 244273 113621 -60697 536165 191141 196937 257646 194933 227867 291130
$$ packed form
15131D61339D8142L49015A64098a25735C47512j09360J01846a06359C41172q9560
15121B51612e8921D7428a44938F1616J66974a25913B24832J064A135b34918b1557
15109E7703M40021e9568B64811r2038K913H7593L73065A20306M4027K31928j94420
15098B01841l7792o4177R5810f907C03142K1112A19502k6167J78691G2275O9311
15087A41586b23556G9629Q9308L7960M0639I6833l1402c3176A55172J55017q6022
15076B24167r5754J56768J02603a73239C98379f5450C69927j77275k8950P3595
15066B37297N2543f7785D3758K77694E4940K36357J44784a37465d8527k5357k8278
15055a02162E28488B44273A13621f0697E36165A91141N796O0709o2713L2934O3263
$$ plain form
15044 291130 115837 418965 350325 117836 108917 340569 90412 362432 -16138 -33244 -3020
15032 132408 -206699 387369 122431 130393 158797 300266 404713 138124 574073 149682
15021 109817 308017 -101316 67166 381124 -30158 11307 334708 122088 228160 304161
15011 304161 464391 387268 536969 43819 218143 361278 190851 279530 356811 45459
15000 259136 -157878 539791 222217 373601 102520 11298 510654 41508 187035 314085
14990 314085 309592 120301 172321 387151 54019 288605 37401 31547 68577 -12833 365589
14978 216276 175205 221744 219841 507934 369739 159945 65603 243844 166311 -179105 72726
14966 640520 313677 179631 245140 277723 179874 -56416 178891 152423 289103 372214 268023
$$ packed form
15044B91130A15837L03128o8640A17836q919K31652I0412K72020a6138j7106c020
15032A32408b06699C87369A22431P962K8404J41469J04447A38124M35949A49682
15021A09817J98200a01316F7166L13958c0158A1307L23401A22088J06072P6001
15011C04161J60230p7123J49701D3819J74324J43135j70427Q8679P7281D5459
15000B59136a57878E39791B22217J51384A02520A1298M99356D1508J45527J27050
14990C14085m493A20301N2020K14830E4019K34586C7401n854L7030a2833C65589
14978B16276m1071M6539j903K88093j38195A59945F5603J78241p7533a79105G2726
14966F40520C13677j34046O5509L2583r7849e6416A78891k6468J36680Q3111j04191
$$ plain form
14955 268023 134365 238862 -34000 262926 356283 452975 -51399 346659 -169880 24295
14944 279881 525848 279527 103879 598821 49897 220409 197695 490046 335765 77209
14933 363611 276942 61472 224753 6093 345605 483716 283873 489316 366993 338744
14923 338744 515364 512852 350106 145998 409415 351447 289751 323493 135284 169380 94928
14912 94928 531295 442420 284739 333530 466994 151097 462210 267418 287045 150022
14902 150022 249810 306707 -58714 129522 537507 466931 286478 241674 220350 422659 587164
14891 587164 476839 423398 630981 491858 14028 394708 521225 113408 180596 497612
14881 497612 643032 465574 162095 390182 362115 188008 -13269 500663 197517 509469
$$ packed form
14955B68023j33658J04497c4000B62926R3357R6692e1399C46659a69880B4295
14944B79881K45967k46321A03879M94942D9897J70512k2714K92351j54281G7209
14933C63611q6669F1472J63281F093L39512J38111j99843K05443j22323k8249
14923C38744J76620k512j62746A45998K63417n7968o1696L3742A35284L4096p4452
14912I4928M36367q8875j57681M8791J33464A51097L11113j94792J9627j37023
14902A50022R9788N6897e8714A29522M07985p0576j80453m4804k1324K02309J64505
14891E87164j10325n3441K07583j39123A4028L80680J26517A13408O7188L17016
14881D97612J45420j77458A62095K28087k8067j74107a3269E00663A97517L11952
$$ plain form
14871 509469 649027 562865 167220 434660 452787 355386 602357 227509 479247 463157
14861 463157 237188 257602 379495 573135 207326 215755 226375 220687 378199 10868 694906
14850 694906 450781 498932 518798 661879 505407 364051 370212 513747 254752 302777
14840 302777 422722 204750 324902 694285 529081 158167 336863 456591 618353 453482
14830 453482 276813 419198 379954 233948 541175 426258 324777 296308 688769 495305
14820 495305 355160 453716 602514 240561 496397 352854 554312 601430 385073 643679
14810 643679 86897 677644 450775 513235 480822 480959 630949 2160 346879 486643 204692
14798 559661 519863 505636 627920 511690 290047 518324 322909 580577 448311 356896
$$ packed form
14871E09469J39558q6162A67220K67440J8127r7401K46971B27509K51738j6090
14861D63157k25969K0414J21893J93640B07326Q429J0620n688J57512A0868O84038
14850F94906k44125M8151J9866J43081j56472j41356O161J43535B54752M8025
14840C02777J19945B04750J20152L69383j65204A58167J78696J19728J61762j64871
14830D53482j76669J42385l9244j46006L07227j14917j01481k8469L92461j93464
14820D95305j40145R8556J48798B40561K55836j43543K01458M7118k16357K58606
14810F43679H6897N90747k26869O2460l2413J37J49990B160L44719J39764B04692
14798E59661l9798j4227J22284j16230k21643K28277j95415K57668j32266r1415
$$ plain form
14788 356896 730064 631027 783868 420868 826103 577358 576764 355656 702351 898955
14778 898955 499556 343896 665289 544818 545343 580975 509482 520850 731645 572942 753094
14767 753094 845036 405434 426937 711331 457729 394862 591786 252688 310710 608981
14757 608981 599959 758212 671554 442186 826500 789522 727945 940136 676527 684122 642976
14746 642976 614269 860184 726431 1219800 642139 589278 855076 926157 233387 382214
14736 382214 503371 687925 467972 902504 743828 822430 809435 909346 882945 540600
14726 540600 587993 1066417 816297 773279 746501 831595 851336 966103 711658 1221462
14716 1221462 579840 834334 844825 564628 620945 722627 727521 681380 1002189 783708
$$ packed form
14788C56896L73168r9037J52841l63000M05235k48745n94k21108L46695J96604
14778H98955l99399j55660L21393j20471N25L5632p1493J1368K10795j58703J80152
14767G53094R1942D05434K1503K84394k53602o2867J96924B52688N8022K98271
14757F08981r022J58253q6658k29368L84314l6978o1577K12191k63609P595m1146
14746F42976k8707K45915j33753M93369n77661n2861K65798P1081B33387J48827
14736C82214J21157J84554k19953M34532j58676P8602j2995R9911k6401l42345
14726E40600M7393M78424k50120m3018k6778Q5094J9741J14767k54445N09804
14716A221462E79840K54494J0491k80197N6317J01682M894m6141L20809k18481
$$ plain form
14706 783708 622814 639456 790441 970858 832614 923082 1165414 700448 494285 985973
14696 985973 1061810 821857 792190 774568 678960 985601 1022564 639385 1078714 1074405 868581
14685 868581 934055 606641 969434 878590 713571 1008199 912692 1016858 1023562 845931
14675 845931 1044764 959988 894473 891024 841310 1067904 999800 989673 1114533 937980 980067
14664 980067 1169919 1278064 1171128 1113607 1208845 1001087 1221430 683255 1101734 991729
14654 991729 1351136 1422459 992485 1249952 1221724 1550172 964297 1290520 1352115 1172552
14644 1172552 1407314 1028310 1401327 1235019 835020 1080855 1078025 1596097 1355835 1365777
14634 1365777 1530299 1208966 1145778 1187244 1442846 1465236 1062148 1369608 1073262 1481809
$$ packed form
14706G83708j60894J6642J50985J80417j38244R0468K42332m64966k06163M91688
14696I85973P5837k39953k9667j7622r5608L06641L6963l83179M39329m309k05824
14685H68581O5474l27414L62793r0844j65019K94628r5507J04166O704j77631
14675H45931J98833q4776o5515l449m9714K26594o8104j0127J24860j76553M2087
14664I80067J89852J08145j06936n7521R5238k07758K20343n38175M18479j10005
14654I91729L59407P1323m29974K57467k8228L28448n85875L26223O1595j79563
14644A172552K34762l79004L73017j66308l99999K45835k830N18072k40262R942
14634A365777J64522l21333o3188M1466K55602K2390m03088L07460k96346M08547
$$ plain form
14624 1481809 1300636 1199860 1349814 1481044 1220769 1327780 1230169 1379617 1671683 1333307
14614 1333307 1614866 1482968 1356639 1702572 1529566 1531369 1666021 1614985 1309091 1426541
14604 1426541 1216066 1238676 1419440 1601824 1888085 1605437 1598090 1590573 1855159 1353150
14594 1353150 1489214 1644972 1563066 1804168 2067770 1629889 1861218 1821702 1883434 1794318
14584 1794318 1744791 1824608 1806519 1867832 1972810 1940578 2061466 1966300 2193042 2032371
14574 2032371 2030002 2113601 1939628 2121538 2281109 2542336 2179779 2295847 2234547 2475423
14564 2475423 2381859 2426735 2651712 2794536 2731270 2739460 2582806 3069204 3101479 3008891 3541963
14553 3541963 3571942 4188802 4736969 5733649 7556222 12100533 22244826 40661362 45318752
$$ packed form
14624A481809j81173j00776J49954J31230k60275J07011r7611J49448K92066l38376
14614A333307K81559j31898j26329L45933j73006J803J34652n1036l05894J17450
14604A426541k10475K2610J80764J82384K86261k82648p347p517K64586n02009
14594A353150J36064J55758q1906K41102K63602m37881K31329l9516O1732q9116
14584A794318m9527P9817j8089O1313J04978l2232J20888r5166K26742j60671
14574B032371k369Q3599j73973J81910J59571K61227l62557J16068o1300K40876
14564B475423r3564M4876K24977J42824o3266Q190j56654M86398L2275r2588N33072
14553C541963K9979O16860N48167R96680J822573M544311J0144293J8416536M657390
$$ plain form
14544 45318752 21521062 8711609 4410746 2794418 2439092 2036068 1937008 1930186 1928386
14535 1928386 2292589 2040990 2039011 1700524 2459670 2144111 1869889 2368964 2229715 2225734
14525 2225734 2274940 2215941 2317403 2367251 2411985 2656408 2700144 2485179 2763347 2632036
14515 2632036 2498792 2533318 2661269 2848461 2586162 2858201 2832053 2787954 3124924 2712824
14505 2712824 3074511 2779974 3172326 3183746 3116583 3304799 3408414 3289129 3256108 3200827
14495 3200827 3425075 3371863 3658500 3240621 3523477 3667237 3406279 3864047 3581807 3517993
14485 3517993 3508737 3503027 3782129 3823280 4141945 3776627 3881959 3822915 3940348 3971675 4273332
14474 4273332 4143263 4404482 4017567 4514213 4139858 4330345 4303041 4781940 4598394 4615876
$$ packed form
14544D5318752B1521062H711609m300863j616328l55326m03024r9060o822j800
14535A928386L64203k51599j979l38487P59146l15559k74222M99075j39249l981
14525B225734M9206n8999J01462M9848M4734K44423M3736k14965K78168j31311
14515B632036j33244L4526J27951J87192k62299K72039k6148m4099L36970m12100
14505B712824L61687k94537L92352J1420o7163J88216J03615j19285l3021n5281
14495C200827K24248n3212K86637m17879K82856J43760k60958M57768k82240o3814
14485C517993r256n710K79102M1151L18665l65318J05332n9044J17433L1327L01657
14474D273332j30069K61219l86915M96646l74355J90487k7304M78899j83546J7482
$$ plain form
14464 4615876 4321430 4427419 4711032 4461049 4796496 5028312 5229685 5216783 4936691 5094997
14454 5094997 5089239 5354460 5582126 5292492 5259266 5407900 5540504 5738303 5688310 5527671
14444 5527671 5719787 6191365 6143014 6121253 6072162 6148396 6206373 6290609 6745932 6830609 6513771
14433 6513771 7087434 6712223 6950149 6798172 7085994 7111006 7211430 7604585 7787280 7490381
14423 7490381 7803522 8275168 7871039 7830420 7946612 8279320 8212347 8782649 8854100 8814753
14413 8814753 8958324 9173805 9394339 9281257 9475679 9389613 9499029 9993059 10004486 10424054
14403 10424054 10205749 10493212 10723063 10948363 10783096 11532550 11233458 11769981 11792611
14394 11792611 11843103 12092575 12388916 12535593 12510796 12890780 13002329 13094288 13678408 13831936
$$ packed form
14464D615876k94446J05989K83613k49983L35447K31816K01373j2902k80092J58306
14454E094997n758K65221K27666k89634l3226J48634J32604J97799m9993j60639
14444E527671J92116M71578m8351k1761m9091P6234N7977Q4236M55323Q4677l16838
14433F513771N73663l75211K37926j51977K87822K5012J00424L93155J82695k96899
14423G490381L13141M71646m04129m0619J16192L32708o6973N70302P1451l9347
14413H814753J43571K15481K20534j13082J94422q6066J09416M94030J1427M19568
14403A0424054k18305K87463K29851K25300j65267P49454k99092N36523K2630
14394A1792611N0492K49472K96341J46677k4797L79984J11549R1959N84120J53528
$$ plain form
14384 13831936 14135444 14306393 14560924 14591303 15221600 15616205 15270722 16054342 16057014 16834012
14374 16834012 16867802 17123490 17438071 17636622 18210533 18568674 19100331 19154273 19901895 20305063
14364 20305063 20537516 21084314 21798840 21647888 22227727 23012607 23333384 24012845 24805746
14355 24805746 25231712 25423196 26365105 26640642 27609761 27922266 28872597 29516655 30185827
14346 30185827 30843834 31660049 32549628 33357459 34348138 34990032 36242462 37408913 37955764
14337 37955764 39289911 40469639 41405370 42743264 43733927 45414056 46591512 48460303
14329 48460303 49838513 51019710 52730802 54267451 56270502 58407658 60564460 62281842
14321 62281842 64743295 66947164 69305145 71837246 74596683 77313989 80702370 83698500
$$ packed form
14384A3831936L03508J70949K54531L0379O30297L94605l45483P83620K672P76998
14374A6834012L3790K55688L14581J98551N73911L58141N31657N3942P47622M03168
14364B0305063K32453N46798P14526j50952N79839P84880L20777O79461P92901
14355B4805746M25966J91484R41909K75537R69119L12505R50331O44058O69172
14346C0185827O58007Q16215Q89579Q07831R90679O41894J252430J166451N46851
14337C7955764J334147J179728R35731J337894R90663J680129J177456J868791
14329D8460303J378210J181197J711092J536649K003051K137156K156802J717382
14321F2281842K461453K203869K357981K532101K759437K717306L388381K996130
$$ plain form
14313 83698500 87058826 90264970 93978150 97733849 101997526 106658104 110733513 116077024
14305 116077024 121526226 126806953 132785941 139114154 145435196 152587926 160060930 167421735
14297 167421735 175667005 184387154 193757195 203446149 213432212 224162406 235256818 247455298
14289 247455298 259551482 272818278 286289393 300545730 314706658 329386152 344361962
14282 344361962 359359920 374073498 388721923 403091286 416437041 428986173 440136636
14275 440136636 449961968 457417058 462251479 463284641 462176178 460966878 458364503 454453910
14267 454453910 450631446 443278547 433317153 421895833 409316480 396674194 382229879
14260 382229879 367212702 351874853 336878247 321586810 307009547 293149744 279375772
$$ packed form
14313H3698500L360326L206144L713180L755699M263677M660578M075409N343511
14305A16077024N449202N280727N978988O328213O321042P152730P473004P360805
14297A67421735Q245270Q720149R370041R688954R986063J0730194J1094412J2198480
14289B47455298J2096184J3266796J3471115J4256337J4160928J4679494J4975810
14282C44361962J4997958J4713578J4648425J4369363J3345755J2549132J1150463
14275D40136636R825332P455090M834421J033162j108463j209300k602375l910593
14267D54453910l822464p352899r961394j1421320j2579353j2642286j4444315
14260C82229879j5017177j5337849j4996606j5291437j4577263j3859803j3773972
$$ plain form
14253 279375772 265767584 253135537 240498842 228839298 217615706 207175144 196782368
14246 196782368 187630636 178881387 170894547 162704858 154702679 148074613 141061898 134915891
14238 134915891 129579957 123958066 118497604 113213706 108818385 104071262 100268420 96398249
14230 96398249 92771717 88931305 85568424 82422522 79045285 76100858 73588560 71026564
14222 71026564 68374542 65954239 64214888 62040259 59948871 57565018 55873337 54231260
14214 54231260 52662187 50723733 49487819 47952218 46422904 45516876 43913718 43195487
14206 43195487 41730949 40619769 39308346 38205392 37017159 35901727 35476520 34315102
14198 34315102 33512819 32407428 31594055 31037811 30513303 29333856 28688801 28242176 26972063
$$ packed form
14253B79375772j3608188j2632047j2636695j1659544j1223592j0440562j0392776
14246A96782368r151732q749249p986840q189689q002179o628066p012715o146007
14238A34915891n335934n621891n460462n283898m395321m747123l802842l870171
14230I6398249l626532l840412l362881l145902l377237k944427k512298k561996
14222G1026564k652022k420303j739351k174629k091388k383853j691681j642077
14214E4231260j569073j938454j235914j535601j529314r06028j603158p18231
14206D3195487j464538j111180j311423j102954j188233j115432m25207j161418
14198C4315102q02283j105391q13373n56244n24508j179447o45055m46625j270113
$$ plain form
14189 26972063 26829839 25858207 25382680 24741207 24304249 23553157 22898222 22742938 21916997
14180 21916997 21827355 21314482 21019934 20261040 20050686 19393972 19128545 18695529 18370293
14171 18370293 18241784 18076263 17437756 16920235 17055674 16592499 16259698 15364926 15805259
14162 15805259 15348160 14920826 14423048 14570628 14473677 13965400 13792152 13934795 13170794
14153 13170794 13250361 12689047 12562885 12382526 11996263 11915668 11734179 11841472 11513508 11324843
14143 11324843 11540900 11261576 10804739 10312857 10430590 10420897 10062605 10066097 9748962 9934179
14133 9934179 9662822 9734693 9134697 9234694 9020102 8903422 8930137 8665124 8712562 8397158
14123 8397158 8423282 8171570 8212273 7979856 8028248 8005906 8013580 7791210 7462492 7628466
$$ packed form
14189B6972063j42224r71632m75527o41473m36958p51092o54935j55284q25941
14180B1916997q9642n12873k94548p58894k10354o56714k65427m33016l25236
14171A8370293j28509j65521o38507n17521J35439m63175l32801q94772M40333
14162A5805259m57099m27334m97778J47580r6951n08277j73248J42643p64001
14153A3170794P9567n61314j26162j80359l86263q0595j81489J07293l27964j88665
14143A1324843K16057k79324m56837m91882J17733r693l58292L492l17135J85217
14133I934179k71357P1871n99996R9997k14592j16680K6715k65013M7438l15404
14123H397158K6124k51712M0703k32417M8392k2342P674k22370l28718J65974
$$ plain form
14113 7628466 7371994 7080827 7540185 7390350 6599609 7063618 6866993 6421730 6864192
14104 6864192 6671853 6679543 6435482 6492788 6504409 6230172 6075862 6137588 6072680 5572923
14094 5572923 5766293 6014647 6097365 5987397 5350056 5375256 5322924 5316491 5269262 5396814
14084 5396814 5102708 5623712 4941365 5161000 5183818 5370141 4835223 4807887 4655758 4753859
14074 4753859 4810202 4668651 4560619 4687488 4541816 4888163 4548380 4904899 4817921 4454895
14064 4454895 4185517 4203032 4427296 4051926 4339556 4667534 4487913 4279517 4242341 4152176
14054 4152176 4013210 4300831 3679513 3999451 3836571 3870370 3997543 3929356 3583298 3605108
14044 3605108 3566274 3614156 3683524 3489882 3420551 3519893 3637502 3435770 3215809 2865269
$$ packed form
14113G628466k56472k91167M59358j49835p90741M64009j96625m45263M42462
14104F864192j92339P690k44061N7306J1621k74237j54310O1726o4908m99757
14094E572923J93370K48354Q2718j09968o37341K5200n2332o433m7229J27552
14084E396814k94106N21004o82347K19635K2818J86323n34918k7336j52129R8101
14074D753859N6343j41551j08032J26869j45672L46347l39783L56519q6978l63026
14064D454895k69378J7515K24264l75370K87630L27978j79621k08396l7176r0165
14054D152176j38966K87621o21318L19938j62880L3799J27173o8187l46058K1810
14044C605108l8834M7882O9368j93642o9331R9342J17609k01732k19961l50540
$$ plain form
14034 2865269 3234574 3367272 3168825 3250897 3327589 3179017 3223742 3299849 2859447 3092444
14024 3092444 3296018 3091050 2770107 3055552 2701432 2775421 2518479 2622043 2878267 2449670
14014 2449670 2772397 2433932 2544006 2509908 2330279 2351802 2502350 2631254 2145438 2327248
14004 2327248 2375686 2366811 2365781 2256014 2254403 2290969 2089661 2001790 2216841 2333573 2206432
13993 2206432 2251448 2326469 2545271 3163743 3622956 6471362 14518426 33115212 45877781
13984 45877781 26654402 13452598 8339783 6201220 4893599 4085753 3778163 3603042
13976 3603042 3578776 2989877 3032793 2946181 2794203 2847794 2780855 2823415 2641595 2946352
13966 2946352 2468127 2467251 2097686 2464017 2612867 2595722 2158515 2432305 2620653 2167367
$$ packed form
14034B865269L69305J32698j98447Q2072P6692j48572M4725P6107m40402K32997
14024C092444K03574k04968l20943K85445l54120P3989k56942J03564K56224m28597
14014B449670L22727l38465J10074l4098j79629K1523J50548J28904m85816J81810
14004B327248M8438q875j030j09767j611L6566k01308q7871K15051J16732j27141
13993B206432M5016P5021K18802O18472M59213K848406Q047064J8596786J2762569
13984D5877781j9223379j3201804n112815k138563j307621q07846l07590j75121
13976C603042k4266n88899M2916q6612j51978N3591o6939M2560j81820L04757
13966B946352m78225q76l69565L66331J48850j7145m37207K73790J88348m53286
$$ plain form
13956 2167367 2489456 1850981 2152398 1973021 1886331 1838128 1920932 2442413 1973862 2293770
13946 2293770 1947724 2577040 2176499 1844044 1856459 2004351 1986891 2212266 2027542 1701539
13936 1701539 1710070 1831133 1915330 1722455 1560484 1939344 1687622 1625954 1773274 1739499
13926 1739499 1520934 1686530 1780789 1834101 1591676 1585395 1220017 1758034 1529580 1645403
13916 1645403 1694590 1785087 1809473 1533757 1361922 1261304 1556172 1489565 1615274 1622976
13906 1622976 1316455 1582219 1952985 1693499 1469071 1470181 1476330 1667026 1691741 1350434
13896 1350434 1676448 1385615 1138053 1552951 1396878 1322596 1633756 901109 1434120 1276718
13886 1276718 1187899 1181434 1311222 1426523 1487053 1334859 1102940 1030595 1174361 1378254
$$ packed form
13956B167367L22089o38475L01417j79377q6690m8203Q2804N21481m68551L19908
13946B293770l46046O29316m00541l32455J2415J47892j7460K25375j84724l26003
13936A701539Q531J21063Q4197j92875j61971L78860k51722o1668J47320l3775
13926A739499k18565J65596R4259N3312k42425o281l65378N38017k28454J15823
13916A645403M9187R0497K4386k75716j71835j00618K94868o6607J25709P702
13906A622976l06521K65764L70766k59486k24428J110O149J90696K4715l41307
13896A350434L26014k90833k47562M14898j56073p4282L11160p32647N33011j57402
13886A276718q8819o465J29788J15301O0530j52194k31919p2345J43766K03893
$$ plain form
13876 1378254 1459690 1165015 1244457 1369589 1226010 1337060 1426040 1071911 1256125 1558542
13866 1558542 990975 1443576 1479137 1005065 1076974 1219614 1298226 1418309 1236499 1330579
13856 1330579 1180319 1059558 887382 1102338 1076475 916697 1104293 1016033 1138424 1153114
13846 1153114 1324971 817816 810958 1298647 1212468 1276826 833476 1127901 1048900 1066003
13836 1066003 1141174 938101 1048572 800662 1221356 1083818 688752 796790 1057313 893389
13826 893389 856661 1046832 748458 893569 773122 889299 1339443 930787 1072758 1084807
13816 1084807 1131471 916190 503340 869742 754165 719804 1191024 874319 901253 744593
13806 744593 269826 884764 962340 734007 618895 937987 894786 771311 722828 804885
$$ packed form
13876A378254Q1436k94675P9442J25132j43579J11050Q8980l54129J84214L02417
13866A558542n67567M52601L5561m74072P1909J42640P8612J20083j81810R4080
13856A330579j50260j20761j72176K14956k5863j59778J87596q8260J22391J4690
13846A153114J71857n07155o858M87689q6179O4358m43350K94425p9001J7103
13836A066003P5171k03073J10471k47910M20694j37538l95066J08038K60523j63924
13826H93389l6728J90171k98374J45111j20447J16177M50144m08656J41971J2049
13816A084807M6664k15281m12850L66402j15577l4361M71220l16705K6934j56660
13806G44593B69826O14938P7576k28333j15112L19092m3201j23475m8483Q2057
$$ plain form
13796 804885 928257 517587 876621 906410 775610 686283 861525 620745 938519 888147
13786 888147 1073456 701319 1043278 863109 894697 723655 687011 745694 699618 800372
13776 800372 676797 532770 631784 634323 668441 715367 1064838 1067440 825206 1019436 565084
13765 565084 980360 564077 1235185 824256 766715 517833 826627 661908 804357 500154
13755 500154 825704 549855 520756 962546 534163 987554 582349 691819 394988 547347
13745 547347 434667 685950 737463 550472 721746 618241 679195 609056 961490 793802
13735 793802 775875 587348 433200 455814 776461 398530 686264 773966 562065 629447
13725 629447 633272 783285 870040 483794 388518 417572 504742 735277 787717 729025 791275
$$ packed form
13796H04885J23372m10670L59034K9789j30800q9327J75242k40780L17774n0372
13786H88147J85309l72137L41959j80169L1588j71042l6644N8683m6076J00754
13776H00372j23575j44027R9014K539L4118M6926L49471K602k42234J94230m54352
13765E65084M15276m16283O71108m10929n7541k48882L08794j64719J42449l04203
13755E00154L25550k75849k9099M41790m28383M53391m05205J09470k96831J52359
13745E47347j12680K51283N1513j86991J71274j03505O0954p0139L52434j67688
13735G93802j7927j88527j54148K2614L20647l77931K87734Q7702k11901O7382
13725F29447L825J50013Q6755l86246r5276K9054Q7170K30535N2440n8692O2250
$$ plain form
13714 791275 510287 714404 561398 568446 598242 878991 559955 768763 688657 420458
13704 420458 959468 442383 423675 579441 922825 492287 750750 335111 389842 516713
13694 516713 686310 710926 392017 529640 415109 649736 507852 497422 861548 804091
13684 804091 685920 515854 955051 591609 544067 503478 299378 542780 460396 454695
13674 454695 715897 734633 578117 454374 353301 310513 548665 703633 500544 515203
13664 515203 536915 479639 328948 523620 328171 496366 505758 562319 752329 451514
13654 451514 463267 368974 502719 369735 494017 529153 578080 495008 555918 459108 671619
13643 671619 369624 805961 725698 467472 364252 484699 409682 542846 646795 285182
$$ packed form
13714G91275k80988K04117j53006P048K9796K80749l19036K08808q0106k68199
13704D20458N39010D42383j8708J55766L43384m30538K58463C35111N4731J26871
13694E16713J69597K4616l18909J37623j14531K34627j41884j0430L64126n7457
13684H04091j18171j70066M39197l63442m7542m0589k04100K43402q2384n701
13674D54695K61202J8736j56516j23743j01073m2788K38152J54968k03089J4659
13664E15203K1712n7276j50691J94672j95449J68195R392N6561J90010l00815
13654D51514J1753r4293J33745j32984J24282L5136M8927q3072O0910r6810K12511
13643F71619l01995M36337q0263k58226j03220J20447p5017J33164J03949B85182
$$ plain form
13632 580773 233184 722994 179095 579733 563529 459623 318369 626723 518529 262026
13622 262026 248986 597158 561814 487624 711494 159280 298416 461897 534855 382581
13612 382581 231678 572496 507597 179596 705087 616794 498896 496106 212612 585318
13602 585318 623013 513872 313339 366901 441043 455783 516106 210829 588847 506601 329814
13591 329814 392709 442689 427826 590899 580551 388715 386811 385857 451535 785521 263906
13579 442927 323130 444266 96903 407665 391036 339606 128504 353612 421039 407503
13569 407503 272896 511140 680476 631634 486711 195100 368302 113057 107127 357764
13559 357764 311089 446330 305843 181494 276846 204535 312492 136726 489342 447134
$$ packed form
13632E80773B33184M89810A79095M00638j6204j03906j41254L08354j08194k56503
13622B62026j3040L48172l5344p4190K23870A59280J39136J63481P2958j52274
13612C82581j50903L40818o4899A79596N25491q8293j17898k790B12612L72706
13602E85318L7695j09141k00533N3562P4142J4740O0323B10829L78018q2246j76787
13591C29814O2895M9980j4863J63073j0348j91836j904r54O5678L33986B63906
13579D42927j19797J21136I6903L10762j6629n1430A28504K25108O7427j3536
13569D07503j34607K38244J69336m8842j44923A95100J73202A13057n930K50637
13559C57764m6675J35241j40487j24349R5352p2311J07957A36726L52616m2208
$$ plain form
13549 447134 267990 387472 45402 386542 326366 273318 287251 230284 -52492 420092 151783
13537 111574 254893 232593 283493 570191 322689 323982 95432 420836 367158 156089 713309
13526 713309 160571 571397 314163 202668 252002 236113 482558 385548 175654 237082
13516 237082 364898 88883 396969 233413 368409 152329 -31994 217659 157952 41879
13505 270859 -5713 308955 388397 150787 67917 602234 -12236 338457 394403 82860 424229
13494 424229 220238 455772 303956 89793 331667 283151 330743 487582 443920 292509
13484 292509 279450 61376 712773 25242 543494 452703 325832 138744 134754 322851 347282
13473 347282 344527 279576 205361 370328 371667 83480 273964 375701 333997 33227 51423
$$ packed form
13549D47134j79144J19482D5402L41140o0176n3048J3933n6967e2492D20092A51783
13537A11574J43319k2300N0900K86698k47502J293I5432L25404n3678A56089N57220
13526G13309A60571M10826k57234j11495M9334j5889K46445r7010A75654O1428
13516B37082J27816H8883L08086j63556J34996A52329c1994B17659n9707D1879
13505B70859e713C08955P9442A50787F7917N34317a2236C38457N5946H2860L41369
13494D24229k03991K35534j51816H9793K41874m8516M7592J56839m3662j51411
13484B92509j3059F1376O51397B5242N18252r0791j26871A38744l990J88097K4431
13473C47282k755o4951p4215J64967J339H3480J90484J01737m1704C3227J8196
$$ plain form
13462 51423 619471 386089 290722 115405 235184 426636 552521 359156 -141167 184658
13451 272707 79612 561126 478078 208643 376097 128292 251156 135044 348703 93187
13440 341956 56988 16092 316349 240100 512887 59412 172055 76276 415956 85658 432200
13429 432200 607571 110197 447103 304562 196242 683447 283113 426465 156287 280272
13419 280272 503663 237992 281758 402715 -162972 231043 -217291 -151928 -22347 120870
13408 -96945 138634 -183524 222209 176091 319433 348300 41833 389089 233605 135418
13398 135418 230322 294989 191984 195284 248445 152774 132303 183697 41587 361691 64158
13386 146762 260349 97277 360653 -208479 408951 311717 321657 187548 301103 22730
$$ packed form
13462E1423N68048k33382r5367A15405J19779J91452J25885j93365a41167A84658
13451B72707G9612M81514q3048B08643J67454A28292J22864j16112K13659I3187
13440C41956E6988A6092L00257p6249K72787E9412J12643G6276L39680H5658L46542
13429D32200J75371A10197L36906j42541j08320M87205B83113J43352A56287J23985
13419B80272K23391B37992M3766J20957a62972B31043b17291O5363b2347A20870
13408i6945A38634a83524B22209m6118J43342K8867D1833L47256j55484r8187
13398A35418R4904O4667j03005L300N3161r5671k0471N1394D1587L20104F4158
13386A46762J13587I7277K63376b08479D08951r7234R940j34109J13555B2730
$$ plain form
13375 87629 129674 -326698 274024 358494 232496 97867 274115 392443 232383 522864
13365 522864 399387 234829 267626 92453 403786 -34252 377136 681 209317 521343 197640
13353 19910 297223 219524 90507 -136988 231721 483229 425817 520621 195416 461487
13343 461487 210533 257633 365705 116795 453378 476952 117352 189882 95639 243465
13333 243465 155823 318742 283319 208443 319242 342311 289554 150608 429311 -61708 -89045
13322 -89045 145261 170809 247627 695054 99318 397138 327628 273157 39304 281562 61641
13310 323151 178354 235919 -5935 364115 497777 30731 -29244 -170228 -36125 -182074 349375
13298 149383 177189 314136 286304 92024 149325 204327 -8591 54399 267570 246573 -94989
$$ packed form
13375H7629M2045c26698B74024Q4470j25998I7867J76248J18328j60060K90481
13365E22864j23477j64558L2797I2453L11333c4252C77136F81K08636L12026A97640
13353A9910K77313p7699I0507a36988B31721K51508n7412R4804A95416K66071
13343D61487B10533M7100J08072A16795L36583K3574A17352P2530r4243J47826
13333B43465q7642J62919l5423p4876J10799K3069n2757j38946K78703f1708k7337
13322h9045A45261K5548P6818M47427I9318K97820o9510n4471C9304K42258F1641
13310C23151j44797N7565e935C64115J33662C0731b9244j40984c6125j45949C49375
13298A49383K7806J36947k7832I2024N7301N5002h591E4399K13171k0997i4989
$$ plain form
13286 -37055 66700 316128 176508 121972 221352 241828 171726 40372 91077 335685 321288
13275 321288 164234 444635 360946 61830 231137 15342 -105080 106244 -192494 397648
13264 335448 351086 267751 79751 346656 69056 -196872 56009 484705 18975 -114678 180521
13252 24142 287468 227992 -20651 256510 123816 127981 351502 171127 197883 236838 219212
13241 219212 144554 -190277 259546 -62787 212487 147500 161776 419920 161030 19065
13230 165133 98795 154037 45194 46703 229657 -358775 -33069 76776 56296 23858 192893
13219 192893 254688 -65840 292966 93675 104589 35532 -3716 55557 189267 485329 125565
13207 111935 195782 61335 186806 152421 536243 -61929 251038 180087 -107265 -47858 6369
$$ packed form
13286c7055F6700K49428j39620n4536R9380K0476p0102D0372N0705K44608j4397
13275C21288j57054K80401q3689F1830J69307A5342a05080A06244a92494C97648
13264C35448J5638q3335G9751K66905F9056a96872E6009M28696A8975a14678A80521
13252B4142K63326n9476b0651B56510A23816M165K23521A71127K6756L8955j7626
13241B19212p4658a90277B59546f2787B12487o4987J4276K58144A61030A9065
13230A65133o6338N5242D5194J509J82954c58775c3069G6776k0480B3858J69035
13219A92893O1795f5840B92966I3675J0914C5532c716E5557J33710K96062A25565
13207A11935Q3847F1335J25471l4385L83822f1929B51038p0951a07265d7858F369
$$ plain form
13195 148852 147319 197287 88605 189380 324376 -227842 42006 235119 514930 177721
13184 390883 61149 132897 164093 -273388 204777 -6200 35954 -2042 25231 -72628 155768
13172 142925 -56027 207572 397970 388401 49647 124083 2097 281082 176973 155468 -10764
13160 254453 -108116 312889 -52244 275908 208986 76907 -118998 159134 57208 9874 197174
13149 197174 4585 255171 364503 136141 226401 16246 -82314 -106082 178367 161925 234045
13138 234045 -44203 367429 286920 273290 142831 -244611 -32468 65628 142480 -194080 238005
13126 -152403 295534 177975 375875 93674 368927 -21146 -114929 -29977 32773 -50001 -258465
13115 -258465 471224 -81345 116304 196818 341990 184323 45108 -284900 -14433 273684
$$ packed form
13195A48852j533M9968H8605J00775J34996b27842D2006J93113K79811A77721
13184C90883F1149P1748L1196b73388B04777f200C5954b042B5231g2628A55768
13172A42925e6027B07572J90398r569D9647P4436B097K78985j04109k1505a0764
13160B54453a08116C12889e2244B75908o6922G6907a18998A59134E7208I874J87300
13149A97174D585K50586J09332A36141R0260A6246h2314k3768A78367j6442P2120
13138B34045d4203C67429q0509j3630j30459b44611c2468F5628P6852a94080B38005
13126a52403B95534j17559J97900I3674K75253b1146r3783b9977C2773e0001k08464
13115b58465D71224h1345A16304Q0514J45172j57667D5108b84900a4433B73684
$$ plain form
13104 -186839 299344 23912 72900 256163 487076 163154 34566 345482 -55847 206797
13093 79291 342063 93771 -211998 111404 251117 73731 278651 236375 121233 -43050
13082 -179829 -283883 12253 124890 214480 129614 27818 11170 152693 -415447 117776
13071 31736 383490 14799 267288 134473 -60775 -139344 314129 197156 -101549 236807
13060 49754 -19744 86208 26231 363665 304713 187160 14705 -65893 -113963 104685 -138349
13048 294466 123782 -124674 -77637 4751 125590 49574 -266792 -58489 -38526 123224 42474
13036 1062 8945 96000 -203584 9163 317172 -116569 160820 -232138 88763 67616 112235
13025 112235 246317 -44266 155229 124722 181991 -131604 8817 73836 -343409 6025 -30800
$$ packed form
13104a86839B99344B3912M8988J83263K30913A63154C4566L10916e5847B06797
13093G9291K62772I3771b11998A11404J39713G3731K04920m2276j15142d3050
13082a79829j04054A2253J12637Q9590q4866B7818A1170J41523d15447A17776
13071C1736L51754A4799K52489j32815f0775p8569C14129j16973a01549B36807
13060D9754a9744H6208B6231L37434n8952j17553A4705f5893m8070A04685a38349
13048B94466A23782a24674M7037D751J20839D9574b66792e8489J9963A23224D2474
13036A062P883Q7055b03584I163L08009a16569A60820b32138H8763k1147M4619
13025A12235J34082d4266A55229l0507N7269a31604H817O5019c43409F025c0800
$$ plain form
13013 222883 119750 27512 45768 -115336 -206549 13374 157786 329436 33015 135072
13003 135072 33185 131598 165164 100489 298435 28540 291568 281100 -145120 433500 126480
12991 113239 312285 -18232 272214 -277887 -185300 -82105 98746 -107387 -99316 278464 -66307
12979 130346 209706 5141 -31324 -43221 -52877 -95592 212567 67442 241524 235188 34107 58008
12967 58008 182249 -40072 212695 -35439 -180821 -136256 93031 273651 215741 117285 91290
12956 91290 -85092 128548 182732 -213277 -107819 -350323 -87651 -11033 76392 -99446 123129
12944 227975 550099 116509 147003 121344 231066 -57560 97575 -343353 312971 57132
12933 217754 152927 -227998 -91665 10325 343433 -74262 -44141 12256 187594 426928 -194028
$$ packed form
13013B22883j03133B7512J8256a15336r1213A3374J44412J71650C3015J02057
13003A35072C3185R8413L3566o4675J97946B8540K63028j0468a45120D33500A26480
12991A13239J99046a8232B72214b77887R2587h2105I8746a07387Q071B78464f6307
12979A30346P9360E141c1324j1897r656m2715B12567F7442J74082o336C4107K3901
12967E8008J24241d0072B12695c5439j45382M4565I3031J80620n7910r8456k5995
12956I1290h5092A28548N4184b13277J05458k42504h7651a1033G6392i9446A23129
12944B27975L22124A16509L0494k5659J09722e7560I7575c43353C12971E7132
12933B17754o4827b27998i1665A0325L33108g4262L0121A2256J75338K39334a94028
$$ plain form
12921 13785 6015 462425 396009 110518 127873 122977 172863 -236222 46618 -62821 60464
12909 31753 120092 217088 371841 -167482 -148525 49870 326015 190448 -37360 374181 162540
12897 120558 -208730 -50172 303245 -218571 -30396 159400 97292 -112291 -2802 186817
12886 88605 92527 62724 373367 389066 120007 241808 244141 24940 -132968 12027 75987
12875 75987 -19324 -125268 19267 -229515 -4501 -259316 402764 41644 249421 35831 -146934
12863 -161282 280007 108208 303690 77987 35995 16496 35705 26281 242841 104664 324442
12852 324442 56934 137328 -182949 -114768 -102873 -117162 170239 -215004 -194993 -295764 138338
12840 -105740 271904 -27565 179056 300489 168415 12074 12825 209618 57166 -469420 -72437
$$ packed form
12921A3785F015M56410o6416A10518J7355m896M9886b36222D6618f2821F0464
12909C1753Q8339R6996J54753a67482J8957D9870K76145j35567c7360C74181A62540
12897A20558b08730e0172C03245b18571c0396A59400o2108a12291b802A86817
12886H8605L922k9803L10643J5699A20007J21801K333B4940a32968A2027O3960
12875G5987a9324j05944A9267b29515d501k54815D02764D1644K07777C5831a46934
12863a61282B80007A08208J95482G7987C5995A6496J9209r424K16560A04664K19778
12852C24442E6934Q0394a82949O8181J1895j4289A70239b15004K0011j00771A38338
12840a05740B71904b7565A79056J21433j32074A2074P51J96793E7166d69420g2437
$$ plain form
12828 122959 127057 209273 19211 150766 -185802 194626 -135684 338282 17711 -226314
12817 122592 111125 -29244 -124965 -69379 -40283 -66435 -35643 114619 21332 -84284 140471
12805 -39974 28991 306446 -16210 -254314 54872 -39758 173323 -151358 108608 -139853
12794 139605 -112799 -90760 170826 -215004 96242 167564 346573 362410 74189 14935 -77208
12782 422563 280206 -65166 -9141 -226804 -81886 145638 -43569 -4271 -48187 -154288 41701
12770 -14898 -50575 204954 -194042 4958 80547 -98171 65243 93663 110002 275977 -183489
12758 709604 29697 23401 -152812 249576 145238 548093 164099 86217 -64056 -116354 117052
12746 -24660 -145191 169529 140544 40592 215393 119422 -56147 84884 115662 -54417 73441
$$ packed form
12828A22959M098Q2216A9211J31555a85802A94626a35684C38282A7711b26314
12817A22592j1467b9244r5721N5586K9096k6152L0792A14619B1332h4284A40471
12805c9974B8991K77455a6210k38104E4872c9758A73323a51358A08608a39853
12794A39605a12799K2039A70826b15004I6242P1322J79009J5837G4189A4935g7208
12782D22563j42357f5166i141k17663h1886A45638d3569d271m3916j06101D1701
12770a4898l5677B04954a94042D958P5589i8171F5243K8420J6339J65975a83489
12758G09604B9697o296a52812B49576j04338M02855A64099p7882f4056n2298A17052
12746b4660j20531A69529k8985D0592J74801r5971e6147H4884L0778e4417G3441
$$ plain form
12734 -40341 -87039 28626 82319 -42954 26825 263450 52438 273415 -31250 306434 268342
12723 268342 -147916 -144832 70616 92130 -83967 46771 85535 21553 75607 -242651 435829
12711 37325 41238 -139866 191563 270516 392428 117958 112392 206852 322462 425590 45286
12699 -59277 -111037 122865 -241082 225488 56968 -20241 -62934 183891 121482 -308392 -66762
12687 155630 163103 265141 141648 -55275 75115 -355081 402210 123909 478078 49699
12676 38442 257685 -57296 -4087 -117047 307467 -264874 282110 173893 -183722 164274
12665 153349 -8477 -115570 187707 -410870 68033 181696 166830 57929 -16294 253675 388005
12654 388005 411633 278243 -1438 218490 174365 -114412 -26703 175214 270803 -31589 164098
$$ packed form
12734d0341m6698B8626N3693d2954B6825K36625E2438K20977c1250C06434l8092
12723B68342a47916L084G0616K1514h3967D6771L8764B1553N4054b42651D35829
12711C7325L913a39866A91563P8953J21912A17958n566R4460J15610J03128D5286
12699e9277n1760A22865b41082B25488E6968b0241m2693A83891o2409c08392f6762
12687A55630P473J02038j23493e5275G5115c55081D02210A23909L54169D9699
12676C8442K19243e7296d087j12960C07467b64874B82110j08217a83722A64274
12665A53349h477j07093A87707d10870F8033J13663j4866E7929a6294B53675J34330
12654C88005K3628j33390a438B18490m4125a14412b6703A75214R5589c1589A64098
$$ plain form
12642 96433 71129 -87997 117723 227899 -19015 321072 659 -318120 223465 -45832 205997
12630 228130 119120 -170963 126587 218141 49004 192676 -14139 584403 188832 426624
12620 426624 85138 210971 151082 103153 68094 -59193 -32006 115322 -108396 95472 107464
12609 107464 128354 101324 -10084 227909 144989 35150 46030 245862 181426 187226 -177554
12597 10652 147741 -22103 455699 212971 -427093 -6304 -18506 -167775 296772 13180 112695
12586 112695 61544 33532 -295068 -98737 6035 -99777 32984 125640 153519 365827 95258
12574 152096 -95171 -108630 39983 238824 207891 184191 37871 -66597 -140715 404352 -31057
12562 145279 44633 28347 -216137 -37184 -144861 -256673 109475 -21353 -46255 170394
$$ packed form
12642I6433k5304h7997A17723J10176a9015C21072F59c18120B23465d5832B05997
12630B28130j09010a70963A26587R1554D9004J43672a4139E84403A88832K37792
12620D26624H5138J25833n9889m7929l5059e9193K7187A15322a08396I5472J1992
12609A07464K0890k7030a0084B27909q2920C5150J0880J99832o4436N800a77554
12597A0652J37089b2103D55699B12971d27093f304j2202j49269B96772A3180R9515
12586A12695n1151k8012b95068i8737F035i9777C2984R2656K7879K12308I5258
12574A52096i5171j3459C9983J98841l0933k3700C7871f6597p4118D04352c1057
12562A45279D4633j6286b16137c7184j07677j11812A09475b1353k4902A70394
$$ plain form
12551 -70399 -216131 -112695 -76093 372956 344104 95225 128406 -217849 -83406 -174963 78792
12539 -135461 275861 564815 -288614 -101786 -40592 -106861 392884 209605 -62579 -98553
12529 -98553 -15604 -236498 -213162 162494 -187784 102289 234821 -136030 -141248 231715
12518 -48479 -208300 59024 -61129 -13258 109944 143117 -177459 -236759 228274 -32274 33326
12506 -140692 -61723 109293 100128 48050 -75871 47774 128139 -102339 -307616 -5835 -42867
12495 -42867 -19856 -57260 281250 253922 284772 -420137 454755 -222632 389803 -275895
12484 114168 91077 -98696 -179525 -127940 274914 139192 88729 -115225 83469 -110782 -11241
12472 97047 36066 -200221 62463 -126256 -141168 82293 4221 -53746 -165068 -92307 -190230
$$ packed form
12551g0399j45732J03436L6602C72956k8852I5225L3181b17849h3406r1557G8792
12539a35461B75861K88954b88614a01786d0592o6269C92884j83279f2579l5974
12529i8553a5604k20894K3336A62494a87784A02289J32532a36030n218B31715
12518d8479j59821E9024f1129a3258A09944L3173a77459n9300B28274c2274C3326
12506a40692f1723A09293r165D8050g5871D7774Q0365a02339k05277e835l7032
12495d2867a9856l7404B81250k7328L0850d20137D54755b22632C89803b75895
12484A14168k3091i8696q0829N1585B74914j35722n0463a15225H3469a10782a1241
12472I7047C6066b00221F2463a26256j4912H2293D221e3746j11322P2761r7923
$$ plain form
12461 -190230 -203083 84911 -250815 -13781 199246 -128638 -153011 87126 -71949 -76276 -82892
12450 -82892 79215 158762 111046 121040 26151 -213911 -403857 -176198 13448 -120306 440861
12438 65800 -132172 27100 131850 11130 -152131 -115188 -108815 171211 127281 27392 -4432
12426 223774 75900 -45909 74509 -199272 -120781 -501464 246879 -86976 34459 156830 -289166
12414 -66622 8948 -216610 84422 86699 -100075 -241438 -194047 230738 -175229 273795 44472
12402 313424 214899 43641 -27712 214154 -41851 -28293 65330 -87087 -27042 16773 -46235
12390 -18953 -14644 51704 -9091 195455 -122475 -163195 -205638 -49615 -182736 16110 -31237
12378 62063 63689 62324 225304 -118432 -300272 87039 -332232 -235651 219490 -152798 -40443
$$ packed form
12461a90230j2853H4911b50815a3781A99246a28638k4373H7126g1949m327o616
12450h2892G9215P9547m7716R994B6151b13911j89946a76198A3448a20306D40861
12438F5800a32172B7100J04750A1130a52131L6943O373A71211m3930B7392d432
12426B23774G5900d5909G4509a99272P8491l80683B46879h6976C4459J22371b89166
12414f6622H948b16610H4422K277a00075j41363M7391B30738a75229B73795D4472
12402C13424r8525D3641b7712B14154d1851J3558F5330h7087b7042A6773d6235
12390a8953M309E1704i091A95455a22475m0720m2443d9615j33121A6110c1237
12378F2063J626j365J62980a18432j81840H7039c32232R6581B19490a52798d0443
$$ plain form
12366 -153024 91882 32291 -32200 295605 1591 -130691 -456442 22837 14009 92611 -41243
12354 -80826 -144420 120532 109638 26528 -13598 160072 -120702 177571 224917 32273 140439
12343 140439 293958 -70978 29456 255461 153198 90940 -19116 172837 14456 -213073
12332 32952 -276210 87517 -21237 -69256 118657 36341 -193672 164274 -319770 24204 -265211
12320 -27585 -336553 176394 506774 72474 60251 235197 28888 186634 -54900 -190433
12310 -190433 -422309 -156472 13201 -193050 234660 126411 125843 -13290 92739 19908 249878
12299 249878 11300 -195687 163782 12762 44940 36508 -39851 111685 105671 -108541 60979
12287 33128 176387 175639 58321 155477 -111313 79416 93482 501492 -169526 85325 -47861
$$ packed form
12366a53024I1882C2291c2200B95605A591a30691l25751B2837q828P8602d1243
12354h0826o3594A20532j0894B6528a3598A60072a20702A77571M7346C2273J08166
12343A40439J53519g0978B9456K26005j02263o2258a9116A72837A4456b13073
12332C2952b76210H7517b1237m8019A18657C6341a93672A64274c19770B4204b65211
12320b7585l08968A76394L30380G2474j2223J74946B8888J57746e4900j35533
12310a90433k31876a56472A3201a93050B34660j08249n68a3290I2739A9908K29970
12299B49878A1300a95687A63782A2762L2178q432c9851A11685o014a08541F0979
12287C3128J43259p48E8321R7156a11313G9416J4066M08010a69526H5325d7861
$$ plain form
12275 122250 64952 -19807 549103 20300 51388 239826 -118723 200626 -336742 -160159
12264 -20003 148072 5369 -78793 -80047 -205797 317505 139849 179240 -271094 389895 150639
12252 47978 184248 130775 119990 184291 37172 325658 158313 -84990 -232756 134572 175862
12241 175862 70265 251900 69713 149450 -53707 217906 -89151 -382677 5978 228811 13057
12229 256310 239184 154964 -78823 436102 310802 -17342 292406 -153707 -41972 81853 166636
12218 166636 -8324 178874 189001 43358 385747 106256 -5486 -256665 -114142 227144 361281
12207 361281 -167474 442207 88965 46721 -159832 242165 47653 112901 164369 149088 253386
12196 253386 292296 58204 118030 339853 -28816 153210 116672 471971 308888 258002 159472
$$ packed form
12275A22250n7298a9807E49103B0300L1088J88438a18723B00626c36742a60159
12264b0003A48072E369g8793j254j25750C17505A39849L9391b71094C89895A50639
12252D7978J36270n3473j0785O4301C7172K88486A58313h4990j47766A34572M1290
12241A75862G0265J81635F9713P9737e3707B17906h9151k93526E978K22833A3057
12229B56310j7126q4220g8823D36102j25300a7342B92406a53707d1972H1853Q4783
12218A66636h324A78874J0127D3358L42389A06256e486k51179a14142B27144J34137
12207C61281a67474D42207H8965m2244a59832B42165D7653O5248N1468j5281J04298
12196B53386L8910E8204N9826K21823b8816A53210l6538L55299j63083n0886r8530
$$ plain form
12185 159472 62955 111222 126939 282242 59465 200011 128183 120991 -11691 -31288 329919
12173 31031 -77815 38253 137429 129166 462162 102916 145697 250739 164993 309363 206732
12162 206732 -123881 48125 142440 96278 59493 -47263 27197 -188037 177686 87567 176576
12151 176576 -48269 -99255 85033 37612 71124 301076 349221 77448 381590 -133152 162139
12139 133285 -116742 327497 38314 -157288 10188 -58831 112679 14580 74704 45906 -52936
12127 81330 -103072 70834 -36885 154458 282976 -261168 91386 89456 -278324 310381 -17712
12115 62078 -290685 22389 -387827 -36224 -4983 26842 -279719 -16127 -217642 -185243 22355
12103 -206953 -185124 401585 99128 -133351 -34114 211193 -695743 62068 -196027 -249303
$$ packed form
12185A59472F2955M8267J5717J55303E9465J40546p1828p192a1691j9597C29919
12173C1031g7815C8253R9176q263L32996A02916M2781J05042q5746J44370j02631
12162B06732a23881D8125R4315m6162l6785d7263B7197a88037A77686H7567Q9009
12151A76576d8269n0986H5033C7612L3512K29952M8145G7448L04142a33152A62139
12139A33285a16742C27497C8314a57288A0188e8831A12679A4580O0124k8798e2936
12127H1330a03072G0834c6885A54458J28518b61168I1386j930b78324C10381a7712
12115F2078b90685B2389c87827c6224d983B6842b79719a6127k01515L2399B2355
12103b06953K1829D01585I9128a33351c4114B11193f95743F2068a96027n3276
$$ plain form
12093 -249303 -290819 58103 -243216 91217 83956 -143884 -2129 -106741 -299597 -43780 112737
12081 -126755 -296559 236877 264535 988077 2058152 894772 263026 -151671 219350 -46390
12070 -19745 276743 125692 -17997 -91207 -187124 5937 401983 544926 79046 -277852 328224
12058 127053 309891 -35947 18639 12336 193554 -161265 -113239 -162611 -13586 26869 29306
12047 29306 -252110 8735 105523 -66361 -180652 179974 -23955 133555 -154105 71278 174767
12036 174767 -280937 -45590 -53232 -184001 -223304 -62474 -95796 185670 -138170 83681 104843
12025 104843 -232205 -83376 7758 223994 -241069 256175 -76202 247789 -157304 62238
12014 54995 13212 135546 352486 -127353 -41463 -21103 143763 100640 -88565 -196634 161529
$$ packed form
12093b49303m1516E8103b43216I1217p261a43884b129j04612j92856d3780A12737
12081a26755j69804B36877K7658P23542J070075H94772B63026a51671B19350d6390
12070a9745B76743A25692a7997p3210r5917E937L96046J42943G9046b77852C28224
12058A27053J82838c5947A8639o303J81218a61265M8026m9372a3586B6869K437
12047B9306b52110H735R6788f6361j14291A79974b3955A33555a54105G1278J03489
12036A74767b80937d5590p642j30769l9303f2474l3322A85670a38170H3681K1162
12025A04843b32205h3376G758K16236b41069B56175g6202B47789a57304F2238
12014E4995A3212J22334K16940a27353d1463K0360A43763m3123h8565j08069A61529
$$ plain form
12002 148761 -114063 -161680 -78465 -42078 19786 39997 131617 -295210 -92144 118956 62944
11991 62944 -105537 -27256 25218 70927 -57351 -91464 -72950 -38213 209362 48772 -97006
11979 85656 165803 272728 -182793 -166012 28791 146170 -19951 -133898 -344584 72414 46874
11968 46874 25022 37138 111571 25819 -70637 -251684 -47206 -239293 210441 74755 -9031
11956 -136656 -45350 19918 154958 80188 61488 71400 -200145 -395552 111489 -213824 -87368
11944 214797 -41723 206829 -161698 -90703 72321 -28654 27447 -176187 264511 -272406
11933 8827 128334 -2361 -51271 -173198 -117609 253518 -125535 94408 240847 -105181 20374
11921 -164461 199143 -159881 207948 180345 345416 -50392 152175 -99790 231429 -354059
$$ packed form
12002A48761a14063m7617g8465L6387A9786K0211R1620b95210i2144A18956n6012
11991F2944a05537b7256B5218M5709e7351l4113J8514L4737B09362D8772i7006
11979H5656Q0147J06925a82793J6781B8791J17379a9951j13947k10686G2414k5540
11968D6874k1852J2116P4433B5819g0637j81047d7206j92087B10441G4755i031
11956a36656d5350A9918J35040p4770j8700R912b00145j95407A11489b13824h7368
11944B14797d1723B06829a61698P0995G2321b8654B7447a76187B64511b72406
11933H827J19507b361m8910j21927N5589B53518a25535I4408J46439a05181B0374
11921a64461A99143a59881B07948k7603J65071e0392A52175i9790B31429c54059
$$ plain form
11910 347677 -24119 -198684 -22913 -205373 70280 -17224 -90278 -233085 -138609 -129585 173478
11898 228738 212983 -52066 -22634 -62151 -75510 118546 294203 234235 -23839 45241 -164935
11886 -130125 248186 -145154 -28702 240400 -11950 124915 96639 -116359 -245730 142120
11875 123176 -247604 -196929 -53820 38656 326125 -208466 -340309 -363048 -15623 -68652 -123438
11864 -123438 -245075 -166985 103512 -158913 -31019 19614 341640 -17431 -80149 131472
11853 146747 -142892 66147 36670 -82685 -251574 -201820 -307858 335362 -91004 -115072 -149561
11842 -149561 286275 -173816 18752 105854 -13086 -412126 168508 -156050 -185453 167938
11831 -235538 39395 -12968 144144 136479 -3188 105733 -34010 -208466 89090 150593 -266208
$$ packed form
11910C47677b4119j74565b2913j82460G0280a7224p3054j42807R4476R024A73478
11898B28738j5755e2066b2634l9517j3359A18546J75657n9968b3839D5241a64935
11886a30125B48186a45154b8702B40400a1950A24915k8276a16359j29371A42120
11875A23176b47604N0675e3820C8656K87469b08466j31843k2739a5623n3029n4786
11864a23438j21637P8090A03512a58913c1019A9614L22026a7431o2718A31472
11853A46747a42892F6147k9477h2685j68889M9754j06038C35362i1004k4068l4489
11842a49561B86275a73816A8752Q7102a3086l99040A68508a56050k9403A67938
11831b35538C9395a2968A44144p665c188A05733c4010j74456H9090O1503b66208
$$ plain form
11819 -181680 141403 47724 -206623 -148362 109421 -75688 -87595 266117 -178018 -36686
11808 319171 -72947 -247573 85719 41393 162212 -23345 -288714 152329 173956 318355
11798 318355 182079 131929 188959 -189200 -344291 116043 -15571 159015 62953 -156327
11787 16826 -349147 382999 -117792 261744 -180960 -70037 45998 -156392 -2942 125762
11776 51098 277401 449388 -191566 224519 54390 -113563 -75513 55904 -323175 98997
11765 -525005 -144007 259280 269142 48975 284381 64726 -58172 7051 -392458 -3049 -28631
11754 -28631 218895 -154047 96904 169299 42696 -48816 -170742 -69040 318514 -240132 44836
11742 -15471 18420 -148609 -39416 -80586 -299036 -162561 103564 -240761 2642 258591 185940
$$ packed form
11819a81680A41403D7724b06623N8261A09421g5688j1907B66117a78018c6686
11808C19171g2947j74626H5719D1393J20819b3345k65369A52329K1627J44399
11798C18355j36276n0150N7030a89200j55091A16043a5571A59015F2953a56327
11787A6826c49147C82999a17792B61744a80960g0037D5998a56392b942A25762
11776E1098K26303J71987a91566B24519E4390a13563L8050E5904c23175I8997
11765e25005a44007B59280R862D8975K35406F4726e8172G051c92458c049k5582
11754b8631B18895a54047I6904P2395D2696d8816j21926f9040C18514b40132D4836
11742a5471A8420a48609c9416m1170k18450J36475A03564b40761B642K55949p2651
$$ plain form
11731 185940 61125 -231562 -56893 -111002 -211923 -315075 55443 235441 -116242 390103
11720 38345 -118468 -193477 -3286 -32061 -24369 51549 -62404 34070 -156451 5610 260270 145789
11708 145789 115937 -9357 -164558 112573 73522 180422 -112500 167296 32122 7169 84625
11697 84625 178991 185436 5839 -162982 265204 -105947 -254505 352302 129043 187487 -128174
11685 52630 35830 449586 355453 19956 -124913 19575 125646 233529 -22799 -235431 -13098
11673 65995 -24048 -44624 97187 383952 -17575 -66117 -31434 -183626 -198861 61034 53521
11662 53521 49480 -76880 215711 172831 -61523 -272124 129501 -94068 172720 -312459 11353
11650 -92568 375647 9952 -89492 -14465 -15201 -318136 -323896 -158965 -73291 -21882 -149735 -313240
$$ packed form
11731A85940F1125b31562e6893n4109j00921j03152E5443J79998a16242C90103
11720C8345a18468p5009c286k8775P692E1549f2404C4070a56451E610K54660j14481
11708A45789k9852i357j55201A12573l9051J06900a12500A67296C2122G169P7456
11697H4625R4366O445E839a62982B65204a05947j48558C52302A29043N8444a28174
11685E2630j6800M13756r4133A9956a24913A9575J06071J07883b2799k12632a3098
11673F5995b4048k0576I7187K86765a7575m8542c1434j52192j5235F1034p513
11662E3521m041g6880B15711m2880f1523k10601A29501i4068A72720c12459A1353
11650i2568C75647I952h9492a4465p36l02935n760a58965g3291b1882j27853j63505
$$ plain form
11638 -313240 -23099 -105171 354575 210704 74492 274677 -38086 41559 253648 37757 -216548
11626 217513 92265 -57180 244872 276024 174526 103537 -9682 73800 77425 -4789 -377667
11615 -377667 -130725 334414 -145308 -166852 149862 20319 -136238 46070 -194424 61952
11604 76667 -105441 -70505 193739 255945 57918 -164797 236408 103672 126011 119482 99012
11593 99012 -151432 84891 -67248 264875 131614 -129693 1668 29412 -1755 423943 242495
11582 242495 283808 80033 -30958 193535 -42900 178549 136675 274036 -244850 212416
11571 106543 485078 27944 -38108 -254646 410856 29964 112011 293704 151544 536473
11561 536473 -111776 -66068 23728 327295 144889 -213633 -64377 143228 117201 156241
$$ packed form
11638c13240b3099q2072C54575j43871G4492K00185c8086D1559K12089C7757b16548
11626B17513I2265e7180B44872L1152j01498p0989i682G3800L625d789l72878
11615c77667a30725C34414a45308k1544A49862B0319a36238D6070a94424F1952
11604G6667a05441L4936A93739O2206E7918a64797B36408A03672K2339o529k0470
11593I9012a51432H4891f7248B64875A31614a29693A668K7744a755D23943j81448
11582B42495M1313H0033c0958A93535d2900A78549m1874J37361b44850B12416
11571A06543L78535B7944c8108k16538D10856B9964Q2047J81693j42160L84929
11561E36473a11776M5708B3728L03567A44889b13633f4377A43228k6027L9040
$$ plain form
11551 156241 127696 380168 -370408 279328 56128 259033 -123516 -65071 196664 40182
11540 -93526 353655 -61801 96054 90514 287661 23160 33565 35497 143149 96213 -102304
11528 150646 -421886 -28698 -102049 43729 18104 136571 -83671 67516 -352547 104675 -108069
11516 131885 227025 176132 137458 176950 -37806 141973 227434 184713 -12497 -340462 257154
11504 71083 107168 90738 248674 -63452 112124 201409 177346 458177 -60574 138767 225583
11493 225583 -7907 223675 250406 92193 124284 -95423 172053 312499 224980 311339 180441
11482 180441 134072 31992 201793 -14362 163403 43076 45005 498559 183143 157368 -43622
11470 209657 311227 107767 42522 106267 -140944 208920 200292 110684 32233 5797 351694
$$ packed form
11551A56241k8545K52472c70408B79328E6128K02905a23516N8445A96664D0182
11540i3526C53655f1801I6054n540J97147B3160J0405J932J07652m6936a02304
11528A50646d21886b8698p3351D3729A8104J18467h3671F7516c52547A04675a08069
11516A31885R5140n0893l8674L9492c7806A41973Q5461m2721a2497l27965B57154
11504G1083L6085j6430J57936f3452A12124Q9285k4063K80831f0574A38767Q6816
11493B25583g907B23675K6731I2193L2091i5423A72053J40446q7519Q6359j30898
11482A80441m6369C1992J69801a4362A63403D3076J929M53554A83143k5775d3622
11470B09657J01570A07767D2522O3745a40944B08920q628q9608C2233E797L45897
$$ plain form
11459 351694 81688 206859 368960 -44132 -185692 160274 365348 -9952 -34675 149504
11448 142217 137900 433592 142980 147583 -34617 -33385 -225042 271389 -114173 165517 -26077
11436 178649 251580 226254 -127863 337984 418031 162930 171478 124033 -101902 -149629 -32267
11424 340701 23676 -96614 -119557 169434 35286 -183868 10003 -117726 192692 -215669
11413 158689 -145694 -103645 95326 -308736 -347347 -58339 94117 -105861 2575 161970 336964
11402 336964 -194606 156692 -232653 193117 128924 78153 13238 -3280 75837 30666 95187
11391 95187 -103335 99103 -80850 -67402 -175070 167243 187500 300505 5091 -35970 145877
11379 -73390 501355 -92941 96955 -13799 -79671 60510 -44562 -211063 -270183 -322620 -28387
$$ packed form
11459C51694H1688J25171J62101d4132j41560A60274K05074i952k4723A49504
11448A42217m317K95692A42980M603c4617J232j91657B71389a14173A65517b6077
11436A78649P2931k5326a27863C37984Q0047A62930Q548m7445a01902m7727c2267
11424C40701B3676i6614k2943A69434C5286a83868A0003a17726A92692b15669
11413A58689a45694M2049I5326c08736l8611e8339I4117a05861B575J59395J74994
11402C36964a94606A56692b32653A93117o4193n0771A3238c280G5837C0666O4521
11391I5187a03335I9103h0850J3448j07668A67243K0257J13005E091c5970A45877
11379g3390E01355i2941I6955a3799o5872F0510d4562j66501n9120n2437b8387
$$ plain form
11367 32307 -267852 -217815 164625 79249 -13274 -18758 91281 -282940 -163352 137527 -32602
11355 130465 163994 13242 -153996 -76462 -65418 241327 164323 -146839 229911 233965 290201
11344 290201 64061 -94651 7931 -112126 -23353 -93084 204492 29302 122665 214476 -212489
11332 -57577 107237 14775 -49534 32748 -136813 184993 -47618 137768 142812 -39386 238670
11320 239220 23169 -103801 -60540 -44210 -181451 -40096 -228768 -377 -49399 26044 111122
11309 111122 -380353 243520 287786 -110752 -13951 -131569 11041 24197 -272747 60950
11298 -88102 -327901 213335 106599 68728 -68995 96884 -91746 -184966 132514 -235606 -1975
11286 -354398 124115 -181163 -43042 -41858 322694 127394 -37586 -167662 48393 -335291
$$ packed form
11367C2307b67852N0037A64625G9249a3274n484I1281b82940J19588A37527c2602
11355A30465L3529A3242a53996g6462J1044B41327p7004a46839B29911M054N6236
11344B90201F4061i4651G931a12126b3353o9731B04492B9302R3363R1811b12489
11332e7577A07237A4775d9534C2748a36813A84993d7618A37768N044c9386B38670
11320B39220B3169a03801M3261J6330j37241d0096j88672c77m9022B6044Q5078
11309A11122c80353B43520M4266a10752a3951j17618A1041J3156b72747F0950
11298h8102k39799B13335A06599l7871f8995I6884i1746r3220A32514b35606a975
11286c54398A24115a81163d3042J184C22694A27394c7586j30076D8393c35291
$$ plain form
11275 -66134 -176133 -502339 -14975 14530 -323816 93740 -198067 -125314 -98958 116494 167548
11264 167548 -417228 -255132 105793 66555 -208858 48188 -258693 -366447 -26251 -133853
11254 -133853 -199668 -279937 178889 78797 -114373 -205357 170743 36466 -154787 -292364
11244 -292364 279009 136553 -137011 -123389 -444376 -104482 -5282 -251255 87748 -140221
11233 157602 -432528 -265957 94668 303892 -141258 -206697 149792 265763 -94641 130697
11222 -180538 -182862 -30901 -116340 -68778 107413 -134838 -204409 129659 268000 165128 35721
11210 -193648 143744 27179 93074 -264083 -269858 -203878 -427582 -151390 78506 13612 189679
11199 189679 -215311 -36452 101394 -371 2644 -119192 185547 -187822 -129831 -382499 27555
$$ packed form
11275f6134j09999l26206a4975A4530c23816I3740a98067P2753K6356A16494N1054
11264A67548d17228J62096A05793l9238b08858D8188b58693j07754b6251j07602
11254a33853o5815q0269A78889G8797a14373r0984A70743C6466a54787j37577
11244b92364B79009A36553a37011J3622l20987a04482e282k45973H7748a40221
11233A57602d32528J66571I4668K09224a41258o5439A49792J15971i4641A30697
11222a80538k324c0901q5439M7562A07413a34838o9571A29659J38341j02872C5721
11210a93648A43744B7179O5895b64083n775O5980k23704a51390G8506A3612J76067
11199A89679b15311c6452A01394c71B644a19192A85547a87822N7991k52668B7555
$$ plain form
11187 -47261 372 261703 177866 -194601 -169240 51260 1573 -247264 150019 84012 -287994
11175 -441813 70641 141260 1934 -125554 151068 -155351 -219522 89335 141178 -18905 32737
11163 -312047 -68851 40271 89231 -372207 -17378 -20713 166170 -213328 -92356 95497 34899
11151 -4636 -61143 -153077 8562 81951 249094 235173 44826 -199561 -165202 -67192 200350
11139 -114082 -60282 -105167 -42139 149439 148539 -29116 -67333 264831 119323 -27661 626657
11127 -84197 71105 81793 327530 255481 69899 64812 232808 290987 117082 -49261 -87832
11116 -87832 260464 92698 -120279 82318 310400 97 70243 -295548 -20551 -169889 202141
11104 193626 -30776 349988 -406178 332763 249474 230 -117936 274168 206757 253071 -67027
$$ packed form
11187d7261C72K61331q3837a94601K5361E1260A573b47264A50019o6007b87994
11175d41813G0641P0619A934a25554A51068a55351o4171H9335N1843a8905C2737
11163c12047f8851D0271M8960c72207a7378l335A66170b13328i2356I5497C4899
11151d636n6507r1934H562P3389J67143j3921D4826a99561L4359f7192B00350
11139a14082N3800m4885d2139A49439r00b9116l8217B64831A19323b7661F26657
11127h4197G1105J0688K45737p2049F9899n087J67996N8179A17082d9261l8571
11116h7832B60464I2698a20279H2318K28082I7P0146b95548b0551j49338B02141
11104A93626c0776C49988d06178C32763q3289B30a17936B74168o7411M6314f7027
$$ plain form
11092 501620 156945 54581 136932 88050 455978 84814 -156633 35491 167538 -3994 91935
11080 219049 273434 83074 172342 481889 65464 155972 -72497 177633 105722 43061 301158
11069 301158 32713 -1939 376369 119742 529894 267474 528555 457103 338675 534670
11059 534670 305619 665485 415280 647604 904205 543818 479950 929254 611224 879771
11049 879771 513040 724648 953371 751964 650919 791310 607380 598095 926911 588600
11039 588600 478472 741312 751218 902868 725606 266775 558142 584238 228958 656619
11029 656619 640390 601899 297391 816192 321852 687976 887543 582607 266203 390440
11019 390440 430106 465590 569708 263676 90447 881613 532837 510189 429249 406640 326328
$$ packed form
11092E01620A56945E4581Q2351m8882L67928H4814a56633C5491J32047c994I1935
11080B19049N4385H3074Q9268L09547F5464R0508g2497A77633p1911D3061K58097
11069C01158C2713a939C76369A19742M10152k62420K61081p1452j18428J95995
11059E34670k29051L59866k50205K32324K56601l60387o3868M49304l18030K68547
11049H79771l66731K11608K28723k01407j01045J40391j83930r285L28816l38311
11039E88600j10128K62840R906J51650j77262B66775K91367K6096B28958M27661
11029F56619j6229l8491B97391N18801C21852L66124J99567l04936B66203J24237
11019C90440L9666L5484J04118B63676I0447P91166l48776k2648q0940k2609q0312
$$ plain form
11008 326328 568197 459252 443038 209364 649372 377668 732964 656117 1030919 670768
10998 670768 722688 723542 959622 691330 605204 775262 752949 445398 770843 730640 804470
10987 804470 628556 718793 857754 1253084 1096449 1094784 609248 1276473 1109038 1183303
10977 1183303 1765854 1680780 1581396 1919477 2064049 2544750 2517067 2639956 2542092 2228279
10967 2228279 2153105 1751600 1760127 1486550 1421016 1639868 1578982 1551429 1395350 2059592
10957 2059592 1491954 1678925 2063149 1569631 1257934 1276248 1224085 940593 1131256 644751
10947 644751 264926 586584 398805 517744 373561 -90363 294446 123541 -25778 474086
10936 94103 74211 174706 293365 38289 251195 2001 290020 217207 -4022 -12181 35913
$$ packed form
11008C26328K41869j08945j6214B09364M40008k71704L55296p6847L74802l60151
10998F70768N1920Q54K36080k68292q6126J70058k2313l07551L25445m0203P3830
10987H04470j75914R0237J38961L95330j56635j665m85536O67225j67435P4265
10977A183303N82551q5074r9384L38081J44572M80701k7683J22889r7864l13813
10967B228279p5174m01505Q527k73577o5534K18852o0886k7553j56079O64242
10957B059592n67638J86971L84224m93518l11697J8314n2163k83492J90663m86505
10947F44751B64926L21658j87779J18939j44183i0363B94446A23541b5778D74086
10936I4103j9892J00495J18659C8289K12906B001K88019p2813d022q159C5913
$$ plain form
10924 -249330 -193585 289582 33018 12015 59469 12591 -208886 313471 186786 -38585 56830
10912 -177759 62932 86561 140655 -84286 233970 170910 -72075 161245 28148 -78438 -169712
10901 -169712 -262911 27780 193353 152058 301093 59747 -295516 -67781 -46570 -234082 -110092
10889 242409 -125410 -345412 131170 -22263 -185335 -6084 376236 251572 -15665 -34781
10879 -34781 -6508 -121280 184958 -208752 -191402 -171840 -101729 129306 320445 270986 -34177
10867 27946 -123831 -188174 -15562 -213669 90282 -188329 73649 238251 -22558 92024 -18555
10855 -207744 -70482 63335 571618 171805 -207806 89408 53053 -327626 -241126 228501
10844 491211 -96533 -95013 -179409 -155916 272050 -11204 218276 -23350 -130673 98584 -216720
$$ packed form
10924b49330N5745B89582C3018A2015M7454A2591b08886C13471j26685c8585E6830
10912a77759F2932K3629N4094h4286B33970o3060g2075A61245B8148g8438r1274
10901a69712r3199B7780J65573m1295J49035E9747b95516f7781K1211j87512a10092
10889B42409a25410k20002A31170b2263j63072f084C76236j24664a5665j9116
10879c4781f508j14772A84958b08752J7350J9562P0111A29306J91139m9459c4177
10867B7946a23831o4343a5562j98107I0282a88329G3649J64602b2558I2024a8555
10855b07744g0482F3335N08283A71805b07806H9408l6355c27626Q6500B28501
10844D91211i6533J520q4396K3493B72050a1204B18276b3350j07323I8584b16720
$$ plain form
10832 243033 -37309 -113928 -172153 -61760 72469 -27263 32386 -169855 118914 14738 -252667
10820 144741 -120326 -154161 -281593 -178652 91457 -116395 -104928 134430 -249594 -152528
10810 -152528 4587 -380978 4440 -207347 -327679 -185611 131189 -106207 205643 60652
10799 -259169 16696 95990 -102158 -12818 129307 47996 166935 -154975 -151497 106958 242381
10788 242381 236625 -107976 -43745 -334268 65317 -47793 -269853 -130169 22554 2275 67643
10777 67643 -167348 -219532 77699 -155236 -75599 -38745 -160009 21452 358974 -36473 59306
10765 -267113 154405 -318141 -268857 -35879 121588 247325 -52591 -74638 -79317 -109963 9182
10753 3592 324055 224032 -93890 43786 -131221 -179197 161883 280917 -14288 222359 -200153
$$ packed form
10832B43033c7309p6619n8225f1760G2469b7263C2386a69855A18914A4738b52667
10820A44741a20326l3835j27432J02941I1457a16395J1467A34430b49594R7066
10810a52528D587c80978D440b07347j20332J42068A31189a06207B05643F0652
10799b59169A6696P9294a02158a2818A29307D7996J18939a54975L478A06958J35423
10788B42381n756a07976d3745k90523F5317d7793k22060a30169B2554B275O5368
10777F7643a67348n2184G7699a55236g5599L6854j21264B1452L37522c6473E9306
10765b67113A54405c18141M9284c5879A21588J25737e2591k2047m679l0646I182
10753C592L20463j00023i3890D3786a31221m7976A61883J19034a4288B22359b00153
$$ plain form
10741 -157132 120828 272388 -104252 -304264 -304204 -180465 35568 258343 8604 77156 493
10729 -129701 -92216 -45265 -82425 -247409 -38515 -1616 64781 15849 -226168 -63590 161250
10717 -56033 6122 -28400 36960 -121430 -263190 -79350 252491 115635 -166043 117466 148558
10706 148558 270724 -142357 -105483 -45900 6255 -97647 -22331 -34694 166653 -21924 31597
10694 -362839 -182201 -59176 -180311 -93908 324777 -54792 -301865 -101040 193784 -176275
10683 -58404 -259533 222080 237089 28307 -349955 5958 -263267 182657 4989 -129961 141353
10671 55153 -52170 -220386 15913 -313679 -125176 44559 -130123 77447 -84867 229559 -137014
10659 -181135 -1842 310056 -399767 174428 -101360 -89931 17601 -7478 293971 -248206 34999
$$ packed form
10741a57132A20828J51560a04252k00012O0J23739C5568K22775H604O8552D93
10729a29701L7485d5265l7160j64984c8515a616F4781A5849b26168f3590A61250
10717e6033F122b8400C6960a21430j41760g9350B52491A15635a66043A17466L1092
10706A48558J22166a42357L6874d5900F255i7647b2331j2363A66653b1924C1597
10694c62839J80638e9176j21135Q6403C24777e4792k47073a01040A93784a76275
10683e8404k01129B22080J5009B8307c49955E958b63267A82657D989a29961A41353
10671E5153e2170j68216A5913c13679a25176D4559a30123G7447h4867B29559a37014
10659a81135a842C10056c99767A74428a01360J1429A7601g478B93971b48206C4999
$$ plain form
10647 -188242 -89656 123353 -330026 -119815 -319732 107775 -63766 -315861 -93569 70014
10636 -22909 -17421 -82570 -260201 444978 -130020 -212280 -64072 49976 6983 63704 -95665
10624 134988 -155347 15339 27126 199830 -169768 -64388 -221914 -78957 -115517 111718
10613 -131890 -55773 -152461 110386 29833 -130824 38304 33914 283019 -297246 151626 143798
10602 143798 -177478 -111178 -198130 107639 -229598 34725 -31858 90711 -196788 -124948 172538
10590 -11449 -315785 -47656 -272879 -238623 -117161 -10344 -333559 -118776 64382 -114338
10579 106648 47573 105180 208376 -232200 54275 213292 15590 36411 -161281 -179624 45875
10567 -61376 227527 -169434 -295910 -195548 -140505 180082 -20509 -79940 89414 21796 54916
$$ packed form
10647a88242h9656A23353c30026a19815j99917A07775f3766k52095i3569G0014
10636b2909N488o5149j77631D44978a30020q2260f4072D9976F983N6721i5665
10624A34988a55347A5339J1787J72704a69768f4388j57526g8957l6560A11718
10613a31890e5773r6688A10386B9833a30824C8304m390K49105b97246A51626p828
10602A43798a77478O6300q6952A07639b29598C4725c1858I0711a96788P1840A72538
10590a1449l04336d7656k25223L4256a17161a0344l23215a18776F4382a14338
10579A06648D7573N7607J03196b32200E4275J59017A5590K0821a61281j8343D5875
10567f1376B27527a69434j26476J00362N5043A80082b0509n9431H9414B1796L3120
$$ plain form
10556 54916 -108820 197661 66433 216041 191637 -343605 17048 -146225 -116884 54385 248593
10545 248593 11499 3923 64309 -9208 -25767 250332 200756 -19065 189622 13652 -194526
10533 48596 -120035 188989 452059 -78916 54203 -9157 355014 -314224 -280860 -295399 -94681
10521 -23033 127774 156821 466798 52505 -219826 -283437 74271 -61426 204144 -230679 22661
10509 -208923 -272299 -189048 -285068 -131567 -70391 -25020 260676 -42234 127786 -137680 517383
10497 162348 -78901 89084 144367 -138952 -102254 69465 -116480 44218 -114036 213438 235121
10486 235121 -33501 129972 -150464 249113 330879 430946 293576 242653 422278 -81672
10475 -72810 -35889 154008 -138245 15385 -70805 123163 -83357 -32163 105482 349710 -264521
$$ packed form
10556E4916a08820A97661F6433J49608k4404c43605A7048a46225K9341E4385J94208
10545B48593A1499C923O0386i208j6559B50332m9576a9065A89622A3652a94526
10533D8596a20035A88989K63070g8916E4203i157C55014c14224L3364j4539i4681
10521b3033A27774K9047L09977E2505b19826o3611G4271f1426B04144b30679B2661
10509b08923o3376Q3251r6020a31567O1176b5020B60676d2234A27786a37680E17383
10497A62348g8901H9084N5283a38952L6698F9465a16480D4218a14036B13438K1683
10486B35121c3501A29972a50464B49113Q1766J00067j37370n0923J79625h1672
10475g2810c5889A54008a38245A5385g0805A23163h3357c2163A05482K44228b64521
$$ plain form
10463 256720 -29802 320970 -239041 -41282 -97671 -352960 -257081 -177926 -397874 57952 61086
10452 61086 -134019 -116874 29223 -237500 61934 -194002 -340264 -100151 158464 -69439
10441 -276691 -63464 298201 -169026 19292 159336 31976 -381965 -197099 -209400 179598
10430 148526 31357 -471412 -19865 -58064 44105 -138525 34294 21852 -150132 -32633 -148807
10419 -148807 -222201 -70846 -248649 -252929 75310 -172671 143589 -107133 118671 3054 42030
10408 42030 -31855 -64631 -124307 106410 4037 -231070 -172628 -15647 -17695 176543 -32400
10396 21266 60874 -485279 197391 255127 140241 -55615 44923 45487 426783 292672 266399
10385 266399 322527 -192335 128559 39755 108940 28294 62945 234155 223048 60959 -41488
$$ packed form
10463B56720b9802C20970b39041d1282n6389k55289R5879P9155k19948E7952L134
10452F1086a34019J7145B9223b37500F1934a94002j46262a00151A58464f9439
10441b76691f3464B98201a69026A9292J40044C1976c81965J84866j2301A79598
10430A48526C1357d71412a9865l8199D4105a38525C4294j2442a50132c2633j16174
10419a48807p3394g0846j77803m280G5310a72671A43589a07133A18671C054L8976
10408D2030c1855l2776n9676A06410D037b31070N8442a5647k048A76543c2400
10396B1266L9608d85279A97391N7736j14886e5615D4923N64L81296j34111k6273
10385B66399N6128a92335A28559C9755O9185B8294L4651J71210j1107F0959d1488
$$ plain form
10373 284800 -121858 527223 402146 233752 277287 35233 502387 326350 610775 191200
10362 226678 558937 146632 625935 141863 -117748 238198 422506 6571 324340 191340
10352 191340 223451 248622 408798 263217 562525 399095 -40296 404069 305937 298152 346786
10341 346786 214339 -20412 157846 50913 -19593 18149 466962 95033 -267021 250317
10330 189320 148622 226512 110296 85719 -246630 297946 306622 215808 62216 313747 192246
10319 192246 -28619 312847 55601 -95889 120051 265690 142582 -273722 105611 -440075
10308 62767 258821 -29355 94354 34592 -57314 -28536 -182857 -295968 -269816 164414 -123473
10296 -311803 -136998 347236 214179 152779 -22021 169220 2374 -81584 -69033 101097 -66958
$$ packed form
10373B84800a21858E27223j25077j68394M3535C5233M67154j76037K84425A91200
10362B26678L32259A46632M79303A41863a17748B38198J84308F571L17769j33000
10352A91340L2111K5171J60176j45581K99308j63430d0296D04069r8132p785M8634
10341C46786j32447b0412A57846E0913a9593A8149M48813I5033b67021B50317
10330A89320m0698P7890A10296k4577b46630B97946Q676r0814F2216K51531j21501
10319A92246b8619C12847E5601i5889A20051J45639j23108b73722A05611d40075
10308F2767J96054b9355I4354C4592e7314b8536j54321j13111K6152A64414a23473
10296c11803a36998C47236j33057o1400b2021A69220B374h1584J2551A01097f6958
$$ plain form
10284 -85449 -92444 122368 -15339 -229245 35512 -89948 64541 -248973 -207306 -163075 -68875
10272 -355960 533676 -237881 -142395 32785 241232 173104 -42910 430711 70765 90980 45425
10260 246522 271667 56859 285427 353138 407076 -77249 354741 170457 -70268 50755 216571
10249 216571 -46615 93735 227598 -46153 50089 -107128 -3589 -144405 -15149 -1346 23233
10237 -204038 -73951 -408454 24842 281207 -399943 53283 -133955 76448 16333 -36103 376899
10225 -290437 -1381 105381 94245 -183962 177165 301167 6951 -196318 -490 -360330 65756
10213 119198 -13814 -94574 -258322 -107212 -298392 272317 -72458 -332670 76916 160299
10203 160299 -302323 -73695 108880 -171756 323969 -51641 -271118 142371 212018 123967
$$ packed form
10284h5449o995A22368a5339k13906C5512h9948F4541b48973M1667M4231f8875
10272c55960E33676b37881R5486C2785K08447o8128d2910D30711G0765K0215D5425
10260B46522K5145E6859K28568O7711N3938g7249C54741A70457g0268E0755J65816
10249B16571d6615I3735J33863d6153E0089a07128c589j40816a5149a346B3233
10237b04038g3951l34503B4842K56365c99943E3283a33955G6448A6333c6103C76899
10225b90437a381A05381j1136a83962A77165J24002F951a96318d90l59840F5756
10213A19198a3814q0760j63748a07212j91180B72317g2458k60212G6916Q3383
10203A60299c02323g3695A08880a71756C23969e1641k19477A42371O9647q8051
$$ plain form
10193 123967 281873 -243849 -27971 64264 -525267 148253 127321 -293812 -91553 218492
10182 150622 -326192 235394 -121015 -68521 -95209 149106 -225809 -387944 234072 -146143
10171 -85289 -301081 217911 286397 47948 126433 13099 308153 -180862 -334107 -122151
10160 65837 -114957 -213783 12203 -8042 99531 -41646 -225674 16951 -73503 55710 -214563
10148 63892 134059 -268109 -308928 151610 -29623 -141966 -72488 121792 263678 110122
10137 -70710 95796 -31728 -371168 12579 316620 91758 -56074 91603 58410 -19189 249609
10125 -18962 -64901 4373 -90722 20917 89734 -303696 36940 219851 26974 -52373 57985
10113 -113305 -80563 -91924 -241934 -203581 99107 -311802 -191399 42734 -315327 -141079
$$ packed form
10193A23967J57906b43849b7971F4264e25267A48253k0932b93812i1553B18492
10182A50622c26192B35394a21015N2494k6688A49106b25809j62135B34072a46143
10171h5289k15792B17911O8486D7948P8485A3099K95054a80862j53245a22151
10160F5837a14957r8826A2203h042I9531d1646j84028A6951g3503E5710b14563
10148F3892P0167b68109m0819A51610b9623j12343O9478A21792J41886A10122
10137g0710I5796c1728l39440A2579L04041I1758e6074I1603l3193a9189B49609
10125a8962m5939D373i0722B0917O8817c03696C6940J82911B6974e2373E7985
10113a13305L2742j1361j50010L8353I9107c11802J20403D2734c15327a41079
$$ plain form
10102 8149 121857 72679 -47645 -331566 -218751 -424849 -132976 -65757 -258400 -6158 -324548
10091 -324548 4448 -138320 100496 -58759 -229019 -132477 -93728 240215 -313119 -289599 -70060
10079 -260265 -10224 -201083 -135138 -199012 -66753 203135 -136493 282513 129591 -112583
10068 -84162 -221455 -75465 319990 -233467 -7452 -123672 -118377 -300762 201468 -279682 -45727
10056 -51080 -165013 -161288 15283 57778 -169016 40592 -240291 -31635 28802 -91019 36236
10044 -303399 169647 -201946 -7063 -464881 74609 -262411 82370 -265092 -168532 187073
10033 -78832 139003 107166 -26471 -148379 6971 33246 -45176 -113836 194743 428876 -414389
10021 1732 -156359 281783 305836 -399198 192680 310147 63946 71943 -6802 -55049 40735
$$ packed form
10102H149J13708m9178d7645k83921J12815k06098a32976f5757j92643f158l18390
10091c24548D448a38320A00496e8759j70260R6542L8749B40215c13119K3520g0060
10079b60265a0224j90859O5945o3874f6753B03135a36493B82513A29591a12583
10068h4162j37293g5465C19990b33467g452j16220N295j82385B01468b79682d5727
10056e1080j13933L725A5283M2495a69016D0592b40291c1635B8802i1019C6236
10044c03399A69647b01946g063m57818G4609b62411H2370b65092R6560A87073
10033g8832A39003l1837b6471j21908F971K6275d5176o8660A94743K34133d14389
10021A732a56359B81783K4053c99198A92680J17467F3946P997f802m8247D0735
$$ plain form
10009 -358 -35692 121437 21087 62094 -331306 -28602 -15668 -255714 -43474 -50980 -83910 -355569
9997 -355569 124523 -63813 80633 -363027 -19950 -284777 319652 -300477 -160212 -98655
9987 -98655 -14757 5737 248868 3764 -126101 111028 110283 246834 104016 -226007 -124413
9976 -124413 -247222 149173 -95848 -112534 -209911 72024 -92023 98158 -150700 -106469 -278068
9965 -278068 53219 -136771 -301392 210833 126328 -105337 -123352 -44023 101185 -69956 -98696
9954 -98696 346351 349398 174374 42643 -31000 119138 -40909 17830 91715 130666 18490
9942 -122281 -265413 245076 247210 -371818 -182424 -285232 -38251 116837 -93009 128701
9931 123326 -25888 23542 -257462 -230143 233161 -95437 62571 -71601 60519 260309 -73731
$$ packed form
10009c58l5334A21437B1087M1007c31306b8602J2934k40046d3474p506l2930k71659
9997c55569A24523f3813H0633c63027a9950k64827C19652c00477J40265O1557
9987i8655a4757E737K43131C764a26101A11028p45J36551A04016b26007J01594
9976a24413j22809A49173i5848j6686r7377G2024i2023I8158a50700M4231j71599
9965b78068E3219a36771j64621B10833q4505a05337j8015d4023A01185f9956k8740
9954i8696C46351L047A74374D2643c1000A19138d0909A7830P3885L8951A8490
9942a22281j43132B45076K134c71818a82424j02808c8251A16837i3009A28701
9931A23326b5888B3542b57462K7319B33161i5437F2571g1601F0519J99790g3731
$$ plain form
9919 -28528 -116467 -148121 -375370 -19904 23386 -121358 36514 -335014 -268436 28433 -165566
9907 -127868 -4548 -55252 -165150 -344306 -210984 -34064 -168687 -75311 -90191 -216829 105532
9895 56533 -27330 -220129 113956 49001 -144606 -148978 -230992 -7357 154328 -205718 -427752
9884 -427752 -368845 -131865 -47055 -362888 -45681 108026 -477869 -343580 -277579 281897
9873 10490 31159 8203 -87505 45787 -122761 -126281 55743 -158681 -206410 -149254 -57760 -215452
9861 -215452 70482 36510 173502 -61095 -200824 -155164 -127961 -87754 38054 -95462 67474
9849 -22737 176233 -12452 -200819 259933 85973 -233562 63125 326354 49145 125134 166842
9838 166842 24850 78012 26964 124298 -312675 122347 51220 -153811 8603 -15691 -144893
$$ packed form
9919b8528q7939l1654k27249a9904B3386a21358C6514c35014O6578B8433a65566
9907a27868d548n0704j09898j79156J33322c4064j34623g5311j4880j26638A05532
9895E6533b7330j92799A13956D9001a44606m372q2014g357A54328b05718k22034
9884d27752N8907a31865d7055l15833d5681A08026d77869J34289O6001B81897
9873A0490K0669H203h7505D5787a22761l520E5743a58681m7729N7156e7760j57692
9861b15452G0482l3972J36992f1095j39729M5660K7203M0207C8054i5462F7474
9849b2737A76233a2452j88367B59933H5973b33562F3125K63229D9145P5989M1708
9838A66842B4850N3162B6964R7334c12675A22347E1220a53811H603a5691j29202
$$ plain form
9827 -144893 -195681 -50852 140335 -110789 -76105 -407512 -23000 169966 -75643 -118007 -138888
9816 -138888 -71398 2787 47285 -23514 193807 -42364 27658 -116706 -82973 127350 -43095
9804 -73747 -75046 312583 100660 256799 -223758 -4151 284622 119175 -135621 -132563 -34107
9792 56600 -135444 106761 -23600 -448397 -159121 86965 231280 -304386 -119359 -62702
9782 -62702 -99681 130691 250397 29066 43397 -220925 -357511 192512 -353519 -143472
9771 23412 -211586 -44382 -423631 7794 5189 -74166 -35936 -86355 -118626 250789 406394
9760 406394 -160832 119962 22481 244006 -272828 103741 49258 -261139 -307674 -17621
9749 -371589 50711 -133288 -215745 -31630 -205004 -263815 -221457 -115119 -100064 131587 -312719
$$ packed form
9827a44893n0788e0852A40335a10789L4684l31407b3000A69966g5643m2364k0881
9816a38888O7490B787M4498b3514A93807d2364B7658a16706L3733A27350d3095
9804g3747j299C12583A00660J56139b23758d151B84622A19175a35621L058c4107
9792E6600a35444A06761b3600m24797a59121H6965J44315c04386a19359N6657
9782f2702l6979A30691J19706B9066J4331b20925j36586A92512c53519a43472
9771B3412b11586d4382l79249G794k605g4166c5936n0419l2271B50789J55605
9760D06394a60832A19962B2481K21525b72828A03741D9258b61139m6535a7621
9749c71589E0711a33288q2457c1630j73374n8811M2358J06338J5055A31587c12719
$$ plain form
9737 -132241 19202 225244 173163 -9741 -111817 -206276 -590667 -157752 163882 -44344 56620
9725 3371 -330591 -295350 -206617 -144775 -1981 130635 -321389 64407 70296 105418 -205369 -398896
9713 -398896 -28106 250543 -272323 350403 193243 -94392 -11344 43936 171145 44528 -49463
9701 4808 105741 246170 -5322 327314 56959 125457 -97698 115917 76410 -92123 414627
9689 28430 -220078 79262 244343 -59261 -90066 -202998 -4550 -224336 -62562 28883 80719
9678 80719 -389332 -77582 105404 175237 -177756 -59263 -94034 -159775 -180245 242675 -5838
9666 -187355 266148 -137861 -125905 278882 -418483 63240 57245 38636 289887 -81226 -256460
9655 -256460 -155695 -21867 -96600 -22444 -22890 6913 -27819 -87970 -171534 33522 84825 -6153
$$ packed form
9737a32241A9202K06042n2081i741j02076r4459l84391a57752A63882d4344E6620
9725C371c30591L5241Q8733O1842a981A30635c21389F4407N889L5122b05369j93527
9713c98896b8106B50543b72323C50403j57160i4392a1344D3936J27209D4528d9463
9701D808J00933J40429e322C27314E6959O8498i7698A15917l9507i2123D14627
9689B8430b20078G9262J65081e9261l0805j12932d550k19786f2562B8883N1836
9678H0719c89332g7582A05404O9833a77756e9263l4771o5741k0470B42675e838
9666a87355B66148a37861J1956B78882d18483F3240n995j8609K51251h1226j75234
9655b56460J00765b1867p4733b2444m46F913b7819o0151q3564C3522N1303f153
$$ plain form
9642 -93514 65180 -33045 -176089 -110457 185584 -238250 -427245 -25194 -119463 41325 331439
9631 331439 -215665 -158176 -62544 -167049 -217509 171776 -127568 8031 -276906 156873 -250782
9619 -94884 -116605 -146957 -167724 182399 71422 -149204 -426759 311168 9397 234394 -196909
9607 142016 -575033 45515 -29274 83581 -84512 -178001 -5877 -88862 -148570 -367942 1783 93468
9595 93468 -115847 -122462 165253 114860 170073 52569 184507 13972 -311490 21106 75219
9584 75219 -128408 111803 166031 -214889 -122393 -6033 -353126 -11420 -73440 120470 -302129
9572 -17931 -79778 -107187 -358152 -129637 -186556 -89412 119951 -182370 20432 -259867 -200191
9561 -200191 44120 -198670 -90652 -512609 159550 -271579 10775 112878 -259663 71868
$$ packed form
9642i3514F5180c3045j43044O5632A85584b38250j88995b5194r4269D1325K90114
9631C31439b15665N7489f2544j04505n0460A71776a27568H031b76906A56873b50782
9619i4884k1721l0352k0767A82399G1422a49204k77555C11168I397K24997a96909
9607A42016e75033D5515b9274H3581h4512r3489e877q2985n9708k19372A783R1685
9595I3468a15847o615A65253n0393N5213E2569J31938A3972c11490B1106N4113
9584G5219a28408A11803N4228b14889R2496f033l47093a1420o2020A20470c02129
9572a7931o1847k7409k50965a29637n6919h9412A19951a82370B0432b59867N9676
9561b00191D4120a98670i0652m21957A59550b71579A0775J02103b59663G1868
$$ plain form
9550 -124427 -121117 188777 14260 -152000 32942 -9079 -216553 -34420 43614 -45372 -117359
9539 -117359 -90474 -35199 -169544 199254 166886 79150 -4982 190269 -250393 -152753 -136175
9528 -136175 -495993 13141 -144627 123305 -170710 -66485 55334 146423 -7794 -9006 16080
9516 -48720 -103144 -97043 90750 -316882 31201 -143985 -110789 -75454 86998 56944 -67624 -388170
9504 -388170 -234418 -135195 -45443 160737 85604 -9818 -179228 -289020 -231286 -306000 58976
9492 73416 -50887 -301358 -82605 184453 -60637 -358377 -156454 -72418 -191608 -46310 -128207
9481 -128207 -113522 29360 -78586 -141452 93493 318711 -196577 -135886 -226531 46652 -19254
9469 51666 198617 -66600 -486179 -139842 -92607 252530 10471 93646 129520 -202175 -272971
$$ packed form
9550a24427L310A88777A4260a52000C2942i079k07474c4420D3614d5372p1987
9539a17359K6885c5199j34345A99254l2368G9150d982A90269b50393R7640J6578
9528a36175l59818A3141a44627A23305a70710f6485E5334R1089g794j212A6080
9516d8720n4424O101I0750c16882C1201a43985L3196L5335H6998l0054f7624l20546
9504c88170J53752R9223d5443A60737p5133i818j69410j09792N7734p4714E8976
9492G3416e0887k50471h2605A84453f0637k97740a56454g2418j19190d6310q1897
9481a28207J4685B9360g8586o2866I3493K25218a96577O0691r0645D6652a9254
9469E1666J46951f6600m19579a39842M7235B52530A0471Q3175L5874b02175p0796
$$ plain form
9458 -272971 204370 -94350 -353404 -257413 -386097 109099 -143379 -585913 -285976 -730365
9448 -730365 -46416 -148488 -113461 -30494 795 -211316 97809 -230313 -112479 -116685 -32988
9436 -9292 232143 328464 -271907 -158305 99887 -60711 -321972 -67560 -12026 -259823 88025
9424 -127418 27713 50239 -21533 -235811 -53924 116228 -75753 35125 -212161 -184284 74225
9412 130939 110960 -290284 -136144 168035 -228947 -62186 241170 -30020 -47696 -211420
9402 -211420 -232292 26554 93277 -97629 14563 -30687 250340 296972 42180 -17818 -184683
9391 -184683 270175 30014 190345 -20385 -389000 219981 10289 16995 6215 -281792 -101171
9379 128999 -293000 81629 -207619 -62736 -93527 238155 -40212 122834 -324078 -204036
$$ packed form
9458b72971B04370i4350k59054R5991j28684A09099a43379m42534b85976m44389
9448g30365d6416j02072L5027c0494G95b11316I7809b30313a12479m206c2988
9436i292B32143R6321b71907J13602I9887f0711k61261f7560a2026k47797H8025
9424a27418B7713K2526b1533k14278e3924A16228g5753C5125b12161K7877G4225
9412A30939j9979b90284a36144A68035b28947f2186B41170c0020j7676j63724
9402b11420k0872B6554O6723i7629A4563c0687B50340M6632D2180a7818j66865
9391a84683B70175C0014J60331b0385l68615B19981A0289O706F215b81792a01171
9379A28999b93000H1629b07619f2736l0791B38155d0212A22834c24078J20042
$$ plain form
9369 -204036 257158 -8027 64767 82348 14566 -209534 -97998 -115404 -75787 -39254 -307853
9358 -307853 72541 -108031 50763 -66456 -50488 -227504 -501343 -134736 -330808 -45675 -41391
9347 -41391 206540 -272508 390613 -330812 -30502 -42626 110030 -67600 -37283 164732 -135961
9335 -277257 18895 -120267 -99509 224840 -54127 199839 174558 -86975 -124483 -227757 93298
9323 9177 93090 -2601 86258 -239492 -374992 -127670 -233837 287818 -200372 -23396 -170229
9312 -170229 21490 -198885 -21068 -100195 -138047 -2623 -301210 98604 -403032 484596 -37694
9300 75639 -265666 -13541 -246483 -167259 -50652 -435032 -65616 -328890 113300 -299980 -91463
9288 -143524 67536 -99727 -454867 -122577 128542 -34577 -56895 106717 -101416 -200272 -316028
$$ packed form
9369b04036B57158h027F4767J7581A4566b09534i7998j7406L9617L6533k68599
9358c07853G2541a08031E0763f6456J5968j77016k73839a34736j96072d5675M284
9347d1391B06540b72508C90613c30812c0502j2124A10030f7600L0317A64732a35961
9335b77257A8895a20267K0758B24840e4127A99839k5281h6975l7508j03274I3298
9323I177Q3913b601H6258b39492j35500a27670j06167B87818b00372b3396j46833
9312a70229B1490a98885b1068p9127l7852b623k98587I8604d03032D84596c7694
9300G5639b65666a3541k32942P9224e0652l84380f5616k63274A13300b99980i1463
9288a43524F7536i9727l55140a22577A28542c4577k2318A06717a01416r8856j15756
$$ plain form
9277 -316028 304762 -356543 -19344 -247625 -179752 -40706 -334074 -66916 -249429 -305595 10644
9265 91087 -309985 108996 -214157 -53765 63024 -79535 -122496 -210819 273530 -238386 -248327
9254 -248327 -210563 -229743 -315870 301571 -236026 -91839 126705 -340438 -60574 -108655 169496
9242 238108 -138240 -133264 -81790 -309521 -53998 -89497 -102495 179002 -119600 30208 -201756
9230 -457001 -311116 247052 3933 -95026 -177829 -155499 87406 -161739 81759 -254840 85214
9218 -133373 -78745 100454 129192 68447 -202839 -490471 164514 -47829 -129735 254938 -161335
9206 -8664 -111137 -8736 259464 -65073 -1490 -123997 -5870 -58546 -261019 -270052 116335 -100323
9193 -2239 -174038 64832 -185849 -142690 359285 -219218 -93017 -158777 -53777 -95201 139370
$$ packed form
9277c16028C04762c56543a9344k28281O7873d0706k93368f6916j82513n6166A0644
9265I1087c09985A08996b14157e3765F3024g9535m2961q8323B73530b38386r941
9254b48327L7764j9180q6127C01571b36026i1839A26705c40438f0574m8081A69496
9242B38108a38240M976N1474k27731e3998l5499j2998A79002a19600C0208b01756
9230d57001J45885B47052C933i5026q2803K2330H7406a61739H1759b54840H5214
9218a33373N4628A00454K8738o0745b02839k87632A64514d7829q1906B54938a61335
9206h664j02473h736B59464f5073a490j22507e870n2676k02473r033A16335a00323
9193b239j71799F4832a85849M3159C59285b19218i3017o5760e3777m1424A39370
$$ plain form
9181 -149808 -154866 236460 37888 -133778 154881 179128 137138 -271963 -17401 506 237743
9170 237743 43258 264833 -147057 -171223 61361 78882 -164852 270290 -245483 -355040
9160 -355040 -46701 -366368 38996 -5758 -8523 -153219 -414124 186490 -171696 13941 56811
9149 56811 -211682 121126 -212265 -254281 -105539 -74938 -278888 49243 146244 -101192 -351489
9138 -351489 -317149 -101361 -220592 -125211 45966 -252312 -20157 -114980 47611 -43585 -234180
9127 -234180 -163023 98353 -98871 -164813 311308 -229216 -85978 64570 70637 41386 -163406
9115 -37674 41969 -69051 -188607 -228164 206512 -17285 -283877 -16107 -123149 -309653 202089
9103 -59551 -83022 -152713 27726 223696 -200365 99017 -102247 59902 20889 -272164 192752
$$ packed form
9181a49808n058B36460C7888a33778A54881K4247m1990b71963a7401E06K37237
9170B37743D3258K21575a47057k4166F1361J7521a64852B70290b45483j09557
9160c55040d6701l19667C8996e758k765j44696k60905A86490a71696A3941M2870
9149E6811b11682A21126b12265m2016a05539L0601k03950D9243R7001a01192k50297
9138c51489L4340a01361j19231R5381D5966b52312b0157r4823D7611d3585j90595
9127b34180P1157I8353i8871o5942C11308b29216h5978F4570O067k9251a63406
9115c7674D1969f9051j19556l9557B06512a7285k66592a6107j07042j86504B02089
9103e9551k3471o9691B7726J95970b00365I9017a02247E9902B0889b72164A92752
$$ plain form
9091 -140371 -219375 -111195 254427 -17631 -166143 -39712 7116 -84195 266333 -281681 -208698
9080 -208698 -51515 -82345 -136633 -95687 143828 -130034 -83805 -17972 109560 -78733 340586
9068 -73305 -156126 -175666 56334 109440 -232381 -230709 50264 -5429 172160 -123403 -207387 41094
9055 -44537 341920 -150996 -157217 -149890 -304120 -50082 -76540 -131365 -274820 27474 -115463
9043 33509 -29709 23002 357432 264803 -134312 -227288 -126555 -147816 -177679 390488 -36358
9031 -123991 150119 -48689 -107674 -217354 -127225 -466853 85895 -523089 -407343 -578035
9021 -578035 -392965 218194 186040 132584 -132312 -100095 -106265 -29046 128973 324090 120316
9009 -154508 -44676 -255409 130459 -97071 -179190 -263812 -105775 20800 -39749 -438210 -212044
$$ packed form
9091a40371p9004J08180B54427a7631j48512c9712G116h4195B66333b81681P2983
9080b08698e1515l0830n4288M0946A43828a30034M6229a7972A09560g8733C40586
9068g3305q2821j9540E6334N3106b32381J672E0264e429A72160a23403q3984D1094
9055d4537C41920a50996o221P327j54230e0082k6458n4825j43455B7474a15463
9043C3509b9709B3002L34430r2629a34312r2976J00733k1261k9863C90488c6358
9031a23991A50119d8689n8985j09680R0129l39628H5895e23089J15746j70692
9021e78035J85070B18194l2154n3456a32312L2217o170b9046A28973J95117A20316
9009a54508d4676k10733A30459i7071q2119q4622a05775B0800c9749l98461b12044
$$ plain form
8997 39649 -2662 -261573 -246671 204854 -17359 -67488 -121858 -81960 -3972 -37297 -157620 -307161
8985 -307161 -438946 -382394 -198702 306935 -75332 33603 838 -69448 -1296 -145180 -83451
8974 -83451 61006 -48633 -291100 50901 -431246 260241 -112797 -446307 -203958 -3479 412037
8962 -247094 101506 35401 63070 -79585 33356 -97922 -178814 62820 -265746 91645 -281787
8950 -32341 58516 -312737 -109967 -129120 160144 -394134 -41682 -677200 104524 -50474 -90368
8939 -90368 -34237 -14677 -261216 92161 292764 552605 118311 30764 169002 -138854 214879
8927 -41640 56866 456106 53771 -74710 1532478 3983666 7835763 2960658 844228 122631
8916 153554 -121140 -80052 125544 77949 -17617 14546 198168 29852 41467 149882 304868
$$ packed form
8997C9649b662k58911J4902B04854a7359n0129n4370L9898c972l3325j20323j49541
8985c07161j31785N6552J83692C06935g5332C3603H38f9448a296j43884O1729
8974h3451F1006d8633k42467E0901d31246B60241a12797l33510b03958c479D12037
8962b47094A01506C5401K7669g9585C3356i7922q0892F2820b65746I1645b81787
8950c2341E8516c12737a09967j9153A60144c94134d1682o35518A04524e0474l9894
8939i0368c4237a4677k46539I2161K00603K59841A18311C0764J38238a38854B14879
8927d1640E6866L99240E3771g4710A532478K451188L852097B960658H44228A22631
8916A53554a21140M1088A25544m7595a7617A4546J83622B9852J1615J08415J54986
$$ plain form
8905 304868 -71375 103349 -40558 -112857 159536 92733 -232466 -9054 -120261 9002 -101164
8893 -159859 -115285 119067 4413 -39504 177312 -459144 -77046 227893 95651 -254897 -503028
8882 -503028 137073 102605 -300329 409528 168053 -40366 6326 82816 405776 120225 -83588
8870 -2795 -147671 299008 -372773 -204394 -18296 -88187 159087 -294268 -85040 -73516 -181472
8859 -181472 -27030 -180980 -33031 -507379 -284656 -1136 -102164 32774 1731 -72490 48598
$$ packed form
8905C04868g1375A03349d0558p2299A59536o6803b32466i054j11207I002a01164
8893a59859M4574A19067D413c9504A77312d59144g7046B27893I5651b54897k48131
8882e03028A37073l4468c00329D09528A68053d0366F326P6490L22960A20225h3588
8870b795j44876B99008c72773J68379a8296o9891A59087b94268h5040J1524j07956
8859a81472b7030j53950c3031m74348K22723a136j01028C2774A731g2490D8598
$$ [...]
##END NTUPLES=NMR SPECTRUM
##END=
