##TITLE=AC1684_PANAN14365_8637509_Men9rfclpd
##JCAMPDX= 6.0         $$ Bruker NMR JCAMP-DX V2.0
##DATA TYPE= NMR SPECTRUM
##DATA CLASS= NTUPLES
##ORIGIN= BRUKER
##OWNER= Administrator
$$ 1.72 TOPSPIN		Version 2.1
$$ 2014-05-31 03:19:02.732 -0700  Administrator@X
$$ Compression mode = diff/dup
##.OBSERVE FREQUENCY= 400.02188249412
##.OBSERVE NUCLEUS= ^1H
##.ACQUISITION MODE= SIMULTANEOUS (DQD)
##.ACQUISITION SCHEME= undefined
##.AVERAGES= 64
##.DIGITISER RES= 22
##SPECTROMETER/DATA SYSTEM= spect
##.PULSE SEQUENCE= noesygpps1d.comp
##.SOLVENT NAME= COFFEE_meoh
##.SHIFT REFERENCE= INTERNAL, COFFEE_meoh, 1, 14.96118
##AUDIT TRAIL= $$ (NUMBER, WHEN, WHO, WHERE, PROCESS, VERSION, WHAT)
$$ ##TITLE= Audit trail, TOPSPIN		Version 2.1
$$ ##JCAMPDX= 5.01
$$ ##ORIGIN= Bruker BioSpin GmbH
$$ ##OWNER= Administrator
$$ $$ E:\/data/COFFEE/nmr/AC1684_PANAN14365_8637509_Men9rfclpd/22/pdata/1/auditp.txt
$$ ##AUDIT TRAIL=  $$ (NUMBER, WHEN, WHO, WHERE, PROCESS, VERSION, WHAT)
(   1,<2014-05-31 03:18:57.466 -0700>,<Administrator>,<X>,<go>,<TOPSPIN 2.1>,
      <created by zg
	started at 2014-05-31 03:07:27.497 -0700,
	POWCHK enabled, PULCHK disabled,
       configuration hash MD5:
       C8 4E 4E 5D D3 5C D8 9E 9F 52 82 E0 59 8A DE 15
       data hash MD5: 64K
       0D 51 E1 C4 79 EB CE 61 C9 A5 90 E6 E4 7D 6B 8D>)
(   2,<2014-05-31 03:19:00.560 -0700>,<Administrator>,<X>,<proc1d>,<TOPSPIN 2.1>,
      <Start of raw data processing
       efp LB = 0.3 FT_mod = 6 PKNL = 1 PHC0 = 0 PHC1 = 0 SI = 128K 
       data hash MD5: 128K
       70 A8 BF 1F A7 92 DB 7D 1B 99 68 39 61 B0 BD C6>)
(   3,<2014-05-31 03:19:01.622 -0700>,<Administrator>,<X>,<proc1d>,<TOPSPIN 2.1>,
      <pk PHC0 = -85.98999 PHC1 = 0 
       data hash MD5: 128K
       D0 57 23 07 CA 63 D5 A3 6E BF 42 DA 29 7A DC 39>)
(   4,<2014-05-31 03:19:02.091 -0700>,<Administrator>,<X>,<proc1d>,<TOPSPIN 2.1>,
      <abs ABSG = 1 
       data hash MD5: 128K
       9E B3 00 47 8B 56 43 AB 10 95 F0 FE 80 16 76 43>)
(   5,<2014-05-31 03:19:02.216 -0700>,<Administrator>,<X>,<proc1d>,<TOPSPIN 2.1>,
      <abs ABSG = 2 
       data hash MD5: 128K
       02 8C 5C B6 0B 35 9D 81 94 E6 32 5E 99 30 59 6B>)
(   6,<2014-05-31 03:19:02.310 -0700>,<Administrator>,<X>,<proc1d>,<TOPSPIN 2.1>,
      <abs ABSG = 3 
       data hash MD5: 128K
       E9 B1 4C 0F 64 D0 D7 AE 57 B1 03 51 7D AA 15 8D>)
(   7,<2014-05-31 03:19:02.435 -0700>,<Administrator>,<X>,<proc1d>,<TOPSPIN 2.1>,
      <abs ABSG = 4 
       data hash MD5: 128K
       4D 78 40 99 C9 68 42 45 7F 85 D6 49 E7 D1 05 D5>)
(   8,<2014-05-31 03:19:02.528 -0700>,<Administrator>,<X>,<proc1d>,<TOPSPIN 2.1>,
      <abs ABSG = 5 
       data hash MD5: 128K
       CA DE F5 8C 25 9F CA B4 11 E5 0D CA 6D B3 48 81>)
$$ ##END=
$$ 
$$ $$ hash MD5
$$ $$ 88 B7 42 05 8D 4B 54 8D 7E 46 85 8E 59 35 2C 3A
##$RELAX= 
##$RELAX= 
##$RELAX= 
##$RELAX= 
##$RELAX= 
##$RELAX= 
##$RELAX= 
##$RELAX= 
$$ Bruker specific parameters
$$ --------------------------
##$DU= <E:\>
##$EXPNO= 22
$$ [...]
##$TP07= 0
##$TPNAME0= <>
##$TPNAME1= <>
##$TPNAME2= <>
##$TPNAME3= <>
##$TPNAME4= <>
##$TPNAME5= <>
##$TPNAME6= <>
##$TPNAME7= <>
##$TPOAL= (0..7)
0.5 0.5 0.5 0.5 0.5 0.5 0.5 0.5
##$TPOFFS= (0..7)
0 0 0 0 0 0 0 0
##$TUNHIN= 0
##$TUNHOUT= 0
##$TUNXOUT= 0
##$USERA1= <user>
##$USERA2= <user>
##$USERA3= <user>
##$USERA4= <user>
##$USERA5= <user>
##$V9= 5
##$VALIST= <valist>
##$VCLIST= <CCCCCCCCCCCCCCC>
##$VD= 0
##$VDLIST= <DDDDDDDDDDDDDDD>
##$VPLIST= <PPPPPPPPPPPPPPP>
##$VTLIST= <TTTTTTTTTTTTTTT>
##$WBST= 2048
##$WBSW= 25
##$XGAIN= (0..3)
0 0 0 0
##$XL= 0
##$YL= 0
##$YMAX_a= 5975564
##$YMIN_a= -12049358
##$ZGOPTNS= <>
##$ZL1= 120
##$ZL2= 120
##$ZL3= 120
##$ZL4= 120
##$ABSF1= 14.96118
##$ABSF2= -5.597002
##$ABSG= 5
##$ABSL= 3
##$ALPHA= 0
##$AQORDER= 0
##$ASSFAC= 0
##$ASSFACI= 0
##$ASSFACX= 0
##$ASSWID= 0
##$AUNMP= <proc_prof1d_extract.lims>
##$AXLEFT= 0
##$AXNAME= <>
##$AXNUC= <1H>
##$AXRIGHT= 0
##$AXTYPE= 0
##$AXUNIT= <>
##$AZFE= 0.1
##$AZFW= 0.1
##$BCFW= 0
##$BC_mod= 0
##$BYTORDP= 0
##$COROFFS= 0
##$CY= 15
##$DATMOD= 1
##$DC= 0
##$DFILT= <>
##$DTYPP= 0
##$F1P= 0
##$F2P= 0
##$FCOR= 0.5
##$FTSIZE= 131072
##$FT_mod= 6
##$GAMMA= 0
##$GB= 0
##$INTBC= 1
##$INTSCL= 1
##$ISEN= 128
##$LB= 0.3
##$LEV0= 0
##$LPBIN= 0
##$MAXI= 10000
##$MC2= 0
##$MEAN= 0
##$ME_mod= 0
##$MI= 0
##$NCOEF= 0
##$NC_proc= -2
##$NLEV= 6
##$NOISF1= 0
##$NOISF2= 0
##$NSP= 0
##$NTH_PI= 0
##$NZP= 0
##$OFFSET= 14.96118
##$PC= 1
##$PHC0= -85.98999
##$PHC1= 0
##$PH_mod= 1
##$PKNL= yes
##$PPARMOD= 0
##$PPDIAG= 0
##$PPIPTYP= 0
##$PPMPNUM= 2147483647
##$PPRESOL= 1
##$PSCAL= 4
##$PSIGN= 0
##$PYNMP= <proc.py>
##$REVERSE= no
##$SF= 400.020009565659
##$SI= 131072
##$SIGF1= 0
##$SIGF2= 0
##$SINO= 400
##$SIOLD= 131072
##$SPECTYP= <>
##$SREGLST= <1H.CDCl3>
##$SSB= 0
##$STSI= 131072
##$STSR= 0
##$SW_p= 8223.68421052631
##$SYMM= 0
##$S_DEV= 0
##$TDeff= 65536
##$TDoff= 0
##$TI= <>
##$TILT= no
##$TM1= 0
##$TM2= 0
##$TOPLEV= 0
##$USERP1= <user>
##$USERP2= <user>
##$USERP3= <user>
##$USERP4= <user>
##$USERP5= <user>
##$WDW= 1
##$XDIM= 131072
##$YMAX_p= 437452197
##$YMIN_p= -12547
##$CURPLOT= <Network HP LaserJet P1505>
##$CURPRIN= <$Network HP LaserJet P1505>
##$DFORMAT= <normdp>
##$LAYOUT= <+/1D_H.xwp>
##$LFORMAT= <normlp>
##$PFORMAT= <normpl>
##$SURQMSG= 1
$$ End of Bruker specific parameters
$$ ---------------------------------
##NTUPLES= NMR SPECTRUM
##VAR_NAME=  FREQUENCY,     SPECTRUM/REAL,   SPECTRUM/IMAG
##SYMBOL=    X,             R,               I
##VAR_TYPE=  INDEPENDENT,   DEPENDENT,       DEPENDENT
##VAR_FORM=  AFFN,          ASDF,            ASDF
##VAR_DIM=   131072,        131072,          131072
##UNITS=     HZ,            ARBITRARY UNITS, ARBITRARY UNITS
##FACTOR=    0.0627417313425164, 1,          1
##FIRST=     8223.62146879497, -587,         -57133
##LAST=      0,             1579,            -57154
##MIN=       0,             -12547,          0
##MAX=       8223.62146879497, 437452197,    0
$$ Real data points
##PAGE= N=1
##DATA TABLE= (X++(R..R)), XYDATA
$$ [...]
63813B84536m008k946j841j132q83o41j02M83O73L16m15j131j357r87o85j294
63797B68586k707l817l853l275l014l359l907m191l937l101k076j590j960k653
63783B25146k862k314j310l08K23K9n04n64L2M49k0q91j114m18N22J035R36L73
63765B18440k36l54M1K69r2m55j71K46j89j289j857j415p34m14j18M35P33L44
63747B13184k48l19J77R07J787K742L270K966K180J575J241P92J74j45J80R50
63731B31413J690K066K056J888J812J944K326L053M036M743M640L992L689M061
63717B73409M375L897K886K051J455O87j96o55o37q16j598k434k532j912j318
63702B76662j182j126n42N95J729K380K565K567K612K856L386M004M260L977L550
$$ plain form
63813 284536 280528 277582 275741 274609 273726 273085 272983 273466 274139 274455 274040 272909 271552 270565 269880 268586
63797 268586 265879 262062 258209 254934 251920 248561 244654 240463 236526 233425 231349 229759 227799 225146
63783 225146 222284 219970 218660 218352 218575 218604 218100 217536 217568 218017 217997 217106 215992 215574 216096 217131 218067 218440
63765 218440 218204 217850 217891 218160 218068 217613 217442 217688 217499 216210 214353 212938 212204 211790 211672 212107 212840 213184
63747 213184 212936 212617 212794 213701 215488 218230 221500 224466 226646 228221 229462 230254 230428 230283 230463 231413
63731 231413 233103 235169 237225 239113 240925 242869 245195 248248 252284 257027 261667 265659 269348 273409
63717 273409 277784 281681 284567 286618 288073 288760 288564 287909 287272 286456 284858 282424 279892 277980 276662
63702 276662 275480 274354 273812 274407 276136 278516 281081 283648 286260 289116 292502 296506 300766 304743 308293
63687C08293L377L260K782K062J512J065L36m90q12p48j168k233k824k129r55
63672C11328o46j210j494r26o8M00M05R9l88o43j55Q77J424O70j137l080m451
63655C01005n090n160m930m548l881k683j087K50O47K0j032j701j523o79K67Q93
63639B70768J139J154J145J416K151K975L174K706K578L692N576O871O923O353
63625C18621O131O645P686Q761R375R493R847J1233J3468J5552J6967J8199J9823
63612D71801K1728K3613K5622K7909K9970L1028L0950L0288K9416K7966K5249
63601G75540K0981J5537R599L783j402n376p695q568q816r007r007q752r044j0843
63587G46930j3903j6959j9278k1205k3012k4179k4216k3469k2474k1113j8983
$$ plain form
63687 308293 311670 314930 317712 319774 321286 322351 322687 322197 321385 320637 319469 317236 314412 312283 311328
63672 311328 310682 309472 307978 307052 306984 307384 307789 307888 307500 306857 306702 307579 309003 309673 308536 305456 301005
63655 301005 295915 290755 285825 281277 277396 274713 273626 273876 274523 274543 273511 271810 270287 269608 269875 270768
63639 270768 271907 273061 274206 275622 277773 280748 283922 286628 289206 292898 298474 305345 312268 318621
63625 318621 324752 331397 339083 347844 357219 366712 376559 387792 401260 416812 433779 451978 471801
63612 471801 493529 517142 542764 570673 600643 631671 662621 692909 722325 750291 775540
63601 775540 796521 812058 821657 825440 824038 818662 810967 802399 793583 784576 775569 766817 757773 746930
63587 746930 733027 716068 696790 675585 652573 628394 604178 580709 558235 537122 518139
63576E18139j6196j3242j0384p720n484l801k426j099J23J230K541M160N606O491
63562D77938P149Q011Q760Q862Q623Q900J0014J1636J3623J6092J8748K0961K2679
63549F41996K4508K6809K9331L1831L4270L6104L6134L3445K8053K0502J1481
63538I54464K202n593j0619j2936j3469j3022j2052j0964j0117r727j0041j1404
63526H36722j3833j6803j9838k2979k6292k9179l0739l0741k9781k8415k6627
63515E61495k4246k1495j8921j6916j5476j4335j3169j1791j0272q841p654o663
63503C91716n757m956m381m053l813l526l230k951k465j521l16M90L99l81j198
63488C54057j542j325q03m44n93j045j104l64P64J565J865K039K359K775L146
$$ plain form
63576 518139 501943 488701 478317 470597 465113 461312 458886 457787 457910 459140 461681 465841 471447 477938
63562 477938 485087 493098 501858 510720 519343 528243 538257 549893 563516 579608 598356 619317 641996
63549 641996 666504 693313 722644 754475 788745 824849 860983 894428 922481 942983 954464
63538 954464 956666 951073 940454 927518 914049 901027 888975 878011 867894 858167 848126 836722
63526 836722 822889 806086 786248 763269 736977 707798 677059 646318 616537 588122 561495
63515 561495 537249 515754 496833 479917 464441 450106 436937 425146 414874 406033 398379 391716
63503 391716 385959 381003 376622 372569 368756 365230 362000 359049 356584 355063 354747 355237 355636 355255 354057
63488 354057 352515 351190 350387 349943 349350 348305 347201 346837 347601 349166 351031 353070 355429 358204 361350
63473C61350L282K880J864P29M2k65o50j085j139q44q21j305j781j841j703j545
63457C57168r46M46K171L370L731L583L379L526M399O012P777Q996R568R869J0112
63442D33161J0179J0000R754R714J0095J1019J2414J3979J5461J6847J8145J9047
63430E89815J9068J7973J6023J3792J1859J0624J0295J1002J2812J5493J8527
63419G47283K1553K4726K8306L2011L5074L6799L6775L4669L0389K4416J7540
63408A069541J0328L261k863p344j0294j2180j2910j2320j1411j1832j3871j6275
63396I71830j8424k1282k5445k9625l2210l3304l3919l4010l2720l0084k7135
63385F53672k4481k1888j9084j6071j2839r551o742m553k248O96L621N792P773
$$ plain form
63473 361350 364632 367512 369376 370105 370147 369882 369232 368147 367008 366164 365343 364038 362257 360416 358713 357168
63457 357168 356222 356668 358839 362209 365940 369523 372902 376428 380827 386839 394616 403612 413180 423049 433161
63442 433161 443340 453340 463094 472808 482903 493922 506336 520315 535776 552623 570768 589815
63430 589815 608883 626856 642879 656671 668530 679154 689449 700451 713263 728756 747283
63419 747283 768836 793562 821868 853879 888953 925752 962527 997196 1027585 1052001 1069541
63408 1069541 1079869 1083130 1080267 1072923 1062629 1050449 1037539 1025219 1013808 1001976 988105 971830
63396 971830 953406 932124 906679 877054 844844 811540 777621 743611 710891 680807 653672
63385 653672 629191 607303 588219 572148 559309 549758 543016 538463 536215 536911 540532 546324 554097
63372E54097J0419J3031J4128J3725J3277J3491J3777J3804J3986J4283J4220
63361G02238J4401J6228J9608K2644K4341K5953K8732L1837L3614L3615L2016
63350I85227K8306K2123J4626P579J535l872q388j1250j2509j2943j2909j2370
63338I85155j1928j2653j4786j7601k0582k3865k7298k9912l0822l0123k8672
63327G36913k7174k5612k3347j9831j5430j1322q326o182m326k977k930m520p327
63314E77609j0594j3468j5111j5236j4424j3393j2189j0533q651p033n580l751
63302D47646j548L24J419K126L012M005M355L321R03j974m223n660p018q684r988
63287D28016j0170r504q807q284p644p028o904p086o753n573m123l068k485k129
$$ plain form
63372 554097 564516 577547 591675 605400 618677 632168 645945 659749 673735 688018 702238
63361 702238 716639 732867 752475 775119 799460 825413 854145 885982 919596 953211 985227
63350 985227 1013533 1035656 1050282 1057861 1059396 1055524 1047136 1035886 1023377 1010434 997525 985155
63338 985155 973227 960574 945788 928187 907605 883740 856442 826530 795708 765585 736913
63327 736913 709739 684127 660780 640949 625519 614197 605871 599689 595363 592386 589456 584936 577609
63314 577609 567015 553547 538436 523200 508776 495383 483194 472661 464010 456977 451397 447646
63302 447646 446098 446422 447841 449967 452979 456984 461339 464660 465563 463589 459366 453706 446688 438004 428016
63287 428016 417846 408342 399535 391251 383607 376579 369675 362589 355836 350263 346140 343072 340587 338458
63273C38458j807j370q00l65k87k41L13J270J879J621P67J0q1P00K021L123L500
63256C48711L455L580L902M054M096M508N473O810Q414J0142J1307J1239J0344
63243D36035R830J0208J0901J1549J2728J4944J7612J9740K1098K2255K3697K5346
63231F35943K6687K7219K7017K6935K7768K9146K9799K9094K7736K6775K6489
63220I40608K6536K6593K6496K6240K6139K6481K6774K5951K3633K0578J7404
63209A213433J3541Q106J279n749j1917j6807k0490k3347k5765k7559k8074k7252
63197A049399k5998k4977k3698k1448j8543j5804j3373j1038r324q847q802p400
63185H60147m204p58J561L220N392Q075J0294J1660J2719J3909J5055J5906J6474
$$ plain form
63273 338458 336651 335281 334481 334116 333829 333588 333901 335171 337050 338671 339438 339448 339367 340067 342088 345211 348711
63256 348711 352166 355746 359648 363702 367798 372306 377779 384589 393003 403145 414452 425691 436035
63243 436035 445865 456073 466974 478523 491251 506195 523807 543547 564645 586900 610597 635943
63231 635943 662630 689849 716866 743801 771569 800715 830514 859608 887344 914119 940608
63220 940608 967144 993737 1020233 1046473 1072612 1099093 1125867 1151818 1175451 1196029 1213433
63209 1213433 1226974 1235080 1236359 1230610 1218693 1201886 1181396 1158049 1132284 1104725 1076651 1049399
63197 1049399 1023401 998424 974726 953278 934735 918931 905558 894520 885196 876349 867547 860147
63185 860147 855943 855185 856746 859966 865358 873433 883727 895387 908106 922015 937070 952976 969450
63172I69450J6700J6297J5231J3947J2823J1610R773P237M437J588j709n887j0661
63159A060836j5181j8942k2057k4721k6753k8002k8747k9264k9275k8286k6367
63148G83241k4136k1971j9749j7410j5299j3665j2202j0500q709p360o585n864
63136F19791m628k879j104K72J184J804K364L118M307N909P507Q729R818J1435
63122F67627J3641J5368J5356J3504J0796P898M500M11l361n377n515n165n519
63109G24164o278o422n719m861m366m048l620l210l042k998k789k360j888j633
63095F70930j857k617l417l402k270p34K32M61N33Q55J257J474J574J836K466
63080F67321L513M797N930O647P061P342P313O805O311O693Q148R933J1362J2468
$$ plain form
63172 969450 986150 1002447 1017678 1031625 1044448 1056058 1065831 1073068 1077505 1079093 1077384 1071497 1060836
63159 1060836 1045655 1026713 1004656 979935 953182 925180 896433 867169 837894 809608 783241
63148 783241 759105 737134 717385 699975 684676 671011 658809 648309 639600 632240 625655 619791
63136 619791 615163 612284 611180 611452 612636 614440 616804 619922 624229 630138 637645 646374 656192 667627
63122 667627 681268 696636 711992 725496 736292 744190 748690 749101 745740 740363 734848 729683 724164
63109 724164 717886 711464 705745 700884 696518 692470 688850 685640 682598 679600 676811 674451 672563 670930
63095 670930 669073 666456 663039 659637 657367 656633 656865 657326 657859 658714 659971 661445 663019 664855 667321
63080 667321 670834 675631 681561 688208 695269 702611 709924 716729 723040 729733 737881 747814 759176 771644
63066G71644J3526J4412J4997J5766J7471K0211K3283K5941K8045L0009L2418
63055A007723L5669L9752M4219M8476N2115N5049N7439N9598O1783O3874O5413
63044A591110O6054O5919O5408O4745O3904O2901O1960O1315O0943O0549N9852
63033B284660N8843N7555N5571N1913M5730L6985K6261J4072O96j3400k7492m1005
63021B550389n3565o4650p3643q0357q5042q7659q7643q4691p9382p2683o5232
63010A715842n7431m9736m2318l4771k6730j8631j1318n020P60O430J1854J6708
62998A505639K0841K4222K6875K8925L0428L1170L0991L0250K9604K9232K8639
62987A816816K7260K4976K2008J8547J4691J0414N471m53p379j4983k2945l1112
$$ plain form
63066 771644 785170 799582 814579 830345 847816 868027 891310 917251 945296 975305 1007723
63055 1007723 1043392 1083144 1127363 1175839 1227954 1283003 1340442 1400040 1461823 1525697 1591110
63044 1591110 1657164 1723083 1788491 1853236 1917140 1980041 2042001 2103316 2164259 2224808 2284660
63033 2284660 2343503 2401058 2456629 2508542 2554272 2591257 2617518 2631590 2632286 2618886 2591394 2550389
63021 2550389 2496824 2432174 2358531 2278174 2193132 2105473 2017830 1933139 1853757 1781074 1715842
63010 1715842 1658411 1608675 1566357 1531586 1504856 1486225 1474907 1469887 1470647 1477077 1488931 1505639
62998 1505639 1526480 1550702 1577577 1606502 1636930 1668100 1699091 1729341 1758945 1788177 1816816
62987 1816816 1844076 1869052 1891060 1909607 1924298 1934712 1940183 1939730 1932351 1917368 1894423 1863311
62975A863311l9203m6558n2481n6752n9651o1477o2127o1288n9013n5928n2705
62964A256128m9472m6019m2537l9655l7521l5421l2728k9840k7605k6053k4503
62953H64774k2821k1714k1479k1244k0065j8275j7022j6719j6597j5834j4466
62942F58538j3033j1838j0894j0213r717r074q005o739n804n269m571l219j440
62929E58722P6Q81J090J104J266J600J749J300L74k87j94J76j43j438l090m470
62913E58716n463o034n866m883l756l421m138n221n706n075l639k323j933k451
62899D98807l127l344l180l064l159l249l023k287j149r8L44K69L11Q22J451J741
62883D78065J715J523R78k8r94j261q35k31K84P94J187J053K45q64j741k049j763
$$ plain form
62975 1863311 1824108 1777550 1725069 1668317 1608666 1547189 1485062 1423774 1364761 1308833 1256128
62964 1256128 1206656 1160637 1118100 1078445 1040924 1005503 972775 942935 915330 889277 864774
62953 864774 841953 820239 798760 777516 757451 739176 722154 705435 688838 673004 658538
62942 658538 645505 633667 622773 612560 602843 593769 585764 579025 573221 567952 563381 560162 558722
62929 558722 558798 559679 560769 561873 563139 564739 566488 567788 568162 567875 567681 567857 567714 566276 563186 558716
62913 558716 553253 547219 541353 536470 532714 529293 525155 519934 514228 509153 505514 503191 501258 498807
62899 498807 495680 492336 489156 486092 482933 479684 476661 474374 473225 473127 473471 473740 474051 474873 476324 478065
62883 478065 479780 481303 482281 482253 481259 479998 479163 478932 479216 480010 481197 482250 482495 481631 479890 477841 476078
62866D76078j264j192j761k344k112j094r6L42M63P00J077J318J187O41n2l33
62850D71558O4O13N50K0QR21J823J599L33r61j690k056k272k105j404o05k89n14
62832D65593q73j147j474j838j765q73N03J555J832J563J158Q40Q60J547K800
62817D70281L834L956L430L223L915N205O399P040P096O881O850P212P704P927
62803E50953P876P928Q311Q911R596J0460J1541J2563J3117J3282J3911J6035
62791F84484J9685K3566K6368K8441L1452L6265M1861M6912N1588N6993O3411
62780A111026P0127P6744Q3461R0003R5345R8921J01243J02885J03470J02108
62770B035333R8255R1652Q1989O9255N4214L7932K0976L402j4594l2384m9191
$$ plain form
62866 476078 474814 473622 471861 469517 467405 466311 466215 466557 467020 467720 468797 470115 471302 471943 471891 471558
62850 471558 471622 472235 472785 472805 472813 473734 475557 477156 477489 476528 474838 472782 470510 468405 467001 466396 466107 465593
62832 465593 464720 463573 462099 460261 458496 457623 458126 459681 461513 463076 464234 465074 465934 467481 470281
62817 470281 474115 478071 481501 484724 488639 493844 500243 507283 514379 521260 528110 535322 543026 550953
62803 550953 558829 566757 575068 583979 593575 604035 615576 628139 641256 654538 668449 684484
62791 684484 704169 727735 754103 782544 813996 850261 892122 939034 990622 1047615 1111026
62780 1111026 1181153 1257897 1341358 1431361 1526706 1625627 1726870 1829755 1933225 2035333
62770 2035333 2133588 2225240 2307229 2376484 2430698 2468630 2489606 2493008 2478414 2446030 2396839
62759B396839o4284p6962q6731r3632r8241j01108j02242j01280r8237r3852q8978
62748A391292q3737p7762p1261o5247o0323n5881n1058m6037m1655l8036l4486
62737G65809l0668k7017k3849k0865j7753j4709j2091j0084q848q393q158p341
62725E76033n832m300l197k322j489q53k50R78K994M989O237P091Q291R856J1311
62710F09537J2617J4183J6224J8744K1848K5499K9186L2449L5596L9293M3593
62699H98769M7960N2157N6534O1278O5888O9561P1818P2707P2486P1178O8304
62688A608640O3266N6063M7350L7601K6522J3758j47j3942k6764l8545m9350n8714
62676A665738o5881p0522p3035p4108p3981p2370o9234o5374o1736n8227n3923
$$ plain form
62759 2396839 2332555 2255593 2168862 2075230 1976989 1875881 1773639 1672359 1574122 1480270 1391292
62748 1391292 1307555 1229793 1158532 1093285 1032962 977081 926023 879986 838331 800295 765809
62737 765809 735141 708124 684275 663410 645657 630948 618857 608773 599925 591532 583374 576033
62725 576033 570201 565901 562704 560382 558893 558040 557790 558768 561762 566751 572988 580079 588370 598226 609537
62710 609537 622154 636337 652561 671305 693153 718652 747838 780287 815883 855176 898769
62699 898769 946729 998886 1055420 1116698 1182586 1252147 1323965 1396672 1469158 1540336 1608640
62688 1608640 1671906 1727969 1775319 1812920 1839442 1853200 1853053 1839111 1812347 1773802 1724452 1665738
62676 1665738 1599857 1529335 1456300 1382192 1308211 1235841 1166607 1101233 1039497 981270 927347
62665I27347m8617m3444l9540l6750l4154l1313k8357k5305k2145j9292j7224
62654E81206j5776j4417j3120j2245j1729j1060j0092r209q563p815o755n641
62642D54784m723l945l284k909k722k231j187l6N68M44j61r88j763k048j601q84
62626D27314p72j537k338k077p16O39J054Q34R83J921L265M626N886O620O204
62611D51906M910M189N142P186Q841R529R895J0705J2186J4305J6897J9528K1898
62598E97117K4423K7847L2186L6592M0296M3169M5354M7035M8595N0322N1663
62587A044599N1361M8624M3728L7350K9879K1639J3111M510m368j3432k1882k8984
62575A226135l4875m0014m4177m6649m7278m6683m5491m3867m1882l9714l7330
$$ plain form
62665 927347 878730 835286 795746 758996 724842 693529 665172 639867 617722 598430 581206
62654 581206 565430 551013 537893 525648 513919 502859 492767 483558 474995 467180 460425 454784
62642 454784 450061 446116 442832 439923 437201 434970 433783 433747 434315 434759 434598 433610 431847 429799 428198 427314
62626 427314 426542 425005 422667 420590 419874 420513 421567 422401 423384 425305 428570 433196 439082 445702 451906
62611 451906 456816 461005 466147 473333 482174 491703 501598 512303 524489 538794 555691 575219 597117
62598 597117 621540 649387 681573 718165 758461 801630 846984 894019 942614 992936 1044599
62587 1044599 1095960 1144584 1188312 1225662 1255541 1277180 1290291 1294801 1290433 1277001 1255119 1226135
62575 1226135 1191260 1151246 1107069 1060420 1013142 966459 920968 877101 835219 795505 758175
62564G58175l4463l1198k8135k5637k3223k0223j6886j4194j2564j1279r544p651
62552E23178o531o348o160n101l360j802r23n50l40k00k67o37j171j498j333q37
62536D86120m83n26p92r96r94o13L74J826L179M104M907O046P538R159J0864J2632
62520E42345J4210J5559J7280K0019K3574K7099L0150L2996L5882L8609M0855
62509H38578M2518M3589M4025M3817M2894M0944L7582L2719K6590J9561J2174
62498A224991N157r69o146j0331j3107j4188j3921j2707j0281o332j587K715O396
62485A149690J0416J5224K0036K3981K7136K9907L2145L3273L2644K9459K3174
62474A427085J4612N900j460p974j5039k3010l1104l8661m5452n0978n4490n5826
$$ plain form
62564 758175 723712 692514 664379 638742 615519 595296 578410 564216 551652 540373 530829 523178
62552 523178 516647 510299 504139 499038 495678 493876 492953 492403 492063 491863 491596 490959 489788 488290 486957 486120
62536 486120 485637 485111 484319 483323 482329 481716 482090 483916 487095 491199 496106 502152 509690 518849 529713 542345
62520 542345 556555 572114 589394 609413 632987 660086 690236 723232 759114 797723 838578
62509 838578 881096 924685 968710 1012527 1055421 1096365 1133947 1166666 1193256 1212817 1224991
62498 1224991 1230148 1229179 1223033 1212702 1199595 1185407 1171486 1158779 1148498 1142166 1140579 1143294 1149690
62485 1149690 1160106 1175330 1195366 1219347 1246483 1276390 1308535 1341808 1374452 1403911 1427085
62474 1427085 1441697 1447597 1446137 1438163 1423124 1400114 1369010 1330349 1284897 1233919 1179429 1123603
62462A123603n5567n4264n2026m8958m5372m1442l7120l2558k8228k4405k0868
62451F82795j7261j3553r986o788m032j608O84K918M903O403P496Q505R529J0257
62437F80262J0362J0001R765R979J0094R016O282K758j70k027l489n223p113q781
62423G21716j0242j1505j2125j1846j1396j1807j2945j3500j2637j1047j0009
62412E92657r877r967r676r135q722q378p656o387m970l903l190k419j392l93
62398E06592K55O43J126J837K570L021L016K649K319K428K843K932K390J838K148
62383E38607L365M690N517O020O643P490Q375R135R622R718R598R764J0468J1337
62369F50349J1835J2055J2697J4234J6434J8839K1368K4328K7889L1847L5830
$$ plain form
62462 1123603 1068036 1013772 961746 912788 867416 825974 788854 756296 728068 703663 682795
62451 682795 665534 651981 641995 635207 631175 629567 630251 633169 638072 644475 651971 660476 670005 680262
62437 680262 690624 700625 710390 720369 730463 739479 745761 748519 748349 746322 742833 737610 730497 721716
62423 721716 711474 699969 687844 675998 664602 652795 639850 626350 613713 602666 592657
62412 592657 582780 572813 563137 554002 545280 536902 529246 522859 517889 513986 510796 508377 506985 506592
62398 506592 506847 507490 508616 510453 513023 516044 519060 521709 524028 526456 529299 532231 534621 536459 538607
62383 538607 541972 546662 552179 558199 564842 572332 580707 589842 599464 609182 618780 628544 639012 650349
62369 650349 662184 674239 686936 701170 717604 736443 757811 782139 810028 841875 877705
62358H77705L9641M3312M6925N0355N3229N5156N6037N5981N4767N1641M5909
62347A430658L7768K8288J8551R071Q2q039j4932k0644k5511k9803l3611l6950
62335A354928l9643m1270m1496m0454l8530l5944l2835k9579k6597k3924k1402
62324I83254j9249j7931j7397j7062j6744j7048j8418k0212k1215k0897j9714
62313G77367j8340j6992j5556j3992j2499j1273j0187q775o765m610l157k708
62301F52513k703k511k176k078k206k198j842j142q7J176K125K261J720J073O06
62286F44531K69K81J029K278L156L303L456M372N680O525P032Q176J0186J1990
62272G12264J2631J2497J2518J2744J2556J2018J2058J3115J4477J5379J6148
$$ plain form
62358 877705 917346 960658 1007583 1057938 1111167 1166323 1222360 1278341 1333108 1384749 1430658
62347 1430658 1468426 1496714 1515265 1524336 1524418 1516379 1501447 1480803 1455292 1425489 1391878 1354928
62335 1354928 1315285 1274015 1232519 1192065 1153535 1117591 1084756 1055177 1028580 1004656 983254
62324 983254 964005 946074 928677 911615 894871 877823 859405 839193 817978 797081 777367
62313 777367 759027 742035 726479 712487 699988 688715 678528 669753 662988 658378 655221 652513
62301 652513 649810 647299 645123 643045 640839 638641 636799 635657 635570 636746 638871 641132 642852 643925 644531
62286 644531 644800 645081 646110 648388 651544 654847 658303 662675 668355 674880 681912 690088 700274 712264
62272 712264 724895 737392 749910 762654 775210 787228 799286 812401 826878 842257 858405
62261H58405J7730K0472K3967K7801L1899L6260M0889M5978N1509N6552N9497
62250A270959N9290N6207N1298M5300L8320L0302K1559J2777M528l249j1061j9107
62238A557123k6905l3951m0351m6362n1507n4871n6211n6110n4960n2503m8650
62227A034742m4033l9368l4820l0433k6598k3567k0938j8256j5775j3946j2452
62216G54556j0488q018n957m963m575l873k527r16M91J561K405L179M032N089
62202G29996O375P745Q955R806J0226J0258J0085J0053J0414J0849J0565R209
62190H44536P463O275N693N055M236L899M386N208N953O893Q058Q560P691O195
62176I30101N437N636N883N792O087P414R560J2196J5591J9953K4628K8598L1518
$$ plain form
62261 858405 876135 896607 920574 948375 980274 1016534 1057423 1103401 1154910 1211462 1270959
62250 1270959 1330249 1386456 1437754 1483054 1521374 1551676 1573235 1586012 1590540 1587291 1576230 1557123
62238 1557123 1530218 1496267 1455916 1409554 1358047 1303176 1246965 1190855 1135895 1083392 1034742
62227 1034742 990709 951341 916521 886088 859490 835923 814985 796729 780954 767008 754556
62216 754556 744068 736050 730093 725130 720555 716682 714155 713239 713730 715291 717696 720875 724907 729996
62202 729996 736371 744116 753071 762877 773103 783361 793446 803499 813913 824762 835327 844536
62190 844536 851999 858274 863967 869022 873258 877157 881543 886751 892704 899597 907655 916215 923906 930101
62176 930101 935538 941174 947057 952849 958936 966350 975910 988106 1003697 1023650 1048278 1076876 1108394
62163A108394L3780L5732L7306L8237L8238L6879L3708K8687K2323J5284Q014
62152A436582Q25n796j1326j5735j9590k3388k6932k9710l1736l3504l5038l5471
62140A169181l4022l1035k7633k4502k1450j8079j4495j1271q983p826p456p179
62128I55250o522n662n270n770o805p454p041n818m712m254l932k971j555p38
62114H86746j081k071l031l936m874n462n378n026m928m928m706m737n853p925
62100H22810r801j0571j0224r209q029p232o950o472n034l109j993j969j862q75
62086G39480K18L50j17Q1J363K990M250N152N951O769P801R319J1207J2922J4119
62071H21855J5045J6157J7500J8762J9748K0646K1774K3251K5002K6939K8953
$$ plain form
62163 1108394 1142174 1177906 1215212 1253449 1291687 1328566 1362274 1390961 1413284 1428568 1436582
62152 1436582 1437407 1431611 1420285 1404550 1384960 1361572 1334640 1304930 1273194 1239690 1204652 1169181
62140 1169181 1135159 1104124 1076491 1051989 1030539 1012460 997965 986694 977711 969885 962429 955250
62128 955250 948728 943066 937796 932026 925221 917767 910726 904908 900196 895942 892010 889039 887484 886746
62114 886746 885665 883594 880563 876627 871753 866291 860913 855887 850959 846031 841325 836588 830735 822810
62100 822810 813009 802438 792214 783005 774976 767744 760794 754322 749288 746179 744186 742217 740355 739480
62086 739480 739698 740048 739931 740012 741375 744365 748615 753767 759718 766487 774288 783607 794814 807736 821855
62071 821855 836900 853057 870557 889319 909067 929713 951487 974738 999740 1026679 1055632
62060A055632L0653L1281L0179K7217K2708J7056J0817M881M0l865p873j2715
62048A206011j7969k2669k6450k9732l2912l5880l8224l9628l9902l9012l7317
62037H46316l5584l4376l3393l1688k8742k5121k1813j9115j6580j4068j2167
62026E73669j1294j0910j0177q998p871o918n837m763m335m718n188n056m482
62013D83122l987l667l310k933k647k192j184J70J065R62J95l94k68M05J059J365
61997D67761J552K075K919L465L080J752M3j391k138k168j894k049l110m831o419
61982D58647p325p628p708p673p324o526n387m080k727j605j183j559k043j710
61968C94169n53M44N30J56K76J081J873K056J670J033L77n1m1K88N05L74N2k23
$$ plain form
62060 1055632 1086285 1117566 1147745 1174962 1197670 1214726 1225543 1230424 1230464 1226599 1218726 1206011
62048 1206011 1188042 1165373 1138923 1109191 1076279 1040399 1002175 962547 922645 883633 846316
62037 846316 810732 776356 742963 711275 682533 657412 635599 616484 599904 585836 573669
62026 573669 562375 551465 541288 532290 524419 517501 511664 506901 502566 497848 492660 487604 483122
62013 483122 479135 475468 472158 469225 466578 464386 463202 463372 464437 465399 465594 465200 464932 465337 466396 467761
61997 467761 469313 471388 474307 477772 480852 482604 482647 481256 479118 476950 475056 473007 469897 465066 458647
61982 458647 451322 443694 435986 428313 420989 414463 409076 404996 402269 400664 399481 397922 395879 394169
61968 394169 393616 394060 394590 394746 395022 396103 397976 400032 401702 402735 403112 403061 403020 403308 403813 404187 404239 404016
61950D04016l56k50K16R17J520J830J960K093K421L242M666O175O967O965P001
61935D49383P758Q927R710R814R531R171Q794Q300P489O217M699L403K415J218
61921E46829m93k127k821k599k290k390k496k006q80N17J981L547N144O491P433
61906E53840Q200R219J0597J1877J2437J2175J1659J1460J1469J1079J0091R170
61894F83273R295J0719J2656J4081J4704J5032J5563J6294J6953J7252J6606J4126
61882H56554R553L942j257n785j0482j5626k0192k3128k4577k5300k5462k4710
61870F93530k3095k1132j9072j6749j4183j1781r820q180o698n387m201k899j346
61857E48987K39J499K364L194M481O338Q248R541J0233J1044J2326J3283J2843
$$ plain form
61950 404016 403660 403410 403626 404543 406063 407893 409853 411946 414367 417609 422275 428450 435417 442382 449383
61935 449383 457141 466068 475778 485592 495123 504294 513088 521388 528877 535094 539793 543196 545611 546829
61921 546829 546336 544209 541388 538789 536499 534109 531613 529607 528727 529244 531225 534772 539916 546407 553840
61906 553840 562040 571259 581856 593733 606170 618345 630004 641464 652933 664012 674103 683273
61894 683273 692568 703287 715943 730024 744728 759760 775323 791617 808570 825822 842428 856554
61882 856554 866107 870049 868792 863007 852525 836899 816707 793579 769002 743702 718240 693530
61870 693530 670435 649303 630231 613482 599299 587518 577698 569518 562820 557433 553232 550333 548987
61857 548987 549226 550725 553089 556283 560764 567102 575350 584891 595124 606168 618494 631777 644620
61844F44620J1114R384Q544Q153P301N837M262K762R18j526m104n938o438n683
61830F79206m252k810j657n32J046L152N233O624P212P455P757Q043P978P428
61816G31883O517N391M143K996K295K228K607L013L116K833K198J157n07k938
61802G66932n941r013j1763j4108j5979j7021j6893j5744j4098j2225j0031p643
61790F16473n637m417l595k491j084o5J56O2L95J219J969K341K618L083L559L880
61774F18466M409N610P270Q778J0094J1837J4180J6385J7853J9118K1205K4273
61762G79478K7500L0109L2016L3490L4732L5816L6589L6498L4854L1278K5766
61751A138126J8464R742L76q697j6915k4069k9936l4280l7115l8599l8746l7609
$$ plain form
61844 644620 655734 665118 673662 681815 689116 694953 699215 701977 702895 701369 697265 691327 684889 679206
61830 679206 674954 672144 670487 669955 671001 674153 679386 686010 693222 700677 708434 716477 724455 731883
61816 731883 738400 743791 747934 750930 753225 755453 758060 761073 764189 767022 769220 770377 769870 766932
61802 766932 760991 751978 740215 726107 710128 693107 676214 660470 646372 634147 624116 616473
61790 616473 610836 606419 602824 600333 599249 599184 599340 599402 599797 601016 602985 605326 607944 611027 614586 618466
61774 618466 622875 628485 635755 644533 654627 666464 680644 697029 714882 734000 755205 779478
61762 779478 806978 837087 869103 902593 937325 973141 1009730 1046228 1081082 1112360 1138126
61751 1138126 1156590 1166332 1166708 1158011 1141096 1117027 1087091 1052811 1015696 977097 938351 900742
61739I00742l5643l3465l1262k8791k5932k2878j9938j7488j5850j4828j3604
61728F41063j1685r605q122p097n945m874m528m567l876k323j110j003j333j246
61714E73749q86o67l44L86J083J092M50m46j465k487l090l095k977l156l415l555
61698E51177l917m683n295n314n197n443n618n136m488m634n523o194o142n641
61684D77952m953m125l413l089k911k518k144k191k366k100j594j492j725j690
61670D41641j463j680k161j840l62J286K206K708L526M723N878O814P546P962
61656D76784Q065Q116Q234Q077P227N555L174M08k028l401l777l961m341m300
61642E03832l163j304K46J079J802L156N056O691P442P555P706Q011P795O477
$$ plain form
61739 900742 865099 831634 800372 771581 745649 722771 702833 685345 669495 654667 641063
61728 641063 629378 619773 611651 604554 598609 593735 589207 584640 580764 578441 577331 576328 574995 573749
61714 573749 572863 572196 571852 572238 573321 574413 574863 574417 572952 570465 567375 564280 561303 558147 554732 551177
61698 551177 547260 542577 537282 531968 526771 521328 515710 510574 506086 501452 495929 489735 483593 477952
61684 477952 472999 468874 465461 462372 459461 456943 454799 452608 450242 448142 446548 445056 443331 441641
61670 441641 440178 438498 436337 434497 434135 435421 437627 440335 443861 448584 454462 461276 468822 476784
61656 476784 484849 492965 501199 509276 516503 522058 525232 525640 523612 520211 516434 512473 508132 503832
61642 503832 500669 499365 499611 500690 502492 505648 510704 517395 524837 532392 540098 548109 555904 562381
61628E62381M262J638j347m713p855j0004j1194j2060j2675j2445j1201r628q369
61615D66790p353o343n531n217n243n185m778m076l356k984l025l128l056l158
61601D04357l729m213l835k933k602k981k965k078j408j974l077l279k444j698
61587C65141j719k062k169k112k123k044j569p40P0N23O17P27J226J970K349K007
61571C60092J382J215J645K123K173J954J972K423L019L399L568L793M172M569
61557C97499M955N450N861N613M513L260K592K334J795R41L46J84P0m0K73R24
61541D36570J115M90k92o08p03r42r85m03L75N68P5o43j410k299k999l034k571
61524D22304k303k535k898l050l011k714j820l45J000J487J264J184J809K843
$$ plain form
61628 562381 566643 568281 566934 562221 554366 544362 533168 521108 508433 495988 484787 475159 466790
61615 466790 459437 453094 447563 442346 437103 431918 427140 423064 419708 416724 413699 410571 407515 404357
61601 404357 400628 396415 392580 389647 387045 384064 381099 379021 377613 375639 372562 369283 366839 365141
61587 365141 363422 361360 359191 357079 354956 352912 351343 350603 350673 351196 351813 352540 353766 355736 358085 360092
61571 360092 361474 362689 364334 366457 368630 370584 372556 374979 377998 381397 384965 388758 392930 397499
61557 397499 402454 407904 413765 419378 423891 427151 429743 432077 433872 434813 435159 435343 435413 435373 435646 436570
61541 436570 437685 438175 437883 437275 436572 435630 434645 434242 434617 435185 435260 434617 433207 430908 427909 424875 422304
61524 422304 420001 417466 414568 411518 408507 405793 403973 403628 404628 406115 407379 408563 410372 413215
61510D13215L653M095M579N339O005O138N954O145P037Q309R565J0790J2124J3488
61496E16436J4636J5360J5528J5106J4264J3284J2352J1551J0868R917P929M639
61484F61870J087j130j492q87k86J68N32M54l23j405k254k848l375l785m069m468
61468F37789m911m737l652k529k504l554m681n346n979p040q205q684p981o317
61454E61669m467l172k521k036j461j072j015q36j19Q87J810K873M319N552N726
61439E66137N095M771N090N101L919J824l02j909k754k622j700p76m46k88N46
61424E81686K073L380L813L772M024M656N113N094M899M778M297K775K40k373
61410F28227m097m750m854m918m958m644l823k831k223k169k308k264k087j914
$$ plain form
61510 413215 416868 420963 425542 430881 436886 443024 448978 455123 462160 470469 480034 490824 502948 516436
61496 516436 531072 546432 561960 577066 591330 604614 616966 628517 639385 649302 657231 661870
61484 661870 662957 661827 660335 659448 659162 659330 659862 660316 659993 658588 656334 653486 650111 646326 642257 637789
61468 637789 632878 628141 624489 621960 619456 615902 611221 605875 599896 592856 584651 575967 567986 561669
61454 561669 557202 554030 551509 549473 548012 546940 545925 545089 544970 545857 547667 550540 554859 560411 566137
61439 566137 571232 576003 581093 586194 590113 591937 591635 589726 586972 584350 582650 581874 581428 581140 581686
61424 581686 583759 587139 590952 594724 598748 603404 608517 613611 618510 623288 627585 630360 630600 628227
61410 628227 624130 619380 614526 609608 604650 600006 596183 593352 591129 588960 586652 584388 582301 580387
61396E80387j554q49j90q6k87j3Q66J650J895K042K602L411M121M874N948P098
61380F11915P767P720P171O588O568P441Q649R109Q511P693P293O716N136K899
61366G11176R92m22j998l872n407o262o885p743q696r387r650r447q813q023p393
61351F18170o858o155n376m964n051n262n200m753l960k971k145j810j879j995
61337E59791j961j689r49L18J557K139K245K588L253L487K949K370K623L602M516
61322E86839M955N171N474N796N941N987O260O972P970Q911R656J0296J0865J1267
61308F92360J1588J2167J3092J3941J4297J4198J3833J3098J1816J0027P716M715
61296H32848J372j200k326k885m329o759q838r660r767j0165j1073j1975j2281
$$ plain form
61396 580387 578833 577984 577794 577708 577421 577408 578274 579924 581819 583861 586463 589874 593995 598869 604817 611915
61380 611915 619682 627402 634573 641161 647729 655170 663819 672928 681439 689132 696425 703141 708277 711176
61366 711176 712168 711746 709748 705876 700469 694207 687322 679579 670883 661496 651846 642399 633586 625563 618170
61351 618170 611312 605157 599781 594817 589766 584504 579304 574551 570591 567620 565475 563665 561786 559791
61337 559791 557830 556141 555192 555510 557067 559206 561451 564039 567292 570779 573728 576098 578721 582323 586839
61322 586839 591794 596965 602439 608235 614176 620163 626423 633395 641365 650276 659932 670228 681093 692360
61308 692360 703948 716115 729207 743148 757445 771643 785476 798574 810390 820417 828133 832848
61296 832848 834220 833020 830694 827809 823480 816721 807883 798223 788456 778291 767218 755243 742962
61283G42962j1697j0425r240q806q895q719q103p558p154o260m743l564l509m091
61269F40198m329m125m010l914l116j418L84J411J634J731K237L054L665L718
61255F37120L327K853K460K127K021K504L588M750N487N970O763Q046R269R687
61241G05972R090P952O813N605L796J191j615l802n054n468n080l959k588j520
61227G11333o62N96K425M295N826P363R327J1383J2669J2718J1747J0189Q250
61214H07459O093M211L307L552M071L650K145P56N85J334J861J690J333J378J952
61199H45377K926M008M652M616M588N510P219Q510Q621P816O371L982O65k638
61185I12223m949o225o910p189p278p873r445j1449j2848j3276j3212j3223j3513
$$ plain form
61283 742962 731265 720840 711600 702794 693899 685180 677077 669519 662365 656105 651362 647798 644289 640198
61269 640198 635869 631744 627734 623820 620704 619286 619670 621081 622715 624446 626683 629737 633402 637120
61255 637120 640447 643300 645760 647887 649908 652412 656000 660750 666237 672207 678970 687016 696285 705972
61241 705972 715062 723014 729827 735432 739228 740419 738804 735002 729948 724480 719400 715441 712853 711333
61227 711333 710671 711267 713692 717987 723813 731176 740503 751886 764555 777273 789020 799209 807459
61214 807459 813552 817763 821070 824622 828693 832343 834488 835244 835829 837163 839024 840714 842047 843425 845377
61199 845377 848303 852311 856963 861579 866167 871677 878896 887406 896027 903843 910214 914196 914861 912223
61185 912223 907274 901049 894139 886950 879672 871799 862354 850905 838057 824781 811569 798346 784833
61172G84833j3943j4035j3281j1909j1004j1310j2219j2610j2338j2118j2070
61161F47996j1391r662p655o428o116o024n582m732l638k438j240p4J165K480
61147E86661L481L529K380M89j424l059m527n731o146n444m034k626j410m8J523
61132E63614K834L504L762M156N027O411Q202J0182J2034J3513J4513J4972J4960
61119F77684J4955J5711J7513J9645K0952K0972K0452K0567K1675K2913K3147
61108H96186K2152K0638J9235J7926J6504J5031J3503J1644R386P146N162L075
61096A057588P38j199k247l054m420n758n833m724l723l238k293l64J699L228
61082A026400M908P471J0330J2525J4202J6111J8145J9532K0079K0359K0724K0936
$$ plain form
61172 784833 770890 756855 743574 731665 720661 709351 697132 684522 672184 660066 647996
61161 647996 636605 626943 619288 612860 606744 600720 595138 590406 586768 584330 583090 583016 584181 586661
61147 586661 590142 593671 596051 596540 595116 592057 587530 581799 575653 570209 566175 563549 562139 562091 563614
61132 563614 566448 569952 573714 577870 582897 589308 597510 607692 619726 633239 647752 662724 677684
61119 677684 692639 708350 725863 745508 766460 787432 807884 828451 850126 873039 896186
61108 896186 918338 938976 958211 976137 992641 1007672 1021175 1032819 1042205 1049351 1054513 1057588
61096 1057588 1058326 1057127 1054880 1051826 1047406 1041648 1035815 1031091 1027368 1024130 1021837 1021473 1023172 1026400
61082 1026400 1031308 1038779 1049109 1061634 1075836 1091947 1110092 1129624 1149703 1170062 1190786 1211722
61070A211722K0595J9423J7269J4336J1270Q547N985L165M8l186o464r576j2038
61057A281096j3693j5042j6469j7532j7609j6890j6107j5520j4736j3363j1395
61046A112740r132p069n596m496l077j038J140L007M756O642Q408R799J1098J2635
61032A139817J4344J6227J8578K1200K3244K4505K6103K8834L1714L3343L4120
61021A412029L5838L9491M4766N1344N9350O8540P8339Q8773J00535J14377J31448
61010B224830J53870J83733K21829K68659L26129L96662M81071N79267O92394
61001E528444Q21434R64105J116939J279700J448368J594925J658284J571045
60993A5983244J309436R21114N02532J48023q4203j73605j30406j558J25045J46318
$$ plain form
61070 1211722 1232317 1251740 1269009 1283345 1294615 1303162 1309147 1312312 1312360 1309174 1302710 1293134 1281096
61057 1281096 1267403 1252361 1235892 1218360 1200751 1183861 1167754 1152234 1137498 1124135 1112740
61046 1112740 1103608 1096539 1090943 1086447 1083370 1082332 1083472 1086479 1091235 1097877 1106285 1116084 1127182 1139817
61032 1139817 1154161 1170388 1188966 1210166 1233410 1257915 1284018 1312852 1344566 1377909 1412029
61021 1412029 1447867 1487358 1532124 1583468 1642818 1711358 1789697 1878470 1979005 2093382 2224830
61010 2224830 2378700 2562433 2784262 3052921 3379050 3775712 4256783 4836050 5528444
61001 5528444 6349878 7313983 8430922 9710622 11158990 12753915 14412199 15983244
60993 15983244 17292680 18213794 18716326 18864349 18780146 18606541 18476135 18474577 18599622 18745940
60983A8745940m023l17416p18463j108581j408788j578935j616793j547913j411026
60974I034002j242663j068237r02573p54068o26372n18751m28461l53523k92710
60965B846644k44012k04896j73697j49522j31006j16292j04024r3441q3725p4225
60955A471804o5152n7089n0008m3511l7765l3283k9975k7316k5374k4695k5094
60944A052542k5456k4953k3808k2665k1768k0964k0039j8913j7836j7319j7502
60933H21319j7729j7246j6160j5123j4250j3134j1839j0977j0594r867q306o602
60921F69492n724n680n729n426m922m414l870l310k942k891k945k724k147j622
60907F15146j619j981j928j045q6k72j832l699m785n050n135n413n772n972n856
$$ plain form
60983 18745940 18741917 18424501 17706038 16597457 15188669 13609734 11992941 10445028 9034002
60974 9034002 7791339 6723102 5820529 5066461 4440089 3921338 3492877 3139354 2846644
60965 2846644 2602632 2397736 2224039 2074517 1943511 1827219 1723195 1629754 1546029 1471804
60955 1471804 1406652 1349563 1299555 1256044 1218279 1184996 1155021 1127705 1102331 1077636 1052542
60944 1052542 1027086 1002133 978325 955660 933892 912928 892889 873976 856140 838821 821319
60933 821319 803590 786344 770184 755061 740811 727677 715838 704861 694267 684400 676094 669492
60921 669492 663768 658088 652359 646933 642011 637597 633727 630417 627475 624584 621639 618915 616768 615146
60907 615146 613527 611546 609618 608573 608487 608215 606383 602684 597899 592849 587714 582301 576529 570557 564701
60892E64701n400m857m641m811m891m476l796l311l048k762k633l117m151n011
60878E07796n143m717m158l580k979k579k597k807k668j831l49J419K961L837
60864D82605M077M198M582N014N088M877M757M683M169L034J754R34P69J104J618
60849E33263J913J804J664J965K379J872Q3j899k686k198j663k203l859n892p502
60834E17041q241q127p542o904o499o492o817o937o242m958m145m318m625m041
60820D31153k910k383k654k845k573k522l111l603l131j934r77q16j359k258k997
60805C95080k969k000p17O8J70Qj1K40P49J351J748J809J771J875J978J784J291
60788D04225P56M05M04R28J874K631K534J523J91q49j414j710k006k334k405j956
$$ plain form
60892 564701 559301 554444 549803 544992 540101 535625 531829 528518 525470 522708 520075 516958 512807 507796
60878 507796 502653 497936 493778 490198 487219 484640 482043 479236 476568 474737 474388 475807 478768 482605
60864 482605 486682 490880 495462 500476 505564 510441 515198 519881 524050 527084 528838 529772 530541 531645 533263
60849 533263 535176 536980 538644 540609 542988 544860 544943 543044 540358 538160 536497 534294 530435 524543 517041
60834 517041 508800 500673 493131 486227 479728 473236 466419 459482 453240 448282 444137 439819 435194 431153
60820 431153 428243 425860 423206 420361 417788 415266 412155 408552 405421 403487 402510 401694 400335 398077 395080
60805 395080 392111 390111 389394 389462 389632 389640 389629 389869 390618 391969 393717 395526 397297 399172 401150 402934 404225
60788 404225 404981 405386 405790 406718 408592 411223 413757 415280 415471 414622 413208 411498 409492 407158 404753 402797
60772D02797j239r41j393k088k298j961j538j192o36J61O34L51k89n06j62J53
60756C89853R2R6O14J157Q62j63p70l72K29K01J63J286L232M195L200J308J24
60739D05307p6j18o00j497k625l669m050l382k082r58l30P1M44P33R74J329J752
60722C91223K029K131K230K348K382K376K410K299J835J302J220J551J615J028
60708D17979K78O6L83N22qr11j459j323r43r95j584k194k503k831l489m009l594
60691C93385k268j050q43j533k318k572k197j415m75N54J766L060L866L613K564
60676C94137J760J938K839L816M623N206N111L863J845J27p36j219j870k461k509
60661D16470k197k135k373k316j674r20n48m17j61J98N05R90J937K979L345K886
$$ plain form
60772 402797 401558 400617 399224 397136 394838 392877 391339 390147 389511 389672 390306 390657 390368 389862 389700 389853
60756 389853 389945 390041 390655 391812 392674 392511 391741 391369 391598 391799 391962 393248 396480 400675 403875 405183 405307
60739 405307 405231 405113 404513 403016 400391 396722 392672 389290 387208 386250 385920 385991 386435 387168 388142 389471 391223
60722 391223 393252 395383 397613 399961 402343 404719 407129 409428 411263 412565 413785 415336 416951 417979
60708 417979 418257 418323 418706 419228 419220 418309 416850 415527 414584 413589 412005 409811 407308 404477 400988 396979 393385
60691 393385 391117 390067 389224 387691 385373 382801 380604 379189 378714 379268 381034 384094 387960 391573 394137
60676 394137 395897 397835 400674 404490 409113 414319 419430 423293 425138 425265 424529 423310 421440 418979 416470
60661 416470 414273 412138 409765 407449 405775 404855 404307 403890 403729 403927 404432 405422 407359 410338 413683 416569
60645D16569K277K037J852J148n8j212j897k123k138k188k342k348j899j169p84
60630D05725r67j085m56P04J570J811J719J399N95m94r65l23O61P83l9o75k01
60613D09762J023J881J762J031M06J50K8m8L54J627L227L813K660O39o65o86k23
60596D26741q1q2L05R01J078P22K98M1k47n12k54O81J666J961J505P33K3l44l4
60577D35101R06J737J758J284J372K533M179N472O268O971P835Q634Q923Q507
60563E01480P694P074O907O819O215M876K931N55j795l150k787j343m04o89j168
60548E33215m25J641L947N634O757P772Q971J0384J1864J3160J4214J5329J6824
60535F49287J8574K0181K1411K2143K2001K0494J7612J3894R807N341M38m535
$$ plain form
60645 416569 418846 420883 422735 423883 423825 422613 420716 418593 416455 414267 411925 409577 407678 406509 405725
60630 405725 404758 403673 403217 403921 405491 407302 409021 410420 411015 410521 409556 409233 409894 410677 410638 409963 409762
60613 409762 410785 412666 414428 415459 415865 416015 416043 415995 416349 417976 421203 425016 427676 428315 427650 426964 426741
60596 426741 426660 426578 426883 427784 428862 429584 429882 429923 429676 429164 428910 429591 431257 433218 434723 435456 435479 435135 435101
60577 435101 436007 437744 439502 440786 442158 444691 448870 454342 460610 467581 475416 484050 492973 501480
60563 501480 509174 516248 523155 529974 536189 541065 543996 544551 542756 539606 536819 535476 535072 534383 533215
60548 533215 532790 534431 538378 544012 550769 558541 567512 577896 589760 602920 617134 632463 649287
60535 649287 667861 688042 709453 731596 753597 774091 791703 805597 815404 820745 821183 816648
60523H16648q976j2494j4940j6165j6128j5222j4146j3219j2067j0156p515m772
60511F70848k582j208m86J25J375L616O335Q715J0709J3085J6200J9366K1913
60498G68011K4280K7295L0707L3327L4544L4840L4673L3743L1675K8855K6073
60487A108023K3798K2171K1284K0993K0610J9193J6148J1423N256k120j0662k0382
60475A235735l0795m0562m8097n2662n4576n4407n2397m8781m4171l9335l4895
60464G35057l1231k8283k5389k1884j8094j5112j3422j2314j0995r575q498p676
60452E32584o792n981n550n352n054m744m575m211l262k181j896k553l220k996
60438D74217j929p77j65k08o47j206j802k402k720k432j736j269j198r36p8Q27
$$ plain form
60523 816648 807672 795178 780238 764073 747945 732723 718577 705358 693291 683135 675620 670848
60511 670848 668266 667058 666572 666697 668072 671688 678023 686738 697447 710532 726732 746098 768011
60498 768011 792291 819586 850293 883620 918164 953004 987677 1021420 1053095 1081950 1108023
60487 1108023 1131821 1153992 1175276 1196269 1216879 1236072 1252220 1263643 1268899 1266779 1256117 1235735
60475 1235735 1204940 1164378 1116281 1063619 1009043 954636 902239 853458 809287 769952 735057
60464 735057 703826 675543 650154 628270 610176 595064 581642 569328 558333 548758 540260 532584
60452 532584 525792 519811 514261 508909 503855 499111 494536 490325 487063 484882 482986 480433 477213 474217
60438 474217 472288 471511 471346 471138 470491 469285 467483 465081 462361 459929 458193 456924 455726 454790 454712 455539
60422D55539J039P01N59Q64J213J334J393J519J593J591J665J877K150K407K523
60407D77967K322J916J792K197K709K827K669K624K670K655K904L754M746N029
60393E18781M576M205M450N140O001O848P117O186M456L238L141L272K561J267
60379E81239M78O38J227J695K067K536K978L053K615J869J156O83M18K70K12L20
60363F03454P58J652K775L484L472L476M561O494P703P381O769P462R202J0395
60349F79038J0278R316P746N286K360J77r71k241m499p022q593r068r075q869
60335F63863q236p091n611m103l173l442m656n577n365m583m298m652m902m500
60321E93674l494k212j085n01l06K43J659L644N718P811R706J0547R803Q298P370
$$ plain form
60422 455539 456578 457279 457838 458702 459915 461249 462642 464161 465754 467345 469010 470887 473037 475444 477967
60407 477967 480289 482205 483997 486194 488903 491730 494399 497023 499693 502348 505252 509006 513752 518781
60393 518781 523357 527562 532012 537152 543153 550001 557118 563304 567760 570998 574139 577411 579972 581239
60379 581239 581717 582355 583582 585277 587344 589880 592858 595911 598526 600395 601551 602234 602652 602922 603134 603454
60363 603454 604212 605864 608639 612123 615595 619071 623632 630126 637829 645210 651979 659441 668643 679038
60349 679038 689316 698632 706378 711664 714024 714201 713230 710989 706490 699468 690875 681807 672732 663863
60335 663863 655627 648536 642925 638822 635649 632207 627551 621974 616609 612026 607728 603076 598174 593674
60321 593674 590180 587968 586883 586382 586076 586319 587978 591622 597340 605151 614857 625404 635207 643505 650875
60306F50875P253P170O716O154N422M113K546J731J822J529l03l287o204q406
60292F77131r877j0565j0480j0126r913r345p712n495m174m407n137m984l881
60279E81035k792k319k251k335k699l469m423n210n554n247m338l448l345l964
60265E29641m298l576k232j267j003r62p58m90k68P1N88J055J290J467J855K454
60249E23567L009L283L177K742K180J758J622J628J409P23j59n28j0Q26J106Q13
60233E47146P44J153J311R29J059K690M993O237O197O354P642R258J0114J0416
60219F16243J1031J2130J3236J4093J4740J5029J4727J3990J3213J2533J1835
60208G62800J1177J0852J1058J1608J1912J1294R637P718O526O228O169N880N509
$$ plain form
60306 650875 658128 665298 672014 678168 683590 687703 690249 691980 693802 695331 695028 691741 685537 677131
60292 677131 667254 656689 646209 636083 626170 616825 609113 603618 599444 595037 589900 584916 581035
60279 581035 578243 575924 573673 571338 568639 565170 560747 555537 549983 544736 540398 536950 533605 529641
60265 529641 525343 521767 519535 518268 517265 516303 515545 515055 514787 514858 515446 516501 517791 519258 521113 523567
60249 523567 526576 529859 533036 535778 537958 539716 541338 542966 544375 545098 544939 544411 544401 545227 546333 547146
60233 547146 547890 549043 550354 551283 552342 555032 560025 566262 572459 578813 586455 595713 605827 616243
60219 616243 627274 639404 652640 666733 681473 696502 711229 725219 738432 750965 762800
60208 762800 773977 784829 795887 807495 819407 830701 840338 848056 854582 860810 866979 872859 878368
60195H78368N165M576L606K445J037r21l056m264m202l955m452n004m512l424
60181H61407l101l512l177j511J76O26L31M68J078J289Q30K12l87j399k946m428
60165H45956n338n903o638p640q615r268r349q619p229n845m967m268l114j677
60151G57486q85j066j265m33J208K477K726K427K329K617K994L210L250L216L179
60136G83470L143L131L352M015M894N332M960M139L450K981K538K172K049J995
60122H31621J786J724K296L439M773O398Q672J1203J2935J3475J3515J3739J4025
60109I39601J4081J4113J4360J4453J3850J2579J1210J0347J0302J0886J1336
60098A077118J0791R147P064N116L262J254r59l334n774p995r858j1789j4196
$$ plain form
60195 878368 883533 888109 891715 894160 895197 894276 891220 886956 882754 878799 874347 869343 864831 861407
60181 861407 858306 854794 851617 850106 850282 850908 851239 851707 852785 854074 854904 855116 854729 853330 850384 845956
60165 845956 840618 834715 828077 820437 811822 802554 793205 784586 777357 771512 766545 762277 759163 757486
60151 757486 756601 755535 754270 753837 755045 757522 760248 762675 765004 767621 770615 773825 777075 780291 783470
60136 783470 786613 789744 793096 797111 802005 807337 812297 816436 819886 822867 825405 827577 829626 831621
60122 831621 833407 835131 837427 840866 845639 852037 860709 871912 884847 898322 911837 925576 939601
60109 939601 953682 967795 982155 996608 1010458 1023037 1034247 1044594 1054896 1065782 1077118
60098 1077118 1087909 1097056 1104120 1109236 1112498 1113752 1112793 1109459 1103685 1095690 1085832 1074043 1059847
60085A059847j6497j7633j7576j7367j7475j7228j6244j5148j4313j3102j1205
60074H86059r641r321r526q992p770o857o497o160n683n283m756l861l215l588
60060G94909m535m917m674m786n478n816n327m759m782n012m811m218l502k620
60046G29672j655j116j131j021k32P59J150J047J240J892K170J421J54n04j77
60031G33669L69K85k35k71N56J593K014J631O88n99j897k722k960l112l541l893
60015G21575l800l663m026m631m833m695m838n309n526n276n029n087n145m898
60001F54819m533m369m485m709m688l993k583j034R3R56J949K925L528M119N433
59986F43428P401R135J0148J0699J0889J0316Q930P398O253N285M155K991J945
$$ plain form
60085 1059847 1043350 1025717 1008141 990774 973299 956071 939827 924679 910366 897264 886059
60074 886059 876418 867097 857571 848579 840809 833952 827455 821295 815612 810329 805573 801712 798497 794909
60060 794909 790374 785457 780783 775997 770519 764703 759376 754617 749835 744823 740012 735794 732292 729672
60046 729672 728017 726901 725770 724749 724517 725276 726426 727473 728713 730605 732775 734196 734350 733846 733669
60031 733669 734038 734323 734088 733817 734373 735966 737980 739611 740299 739700 737803 735081 732121 729009 725468 721575
60015 721575 717775 714112 710086 705455 700622 695927 691089 685780 680254 674978 669949 664862 659717 654819
60001 654819 650286 645917 641432 636723 632035 628042 625459 624425 624518 625474 627423 630348 633876 637995 643428
59986 643428 650829 659964 670112 680811 691700 702016 710946 718344 724597 729882 734037 737028 738973
59973G38973P58q42k599l934m461m118l245k554k675l450m027l729k579j030L26
59958G00814Q91M98k41n25l27k31l85l73j17r4l90l56N03J850L066L936M513M811
59940G17843M876M769M365L618K963K871L066K963K833L621N484P515R065J0321
59926G86173J1292J1375J0515R646R349R027Q168P424P622Q508R469J0641J2310
59913I11519J3906J4726J5059J5468J5434J3862J0674O809K921q90m333p060r420
59900I98675j1966j4348j5768j6420j7142j7666j6606j3613j0296q223p058n522
59888H44047l351j355M0J287K886M775O559P923Q803R485J0436J1774J2912J3048
59874I29269J1936J0058Q169O818O130N740N045L676J780k29k004l320l978l984
$$ plain form
59973 738973 739731 738889 736290 732356 727895 723777 720532 717978 715303 711853 707826 704097 701518 700488 700814
59958 700814 701705 702203 701962 701437 701110 700879 700494 700121 700004 699910 699520 699164 699667 701517 704583 708519 713032 717843
59940 717843 722719 727488 731853 735471 738434 741305 744371 747334 750167 753788 759272 766787 775852 786173
59926 786173 797465 808840 819355 829001 838350 847377 855545 862969 870591 879099 888568 899209 911519
59913 911519 925425 940151 955210 970678 986112 999974 1010648 1017457 1020378 1019488 1015155 1008095 998675
59900 998675 986709 972361 956593 940173 923031 905365 888759 875146 864850 856627 849569 844047
59888 844047 840696 839341 839381 840668 843554 848329 854888 862811 871614 881099 891535 903309 916221 929269
59874 929269 941205 951263 959432 966250 972380 978120 983165 986841 988621 988392 986388 983068 979090 975106
59860I75106l697l537l523l296k604j590n24N86J868L099L636L028J604K60l94
59845I70022n72r68k089l912n975p573q135p619o546n502m668l998l664l986m955
59830H99860o048o591o156m694k591o08N75R71J189J655K226K760L665N381P571
59815H99165R445J0923J2675J4762J5955J5029J2279R003N868K710k17j962k241
59802A003394k090k518l209l352l142l566m950o631p946q778r101q907q650r054
59788I21500j0098j0857j0631r800r134q765q284p600p157p329p803p740o505
59775H09797m322k093m72P25K019L411M468N029N348N649O096P126R085J1398
59761H63264J2782J2726J2225J2741J4686J7296J9595K1127K1909K2074K1652
$$ plain form
59860 975106 971409 967872 964349 961053 958449 956859 956335 956921 958789 961888 965524 968552 970156 970416 970022
59845 970022 969450 968482 966393 962481 956506 948933 940798 933179 926633 921131 916463 912465 908801 904815 899860
59830 899860 893812 887221 881065 876371 873780 873172 873747 874718 875907 877562 879788 882548 886213 891594 899165
59815 899165 908610 919533 932208 946970 962925 977954 990233 999236 1005104 1007814 1007597 1005635 1003394
59802 1003394 1001304 998786 995577 992225 989083 985517 980567 973936 965990 957212 948111 939204 930554 921500
59788 921500 911402 900545 889914 880114 870980 862215 853931 846331 839174 831845 824042 816302 809797
59775 809797 805475 803382 802910 803635 805654 809065 813533 818562 823910 829559 835655 842781 851866 863264
59761 863264 876046 888772 900997 913738 928424 945720 965315 986442 1008351 1030425 1052077
59750A052077K0593J8976J6945J4341J0726O158J679j619l709n256o382o725o620
59737A111184p042q174r047r102q995r289r337q369o909o040n730m964l297j427
59723A013462k49m4n22j046r17L6J190J988K778M227O143P689Q705J0005J2235
59708A065680J5137J8175K1262K4439K7373K9679L1483L3285L5269L7046L8074
59697A376902L8132L7400L6238L4946L3618L1985K9487K5721K1028J6411J2632
59686A694500R503O300K733q23l905o364q247r771j1341j3160j4822j5822j6420
59673A612361j7298j8286j8209j6333j3274j0130p309m640j965R08M405Q676J3219
59660A532125J7397K1028K4195K6926K9334L1545L3119L3141L1375K8689K5789
$$ plain form
59750 1052077 1072670 1091646 1108591 1122932 1133658 1139816 1141495 1139876 1136167 1130911 1124529 1117804 1111184
59737 1111184 1104142 1095968 1086921 1077819 1068824 1059535 1050198 1041829 1034920 1028880 1023150 1018186 1014889 1013462
59723 1013462 1013213 1013169 1012647 1011601 1010684 1010720 1011910 1013898 1016676 1020903 1027046 1034735 1043440 1053445 1065680
59708 1065680 1080817 1098992 1120254 1144693 1172066 1201745 1233228 1266513 1301782 1338828 1376902
59697 1376902 1415034 1452434 1488672 1523618 1557236 1589221 1618708 1644429 1665457 1681868 1694500
59686 1694500 1704003 1710303 1713036 1712213 1708308 1701944 1693697 1683926 1672585 1659425 1644603 1628781 1612361
59673 1612361 1595063 1576777 1558568 1542235 1528961 1518831 1511522 1506882 1504917 1505825 1510230 1518906 1532125
59660 1532125 1549522 1570550 1594745 1621671 1651005 1682550 1715669 1748810 1780185 1808874 1834663
59649A834663K2119J6715R559J385p416j6780k6186l4720m1769m7030n0146n0965
59637A609429m9979m7849m4796m1005l7206l4058l1317k8388k5481k3315k2007
59626A224028k1142k0822k1656k3650k5945k7733k8688k8649k7681k6432k5535
59615I46095k4596k2673j9757j6849j4491j2220r798p870o877o191n001l478k422
59602G93872k137k217k137j669r07k10J02J15J58K18j7n36r53j196j639k307k586
59585G75954k139j576j760k729l763m290m343m297m470m955n596o143o420o297
59571G17176n630m491l349k677k462k308k020j655j206o75l59n37r38j031p38
59556F87100l00M27J744L221L941L850L995N125O792Q266R475J0604J1454J1939
$$ plain form
59649 1834663 1856782 1873497 1883056 1884441 1877025 1860245 1834059 1799339 1757570 1710540 1660394 1609429
59637 1609429 1559450 1511601 1466805 1425800 1388594 1354536 1323219 1294831 1269350 1246035 1224028
59626 1224028 1202886 1182064 1160408 1136758 1110813 1083080 1054392 1025743 998062 971630 946095
59615 946095 921499 898826 879069 862220 847729 835509 825711 817841 810964 804773 799772 796294 793872
59602 793872 791735 789518 787381 785712 784805 784595 784697 784812 784970 785188 785171 784635 783682 782486 780847 778540 775954
59585 775954 773815 772239 770479 767750 763987 759697 755354 751057 746587 741632 736036 729893 723473 717176
59571 717176 711546 707055 703706 701029 698567 696259 694239 692584 691378 690703 690344 689807 688869 687838 687100
59556 687100 686800 687227 688971 692192 696133 699983 703978 709103 715895 724161 733636 744240 755694 767633
59542G67633J2596J3993J5911J7775J9542K1603K3975K5997K6600K4627J9504
59531I89756J2152M862m50l668n678o707o239m428k536j678j776k137k608l611
59517I65254n306p191q660r697j0779j2091j3119j3255j2663j2102j1888j1529
59505H36974j0522r131p933o969n832m425l113k121j153K39K158M334O401Q163
59491H07070R659J1047J2384J3548J4381J4847J5034J5091J5122J5016J4387J2924
59479I70510J0824Q642O702M932L271J804L50j578m109o610q341r217r602r686
59465I57892r516r312r111q295o181l105k84J587K973M537O176P392Q096Q442
59451I51291Q332P690O926O434N760M049J297j601m164o796r658j1967j3088j3533
$$ plain form
59542 767633 780229 794222 810133 827908 847450 869053 893028 919025 945625 970252 989756
59531 989756 1001908 1006770 1006320 1002652 996974 990267 984028 979600 977064 975386 973610 971473 968865 965254
59517 965254 959948 952757 944097 934400 923621 911530 898411 885156 872493 860391 848503 836974
59505 836974 826452 817321 809388 802419 796587 792162 789049 786928 785775 786014 788172 792506 798907 807070
59491 807070 816729 827776 840160 853708 868089 882936 897970 913061 928183 943199 957586 970510
59479 970510 981334 989976 996678 1001610 1004881 1006685 1007035 1005457 1001348 994738 986397 977180 967578 957892
59465 957892 948376 939064 929953 921658 915477 912372 912088 913675 916648 921185 927361 934753 942849 951291
59451 951291 959623 967313 974239 980673 986433 990482 991779 990178 986014 979218 969560 957593 944505 930972
59437I30972j4051j4281j3361j1548j0066r402q896q083p338o765n637l625j667
59424H16252p51m63M10K353M935P764J0730J3554J5829J7465J8602J9434K0563
59411I46677K2934K6382K8612K6723K0026J0715J894m308p040o459l587M12N241
59398A068222J1056J6885K0291J9250J3931O288j588q420j3651j7084j8597j8030
59386A078553j5606j2416r917q583p546n861l750k221j821k173k525k434j920
59373A001780j228m45N26J585K203J996J392J206J702K519L507M871O386P262
59359A035262P149O729O971Q247J0428J3222J6043J8129J9347K0502K2432K5109
59347A209570K8000L0850L3578L5765L6923L7107L6724L5886L4399L2242K9620
$$ plain form
59437 930972 916921 902640 889279 877731 867665 858263 849367 841284 833946 827181 821544 817919 816252
59424 816252 815501 815038 815448 817801 822736 830500 841230 854784 870613 888078 906680 926114 946677
59411 946677 969611 995993 1024605 1051328 1071354 1082069 1083963 1079655 1072615 1066156 1062569 1062981 1068222
59398 1068222 1079278 1096163 1116454 1135704 1149635 1155923 1154335 1145915 1132264 1115180 1096583 1078553
59386 1078553 1062947 1050531 1040614 1032031 1024485 1018624 1014874 1012653 1010832 1008659 1006134 1003700 1001780
59373 1001780 1000552 1000107 1000633 1002218 1004421 1006417 1007809 1009015 1010717 1013236 1016743 1021614 1028000 1035262
59359 1035262 1042411 1049140 1056111 1064358 1074786 1088008 1104051 1122180 1141527 1162029 1184461 1209570
59347 1209570 1237570 1268420 1301998 1337763 1374686 1411793 1448517 1484403 1518802 1551044 1580664
59336A580664K6485K2486J7479J1836O179R74l646p840j1884j5920j9873k3540
59324A583400k6655k8906l0242l1154l2287l3650l4580l4648l4262l4067l4058
59313A228891l3675l2497l0549k8083k5450k3100k1308j9817j7954j5186j1530
59302I69742p503l806r87O95J150K52k081n594r625j3364j6148j7546j7433j6054
59288H61698j3908j1463r039o842m893k985r56J042K768M340O133Q223J0212J1698
59274H56028J2732J3712J4939J6264J7123J7098J6450J5895J5650J5169J4076
59263A025136J2825J1901J0904R160O941N167M019K740Q69j165k830m094n035
59250A076538n520n561n391n113m709m448m577m622l832k429j531j576j786j596
$$ plain form
59336 1580664 1607149 1629635 1647114 1658950 1665129 1666103 1662457 1654617 1642733 1626813 1606940 1583400
59324 1583400 1556745 1527839 1497597 1466443 1434156 1400506 1365926 1331278 1297016 1262949 1228891
59313 1228891 1195216 1162719 1132170 1104087 1078637 1055537 1034229 1014412 996458 981272 969742
59302 969742 962239 958433 957446 958141 959291 959543 957462 951868 942243 928879 912731 895185 877752 861698
59288 861698 847790 836327 827288 820446 815553 812568 811612 812654 815422 819762 825895 834118 844330 856028
59274 856028 868760 882472 897411 913675 930798 947896 964346 980241 995891 1011060 1025136
59263 1025136 1037961 1049862 1060766 1069926 1076867 1082034 1086053 1088793 1089662 1088497 1085667 1081573 1076538
59250 1076538 1071018 1065457 1060066 1054953 1050244 1045796 1041219 1036597 1032765 1030336 1028805 1027229 1025443 1023847
59236A023847j629k671m392n893o928p863q850r690j0272j0548j0399r943r741
59223I25028j0186j0912j1229j0885j0113r192q263p400o536n566m600l865l301
59210H22980k656j989j471p27Q56K973M434M840N289O788Q757R966J0386J1117
59196H81543J2758J4820J6657J8200J9624K0889K1836K2458K2906K3333K3656
59185A098680K3397K1985J9328J5896J2183Q283M086m38n214r989j4284j7769
59173A156144k0586k2902k4274k4170k3036k2004k1504k0977k0022j8836j7371
59162I20462j5209j2656j0810r974r154p781o803p102p868p729o676n716n106
59149H07878m257l060k122j780j833k236l228m691o094p067p621p878q027q305
$$ plain form
59236 1023847 1022218 1019547 1015155 1009262 1002334 994471 985621 975931 965659 955111 944712 934769 925028
59223 925028 914842 903930 892701 881816 871703 862511 854248 846848 840312 834746 830146 826281 822980
59210 822980 820324 818335 816864 816137 816993 819966 824400 829240 834529 841317 850074 860040 870426 881543
59196 881543 894301 909121 925778 943978 963602 984491 1006327 1028785 1051691 1075024 1098680
59185 1098680 1122077 1144062 1163390 1179286 1191469 1199752 1203838 1203400 1198186 1188197 1173913 1156144
59173 1156144 1135558 1112656 1088382 1064212 1041176 1019172 997668 976691 956669 937833 920462
59162 920462 905253 892597 881787 871813 862659 854878 848075 840973 833105 825376 818700 812984 807878
59149 807878 803621 800561 798439 796659 794826 792590 789362 784671 778577 771510 763889 756011 747984 739679
59135G39679q660q600p738o214m360k373n40P88J773L029M665O083P050Q129R518
59120G42229J0482J0591J0545J0967J1311J0961J0420J0314J0096R044P731P096
59108H61787O655N212K905R79k37j581l304m624n171n607o441p335p886q092p876
59093H19384o988n670m609m110l931l917m025l836k901j569o24j45L61Q83Q87
59078G79190M37K54O24J157J655K279K756K493J713J385J761J926J164j00j185
59063G97509k184l494m965o046o539o778p201p838q136p472o098n095m968m786
59049G15909l547j804q98r11o64L49J312J573J487J422J054K39l53j24N84J057
59033G16685J148J114J010O87J54l50m07M77K453N007P328R008J0006J0257R892
$$ plain form
59135 739679 731019 722419 714681 708467 704107 701734 701194 701982 703755 706784 711449 717532 724582 732711 742229
59120 742229 752711 763302 773847 784814 796125 807086 817506 827820 837916 846960 854691 861787
59108 861787 868442 873654 876559 877538 877301 875720 872416 867792 862621 857014 850573 843238 835352 827260 819384
59093 819384 812396 806726 802117 798007 794076 790159 786134 782298 779397 777828 777204 777059 777420 778303 779190
59078 779190 779627 779881 780505 781662 783317 785596 788352 790845 792558 793943 795704 797630 798794 798694 797509
59063 797509 795325 791831 786866 780820 774281 767503 760302 752464 744328 736856 730758 725663 720695 715909
59049 715909 712362 710558 709660 708749 708085 708434 709746 711319 712806 714228 715282 715521 715168 715044 715628 716685
59033 716685 717833 718947 719957 720644 720798 720448 720041 720518 722971 727978 735306 744314 754320 764577 774469
59018G74469R507R477R101P288M059O50j922l594m676n345n854o408o640n938
59004G74174m357k658j356l82M22J132K031L205L948L466K173J319J231R50j20
58989G85178j129r22M60J934K696K975L668N339P496R122J0017J1114J3025J5122
58975H66095J6737J8407K0728K2710K2913K1790K1221K1785K2158K1365J9874
58964A095783J8034J5135J0840O265K641j49k928n906q744j1256j3429j5208j6612
58951A074466j7720j8416j8681j9008j9712j9978j8635j5991j3693j2628j2096
58940H87908j1224r998q545o621m369k512j284j23J146J828J578J122J218J727
58926H51851K184K481K579K337J991J988K120J726R43P17J332K041K478L140M177
$$ plain form
59018 774469 783976 793453 802554 809842 813901 814551 812629 809035 804359 799014 793160 786752 780112 774174
59004 774174 769817 767159 765803 765421 765843 766975 769006 772211 776159 779625 781798 783117 784348 785298 785178
58989 785178 784049 783127 783587 785521 788217 791192 794860 800199 807695 816817 826834 837948 850973 866095
58975 866095 882832 901239 921967 944677 967590 989380 1010601 1032386 1054544 1075909 1095783
58964 1095783 1113817 1128952 1139792 1146057 1148698 1148549 1145621 1139715 1130971 1119715 1106286 1091078 1074466
58951 1074466 1056746 1038330 1019649 1000641 980929 960951 942316 926325 912632 900004 887908
58940 887908 876684 866686 858141 851520 847151 844639 843355 843232 844378 846206 847784 848906 850124 851851
58926 851851 854035 856516 859095 861432 863423 865411 867531 869257 870200 870917 872249 874290 876768 879908 884085
58911H84085M898N117N712P247R117J0671J2183J4023J5878J7381J8639J9635
58899A024586K0062K0084K0234K0268J9315J7567J6475J6827J7955J9305K1224
58888A233902K3552K5075K5333K5517K6572K7744K8026K7681K7248K6381K4822
58877A521853K3311K2303K0949J8528J5661J2959R772N559J294k034n121r100
58865A635934j3506j7047j9533k1528k2989k3724k4423k5734k7010k7397k7403
58854A385640k7928k8509k8114k6982k6019k5041k3296k1227k0101k0152k0572
58843A117699k0971k1446k1645k1322k1230k1961k2381k0985j8340j6326j5213
58832H95879j3532j0837q513p475o898n784m253k670q84R86K300K960L723M931
$$ plain form
58911 884085 888983 894100 899812 907059 916176 926847 939030 953053 968931 986312 1004951 1024586
58899 1024586 1044648 1064732 1084966 1105234 1124549 1142116 1158591 1175418 1193373 1212678 1233902
58888 1233902 1257454 1282529 1307862 1333379 1359951 1387695 1415721 1443402 1470650 1497031 1521853
58877 1521853 1545164 1567467 1588416 1606944 1622605 1635564 1645336 1650895 1652189 1650155 1645034 1635934
58865 1635934 1622428 1605381 1585848 1564320 1541331 1517607 1493184 1467450 1440440 1413043 1385640
58854 1385640 1357712 1329203 1301089 1274107 1248088 1223047 1199751 1178524 1158423 1138271 1117699
58843 1117699 1096728 1075282 1053637 1032315 1011085 989124 966743 945758 927418 911092 895879
58832 895879 882347 871510 862997 855522 848624 842840 838587 835917 835033 836019 838319 841279 845002 849933
58818H49933N931O309O623P385Q168Q298P811P144O485N847N300M739L828K439
58804I36240Q01q27k340l557m224m294l982l560l309l317l102j899K36K160L049
58789I08075L583M999P456J0213J2952J5938J9057K1667K3457K4762K5942K7037
58777A105138K7883K8131K7310K5324K2552J9105J4402Q113R49o020j2322j7778
58765A242787k1925k4509k5991k6811k6810k6061k5505k5620k5304k3321k0309
58754I70621j8045j7065j6378j5298j4190j3375j2507j1246r689p982o237m742
58742H23867l673k653j267L15J686K752L405L313K737K756L832M884M766L843
58728H50563L051K314J265O55J387K640K744J673J078J944L679N498P223Q698
$$ plain form
58818 849933 855864 862173 868796 876181 884349 892647 900458 907602 914087 919934 925234 929973 933801 936240
58804 936240 937041 936214 933874 930317 926093 921799 917817 914257 910948 907631 904529 902630 902866 905026 908075
58789 908075 911658 916657 924113 934326 947278 963216 982273 1003940 1027397 1052159 1078101 1105138
58777 1105138 1133021 1161152 1188462 1213786 1236338 1255443 1269845 1277958 1278907 1272887 1260565 1242787
58765 1242787 1220862 1196353 1170362 1143551 1116741 1090680 1065175 1039555 1014251 990930 970621
58754 970621 952576 935511 919133 903835 889645 876270 863763 852517 842828 834846 828609 823867
58742 823867 820194 817541 816274 816589 818275 821027 824432 827745 830482 833238 837070 841954 846720 850563
58728 850563 853614 855928 857193 857848 859235 861875 864619 866292 867370 869314 872993 878491 885714 894412
58714H94412R674J0429J1310J1756J0867Q810O454L825K77l981p940j1354j4838
58701I29701j8373k1085k2709k3927k5054k5556k5069k3810k1909j9361j6716
58690F86132j4713j3187j1445r601q341p492o204m559l588l459l092j913o46O9
58676E97961O11J384J959J865J420J221J436J922K546L157L734M624O103P835
58662F37778R168R790R465P653M203nl873p178j0031j1919j2398j2111j1965j1758
58648E96819j0831r537q656p928o626n167m565m550l884k332q56M9O97J112J036
58633E34781Q68J094J081N2j107q29N69J230O66K57P19J075O15M4J08N56R55J271
58615E44005J364J172J456K937M828N676N476N336N287M479L364L445M681N323
$$ plain form
58714 894412 904086 914515 925825 937581 948448 957258 963712 967537 967814 963833 955893 944539 929701
58701 929701 911328 890243 867534 843607 818553 792997 767928 744118 722209 702848 686132
58690 686132 671419 658232 646787 637186 628845 621353 615149 610590 607002 603543 600451 598538 597892 597961
58676 597961 598572 599956 601915 603780 605200 606421 607857 609779 612325 615482 619216 623840 629943 637778
58662 637778 646946 656736 666201 673854 678057 678052 674179 667001 656970 645051 632653 620542 608577 596819
58648 596819 585988 576451 567795 559867 553241 548074 543509 538959 535075 532743 531887 531936 532633 533745 534781
58633 534781 535649 536743 537824 537876 536769 535940 536509 537739 538405 538662 539381 540456 541071 541115 541223 541779 542734 544005
58615 544005 545369 546541 547997 550934 555762 561438 566914 572250 577537 582016 585380 588825 593506 598829
58601E98829M748M238M430M241L085K049K006K372K656L420M802N804N962O225
58587F54867P350Q805J0040J1347J2870J4110J5017J6037J6720J5920J3846J2231
58575H09160J1827J1472J0169Q419O922N787N526O983R599J1682J2951J4894J7977
58562I43368K0708K2246K3544K4881K4603K1760J7834J4314J0498N380l3m010
58550A125093o342p738q344q246q277r048j0170j1377j3139j5369j7091j8199
58538I91753j9914k2500k4387k4612k4227k4159k3550k1666j9519j8082j6543
58527G52594j3978j1157r128p574o083n416n938o354n673m949n337n948n377m054
58513F55628l202k751k030j380j354j367p59j56k04j36Q65K033K304K058K082
$$ plain form
58601 598829 603577 607815 612245 616486 619571 621620 623626 625998 628654 632074 636876 642680 648642 654867
58587 654867 662217 671022 681062 692409 705279 719389 734406 750443 767163 783083 796929 809160
58575 809160 820987 832459 842628 851047 857969 863756 869282 876265 885864 897546 910497 925391 943368
58562 943368 964076 986322 1009866 1034747 1059350 1081110 1098944 1113258 1123756 1129136 1129103 1125093
58550 1125093 1118751 1111013 1102669 1094423 1086146 1077098 1066928 1055551 1042412 1027043 1009952 991753
58538 991753 971839 949339 924952 900340 876113 851954 828404 806738 787219 769137 752594
58527 752594 738616 727459 718331 710757 704674 699258 693320 686966 681293 676344 671007 665059 659682 655628
58513 655628 652426 649675 647645 646265 644911 643544 642785 642629 642425 642289 643154 645187 647491 649549 651631
58498F51631J970J197N89J098K111K585K814L586M674N610O846Q699J0301J1034
58484G14745J1658J2673J3100J2451J2320J4031J6209J6760J6021J5640J5462
58473H71070J3808J0199N670R36l843p938j0489j1664j2038j1439r678p556n714
58460H21324l503l54K773M856O579Q975J1360J2414J2328J2091J1421R304N844
58447I15412K010j930o185j0283j3463j5608j6711j6330j4619j2752j1252r192
58435G89097o223l779k855k229n06J611K884L802N351O953P553P489P465O977
58421H23590N537M085L342K153n33l542n223n883o504o672n895n399o226p061
58407G85769o273m760m302m515l898k662j943j424j93J062J250J124J972L152
$$ plain form
58498 651631 653601 654798 655387 656485 658596 661181 663995 667581 672255 677865 684711 693410 703711 714745
58484 714745 726403 739076 752176 764627 776947 790978 807187 823947 839968 855608 871070
58473 871070 884878 895077 900747 901683 897840 889902 879413 867749 855711 844272 834594 827038 821324
58460 821324 817821 817467 820240 825096 831675 840650 852010 864424 876752 888843 900264 909568 915412
58447 915412 917422 915492 909307 899024 885561 869953 853242 836912 822293 809541 798289 789097
58435 789097 782874 779095 776240 774011 773505 775116 778000 781802 787153 794106 801659 809148 816613 823590
58421 823590 829127 833212 836554 838707 838174 834632 829409 823526 817022 810350 804455 799056 792830 785769
58407 785769 779496 774736 770434 765919 762021 759359 757416 755992 755799 756861 758111 759235 761207 764359
58393G64359L364L148L725M528M350L771L981M380L849L112L305L554K667J910
58379H14003L190N646O966O987P116P335O769O300P499R714J1017J1268J1612
58366I15422J1876J1260J0602J1205J2371J2728J2790J3473J3473J1197Q030O503
58354A050930O331N465L845K826K078M29j178r38O10J732K740M831P011P646P794
58339A102152R443J1706J2434J2267J3310J5031J5535J5570J7126J9142J8897
58328A262613J6746J5128J3919J1178P651N875N483L994J776J585L470M721M667
58315A358806N184O610P500Q153J0154J2687J3514J3218J4253J6388J7397J7502
58303A501366J8646K0152J9812J8433J8517J9302J8226J6372J7035J9632K0569
$$ plain form
58393 764359 767723 770871 774596 779124 783474 787245 791226 795606 799455 802567 805872 809426 812093 814003
58379 814003 817193 822839 829805 836792 843908 851243 858012 864312 871811 881525 892542 903810 915422
58366 915422 927298 938558 949160 960365 972736 985464 998254 1011727 1025200 1036397 1044427 1050930
58354 1050930 1057261 1062726 1066571 1069397 1071475 1071904 1070726 1069788 1070398 1072130 1074870 1079701 1086712 1094358 1102152
58339 1102152 1111595 1123301 1135735 1148002 1161312 1176343 1191878 1207448 1224574 1243716 1262613
58328 1262613 1279359 1294487 1308406 1319584 1327235 1333110 1338593 1342587 1344363 1345948 1349418 1354139 1358806
58315 1358806 1363990 1370600 1378100 1386253 1396407 1409094 1422608 1435826 1450079 1466467 1483864 1501366
58303 1501366 1520012 1540164 1559976 1578409 1596926 1616228 1634454 1650826 1667861 1687493 1708062
58292A708062J9656J9990K1920K2877K2939K4667K7652K8951K8834L0231L2831
58281A988610L3665L3266L4957L8217L9227L7902L7861L9463L9548L8141L8608
58270B399465M0990M2103M2312M5123M9929N2568N3300N6516O2144O5298O5098
58259B974846O5814O8483O9559O8793P0109P3584P4952P4194P6037Q0903Q4124
58248C781398Q5280Q9156R6212J01573J04745J10664J19642J26473J31037J39142
58238D885322J51057J60221J65621J74093J87839K01160K12299K26554K44760
58229F608926K60980K74815K93437L18111L41739L63047L89543M22902M55963
58220I729463M87987N27736N77217O28425O80579P43657Q20134R01427R87756
$$ plain form
58292 1708062 1727718 1747708 1769628 1792505 1815444 1840111 1867763 1896714 1925548 1955779 1988610
58281 1988610 2022275 2055541 2090498 2128715 2167942 2205844 2243705 2283168 2322716 2360857 2399465
58270 2399465 2440455 2482558 2524870 2569993 2619922 2672490 2725790 2782306 2844450 2909748 2974846
58259 2974846 3040660 3109143 3178702 3247495 3317604 3391188 3466140 3540334 3616371 3697274 3781398
58248 3781398 3866678 3955834 4052046 4153619 4258364 4369028 4488670 4615143 4746180 4885322
58238 4885322 5036379 5196600 5362221 5536314 5724153 5925313 6137612 6364166 6608926
58229 6608926 6869906 7144721 7438158 7756269 8098008 8461055 8850598 9273500 9729463
58220 9729463 10217450 10745186 11322403 11950828 12631407 13375064 14195198 15096625 16084381
58211A6084381J092148J219116J360402J518376J710984J946255K216771K528462
58203B9676895K908987L378985L945240M633366N493868O562492P852284R401068
58195G3853185J1282801J3547846J6193806J9209532K2578287K6201762K9899457
58188B12766676L3514027L6836612L9206372L9243377L5323135K6637613J3924385
58181D37452197p75430j5018536k6783577l4878592l9029952l9746374l7969294
58174B43250442l4666923l0611631k6370157k2336187j8723676j5594386j2942199
58167H2005283j0745446q955122p493262o292674n315687m526923l879340l339147
58159C1457682k896874k541182k244899j987322j767601j584859j425078j277993
$$ plain form
58211 16084381 17176529 18395645 19756047 21274423 22985407 24931662 27148433 29676895
58203 29676895 32585882 35964867 39910107 44543473 50037341 56599833 64452117 73853185
58195 73853185 85135986 98683832 114877638 134087170 156665457 182867219 212766676
58188 212766676 246280703 283117315 322323687 361567064 396890199 423527812 437452197
58181 437452197 436676767 421658231 394874654 359996062 320966110 281219736 243250442
58174 243250442 208583519 177971888 151601731 129265544 110541868 94947482 82005283
58167 82005283 71259837 62304715 54811453 48518779 43203092 38676169 34796829 31457682
58159 31457682 28560808 26019626 23774727 21787405 20019804 18434945 17009867 15731874
58151A5731874j148145j038584r40155q46333p62889o93514o30451n68218n12944
58142H590641m69411m31533l94031l61603l38346l18954k98255k79412k65410
58133E433686k51867k35120k18712k05661j92774j78171j66014j58368j50520
58124C676479j39565j29561j23377j17508j09631j03220r9874r5174q7036q0291
58114B591242p7945p5727p0290o5246o3692o2130n7481n3205n2654n2727m9912
58103A910233m6753m6692m7728m6685m4822m4209m3152m0020l7163l6547l5845
58092A440617l2950k9963k8777k7221k3461j9848j8533j7672j5581j4281j5231
58081A197099j6117j5455j5803j8686k1014k0368j9262k0159k0825j8888j6617
$$ plain form
58151 15731874 14583729 13545145 12604990 11758657 10995768 10302254 9671803 9103585 8590641
58142 8590641 8121230 7689697 7295666 6934063 6595717 6276763 5978508 5699096 5433686
58133 5433686 5181819 4946699 4727987 4522326 4329552 4151381 3985367 3826999 3676479
58124 3676479 3536914 3407353 3283976 3166468 3056837 2953617 2853743 2758569 2671533 2591242
58114 2591242 2513297 2437570 2367280 2302034 2238342 2176212 2118731 2065526 2012872 1960145 1910233
58103 1910233 1863480 1816788 1769060 1722375 1677553 1633344 1590192 1550172 1513009 1476462 1440617
58092 1440617 1407667 1377704 1348927 1321706 1298245 1278397 1259864 1242192 1226611 1212330 1197099
58081 1197099 1180982 1165527 1149724 1131038 1110024 1089656 1070394 1050235 1029410 1010522 993905
58070I93905j6673j7170j5466j3187j2932j3460j2487j1102j1175j1443j0220
58059H48590r092r958j1295j1157j0962j2497j4082j3541j2190j2075j1993j0184
58047G09564q335q862j0434j0153q185o717o216n986o456p756q087o499n094n613
58033F05171o338n359m294n371p340p857p581q361r427r026p938p820p901o711
58019E03847n346n556o297n639m460m769n889n732m563m099m100l093j443o03
58005D42258l73K59O75j05r89m32P05P82N07J517L054L160K173J962K549K404
57989D60106J391P05N14K38L06J252J875Q83n70m97P61J499J789K941M661N460
57973D83314N397N876P156Q320R140R823R610P748N124K974Q25k223n337p307
$$ plain form
58070 993905 977232 960062 944596 931409 918477 905017 892530 881428 870253 858810 848590
58059 848590 839498 829540 818245 807088 796126 783629 769547 756006 743816 731741 719748 709564
58047 709564 701229 692367 681933 671780 663595 656878 650662 644676 638220 630464 622377 615878 610784 605171
58033 605171 598833 593474 589180 583809 576469 568612 561031 552670 543243 534217 526279 518459 510558 503847
58019 503847 498501 492945 486648 481009 476549 471780 465891 460159 455596 451497 447397 444304 442861 442258
58005 442258 441885 442144 442819 442714 441725 441293 441998 442780 443287 444804 447858 451018 453191 455153 457702 460106
57989 460106 461497 462202 462716 462954 463260 464512 466387 467270 466700 466203 466964 468463 470252 473193 477854 483314
57973 483314 488711 494587 501743 510063 519203 529026 538636 546384 551508 554482 555307 553084 547747 540440
57959E40440q863j1249j3561j4068j3184j2543j2090j0784r295r189r949r593
57947D06072p890o320n278l843k043q74k30P86J845J964J802K971N224O648O543
57932D07377N964N525M833L944L326K411K72k404l935m138m291m881n266n335
57918D03402n590n765n233m485m375m203k593L8J887K417K668L120L202K863K676
57903C90029K448J408k73j749k999m454n607n754n533n959o377n408l442k102
57889C44228j638j019j94o6l72P7J127J377O44J78M24N88M95Q38J437J330O99
57872C50153P57J529J789J347J440K524L631M161M520M675L956K587J721J629
57858C86419J489J141J296J858J812J048N68O21L47m82j033j076j433k386l167
$$ plain form
57959 540440 531577 520328 506767 492699 479515 466972 454882 444098 434803 425614 415665 406072
57947 406072 398182 391862 386584 382741 380698 379824 379594 380380 382225 384189 385991 388962 394186 400834 407377
57932 407377 413341 418866 423699 427643 430969 433380 433652 431248 427313 423175 418884 414003 408737 403402
57918 403402 397812 392047 386814 382329 377954 373751 371158 371196 373083 375500 378168 381288 384490 387353 390029
57903 390029 392477 393885 393612 391863 388864 384410 378803 373049 367516 361557 355180 349772 346330 344228
57889 344228 342590 341571 341377 341311 340939 341016 342143 343520 344164 344342 344766 345354 345849 346687 348124 349454 350153
57872 350153 350910 352439 354228 355575 357015 359539 363170 367331 371851 376526 380482 383069 384790 386419
57858 386419 387908 389049 390345 392203 394015 395063 395631 396252 396599 396117 395084 394008 392575 390189 387022
57843C87022l324l169k735j799r24r73j573j633j227j189j142LJ631J865O38N4
57827C71525J197K728L343L500L908M164L874L490L256K697J789J286J366J328
57813D09451R00L20r84l960p847j0449j0915j0446r856q539o469m998m697m336
57799C27175l074j756j047j97J207K035J557R30J393K420K978L237L645L602K472
57784C46577R07j72r31j814k388k123j449r18k78P22J441J361J005R30O73k80
57768C43263j396k013k483l341m112m096l672l739m285m468l774k416j001k11
57754C02256k64l60N90K341L458L369L132L586M060L833L557M067M818M770M061
57739C47274L572L389K874J936J100O11K70j4k07m89r49j266j169r33r65j185
$$ plain form
57843 387022 383698 380529 377794 375995 375071 374098 372525 370892 369665 368476 367334 367337 368968 370833 371471 371525
57827 371525 372722 375450 378793 382293 386201 390365 394239 397729 400985 403682 405471 406757 408123 409451
57813 409451 410351 410671 409687 405727 397880 387431 376516 366070 356214 347675 341206 336208 331511 327175
57799 327175 324101 322345 321298 321101 322308 324343 325900 326830 328223 330643 333621 336858 340503 344105 346577
57784 346577 347484 347312 346381 344567 342179 340056 338607 337689 337411 338133 339574 340935 341940 342870 343543 343263
57768 343263 341867 339854 337371 334030 329918 325822 322150 318411 314126 309658 305884 303468 302467 302256
57754 302256 301992 301632 302222 304563 308021 311390 314522 318108 322168 326001 329558 333625 338443 343213 347274
57739 347274 350846 354235 357109 359045 360145 360756 361026 361012 360805 360316 359367 358101 356932 355999 355034 353849
57723C53849j221r04l18L17N81J48p96j752k519l006k738j448r4q6j414k535k390
57706C33674j441n93j52j31l98l00P47K083K447J885J633J911J646O66L21J113
57690C45111J615P81l56n34k19l88p15m41J89P43J784L790N940P415R039J2101
57674C85855J6370K0775K5352L1009L7770M4838N2069N9973O8212P4981P7586
57663H94790P2994N8807L5282O347k2332m6340o3388p2513p3990o9689o2182n3300
57651F04486m4101l5642k8730k3216j8392j3956r947o337l393j858j879k326k080
57638D12629j490j639k718m013n093n933o260n840n093m699m769n060n504n866
57624C48652n581m714m324m938n507m956l995l967m596m403l027j627j057j084
$$ plain form
57723 353849 352628 351724 351406 351723 352304 352452 351656 349904 347385 344379 341641 340193 340099 340013 338599 336064 333674
57706 333674 332233 331640 331488 331357 330959 330659 331406 333489 335936 337821 339454 341365 343011 343677 343998 345111
57690 345111 346726 347507 347151 346617 346398 346010 345295 344854 345043 345786 347570 351360 357300 364715 373754 385855
57674 385855 402225 423000 448352 479361 517131 561969 614038 674011 742223 817204 894790
57663 894790 967784 1026591 1061873 1068220 1045888 999548 936160 863647 789657 719968 657786 604486
57651 604486 560385 524743 496013 472797 454405 440449 430502 424165 420772 418914 417035 414709 412629
57638 412629 411139 409500 406782 402769 397676 391743 385483 379643 374550 369851 365082 360022 354518 348652
57624 348652 343071 338357 334033 329095 323588 318632 314637 310670 306074 301671 298644 297017 295960 294876
57610B94876j361j881k233j656j53J281J831J554Q78J76j72j4K38J02j70O8Q46
57593B94210J522J634J284P89N37R86K229L714M803N335N326M615L360K295J759
57578C34398J107k87k014l406m631o022o944o552n258m367m464n133n962o790
57564B73675p249p040o549o266n907m942l674k809k323j717j077p97o67k65O6
57549B22459j24j67Q93K463K910J931R24Q11Q84K98n40o82R2J210J890J477l0
57532B36699j628k211j858j573j720j689j141n96m57l46J51Q50J386J718J890
57517B29475J884J891K186K536K337J491O51L90O74J208J838K440K817K829K394
57502B57041J525O07L35R33J747K122K273K640K893K428J530J154J639K426K873
$$ plain form
57610 294876 293515 291634 289401 287745 287592 288873 290704 292258 293136 293312 293140 293126 293364 293466 293296 293364 294210
57593 294210 295732 297366 298650 299439 299976 300962 303191 306905 311708 317043 322369 326984 330344 332639 334398
57578 334398 335505 335218 333204 329798 325167 319145 312201 305649 300391 296024 291560 286427 280465 273675
57564 273675 266426 259386 252837 246571 240664 235722 232048 229239 226916 225199 224122 223325 222658 222393 222459
57549 222459 222335 222168 223061 225524 228434 230365 231289 232100 232984 233282 232742 232060 232152 233362 235252 236729 236699
57532 236699 235071 232860 231002 229429 227709 226020 224879 224283 223826 223480 223631 224481 225867 227585 229475
57517 229475 231359 233250 235436 237972 240309 241800 242451 242841 243515 244723 246561 249001 251818 254647 257041
57502 257041 258566 259173 259508 260441 262188 264310 266583 269223 272116 274544 276074 277228 278867 281293 284166
57487B84166K737K008J008K80j81j168k979m564m892m482m442m652m291l658l763
57472B51127m426m479l840l631m094m072l057k145k300k963l105k513j475j95
57458B08832Q14Q05j20q35n99J22O24Q58R77Q90O63O53Q41Q26O95J058J974K732
57440B21810K970L069L222L121K860L057L730M097L833L512L410L054K346J996
57426B66087K222K203J391L55l26r41j743k286k367k620l372l950l877l734l933
57411B43109l711k372o50K92M65N57N64M1p82j299j575k084k640k546j662o03
57395B25104N2J95lk61l62m25o12n53K39J235J251L42J22J417K826K697J461P01
57377B35426O54K53q05j593j501j028p79o98n47l93m03o22j018j394j397r83n86
$$ plain form
57487 284166 286903 288911 289919 290199 290018 288850 285871 281307 276415 271933 267491 262839 258548 254890 251127
57472 251127 246701 242222 238382 234751 230657 226585 223528 221383 219083 216120 213015 210502 209027 208832
57458 208832 209646 210451 210331 209496 208897 209019 209643 210501 211478 212368 213031 213684 214525 215351 216046 217104 219078 221810
57440 221810 224780 227849 231071 234192 237052 240109 243839 247936 251769 255281 258691 261745 264091 266087
57426 266087 268309 270512 271903 272258 271932 270991 269248 266962 264595 261975 258603 254653 250776 247042 243109
57411 243109 239398 237026 236376 236668 237133 237690 238254 238295 237513 236214 234639 232555 229915 227369 225707 225104
57395 225104 225156 225351 225348 225087 224725 224300 223688 223135 223374 224609 225860 226202 226324 227741 230567 233264 234725 235426
57377 235426 236080 236333 235528 233935 232434 231406 230627 229929 229382 228989 228586 227964 226946 225552 224155 223172 222586
57360B22586m43j86M35R42Q80O02N84N55J65O2J130K906L810L113J762J080J374
57343B41357J966K081J467N28k8R0M83P45J013J475J743J312L71m15p83r81j167
57326B51257j219j034n64K07R16Q12l73j782k263j642o58J13O25Q45N79r1o81
57309B45047p28j53P01J214R68L65L10J017J601J311O84P71J651K398K302J487
57293B60946N03j23n5N61J115J203J134J349J682J652J218P94P22J134J983K879
57277B78697L206K861K426K295K134J710J527K048K813L132L069L066L108L077
57263C15169L344M097M585M036L013K746L339L702L162K266J906K479L733M840
57249C62417M776L425K094K140L354M478M964N217N449N433N366N847O896P866
$$ plain form
57360 222586 222143 221957 222392 223334 224214 224816 225400 225955 226120 226182 227312 230218 234028 237141 238903 239983 241357
57343 241357 243323 245404 246871 247399 247371 247461 247944 248689 249702 251177 252920 254232 254603 254188 253405 252424 251257
57326 251257 250038 249004 248440 248647 249563 250375 250002 248220 245957 244315 243657 243770 244395 245240 245819 245728 245047
57309 245047 244319 244166 244867 246081 247049 247414 247724 248741 250342 251653 252337 253108 254759 257157 259459 260946
57293 260946 261449 261326 261271 261832 262947 264150 265284 266633 268315 269967 271185 271979 272701 273835 275818 278697
57277 278697 281903 284764 287190 289485 291619 293329 294856 296904 299717 302849 305918 308984 312092 315169
57263 315169 318513 322610 327195 331231 334244 336990 340329 344031 347193 349459 351365 353844 357577 362417
57249 362417 367193 370618 372712 374852 378206 382684 387648 392865 398314 403747 409113 414960 421856 429722
57235D29722Q402Q643Q598Q212P954Q405R224R560R475R945J1290J2664J3334
57222E55428J3492J3555J3536J3457J3634J4229J5053J5950J6854J7540J7967
57211G20695J8707K0292K2287K3944K5458K7569L0065L1895L2776L3389L4009
57200A021086L4223L4107L4272L4554L4105L3157L3121L4408L5711L6199L6839
57189A401782L8577M0630M1813M2353M2954M3097M1839L9666L8002L7210L6411
57178A844334L5111L3694L2370L0764K8827K7164K6207K5675K5165K4781K4939
57167B159031K5737K6654K6890K6107K4853K3915K3277K2210K0492J8846J7948
57156B415960J7625J7414J7292J7389J7529J7547J7573J7638J7495J7197J7202
$$ plain form
57235 429722 438124 446767 455365 463577 471531 479936 489160 498720 508195 518140 529430 542094 555428
57222 555428 568920 582475 596011 609468 623102 637331 652384 668334 685188 702728 720695
57211 720695 739402 759694 781981 805925 831383 858952 889017 920912 953688 987077 1021086
57200 1021086 1055309 1089416 1123688 1158242 1192347 1225504 1258625 1293033 1328744 1364943 1401782
57189 1401782 1440359 1480989 1522802 1565155 1608109 1651206 1693045 1732711 1770713 1807923 1844334
57178 1844334 1879445 1913139 1945509 1976273 2005100 2032264 2058471 2084146 2109311 2134092 2159031
57167 2159031 2184768 2211422 2238312 2264419 2289272 2313187 2336464 2358674 2379166 2398012 2415960
57156 2415960 2433585 2450999 2468291 2485680 2503209 2520756 2538329 2555967 2573462 2590659 2607861
57145B607861J7454J7109J5741J4140J3240J2837J2134J1008R954R158Q432P744
57133B756812P192O727O414O547O929O595M965K869J708J980L345N635R038J3542
57119B840298J8986K5323L2154L8387M3110M6559M9634N2920N6870O2330O9986
57108C336557P9721R1364J05399J22091J40737J61160J85293K15856K53951K99475
57098D991604L53371M17681M93680N81948O83928Q01047R31863J072183J218134
57089A1545439J366513J511403J643360J753447J836177J888166J907730J897289
57081B5349524J859886J786587J650133J420682J092956O96268K77164j25118
57073C4008082m88649q05822j080201j324288j550911j761029j940387k068645
$$ plain form
57145 2607861 2625315 2642424 2658165 2672305 2685545 2698382 2710516 2721524 2731478 2740636 2749068 2756812
57133 2756812 2764004 2770731 2777145 2783692 2790621 2797216 2802181 2805050 2806758 2808738 2812083 2817718 2826756 2840298
57119 2840298 2859284 2884607 2916761 2955148 2998258 3044817 3094451 3147371 3204241 3266571 3336557
57108 3336557 3416278 3507642 3613041 3735132 3875869 4037029 4222322 4438178 4692129 4991604
57098 4991604 5344975 5762656 6256336 6838284 7522212 8323259 9255122 10327305 11545439
57089 11545439 12911952 14423355 16066715 17820162 19656339 21544505 23452235 25349524
57081 25349524 27209410 28995997 30646130 32066812 33159768 33856036 34133200 34008082
57073 34008082 33519433 32713611 31633410 30309122 28758211 26997182 25056795 22988150
57065B2988150k130832k121947k046253j915948j748813j563245j373659j189740
57057H897713j018182q63477p27786o11691n15302m37931l77201l29491k91370
57048C725282k60110k33302k09058j86655j66338j48367j32659j19080j07292
57039B162421r6462q5789p5340o5737n7019m8503l9756l1121k3068j5537q060
57028A616029k61P521J3449J4311P525o443k4103m1415n5769o5764p0461o9810
57016A324809o5181n8618n1603m4910l9158l4823l1770k9364k7117k4996k3166
57005H94103k1698k0587j9817j9380j9253j9395j9742k0229k0686k0678j9698
56994F72940j7766j5478j3164j0291o343j980J470L647N486P752J0015J1303J1098
$$ plain form
57065 22988150 20857318 18735371 16689118 14773170 13024357 11461112 10087453 8897713
57057 8897713 7879531 7016054 6288268 5676577 5161275 4723344 4346143 4016652 3725282
57048 3725282 3465172 3231870 3022812 2836157 2669819 2521452 2388793 2269713 2162421
57039 2162421 2065959 1980170 1904830 1839093 1782074 1733571 1693815 1662694 1639626 1624089 1616029
57028 1616029 1615768 1623289 1636738 1651049 1658574 1652131 1628028 1586613 1530844 1465080 1394619 1324809
57016 1324809 1259628 1201010 1149407 1104497 1065339 1030516 998746 969382 942265 917269 894103
57005 894103 872405 851818 832001 812621 793368 773973 754231 734002 713316 692638 672940
56994 672940 655174 639696 626532 616241 609898 607918 609388 613035 618521 626273 636288 647591 658689
56981F58689R287N781O70n549j2159j8344k3107k5657k6124k5403k4101k2169
56969D91814j9707j7249j4938j2215q802n330k443J18K966O134R301J2379J5169
56956D57197J6863J6467J3483P846j61r309j7406k2727k5197k5660k4636k2477
56944C64283k0031j7947j5662j2198p821l878r74J675M956Q789J2596J6049J9080
56931C48917K1614K3417K3744K1233J4875N287n430j5198k2906k8111l0674l0953
56919C25815k9689k7417k4389k1088j8210j5956j3899j1750r799q357p309o474
56907A31478n923n622n180m306l269k559k265j962j156K53J776K626K481K039
56893A08411K460M245O848R412J1474J2960J3962J4723J5431J5742J4767J1858
$$ plain form
56981 658689 667976 673757 674427 668878 656719 638375 615268 589611 563487 538084 513983 491814
56969 491814 472107 454858 439920 427705 418903 413573 411130 411248 414214 420348 429649 442028 457197
56956 457197 474060 490527 504010 511856 511695 502386 484980 462253 437056 411396 386760 364283
56944 364283 344252 326305 310643 298445 290624 286746 285772 287447 292403 301192 313788 329837 348917
56931 348917 370531 393948 417692 438925 453800 459087 453657 438459 415553 387442 356768 325815
56919 325815 296126 268709 244320 223232 205022 189066 175167 163417 153618 145261 137952 131478
56907 131478 125555 119933 114753 110447 107178 104619 102354 100392 99236 99489 101265 103891 106372 108411
56893 108411 110871 115116 121964 131376 142850 155810 169772 184495 199926 215668 230435 242293
56881B42293P371K381k124n685q143r349r237q051o352m659l073j284J058M016
56867A99162P406J0983J4620J8370K2367K6527L0440L3741L6300L7602L6111L0108
56855E03737J9494O316o650j7335k4513k7675k7513k5736k3522k0484j5841j0015
56843C30263m241J111O751J3249K0449K8040L5786M3114M9291N4146N7863N9687
56831F95509N7451M8854L3298J2657r329k8721m3153n2343n6897n7138n3453m7151
56819D99584l9892l2338k4185j5519p228j7O292J2305J8484K5055L1815L7930
56807E12286M2395M4565M3633L8054K6707J0802o445k2207l5208m4576m9116m8672
56795E12218m5058m0502l5690l0121k3797j7546j1943o853k008K631P100J1449
$$ plain form
56881 242293 249664 252045 249921 244236 236093 226744 217507 209456 203104 198445 195372 194088 195146 199162
56867 199162 206568 217551 232171 250541 272908 299435 329875 363616 399916 437518 473629 503737
56855 503737 523231 529547 522897 505562 481049 453374 425861 400125 376603 356119 340278 330263
56843 330263 326022 327133 333884 347133 367582 395622 431408 474522 523813 577959 635822 695509
56831 695509 752960 801814 835112 847769 838440 809719 766566 714223 657326 600188 546735 499584
56819 499584 459692 427354 403169 387650 380422 380405 386697 399002 417486 442541 474356 512286
56807 512286 554681 599246 642879 680933 707640 718442 711997 689790 654582 610006 560890 512218
56795 512218 467160 426658 390968 360847 337050 319504 307561 300708 298700 301331 308431 319880
56783C19880J5480J8843K1344K2831K2765K0273J4833O828k527j1692j9411k4989
56771D04458k8187k9052k8039k6104k4172k2449k0482j7995j5289j2835j0819
56760A69035r196p896o852o066n648n546n306m460l115j822r25m60n59j349k350
56745A07485k649j913q35l33o02j188j584j583j274r13o50l96r0J28K51N97J233
56728I5684J540R75O8j10N89J294J447J421J614J853J916J953J951J484M94k54
56712A13919K7J121K039K030J218M25M09J073J568J404J159J551K207K195J475
56697A33820Q23M25k73j171j194O4J467J772J180P82J060J584J744J346P47O62
56681A44838J428K363K426J590Q49Q19J150J455J815K014J385l6j164j267r12
$$ plain form
56783 319880 335360 354203 375547 398378 421143 441416 456249 463077 460550 448858 429447 404458
56771 404458 376271 347219 319180 293076 268904 246455 225973 207978 192689 179854 169035
56760 169035 159839 151943 145091 139025 133377 127831 122525 118065 114950 113128 112203 111743 111184 109835 107485
56745 107485 104836 102923 102088 101755 101153 99965 98381 96798 95524 94611 93961 93565 93475 93603 93854 94451 95684
56728 95684 97224 98199 98267 98157 98746 100040 101487 102908 104522 106375 108291 110244 112195 113679 114173 113919
56712 113919 113946 115067 117106 119136 120354 120779 121188 122261 123829 125233 126392 127943 130150 132345 133820
56697 133820 134643 135068 134795 133624 132430 132494 133961 135733 136913 137695 138755 140339 142083 143429 144176 144838
56681 144838 146266 148629 151055 152645 153494 154313 155463 156918 158733 160747 162132 162096 160932 159665 158753
56666A58753q55q30k03Q32J509J447P92j12p16n09K30N30ko62p67m90j28N16J412
56647A60747J821J366P64P35R44Q31P10J079J529J352P05K40j0m09q31q81o99
56630A69993p09q54p78n25m11n34r50j746k485k246r35J49r0j060j453j047n71
56613A53748l52j65p5k84m53n8P10J197J161P57O1o80q46k33M34N35M10N23N22
56594A56912P7j59M23J188J189O76L97K07l09n15L21J418J458P20N14Q80P90L77
56576A66564Q36K029K299J135Q2L66J309J917K394L116L547L289L103L807M990
56561B00783N817O301O912P544P777P618P237O364M647K357J69j484k487k819
56547B56736k686k566k840l489m247m753m602l624k262j220p90p73r39j068q52
$$ plain form
56666 158753 157898 157068 156865 157697 159206 160653 161445 161333 160617 160108 160338 160868 160866 160204 159437 158947 158819 159335 160747
56647 160747 162568 163934 164698 165433 166377 167208 167918 168997 170526 171878 172583 172823 172813 172404 171573 170692 169993
56630 169993 169284 168430 167652 167127 166716 166182 165232 163486 161001 158755 157820 157969 157879 156819 155366 154319 153748
56613 153748 153396 153231 153156 152872 152419 152361 153071 154268 155429 156186 156247 155567 154721 154488 154922 155457 155867 156390 156912
56594 156912 156989 156830 157253 158441 159630 160306 160703 160910 160601 160086 160407 161825 163283 164003 164517 165397 166187 166564
56576 166564 167400 169429 171728 172863 172945 173311 174620 176537 178931 182047 185594 188883 191986 195793 200783
56561 200783 206600 212901 219813 227357 235134 242752 249989 256353 261000 263357 263526 262042 259555 256736
56547 256736 254050 251484 248644 245155 240908 236155 231553 227929 225667 224447 223657 222884 221945 220877 220025
56532B20025k59J75Q7n3K52M94j28j219j617j168q33j009j021n57l14p56j352
56515B10747j579j775k334k879k894k561k412k574k797k822k432j553m97K82P43
56500A82663J067J057L34q04j535j527j205r03n53j89nJ36M65O25J56m60k31P05
56482A79796J094M29l66n07m64q79j356j152l73K83N09N18N46O55P93Q18O78O02
56464A81624P73R54Q80Q48J248J681J362L19n66p29l19L58J001J101N01M4O29
56447A91709J836K507K468K427K403J741O45J46L47K23n48j007n75J05M07M73
56431B05307L47k74j005q65Q3O22L32J66O31R97R42J255K043J972L99j295j626
56414B10031r26k16M24J078J028mp62j07J141J443P86L11M00N66O35P29O09J04
$$ plain form
56532 220025 219766 219941 220028 219975 220227 220721 220593 219374 217757 216589 215756 214747 213726 213169 212855 212099 210747
56515 210747 209168 207393 205059 202180 199286 196725 194313 191739 188942 186120 183688 182135 181638 181920 182663
56500 182663 183730 184787 185121 184317 182782 181255 180050 179147 178594 178405 178400 178536 179001 179626 179782 179322 179091 179796
56482 179796 180890 181319 180953 180446 179982 179103 177747 176595 176222 176505 177014 177532 178078 178733 179526 180344 181022 181624
56464 181624 182397 183351 184231 185079 186327 188008 189370 189689 189123 188394 188075 188433 189434 190535 191036 191080 191709
56447 191709 193545 196052 198520 200947 203350 205091 205736 205882 206229 206452 205904 204897 204322 204427 204834 205307
56431 205307 205654 205380 204375 203510 203593 204215 204547 204713 205344 206341 207283 208538 210581 212553 212952 211657 210031
56414 210031 209105 208889 209313 210391 211419 211415 210653 210546 211687 213130 213916 214227 214627 215193 215828 216557 217166 217270
56396B17270k41K7L60J36j94J14P05O70k0n82n83j78L66O51K46m54k09J418L086
56377B22588L315K376J581J353J157P97O76R81J479J909J969J377M64J23N58Q71
56361B43574M83J04N18J302J622J568J740K142K379K328J839O07r71j626p59O66
56345B57516J570K086K593K572J619N95M90R50J121J139J563K102K213K270K874
56330B83273L659L988M118M543M838M477M022M196M443L810K596J773J354P95
56316C31885M31R46J814J807Q14j79o53p69l72R09K669M055M949N742O277O166
56300C66491N831O136P096P954Q225P831O727N313M670N346O426O845O891P351
56286D59133P926P914P778Q580J0217J1575J2112J2095J1670J0913J0467J0926
$$ plain form
56396 217270 217029 217056 217416 217552 217358 217472 218177 218847 218827 218245 217662 217484 217850 218501 218747 218293 218084 219502 222588
56377 222588 225903 228279 229860 231213 232370 233167 233843 234824 236303 238212 240181 241558 242022 242145 242703 243574
56361 243574 244057 244161 244679 245981 247603 249171 250911 253053 255432 257760 259599 260206 259235 257609 256850 257516
56345 257516 259086 261172 263765 266337 267956 268551 269041 269991 271112 272251 273814 275916 278129 280399 283273
56330 283273 286932 290920 295038 299581 304419 308896 312918 317114 321557 325367 327963 329736 331090 331885
56316 331885 332316 333262 335076 336883 337697 337518 336865 336096 335724 336633 339302 343357 348306 354048 360325 366491
56300 366491 372322 378458 385554 393508 401733 409564 416291 421604 426274 431620 438046 444891 451782 459133
56286 459133 467059 474973 482751 491331 501548 513123 525235 537330 549000 559913 570380 581306
56274E81306J1898J2676J3378J4477J5844J7308J9313K1919K4027K4953K5898
56263G82997K8330L1835L5202L8747M3699M9942N6339O2885P0683P9956Q9874
56252A370489J00159J11320J23412J35957J48843J61922J74095J84211J92421
56243B702829J99262K03873K04662K01170J93720J81887J64976J43548J18690
56234D314617R0279N7814K2643j2435m5474p5848j02883j25880j45029j60658
56224C817146j72035j78537j81308j81939j80164j74897j66930j58459j50356
56215B272521j41985j33248j24663j15882j06370r7190q9880q3915p7549p0696
56205A231143o4616n9171n3111m6794m1954l8697l5369l1460k8096k5533k2821
$$ plain form
56274 581306 593204 605880 619258 633735 649579 666887 686200 708119 732146 757099 782997
56263 782997 811327 843162 878364 917111 960810 1010752 1067091 1129976 1200659 1280615 1370489
56252 1370489 1470648 1581968 1705380 1841337 1990180 2152102 2326197 2510408 2702829
56243 2702829 2902091 3105964 3310626 3511796 3705516 3887403 4052379 4195927 4314617
56234 4314617 4404896 4462710 4485353 4472918 4427444 4351596 4248713 4122833 3977804 3817146
56224 3817146 3645111 3466574 3285266 3103327 2923163 2748266 2581336 2422877 2272521
56215 2272521 2130536 1997288 1872625 1756743 1650373 1553183 1463303 1379388 1301839 1231143
56205 1231143 1166527 1107356 1054245 1007451 965497 926800 891431 859971 831875 806342 783521
56194G83521k0120j8645j8034j6449j3698j1642j0966j0166q377o702n956n456
56182F37310m800m564m581l737k208j667k567l360l044k365j849r22L94J064J028
56167F04132J443K370K454J584J504L045M881N934O841Q203R399J0051J0769J1778
56153F84388J2508J3087J4417J6488J8547K0991K4791K9026L1658L3077L6086
56142I35064M1779M8192N3748N9201O5221P0748P4723P7015P6774P2484O4675
56131A639624N6167M8728M1839L5385L0676K7804K4711K0028J4436Q394J243o535
56119A942500j2994j7731k2550k8279l3831l9267m6544n5840o4218o9424p2076
56108A479746p2828p0508o4815n7828n1089m3886l6005k9274k4603k0283j5082
$$ plain form
56194 783521 763401 744756 726722 710273 696575 684933 673967 663801 655424 648722 642766 637310
56182 637310 632510 627946 623365 619628 617420 615753 613186 609826 606782 604417 602568 601646 602040 603104 604132
56167 604132 605575 607945 610399 611983 613487 616532 621413 627347 634188 642391 651790 661841 672610 684388
56153 684388 696896 709983 724400 740888 759435 780426 805217 834243 865901 898978 935064
56142 935064 976843 1025035 1078783 1137984 1203205 1273953 1348676 1425691 1502465 1574949 1639624
56131 1639624 1695791 1744519 1786358 1821743 1852419 1880223 1904934 1924962 1939398 1947792 1949035 1942500
56119 1942500 1929506 1911775 1889225 1860946 1827115 1787848 1741304 1685464 1621246 1551822 1479746
56108 1479746 1406918 1336410 1271595 1213767 1162678 1118792 1082787 1053513 1028910 1008627 993545
56097I93545j0319p196m733k109l34J36Q64K677M079M058L950M924O087O599P134
56082A009362P945Q114P887Q863J0843J1607J0877J1026J2708J3645J3104J3525
56070A139506J5875J7583J7171J6885J8303J9402J8577J7776J8852K0284K0300
56059A340514J9780J9618J8590J6371J5121J5661J5730J4308J3787J5451J6967
56048A521898J6852J7192J9240K0763K0617K1519K5043K8361K9172K9478L1203
56037A781338L2637L2559L3209L5650L7055L6131L6232L9290M1935M1734M1789
56026B189559M4678M7275M6557M5269M6643M8632M8773M9610N3773N8538O0871
56015B740178O3061O7717P2266P4139P6275Q1576Q7003Q9205R0846R5288J00297
$$ plain form
56097 993545 983226 976030 971297 969188 968854 968990 969854 972531 976610 980668 984618 989542 995629 1002228 1009362
56082 1009362 1017307 1025421 1033308 1042171 1053014 1064621 1075498 1086524 1099232 1112877 1125981 1139506
56070 1139506 1155381 1172964 1190135 1207020 1225323 1244725 1263302 1281078 1299930 1320214 1340514
56059 1340514 1360294 1379912 1398502 1414873 1429994 1445655 1461385 1475693 1489480 1504931 1521898
56048 1521898 1538750 1555942 1575182 1595945 1616562 1638081 1663124 1691485 1720657 1750135 1781338
56037 1781338 1813975 1846534 1879743 1915393 1952448 1988579 2024811 2064101 2106036 2147770 2189559
56026 2189559 2234237 2281512 2328069 2373338 2419981 2468613 2517386 2566996 2620769 2679307 2740178
56015 2740178 2803239 2870956 2943222 3017361 3093636 3175212 3262215 3351420 3442266 3537554 3637851
56004C637851J03268J07050J14235J21438J25855J31400J41454J51859J58445
55995D792855J64903J75551J87114J95887K05950K21577K38590K52399K67385
55986F702211K88678L12123L32511L54154L82700M14341M44229M77421N19744
55977A0228112N66359O11807O62480P26164P98746Q75225R63608J073002J198981
55968A7704484J337152J499722J701158J940417K217001K551121K967112L473077
55960C5391244M081424M832092N767300O902840Q257616R889807J1862078J4188506
55952A01172907J6853227J9843893K3103008K6481467K9811266L2928129L5384779
55945B85578676L6076095L3422076K6304056J5022218J372496j2193340k3561927
$$ plain form
56004 3637851 3741119 3848169 3962404 4083842 4209697 4341097 4482551 4634410 4792855
55995 4792855 4957758 5133309 5320423 5516310 5722260 5943837 6182427 6434826 6702211
55986 6702211 6990889 7303012 7635523 7989677 8372377 8786718 9230947 9708368 10228112
55977 10228112 10794471 11406278 12068758 12794922 13593668 14468893 15432501 16505503 17704484
55968 17704484 19041636 20541358 22242516 24182933 26399934 28951055 31918167 35391244
55960 35391244 39472668 44304760 50072060 56974900 65232516 75122323 86984401 101172907
55952 101172907 118026134 137870027 160973035 187454502 217265768 250193897 285578676
55945 285578676 321654771 355076847 381380903 396403121 397775617 385582277 362020350
55938C62020350l1486682l5649039l6490067l4903865l1857018k8118902k4216717
55931A39298060k0502210j7180701j4318011j1896787r884387q242079o907112
55924E0366773n811426m912902m185829l594803l102779k693080k359748k085006
55916B1621200j846467j637450j460465j308165j168558j041871r34884q44389
55908A1378951p61595o86949o25740n74381n24972m78564m40776m09032l76623
55899F500319l44880l19314k97973k75126k52350k34827k20533k03954j86824
55890D164538j74643j65845j54687j41906j32496j25777j17180j07634j01880
55881B942490r9563r6560r3027r1897r1449q7459q0912p6033p2729o8181o3720
$$ plain form
55938 362020350 330533668 294884629 258394562 223490697 191633679 163514777 139298060
55931 139298060 118795850 101615149 87297138 75400351 65515964 57273885 50366773
55924 50366773 44555347 39642445 35456616 31861813 28759034 26065954 23706206 21621200
55916 21621200 19774733 18137283 16676818 15368653 14200095 13158224 12223340 11378951
55908 11378951 10617356 9930407 9304667 8730286 8205314 7726750 7285974 6876942 6500319
55899 6500319 6155439 5836125 5538152 5263026 5010676 4775849 4555316 4351362 4164538
55890 4164538 3989895 3824050 3669363 3527457 3394961 3269184 3152004 3044370 2942490
55881 2942490 2842927 2746367 2653340 2561443 2469994 2382535 2301623 2225590 2152861 2084680 2020960
55870B020960o2645o3292o1541n8197n6892n6700n3944m9478m7077m6267m3636
55859A421291l9756l8004l7958l6483l4024l3381l3626l1588k8066k6369k6012
55848A056024k4082k1483k1440k2996k2395k0037j9642k1241k1259j9211j8145
55837H24093j8602j8046j6277j5798j6635j6151j4178j3175j3260j2079r720q823
55825F51349r602r543q218p863q937r542r366r999j1242j1231j0213j0095j0436
55812E25062r021o269m836m954m240k149m66N08K219M353N072M788N724P674Q075
55797E31540O321M213K265o09l809n417n864p394r898j1081j0627j0324j0208
55784D69108q654o291n696o979p793p811r022j1235j1650r680p953p650o815m397
$$ plain form
55870 2020960 1958315 1895023 1833482 1775285 1718393 1661693 1607749 1558271 1511194 1464927 1421291
55859 1421291 1381535 1343531 1305573 1269090 1235066 1201685 1168059 1136471 1108405 1082036 1056024
55848 1056024 1031942 1010459 989019 966023 943628 923591 903949 882708 861449 842238 824093
55837 824093 805491 787445 771168 755370 738735 722584 708406 695231 681971 669892 660172 651349
55825 651349 641747 632204 623986 616123 607186 597644 588278 578279 567037 555806 545593 535498 525062
55812 525062 516041 509772 504936 499982 495742 493593 493127 493635 495854 500207 505279 510067 515791 523465 531540
55797 531540 537861 542074 544339 543730 539921 534504 528640 521246 511348 500267 489640 479316 469108
55784 469108 460454 454163 448467 441488 433695 425884 416862 405627 393977 384297 376344 368694 361879 357482
55770C57482k160j342q68j15j19j034j407r91j323k679l505l453l945n052n034
55755C24455l700k962l329l092j769j065j476j332k27j13j726l140l186l308m562
55740B89468n708n794n890o767p350o905o418o447n994m722m016m530m929m282
55726B09716l569l637l803l608l839m698m989m229l528l459l078k011j368j600
55712A62300j507m89K75j8l94N6O80O83L83J50l50j127j570j734k291k912k516
55695A49619j444j308k334k952k434j805j673j365o86l21k9J213K853L035J756
55680A42125J155K020K675K155J681J863J303o28k157j883r07o65p56m38k52n76
55664A46715m47O88J751J909J925K421K625K105J951K837L611L199K347K175K453
$$ plain form
55770 357482 355322 353980 353112 352997 352878 351844 350437 349446 348123 345444 341939 338486 334541 329489 324455
55755 324455 320755 317793 314464 311372 309603 308538 307062 305730 305503 305390 303664 300524 297338 294030 289468
55740 289468 283760 277966 272076 265309 257959 251054 244636 238189 232195 227473 223457 218927 213998 209716
55726 209716 206147 202510 198707 195099 191260 186562 181573 177344 173816 170357 167279 165268 163900 162300
55712 162300 160793 160304 160579 160561 160167 160223 160903 161586 161969 162119 161769 160642 159072 157338 155047 152135 149619
55695 149619 148175 146867 144533 141581 139147 137342 135669 134304 133618 133297 133268 134481 137334 140369 142125
55680 142125 143280 145300 147975 150130 151811 153674 154977 154349 152192 150309 149402 148737 147981 147543 147291 146715
55664 146715 146268 146956 148707 150616 152541 154962 157587 159692 161643 164480 168091 171290 173637 175812 178265
55649A78265K467K173J494k6k042l395l952m760n792n643m237l504m316m994m161
55634A37577k830k274j952j068k69j93j10N28R12O04O70J751K799L032L273L964
55618A46414L815K018j10j188j679k252k267j500j419k815m058l582k358j964
55604A27055j942j135n6J85n7M3L6o82j382j470k000l734n172m586k782j758j759
55587I8804j711j429j403j417j238j607k692k879j086J029J270J66k43L21O58
55572H6543O83J243K021K027J656K018K790K809K277K216K270J264m47j398j528
55557A06444k074l176l675l290k966l060k944k484k141j739p72J35j42j174j306
55542G5636p0J293J791J628J134L05m99p27o02p11q08k65M67L27o22j264j188
$$ plain form
55649 178265 180732 182905 184399 184373 182331 178936 174984 170224 164432 158789 154552 151048 146732 141738 137577
55634 137577 134747 132473 130521 129453 129184 128991 128881 129409 130321 130925 131595 133346 136145 139177 142450 146414
55618 146414 150229 152247 152137 150949 149270 147018 144751 143251 141832 139017 134959 131377 129019 127055
55604 127055 125113 123978 123922 124107 124050 124093 124129 123447 122065 120595 118595 114861 109689 105103 102321 100563 98804
55587 98804 97093 95664 94261 92844 91606 89999 87307 84428 83342 84371 85641 85807 85564 85885 86543
55572 86543 87226 88469 90490 92517 94173 96191 98981 101790 104067 106283 108553 109817 109370 107972 106444
55557 106444 104370 101194 97519 94229 91263 88203 85259 82775 80634 78895 78123 78258 78116 76942 75636
55542 75636 75566 76859 78650 80278 81412 81717 81218 80491 79889 79178 78370 78105 78572 78899 78277 77013 75825
55525G5825r69q89p00n91j023j646j624r75l97J1N22P01m5j043j037j60K54j92
55507F6022n33k48ol20p89r70r27p44m07k35m71n74P8J011J263R50R92J536J911
55488F7539J950K028J949J201K65K22R89J342R15P79J701L056L790L519K372P33
55472I4350o54j222j348j779k458k782k843l257l821l632k556j461r01o56o27
55457F4353j045j625j583p56J67O39O68L19k71n22j6O47N37j79n99n91p49j054
55439E8340r32n78p72j340j191j56O42N01l5l96p00q53k91Q68J554J269Q20R22
55421E7672J070N01n10j109r98n33m5L85P84J139J261R17L11J30N09N37m64j650
55403E9907j746j018q12j377j648j142o05m99l12J95L99M4j55K79P69P12L61J00
$$ plain form
55525 75825 74856 73967 73267 72676 71653 70007 68383 67408 67011 67022 67544 68245 68200 67157 66120 65960 66214 66022
55507 66022 65489 65241 65235 64915 64126 63156 62229 61485 61078 60843 60372 59798 59876 60887 62150 63100 64092 65628 67539
55488 67539 69489 71517 73466 74667 74932 75154 76143 77485 78400 79179 80880 83936 87726 91245 93617 94350
55472 94350 93696 92474 91126 89347 86889 84107 81264 78007 74186 70554 67998 66537 65636 64980 64353
55457 64353 63308 61683 60100 59344 59511 60150 60818 61137 60866 60344 60328 60975 61512 61333 60734 60143 59394 58340
55439 58340 57408 56830 56058 54718 53527 53371 54013 54514 54479 54083 53383 52530 52239 53107 54661 55930 56750 57672
55421 57672 58742 59243 58733 57624 56626 56093 56048 56433 57217 58356 59617 60534 60845 60975 61484 62021 61557 59907
55403 59907 58161 57143 56331 54954 53306 52164 51559 51060 50748 50943 51342 51386 51231 51510 52279 52991 53352 53452
55385E3452k33p02q33l61K06M32N61P90O74j59j269j960k070j795j255n86o2K60
55367D5090N73Q57Q93Q30J095J556J497O64l29q71r59p31j67M51N11q3o04m11
55349D9862L63J254K008K356J909O49p86j685j770j179l43M1m08j086r15K90J508
55332E2068J662O58q10j843j704l41J263J845J134Lp01q26n21Q3O65Q64P84P82
55314E5065P80M07k06n14m36m60p48r50r50j027j116p70j0N54O11M82L99J98r8
55295E1211j33Q2N1l67o30k92M24J000J109P33K66L50J070J513Q72l29r23p56
55277E5251n81n42m3Q88J360R81L21j46m93n88p9O56O61j33p87q70q37p60n8J031
55257E5232J299M81j23L07Q35N17NK28O71L65l72n04k4K22j8k55k24m4K81O87
$$ plain form
55385 53452 53219 52517 51684 51323 51529 51961 52522 53312 53986 53827 52558 50598 48528 46733 45478 44892 44830 45090
55367 45090 45663 46520 47413 48243 49338 50894 52391 53055 52726 51855 50896 50165 49998 50449 50960 50877 50273 49862
55349 49862 50225 51479 53487 55843 57752 58401 57615 55930 54160 52981 52638 52679 52271 51185 50270 50560 52068
55332 52068 53730 54388 53578 51735 50031 49690 50953 52798 53932 53935 53234 52408 51887 51970 52635 53499 54283 55065
55314 55065 55845 56252 56046 55532 55096 54636 53888 52938 51988 50961 49845 49075 49065 49619 50230 50712 51111 51309 51211
55295 51211 51078 51160 51211 50844 50214 49922 50346 51346 52455 53188 53454 53804 54874 56387 57259 56930 56007 55251
55277 55251 54670 54128 54085 54973 56333 57314 57635 57489 56996 56408 56329 56985 57646 57513 56726 55856 55019 54259 54201 55232
55257 55232 56531 57012 56889 57196 58031 58548 58553 58781 59452 59817 59445 58941 58917 59139 59121 58866 58642 58598 58879 59566
55237E9566O87%q29j185j292j627j859j293q4Q86J181J025O20M7l25j38K48Q1
55219E5709o69j192r39l35k22q62j721k016j440l38P54J642K346K641K218J267
55203E6843M05pq9O4M16N56jq64r35J12J222J325N86j54n72q28q83n71j14M4j45
55182E6410k76j9N43J009R72M57pkJ68l6m79n15j0N00O76O84O20M03L28P84J344
55161F3554J098J61k43M22J167R07j21j041j484j434p76K87J001R42N54L23J24
55144F5441j74k05J43K85r0m12k70j71m39l10P89J850J467n6j095j003o94q98
55126F4158j094n91K51M86j46r41j110o40j18J13L23P69J099R03N39O00Q16M30
55108F5847l61n01K09P32O02P46J770K569J821K1j144r11Q6J001J440J210M16
$$ plain form
55237 59566 60253 60253 59424 58239 56947 55320 53461 52168 52084 52970 54151 55176 55796 55843 55518 55380 55628 55709
55219 55709 55040 53848 52909 52574 52352 51490 49769 47753 46313 45975 46729 48371 50717 53358 55576 56843
55203 56843 57248 57241 57152 57216 57632 58188 58187 57323 56388 56500 57722 59047 59633 59479 58907 58079 57196 56625 56511 56555 56410
55182 56410 56134 56115 56658 57667 58639 59096 59089 59087 59255 59219 58740 58225 58215 58715 59391 60075 60695 61098 61426 62210 63554
55161 63554 64652 64813 64570 64992 66159 67066 66945 65904 64420 62986 62210 62497 63498 64440 64994 65317 65441
55144 65441 65267 65062 65205 65490 65400 64988 64718 64547 64108 63798 64587 66437 67904 67848 66753 65750 65056 64158
55126 64158 63064 62473 62724 63210 63064 62123 61013 60373 60255 60368 60691 61460 62559 63462 64001 64601 65417 65847
55108 65847 65486 64985 65194 65926 66528 67274 69044 71613 73434 73455 72311 71400 71486 72487 73927 75137 75553
55091G5553l38m91j75J77M71P66Q53O58N60P45O94N3n61l74L36O80N07M08N86
55072H1108N55M1n03m64K44J098J422J029M43K82L99J39n67j116j311j658k246
55055G8895k324j482l79K48M81N60K39m49p47k77J93k9l97j75J78j70q97j030
55037G2438n26j83k30j79J39L66L99N03P40R10R25P42J66o64j150j022p91q01
55019G1782o03R6O04L18j77j05J64j66p80p51j38J43k08o56p92n58J95J320J950
55000G1638J447M97K21O29R63J098J328J251K49j153j744j319o63q4O63J201P90
54983G7012k11n78l4M55L78K50L39J53l61m55Q4M47J89m1K83N94K10m97o81j87
54963G7349M71Q59R03P72P79J146J696K031K006J695J053Q9p96j220j348j487
$$ plain form
55091 75553 75215 74724 74549 74726 75197 75963 76816 77474 78034 78779 79473 79526 78965 78591 78927 79607 80114 80522 81108
55072 81108 81663 81704 81201 80737 80981 82079 83501 84530 84973 85255 85654 85793 85226 84110 82799 81141 78895
55055 78895 76571 75089 74710 74958 75439 75999 76238 75789 75042 74765 74958 74929 74532 74357 74535 74365 73468 72438
55037 72438 71912 71729 71499 71320 71459 71825 72224 72727 73467 74377 75302 76044 76210 75546 74396 73374 72583 71782
55019 71782 71179 71275 71879 72197 72020 71915 72079 71913 71133 70382 70244 70387 70179 69523 68731 68173 68368 69688 71638
55000 71638 73085 73582 73803 74432 75395 76493 77821 79072 79321 78168 76424 75105 74442 74358 75021 76222 77012
54983 77012 76801 76223 76189 76644 77022 77272 77611 77764 77403 76948 77032 77479 77668 77627 77910 78504 78714 78217 77536 77349
54963 77349 77820 78679 79582 80354 81133 82279 83975 86006 88012 89707 90760 90849 90053 88833 87485 85998
54947H5998j413q11q4J50N5K70P53Q51L40l79r86j365j233n08K57O44J192K441
54929H6172L676L819L206L115L819M491M918N696O756P229P032P055P538P579
54915A62101O604M929K696k68l279n035n542o258p706q502p524n586m080l205
54901A19345k576k358k705k989k631k021j722j531j026m25p5K34P69J270J455
54886A03014J514J632J655J643J978K622L098L527M643O382P625P823P675P638
54872A62469P020N389L529K074L45k222m672n831o142o849q055q843q796q169
54858A21247p073n630m453l854l100j548qK58n31j098j064j164j583j558p42R9
54842H8198J81m40j257j926k224k092j790j573j222m59L42N19J10j97l6K89M71
$$ plain form
54947 85998 84585 83774 83690 83840 83895 84165 84918 85769 86109 85730 84744 83379 82146 81638 81895 82539 83731 86172
54929 86172 89848 93667 96873 99988 103807 108298 113216 118912 125668 132897 139929 146984 154522 162101
54915 162101 168705 173634 176330 176062 172783 167748 162206 155948 148242 139740 132216 126630 122550 119345
54901 119345 116769 114411 111706 108717 106086 104065 102343 100812 99786 99361 99286 99520 100289 101559 103014
54886 103014 104528 106160 107815 109458 111436 114058 117156 120683 125326 131708 139333 147156 154831 162469
54872 162469 169489 174878 178407 180481 180826 178604 173932 168101 161959 155110 147055 138212 129416 121247
54858 121247 114174 108544 104091 100237 97137 95589 95581 95839 95308 94210 93146 91982 90399 88841 88099 88198
54842 88198 88379 87939 86682 84756 82532 80440 78650 77077 75855 75396 75738 76257 76367 76170 76134 76423 76894
54825G6894N45N63M50K66J94K46K80L07M09N42O85R94J386J361P01J5jM13M70
54806H6720rm72n66n03m66l37k9L30O20P45N11p1m52k8J017J803J697P86m96j633
54786H9167k015j276J24J104J090O30O68J425K291K646K543K499K793L146L116
54771A09951K677K330K677M011O052P932Q734Q367P706P434P051N690L629K030
54757A86271J166j03k639n715p922q710q486p742o792n959n345m667l745k886
54743A16726k401k134j855j704j730j510p50J27N82Q12J362K123K441K144J790
54728A16023J899K375K817L095L471M280N503O630P098O830O077M887L160J210
54714A75355m37j839l574n606p010p192o686o244n855n202m423l766l046k179
$$ plain form
54825 76894 77439 78002 78452 78718 78912 79158 79438 79745 80154 80696 81381 82375 83761 85122 85823 85838 85837 86250 86720
54806 86720 86711 86239 85673 85170 84704 84367 84338 84668 85288 86033 86544 86473 86021 85993 87010 88813 90510 91296 90800 89167
54786 89167 87152 85876 86000 87104 88194 88824 89492 90917 93208 95854 98397 100896 103689 106835 109951
54771 109951 112628 114958 117635 121646 127698 135630 144364 152731 160437 167871 174922 180612 184241 186271
54757 186271 187437 187334 184695 178980 171058 162348 153862 146120 139328 133369 128024 123357 119612 116726
54743 116726 114325 112191 110336 108632 106902 105392 104642 104769 105351 106163 107525 109648 112089 114233 116023
54728 116023 117922 120297 123114 126209 129680 133960 139463 146093 153191 160021 166098 170985 174145 175355
54714 175355 174918 173079 169505 163899 156889 149697 143011 136767 130912 125710 121287 117521 114475 112296
54700A12296j757k243k995k956k079j292j108j108q33m77m51o60n79K9O72O03
54684I5062j44n47O6Q21K90j335k206j318P0K18q68j839j931j442q22k59Q4K10
54666H4110M62R58J163O63j39o16p90q64m83O32J796J997J253M19o1l56m39n4
54648H9651N58P41L08l20q34j211j320r61l13K18N17O57N48J71j28j39k38p13
54630H7192j052o82k3O5l90o56n65n78o84k84O81J375J175M59kJ33O33J053J057
54611H8907O81K46j36n99r28n14O25J475J289N72M6m89j322j645o60P45R76J04
54593H9373l46J26M34Qk26M23J166J013K09m06n98o49p10q24r98r21k37O83J009
54574H8529O71M47O11N03j59o54m71j60k57l26J47P11P25N27P82J193R02n0p18
$$ plain form
54700 112296 110539 108296 105301 102345 100266 98974 97866 96758 95925 95448 94997 94337 93758 93787 94459 95062
54684 95062 94918 94371 94437 95258 95548 94213 92007 90689 90759 90977 90109 88270 86339 84897 84075 83816 83900 84110
54666 84110 84572 85530 86693 87356 87217 86601 85811 84947 84464 85096 86892 88889 90142 90561 90500 90144 89705 89651
54648 89651 90209 90950 91258 90938 90104 88893 87573 86612 86299 86517 87034 87691 88239 88410 88282 88143 87905 87192
54630 87192 86140 85458 85435 85500 85110 84454 83889 83311 82627 82343 83024 84399 85574 86033 86031 86164 86797 87850 88907
54611 88907 89588 89834 89698 89099 88171 87657 88282 89757 91046 91618 91664 91175 89853 88208 87548 88293 89269 89373
54593 89373 89027 89153 89587 89595 89369 89792 90958 91971 92180 91774 91176 90527 89817 88993 87995 87074 86837 87520 88529
54574 88529 89200 89647 90258 90761 90602 89948 89477 89317 89060 88734 88881 89592 90317 90844 91626 92819 93721 93671 92953
54555I2953o16j95N0K49N95P76L87l77q12n18J93P69J105J476J837J731J046M06
54537A01055L59O08O23N68Q93J239P53n47j592j685j217q05m37P9N20N93L71L4
54519A01412m13q74r99o40j22J97L54N84R63J336J353O48o33j625j549p19r3K5
54501I9205J50N14P07N45L76K60k45j075j296m04Q07J280J024P54O93N09J80P6
54483A04060L01N23M92L62L50L81J88k44m25J99J439K288K033J190Q33J181J554
54466A16705J521J304J003M15k36j89P46J692J763J053J49p46j737k646l043k654
54450A15100j549j72P30O16k56j086j467j512j220m43L88M04m58j187j063n71
54434A06254m61n99m13M2J83k06p55r70o03K21R78J155Q06M37K46J5k16m9N51
$$ plain form
54555 92953 92337 92142 92192 92441 93036 93812 94199 93822 93010 92492 92685 93454 94559 96035 97872 99603 100649 101055
54537 101055 101414 102022 102645 103213 104106 105345 106098 105551 103959 102274 101057 100252 99815 99894 100414 101007 101378 101412
54519 101412 100999 100125 99126 98486 98364 98561 98915 99499 100462 101798 103151 103799 103166 101541 99992 99273 99180 99205
54501 99205 99355 99869 100576 101121 101497 101757 101512 100437 99141 98737 99544 100824 101848 102602 103295 103804 103984 104060
54483 104060 104361 104884 105376 105738 106088 106469 106657 106413 105988 106187 107626 109914 111947 113137 113970 115151 116705
54466 116705 118226 119530 120533 120948 120712 120523 121269 122961 124724 125777 125926 125180 123443 120797 117754 115100
54450 115100 113551 113379 114109 114725 114469 113383 111916 110404 109184 108741 109129 109533 109075 107888 106825 106254
54434 106254 105793 105194 104781 104823 105006 104800 104045 103075 102472 102693 103671 104826 105632 106069 106315 106330 106114 106065 106616
54415A06616J056J154J019O73j72j287j810j344m75J98P71J311J419J052R30J400
54399A12511J729J278N99M81O49L96o7j8M49N59J05l55m40k73M6N47J018J175
54381A20389J050Q03L74j85l87J01Q89J489K004K581K621J543M1l98P31K406L341
54364A39393L097K057R46M48P24J238J406J279J148Q89K49m53p02o55r69j795
54348A48300k636l100l182k919k373j899j799j774j363p75o20r07j015o86l13
54333A22939k01k34k96m70o63o94p61j196j684j444l79O06P18K02k02j64J49N66
54315A16792R97J288J262Q82K65l86q35r55q31n80j79L68Q12Q41M22k36q82j224
54297A17821r95l27K07J83j82m12k65L30J400K527K852K077J003M06n0r40j626
$$ plain form
54415 106616 107672 108826 109845 110518 110346 109059 107249 105905 105430 105628 106399 107710 109129 110181 111111 112511
54399 112511 114240 115518 116117 116598 117247 117643 117576 117558 118007 118566 118671 118316 117876 117603 117649 118196 119214 120389
54381 120389 121439 122242 122616 122431 122044 122145 123034 124523 126527 129108 131729 133272 133313 132915 133646 136052 139393
54364 139393 142490 144547 145493 145941 146665 147903 149309 150588 151736 152625 152874 152421 151719 151064 150095 148300
54348 148300 145664 142564 139382 136463 134090 132191 130392 128618 127255 126480 125860 124953 123938 123252 122939
54333 122939 122738 122504 122208 121738 121075 120381 119620 118424 116740 115296 114917 115523 116241 116443 116241 116077 116226 116792
54315 116792 117789 119077 120339 121221 121486 121100 120265 119310 118479 117899 117720 118088 118900 119741 120163 119927 119045 117821
54297 117821 116826 116499 116706 116889 116707 116295 116030 116360 117760 120287 123139 125216 126219 126625 126575 125635 124009
54280A24009r73N97J185q4j795k086q81M20Q53O79N88Q33J147J118O05m9l17l0
54262A25819M74P82P68N18K25J89N89J183J459J210O85J48m29j096j661j839j517
54245A27507q12RO21Q07N79Q3m76q14o65j18M03O30P37Q92R47P72N61M18Q2m86
54225A31677p42l79Pk30p00o47l08n92j466j899j464q65o69n50k26p4k70k05N10
54206A20908J204J098N20L32N67N08j09p32q01l17L28O66L67l64o79M4J276J829
54188A26645J333O65O62R72P16j30o12o8J082K050K640L077L256K774J700O10
54172A47372j88j005k004k716k665k085j602j490j631j871j984j656r13l25k77
54157A24960m20k81p2k67p28r89j108j393j534r45R8O75O19O78J141J349R33N14
$$ plain form
54280 124009 123036 123633 124818 124734 122939 120853 119972 120392 121245 121924 122512 123345 124492 125610 126215 126166 125849 125819
54262 125819 126293 127075 127843 128361 128586 128775 129364 130547 132006 133216 133901 134049 133620 132524 130863 129024 127507
54245 127507 126695 126704 127325 128132 128711 128794 128318 127504 126839 126721 127124 127754 128491 129383 130330 131102 131663 132081 132163 131677
54225 131677 130935 130556 130563 130333 129633 128986 128678 128086 126620 124721 123257 122392 121723 121173 120947 120873 120603 120398 120908
54206 120908 122112 123210 123730 124062 124629 125137 125028 124296 123495 123178 123506 124172 124539 124175 123496 123540 124816 126645
54188 126645 127978 128643 129305 130277 130993 130863 130251 130183 131265 133315 135955 139032 142288 145062 146762 147372
54172 147372 147184 146179 144175 141459 138794 136709 135107 133617 131986 130115 128131 126475 125562 125237 124960
54157 124960 124540 124259 124187 123920 123192 122203 121095 119702 118168 117223 117321 117996 118615 119293 120434 121783 122716 123230
54139A23230O08P10K21m38m82j9J98%k9M24R48J024P10M46N36Q44R66O13p9o99
54119A29732r37o49K82J778L188L663L164K636K824L289L020J807M72j27K3L08
54103A54473K01l05q30r95p73n19o47j248j894j964j271m07j86o67j064q13k94
54086A40797p5L2N57J278J372O22k64o59o33m08J01R35J769K324K646K756K466
54069A55616J805J195R19P58M32L7k19l45m28m45m15m22l21J08O70Q62O75P31
54051A61213J325J947K134K172K489K807K619K117K012K578L423M113M556M844
54037B00349N092N399N631N428M763M302M773O004O980O805N468L690K333J769
54023B68786J612J148K65l37j30L58J84p21j489j616j662k456l979n458o219o171
$$ plain form
54139 123230 123838 124548 124769 124331 123849 123830 124028 124028 123999 124423 125371 126395 127105 127551 128087 128931 129897 130510 130431 129732
54119 129732 128795 128146 128428 130206 133394 137057 140221 142857 145681 148970 151990 153797 154269 154142 154165 154473
54103 154473 154674 154369 153539 152544 151771 151252 150605 149357 147463 145499 144228 143821 143635 142968 141904 141091 140797
54086 140797 140722 140754 141311 142589 143961 144583 144319 143660 143027 142619 142720 143655 145424 147748 150394 153150 155616
54069 155616 157421 158616 159535 160293 160725 160762 160543 160198 159770 159325 158910 158488 158167 158275 158945 159807 160482 161213
54051 161213 162538 164485 166619 168791 171280 174087 176706 178823 180835 183413 186836 190949 195505 200349
54037 200349 205441 210840 216471 221899 226662 230964 235737 241741 248721 255526 260994 264684 267017 268786
54023 268786 270398 271546 271811 271474 271344 271702 271886 271165 269676 268060 266398 263942 259963 254505 248286 242115
54007B42115n627m982m571m488m431m006l250k697k669k735k297j523j253j884
53993A95702k818l290l207k833k131j040q2O3n22j058j018n46L8N48Q27Q71J058
53976A80562J674K302K409K349K943L945M044K632O83o59j462k354l292l791l800
53961A88185l574k984j782k77Q34J250J167Q67O18P28J200J585J596J545J759
53946A92717J964J749J398J556K361L419M481N541O345O471N874M987M279M066
53932B47208M508N389N931N461M187K975K355K180K167K373L002M009M971N305
53918C02021M806M071M101N193O643P730Q438Q887Q649P370N613M277L453K591
53904C83843J577P68J25q07j997k901l384l871m429m585m301m336n237o640p952
$$ plain form
54007 242115 236488 231506 226935 222447 218016 214010 210760 208063 205394 202659 200362 198839 197586 195702
53993 195702 192884 189594 186387 183554 181423 180383 180301 180364 179842 178784 177766 177220 177258 177806 178633 179504 180562
53976 180562 182236 184538 186947 189296 192239 196184 200228 202860 203543 202884 201422 199068 195776 191985 188185
53961 188185 184611 181627 179845 179568 180402 181652 182819 183686 184304 185032 186232 187817 189413 190958 192717
53946 192717 194681 196430 197828 199384 201745 205164 209645 215186 221531 228002 233876 238863 243142 247208
53932 247208 251716 257105 263036 268497 272684 275659 278014 280194 282361 284734 287736 291745 296716 302021
53918 302021 306827 310898 314999 320192 326835 334565 343003 351890 360539 367909 373522 377799 381252 383843
53904 383843 385420 386188 386313 385506 383509 380608 377224 373353 368924 364339 360038 355702 350465 343825 335873
53889C35873r045r841r878q983p858p343p378p281o780o199n741n275m726m131
53875B35414l357k254j238j130k181l579m272m024l386k851k435k026j768j871
53861A99042k275k673k768k436j744r78n22m97n90m32r3O4l7r6J2m4n74j352j833
53842A80174j755j311q56o54p38q85p22n7R34J822K246K076J470P82K99L7q4o
53824A82772K86M63J77l32l89K14R69J385J526J554J339Q80O90J225K251L172
53808A98182L754M139M385M467M538M780N119N389N582N652N348M623L962L844
53794B63764M096M139L772L239K774K413K114J706R54j4o29o56o83j363k523l594
53778B79509m507n422n946n537m565m005m095m139l755l400l410l411l122k904
$$ plain form
53889 335873 326828 316987 307109 298126 290268 282925 275547 268266 261486 255287 249546 244271 239545 235414
53875 235414 232057 229803 228565 227435 225254 221675 217403 213379 209993 207142 204707 202681 200913 199042
53861 199042 196767 194094 191326 188890 187146 186168 185646 185149 184559 184127 184034 184098 184061 183965 183977 183933 183359 182007 180174
53842 180174 178419 177108 176252 175598 174860 173975 173253 173196 174130 175952 178198 180274 181744 182526 182825 182862 182778 182772
53824 182772 183058 183521 183698 183366 182977 183191 184160 185545 187071 188625 189964 190844 191534 192759 195010 198182
53808 198182 201936 206075 210460 214927 219465 224245 229364 234753 240335 245987 251335 255958 259920 263764
53794 263764 267860 271999 275771 279010 281784 284197 286311 288017 288971 288957 288328 287672 286989 285626 283103 279509
53778 279509 275002 269580 263634 258097 253532 249527 245432 241293 237538 234138 230728 227317 224195 221291
53764B21291l050l151k778k262k195k473k508k158j839j764j636j194o92n89r50
53749A92052j393j558j498j464j465j353j223j363j611j309j74J095J642J502
53735A81880J307J246J020O62O27R59J128Q13L10ko8J24O10J089J098P76Q45J500
53717A95924K046J947J644J747J999J752J103P77J015J258J042O83Q48J685K577
53702B18047K725K055J443J854L241M598N145N046M798M473L928L360L043K783
53688B66539K131J048ko29p83o36n34r09j769k381k003q88r3j51n17m90j80j56
53670B57597n34q89r06o71l49J0L15M10L04K24L48O92J233J914K436K386J785
53653B66305J169R60R46P74N64N90O33K54l14k88N22J347J543J428J648K207K637
$$ plain form
53764 221291 218241 215090 212312 210050 207855 205382 202874 200716 198877 197113 195477 194283 193591 193002 192052
53749 192052 190659 189101 187603 186139 184674 183321 182098 180735 179124 177815 177641 178736 180378 181880
53735 181880 183187 184433 185453 186115 186742 187701 188829 189642 189952 189950 189882 190006 190616 191705 192803 193579 194424 195924
53717 195924 197970 199917 201561 203308 205307 207059 208162 208939 209954 211212 212254 212937 213785 215470 218047
53702 218047 220772 222827 224270 226124 229365 233963 239108 244154 248952 253425 257353 260713 263756 266539
53688 266539 268670 269718 269716 269087 268304 267668 267134 266225 264456 262075 260072 259184 259091 258940 258423 257933 257753 257597
53670 257597 257063 256174 255268 254597 254248 254258 254573 254983 255287 255511 255859 256551 257784 259698 262134 264520 266305
53653 266305 267474 268434 269380 270154 270718 271308 271941 272195 271881 271593 272115 273462 275005 276433 278081 280288 282925
53636B82925K758K690K405J831J266J168J575K101K400K355K012J671J768K279
53622C11204K506J994J327J338J907K226K122K192K681L131L321L641M244M577
53608C48411M252L713L566L681L508K893K143J607J500J869K453K792K692K255
53594C87335J363k43k163l188k609j188k88l66r23j545k250k885k979k463j928
53579C63680j905k256k527k589k638k714k563k033j394j071j064r30m05J78L72
53564C40141L19N07Q35N62n34j527j349k08O46M91p9r9M98R21O81J94K15R44J964
53545C45122K773L080K716J798J029J241K325L179L129K899L501M641N180M921
53531C87534M817N411O166O720P672R391J0952J1278J0766J0768J1661J2490J2567
$$ plain form
53636 282925 285683 288373 290778 292609 293875 295043 296618 298719 301119 303474 305486 307157 308925 311204
53622 311204 313710 315704 317031 318369 320276 322502 324624 326816 329497 332628 335949 339590 343834 348411
53608 348411 352663 356376 359942 363623 367131 370024 372167 373774 375274 377143 379596 382388 385080 387335
53594 387335 388698 388455 386292 383104 380495 379307 379019 378653 377730 376185 373935 371050 368071 365608 363680
53579 363680 361775 359519 356992 354403 351765 349051 346488 344455 343061 341990 340926 339996 339591 339769 340141
53564 340141 340460 340967 341802 342364 341830 340303 338954 338746 339392 339883 339804 339705 340203 341124 341805 341999 342214 343158 345122
53545 345122 347895 350975 353691 355489 356518 357759 360084 363263 366392 369291 372792 377433 382613 387534
53531 387534 392351 397762 403928 410648 418320 427711 438663 449941 460707 471475 483136 495626 508193
53518E08193J2503J3158J4323J5059J5093J5241J6342J8238K0063K1334K2319
53507F91866K3307K4079K4310K4127K3833K3396K2745K2288K2397K2558K1826
53496I46732K0150J8461J7312J6345J5440J5355J6514J7927J8232J7376J6457
53485A136301J6193J6405J6782J7281J7759J7878J7581J7146J6747J6337J5889
53474A322299J5291J4052J1703Q586N699L575J766l54k720m838o577q312j0235
53461A349935j1966j2928j3120j3175j3623j4240j4497j4477j4929j6223j7792
53450A192965j8841j9162j8973j8428j7790j7625j8089j8328j7269j5032j2786
53439A000642j1224r845p982n874m313l624l383k942j919l44J427K973M117M928
$$ plain form
53518 508193 520696 533854 548177 563236 578329 593570 609912 628150 648213 669547 691866
53507 691866 715173 739252 763562 787689 811522 834918 857663 879951 902348 924906 946732
53496 946732 966882 985343 1002655 1019000 1034440 1049795 1066309 1084236 1102468 1119844 1136301
53485 1136301 1152494 1168899 1185681 1202962 1220721 1238599 1256180 1273326 1290073 1306410 1322299
53474 1322299 1337590 1351642 1363345 1371931 1377630 1381205 1382971 1382617 1379897 1375059 1368482 1360170 1349935
53461 1349935 1337969 1325041 1311921 1298746 1285123 1270883 1256386 1241909 1226980 1210757 1192965
53450 1192965 1174124 1154962 1135989 1117561 1099771 1082146 1064057 1045729 1028460 1013428 1000642
53439 1000642 989418 979573 971591 965717 961404 957780 954397 951455 949536 949192 950619 953592 957709 962637
53425I62637N482N780N981O452P454Q907J0565J2335J4270J6380J8442K0059K0966
53412A115710K1375K1886K2872K4074K4992K5630K6503K7957K9764L1465L2889
53401A405117L4201L5649L7436L9688M2372M5181M7619M9274N0178N0794N1579
53390A889088N2462N2970N2972N2929N3166N3186N2219N0328M8437M7114M5833
53379B450704M3686M0507L6880L3261K9510K5284K0601J5836J1318P087K937j409
53367B716202o168j1408j6979k2664k8319l3827l8795m2588m4903m6214m7330
53356B377007m8498m9224m9080m8280m7341m6401m5223m3618m1613l9315l6961
53345A881453l5058l4109l4147l4670l5082l5070l4590l3652l2263l0410k8125
$$ plain form
53425 962637 968119 973899 979880 986332 993786 1002693 1013258 1025593 1039863 1056243 1074685 1094744 1115710
53412 1115710 1137085 1158971 1181843 1205917 1230909 1256539 1283042 1310999 1340763 1372228 1405117
53401 1405117 1439318 1474967 1512403 1552091 1594463 1639644 1687263 1736537 1786715 1837509 1889088
53390 1889088 1941550 1994520 2047492 2100421 2153587 2206773 2258992 2309320 2357757 2404871 2450704
53379 2450704 2494390 2534897 2571777 2605038 2634548 2659832 2680433 2696269 2707587 2714674 2717611 2716202
53367 2716202 2710034 2698626 2681647 2658983 2630664 2596837 2558042 2515454 2470551 2424337 2377007
53356 2377007 2328509 2279285 2230205 2181925 2134584 2088183 2042960 1999342 1957729 1918414 1881453
53345 1881453 1846395 1812286 1778139 1743469 1708387 1673317 1638727 1605075 1572812 1542402 1514277
53334A514277k5552k2998k0811j9188j7988j6815j5301j3526j2083j1593j2102
53323A326320j3087j4058j4912j5644j6066j5976j5489j4879j4202j3287j2142
53312A166578j1085j0320r519q053n843l692k458j951j170L07J799K754L805N826
53298A126978Q450J0550J1970J3616J5827J7780J8928J9893K1325K2758K3429
53287A311504K3460K3447K3393K2905K2013K0985J9653J7738J5556J3595J1605
53276A525854Q963N751K684nk734n619q206j0300j2336j4540j6464j7678j8533
53263A436837j9794k1729k3813k5210k5460k4959k4662k5135k5905k6119k5653
53252A168398k5179k5140k5229k4951k4217k3277k2423k1902k1751k1664k1336
$$ plain form
53334 1514277 1488725 1465727 1444916 1425728 1407740 1390925 1375624 1362098 1350015 1338422 1326320
53323 1326320 1313233 1299175 1284263 1268619 1252553 1236577 1221088 1206209 1192007 1178720 1166578
53312 1166578 1155493 1145173 1135654 1127601 1121758 1118066 1115608 1113657 1112487 1112794 1114593 1117347 1121152 1126978
53298 1126978 1135428 1145978 1157948 1171564 1187391 1205171 1224099 1243992 1265317 1288075 1311504
53287 1311504 1334964 1358411 1381804 1404709 1426722 1447707 1467360 1485098 1500654 1514249 1525854
53276 1525854 1534817 1540568 1543252 1543247 1540513 1534894 1526688 1516388 1504052 1489512 1473048 1455370 1436837
53263 1436837 1417043 1395314 1371501 1346291 1320831 1295872 1271210 1246075 1220170 1194051 1168398
53252 1168398 1143219 1118079 1092850 1067899 1043682 1020405 997982 976080 954329 932665 911329
53241I11329k0880k0575k0239j9438j8321j7634j7683j7849j7395j6309j5035
53230G09971j3790j2518j1229j0004q851p816p163p116p621q416r278j0108j0956
53217E85105j2038j3426j4676j5087j4509j3567j2914j2528j2020j1296j0535
53206D42509r728q737p733p203p329p770q144q520r139r803r923r267q392q131
53192C22690q642r179q855p471n631m213l794m331n193n600n240m427l622k937
53178B43555k192j318n29j36l25j002j785k229k182j804j318r05p40q49q73m10
53162B24958K91M43k84j274j719j511j076p00m28k69j26J50M01J22p38j444j349
53145B15447p71m24m09l24p5J09K45N22P73O71L60L13O50J073J347J336Q00k18
$$ plain form
53241 911329 890449 869874 849635 830197 811876 794242 776559 758710 741315 725006 709971
53230 709971 696181 683663 672434 662430 653579 645763 638600 631484 623863 615447 606169 596061 585105
53217 585105 573067 559641 544965 529878 515369 501802 488888 476360 464340 453044 442509
53206 442509 432781 424044 416311 409108 401779 394009 385865 377345 368206 358403 348480 339213 330821 322690
53192 322690 314048 304869 296014 288543 282912 278699 274905 270574 265381 259781 254541 250114 246492 243555
53178 243555 241363 240045 239516 239380 239055 238053 236268 234039 231857 230053 228735 227830 227090 226241 225368 224958
53162 224958 225249 225692 225408 224134 222415 220904 219828 219128 218700 218431 218305 218455 218856 218978 218240 216796 215447
53145 215447 214676 214252 213843 213519 213444 213553 213798 214320 215093 215764 216124 216437 217087 218160 219507 220843 221643 221425
53127B21425j001q61j13L79M82Q39J678K483K836K825K514J832J100Q70J016Q29
53111B39133J74k32p6l5o82j526j806j641j736k325k946l081k613j844j304j252
53095B16208j284p85J00M57j41r89j190q49p58j231j728j556o48L53O84K30l10
53078B06563j51O56J339J327P45O5k90r8M15N06l39j594k210j889j293j005j021
53061B01726j253j681j945j564p84l78m39k74K35K74m09p17K93J908K649K086
53045A99727R72O2m92q48j248j770j968j264J8O63J76m37j85L75R0q76j232m35
53027A91328P38J421J571J495J253P55R0m81o42k76K28K42k90o44k90L69O51M88
53009A98006K27ok21k01J44M61M84M52M93J36q33j634j385l60M84Q37J048J234
$$ plain form
53127 221425 220424 219563 219450 219829 220311 221150 222828 225311 228147 230972 233486 235318 236418 237288 238304 239133
53111 239133 239307 239075 238999 238964 238282 236756 234950 233309 231573 229248 226302 223221 220608 218764 217460 216208
53095 216208 214924 214139 214239 214696 214555 213566 212376 211527 210769 209538 207810 206254 205606 205959 206643 206873 206563
53078 206563 206412 207068 208407 209734 210479 210544 210254 210156 210571 211077 210738 209144 206934 205045 203752 202747 201726
53061 201726 200473 198792 196847 195283 194499 194121 193682 193408 193643 193917 193508 192791 193084 194992 197641 199727
53045 199727 200699 200761 200269 199421 198173 196403 194435 193171 193189 193852 194028 193591 193406 193781 193871 192995 191763 191328
53027 191328 192066 193487 195058 196553 197806 198561 198651 198170 197528 197252 197480 197722 197432 196788 196498 196867 197518 198006
53009 198006 198233 198227 198006 197805 197949 198410 198894 199346 199839 199975 199142 197508 196123 195763 196247 197084 198132 199366
52991A99366J286J454J936K160J520N80M49J091J450J274J456K385L132K834J848
52976B24221J024O28M72L86Q5o99j549j579p70l07r46j786j516l93J04o20j466
52959B15289j167J16J089R06Pn66l32L32Q80J157J148O56l50j302j502r89m65
52942B14907l64m77n06n31o83q25p63m97j41K10M35M67M66O71J018J162R03L76
52924B15828j60m40k73J86L29k32r45q11K96J305J219K30o74q62n25k06k47o08
52906B13410r79j065p67j95M04O71L66k52n15j80J10l72j379j917j512o95j38
52889B04995J55O48J555K506K821K140R03N5M1L09J52k97l93K7O36J365K376L350
52871B23344L633L171K607K282J885J274Q72Q90Q91N21J56K34M54J46q18j918
$$ plain form
52991 199366 200652 202106 204042 206202 207722 208302 208751 209842 211292 212566 214022 216407 219539 222373 224221
52976 224221 225245 225873 226345 226731 226816 226117 224568 222989 222219 221912 220966 219180 217664 217271 217375 216755 215289
52959 215289 214122 214238 215327 216233 216240 215674 215342 215674 216554 217711 218859 219515 219165 217863 216361 215372 214907
52942 214907 214543 214066 213560 213029 212346 211521 210758 210261 210120 210330 210765 211232 211698 212369 213387 214549 215452 215828
52924 215828 215668 215228 214955 215141 215470 215238 214293 213482 213778 215083 216302 216532 215858 214996 214471 214265 214018 213410
52906 213410 212431 211366 210599 210404 210808 211479 211845 211593 211078 210898 211008 210636 209257 207340 205828 205133 204995
52889 204995 205150 205798 207353 209859 212680 214820 215723 215778 215819 216128 216280 215983 215590 215617 216253 217618 219994 223344
52871 223344 226977 230148 232755 235037 236922 238196 239068 239958 240849 241370 241526 241760 242214 242360 241542 239624
52855B39624k669l070l442m004m515m358l254j819j024j085j393j567j865k418
52841B03141k675k112j020j57M9l26r48j319j001j95K67j19q43r85l05O26J153
52824A93231J061N39q8o19j092j559j723j198j33P98J206J338J479J444R84K34
52808A95902n22j141j411j052l15r2q46j865k123j651j305j421j364n53O55J358
52792A82254J052j0j156j768j637j019m02j21o7K40J117K123K272J162k87p53
52776A83000l4Q71J183J080R11M84l64j127j242q57m84k53l9jl41q00r63q49o97
52757A79478l93K47Q72R67P23Q26J369J680J397J073J356K104K636K579K146J754
52741B00814J675J845J905J441M06p80j561j609r62K0Q11J024O97K51J44M92R26
$$ plain form
52855 239624 236955 233885 230443 226439 221924 217566 214312 212493 211469 210384 208991 207424 205559 203141
52841 203141 200466 198354 197334 197177 197226 196900 195952 194633 193632 193437 193704 193585 192742 191757 191452 192078 193231
52824 193231 194292 194831 194743 194124 193032 191473 189750 188552 188419 189217 190423 191761 193240 194684 195668 195902
52808 195902 195380 194239 192828 191776 191461 191369 190523 188658 186535 184884 183579 182158 180794 180241 180896 182254
52792 182254 183306 183296 182140 180372 178735 177716 177314 177193 177126 177366 178483 180606 182878 184040 183753 183000
52776 183000 182966 183837 185020 186100 187011 187495 187131 186004 184762 183905 183421 183168 183129 183128 182787 181987 181024 180175 179478
52757 179478 179085 179332 180204 181171 181894 182720 184089 185769 187166 188239 189595 191699 194335 196914 199060 200814
52741 200814 202489 204334 206239 207680 208086 207306 205745 204136 203174 203194 204005 205029 205726 205977 206121 206613 207539
52724B07539P48m61k188l189k660j131R9L40J6j76j33k21o36j144j365j118n11
52707A93809J63O21P89Q24R16J071J092Q04L12l9l5J57K56K63M11O90P50M01q4
52688B03171l68m48m69l74n3L10L66R9j13L4M21O80N83K21j24k27j00O2J23J78
52668B03972M26Q93J309J294P42M9j72K52Q59J135J142J288J684K085K396K713
52652B22067K868K395J203j74j205j883k380k643k646k706l080l406k996j640
52638B03774J06J428J925J806J593J549J496J264J186J723K677L310L353L329
52624B30519L547L436K393P88m52j084j667k554l344l426k701j644q85p20q76
52609B21330p87k06N37J019J212J346J516J665J736J647J313Q93P46Q53O94j7
$$ plain form
52724 207539 208287 207826 205638 202449 199789 198658 198757 199097 199113 198937 198804 198583 197947 196803 195438 194320 193809
52707 193809 193972 194593 195382 196206 197122 198193 199285 200089 200401 200362 200327 200484 200740 201003 201414 202104 202854 203255 203171
52688 203171 202803 202355 201886 201512 201459 201769 202135 202234 202121 202155 202576 203256 203839 204060 203936 203709 203609 203671 203794 203972
52668 203972 204398 205291 206600 207894 208636 208685 208513 208765 209624 210759 211901 213189 214873 216958 219354 222067
52652 222067 224935 227330 228533 228359 227154 225271 222891 220248 217602 214896 211816 208410 205414 203774
52638 203774 203880 205308 207233 209039 210632 212181 213677 214941 216127 217850 220527 223837 227190 230519
52624 230519 234066 237502 239895 240683 240231 239147 237480 234926 231582 228156 225455 223811 222926 222206 221330
52609 221330 220543 220337 220874 221893 223105 224451 225967 227632 229368 231015 232328 233221 233967 234820 235514 235497
52593B35497p73q70l14L17O86Q99J051J022P36K95j28k75J10R65J792K134J929
52576B45073J283K39q78j369r36k44j14n22q79j012j191j385j286r74q90j077
52560B33838j138q82m99j58R2K1m62q58o07n9n3n40n22L73J205J066L27k6K76
52541B31394P43J004J043Q74N16K13K78P08J163J245P61l0m44j3Q67J354J314
52524B42990J383J757J655N52q16j326r50n07l12N3P00J067Q31N15P98J699K706
52507B52795L412L665L403K685J778Q53k95j903l609m522m131k950j986j654j543
52492B45998j240r88j263j977k518k485j995j341o57m4L30M44M87O07P80J017
52476B35155J439K019K392K162J287J61o29n99L15J636K679L124L089K774K298
$$ plain form
52593 235497 234724 233854 233540 233857 234543 235442 236493 237515 238251 238546 238418 238143 238253 239218 241010 243144 245073
52576 245073 246356 246595 245717 244348 243412 243168 243054 242532 241653 240641 239450 238065 236779 235805 234915 233838
52560 233838 232700 231818 231319 231161 231253 231274 230812 229954 229347 229288 229235 228695 228173 228546 229751 230817 231144 231118 231394
52541 231394 232137 233141 234184 235058 235574 235787 236065 236773 237936 239181 239942 239912 239468 239455 240322 241676 242990
52524 242990 244373 246130 247785 248337 247521 246195 245245 244738 244426 244479 245179 246246 247077 247592 248390 250089 252795
52507 252795 256207 259872 263275 265960 267738 268591 268296 266393 262784 258262 254131 251181 249195 247541 245998
52492 245998 244758 243770 242507 240530 238012 235527 233532 232191 231534 231490 231820 232264 232751 233358 234138 235155
52476 235155 236594 238613 241005 243167 244454 244615 243986 243387 243702 245338 248017 251141 254230 257004 259302
52461B59302J965K121K603K652J776M32n12q23j027j627k541l344l720l549k889
52446B50819j968j104m64k7K22K00m5k35j52lj99p21r78n23K83O45L47M0L02Q61
52426B47300R94N44R0J72O86J100R95L88k72m41PN88P75O43O86J077J541J908
52408B58781K327K853L336L841M704N836O462N939M512K796R33j210l257m460
52394B93393m636m338l985l368k331j390j156j405j250k56J008J653J472J040
52380B74451R89J403J943K379K820L437M119M533M469M054L627L476L698M170
52366C19568M546M372L388J800J72r70j418j236o28J11O99J070J365J618J590
52351C36047J094L55j47j54K28P71J264J551J708K138L111M256M954N230N765
$$ plain form
52461 259302 261267 263388 265991 268643 270419 270851 270339 269516 268489 266862 264321 260977 257257 253708 250819
52446 250819 248851 247747 247283 247256 247478 247678 247633 247398 247246 247243 247044 246323 245345 244822 245105 245750 246097 246137 246439 247300
52426 247300 248294 248838 248928 249100 249786 250886 251881 252269 251997 251556 251563 252151 252926 253569 254255 255332 256873 258781
52408 258781 261108 263961 267297 271138 275842 281678 288140 294079 298591 301387 302320 301110 297853 293393
52394 293393 288757 284419 280434 277066 274735 273345 272189 270784 269534 269278 270286 271939 273411 274451
52380 274451 275440 276843 278786 281165 283985 287422 291541 296074 300543 304597 308224 311700 315398 319568
52366 319568 324114 328486 331874 333674 333846 332876 331458 330222 329594 329705 330404 331474 332839 334457 336047
52351 336047 337141 337496 337349 337195 337423 338194 339458 341009 342717 344855 347966 352222 357176 362406 368171
52336C68171O821P735P861P583P908R227J0937J2230J2831J3069J3532J4695J6552
52323E09152J8563K0072K0818K0977K0883K0742K0553K0192J9730J9598K0103
52312G31383K0785K0816K0142J9635J9772J9855J9064J7725J6791J6486J6227
52301I38681J5632J4719J3322J1156Q583O526N343M348K620p9l220n950p630q391
52287I95660r075j0241j1370j1590j0919j0094r333q169o432m459k256N11L482
52274I05715N566O415P053Q418J0075J1081J1450J2027J3253J4774J5956J6305
52262A038088J5694J4631J4072J4474J5333J5932J6071J5749J4733J3081J1590
52251A199448J0946J0663R556P114L827L19l142o354r040j1126j2747j3943j4731
$$ plain form
52336 368171 374992 382727 390588 398171 406079 415306 426243 438473 451304 464373 477905 492600 509152
52323 509152 527715 547787 568605 589582 610465 631207 651760 671952 691682 711280 731383
52312 731383 752168 772984 793126 812761 832533 852388 871452 889177 905968 922454 938681
52301 938681 954313 969032 982354 993510 1002093 1008619 1013962 1018310 1020930 1020851 1017631 1011681 1004051 995660
52287 995660 986585 976344 964974 953384 942465 932371 923038 914869 908437 903978 901722 902233 905715
52274 905715 911281 917696 924749 933167 943242 954323 965773 977800 991053 1005827 1021783 1038088
52262 1038088 1053782 1068413 1082485 1096959 1112292 1128224 1144295 1160044 1174777 1187858 1199448
52251 1199448 1210394 1221057 1230613 1237727 1241554 1241873 1238731 1232377 1223337 1212211 1199464 1185521 1170790
52238A170790j5431j6470j7773j8667j8557j7559j6442j5969j6202j6369j5607
52227I85744j3863j1831j0012q360o906o036n773n398m381l125k223j489m79M85
52213I06353P54N99R64K010K849K949K925L531M504M988M720M297M402N047N563
52198I56455N323M497L950M180M642M569M122M078M519M677M227L777L680L137
52184A015833J269j438l637m885o014p649r184r619q953q084p569p082o208n241
52170I31539m726m528l912k598j196m08j48K29J033J979K621K831K837L033L549
52155I32135L915L319J586l82j484j550j201p61KJ134K079K428K516K912L592
52140I50240L949L593K754K009J818K316L331M559N864P395R369J1704J4090J6435
$$ plain form
52238 1170790 1155359 1138889 1121116 1102449 1083892 1066333 1049891 1033922 1017720 1001351 985744
52227 985744 971881 960050 950038 941678 934772 928736 922963 917565 913184 910059 907836 906347 905868 906353
52213 906353 907107 907706 908670 910680 913529 916478 919403 922934 927438 932426 937146 941443 945845 950892 956455
52198 956455 961778 966275 970225 974405 979047 983616 987738 991816 996335 1001012 1005239 1009016 1012696 1015833
52184 1015833 1017102 1015664 1012027 1007142 1001128 993479 984295 974676 965723 957639 950070 942988 936780 931539
52170 931539 926813 922285 918373 915775 914579 914171 914023 914252 915285 917264 919885 922716 925553 928586 932135
52155 932135 936050 939369 940955 940573 939089 937539 936338 935577 935579 936713 938792 941220 943736 946648 950240
52140 950240 954189 957782 960536 962545 964363 966679 970010 974569 980433 987828 997197 1008901 1022991 1039426
52126A039426J9006K1851K4284K5437K5465K5663K7052K9119L0519L0687L0124
52115A328633K9222K7777K5842K4123K2937K1531J9164J6341J4078J2331J0144
52104A552123P259M630L134K453J601k9k393n108p724r938j1846j3821j6037j8306
52090A485998k0363k2014k2985k3047k2328k1179j9655j7561j5081j2846j1167
52079A277772r614p683n425l086n33K399N307P487Q805R814J1009J2385J3795
52066A322432J5297J6855J8095J8647J8620J8369J7955J7190J6240J5622J5393
52055A510715J4767J2879R810O395L172N4l053n924q518j1231j4310j7405k0005
52042A477346k2102k3936k5412k6193k6223k5770k5025k4050k3036k2238k1646
$$ plain form
52126 1039426 1058432 1080283 1104567 1130004 1155469 1181132 1208184 1237303 1267822 1298509 1328633
52115 1328633 1357855 1385632 1411474 1435597 1458534 1480065 1499229 1515570 1529648 1541979 1552123
52104 1552123 1559382 1564012 1567146 1569599 1571200 1571171 1568778 1563670 1555946 1546008 1534162 1520341 1504304 1485998
52090 1485998 1465635 1443621 1420636 1397589 1375261 1354082 1334427 1316866 1301785 1288939 1277772
52079 1277772 1268158 1260475 1255050 1251964 1251431 1253830 1259137 1266624 1275429 1285243 1296252 1308637 1322432
52066 1322432 1337729 1354584 1372679 1391326 1409946 1428315 1446270 1463460 1479700 1495322 1510715
52055 1510715 1525482 1538361 1548171 1554566 1557738 1557792 1554739 1548815 1540297 1529066 1514756 1497351 1477346
52042 1477346 1455244 1431308 1405896 1379703 1353480 1327710 1302685 1278635 1255599 1233361 1211715
52031A211715k0911j9741j8198j6719j5806j5545j5403j4805j3906j3375j3301
$$ plain form
52031 1211715 1190804 1171063 1152865 1136146 1120340 1104795 1089392 1074587 1060681 1047306 1034005
$$ [...]
##END NTUPLES=NMR SPECTRUM
##END=
