##TITLE=AC1685_PANAH14366_8637465_tnnQyLi04W
##JCAMPDX= 6.0         $$ Bruker NMR JCAMP-DX V2.0
##DATA TYPE= NMR SPECTRUM
##DATA CLASS= NTUPLES
##ORIGIN= BRUKER
##OWNER= Administrator
$$ 1.72 TOPSPIN		Version 2.1
$$ 2014-05-30 18:26:51.146 -0700  Administrator@X
$$ Compression mode = diff/dup
##.OBSERVE FREQUENCY= 400.02188249412
##.OBSERVE NUCLEUS= ^1H
##.ACQUISITION MODE= SIMULTANEOUS (DQD)
##.ACQUISITION SCHEME= undefined
##.AVERAGES= 8
##.DIGITISER RES= 22
##SPECTROMETER/DATA SYSTEM= spect
##.PULSE SEQUENCE= zg30
##.SOLVENT NAME= COFFEE_meoh
##.SHIFT REFERENCE= INTERNAL, COFFEE_meoh, 1, 14.98509
##AUDIT TRAIL= $$ (NUMBER, WHEN, WHO, WHERE, PROCESS, VERSION, WHAT)
$$ ##TITLE= Audit trail, TOPSPIN		Version 2.1
$$ ##JCAMPDX= 5.01
$$ ##ORIGIN= Bruker BioSpin GmbH
$$ ##OWNER= Administrator
$$ $$ E:\/data/COFFEE/nmr/AC1685_PANAH14366_8637465_tnnQyLi04W/20/pdata/1/auditp.txt
$$ ##AUDIT TRAIL=  $$ (NUMBER, WHEN, WHO, WHERE, PROCESS, VERSION, WHAT)
(   1,<2014-05-30 18:26:44.349 -0700>,<Administrator>,<X>,<go>,<TOPSPIN 2.1>,
      <created by zg
	started at 2014-05-30 18:25:35.005 -0700,
	POWCHK enabled, PULCHK disabled,
       configuration hash MD5:
       C8 4E 4E 5D D3 5C D8 9E 9F 52 82 E0 59 8A DE 15
       data hash MD5: 64K
       B6 00 1F D0 8E EE D2 BE 38 DB E0 E9 4E 8B 77 60>)
(   2,<2014-05-30 18:26:47.380 -0700>,<Administrator>,<X>,<proc1d>,<TOPSPIN 2.1>,
      <Start of raw data processing
       efp LB = 0 FT_mod = 6 PKNL = 1 PHC0 = 0 PHC1 = 0 SI = 32K 
       data hash MD5: 32K
       8D 56 FE A9 FB 85 8E 0F 1A 6E 67 E4 F4 E7 23 5F>)
(   3,<2014-05-30 18:26:47.724 -0700>,<Administrator>,<X>,<proc1d>,<TOPSPIN 2.1>,
      <pk PHC0 = 92.86194 PHC1 = 0 
       data hash MD5: 32K
       BB 6E EC 67 44 AF E7 6C 48 74 6E 16 47 CE 3F 56>)
(   4,<2014-05-30 18:26:47.849 -0700>,<Administrator>,<X>,<proc1d>,<TOPSPIN 2.1>,
      <abs ABSG = 1 
       data hash MD5: 32K
       0F 30 96 52 5F 97 15 CA 02 21 3E DF 1D AC 3D 46>)
(   5,<2014-05-30 18:26:47.927 -0700>,<Administrator>,<X>,<proc1d>,<TOPSPIN 2.1>,
      <abs ABSG = 2 
       data hash MD5: 32K
       C0 AE CD 4B B3 94 E3 76 A8 D0 3A 3F 66 D0 5C 10>)
(   6,<2014-05-30 18:26:47.974 -0700>,<Administrator>,<X>,<proc1d>,<TOPSPIN 2.1>,
      <abs ABSG = 3 
       data hash MD5: 32K
       E5 F6 18 65 A0 9D AF 8E E4 B1 0C 4A 4E 68 86 78>)
(   7,<2014-05-30 18:26:48.021 -0700>,<Administrator>,<X>,<proc1d>,<TOPSPIN 2.1>,
      <abs ABSG = 4 
       data hash MD5: 32K
       29 AD F0 BA 42 CA F8 06 8D EF EA 09 1C CD FE B6>)
(   8,<2014-05-30 18:26:48.068 -0700>,<Administrator>,<X>,<proc1d>,<TOPSPIN 2.1>,
      <abs ABSG = 5 
       data hash MD5: 32K
       87 61 D4 3C CD 6E 22 D9 A4 8B 1D ED FB AD FE 52>)
$$ ##END=
$$ 
$$ $$ hash MD5
$$ $$ 82 D1 FB 39 36 25 BA B7 7B 56 39 19 6F 9E 94 C7
##$RELAX= 
##$RELAX= 
##$RELAX= 
##$RELAX= 
##$RELAX= 
##$RELAX= 
##$RELAX= 
$$ Bruker specific parameters
$$ --------------------------
##$DU= <E:\>
##$EXPNO= 20
##$NAME= <AC1685_PANAH14366_8637465_tnnQyLi04W>
$$ [...]
150 150 150 150 150 150 150 150
##$TP07= 0
##$TPNAME0= <>
##$TPNAME1= <>
##$TPNAME2= <>
##$TPNAME3= <>
##$TPNAME4= <>
##$TPNAME5= <>
##$TPNAME6= <>
##$TPNAME7= <>
##$TPOAL= (0..7)
0.5 0.5 0.5 0.5 0.5 0.5 0.5 0.5
##$TPOFFS= (0..7)
0 0 0 0 0 0 0 0
##$TUNHIN= 0
##$TUNHOUT= 0
##$TUNXOUT= 0
##$USERA1= <user>
##$USERA2= <user>
##$USERA3= <user>
##$USERA4= <user>
##$USERA5= <user>
##$V9= 5
##$VALIST= <valist>
##$VCLIST= <CCCCCCCCCCCCCCC>
##$VD= 0
##$VDLIST= <DDDDDDDDDDDDDDD>
##$VPLIST= <PPPPPPPPPPPPPPP>
##$VTLIST= <TTTTTTTTTTTTTTT>
##$WBST= 2048
##$WBSW= 25
##$XGAIN= (0..3)
0 0 0 0
##$XL= 0
##$YL= 0
##$YMAX_a= 542836
##$YMIN_a= -463424
##$ZGOPTNS= <>
##$ZL1= 120
##$ZL2= 120
##$ZL3= 120
##$ZL4= 120
##$ABSF1= 14.98509
##$ABSF2= -5.573092
##$ABSG= 5
##$ABSL= 3
##$ALPHA= 0
##$AQORDER= 0
##$ASSFAC= 0
##$ASSFACI= 0
##$ASSFACX= 0
##$ASSWID= 0
##$AUNMP= <proc_prof1d_extract_pilot.lims>
##$AXLEFT= 0
##$AXNAME= <>
##$AXNUC= <1H>
##$AXRIGHT= 0
##$AXTYPE= 0
##$AXUNIT= <>
##$AZFE= 0.1
##$AZFW= 0.1
##$BCFW= 0
##$BC_mod= 0
##$BYTORDP= 0
##$COROFFS= 0
##$CY= 15
##$DATMOD= 1
##$DC= 0
##$DFILT= <>
##$DTYPP= 0
##$F1P= 0
##$F2P= 0
##$FCOR= 0.5
##$FTSIZE= 32768
##$FT_mod= 6
##$GAMMA= 0
##$GB= 0
##$INTBC= 1
##$INTSCL= 1
##$ISEN= 128
##$LB= 0
##$LEV0= 0
##$LPBIN= 0
##$MAXI= 10000
##$MC2= 0
##$MEAN= 0
##$ME_mod= 0
##$MI= 0
##$NCOEF= 0
##$NC_proc= -8
##$NLEV= 6
##$NOISF1= 0
##$NOISF2= 0
##$NSP= 0
##$NTH_PI= 0
##$NZP= 0
##$OFFSET= 14.98509
##$PC= 1
##$PHC0= 92.86194
##$PHC1= 0
##$PH_mod= 1
##$PKNL= yes
##$PPARMOD= 0
##$PPDIAG= 0
##$PPIPTYP= 0
##$PPMPNUM= 2147483647
##$PPRESOL= 1
##$PSCAL= 4
##$PSIGN= 0
##$PYNMP= <proc.py>
##$REVERSE= no
##$SF= 400.02
##$SI= 32768
##$SIGF1= 0
##$SIGF2= 0
##$SINO= 400
##$SIOLD= 32768
##$SPECTYP= <>
##$SREGLST= <1H.CDCl3>
##$SSB= 0
##$STSI= 32768
##$STSR= 0
##$SW_p= 8223.68421052631
##$SYMM= 0
##$S_DEV= 0
##$TDeff= 65536
##$TDoff= 0
##$TI= <>
##$TILT= no
##$TM1= 0
##$TM2= 0
##$TOPLEV= 0
##$USERP1= <user>
##$USERP2= <user>
##$USERP3= <user>
##$USERP4= <user>
##$USERP5= <user>
##$WDW= 1
##$XDIM= 32768
##$YMAX_p= 423951873
##$YMIN_p= -753959
##$CURPLOT= <Network HP LaserJet P1505>
##$CURPRIN= <$Network HP LaserJet P1505>
##$DFORMAT= <normdp>
##$LAYOUT= <+/1D_H.xwp>
##$LFORMAT= <normlp>
##$PFORMAT= <normpl>
##$SURQMSG= 1
$$ End of Bruker specific parameters
$$ ---------------------------------
##NTUPLES= NMR SPECTRUM
##VAR_NAME=  FREQUENCY,     SPECTRUM/REAL,   SPECTRUM/IMAG
##SYMBOL=    X,             R,               I
##VAR_TYPE=  INDEPENDENT,   DEPENDENT,       DEPENDENT
##VAR_FORM=  AFFN,          ASDF,            ASDF
##VAR_DIM=   32768,         32768,           32768
##UNITS=     HZ,            ARBITRARY UNITS, ARBITRARY UNITS
##FACTOR=    0.250966925370066, 1,           1
##FIRST=     8223.43324360094, 61066,        93286
##LAST=      0,             2832,            -109264
##MIN=       0,             -753959,         0
##MAX=       8223.43324360094, 423951873,    0
$$ Real data points
##PAGE= N=1
##DATA TABLE= (X++(R..R)), XYDATA
$$ [...]
19577a82164F3112d3743j02270k16147A33523a12302E26785a93256O2278B80508
$$ -182164 63112 -43743 -146013 -362160 133523 -112302 526785 -193256 -130978 280508
19566D4463L2999C1174K2462a56890E9191K45028F6553l612a04885r1199K862
$$ 44463 77462 31174 53636 -156890 59191 304219 66553 62941 -104885 -196084 -193222
19555a93222d7653j58353O0594C56b85893A2758M06131b46583A70370J63206c27527
$$ -193222 -47653 -206006 -145412 356 -285893 12758 418889 -246583 170370 333576 -327527
19543b67936J27563d2268B8910g2236J3729B61540i0843k64977g3452B7524P8402
$$ -267936 -140373 -42268 28910 -72236 -58507 261540 -90843 -355820 -73452 27524 105926
19532A05926e43446a09511D21709A43983a36549i391j70137j29687A33796a72837
$$ 105926 -543446 -109511 421709 143983 -136549 -9391 -179528 -309215 133796 -172837
19521a64422h1666k63612m0398A51167e7796I9497c6377r4733k0721A98464c42233
$$ -164422 -81666 -345278 -385676 151167 -57796 99497 -36377 -131110 -151831 198464 -342233
19509a80068d6408r657j83652k2466B503J38075b81150R4166D356h0334j08547
$$ -180068 -46408 -56065 -239717 -262183 2503 140578 -281150 -186984 4356 -80334 -188881
19498a88881n3155B32640c26307P005a29772J7963A58733p7611a1258n7461J2125
$$ -188881 -242036 232640 -326307 -319302 -129772 -111809 158733 81122 -11258 -68719 -56594
19487e6594r0593D389f8382B23833J18965a76970R101L126D0595a08503b7116
$$ -56594 -147187 4389 -68382 223833 342798 -176970 -167869 -164743 40595 -108503 -27116
19475a90541e7454H7225a8409F0178a42497M0419I6689a39930j44825J33900G411
$$ -190541 -57454 87225 -18409 60178 -142497 -102078 96689 -139930 -284755 -150855 7411
19463E1011c10069Q1239B3488J24066b56445a09436H9429a46502m4115M8423M2043
$$ 51011 -310069 -228830 23488 147554 -256445 -109436 89429 -146502 -190617 -142194 -100151
19452a00151H0614K1719J47264f1236F3751b70869N0259c0650D8718a24593j16065
$$ -100151 80614 102333 249597 -61236 63751 -270869 -220610 -30650 48718 -124593 -240658
19441b40658B66833c15781a45592B3199c8521J4981r7968B2605g9513j9414C33657
$$ -240658 266833 -315781 -145592 23199 -38521 -23540 -121508 22605 -79513 -98927 333657
19429C5630M7281l8277a60165l4131A69691C8520b24755O4389C00536c0646A21494
$$ 35630 82911 44634 -160165 -194296 169691 38520 -224755 -160366 300536 -30646 121494
19417b48420N269C86037c99982A0177g1052k02182F9692O3016D2752c81519a17470
$$ -248420 -243151 386037 -399982 10177 -71052 -273234 69692 132708 42752 -381519 -117470
19405i6840j88716c9058m21003a66590B9175e2073k34697B61670a44500I2361
$$ -96840 -285556 -39058 -460061 -166590 29175 -52073 -286770 261670 -144500 92361
19394h2738B10342f9976A64535f1783B13519A038a96929K2193A54781a35500B92854
$$ -82738 210342 -69976 164535 -61783 213519 1038 -196929 -174736 154781 -135500 292854
19382B82239a7216p737C853c53637B59744A9623b8337j86328b088k4033o8058
$$ 282239 -17216 -24953 3853 -353637 259744 19623 -28337 -214665 -2088 -26121 -94179
19371i4179a1640j86193C1557b33291A73132G1551J05924E4866P5837L52921a19314
$$ -94179 -11640 -197833 31557 -233291 173132 71551 177475 54866 130703 483624 -119314
19359b78152A0274i0282B2038k243J56923b3797k07876j10290A22996b36578P767
$$ -278152 10274 -90282 22038 19795 176718 -23797 -231673 -341963 122996 -236578 -228811
19348b28811O5164J6065B76965i7268l32191d9247m3303L1498B73008b87200D3446
$$ -228811 -163647 -147582 276965 -97268 -429459 -49247 -92550 -61052 273008 -287200 43446
19336b9506r5465l63490H9103i6830L2866l8088B97908E9172J92693c56456a1612
$$ -29506 -124971 -488461 89103 -96830 -63964 -102052 297908 59172 251865 -356456 -11612
19324A03947a83866f8113j599l8381j77906G5086d90706a38352B4212J40627g1052
$$ 103947 -183866 -68113 -69712 -108093 -285999 75086 -490706 -138352 24212 164839 -71052
19312a15034B05824c5318p9148j09147A57809G4011b84997B02157b36499g5411
$$ -115034 205824 -35318 -114466 -223613 157809 74011 -284997 202157 -236499 -75411
19301A80340o7972a66418C01155r8149g3224a2389A88018a06252j21729k32105
$$ 180340 112368 -166418 301155 203006 -73224 -12389 188018 -106252 -227981 -460086
19291d60086H4505A619a43936i449k79484G2601J34941d9890J6821n3643A63304
$$ -460086 84505 1619 -143936 -9449 -288933 72601 207542 -49890 -33069 -86712 163304
19279A52612a78611B21099a87930b175l74908A0808L1876J51039c27171E2228
$$ 152612 -178611 221099 -187930 -2175 -377083 10808 42684 193723 -327171 52228
19268c03388f2530c0341A42653D0258J7697b6046j66795C04823f4306l50586a13309
$$ -303388 -62530 -30341 142653 40258 57955 -26046 -192841 304823 -64306 -414892 -113309
19256A20773a31643l89823L2459D7725M4682c7929k81208C96436b41021i6077
$$ 120773 -131643 -521466 -489007 47725 92407 -37929 -319137 396436 -241021 -96077
19245D4515a76494P7235k99350J11344f6578D2716c03552L7091L4191j05272f4077
$$ 44515 -176494 -99259 -398609 -287265 -66578 42716 -303552 -266461 -232270 -337542 -64077
19233i9030A41775a43466c9484j03954A53669f8921j42010J9554E8101c3076B29917
$$ -99030 141775 -143466 -39484 -143438 153669 -68921 -210931 -191377 58101 -33076 229917
19221B30861h2145n6088i104j15446j42030A11396A8635a30266B553e87835b40662
$$ 230861 -82145 -138233 -9104 -124550 -266580 111396 18635 -130266 2553 -587835 -240662
19209B21396a37216D6782a40570o1336f999j30139p172G0078J02817b07105A16394
$$ 221396 -137216 46782 -140570 -201906 -6999 -137138 -144310 70078 172895 -207105 116394
19197a81685C79476b91980O5317d8882B24126b23938d9095H5166a64600P8520
$$ -181685 379476 -291980 -226663 -48882 224126 -223938 -49095 85166 -164600 -86080
19187h6080A942h9657F3877i1350m0937k65733a18499E6208e8663B39146f2136
$$ -86080 1942 -89657 63877 -91350 -132287 -398020 -118499 56208 -58663 239146 -62136
19175b69719P9344A01810c07716d8936e945m69893a52491j75815B89067e531k18253
$$ -269719 -190375 101810 -307716 -48936 -5945 -475838 -152491 -328306 289067 -5531 -223784
19164b23784I5951a63689D6585h6808j28224B55349d6147G9278a25320j29245
$$ -223784 95951 -163689 46585 -86808 -215032 255349 -46147 79278 -125320 -254565
19154b54565a12902A65122a28550j34639A55652J12179b52449a7198D8469J16695
$$ -254565 -112902 165122 -128550 -263189 155652 267831 -252449 -17198 48469 165164
19144A65164G810b03459O8755N2893D723K75680J1507I3899B6858e34420A898
$$ 165164 7810 -203459 -134704 -81811 4723 280403 291910 93899 26858 -534420 1898
19132c1536G5052J1831m1819c25697e4565J3882j1042k1658K0851j21374P5989
$$ -31536 75052 86883 45064 -325697 -54565 -40683 -51725 -73383 -52532 -173906 -97917
19121i7917B71601G6144F878b21231A53735a90801H7708P2989a42425a2907j15313
$$ -97917 271601 76144 6878 -221231 153735 -190801 87708 160697 -142425 -12907 -128220
19110a28220H4818C3924a37231O4132l8347d1061k7944r0548m0131j17692g9098
$$ -128220 84818 33924 -137231 -73099 -111446 -41061 -69005 -159553 -199684 -317376 -79098
19098b07767i3844p659L7967J7485A9164J39328a00182A67898o4944a22027p5915
$$ -207767 -93844 -101503 -63536 -46051 19164 158492 -100182 167898 102954 -122027 -197942
19087a97942h4206L7886k18764o2577J46897K8411B18253B6824G641a59775a9204
$$ -197942 -84206 -46320 -265084 -327661 -180764 -152353 218253 26824 7641 -159775 -19204
19075F8228a46858A41966F6639d41868D39861C6981J08321D9723b72169A61755
$$ 68228 -146858 141966 66639 -441868 439861 36981 145302 49723 -272169 161755
19064b12399C97362b15274g2620l41146a25392d4191k08244C6060L6140i6306
$$ -212399 397362 -215274 -72620 -413766 -125392 -44191 -252435 36060 72200 -96306
19053c34350e6400I3496a56757A45659e8251J7864A08227g0718B8848a51814p4753
$$ -334350 -56400 93496 -156757 145659 -58251 -40387 108227 -70718 28848 -151814 -226567
19042b26567b1280j99029a9115l1625A88821j1972F3616a33653c9749A36560a67176
$$ -226567 -21280 -220309 -19115 -50740 188821 176849 63616 -133653 -39749 136560 -167176
19030g740j00281A11532a35291b0151H7942L8012l3002a3329D06405a68219N9585
$$ -7740 -108021 111532 -135291 -20151 87942 125954 92952 -13329 406405 -168219 -108634
19019a08634C62201h2133A0787d6860A15118E0448i0242j84980B63574F8729a99030
$$ -108634 362201 -82133 10787 -46860 115118 50448 -90242 -275222 263574 68729 -199030
19007a03153A12056a41261K4330d5959k2702b6100E3740J06940c36936h6773B8884
$$ -103153 112056 -141261 -116931 -45959 -68661 -26100 53740 160680 -336936 -86773 28884
18995a03009J6142k86213J50761g7809b6757k73900I0974B6274b32869B45713
$$ -103009 -86867 -373080 -222319 -77809 -26757 -300657 90974 26274 -232869 245713
18984a37920f2242G6813K03703c26985a35379B12660f9608k24387J21651A08655
$$ -137920 -62242 76813 280516 -326985 -135379 212660 -69608 -293995 -172344 108655
18973i62B6270b26139A28602a85726A41810J23669a61753A08147C7430a97463
$$ -962 26270 -226139 128602 -185726 141810 265479 -161753 108147 37430 -197463
18962i8935A80772b75789B38024C7445c537j11554B16507r2349g9219A65284D1618
$$ -98935 180772 -275789 238024 37445 -3537 -115091 216507 124158 -79219 165284 41618
18950b29018Q4177O6599o5172B4979b61418H1745B2425i2832b7447k5807j52769
$$ -229018 -144841 -78242 -143414 24979 -261418 81745 22425 -92832 -27447 -53254 -206023
18939b06023A60342N929e7727i097E9516a04690c4115B03703J16179h2990I2007
$$ -206023 160342 166271 -57727 -9097 59516 -104690 -34115 203703 319882 -82990 92007
18927C91217B4260h0547B85746c18377f4158j45085j50907B12414c2976B44367
$$ 391217 24260 -80547 285746 -318377 -64158 -209243 -360150 212414 -32976 244367
18916B03931e887C0749b00374d3008j33728K0549A081c7709B31282a7647q7944
$$ 203931 -5887 30749 -200374 -43008 -176736 -156187 1081 -37709 231282 -17647 -105591
18905a05591A01513g1332q264A416Q7990c0604l65399A74842h7259A71910A420
$$ -105591 101513 -71332 -79596 1416 89406 -30604 -396003 174842 -87259 171910 1420
18893C82167b38842j65L9569C01215c47882M5571q0467A4948N602c0976n1901
$$ 382167 -238842 -239007 -199438 301215 -347882 -302311 -382778 14948 20550 -30976 -82877
18882h2877M0699j55676A99878b57355a11945B30021i47o0600K2040k70093G868
$$ -82877 -42178 -197854 199878 -257355 -111945 230021 -947 -61547 -39507 -309600 7868
18870e4060j35855C6916c48896C05518a24547L5041B44307d12873A07073e0368
$$ -54060 -189915 36916 -348896 305518 -124547 -89506 244307 -412873 107073 -50368
18859a09511j918L1584j38436j30393l7265J05017I5732d7799A33112J22722A02678
$$ -109511 -111429 -79845 -218281 -348674 -385939 -280922 95732 -47799 133112 255834 102678
18847a71882P7335K0450B9270Q2251J25350H0052b03591B52510b63729b2438l04002
$$ -171882 -94547 -74097 29270 111521 236871 80052 -203591 252510 -263729 -22438 -326440
18836c26440J24821I6501J75451A31923L5035b74422i8631k36054C1219c4715
$$ -326440 -201619 96501 271952 131923 166958 -274422 -98631 -334685 31219 -34715
18825a6234A11379k7922a6676B23068D2162a55179A51907D760b04929A91361l8829
$$ -16234 111379 83457 -16676 223068 42162 -155179 151907 4760 -204929 191361 152532
18814A52532B4027A1016J9258a70983D6318c8226m6299F0049K90280I7996K7449
$$ 152532 24027 11016 30274 -170983 46318 -38226 -84525 60049 350329 97996 125445
18803A25445a89427R3102b644E4061k0400a14594C7941Q0541b75076B75062a32500
$$ 125445 -189427 -96325 -2644 54061 33661 -114594 37941 118482 -275076 275062 -132500
18791b6086k04001g1194j40312p6359m0803C1658d2242D49720B0104J30195c05579
$$ -26086 -230087 -71194 -211506 -287865 -328668 31658 -42242 449720 20104 150299 -305579
18779B98935A29480l7836a79472A39309e5812k08852J5251r7929i2777l3732l08212
$$ 298935 129480 91644 -179472 139309 -55812 -264664 -249413 -347342 -92777 -126509 -434721
18768d34721H8229a09769p4733f6722I47h1797p8974C3427i438n9335l9864j4319
$$ -434721 88229 -109769 -184502 -66722 947 -81797 -160771 33427 -9438 -68773 -108637 -122956
18756a22956m1286f6224k39675K2617h539j9256r6693c4323A66674K65105i5443
$$ -122956 -164242 -66224 -305899 -283282 -8539 -27795 -124488 -34323 166674 431779 -95443
18744b3043C831Q8725i010j92779a0154k21914A86483F9831a80491A14066h1699
$$ -23043 3831 92556 -9010 -201789 -10154 -232068 186483 69831 -180491 114066 -81699
18732a09563B01749a59527A47993b61696R9481j3589m0527k34360A8370a79533
$$ -109563 201749 -159527 147993 -261696 -162215 -175804 -216331 -450691 18370 -179533
18721H2984J40774C8830a14744A06892b73446A7067Q060K18963b10760A98068
$$ 82984 223758 38830 -114744 106892 -273446 17067 25127 244090 -210760 198068
18710B86669e18299A42514F8785F673K09620i0469C68084e7739b8659A76922d20246
$$ 286669 -518299 142514 68785 6673 216293 -90469 368084 -57739 -28659 176922 -420246
18698A57776G7079d26870J34150h3353A7685D477b48863L7318B9387b76923J26447
$$ 157776 77079 -426870 -292720 -83353 17685 4477 -248863 -211545 29387 -276923 -150476
18687a50476I9357c146l48601A7810J91237q2787b36406a13839n9814G1154b39855
$$ -150476 99357 -3146 -351747 17810 209047 126260 -236406 -113839 -173653 71154 -239855
18675D4664b8866J0784B44762c69308d3786A8724b6690G7319a03717D4462N6035
$$ 44664 -28866 -18082 244762 -369308 -43786 18724 -26690 77319 -103717 44462 100497
18664A00497b15397e1022A713J65906a07927B7286K23446a17953b0670A02282
$$ 100497 -215397 -51022 1713 167619 -107927 27286 250732 -117953 -20670 102282
18653d2249n1412p0630j06141g6569m430H9319L6341j1498m2186b81283P068B1173
$$ -42249 -93661 -164291 -270432 -76569 -80999 89319 125660 114162 71976 -281283 -274215 21173
18640E9446a17913I6330P1314G8510a93728G9622i2171j37596b1907j73416Q511
$$ 59446 -117913 96330 167644 78510 -193728 79622 -92171 -229767 -21907 -195323 -186812
18629a86812a3371k0324A32171g6221D74a19359J9356M5695C8039R5766a31439
$$ -186812 -13371 -33695 132171 -76221 474 -119359 -100003 -54308 38039 133805 -131439
18617b31726M4937O1205K0060j2933A58486I289O6996b98991A41081e5874A54633
$$ -231726 -186789 -125584 -105524 -118457 158486 9289 76285 -298991 141081 -55874 154633
18605e32523B63526a56266j58195B24403b12557A11816d69193A2662b97531J06771
$$ -532523 263526 -156266 -314461 224403 -212557 111816 -469193 12662 -297531 -190760
18595a90760B22198a82149B90603b2742n1233F8773L53196c0051A24887q404b55651
$$ -190760 222198 -182149 290603 -22742 -73975 68773 421969 -30051 124887 116483 -255651
18583b02486b903A03244L573c6579A36647b40810D0772b8487j02955D5126b81542
$$ -202486 -2903 103244 106817 -36579 136647 -240810 40772 -28487 -131442 45126 -281542
18571b9101r8551p5819p278o6783a33186o0897G3738f441j98585i94j29576A25489
$$ -29101 -127652 -203471 -210749 -277532 -133186 -194083 73738 -6441 -205026 -994 -130570 125489
18558h8053n8765B4824J24993m2900C7577b23174A25027a30799N3197r4960A18328
$$ -88053 -146818 24824 149817 106917 37577 -223174 125027 -130799 -77602 -172562 118328
18546a79950B40042b18777c9506O017A2656i6406A19474d3990F5976c21926g6338
$$ -179950 240042 -218777 -39506 -33489 12656 -96406 119474 -43990 65976 -321926 -76338
18534a19858L0531j50425j01851B36124j01123a19428G6901L7184b97921B2294
$$ -119858 -89327 -239752 -341603 236124 135001 -119428 76901 114085 -297921 22294
18523c9743B19566b5527A57787i5613l43346h1749A19202L2554o1624m1736L9803
$$ -39743 219566 -25527 157787 -95613 -438959 -81749 119202 151756 90132 48396 88199
18512H8199a09915E8154a33548K9818G9968b01994q4226b8545I6038M7238e7223
$$ 88199 -109915 58154 -133548 -103730 79968 -201994 -286220 -28545 96038 143276 -57223
18500F7780a01775j7033B8939f6071p6134F2952J48062b96127B3851L51784a78862
$$ 67780 -101775 -118808 28939 -66071 -142205 62952 211014 -296127 23851 375635 -178862
18488a37081l04057c0437j12919k23192a09653A741M9737L8804B0979c32A3230
$$ -137081 -441138 -30437 -143356 -366548 -109653 1741 51478 90282 20979 -332 13230
18476F7991a00673E7371Pc12296A98508b97122d6398B07679B0116M55107I0810
$$ 67991 -100673 57371 57378 -312296 198508 -297122 -46398 207679 20116 475223 90810
18464a62829m2601D0016g2824I6358a49343D0917a64814K7707O0140A00501a32259
$$ -162829 -205430 40016 -72824 96358 -149343 40917 -164814 -137107 -76967 100501 -132259
18452h3795m19331J84592b7768k99627a516F4273c094A64448d4905C3862c5423
$$ -83795 -503126 -318534 -27768 -327395 -1516 64273 -3094 164448 -44905 33862 -35423
18440b10594k0698P3570k37742J35776Q5520H8088a00077j51863D8545M7118D0952
$$ -210594 -231292 -157722 -395464 -259688 -174168 88088 -100077 -251940 48545 95663 40952
18428A00093O5489c37809B27329b26896h7705b6859k0421E06033C0812L3828b10506
$$ 100093 165582 -337809 227329 -226896 -87705 -26859 -47280 506033 30812 64640 -210506
18416B02032b97422d0787C57959b00054A04153b1495j10934D87371c8115J3538
$$ 202032 -297422 -40787 357959 -200054 104153 -21495 -132429 487371 -38115 -24577
18406b4577l2368B45098g3546B6088c35815A52082P6698b219j02428j99375C0017
$$ -24577 -56945 245098 -73546 26088 -335815 152082 228780 -2219 -104647 -304022 30017
18394b24103b9641j64083P9751B08693b03446b7056j1673A1953J5090c23395a5863
$$ -224103 -29641 -193724 -113973 208693 -203446 -27056 -38729 11953 27043 -323395 -15863
18382B04650G916K30564A02845b43084A01331f7827g198k25576B3740b48459j06912
$$ 204650 7916 238480 102845 -243084 101331 -67827 -7198 -232774 23740 -248459 -355371
18371c55371b0733k46055d9078a4459A75848b16872B80680O1318B3323g6022B76149
$$ -355371 -20733 -266788 -49078 -14459 175848 -216872 280680 341998 23323 -76022 276149
18359E48b21329k67321f1634B43128e8009p9275A06676B8309N6609f8981j11785
$$ 548 -221329 -488650 -61634 243128 -58009 -137284 106676 28309 84918 -68981 -180766
18348a80766h9046A68762p9157l635a70466G9517f9246m0721J9344q6702N9701
$$ -180766 -89046 168762 89605 85970 -170466 79517 -69246 -109967 -90623 -177325 -117624
18337a17624C9722Q2735b37297A84884H0833a38138A02617M8228b52343C15238
$$ -117624 39722 122457 -237297 184884 80833 -138138 102617 150845 -252343 315238
18326B5201b25725I3453h004k50666H1507P0949f2245n5864j12892n6083A09863
$$ 25201 -225725 93453 -8004 -258670 81507 152456 -62245 -118109 -231001 -287084 109863
18314G2292c53638d7907F7326f9612A19313e0827A75153a76545B0683h6081C7817
$$ 72292 -353638 -47907 67326 -69612 119313 -50827 175153 -176545 20683 -86081 37817
18302b36376n1167a05633A74194G1879J01988b38176J6385g6723n3639B77192
$$ -236376 -287543 -105633 174194 71879 173867 -238176 -221791 -76723 -130362 277192
18291a19228j85708q4698l0281i7265k68686e9862m7146C36848A25815c51708
$$ -119228 -304936 -389634 -419915 -97265 -365951 -59862 -107008 336848 125815 -351708
18280B44037a40338F2742J74848m0639a76771e2344k73013A47749J4095B1671
$$ 244037 -140338 62742 237590 196951 -176771 -52344 -325357 147749 161844 21671
18269a22155A5936m78J1975d4390A73880d1177A5245M8520B4337D64a17325B03024
$$ -122155 15936 15458 27433 -44390 173880 -41177 15245 63765 24337 464 -117325 203024
18256A74716o3010a10971d5356i452j91240r1288a03114J9595j47558g5967A0044
$$ 174716 111706 -110971 -45356 -9452 -200692 -291980 -103114 -83519 -231077 -75967 10044
18244b40040A7701J45543h77j03136q3438c337j20815k9823B17485E7156e7020
$$ -240040 17701 163244 -877 -104013 -187451 -3337 -124152 -153975 217485 57156 -57020
18232B06045a60431q4448F2342a64887g7599j63105C1303a03174C1395a25498
$$ 206045 -160431 -244879 62342 -164887 -77599 -240704 31303 -103174 31395 -125498
18221f8064k04327A49854b43604B1277a91910g2032j3204B0216a68653M2685C0838
$$ -68064 -272391 149854 -243604 21277 -191910 -72032 -85236 20216 -168653 -125968 30838
18209E0230a35919k17265i0553o2891A20764a22025O0126H741c35800Q3218G2146
$$ 50230 -135919 -353184 -90553 -153444 120764 -122025 -61899 8741 -335800 -252582 72146
18197D9942a28437J0652C9120c42156e1525A9700a45899D6118J35279a40011B46615
$$ 49942 -128437 -117785 39120 -342156 -51525 19700 -145899 46118 181397 -140011 246615
18185f4730k35231B25150a54511N7615c6203r0234D1052b77366A85897a95645
$$ -64730 -299961 225150 -154511 -96896 -36203 -126437 41052 -277366 185897 -195645
18174e3601K3896E9521e4900a7471l2543K0994j30724H5787A8170O4391l0779
$$ -53601 -29705 59521 -54900 -17471 -50014 -29020 -159744 85787 18170 82561 51782
18163E1782b17953B3084j0127J03059a36033p806A0724D463b06046o0935g1562
$$ 51782 -217953 23084 12957 116016 -136033 -143839 10724 4463 -206046 -266981 -71562
18151B1391K25499b40249j27452C47490a18808n4939F6871d21260a7543m0215
$$ 21391 246890 -240249 -367701 347490 -118808 -173747 66871 -421260 -17543 -57758
18141e7758B9624c61162h5583l01256A21708b38997A5622P9917d2778I3237a45131
$$ -57758 29624 -361162 -85583 -386839 121708 -238997 15622 95539 -42778 93237 -145131
18129A0629a03915A6636a58020q500l3622f9416A0037c00798A1876l0M23643j50274
$$ 10629 -103915 16636 -158020 -166520 -200142 -69416 10037 -300798 11876 11846 435489 285215
18117B85215e25971b54558j21737B73251j29522b0319N373j59635M5877b114A46120
$$ 285215 -525971 -254558 -376295 273251 143729 -20319 -14946 -174581 -128704 -2114 146120
18105b51302A82574k4310J34783M865j7171e61442h1556m6840k9790o1544A53166
$$ -251302 182574 158264 293047 297912 280741 -561442 -81556 -128396 -158186 -219730 153166
18093a28764D31225A69128E5744J3453j6217K5121a09028B38117c35675A62664
$$ -128764 431225 169128 55744 69197 52980 78101 -109028 238117 -335675 162664
18082b51308G8890c8058k11064D0239J30394k1948J01260r216k8445i8199j91201
$$ -251308 78890 -38058 -249122 40239 170633 148685 249945 240729 212284 -98199 -289400
18071b89400e9138p0426D0822h5123A52058O895R4456b21631c3541A01481M8363
$$ -289400 -59138 -129564 40822 -85123 152058 158953 253409 -221631 -33541 101481 149844
18060A49844N6411f4539A09551K66093c8052j35033g1118r7392A65558J72256
$$ 149844 206255 -64539 109551 375644 -38052 -173085 -71118 -168510 165558 337814
18050C37814e7521A48488c17184A96771a42360a3862f585A10741k5197A2074J06296
$$ 337814 -57521 148488 -317184 196771 -142360 -13862 -6585 110741 85544 12074 118370
18039A18370a3487A16138b39467J13069d2239A48519M109e4005m5511b2653G8327
$$ 118370 -13487 116138 -239467 -126398 -42239 148519 152628 -54005 -99516 -22653 78327
18027D0167P1754i6475M3593A8986c04067l0578J20090J01910E1008J039N9823
$$ 40167 111921 -96475 -52882 18986 -304067 -334645 -214555 -112645 51008 52047 111870
18016A11870a9385k43808J06253o8112a1345A56656g4865I2158B8548J20775b54847
$$ 111870 -19385 -263193 -156940 -225052 -11345 156656 -74865 92158 28548 149323 -254847
18004b19047I1043a23035l9566L3392a0883l4360A37850a09195h053E9722h1186
$$ -219047 91043 -123035 -162601 -129209 -10883 -45243 137850 -109195 -8053 59722 -81186
17992B10799c8365j68417A34403b54435g7880n2763J7142a8179n6717o5861j71037
$$ 210799 -38365 -206782 134403 -254435 -77880 -130643 -113501 -18179 -74896 -140757 -311794
17981c11794G1324F483O6945Q7219B0023J59609a78760A97376F6546H878R8017
$$ -311794 71324 6483 73428 160647 20023 179632 -178760 197376 66546 8878 106895
17970A06895B0758g9415H6700d9698m6371l4750f3315K1206A10356i7595c8867
$$ 106895 20758 -79415 86700 -49698 -96069 -130819 -63315 -42109 110356 -97595 -38867
17958a15043E1853J22472b92872I5247N3781a13549q1542A29380A467K03375a43481
$$ -115043 51853 174325 -292872 95247 149028 -113549 -195091 129380 1467 204842 -143481
17946i4506c9852m7943d2659j6792B69116D2595K385b85386a092B7887b957D23680
$$ -94506 -39852 -87795 -42659 -59451 269116 42595 44980 -285386 -1092 27887 -2957 423680
17933c00389A45053b5564A20749a28191m7392P5801B17031i4435f772A73769b3645
$$ -300389 145053 -25564 120749 -128191 -175583 -99782 217031 -94435 -6772 173769 -23645
17921a85901c2418A56016Q098q0424a52400E5607g4200A01354c2298B08202J08498
$$ -185901 -32418 156016 164114 83690 -152400 55607 -74200 101354 -32298 208202 316700
17910C16700b0236I1786a61327D2918J49045e50410a62188B78284i9779A20946
$$ 316700 -20236 91786 -161327 42918 191963 -550410 -162188 278284 -99779 120946
17899G4736b04358l6542l4726B98119E0624J07877b7858j16716D54445b81541
$$ 74736 -204358 -240900 -275626 298119 50624 158501 -27858 -144574 454445 -281541
17888b78576B79734D6780g1753F1251J43544r1269k1792k8191c66039A83308a50650
$$ -278576 279734 46780 -71753 61251 204795 113526 91734 63543 -366039 183308 -150650
17876a04056r904q4068A23356f2506j35954J7016D7665M6458a81621B8446K46688
$$ -104056 -113960 -198028 123356 -62506 -198460 -181444 47665 94123 -181621 28446 275134
17865B75134p0411k307Q1058I7802f1126l49667H7731b12562F4906b14084J5893
$$ 275134 204723 202416 283474 97802 -61126 -410793 87731 -212562 64906 -214084 -198191
17854a98191A3686J2519J02933N4982a280B7346b79432i5468C823P4696K30068
$$ -198191 13686 26205 129138 184120 -1280 27346 -279432 -95468 3823 78519 308587
17843C08587b8012j3539o7054o923B60160C2659b87947B00664b23464J3610B97265
$$ 308587 -28012 -41551 -108605 -115528 260160 32659 -287947 200664 -223464 -209854 297265
17831A25923J84840A09076L412A7505d06382a68618O7040b9572F2049b26331B34111
$$ 125923 310763 109076 112488 17505 -406382 -168618 -101578 -29572 62049 -226331 234111
17819a88740E9400j7780Q9530b51703J23008H7698B3369i1683G7051d0827k16969
$$ -188740 59400 41620 131150 -251703 -128695 87698 23369 -91683 77051 -40827 -257796
17808b57796A79799K1961a12252C44274b87283I8149J83779A31345K64834b18595
$$ -257796 179799 201760 -112252 344274 -287283 98149 281928 131345 396179 -218595
17797C92643A9465a91636j65967g4807k0306B33844F3849L4067L95586E6309k1153
$$ 392643 19465 -191636 -357603 -74807 -95113 233844 63849 97916 493502 56309 35156
17786C5156A4977M7005M7818A8783b4907o045E8560b5086j4501l15228a09084
$$ 35156 14977 61982 109800 18783 -24907 -30952 58560 -25086 -39587 -354815 -109084
17774a80402o8030A49392c42902g9172B14418H6595d2512j12254r6285n5155A96966
$$ -180402 -248432 149392 -342902 -79172 214418 86595 -42512 -154766 -251051 -306206 196966
17762A42582c4819J6533j32746C5792i955r209j48172D79104B10493l0678E2243
$$ 142582 -34819 -18286 -151032 35792 -9955 -19164 -167336 479104 210493 179815 52243
17750B24107C4457B228J02249b02632N1141j20805B684R7581C2438c18366J01542
$$ 224107 34457 2228 104477 -202632 -151491 -272296 2684 100265 32438 -318366 -216824
17739b16824I4272B6444J19592Q9138h0103j72814c8869d104E6175k5537N7358
$$ -216824 94272 26444 146036 235174 -80103 -252917 -38869 -4104 56175 30638 87996
17728H7996b31840b2606j3975B78830A34007C9136a71419C95625H255f1872m84
$$ 87996 -231840 -22606 -36581 278830 134007 39136 -171419 395625 8255 -61872 -62356
17717f2356k89480a21890F5405c2300h617j57609N5421A14658b29123B4411i4250
$$ -62356 -351836 -121890 65405 -32300 -8617 -166226 -110805 114658 -229123 24411 -94250
17705d6716D7009K6087e908q6036j05397C51658f6520o1091l8709a4348A57460
$$ -46716 47009 73096 -5908 -91944 -197341 351658 -66520 -127611 -166320 -14348 157460
17693d8893G1440N6995c65436b0534A94494J82669C4567L3465J85634a67396r6484
$$ -48893 71440 128435 -365436 -20534 194494 377163 34567 68032 253666 -167396 -263880
17682b63880I1097B3093a70747B62090P4375a63485d7334M165a9033B4818e8887
$$ -263880 91097 23093 -170747 262090 336465 -163485 -47334 -43169 -19033 24818 -58887
17670a09055C6862M0791h775r0752D17929B06169I0051P8772a23022A42194B0951
$$ -109055 36862 77653 -8775 -99527 417929 206169 90051 168823 -123022 142194 20951
17658A61134a11358H6453K51817A33392d18256e7413H1446c5122n466C6484J00166
$$ 161134 -111358 86453 338270 133392 -418256 -57413 81446 -35122 -40588 36484 136650
17647A36650M82i2114j21098I907a64387A95713L4767f2663D3244L68566a75283
$$ 136650 137132 -92114 -213212 9907 -164387 195713 230480 -62663 43244 411810 -175283
17635a22938I5186J25724A4717f2413b3292j0571m2520B79902E3540j0385b38557
$$ -122938 95186 220910 14717 -62413 -23292 -33863 -76383 279902 53540 43155 -238557
17623b8214j27970A47536A0097K89956F9233i075B81692A2371M7956a8234B13590
$$ -28214 -156184 147536 10097 300053 69233 -9075 281692 12371 60327 -18234 213590
17611B3856K74890L7006e6261B7815a5480B02536I7237c53258B2405Q5531c36429
$$ 23856 298746 335752 -56261 27815 -15480 202536 97237 -353258 22405 107936 -336429
17599A04319b1851D43608e6668k54157a30013b2209A65963l9719a10442b109j1525
$$ 104319 -21851 443608 -56668 -310825 -130013 -22209 165963 126244 -110442 -2109 -13634
17588a3634n9308K6858B58802I1852M9129N0827g3623E2062J7027L94673a50866
$$ -13634 -72942 -46084 258802 91852 140981 191808 -73623 52062 69089 463762 -150866
17576B91248f5950l97722Q9658Q0480A23406b79493J05676N0950H3595a6210g444
$$ 291248 -65950 -463672 -374014 -293534 123406 -279493 -173817 -122867 83595 -16210 -7444
17564g5473E9415c46241E7319j1679c9245F0207a9609A24854b33699I7594l9031
$$ -75473 59415 -346241 57319 45640 -39245 60207 -19609 124854 -233699 97594 58563
17553E8563a8946l21087a6337l5880j83812B11895a02079E3604J90667a83287
$$ 58563 -18946 -340033 -16337 -52217 -236029 211895 -102079 53604 244271 -183287
17542e1057F0559a6811B95624j8651o6919b04650A96150G4516O9851a20983A6781
$$ -51057 60559 -16811 295624 276973 210054 -204650 196150 74516 144367 -120983 16781
17530a45102I7243B1893i8445A94714d4884B48169J60334G2589i3137B00626H238
$$ -145102 97243 21893 -98445 194714 -44884 248169 408503 72589 -93137 200626 8238
17518c01707d4608k024j29277B75275A4894h2561A27428K411C6651J38762R8355
$$ -301707 -44608 -46632 -175909 275275 14894 -82561 127428 129839 36651 175413 273768
17507B73768j1143r5325g3096C85871i5884A97534n6879L4132h2659A27900c11149
$$ 273768 262625 167300 -73096 385871 -95884 197534 140655 174787 -82659 127900 -311149
17495A92205a01832G1261L04977j04321b1548A16131D2027P1890f0832p8290A07240
$$ 192205 -101832 71261 376238 271917 -21548 116131 42027 113917 -60832 -139122 107240
17483e2520A62997k7241K75957D6790P5786E6451b36882A69892F2856a71203f5571
$$ -52520 162997 135756 411713 46790 122576 56451 -236882 169892 62856 -171203 -65571
17471F1868M37761A57624K65284G1486M763K85001j68689m551D2447A4602J4699
$$ 61868 499629 157624 422908 71486 76249 361250 192561 188010 42447 14602 29301
17460B9301K04572a65611B11863J60148j78220J33592r8340P7064j04921K12907
$$ 29301 233873 -165611 211863 372011 193791 327383 229043 306107 201186 414093
17450D14093A48232Q9769j00025F5180O64519c0314A73813K76808I6419A1694
$$ 414093 148232 238001 137976 65180 729699 -30314 173813 450621 96419 11694
17439A05392f0411B47779k9517K5195J04008j38786M2716j06386J2585J80152
$$ 105392 -60411 247779 218262 243457 347465 208679 251395 145009 157594 337746
17429C37746q0553E0816K11566f0803E46830D3873L65210l0810b1681B38612K7088
$$ 337746 257193 50816 262382 -60803 546830 43873 409083 378273 -21681 238612 265700
17418B65700D3479J25689p3380P3334f75B50799A7792J13241k5718m2889R326
$$ 265700 43479 169168 95788 169122 -675 250799 17792 131033 105315 62426 71752
17407G1752M70924A7445a4338A94232Q1631j24419f1262r7636A58130J12081l7441
$$ 71752 542676 17445 -14338 194232 275863 151444 -61262 -158898 158130 270211 232770
17396B32770K4179J60251E4831J48461J92165q8759A15218c1174D2314O9250J12
$$ 232770 256949 417200 54831 203292 395457 306698 115218 -31174 42314 111564 111676
17385A11676B3181K9661J11481p5534J34729b7408A63192J39089b4776j89584
$$ 111676 23181 52842 164323 88789 223518 -27408 163192 302281 -24776 -214360
17375b14360A18568a33124A75509a70282d648C32583A50251J56813l4558j31991
$$ -214360 118568 -133124 175509 -170282 -4648 332583 150251 307064 272506 140515
17365A40515d06924C28006E6486K44199c4012j55490N8481B01114q7218J70592
$$ 140515 -406924 328006 56486 300685 -34012 -189502 -131021 201114 113896 284488
17355B84488d8116C04574I3283J171d3263A74248o0973K6811b24553A06364Q0810
$$ 284488 -48116 304574 93283 94454 -43263 174248 113275 140086 -224553 106364 187174
17344A87174k8485k1241O4498K31599j18159A36116D6218J52547n2532K86523
$$ 187174 158689 137448 201946 433545 315386 136116 46218 198765 146233 432756
17334D32756E7065K25714A17351P6599m300h7907D33969g530j18607A59198J76520
$$ 432756 57065 282779 117351 193950 189650 -87907 433969 -7530 -126137 159198 335718
17323C35718b76010h844D8969J60373H5924R1716J54413a9489o7255j18848A94587
$$ 335718 -276010 -8844 48969 209342 85924 177640 332053 -19489 -86744 -205592 194587
17311C75038I9693f4171C45856H1769C7193N7234g2581B7677K5266L7490l7218
$$ 375038 99693 -64171 345856 81769 37193 94427 -72581 27677 52943 90433 53215
17300E3215J78734D2836J62699a29309A04887J331h300A13292R4832L2167Q5388
$$ 53215 231949 42836 205535 -129309 104887 106218 -8300 113292 208124 240291 325679
17289C25679a49565a8319A28294n8134R611B4468Q476J21812a53765A30644e4351
$$ 325679 -149565 -18319 128294 70160 79771 24468 32944 154756 -153765 130644 -54351
17277D1755K92540J64H9824O502L31133g8150D18535j81098n295a59914B91869
$$ 41755 334295 334459 89824 96326 427459 -78150 418535 237437 232142 -159914 291869
17265b14100A02025h4541B09293k8313J84222j11273A5395L66453A70650a61213
$$ -214100 102025 -84541 209293 180980 365202 253929 15395 381848 170650 -161213
17254E15760H3692a09149A44117L46500j76383A57099J93759A69283p4415O4941
$$ 515760 83692 -109149 144117 490617 314234 157099 350858 169283 94868 159809
17244A59809Q6030K7376R4724C6790J56485K68564j10736A50828J70547d8466
$$ 159809 245839 273215 367939 36790 193275 461839 351103 150828 321375 -48466
17233A46998O5275K60784E7427R2782o1136L86824b17034B52419k5269E8293M3471
$$ 146998 212273 473057 57427 150209 89073 475897 -217034 252419 227150 58293 101764
17222A01764m4022O2955K3374J27636J704H6278Q1844M45422A29353J99855b27149
$$ 101764 57742 120697 144071 271707 273411 86278 168122 613544 129353 329208 -227149
17210A55115F472K08984k8651K5304A6635K43700k4044p0572b063E95083B40560
$$ 155115 6472 215456 186805 212109 16635 260335 236291 165719 -2063 595083 240560
17198A96161b56345A69118L8912d1824C48335E6388R1967D6156J83065J5164J17164
$$ 196161 -256345 169118 208030 -41824 348335 56388 148355 46156 229221 244385 361549
17187C61549m7023A48680J32332d2871B64369O8621h1880A4819P9673R1867J90349
$$ 361549 314526 148680 281012 -42871 264369 332990 -81880 14819 94492 186359 376708
17176C76708J0119F1775K39272J03694o231A31378K67681i1917A16962K16590
$$ 376708 386827 61775 301047 404741 398510 131378 399059 -91917 116962 333552
17166C33552O9856J00734q7874A77859K87913F1463J51221J849a67463I3159j0232
$$ 333552 403408 504142 416268 177859 465772 61463 212684 214533 -167463 93159 82927
17155H2927J3843K35770j32258K7596o6315J04750R9525j11533c764E75484o0054
$$ 82927 96770 332540 200282 227878 161563 266313 365838 254305 -3764 575484 515430
17144E15430A30923K16271J11663b13592b2657E2504K84206j05469J06493n2070
$$ 515430 130923 347194 458857 -213592 -22657 52504 336710 231241 337734 285664
17134B85664I2292J86561K04328B13778F3938J8366M59965A42897K90575J3589
$$ 285664 92292 278853 483181 213778 63938 82304 542269 142897 433472 447061
17124D47061q7894L11m4909j538N4560j83663J25599m9968B5330J80497l768J00990
$$ 447061 359167 359478 314569 313031 367591 183928 309527 259559 25330 205827 202059 303049
17112C03049J45326A10595M88906k96647L5924m251q4407j3681J97470j36302
$$ 303049 448375 110595 599501 302854 338778 334527 250120 236439 433909 297607
17102B97607Q3804R2996J14346K42A04180J42212q9118o3373J12717J00075O9174
$$ 297607 381411 474407 588753 588995 104180 246392 157274 93901 206618 306693 375867
17091C75867r7775L88401J90174B49338J30571I5854R9786K63951A86324M71680
$$ 375867 278092 666493 856667 249338 379909 95854 195640 459591 186324 658004
17081F58004B46158l3382L66667Q0209F6644L10874o8985Q7127J82897j73829
$$ 658004 246158 212776 579443 659652 66644 377518 308533 395660 578557 404728
17071D04728P4012A46896L04897J49221K0591k77776J83693A64563J15531N4679
$$ 404728 478740 146896 451793 601014 621605 343829 527522 164563 280094 334773
17061C34773K02845n4627k02943N39951A96141Q3476K55787O6694k23950L416
$$ 334773 537618 482991 280048 819999 196141 279617 535404 602098 378148 381564
17051C81564A60186M06691j91698p8048J7010J12068r1212K52211k57897Q662
$$ 381564 160186 566877 375179 297131 314141 426209 334997 587208 329311 337973
17041C37973m9275L49142j22653l6939j41305L29912j38508o1334l2362J76595
$$ 337973 288698 637840 515187 478248 336943 666855 528347 467013 434651 611246
17031F11246m4686K58172j05459B54508K43523J88885B69291M98413j97544K0860
$$ 611246 566560 824732 719273 254508 498031 686916 269291 767704 570160 591020
17021E91020q9637m6968k3060L8629M6016K28964N7649j20704j99162L8174M15738
$$ 591020 501383 454415 431355 469984 516000 744964 802613 681909 482747 520921 936659
17010I36659l21597K56289k57175j47397L40450l32398R9J61035m1367Q3431k78404
$$ 936659 615062 871351 614176 466779 807229 474831 474930 635965 594598 678029 399625
16999C99625J24281K3411P8355k43448K18044K88221j11991C02911K25742J07392
$$ 399625 523906 547317 625672 382224 600268 888489 776498 302911 528653 636045
16989F36045j55716K16870L15451j98964j33341K80034k19692J4514o1266j52
$$ 636045 480329 697199 1012650 813686 680345 960379 740687 755201 693935 693783
16979F93783K02804l44922K16523M7361J49105j15536p8954m912L02785m74308
$$ 693783 896587 551665 768188 815549 964654 849118 770164 765252 1068037 593729
16969E93729Q710K20756J28078r4039k85021J02817K1367J41147J18516j56579
$$ 593729 602439 823195 951273 857234 572213 675030 696397 837544 956060 799481
16959G99481j55623L88169j20692k63441L63260k3531k79666R6387J60330J70327
$$ 799481 643858 1032027 911335 647894 1011154 987623 707957 804344 964674 1135001
16949A135001m79571K39987k98543l4470K82520l1684L12578j20740l3515P4047
$$ 1135001 655430 895417 596874 562404 844924 813240 1125818 1005078 971563 1045610
16939A045610l3535J8677N1925n3939K02780K72057o77792K29397K4290J70189
$$ 1045610 1012075 1030752 1082677 1028738 1231518 1503575 825783 1055180 1079470 1249659
16929A249659m75982K59404p6425N42214G45322L69532o2293o1739L43793l15882
$$ 1249659 773677 1033081 956656 1498870 745322 1114854 1052561 990822 1334615 1018733
16919A018733L24977j74770m6732K52358J49680m53350J73857N8844K3735N198
$$ 1018733 1343710 1168940 1122208 1374566 1524246 1070896 1244753 1303597 1327332 1332530
16909A332530K69712j41320J02597k81433j25577O9240M99772n64104K57721K39721
$$ 1332530 1602242 1460922 1563519 1282086 1156509 1225749 1725521 1161417 1419138 1658859
16899A658859k05683L04431o86738M75055M01935k30701J65905k38759J61647
$$ 1658859 1453176 1757607 1070869 1545924 1947859 1717158 1883063 1644304 1805951
16890A805951k50109J51234O9504j99803k5695j9745M41538k17290N9981M8455
$$ 1805951 1555842 1707076 1776580 1576777 1551082 1531337 1972875 1755585 1815566 1864021
16880A864021r1332M05482J60194p48264K32021O324K21873j30422M6379J83640
$$ 1864021 1772689 2178171 2338365 1590101 1822122 1828446 2050319 1919897 1966276 2149916
16870B149916J83104l37475q9478L36711r4182p6548M60085j80433n9627J52354
$$ 2149916 2333020 1995545 1906067 2242778 2148596 2072048 2532133 2351700 2292073 2444427
16860B444427J07689j44152j79362K31576J21629O9158J06693k99946K07186k7643
$$ 2444427 2552116 2407964 2228602 2460178 2581807 2650965 2757658 2457712 2664898 2637255
16850B637255k9477K27157m7107j15841j76514K54236L5369K10639P8103J44127
$$ 2637255 2607778 2834935 2787828 2671987 2495473 2749709 2785078 2995717 3073820 3217947
16840C217947m72421P67474j31250K5740k83935L52335k27758M91086k44820J72827
$$ 3217947 2745526 3513000 3381750 3407490 3123555 3475890 3248132 3739218 3494398 3667225
16830C667225K37923o30498Q07345j68759j87859L78323k41605L58026J06098
$$ 3667225 3905148 3274650 4081995 3913236 3725377 4103700 3862095 4220121 4326219
16821D326219l12600M45093J06208r1989k83375O54153j13766L32834q7603Q6417
$$ 4326219 4013619 4458712 4564920 4472931 4189556 4843709 4729943 5062777 4975174 5061591
16811E061591O5319k42025K47400J51525M05785j33011P4647p5358Q72808q5996
$$ 5061591 5126910 4884885 5132285 5283810 5689595 5556584 5631231 5555873 6428681 6342685
16801F342685J1159M36587K3341J13402K43374J3712K35435o7063K95154K48299
$$ 6342685 6353844 6790431 6813772 6927174 7170548 7184260 7419695 7352632 7647786 7896085
16791G896085k24952P48877K12564J49668J42721L57452J11969M2027N73802L10870
$$ 7896085 7671133 8420010 8632574 8782242 8924963 9282415 9394384 9436411 10010213 10321083
16781A0321083M14775k6849O05349j3317P66346o7780O03293N32186L68272P76209
$$ 10321083 10735858 10709009 11314358 11301041 12067387 11999607 12602900 13135086 13503358 14279567
16771A4279567P0675L08012L73955P13808L72199R06131Q33294L92175M60481
$$ 14279567 14350242 14658254 15032209 15746017 16118216 17024347 17857641 18249816 18710297
16762A8710297R59850R20202M09035R39478Q10277J215418J151763Q04534R61906
$$ 18710297 19670147 20590349 20999384 21938862 22749139 23964557 25116320 25920854 26882760
16753B6882760J544873J456928J309094J256818J499086J625006J752403K140838
$$ 26882760 28427633 29884561 31193655 32450473 33949559 35574565 37326968 39467806
16745C9467806J482927K573041K366868K280380K935063K627870L066114L339586
$$ 39467806 40950733 43523774 45890642 48171022 51106085 53733955 56800069 60139655
16737F0139655L487026L743545M078765M483111M609398M790601N382594N397733
$$ 60139655 63626681 67370226 71448991 75932102 80541500 85332101 90714695 96112428
16729I6112428O128624N614922O470764O336440O294728O766428O404583N851656
$$ 96112428 102241052 107855974 114326738 120663178 126957906 133724334 140128917 145980573
16721A45980573N621042N391237M000099L212206K417128J474210m0737r35613
$$ 145980573 151601615 156992852 160992951 164205157 166622285 168096495 168055758 167120145
16713A67120145k315682l206030m186497n266948n349574o442886o463279o329839
$$ 167120145 164804463 161598433 157411936 152144988 146795414 140352528 133889249 127559410
16705A27559410p029104o261178o314187o421922n911597n806354n259380n171206
$$ 127559410 120530306 114269128 107954941 101533019 95621422 89815068 84555688 79384482
16697G9384482n029412m277249m032532m026756l409005l570242l126900l069719
$$ 79384482 74355070 70077821 66045289 62018533 58609528 55039286 51912386 48842667
16689D8842667k634050k329799k560608k178300j814084j890816j859107j723265
$$ 48842667 46208617 43878818 41318210 39139910 37325826 35435010 33575903 31852638
16681C1852638j326390j220971j343574j601904p96783j711611r42606p32305
$$ 31852638 30526248 29305277 27961703 26359799 25563016 23851405 22908799 22176494
16673B2176494r28171j206331m68858o44280q16677j019357l04299p41342o00032
$$ 22176494 21248323 20041992 19573134 18928854 18112177 17092820 16788521 16047179 15447147
16664A5447147p21475m32419l44504p58395k12630o74246k82064l67373j08412
$$ 15447147 14725672 14293253 13948749 13190354 12977724 12303478 12021414 11654041 11545629
16655A1545629o49372k28889n78554j32647j92023o33934J09369l05120l93052
$$ 11545629 10896257 10667368 10088814 9956167 9764144 9130210 9239579 8934459 8541407
16646H541407J18366l87501n39436l46827K56041m85660k36457j09743j26293
$$ 8541407 8659773 8272272 7732836 7386009 7642050 7156390 6919933 6810190 6683897
16637F683897o88976M39056l68031J69611n25284k608l7866k29920l60658O7212
$$ 6683897 5994921 6433977 6065946 6235557 5710273 5707665 5669799 5439879 5079221 5146433
16627E146433j63833J19702k23595l17107O7706O2270n44738Q4675K91746l47368
$$ 5146433 4982600 5102302 4878707 4561600 4629306 4691576 4146838 4231513 4523259 4175891
16617D175891j30306l23795K06944N142j91561O2375n6208k71272j19964J25746
$$ 4175891 4045585 3721790 3928734 3933876 3742315 3804690 3748482 3477210 3357246 3482992
16607C482992j81683K7160k20219J71973k66819m6053O2746l08323j23110J28452
$$ 3482992 3301309 3328469 3108250 3280223 3013404 2967351 3030097 2721774 2598664 2727116
16597B727116M44099l81571j28829j21770J92587k34324R7274N0381j76399K6951
$$ 2727116 3171215 2789644 2660815 2539045 2731632 2497308 2594582 2644963 2468564 2495515
16587B495515k96274j64844K69150q5589k83461K70800j78771J59465K09435n57618
$$ 2495515 2199241 2034397 2303547 2217958 1934497 2205297 2026526 2185991 2395426 1837808
16577A837808M09584l47423k70425K45178M8959j12720j36186L23606k91396k40177
$$ 1837808 2247392 1899969 1629544 1874722 1923681 1810961 1674775 1998381 1706985 1466808
16567A466808N04368k32134J180j65362L89222k82435l92828M34767k24051q0300
$$ 1466808 1971176 1739042 1740222 1574860 1964082 1681647 1288819 1723586 1499535 1419235
16557A419235j87857L82895j51685J25116J10811l38069L04503m67321J54044
$$ 1419235 1231378 1614273 1462588 1587704 1698515 1360446 1664949 1197628 1351672
16548A351672m2209P5712k18108K26169J46438k45503k15646J27509n4635o8403
$$ 1351672 1309463 1385175 1167067 1393236 1539674 1294171 1078525 1206034 1151399 1082996
16538A082996K6598j70624r5829J03165K25810J81431j76129k92604J39484J05967
$$ 1082996 1109594 938970 843141 946306 1172116 1353547 1177418 884814 1024298 1130265
16528A130265j34172J01078l23395L49623k40676N179J5376r3691L01800n27000
$$ 1130265 996093 1097171 773776 1123399 882723 887902 903278 809587 1111387 584387
16518E84387P25396k61991k22397J24374j65512J24545o3472q9700C01725M55412
$$ 584387 1309783 1047792 825395 949769 784257 908802 845330 755630 301725 757137
16508G57137N1216J84154k42226L578k13481Q6287K22978j02550J30226K0778
$$ 757137 808353 992507 750281 753859 540378 626665 849643 747093 877319 898097
16498H98097l27331l6414M79303j54977l93311N6419K30014l14570K48308K5409
$$ 898097 570766 534352 1013655 858678 465367 521786 751800 437230 685538 710947
16488G10947L2265q7737j43835K93556j32251j00672Q6994q0055j21004m2443
$$ 710947 743212 655475 511640 805196 672945 572273 659267 579212 458208 415765
16478D15765K54349r6714l0425j21253J39179j4971k47974L59627k36377L88744
$$ 415765 670114 573400 542975 421722 560901 545930 297956 657583 421206 809950
16468H09950k16127A92506K63939r2621J64939j95659K63953A75125K31511M7397
$$ 809950 593823 192506 456445 363824 528763 333104 597057 175125 406636 454033
16458D54033j38486R9014J57500B70324K31819K14955b16040B92387J18379J15207
$$ 454033 315547 414561 572061 270324 502143 717098 -216040 292387 410766 525973
16448E25973k28586J93476n2006j89489N0283m55J33734P5122I5879J52669J32902
$$ 525973 297387 490863 438857 249368 299651 299196 432930 508052 95879 248548 381450
16437C81450j53990j06259M74218j84746A46036J7509L70605B24637N5750K27967
$$ 381450 227460 121201 595419 410673 146036 163545 534150 224637 280387 508354
16427E08354k38383O5219m62p0286K634h7988A92886J18758J9773J17651A30347
$$ 508354 269971 335190 334728 264442 267076 -87988 192886 311644 331417 449068 130347
16415A87383R279K00774j1468N2662J47028k78245O8398q7359K43089B65418J4704
$$ 187383 196662 397436 385968 438630 585658 307413 375811 288452 531541 265418 280122
16404B80122K2648O4001j5059j6458l9933K64571k71812P6307A38492L12184j93110
$$ 280122 302770 366771 351712 335254 295321 559892 288080 364387 138492 450676 257566
16393B57566l6348A1018M01159A63015J22424D8006L41351J1901A36369J16448
$$ 257566 221218 11018 412177 163015 285439 48006 389357 401258 136369 252817
16383B52817A5417L54304R8623A42655K87580n7q3063B1191f6473D85522k02095
$$ 252817 15417 369721 468344 142655 430235 430178 347115 21191 -66473 485522 283427
16372B83427j02922O3632j9808E1035L22235J61886k60209Q1222d276A08670p628
$$ 283427 180505 244137 224329 51035 373270 535156 274947 356169 -4276 108670 101042
16361A01042M6129J21077l5193j12054C9382M81670A80100B6890L25607P7089
$$ 101042 147171 268248 233055 121001 39382 521052 180100 26890 352497 429586
16351D29586A96377J65377A57717J41001L433a03065B35127P4836l8520j34588
$$ 429586 196377 361754 157717 298718 302151 -103065 235127 309963 271443 136855
16341A36855K08362m4925O5958G6145K23924a27184G7553C8734R900k2903J41558
$$ 136855 345217 300292 366250 76145 300069 -127184 77553 38734 48634 25731 167289
16330A67289a49007B41128l4923h5541I9599K3469a97774B51367A11175a31652
$$ 167289 -149007 241128 206205 -85541 99599 123068 -197774 251367 111175 -131652
16319A95748K75562C2162a39348C40912K0007H1431K29168a26111B8925N3561
$$ 195748 471310 32162 -139348 340912 360919 81431 310599 -126111 28925 82486
16309H2486L15892a45185b1001H8822K16707D8886F077L65615G5476N5884F0256
$$ 82486 398378 -145185 -21001 88822 305529 48886 6077 371692 75476 131360 60256
16297D07497E0339J36009C4944J23551J41171H2279K58367I4571n901a17154B61933
$$ 407497 50339 186348 34944 158495 299666 82279 340646 94571 88670 -117154 261933
16285b27803A10689J7870F982J64285M4692r7401J76880b35205p2935B64601p9306
$$ -227803 110689 128559 6982 171267 215959 118558 295438 -235205 -308140 264601 185295
16274A85295b8488B00475a01618C17049h4544b5417l8855B52767a46338A61604
$$ 185295 -28488 200475 -101618 317049 -84544 -25417 -64272 252767 -146338 161604
16263G4870M722Q0478Q8851p9432i2994E5578J21870b31362H5284J6073i9016
$$ 74870 79592 160070 248921 169489 -92994 55578 177448 -231362 85284 101357 -99016
16251A67388i1708B69193g5454B6591c8656C6047R7382b0522I383g3932g204F6698
$$ 167388 -91708 269193 -75454 26591 -38656 36047 133429 -20522 9383 -73932 -7204 66698
16238b35641D40613B07494J99230B7936d9742B62215d6633m1640I4054a5878H5204
$$ -235641 440613 207494 406724 27936 -49742 262215 -46633 -88273 94054 -15878 85204
16226I9264J29441a21382A62116l6143F683J60836b16415c4377A42471J6855G792
$$ 99264 228705 -121382 162116 125973 6683 167519 -216415 -34377 142471 159326 7792
16214I9077b45150B9486J84801a09219M4149J5869j8777A23617H897a87026A00197
$$ 99077 -245150 29486 214287 -109219 -65070 -49201 -67978 123617 8897 -187026 100197
16202B00996a58952j41722J13168O0442e09B03141a19232E7823L7993K30059o1657
$$ 200996 -158952 -300674 -187506 -127064 -509 203141 -119232 57823 95816 325875 264218
16191B64218j02369L4945J15624b8697r9572j72653C64448a02732A01342a50881
$$ 264218 161849 196794 312418 -28697 -128269 -300922 364448 -102732 101342 -150881
16180H4773a72619n8766a04251I5252n471e4219G2044O3601D2961e6812K0590
$$ 84773 -172619 -231385 -104251 95252 89781 -54219 72044 135645 42961 -56812 -36222
16169c6222B12522a97571F948L52597G6482Q6579k6754a41306F0166M4336a38407
$$ -36222 212522 -197571 6948 359545 76482 163061 136307 -141306 60166 104502 -138407
16157D5931b38891D80259g9222C5289J49482a18165L3842B8754A1918N8964a86794
$$ 45931 -238891 480259 -79222 35289 184771 -118165 -84323 28754 11918 70882 -186794
16145c84536a60872B82827A11535b94639j12699a715C02461a47785q1919C06688
$$ -384536 -160872 282827 111535 -294639 -407338 -1715 302461 -147785 -229704 306688
16134h8508A47796a15204J7204A322f5641j96159A64309C766a51734L6877B92757
$$ -88508 147796 -115204 -98000 1322 -65641 -261800 164309 3766 -151734 -114857 292757
16122a81242Q0098A05287k4959a25757m7759j30485B07200A6335b22536B345g1524
$$ -181242 -101144 105287 80328 -125757 -173516 -304001 207200 16335 -222536 2345 -71524
16110A26313b20798A43298a26292n309D4415p710J69040K37701A24381D3784H101
$$ 126313 -220798 143298 -126292 -131601 44415 36705 205745 443446 124381 43784 8101
16098F8745a04637C3879R353R7390i518m0971j38581m3064J2727Q7522B1349J59323
$$ 68745 -104637 33879 43232 140622 -9518 -50489 -189070 -232134 -219407 -131885 21349 180672
16086A80672J06514d7659B57257o8739E6460c3563j7575P490k34210A4228B90
$$ 180672 287186 -47659 257257 188518 56460 -33563 -51138 -43648 -277858 14228 290
16074a72337N9726C09690c6299j43236F5183B2331a3847j72661C8725b52212J25331
$$ -172337 -112611 309690 -36299 -179535 65183 22331 -13847 -186508 38725 -252212 -126881
16063a26881A05072i5033A09177a37391l4498E7376a30027k12120l4293E5074
$$ -126881 105072 -95033 109177 -137391 -171889 57376 -130027 -342147 -376440 55074
16052c41704D5673J6815R6722b30223a01074d6411E7730b94684i7432D8267b29908
$$ -341704 45673 62488 159210 -230223 -101074 -46411 57730 -294684 -97432 48267 -229908
16040c55134A70244a75283f8530A36944C542e4060A808J15683j6995c2131r0112
$$ -355134 170244 -175283 -68530 136944 3542 -54060 1808 117491 100496 -32131 -122243
16029a22243D1193N4716a26624P826P024E8046a38741d0448F6741e3310D3242
$$ -122243 41193 95909 -126624 -118798 -111774 58046 -138741 -40448 66741 -53310 43242
16017c63397A23385N2105l3847n6815i3163j36501g8460B07260a13765j25858
$$ -363397 123385 175490 141643 84828 -93163 -229664 -78460 207260 -113765 -239623
16007b39623h3417k27797J32743k3790A36685F2013g4373m4429L8781c0452A41532
$$ -239623 -83417 -311214 -178471 -202261 136685 62013 -74373 -118802 -80021 -30452 141532
15995I8407d8097C69223c3414E4059L4766a67169G0679O9070K2406M512J17485
$$ 98407 -48097 369223 -33414 54059 88825 -167169 70679 139749 162155 166667 284152
15984B84152j6682a73767I8938J76287e6062C07983A42610J58268j39881g1631
$$ 284152 267470 -173767 98938 275225 -56062 307983 142610 300878 160997 -71631
15973e61501E856b27558H9500k0720a78969K1809j95368a48803A36544n9696a23185
$$ -561501 5856 -227558 89500 68780 -178969 -157160 -352528 -148803 136544 76848 -123185
15961a23193G2151a01118a238l2966A62946A3073Q7758J5477a18036k35803B7491
$$ -123193 72151 -101118 -1238 -34204 162946 13073 100831 116308 -118036 -353839 27491
15949b78272C4575c9487l666A84436o4184N3112D1079j1531J7677M9011g6349
$$ -278272 34575 -39487 -43153 184436 120252 173364 41079 29548 47225 96236 -76349
15937h6247I7750l7940i4237K9664A37696q802g6582A05967i344j96877f2814
$$ -86247 97750 59810 -94237 -64573 137696 128894 -76582 105967 -9344 -206221 -62814
15925A96298a0380o33171a31948F5661P9154c31476D93970a60951C9010K41791
$$ 196298 -10380 -643551 -131948 65661 144815 -331476 493970 -160951 39010 280801
15915B80801a13259m54629a90126j38908A68013n9990o473g408F0121M2166a92416
$$ 280801 -113259 -567888 -190126 -329034 168013 108023 101550 -7408 60121 102287 -192416
15903F5510g2047k1549I8941a37625c4653A04567N4733G779b10220e5985p091
$$ 65510 -72047 -93596 98941 -137625 -34653 104567 159300 7779 -210220 -55985 -63076
15892f3076j77584j28485B03606f8625l07993H4312l1532g6753r8320e2405F4138
$$ -63076 -240660 -369145 203606 -68625 -376618 84312 52780 -76753 -175073 -52405 64138
15880D1622b07491N5020N878J3858A85728b17764A10627c09221N0602c3322l706
$$ 41622 -207491 -152471 -146593 -132735 185728 -217764 110627 -309221 -258619 -33322 -37028
15869c7028D20591H7439B6573K3572c01553A1611a19294M2342j06444b3698H5487
$$ -37028 420591 87439 26573 50145 -301553 11611 -119294 -76952 -183396 -23698 85487
15857c12577b1924j54711l3289P4337A1842K06484a54609B04580K2440b89332
$$ -312577 -21924 -176635 -209924 -135587 11842 218326 -154609 204580 227020 -289332
15846c23679d4081l34479i1786A6493a00707B4680K73619A1209K90269e3129a4389
$$ -323679 -44081 -378560 -91786 16493 -100707 24680 298299 11209 301478 -53129 -14389
15834A75469b08091N6991A93245b637B66559h2977l3596r7492p2936j90742A90817
$$ 175469 -208091 -151100 193245 -2637 266559 -82977 -116573 -214065 -287001 -477743 190817
15822A09281B7228a12732A25868b96A23413E4931K21030f9026A84975a37964k48003
$$ 109281 27228 -112732 125868 -296 123413 54931 275961 -69026 184975 -137964 -385967
15811c85967i9605A26183a18284A82855c024k8305m37327B02814b16643C6521
$$ -385967 -99605 126183 -118284 182855 -3024 -31329 -468656 202814 -216643 36521
15800c66017B27844D9682a11350H6258a05607M9001j08731A31816D5185b11761
$$ -366017 227844 49682 -111350 86258 -105607 -56606 -165337 131816 45185 -211761
15789C46221C8775a65782B48136a5977H6647d14998f0423m3677b1546j32918M8753
$$ 346221 38775 -165782 248136 -15977 86647 -414998 -60423 -104100 -21546 -154464 -105711
15778a05711A33794D0367A8852b0900H9443a30286K4597h987l07676A62822c2327
$$ -105711 133794 40367 18852 -20900 89443 -130286 -105689 -8987 -316663 162822 -32327
15766G6584B8489J35594J61503b26864l3148A57863b96265a32675A26971a60230
$$ 76584 28489 164083 325586 -226864 -260012 157863 -296265 -132675 126971 -160230
15755A93548h8722A57816a62663j92988A38068g0695d36j98764I4573i2114j69686
$$ 193548 -88722 157816 -162663 -355651 138068 -70695 -436 -199200 94573 -92114 -261800
15744b61800a11502A26600b8045j30609A28306a16451G1465J99513c88099a9410
$$ -261800 -111502 126600 -28045 -158654 128306 -116451 71465 270978 -388099 -19410
15733B95322r5960d76774A43080c85276a57698B65888A22844L6093a18654D4185
$$ 295322 199362 -476774 143080 -385276 -157698 265888 122844 158937 -118654 44185
15722h6271m7116L2393b0955B4342M954Q0830n224R2839h7797K7972j58216E2787
$$ -86271 -133387 -100994 -20955 24342 29296 110126 104902 197741 -87797 -59825 -218041 52787
15709A02874i4261r7056A0993J3020A0758a11883l44310c5773l02935A09481e5412
$$ 102874 -94261 -191317 10993 24013 10758 -111883 -456193 -35773 -338708 109481 -55412
15697A55003H066b276k64095B91790j2685i0702j23746a03245A3487c46390f3284
$$ 155003 8066 -2276 -266371 291790 279105 -90702 -214448 -103245 13487 -346390 -63284
15685i5512C94545b06421A65861l3494b21389B64995b68299N8440n2657A93865
$$ -95512 394545 -206421 165861 132367 -221389 264995 -268299 -209859 -262516 193865
15674b23849B94052a45210a2024m564C19497f4422G9942K26822F4440J43013a04582
$$ -223849 294052 -145210 -12024 -16588 319497 -64422 79942 306764 64440 207453 -104582
15662f6373r5373c8614E3774a19535A39649C5125f7691a8025o3143A08057g8474
$$ -66373 -161746 -38614 53774 -119535 139649 35125 -67691 -18025 -81168 108057 -78474
15650i5551a9962j07204C4916a54030A60422a96135P0527B85301b15636B081J06686
$$ -95551 -19962 -127166 34916 -154030 160422 -196135 -125608 285301 -215636 2081 108767
15639A08767b7880H2559M5570a87433k0422I7352f1502N650j86328k6242J28409
$$ 108767 -27880 82559 128129 -187433 -207855 97352 -61502 -55852 -242180 -268422 -140013
15628a40013d1011k86166C5997Q3006a50165n5232B56516a67293e5697D7493a27157
$$ -140013 -41011 -327177 35997 119003 -150165 -205397 256516 -167293 -55697 47493 -127157
15616a82363f0885A59949o7196b45627H5275i926j84136A7020N3344A001e1422
$$ -182363 -60885 159949 92753 -245627 85275 -9926 -194062 17020 70364 1001 -51422
15604a41870G8673c68173i8624C6240Q9208d2928A32837a65813G8054d168H3517
$$ -141870 78673 -368173 -98624 36240 125448 -42928 132837 -165813 78054 -4168 83517
15592h4326A36353J53140a28618j37405i4205K2579k00685B71139g8676J7688
$$ -84326 136353 289493 -128618 -266023 -94205 -71626 -272311 271139 -78676 -60988
15582f0988A52732b6263n6426A53628a86095F091c0743r865B33505A0069Q0049
$$ -60988 152732 -26263 -82689 153628 -186095 6091 -30743 -40608 233505 10069 90118
15571I0118k0775b2739j64572A90286b04092A13581b99414J30211A69358K75003
$$ 90118 69343 -22739 -187311 190286 -204092 113581 -299414 -169203 169358 444361
15561D44361I5390n029J42996c83110B24871j04708E5214d9657B7483f9378A56829
$$ 444361 95390 90361 233357 -383110 224871 120163 55214 -49657 27483 -69378 156829
15549f8918j21657G7875l4390K33107j15062a85699B76833a68348B3069b78084
$$ -68918 -190575 77875 43485 276592 161530 -185699 276833 -168348 23069 -278084
15538D81608a6802H9413i2502A65398m5958a95653d6377j71637I609Q6730m124
$$ 481608 -16802 89413 -92502 165398 119440 -195653 -46377 -218014 9609 96339 92215
15527I2215f458n5306m5057p5443A96562a9251a102p2591A72670d2107b0556B12281
$$ 92215 -6458 -61764 -106821 -182264 196562 -19251 -1102 -73693 172670 -42107 -20556 212281
15514A13248a94114b1411I7432a30494F0417b10385I9847D8086a60826B54282
$$ 113248 -194114 -21411 97432 -130494 60417 -210385 99847 48086 -160826 254282
15503a93009A70900l0096L3798b11786n5581B5887D379J87695c10982d4679p2518
$$ -193009 170900 140804 174602 -211786 -267367 25887 4379 192074 -310982 -44679 -117197
15492a17197j28936a11919G7042b52408C26975j58773b26738a0659l07177a18710
$$ -117197 -246133 -111919 77042 -252408 326975 168202 -226738 -10659 -317836 -118710
15481a67140K5852a8235k2868B4016a412k0274p668D6090J77710a4859j0740E9296
$$ -167140 -141288 -18235 -41103 24016 -1412 -21686 -29354 46090 223800 -14859 -25599 59296
15468A16872b62614k41078a9413C34381J411j64713a3305l7728A81735l7764c23158
$$ 116872 -262614 -503692 -19413 334381 335792 171079 -13305 -51033 181735 143971 -323158
15456h1874j45718D0327a02328A7208a46336A63714e3750b5556R117B1140J0817
$$ -81874 -227592 40327 -102328 17208 -146336 163714 -53750 -25556 -16439 21140 31957
15445C1957c26507a35793J8987c2738j55299h0991k53256D3542f2441a7372A20560
$$ 31957 -326507 -135793 -116806 -32738 -188037 -80991 -334247 43542 -62441 -17372 120560
15433a41235B57497a79286c1430G345P4035Q0986a47261B33119A170K06509E0577
$$ -141235 257497 -179286 -31430 7345 81380 162366 -147261 233119 1170 207679 50577
15421G9469b89775a00672B8165j2339K09023D5798J56281A7392f6572E3421M7145
$$ 79469 -289775 -100672 28165 15826 224849 45798 202079 17392 -66572 53421 100566
15410A00566P623J1492q794b25340A09758k062C3054a09992F987f2969b6361o9291
$$ 100566 108189 119681 110887 -225340 109758 107696 33054 -109992 6987 -62969 -26361 -95652
15398i5652b5523j97953B3889J28639b86009J11924k25865A6444a23069A12690
$$ -95652 -25523 -223476 23889 152528 -286009 -174085 -399950 16444 -123069 112690
15387c9136A49469h5097j73298e1204C61184A46153l6581J16076n9919d4968l25983
$$ -39136 149469 -85097 -258395 -51204 361184 146153 109572 225648 165729 -44968 -370951
15376c70951A53078a355j32018n3529C61116d5193j27511b9309J1662j44861B59265
$$ -370951 153078 -1355 -133373 -186902 361116 -45193 -172704 -29309 -17647 -162508 259265
15364b2841j18828A99996i4154c7595r4485e3645C69046a6316D0725a32896d6072
$$ -22841 -141669 199996 -94154 -37595 -132080 -53645 369046 -16316 40725 -132896 -46072
15352b38663d5668h469a830q3840b1090m7820D4049M96189g9190m4681A7658J81675
$$ -238663 -45668 -8469 -1830 -85670 -21090 -68910 44049 540238 -79190 -123871 17658 199333
15340A99333r8439d20978a23075D4882a44565B8718a56713O5376A80887e4814
$$ 199333 100894 -420978 -123075 44882 -144565 28718 -156713 -91337 180887 -54814
15329A21715b76501a09342L9388j85285g6647K6164a17F49720F6379P7237f4449
$$ 121715 -276501 -109342 -69954 -255239 -76647 -50483 -117 649720 66379 143616 -64449
15317c30300B41856a00338o9258A27433d9745E3576e1210G2284M64888e18423
$$ -330300 241856 -100338 -169596 127433 -49745 53576 -51210 72284 537172 -518423
15306a19356E1441b8837o9386M0241B67039A04139h5435A26457e8616A71278b78075
$$ -119356 51441 -28837 -98223 -57982 267039 104139 -85435 126457 -58616 171278 -278075
15294D09740e6776G396N6330J46804K0418G3240N7086D2199f1189D15829h0515
$$ 409740 -56776 7396 63726 210530 230948 73240 130326 42199 -61189 415829 -80515
15282D8698a8489D46020i590k66123B03225m276J00667A3906L5242i345I6761
$$ 48698 -18489 446020 -9590 -275713 203225 198949 299616 13906 49148 -9345 96761
15270F6866j5484B2969M0864J64988K686N9893R0701j82484J23267l3320a81077
$$ 66866 51382 22969 63833 228821 231507 291400 382101 199617 322884 289564 -181077
15258c5469B40181J3555c93891B63854p8786C173K05938J2255F4439P56593B26883
$$ -35469 240181 253736 -393891 263854 185068 3173 209111 221366 64439 821032 226883
15246A114351l69178K04641j58792C32202m0660J29434B05539i9359c1047A46556
$$ 1114351 745173 949814 791022 332202 291542 420976 205539 -99359 -31047 146556
15235A83238n0423J3501i8572H1783b87535J00989f9526B98975b94115A03578
$$ 183238 132815 146316 -98572 81783 -287535 -186546 -69526 298975 -294115 103578
15224a83286A59009b20354f5201j07141a9804j14078e0520I9917h5689E9437J98942
$$ -183286 159009 -220354 -65201 -172342 -19804 -133882 -50520 99917 -85689 59437 258379
15213B58379I0174Q0571B5120M7622a38549B08686a00889E30809A04533k6299
$$ 258379 90174 170745 25120 72742 -138549 208686 -100889 530809 104533 78234
15203G8234f3742b6785N045A10747k7137i7598j0510p9806C31602j63465O353
$$ 78234 -63742 -26785 -21740 110747 83610 -97598 -108108 -187914 331602 168137 174490
15192A74490C7406K04056r3453N9108g4586A21978K41543b81891C34103m3123
$$ 174490 37406 241462 148009 207117 -74586 121978 363521 -281891 334103 290980
15182B90980k0368A15613A1375J47433p9271g5304B7502L02976a58557O4512D20244
$$ 290980 270612 115613 11375 158808 79537 -75304 27502 330478 -158557 -94045 420244
15170B13550Q1641e2380A19988N8069h2351j93664B27854j04271R6731B6314O613
$$ 213550 295191 -52380 119988 178057 -82351 -276015 227854 123583 220314 26314 32927
15159C2927N0102i3350C4812c405E0454d2560j0976D3176Q1910J34948b80415
$$ 32927 83029 -93350 34812 -3405 50454 -42560 -53536 43176 125086 260034 -280415
15147a89428H6535C8226L22960D6252M232a1140k3808B25651c5201E9188f6125
$$ -189428 86535 38226 361186 46252 50484 -11140 -34948 225651 -35201 59188 -66125
15135E93395e0147A63629j3280i791l8063o4394A38722i9927F4966B020b9194
$$ 593395 -50147 163629 150349 -9791 -47854 -112248 138722 -99927 64966 2020 -29194
15123B72568K71475B14281C6488K37286b63C38708j50221o5023d1322E869a75292
$$ 272568 544043 214281 36488 273774 -263 338708 188487 123464 -41322 5869 -175292
15111c33134d414l3244A68429K767E6562c3117h241o999a199B2551K04708I7558
$$ -333134 -4414 -37658 168429 171196 56562 -33117 -8241 -15240 -1199 22551 227259 97558
15098A12902K23620j49963C1371L55450A00230a85072C11429a78348o4598C51230
$$ 112902 336522 186559 31371 386821 100230 -185072 311429 -178348 -242946 351230
15087A12688K1857a16150M2766C15439h4734B73923K541B6230b33521C722a04347
$$ 112688 134545 -116150 -73384 315439 -84734 273923 276464 26230 -233521 3722 -104347
15075g9731b8286o9383F1486K59709h86I0250J39839I9862J02130d6310n0453
$$ -79731 -28286 -97669 61486 321195 -886 90250 230089 99862 201992 -46310 -96763
15064i6763C20631D025J60668J06111E0692R5083N59F397M08706B3399c7229m4521
$$ -96763 320631 4025 164693 270804 50692 145775 146334 6397 415103 23399 -37229 -81750
15052h1750n9454B26103l2223J30349j35226m9365g584C75583j79515J16888j34798
$$ -81750 -141204 226103 193880 324229 189003 139638 -7584 375583 196068 312956 178158
15041A78158L72131b39995A93318J19030a87009A51377k7452b08582b061C29013
$$ 178158 550289 -239995 193318 312348 -187009 151377 123925 -208582 -2061 329013
15030A14860b7662B83448j04217J3812J06145i9636b6019B05225K19286G6618
$$ 114860 -27662 283448 179231 193043 299188 -99636 -26019 205225 424511 76618
15019A83319J28370o7421n0652m312f0450C96489A97463k6433G7650M57266k59419
$$ 183319 311689 244268 193616 189304 -60450 396489 197463 171030 77650 534916 275497
15008B75497A11276L30229A75241n5388L21900j91752c7553A51728L7125L50991
$$ 275497 111276 441505 175241 119853 441753 250001 -37553 151728 188853 539844
14998E39844i7921D8999M54447I5069O4083R8368I5168N6696b10858O4888B09493
$$ 539844 -97921 48999 503446 95069 159152 257520 95168 151864 -210858 -145970 209493
14986d33H1373R0385l933M1625A00042M180m2756c9953C36119q5473E4601J64464
$$ -433 81373 171758 167825 209450 100042 104222 61466 -39953 336119 250646 54601 219065
14974B19065a59550C5653K92759j14193l890O7809Q7023j44968C4083O4705M14768
$$ 219065 -159550 35653 328412 214219 210329 278138 365161 220193 34083 98788 513556
14963E13556A81246G0424B7186h5064A58237J97517I5617J8757l3267K08031J14180
$$ 513556 181246 70424 27186 -85064 158237 355754 95617 114374 81107 289138 403318
14952D03318j82454g1282G29319F5200K19924A07389M91702p4168k24159A9261
$$ 403318 220864 -71282 729319 65200 285124 107389 599091 524923 300764 19261
14941g6197C85441j5694j11620J54221a48044D05158A69913n8128J46457l2845
$$ -76197 385441 369747 258127 412348 -148044 405158 169913 111785 258242 225397
14931B25397J25002P429n5918j39865J04717K12597A52660J45497c9296B37336
$$ 225397 350399 357828 301910 162045 266762 479359 152660 298157 -39296 237336
14920A76031l5240J15688d3587B37401M3643M7420M4552J97960A04156P5982K37168
$$ 176031 140791 256479 -43587 237401 281044 328464 373016 570976 104156 180138 417306
14909D17306j31526i2551C23484j54744b750D41469A31602K41431l3251j13864
$$ 417306 285780 -92551 323484 168740 -2750 441469 131602 373033 339782 225918
14899B25918K79013A33487F0404g9637A42452M15614A25869R6659R6569o5558
$$ 225918 504931 133487 60404 -79637 142452 558066 125869 222528 319097 253539
14889B53539R7197L6599L3386e3766B85984j4004l3128k3097O7755K45284r8021
$$ 253539 350736 387335 420721 -53766 285984 271980 238852 215755 283510 528794 430773
14878D30773q8720J97352k13622F6200J76855r9236K37149r238J15317A88462
$$ 430773 342053 539405 325783 66200 243055 143819 380968 371730 487047 188462
14867D61813j64690J54551j46098N9491j26282J2736Q2761A61773L87231A22777
$$ 461813 297123 451674 305576 365067 238785 251521 334282 161773 549004 122777
14856C68334j51058K20645J66354k96253r5885a20626C08609n1844L11669A67227
$$ 368334 217276 437921 604275 308022 212137 -120626 308609 256765 568434 167227
14845A63927M39399j59048j68990l3498K74870E1288M86999L3710j77848J04819
$$ 163927 603326 444278 275288 241790 516660 51288 538287 571997 394149 498968
14835D98968N7046R2742k90401L92794k80016K3664A90472O7378m5160J36825
$$ 498968 556014 648756 358355 751149 471133 494797 190472 257850 212690 349515
14825C49515j58658J70950I4097M15036j11453A40762K78430o4492j49899J28346
$$ 349515 190857 361807 94097 509133 397680 140762 419192 354700 204801 333147
14815C33147p5628J09728n1215Q8954j04872A06891K45082P9253j98225L09382
$$ 333147 257519 367247 316032 404986 300114 106891 351973 431226 233001 542383
14805E42383A36484K56986r8419N23006B45423J24267j2854l6404j9027J81976
$$ 542383 136484 393470 295051 818057 245423 369690 356836 320432 301405 483381
14795D83381E2887M26656j81924P4032J2289J8506J63724k37120K75313j88974
$$ 483381 52887 479543 297619 371651 383940 402446 566170 329050 604363 415389
14785D15389J88370R8161E6201J67690k6850k8576N25793k41791L5271J28858
$$ 415389 603759 701920 56201 223891 197041 168465 694258 452467 487738 616596
14775F16596K2545A69537L17142J20630J7897j94012J19905H3252L25617A46243
$$ 616596 639141 169537 486679 607309 625206 431194 551099 83252 408869 146243
14764E85333o1748M0764j59277l1588I1981L73489K2997k37813L9586K42551m9554
$$ 585333 523585 564349 405072 373484 91981 465470 488467 250654 290240 532791 483237
14753D83237j89810K06822Q4868k27953N29990D38086L19123C58048L53036l05615
$$ 483237 293427 500249 585117 357164 887154 438086 757209 358048 711084 405469
14743D05469J02626k6754k4772J17400L0421K4759j40378J55602B04290M30097
$$ 405469 508095 481341 456569 573969 604390 629149 488771 644373 204290 634387
14733F34387j25434J8209L8788J9724J42817j2293C31145K44548L8462K04797
$$ 634387 508953 527162 565950 585674 728491 716198 331145 575693 614155 818952
14723H18952l25817Q5397J03255O2925k72125O7871M7575J21367j99046n1911
$$ 818952 493135 578532 681787 744712 472587 540458 588033 709400 510354 458443
14713D58443M70615k56965J33878m9467N6463j03343j25684B00379M29157K02730
$$ 458443 929058 672093 805971 756504 812967 709624 583940 200379 629536 832266
14703H32266l70413K68264M0496k37512N7649J64841O8940l21060J58209L33072
$$ 832266 461853 730117 770613 533101 590750 755591 824531 503471 661680 994752
14693I94752j18045N4242m02407M8172J61322j55978j7190r3877J53769J41506
$$ 994752 876707 930949 528542 576714 738036 582058 564868 470991 624760 766266
14683G66266q7900P3817O0552J43764J44849m32031P1713L54199n37378M24802
$$ 766266 678366 752183 812735 956499 1101348 669317 741030 1095229 557851 982653
14673I82653k45463J35827K04523l56224K7817j49998L22017j47256L10544j00461
$$ 982653 737190 873017 1077540 721316 749133 599135 921152 773896 1084440 983979
14663I83979m20234L67618j10310J50144j11198k24827J84939k36182L15895k07743
$$ 983979 563745 931363 821053 971197 859999 635172 820111 583929 899824 692081
14653F92081K61453k55500J43875N31157n55183k67206N22763P9959l43456J83612
$$ 692081 953534 698034 841909 1373066 817883 550677 1073440 1153399 809943 993555
14643I93555j97512L7629J09377R3731J52359o2462J00980j97481L05241l83112
$$ 993555 796043 833672 943049 1036780 1189139 1126677 1227657 1030176 1335417 952305
14633I52305j01219K78933J39494r2032j39866J21756l55309J03518J07287O7742
$$ 952305 851086 1130019 1269513 1177481 1037615 1159371 804062 907580 1014867 1082609
14623A082609J66503q2477q8396L22164j26466N0261k13901J15757m9557L30214
$$ 1082609 1249112 1166635 1078239 1400403 1273937 1324198 1110297 1226054 1176497 1506711
14613A506711l78491j47455L03745n0931k95429L14864j21542j82725K35678q0366
$$ 1506711 1128220 980765 1284510 1233579 938150 1253014 1131472 948747 1184425 1104059
14603A104059K11349j66837K9958K32325J06850p8724l45778J47286J5193J10029
$$ 1104059 1315408 1148571 1178529 1410854 1517704 1438980 1093202 1240488 1255681 1365710
14593A365710R27l76622N97511k22459K3089K43351j65048q9623K4088J74182
$$ 1365710 1366637 990015 1587526 1365067 1388156 1631507 1466459 1376836 1400924 1575106
14583A575106p6619k64797J94999J52397k61960K17125j45766J21739J82153j41249
$$ 1575106 1498487 1233690 1428689 1581086 1319126 1536251 1390485 1512224 1694377 1553128
14573A553128P1534k59340K04173J720K64245L72022K6387j28568j70097j69446
$$ 1553128 1624662 1365322 1569495 1571215 1835460 2207482 2233869 2105301 1935204 1765758
14563A765758N96162j24801k68449K01227K21709k79121M07303m12214L49896
$$ 1765758 2361920 2237119 1968670 2169897 2391606 2112485 2519788 2107574 2457470
14554B457470J51390L42257L77917R31058L00498K875033M943555O414907J3607274
$$ 2457470 2608860 2951117 3329034 4260092 4560590 7435623 12379178 18794085 32401359
14545C2401359O051394A6724730F770554C252927q50502o34732l58682K06683
$$ 32401359 38452753 16724730 6770554 3252927 2402425 1767693 1409011 1615694
14537A615694k89685M13323q1335j48976R1133j0140J85521M0106k13510k11038
$$ 1615694 1326009 1739332 1657997 1509021 1600154 1590014 1775535 1815641 1602131 1391093
14527A391093M71172L73065o57686N78802J75150j42846j39578k67769K35373
$$ 1391093 1862265 2235330 1577644 2156446 2331596 2188750 2049172 1781403 2016776
14518B016776O4420J25162J65768k29860l56623K30736J54590j16046L39386j43570
$$ 2016776 2081196 2206358 2372126 2142266 1785643 2016379 2170969 2054923 2394309 2250739
14508B250739j6827O5105q0100j34056P090L97515J52844k43309L71982l70989
$$ 2250739 2233912 2299017 2218917 2084861 2091951 2489466 2642310 2399001 2770983 2399994
14498B399994J99405N7171k24588J14275k52011K87999J01889p7742L11786l44702
$$ 2399994 2599399 2656570 2431982 2546257 2294246 2582245 2684134 2606392 2918178 2573476
14488B573476J05588L24703l88814J70873p6676j161L02984m50073K26201N32769
$$ 2573476 2679064 3003767 2614953 2785826 2709150 2707989 3010973 2560900 2787101 3319870
14478C319870j00119k23662j8057q6178J48052m2038R9082K11976L4380L11937
$$ 3319870 3219751 2996089 2978032 2891854 3039906 2997868 3096950 3308926 3343306 3655243
14468C655243m99883K31814J61770Q3167p7797n9246K67616j06657K32976J87799
$$ 3655243 3155360 3387174 3548944 3632111 3554314 3495068 3762684 3656027 3889003 4076802
14458D076802k81707K316K78402o5428j55885J0679L3028L31656L02538l56631
$$ 4076802 3795095 3797411 4075813 4010385 3854500 3865179 3898207 4229863 4532401 4175770
14448D175770n368J97153K70695J00478K3750j0449l6047k2141K2944J23639M9963
$$ 4175770 4170402 4367555 4638250 4738728 4762478 4752029 4715982 4693841 4716785 4840424 4890387
14437D890387k66514N08145n36973M59655M15821j53431J28309j21448L81868
$$ 4890387 4623873 5132018 4595045 5054700 5470521 5317090 5445399 5323951 5705819
14428E705819l08613L14582p2234k0310L05418M42697l90784j50596L73322K93131
$$ 5705819 5397206 5711788 5639554 5619244 5924662 6367359 5976575 5825979 6199301 6492432
14418F492432q036J65769j14979l6974L72032j92661L20788p6480J90459J08863
$$ 6492432 6484396 6650165 6535186 6498212 6870244 6677583 6998371 6921891 7112350 7221213
14408G221213k8524N38972Q3798j64867N7113J45618K11226M41558l74679L86229
$$ 7221213 7192689 7731661 7815459 7650592 7707705 7853323 8064549 8506107 8131428 8517657
14398H517657J04185J68713J60327R5494J68478M7355J39244J12262O8061K52643
$$ 8517657 8621842 8790555 8950882 9046376 9214854 9262209 9401453 9513715 9581776 9834419
14388I834419J69935K3168L69406N99446n90141N19819o3469K32299N24647K38976
$$ 9834419 10004354 10027522 10396928 10996374 10406233 10926052 10862583 11094882 11619529 11858505
14378A1858505L01917r8856N21640J83846K54898k1916O25029P021N96296J32394
$$ 11858505 12160422 12061566 12583206 12767052 13021950 13000034 13625063 13632084 14228380 14360774
14368A4360774n6518Q23419K37879J53214L10972K82541M52895M21169M43240
$$ 14360774 14304256 15127675 15365554 15518768 15829740 16112281 16565176 16986345 17429585
14359A7429585L68780L44179M10505K78153N19598J63209M02288Q39308P15764
$$ 17429585 17798365 18142544 18553049 18831202 19350800 19514009 19916297 20755605 21471369
14350B1471369L77134O01127L25814O36578J099156K16906P50322K43259J169198
$$ 21471369 21848503 22449630 22775444 23412022 24511178 24728084 25478406 25721665 26890863
14341B6890863Q03870N63026O58895R36067J020273R00674J019999M44917J303052
$$ 26890863 27694733 28257759 28916654 29852721 30872994 31773668 32793667 33238584 34541636
14332C4541636R18940R90261J280478J268937J197524J316646R96811J805879
$$ 34541636 35460576 36450837 37731315 39000252 40197776 41514422 42511233 44317112
14324D4317112J581698J754717J305455J780973J901913J835304K191798K352919
$$ 44317112 45898810 47653527 48958982 50739955 52641868 54477172 56668970 59021889
14316E9021889K204300K206681K735896K887978K216151L393324L381456L110643
$$ 59021889 61226189 63432870 66168766 69056744 71272895 74666219 78047675 81158318
14308H1158318L881523L657563L824810L935739M738725M628828N389442N443226
$$ 81158318 85039841 88697404 92522214 96457953 101196678 105825506 111214948 116658174
14300A16658174N520047O433449O985924P065414P221115Q255471Q231197R139795
$$ 116658174 122178221 128611670 135597594 142663008 149884123 158139594 166370791 175510586
14292A75510586R583428J0190902J1050101J1484166J2339996J2363312J3799950
$$ 175510586 185094014 195284916 206335017 217819183 230159179 242522491 256322441
14285B56322441J3935036J4063167J5248630J4930738J5469965J5296932J5215941
$$ 256322441 270257477 284320644 299569274 314500012 329969977 345266909 360482850
14278C60482850J4712387J3778931J2747689J1291682Q455490J213686l339684
$$ 360482850 375195237 388974168 401721857 413013539 421469029 422682715 419343031
14271D19343031K29941L741062O37839k640074m501958p518943j0543881j1796617
$$ 419343031 419572972 423314034 423951873 421311799 416809841 409290898 398747017 386950400
14263C86950400j3920335j4361479j4844645j5721961j6029812j5850178j5508116
$$ 386950400 373030065 358668586 343823941 328101980 312072168 296221990 280713874
14256B80713874j4814402j3958882j3285457j3135171j2142466j1697641j0837717
$$ 280713874 265899472 251940590 238655133 225519962 213377496 201679855 190842138
14249A90842138j0291058r659199r176439q319198p724348p286789o869649o895664
$$ 190842138 180551080 170891881 161715442 153396244 145671896 138385107 131515458 124619794
14241A24619794o238309n714262n210840m413408m915990m545671l957214l923229
$$ 124619794 118381485 112667223 107456383 103042975 98126985 93581314 89624100 85700871
14233H5700871m232250k888019k911685l332476k826452l113598k536146k241421
$$ 85700871 81468621 78580602 75668917 72336441 69509989 66396391 63860245 61618824
14225F1618824k652122j910249k305678k160116j335043j852437j858195j229925
$$ 61618824 58966702 57056453 54750775 52590659 51255616 49403179 47544984 46315059
14217D6315059j784232j623638j520282q50560j288185j380547j137459j162507
$$ 46315059 44530827 42907189 41386907 40536347 39248162 37867615 36730156 35567649
14209C5567649j019246j059545k42989j181795j038851j070358o82984r89441
$$ 35567649 34548403 33488858 33245869 32064074 31025223 29954865 29271881 28282440
14201B8282440q61372l28664p69056p25065p61616o48655p70988j89835j070327
$$ 28282440 27421068 27092404 26323348 25598283 24836667 24188012 23417024 23227189 22156862
14192B2156862n19048k19814o93027n20298o43219p6388n91710j92086p04516
$$ 22156862 21637814 21418000 20724973 20204675 19561456 19485068 18893358 18701272 17996756
14183A7996756p612j131167J13603l03907n03994k65085o31754K63161p77027
$$ 17996756 17989144 16857977 16971580 16667673 16163679 15898594 15266840 15530001 14752974
14174A4752974O2746k82245k91011n74706j67628k67578J93707p04368j84115
$$ 14752974 14815720 14533475 14242464 13667758 13500130 13232552 13426259 12721891 12537776
14165A2537776k97498k33685j10369k30307k29013j41703j30572m82237L16840
$$ 12537776 12240278 12006593 11896224 11665917 11436904 11295201 11164629 10682392 10999232
14156A0999232l87853k44465l63280j51993J52004o28079J25952k48008J13724
$$ 10999232 10611379 10366914 10003634 9851641 10003645 9375566 9501518 9253510 9367234
14147I367234l26503l31968J10829p5299j88617m40582K52518j11161l76506Q7718
$$ 9367234 9040731 8708763 8819592 8744293 8555676 8115094 8367612 8256451 7879945 7967663
14137G967663q7430l71987K63308j82078r8106j45840m3617l70399q5358J8081
$$ 7967663 7880233 7508246 7771554 7589476 7491370 7345530 7301913 6931514 6846156 6864237
14127F864237l10397Q1833l74827k1427K9724l31082L8022K9465J95157j71386
$$ 6864237 6553840 6635673 6260846 6239419 6269143 5938061 5976083 6005548 6200705 6029319
14117F029319N8614k38924j64665k64640n7510J07355l27425K11199J5720m96081
$$ 6029319 6087933 5849009 5684344 5419704 5362194 5469549 5142124 5353323 5369043 4872962
14107D872962M32981j43347k90799N9307J2261m59435K38574J05923j79761k04876
$$ 4872962 5305943 5162596 4871797 4931104 4943365 4483930 4722504 4828427 4648666 4443790
14097D443790K11722m91766N27980m99727N4697J07534k25944N3368m2222p6337
$$ 4443790 4655512 4163746 4691726 4191999 4246696 4354230 4128286 4181654 4139432 4063095
14087D063095O615R532k01292N42052n56342R5328K98040j48558l43763l92613
$$ 4063095 4069710 4079242 3877950 4420002 3863660 3958988 4257028 4108470 3764707 3372094
14077C372094N11359l97480J76354o8166J7004K03507m05386j1426j29200r3154
$$ 3372094 3883453 3485973 3662327 3594161 3611165 3814672 3409286 3397860 3268660 3175506
14067C175506j64190M96599n28755M63556m73459L38166j92728J18953n541J36039
$$ 3175506 3011316 3507915 2979160 3442716 2969257 3307423 3114695 3233648 3228107 3364146
14057C364146l59365L25983l05210K6849j85065k87113J49649j2654N5881M8127
$$ 3364146 3004781 3330764 3025554 3052403 2867338 2580225 2729874 2717220 2773101 2821228
14047B821228N14250p28689K5805M9472l39990j20550L41920k51163n6530K40020
$$ 2821228 3335478 2606789 2632594 2682066 2342076 2221526 2563446 2312283 2255753 2495773
14037B495773M2460J9069l11504L80376l22625p4302K62320k70619P6533k25217
$$ 2495773 2538233 2557302 2245798 2626174 2303549 2229247 2491567 2220948 2297481 2072264
14027B072264L9535K76322k73113J99152l83790j19569O7893j23476J52384m0900
$$ 2072264 2111799 2388121 2115008 2314160 1930370 1810801 1878694 1755218 1907602 1866702
14017A866702P9133M9792j63567m1810R8400L946r6782O1741m7958J54556k67352
$$ 1866702 1945835 1995627 1832060 1790250 1888650 1892596 1795814 1857555 1809597 1964153 1696801
14006A696801O1899J18387k08742r3125J08711n2842J7762Q7925k27353Q0489
$$ 1696801 1758700 1877087 1668345 1575220 1683931 1631089 1648851 1736776 1509423 1589912
13996A589912k80729n0139K46395J49362K13068n4913K34009J862775L996615
$$ 1589912 1309183 1259044 1505439 1654801 1867869 1812956 2046965 3909740 7906355
13987G906355N788437J2598233J4544405j9755644A0136951l973822j582117o45312
$$ 7906355 13694792 26293025 40837430 21081786 10136951 6163129 4581012 3935700
13979C935700q46741k03986k44730l11835O3202l53004l6989p5119N9936j50847
$$ 3935700 3088959 2884973 2640243 2328408 2391610 2038606 2001617 1926498 1986434 1835587
13969A835587L179k31788K43034j64826K04766j12112L624l38737R0266J79637
$$ 1835587 1838766 1606978 1850012 1685186 1889952 1777840 1781464 1442727 1532993 1712630
13959A712630j85604j95082L79667j14434M4354M8330k82120o8039J54604k45514
$$ 1712630 1527026 1331944 1711611 1597177 1641531 1689861 1407741 1339702 1494306 1248792
13949A248792K11022L22577m49082R7737K2224o8257K30532k08303l12723L90376
$$ 1248792 1459814 1782391 1333309 1431046 1453270 1385013 1615545 1407242 1094519 1484895
13939A484895l09813p7086M52418m50964J33256K07884p08591M20702R8320q914
$$ 1484895 1175082 1097996 1550414 1099450 1232706 1440590 731999 1152701 1251021 1242107
13929A242107Q9641K3143k42435J95462l30311M23353q9383j39626j81729J77873
$$ 1242107 1331748 1354891 1112456 1307918 977607 1400960 1311577 1171951 990222 1168095
13919A168095k09309M9870J59862K13252m14464l33546P16569k39433Q0525j85440
$$ 1168095 958786 1008656 1168518 1381770 967306 633760 1350329 1110896 1191421 1005981
13909A005981P5185l21647K01273R9450l29495L90087m0777J41587K043j4076
$$ 1005981 1081166 759519 960792 1060242 730747 1120834 1080057 1221644 1223687 1209611
13899A209611m2404l63449L21225j38186J28725k41533K15806j92005o2903k00103
$$ 1209611 1167207 803758 1124983 986797 1115522 873989 1089795 897790 834887 634784
13889F34784K31390k27134K80011n1240M45119j46994j41225K2639l3349l18276
$$ 634784 866174 639040 919051 867811 1312930 1165936 1024711 1047350 1014001 695725
13879F95725Q7097Q2458j23702J98847L29826k80425k87625L98785m14454J37248
$$ 695725 782822 865280 741578 940425 1270251 989826 702201 1100986 686532 823780
13869H23780L13872j68894l94578J57614J00280M6173j64400L48556m3267j52835
$$ 823780 1137652 968758 574180 731794 832074 878247 713847 1062403 1019136 866301
13859H66301M5750j5993k59418j88544L92358k0426K63817k75840l6341r7709
$$ 866301 912051 896058 636640 448096 840454 820028 1083845 808005 771664 673955
13849F73955j7283L15593j08086m3049J6754J47605j9762p6736P4605j7051J69185
$$ 673955 656672 972265 864179 821130 837884 985489 965727 888991 963596 946545 1115730
13838A115730l44924k42853J17585J25910q7651j03156L09678l48181J73837j6492
$$ 1115730 770806 527953 645538 771448 683797 580641 890319 542138 715975 699483
13828F99483L2205k52390K17001q5136J44470l43382L47492r3333m0086P6026
$$ 699483 731688 479298 696299 611163 755633 412251 759743 666410 626324 702350
13818G02350J34950j54281l8190j15100K9661L8794r049j0570K96123A68703J64354
$$ 702350 837300 683019 644829 529729 559390 598184 589135 578565 874688 168703 333057
13807C33057N28881j45607j98625K84168k15063M8296j12407N8958A56150N66282
$$ 333057 861938 716331 517706 801874 586811 635107 522700 581658 156150 722432
13797G22432k84936J70120k7355r744J81920k95644N3398B46298K51850R3774
$$ 722432 437496 607616 580261 570517 752437 456793 510191 246298 498148 591922
13787E91922L2937K63716m05317K64765C37551K13193A02711N64572J58084O8941
$$ 591922 624859 888575 483258 748023 337551 550744 102711 667283 825367 894308
13777H94308k55251P619j75381M0974J33132J9181j5190L9035k61436A11983N43133
$$ 894308 639057 646676 471295 512269 645401 664582 649392 688427 426991 111983 655116
13766F55116k56123o8162O6338Q2576n0915J11146k7224J69064B88053L26495
$$ 655116 398993 330831 397169 479745 428830 539976 512752 681816 288053 614548
13756F14548q5931R6688J01008A42477M37788P4095q4475K9665k40993J50016
$$ 614548 528617 625305 726313 142477 580265 654360 569885 599550 358557 508573
13746E08573l2531k06702m7256L37716J86250l67934j26173J60160k665A88708
$$ 508573 476042 269340 222084 559800 746050 378116 251943 412103 409438 188708
13735G99176k67368K37301B80096K13820Q1230l4340K73044C86358K01377N5108
$$ 799176 531808 769109 280096 493916 575146 540806 813850 386358 587735 642843
13725F42843k08715A54499J92217Q4053J90559A72207K08416J65136K42894k81866
$$ 642843 434128 154499 346716 430769 621328 172207 380623 545759 788653 506787
13715E06787k04313K7175J28571k4427j59663j0524B1194M80457j93558J05144
$$ 506787 302474 329649 458220 433793 274130 263606 21194 501651 308093 413237
13705D13237m0057K60732j70746L5744q7188p556J3253J50569l7953A21142M13272
$$ 413237 373180 633912 463166 498910 411722 404166 417419 567988 530035 121142 534414
13694E34414j00413A60721L08820k08271K16937P6201B10074O0805o5502m3807
$$ 534414 434001 160721 469541 261270 478207 554408 210074 270879 205377 161570
13684A61570c1988C91050n5867j13443K16874k1468j5688k7075A59826J77399
$$ 161570 -31988 391050 335183 221740 438614 417146 401458 374383 159826 337225
13674C37225L05182C06395r4822G7814M55379j51450E276J48864L35186k22595
$$ 337225 642407 306395 211573 77814 533193 381743 5276 154140 489326 266731
13664B66731K10846l7410k06133N8958O0148J68326m5024l644n3172i8196F89910
$$ 266731 477577 440167 234034 292992 353140 521466 476442 472798 419626 -98196 689910
13652E48389C1569J95314b4451C27612O1699j44215Q6905j44754J49289p7992
$$ 548389 31569 226883 -24451 327612 389311 245096 332001 187247 336536 258544
13642B58544k5268J47794G2134K33985l6124K7756H1856M68544A59590L7508J80965
$$ 258544 233276 381070 72134 306119 269995 297751 81856 550400 159590 197098 378063
13631C78063j4677J3336R5781A26020l9586L11257A26356L56555j38201q9487
$$ 378063 363386 376722 472503 126020 86434 397691 126356 482911 344710 255223
13621B55223J55596M0937l1309A66253a05851D09009p6760G8408K26589J88798
$$ 255223 410819 451756 420447 166253 -105851 409009 332249 78408 304997 493795
13611D93795k23004B9632N10902j88265r7587o5267J2703L2667L0021k3251J25710
$$ 493795 270791 29632 540534 352269 254682 189415 202118 234785 264806 241555 367265
13600C67265A51461D5819K65451G6498K18098p2504J80618A94057R3737J36700
$$ 367265 151461 45819 311270 76498 294596 222092 402710 194057 287794 424494
13590D24494a29483A43236B3302J87808J09305j00595M12145a4919j2358Q722
$$ 424494 -129483 143236 23302 211110 320415 219820 631965 -14919 -27277 -18555
13580a8555C33341r3844g0289B25831F4549J50430G9838M11183n2352J88214B06782
$$ -18555 333341 239497 -70289 225831 64549 214979 79838 491021 438669 626883 206782
13568D45877q6670L1699J45391k65680A05364K26565p4578J48878P342A23900
$$ 445877 359207 390906 536297 270617 105364 331929 257351 406229 413571 123900
13557C20630p6819b6143A52330L6106K0885J2296m1020G8693K96348K1205q3916
$$ 320630 243811 -26143 152330 188436 209321 221617 180597 78693 375041 396246 312330
13546C12330N1249F132K22727J1881P6311J91180c573j1861n9996B94688e7352
$$ 312330 363579 6132 228859 240740 317051 508231 -3573 -15434 -75430 294688 -57352
13534C95195A2426g6004C53189n2073L994n2708A17573M3685K62580j23395E3806
$$ 395195 12426 -76004 353189 301116 305110 252402 117573 161258 423838 300443 53806
13522B61739l0182r0408Q790J45724N8401m0361j26503n041M09426B12700J26780
$$ 261739 231557 141149 149939 295663 354064 313703 187200 182159 591585 212700 339480
13511C39480a98147C00944I5670K67168H3740L3791L0749J5457L03361k02147
$$ 339480 -198147 300944 95670 362838 83740 117531 148280 163737 467098 264951
13501B64951c0111B03191f4733A13533b5492E79415g7169A86851M198P523P0952
$$ 264951 -30111 203191 -64733 113533 -25492 579415 -77169 186851 191049 198572 269524
13490B69524a36945I1104M16105r8546j94503C492J98854J99980E8582L45020
$$ 269524 -136945 91104 507209 408663 214160 3492 202346 402326 58582 403602
13480D03602a34407j8831C78117B1155J07043b62409A7398J99807A7021O0120
$$ 403602 -134407 -153238 378117 21155 128198 -262409 17398 217205 17021 77141
13470G7141L37468A75741B0593K59769j30967K23721j47335k0184L23017A01510
$$ 77141 414609 175741 20593 280362 149395 373116 225781 205597 528614 101510
13459A07582c5738j6542C12651n1506d7720G7611J72649d3372F2833B4833Q2053
$$ 107582 -35738 -52280 312651 261145 -47720 77611 250260 -43372 62833 24833 106886
13448A06886C97J28024Q7315I5479i767B46728r3529a16473A89584a64809C4391
$$ 106886 397 128421 215736 95479 -9767 246728 153199 -116473 189584 -164809 34391
13436B17114c40055I8023R0294b2216l1328A8216Q5166j5843a86571A69762f0477
$$ 217114 -340055 98023 188317 -22216 -53544 18216 103382 87539 -186571 169762 -60477
13424C79025I9141r102J16801o6663J8986p6880l5053K13489A2827K04086J53533
$$ 379025 99141 90039 206840 140177 159163 82283 47230 260719 12827 216913 370446
13413C70446A10692B7600L75646A75666M9319h598B28361G4652C1029R767J26081
$$ 370446 110692 27600 403246 175666 224985 -8598 228361 74652 31029 40796 166877
13402A66877K01591I1378O5643K06716r109g7481G0589J50517c89409A52839e8829
$$ 166877 368468 91378 157021 363737 354628 -77481 70589 221106 -389409 152839 -58829
13390B16115L10749a3248E0895g5782d415A68537n300N8656G4615b90606a01980
$$ 216115 526864 -13248 50895 -75782 -4415 168537 163237 221893 74615 -290606 -101980
13378E66465A80065J18750C4131J60906P9399E6372L08254j39102K38962K290
$$ 566465 180065 298815 34131 195037 274436 56372 364626 225524 464486 466776
13368D66776A66220k6820n7599K19465R533A06688K4904J88325a00354n7949C36318
$$ 466776 166220 139400 81801 301266 310799 106688 131592 319917 -100354 -158303 336318
13356G5424B3897e8251I0249J75860A10733K81317A05066M5221P4600B6710M2083
$$ 75424 23897 -58251 90249 266109 110733 392050 105066 150287 224887 26710 68793
13345F8793d5654F6504Q3318K84996b673A46908k2308J01612j419N9510a94877
$$ 68793 -45654 66504 149822 434818 -2673 146908 124600 226212 224793 284303 -194877
13333A28206c2674B95485o3276r5073O6913D1467K18291n6592N9802g0170B55449
$$ 128206 -32674 295485 232209 137136 204049 41467 259758 203166 262968 -70170 255449
13321A74920L3529L75591A18109L05809E9301M6834b2057C18729h2855A8939J93299
$$ 174920 208449 584040 118109 423918 59301 106135 -22057 318729 -82855 18939 212238
13310B12238k2933J57160d9010B24498M2229A07050J44525n8446N7485e1377j26125
$$ 212238 189305 346465 -49010 224498 266727 107050 251575 193129 250614 -51377 -177502
13299a77502e1561C43051B6536L37996A79951k5319N9462m5384b06953j6417I2545
$$ -177502 -51561 343051 26536 364532 179951 154632 214094 168710 -206953 -223370 92545
13287b44490b1059C3702J48645F2835d812o9442j34734B00300k1271h5857B73536
$$ -244490 -21059 33702 182347 62835 -4812 -74254 -208988 200300 179029 -85857 273536
13275a36127l2241C42938A34966D1636a23756B4314J03376O9365H6254a58915
$$ -136127 -168368 342938 134966 41636 -123756 24314 127690 197055 86254 -158915
13264A31056K80539c175p3565D44548A49373L1914a11062j45801B66412E6809
$$ 131056 411595 -3175 -76740 444548 149373 181287 -111062 -256863 266412 56809
13253B27742m804q3852e1318j13549H0773C7799a133A65111a64211F8552R3010
$$ 227742 222938 139086 -51318 -164867 80773 37799 -1133 165111 -164211 68552 161562
13242A61562b46562R286D329L80787I9942a1979A87862L76587B51491D5741K74559
$$ 161562 -246562 -237276 4329 385116 99942 -11979 187862 564449 251491 45741 320300
13231C20300a04154I2938j9366d0932E8475N2972l3929f3756I1687c19753Q1487
$$ 320300 -104154 92938 73572 -40932 58475 111447 77518 -63756 91687 -319753 -238266
13220b38266l451h1931H0218N1733b18071M5395A28966m5612J80155A6655J73875
$$ -238266 -241717 -81931 80218 131951 -218071 -172676 128966 83354 263509 16655 190530
13209A90530j9872i8856E069M5220b12365C3364e2257D608P9276K12315A12548
$$ 190530 170658 -98856 5069 50289 -212365 33364 -52257 4608 83884 296199 112548
13197B97861A17426l689m1273P8199I964e200n5352q1420N4266B33401r4639a92533
$$ 297861 117426 113737 72464 150663 9964 -5200 -60552 -141972 -87706 233401 138762 -192533
13184A80439N4212J050K08845B5522d6322C5655b55561a20980c1201D7913g988
$$ 180439 234651 235701 444546 25522 -46322 35655 -255561 -120980 -31201 47913 -7988
13172B08384J58356j28707J2510F2020J2357Q378f3676A8782n774J77460o8597
$$ 208384 366740 238033 250543 62020 74377 82755 -63676 18782 13008 190468 121871
13161A21871O2360b74948f885A6088P6863C6102a90129I4230a79765C9976k791
$$ 121871 184231 -274948 -6885 16088 92951 36102 -190129 94230 -179765 39976 37185
13150C7185a00864B1646K0306K4453J87892i5524B53521p6462b67561G7728b33628
$$ 37185 -100864 21646 41952 66405 254297 -95524 253521 177059 -267561 77728 -233628
13138B1893K62454I0785K05785j44399P455j1702O320M8203q8641C5996c45459
$$ 21893 284347 90785 296570 152171 159626 147924 154244 202447 113806 35996 -345459
13126h3774A62386o8029c7741D5d69539A90229c37799C3397h0751B05503a45905
$$ -83774 162386 94357 -37741 45 -469539 190229 -337799 33397 -80751 205503 -145905
13114b33645C5451a66296E3251K45032o9886K4376g3093A78946m9962n3761E299
$$ -233645 35451 -166296 53251 298283 228397 252773 -73093 178946 128984 75223 5299
13102b8858r4086O0555b1241j22111l9155P4319p6478M9579n2284b0832m5951
$$ -28858 -122944 -62389 -21241 -143352 -182507 -108188 -184666 -135087 -187371 -20832 -66783
13091f6783A80480G602P2755C1707g1874J1713C86373g2599p3172M8239C03114
$$ -66783 180480 7602 80357 31707 -71874 -60161 386373 -72599 -145771 -97532 303114
13079A83330C8722A1816J29098k2558a0961m1978A96152r582i9427C70325B6286
$$ 183330 38722 11816 140914 118356 -10961 -52939 196152 186570 -99427 370325 26286
13067B46070b65335F3452a9160A07457R3495r4339P9490M5696l5710b0223j13055
$$ 246070 -265335 63452 -19160 107457 200952 106613 186103 231799 196089 -20223 -133278
13056a33278H0957N739J22745K8326p5985a39995e1022D1549L44960j2358i9863
$$ -133278 80957 86696 209441 237767 161782 -139995 -51022 41549 386509 374151 -99863
13044C17124a02709B7072K6517O0388Q2340e0907h897D2341a8370E5514O6369
$$ 317124 -102709 27072 53589 113977 196317 -50907 -8897 42341 -18370 55514 121883
13033A21883D2018M9639a15122N4717C40375h6451B48501m1579b2553G5530J0954
$$ 121883 42018 91657 -115122 -60405 340375 -86451 248501 206922 -22553 75530 86484
13022H6484e2363j07063B0899L46633a38825A15769n6865O5821a5744l9611B01288
$$ 86484 -52363 -159426 20899 367532 -138825 115769 58904 124725 -15744 -55355 201288
13010f3844j01250M8791B19650I6999m5263J85755b7827p5059M548B68372c30569
$$ -63844 -165094 -116303 219650 96999 51736 237491 -27827 -102886 -98338 268372 -330569
12998E0047K6748L17317a09167A27077b0779m0574o9030A56006b38932B01115
$$ 50047 76795 394112 -109167 127077 -20779 -61353 -130383 156006 -238932 201115
12987A95508b05939j38347B390a9400F5774J61373Q772b20529B02048i7965j49733
$$ 195508 -205939 -344286 2390 -19400 65774 227147 235919 -220529 202048 -97965 -247698
12976b47698A46663g6222L7569j59653C31662a01312C48780E0036B4476a08372
$$ -247698 146663 -76222 -38653 -198306 331662 -101312 348780 50036 24476 -108372
12965d0657j74333a9337k05242D26903b47645B98610a86452P8322C61968d09202
$$ -40657 -214990 -19337 -224579 426903 -247645 298610 -186452 -108130 361968 -409202
12954c67504d1752G9356a32587A80440a53467B30492M0959c0166F2475L3361c7596
$$ -367504 -41752 79356 -132587 180440 -153467 230492 271451 -30166 62475 95836 -37596
12942B70074c78165D8680J39024L3469c0637F6002b2478j22261D7368K22103e658
$$ 270074 -378165 48680 187704 221173 -30637 66002 -22478 -144739 47368 269471 -5658
12930A62207Q5180j14546n9514g4271C12420a43443d5461E6600g53959A58286
$$ 162207 247387 132841 73327 -74271 312420 -143443 -45461 56600 -753959 158286
12919b29088A61289L1412g2892j3600j45936M2162G5530H963a4619k29814B296
$$ -229088 161289 192701 -72892 -86492 -232428 -190266 75530 8963 -14619 -244433 2296
12907C662K11971e2681F1177a30262A89341B4533J27379c7540A30582a05043k6344
$$ 3662 215633 -52681 61177 -130262 189341 24533 151912 -37540 130582 -105043 -131387
12896a31387G4644g3639B90989b6547o5763k07140g4657j25445A07211a2158E8142
$$ -131387 74644 -73639 290989 -26547 -92310 -299450 -74657 -200102 107211 -12158 58142
12884A93610b19272C8910a10559a8967A2906L871c942k48404A25631B1522f3905
$$ 193610 -219272 38910 -110559 -18967 12906 16777 -3942 -252346 125631 21522 -63905
12872E0698a10456K7454A24984J8946e4383k7804A52997F6446J07194R9104a5801
$$ 50698 -110456 -83002 124984 143930 -54383 -82187 152997 66446 173640 272744 -15801
12860b09603j7196J12880A35777a7386B77322a77788N9102c666F0387K64953d54852
$$ -209603 -226799 -113919 135777 -17386 277322 -177788 -118686 -3666 60387 325340 -454852
12848A1049J76111d6051C28965E6675Q1838P7183N341c21585J05961F6533l1564
$$ 11049 187160 -46051 328965 56675 138513 215696 221037 -321585 -215624 66533 34969
12837C4969a02793J1606C00824j41413J1029l9419k6691d40504a63136a2076p3886
$$ 34969 -102793 -91187 300824 159411 170440 131021 104330 -440504 -163136 -12076 -85962
12826h5962p5259B7308P1152a5194j3580I5682a31509I8540J6554n7081k0562
$$ -85962 -161221 27308 98460 -15194 -28774 95682 -131509 98540 115094 58013 37451
12815C7451a31881D8130e7280I698J42732d3778E9789c9323B45236a26983j26226
$$ 37451 -131881 48130 -57280 9698 152430 -43778 59789 -39323 245236 -126983 -253209
12804b53209g1397k79923a46271H507g4358B81010A6212b53776o0483i9168j07551
$$ -253209 -71397 -351320 -146271 8507 -74358 281010 16212 -253776 -314259 -99168 -206719
12793b06719I6272i9177G1902M0747c3948E4454K23283b65798a23050j39080o9748
$$ -206719 96272 -99177 71902 112649 -33948 54454 277737 -265798 -123050 -262130 -331878
12782c31878Q1031g4642D09475A42417d48523B5053K48726i0964a7506A39181
$$ -331878 -250847 -74642 409475 142417 -448523 25053 273779 -90964 -17506 139181
12771A21999J62144E4300a8332A18668E4765a11558G8303J55863b36313D7850
$$ 121999 284143 54300 -18332 118668 54765 -111558 78303 234166 -236313 47850
12760B28048J05465C8216a17252m8883c0918A7330N7734d7790D0621J09491o0700
$$ 228048 333513 38216 -117252 -166135 -30918 17330 75064 -47790 40621 150112 89412
12749H9412B6973J41265M0042h4170C61564p2111c2026j26496A36094J52080m4345
$$ 89412 26973 168238 208280 -84170 361564 289453 -32026 -158522 136094 288174 243829
12738B43829D7554K41129c47224E2699K20644i1356F9624Q1123b4355p639j59345
$$ 243829 47554 288683 -347224 52699 273343 -91356 69624 150747 -24355 -31994 -191339
12727a91339B20455A0820L60728g9755j68553A24229a56226N6734n4693j78065
$$ -191339 220455 10820 371548 -79755 -248308 124229 -156226 -99492 -154185 -332250
12717c32250A91898a30889j07801j16585F2974d69504B98244A18376M6163q2167
$$ -332250 191898 -130889 -238690 -355275 62974 -469504 298244 118376 164539 82372
12707H2372L06383d5065D14428H104L00180m9659D9536c2934A19836i3443B23664
$$ 82372 388755 -45065 414428 8104 308284 258625 49536 -32934 119836 -93443 223664
12695c83893d4022A61468A9176K5295a91646B7720f5015k99743A68800H0085J17471
$$ -383893 -44022 161468 19176 44471 -191646 27720 -65015 -364758 168800 80085 197556
12684A97556d35501E9852J20350O1218J40195o1262d1027D9966J07255e749q4457
$$ 197556 -435501 59852 180202 241420 381615 320353 -41027 49966 157221 -5749 -90206
12673i0206L3510D23384k11628b56337A12928p611J46150a25057B8727b32706
$$ -90206 -56696 423384 211756 -256337 112928 105317 251467 -125057 28727 -232706
12662C74012A79797g554B81329A16764i9874B49520A16735J20864A01280D6327
$$ 374012 179797 -7554 281329 116764 -99874 249520 116735 237599 101280 46327
12651B09587a07809A04522g0043C57052e2656A41838j8136A7306K37239g0460
$$ 209587 -107809 104522 -70043 357052 -52656 141838 123702 17306 254545 -70460
12640D1870O2129P0971E1271K4466J37684m9161a64772O5856c8146a4481D33828
$$ 41870 103999 174970 51271 75737 213421 164260 -164772 -98916 -38146 -14481 433828
12628B34743J95128j76891O3573d9588B07937A8676J03529Q5806L8988b84929
$$ 234743 429871 252980 316553 -49588 207937 18676 122205 208011 246999 -284929
12617f3254I4745J16461f6205m20246C912b46634A66987C9322K57738p1473L7509
$$ -63254 94745 211206 -66205 -486451 3912 -246634 166987 39322 297060 225587 263096
12606B63096b17071L7265j46889A0308K18801f9781l6169E5521K4726L8858c7621
$$ 263096 -217071 -179806 -326695 10308 229109 -69781 -105950 55521 80247 119105 -37621
12594B01895E0240J76744a22343d2754B37982a33329l17349e4601q2847B72955
$$ 201895 50240 226984 -122343 -42754 237982 -133329 -450678 -54601 -137448 272955
12583B23632b58035A4271c6003B99215d71526a20299k4649B85125j26180a56712
$$ 223632 -258035 14271 -36003 299215 -471526 -120299 -144948 285125 158945 -156712
12572a18268c00m20809g1937l8159A57658b01130A46639n8742J52452m5225j5517
$$ -118268 -300 -421109 -71937 -110096 157658 -201130 146639 87897 240349 195124 179607
12561A79607f5256A92417K95862b76725B32387A10848D1902a7920l7299B17054
$$ 179607 -65256 192417 488279 -276725 232387 110848 41902 -17920 -55219 217054
12550B58031a77798A73942o4611c32523A17757f7933A61983B6502a78457n7649
$$ 258031 -177798 173942 109331 -332523 117757 -67933 161983 26502 -178457 -236106
12540b36106A10453m7484a168F704g4088m3759d2457l0566j7616C3460J64922
$$ -236106 110453 62969 -1168 6704 -74088 -117847 -42457 -73023 -90639 33460 198382
12529A98382a69673A32933b06773A03929A7542L01021i6010Q32A45785a43592
$$ 198382 -169673 132933 -206773 103929 17542 318563 -96010 -95178 145785 -143592
12518a57634N485A78128F6887i9381b1367m5449j93992B4964f9729j1033j16109
$$ -157634 -152149 178128 66887 -99381 -21367 -66816 -260808 24964 -69729 -80762 -196871
12507a96871N623N282A44052L2723G8197N8975D524b23136a7101B58717P785B6770
$$ -196871 -191248 -185966 144052 176775 78197 137172 4524 -223136 -17101 258717 266502 26770
12494E8764a76270b848m00898F8955M4071i1531B17105e689C7636M9668L26445
$$ 58764 -176270 -2848 -403746 68955 113026 -91531 217105 -5689 37636 87304 413749
12483D13749A56933c82810a01826G0458b28717Q2974E2324J4770d83491A7002
$$ 413749 156933 -382810 -101826 70458 -228717 -145743 52324 67094 -483491 17002
12472a66536C06132A40046e4546p7268n059D9536a90479e2763B24476h7077b7527
$$ -166536 306132 140046 -54546 -131814 -136873 49536 -190479 -52763 224476 -87077 -27527
12460B59174h6193H2118A3887b68292a31875e7204q9877j78017a39576A96105
$$ 259174 -86193 82118 13887 -268292 -131875 -57204 -147081 -325098 -139576 196105
12449b15064g7321K0555j31389N4180B9003q030h4184K7677C83915A82294c88655
$$ -215064 -77321 -56766 -188155 -133975 29003 20973 -84184 -56507 383915 182294 -388655
12437a48056D1067a62163F844M3863a18054j20420A60975B883J82703K5879n3912
$$ -148056 41067 -162163 6844 50707 -118054 -238474 160975 2883 185586 211465 157553
12426A57553o7356R2957e8951j15741b345A02836l9405a92630c0802J2011j73869
$$ 157553 90197 183154 -58951 -174692 -2345 102836 63431 -192630 -30802 -18791 -192660
12415a92660A92047a63092F4500J77965d8777I5544a35816f3405k5969B775b2657
$$ -192660 192047 -163092 64500 242465 -48777 95544 -135816 -63405 -89374 2775 -22657
12403f8920F5376e9585j87405F4893a80425L9420G0339K16394n2455b4471l699
$$ -68920 65376 -59585 -246990 64893 -180425 -141005 70339 286733 234278 -24471 -28170
12392b8170E1785i7283o5054A97284r0342J12144a58464M0844H089J4641a38959
$$ -28170 51785 -97283 -162337 197284 106942 219086 -158464 -117620 8089 22730 -138959
12380h1462b4419A5625P442D905J41927h4814j4641A03461L4446a63126g1608
$$ -81462 -24419 15625 23067 4905 146832 -84814 -99455 103461 137907 -163126 -71608
12368b1312F1240O9432a4396j00247B5553a36986j70009A57666f9921C6236K7434
$$ -21312 61240 130672 -14396 -114643 25553 -136986 -306995 157666 -69921 36236 63670
12357F3670g6242A92461D225R9914N8606B9755e4186j92167g5882B06603b33181
$$ 63670 -76242 192461 4225 104139 162745 29755 -54186 -246353 -75882 206603 -233181
12345D03277b92508P654a3119B42632d21764c948B2763r21L17681A31484g8553
$$ 403277 -292508 -284854 -13119 242632 -421764 -3948 22763 21842 339523 131484 -78553
12333g9435M218b1053j35285k37918A31181c35060F6020B7434N4239a58684k00006
$$ -79435 -75217 -21053 -156338 -394256 131181 -335060 66020 27434 81673 -158684 -358690
12322c58690A13224a9540j26568j853A65882b29869R2270a5900l46481G5184P189
$$ -358690 113224 -19540 -146108 -147961 165882 -229869 -137599 -15900 -362381 75184 82373
12311H2373J17821K23008k07083b34446B6328J64127E6916p731b90756G1950a53364
$$ 82373 200194 423202 216119 -234446 26328 190455 56916 49185 -290756 71950 -153364
12299f6077j4424B98478a0773A01872h869k76731B79780A18752O5199G7336O435
$$ -66077 -80501 298478 -10773 101872 -8869 -285600 279780 118752 183951 77336 83771
12288H3771J12516E8446k3551K88088b7265B831L69953A81756n5596E5774K08542
$$ 83771 196287 58446 34895 322983 -27265 2831 372784 181756 126160 55774 264316
12277B64316c23264A2870b2503C89372j62453o5593J00912p4651a39240a316C0981
$$ 264316 -323264 12870 -22503 389372 226919 161326 262238 187587 -139240 -1316 30981
12265A57695k6432m519b3726B47174a0471k51902C23229A370a29239A7907K96578
$$ 157695 131263 126744 -23726 247174 -10471 -262373 323229 1370 -129239 17907 314485
12254C14485K0141a5981C39407a5851C27770J47072A57026K03435a14319I6160
$$ 314485 334626 -15981 339407 -15851 327770 474842 157026 360461 -114319 96160
12243A08403c9601J256j99468A19078K46698A28728o643i0454F8277K56910q3562
$$ 108403 -39601 -38345 -237813 119078 365776 128728 122085 -90454 68277 325187 241625
12232B41625f6008D68804B06739m3491D006L51339j41209I2930J06733Q5384f2534
$$ 241625 -66008 468804 206739 163248 4006 355345 214136 92930 199663 285047 -62534
12220A94229r716K40848D3527j00k1608J36277L438J46781A08181b30166E38344
$$ 194229 184513 425361 43527 43427 21819 158096 161534 308315 108181 -230166 538344
12208A0961K26602e0807C58454A64914J79636j53801p0258e1217A07319d26769
$$ 10961 237563 -50807 358454 164914 344550 190749 120491 -51217 107319 -426769
12197B30282K18930j89489G9587B5613Q3455h6768L8501A35291a5696C18331A41496
$$ 230282 449212 259723 79587 25613 109068 -86768 -48267 135291 -15696 318331 141496
12185G6026C7548Q8605A3673b08849Q9273A00581a7000A98971d075j90171A43691
$$ 76026 37548 126153 13673 -208849 -119576 100581 -17000 198971 -4075 -194246 143691
12173B09779R7655F5199M8880b4804A79945C0072K18412k2780b55492A86172e248
$$ 209779 307434 65199 114079 -24804 179945 30072 248484 225704 -255492 186172 -5248
12161A59871N1141E5937j6889d7971j07817E3693J19444b88893H394J95113q1114
$$ 159871 211012 55937 39048 -47971 -155788 53693 173137 -288893 8394 203507 122393
12150A22393a34740A02497D1545K79546d2128j78057B54089b29883h3677J1953
$$ 122393 -134740 102497 41545 321091 -42128 -220185 254089 -229883 -83677 -71724
12140g1724C10012a6167k4340H7912a7298E9484h3382K8019A62037J94343F1192
$$ -71724 310012 -16167 -40507 87912 -17298 59484 -83382 -55363 162037 356380 61192
12128g9424B11968a96153j3458b8956m7496B24960b67604A33686c37015b8796
$$ -79424 211968 -196153 -209611 -28956 -76452 224960 -267604 133686 -337015 -28796
12117B17585B727d5174A5357a25240B7681a76227B44959E4422J54107f1229B9385
$$ 217585 2727 -45174 15357 -125240 27681 -176227 244959 54422 208529 -61229 29385
12105b08952B2626J3722a96111j76562J47586A25334a05294L3244c4150B00394
$$ -208952 22626 36348 -196111 -372673 -225087 125334 -105294 -72050 -34150 200394
12094f9142k62620f6622j17778C38359d2191r81H6623b84065B37854b19250B40385
$$ -69142 -331762 -66622 -184400 338359 -42191 -43172 86623 -284065 237854 -219250 240385
12082A95983b78662a19980F5577L02832k8977N71360J246928E34290B54285F0279
$$ 195983 -278662 -119980 65577 368409 339432 910792 2157720 534290 254285 60279
12071g8865c7268o3472A11363J59293J5173F3497Q6424i7970A9003b2972q8217
$$ -78865 -37268 -100740 111363 270656 285829 63497 149921 -97970 19003 -22972 -111189
12060a11189B07687a4439k27248H5128c0867A499a10171k63407A32761a54360
$$ -111189 207687 -14439 -241687 85128 -30867 1499 -110171 -373578 132761 -154360
12049b8880F781L4084L0587i5856G7830a30808B26614o8000e5587j28920A68161
$$ -28880 6781 40865 71452 -95856 77830 -130808 226614 158614 -55587 -184507 168161
12037a06681A09630a05302A02642P1526f0999l7176j15502G5875C0146c6037n5355
$$ -106681 109630 -105302 102642 174168 -60999 -98175 -213677 75875 30146 -36037 -91392
12026i1392A90050b11341C15814j47850n8676K8364E8181K0966K66544A49462
$$ -91392 190050 -211341 315814 167964 109288 137652 58181 79147 345691 149462
12015a64455j90140B0617i8425j26239A33279h1207B72644A16540B9997a6585
$$ -164455 -354595 20617 -98425 -224664 133279 -81207 272644 116540 29997 -16585
12004h494j9581o0161A63016b93309g6141j45882A80928P5044p0264b81221B95738
$$ -8494 -28075 -88236 163016 -293309 -76141 -222023 180928 255972 185708 -281221 295738
11992i7911q4511p3544B05672b4592l4841A60042R2532c29386h8885r0057C2869
$$ -97911 -182422 -255966 205672 -24592 -59433 160042 252574 -329386 -88885 -178942 32869
11980b24686a5053k52189B6278K24851D8431K63344h5567H3037d0285B07910h8985
$$ -224686 -15053 -267242 26278 251129 48431 311775 -85567 83037 -40285 207910 -88985
11968A94943A3439d6672D36735j01731j34442b31980D7619L9423K09792j28552
$$ 194943 13439 -46672 436735 335004 200562 -231980 47619 87042 296834 168282
11958A68282G9313k2486a57936E2610b807k84759A11072l5762b29369a08028j53972
$$ 168282 79313 56827 -157936 52610 -2807 -287566 111072 75310 -229369 -108028 -262000
11947b62000F4539j8223A060J70527J2973i2041b7558B10256m2263F3906b55445
$$ -262000 64539 46316 1060 171587 184560 -92041 -27558 210256 167993 63906 -255445
11935B0427a50030q3477H852L90820A87418h7536j95031B4556a05267E07928c25595
$$ 20427 -150030 -233507 8852 399672 187418 -87536 -282567 24556 -105267 507928 -325595
11923A1571c18747c0913j40559g4049o8222A22708a27926d330D4703a59716j74034
$$ 11571 -318747 -30913 -171472 -74049 -142271 122708 -127926 -4330 44703 -159716 -333750
11912c33750J1531B6511J79813C2380b86726B2890g9226j96324E5787P0292a28004
$$ -333750 -322219 26511 206324 32380 -286726 22890 -79226 -275550 55787 126079 -128004
11900a19020a4114k49443E4317J46352a94227G4772b1542l16395a46360C8810
$$ -119020 -14114 -263557 54317 200669 -194227 74772 -21542 -337937 -146360 38810
11889a28971o5023e7268A57992b07357A78521K4936E5413b22637a08601q1080
$$ -128971 -193994 -57268 157992 -207357 178521 203457 55413 -222637 -108601 -189681
11879a89681j02808F4804c84795J22329f7262b1960H6819d26274A679c93047E8807
$$ -189681 -292489 64804 -384795 -262466 -67262 -21960 86819 -426274 1679 -393047 58807
11867i8303G3467K7301Q3563a82788A9431d7891F9689a54795J9875I1400g3750
$$ -98303 73467 100768 184331 -182788 19431 -47891 69689 -154795 -134920 91400 -73750
11855b30245H0796i6680I0782h5854k68294O8020a26012j61766g4080B3384b75698
$$ -230245 80796 -96680 90782 -85854 -354148 -286128 -126012 -287778 -74080 23384 -275698
11843d59930A26840b60379A69265a72586Q2800r5613N2920G34J46180a58794A19547
$$ -459930 126840 -260379 169265 -172586 -89786 -185399 -132479 734 146914 -158794 119547
11831a8437p6344j6963j20687R0969k80107H6335a51394b8090l63640a57175b9837
$$ -18437 -94781 -111744 -232431 -141462 -421569 86335 -151394 -28090 -391730 -157175 -29837
11819I0138c85306B31485a15955A72260f3876k67632G7500g3790m87677a15385
$$ 90138 -385306 231485 -115955 172260 -63876 -331508 77500 -73790 -561467 -115385
11808A02812a81725h6975j07510G4120l0121c3076j92223j06564e4878K2155o7938
$$ 102812 -181725 -86975 -194485 74120 43999 -33076 -225299 -331863 -54878 -32723 -100661
11797a00661n9813I935a78376I6388l1960b02768c8799k38190A85492J52423D9537
$$ -100661 -160474 9935 -178376 96388 64428 -202768 -38799 -276989 185492 337915 49537
11785A3585a53514j02731I1317a78908C6760d0948A34469F1078a76334A45162
$$ 13585 -153514 -256245 91317 -178908 36760 -40948 134469 61078 -176334 145162
11774d4369j60045f4085j86215c8506B58116A27061a5255o4574k27161J36697
$$ -44369 -204414 -64085 -250300 -38506 258116 127061 -15255 -79829 -306990 -170293
11764a70293M1825A70705b1549l8958k26367H5388c19335a57252A08914a74378
$$ -170293 -128468 170705 -21549 -60507 -286874 85388 -319335 -157252 108914 -174378
11753F2030N0968a42868C39194e0586j7953o4276A0892L5746K1716b94060A5945
$$ 62030 112998 -142868 339194 -50586 -68539 -132815 10892 46638 68354 -294060 15945
11741a6851k1432C46465m9189J13647a17126B6312a34454A04428J1474A7969d9101
$$ -16851 -38283 346465 297276 410923 -117126 26312 -134454 104428 115902 17969 -49101
11729b37018A80296a96573A56942D3051Q8001a97189C4643j0564L21691H6375
$$ -237018 180296 -196573 156942 43051 131052 -197189 34643 24079 345770 86375
11718b32388C41721B8398a78429f9815A89710i8761q8512B62829M8590a73907
$$ -232388 341721 28398 -178429 -69815 189710 -98761 -187273 262829 311419 -173907
11707d0549q1522A95442a7455C12632A06623N7528C9529J81478a08061C26275
$$ -40549 -122071 195442 -17455 312632 106623 164151 39529 221007 -108061 326275
11696A49236A7733a85356B52247b09315A13147O126P0456b42906C4533L9105b28878
$$ 149236 17733 -185356 252247 -209315 113147 119273 189729 -242906 34533 73638 -228878
11684F6166A9335a71932b373B48010A18180c71231B9728J0448J351J72773j06756
$$ 66166 19335 -171932 -2373 248010 118180 -371231 29728 40176 41527 214300 107544
11673A07544C945b71454F67115A04074c1510A02515L2071h6356B91018i2653A23011
$$ 107544 3945 -271454 667115 104074 -31510 102515 134586 -86356 291018 -92653 123011
11661D78711b99432F9000c06126B37121i2888A70905e9617A77661f184C0679N120
$$ 478711 -299432 69000 -306126 237121 -92888 170905 -59617 177661 -6184 30679 35799
11650C5799J34322c56249A24098g1069L4947B16355a0707B0145a68741C09844
$$ 35799 170121 -356249 124098 -71069 -36122 216355 -10707 20145 -168741 309844
11639c8054n4816A02494d1579m23597B92645c0469j65251k1897G6909N7216m10
$$ -38054 -92870 102494 -41579 -465176 292645 -30469 -195720 -217617 76909 134125 133715
11628A33715M54J21729I5473K06909A5041K6037a14685k4785G8361a58380M4827
$$ 133715 134169 255898 95473 302382 15041 41078 -114685 -139470 78361 -158380 -113553
11617a13553k73691d2660B06740j01145a79893G765J42555b6626A7706a38527
$$ -113553 -387244 -42660 206740 105595 -179893 7765 150320 -26626 17706 -138527
11606a4071A48407a88895a1103E7366R9270a30427j1025B04193q2050C2062J37402
$$ -14071 148407 -188895 -11103 57366 156636 -130427 -141452 204193 122143 32062 169464
11595A69464G113e0720C18976b1077B49283I1349L67700D4613J08932J21312a20452
$$ 169464 7113 -50720 318976 -21077 249283 91349 459049 44613 153545 274857 -120452
11583B0703K6477a18950j85573B6459a4169A58968a08040A5539K53286J20859
$$ 20703 47180 -118950 -304523 26459 -14169 158968 -108040 15539 268825 389684
11573C89684A60086D5278c51166C50051e4493B7667N0477K08858j03580a20905
$$ 389684 160086 45278 -351166 350051 -54493 27667 78144 287002 183422 -120905
11562D6332J89609K01402C4745A2913a03648j97752G0420a91889e8482j50957
$$ 46332 235941 437343 34745 12913 -103648 -301400 70420 -191889 -58482 -209439
11552b09439B74436A9585M5975K06914C3324J56514L3445a55294F0648J30948
$$ -209439 274436 19585 65560 272474 33324 189838 223283 -155294 60648 191596
11542A91596J74398b4442a110B30886K78875c3975G3549K79757h5078B20213h6884
$$ 191596 365994 -24442 -1110 230886 509761 -33975 73549 353306 -85078 220213 -86884
11530H5413J53195K25667D1379J13231j6042I766J35216a83155A91531G9701L871
$$ 85413 238608 464275 41379 154610 138568 9766 144982 -183155 191531 79701 83572
11519H3572J32475H9480M2970e5879j23323B35101A17064J52287c0168j70240
$$ 83572 216047 89480 132450 -55879 -179202 235101 117064 269351 -30168 -200408
11509b00408D5352L67415j95013j05909J56603F3155J22651B6001M15494G8984
$$ -200408 45352 412767 217754 111845 268448 63155 185806 26001 441495 78984
11498A22500m2074N0311C3916M2203a61478d7717k3085J5198f260B73033d3566
$$ 122500 80426 130737 33916 76119 -161478 -47717 -70802 -55604 -6260 273033 -43566
11486C7403L7965K14982a01504K3241j03460d7082C68904D992J76461p777b2006
$$ 37403 75368 290350 -101504 -78263 -181723 -47082 368904 4992 181453 173676 -22006
11474B30381r2733K32912j48256A04335l8813a14886A29003J76625b2716j23432
$$ 230381 137648 370560 222304 104335 65522 -114886 129003 305628 -22716 -146148
11464a46148M3608A27603J67896J13240A24717J93299H7221n550j9913p086P6283
$$ -146148 -102540 127603 295499 408739 124717 318016 87221 81671 61758 54672 130955
11453A30955K25958E8398K543c10035A42156o7584Q9092M475o6353K14188A1659
$$ 130955 356913 58398 60941 -310035 142156 74572 163664 168139 101786 315974 11659
11441c42582L7271R6177P0608B13216B7618j146K1748a46503c6311k223j29937
$$ -342582 -305311 -209134 -138526 213216 27618 26472 48220 -146503 -36311 -38534 -168471
11430a68471A10498b0323j50946b6713P683E0847R2186b1333B6543b79363A32230
$$ -168471 110498 -20323 -171269 -26713 -19030 50847 143033 -21333 26543 -279363 132230
11418e0753A92864D557P4642k7701J1173a33531k3113q9104d9168k40339h4525
$$ -50753 192864 4557 79199 51498 62671 -133531 -156644 -245748 -49168 -289507 -84525
11406f244k40216D1655Q0777J47511n1688q9476A6964b07234B43450r4218c1471
$$ -6244 -246460 41655 122432 269943 218255 128779 16964 -207234 243450 149232 -31471
11394A72271J24260b16846B53624I0577B3064a41395j56124G0913e5453m2523
$$ 172271 296531 -216846 253624 90577 23064 -141395 -297519 70913 -55453 -97976
11384i7976J1129a8275r1483A73004O1348j11108K0056Q5278J13867A41128E1427
$$ -97976 -86847 -18275 -109758 173004 234352 123244 143300 228578 342445 141128 51427
11372e5187B65125c46167h5129A35719d9515B40091m9445a68011F0148K52174
$$ -55187 265125 -346167 -85129 135719 -49515 240091 190646 -168011 60148 312322
11362C12322h6152j22906a711m2794C9490b06761B20575o018A7771b1708q5858
$$ 312322 -86152 -209058 -1711 -44505 39490 -206761 220575 214557 17771 -21708 -107566
11351a07566l34423a23313B64960j27339b1262E8200A0887a42104A78551E3625
$$ -107566 -441989 -123313 264960 137621 -21262 58200 10887 -142104 178551 53625
11340A77573a89266B8270a42640j38088D6768j9870a82005A66617a68427L3630
$$ 177573 -189266 28270 -142640 -280728 46768 26898 -182005 166617 -168427 -134797
11330a34797J2539H7162k2022P5477a13388A80042b13649g9115A69221J80234
$$ -134797 -122258 87162 65140 140617 -113388 180042 -213649 -79115 169221 349455
11320C49455j58783H0419k0194J27310a04530M959E5356P6507e4712I1336J17999
$$ 349455 190672 80419 60225 187535 -104530 -99571 55356 131863 -54712 91336 209335
11309B09335B3727a12632j3917e0255C64636a76461a3145B13370a69038k5578
$$ 209335 23727 -112632 -126549 -50255 364636 -176461 -13145 213370 -169038 -194616
11299a94616j63474B90295B538J25822F0120b2899I8227M8771E2901J43598i1769
$$ -194616 -358090 290295 2538 128360 60120 -22899 98227 146998 52901 196499 -91769
11287e5886A25804r662a06096A1262a40385k10078a07325B2510b40826D3745A9792
$$ -55886 125804 116142 -106096 11262 -140385 -350463 -107325 22510 -240826 43745 19792
11275e67477b5069j90684D8330J4135P3152f5658l26821f3001A46264L31499E5787
$$ -567477 -25069 -215753 48330 62465 135617 -65658 -392479 -63001 146264 477763 55787
11263A77017a43592e7120A48584f2454j24975C8260J67164d11712B11564b25499
$$ 177017 -143592 -57120 148584 -62454 -187429 38260 205424 -411712 211564 -225499
11252A55296c1268r4564m5605H5060d51291A14811J45214e2919j17981B67544
$$ 155296 -31268 -125832 -171437 85060 -451291 114811 260025 -52919 -170900 267544
11241C30412b18860A93252c84945A23912J78168G0990N9724A0117N1072i6006
$$ 330412 -218860 193252 -384945 123912 302080 70990 130714 10117 61189 -96006
11230d9840M63l0305a5173B0147E172K1874e9212q6255G7937C629h2489C4705
$$ -49840 -49377 -79682 -15173 20147 5172 27046 -59212 -145467 77937 3629 -82489 34705
11217a83911A47240a03889L9643B41569A15871c67716H875c26300M7159E7286
$$ -183911 147240 -103889 -64246 241569 115871 -367716 8875 -326300 -279141 57286
11206A55040b28258L8716i2460G5245A951b94073g4622B30720h2882C14228c23384
$$ 155040 -228258 -189542 -92460 75245 1951 -294073 -74622 230720 -82882 314228 -323384
11194a55005j42178f8619A03814J83493c05048a15003A17084b65330M769N3156
$$ -155005 -297183 -68619 103814 287307 -305048 -115003 117084 -265330 -260561 -207405
11184b07405O102K1861p0817D1155k0065O5892b99464A51833i8562B7098c6288
$$ -207405 -201303 -179442 -250259 41155 21090 86982 -299464 151833 -98562 27098 -36288
11172f9387A69185J25776b17016A59042a64804B28650C4326a55193d1144A34267
$$ -69387 169185 294961 -217016 159042 -164804 228650 34326 -155193 -41144 134267
11161E0395a63662A45148c06862J00942C44908c23679P3629l552B86246a4049
$$ 50395 -163662 145148 -306862 -205920 344908 -323679 -250050 -253602 286246 -14049
11150B6859c4088m7162o6268L0612F3280b21442A03959a97249k49476A29324a29654
$$ 26859 -34088 -81250 -147518 -116906 63280 -221442 103959 -197249 -446725 129324 -129654
11138b15213g4448C61470h2293B41358a46430a8637D7533L6202m625M9882J08764
$$ -215213 -74448 361470 -82293 241358 -146430 -18637 47533 83735 79110 128992 237756
11127B37756F9681b206k07566B29321R7216A0688J66681f7989A85349J32959b8921
$$ 237756 69681 -2206 -209772 229321 326537 10688 177369 -67989 185349 318308 -28921
11115g4125R882b9956p7690A5705P8495d3965D49055F8538Q996K77768r9225a29168
$$ -74125 -64243 -29956 -107646 15705 94200 -43965 449055 68538 77534 355302 256077 -129168
11102B77465G1781J61824h5200B28133p4699E9347L26515I7204a96325A52885
$$ 277465 71781 233605 -85200 228133 153434 59347 385862 97204 -196325 152885
11091a41056D17259g1842A17167M8575O1715r9096i070C86893a5327C52808j19953
$$ -141056 417259 -71842 117167 165742 227457 128361 -9070 386893 -15327 352808 232855
11080B32855O8875a10757B12918j00180j0082J72289A30344m9778J44538P1031
$$ 232855 301730 -110757 212918 112738 102656 274945 130344 80566 225104 296135
11070B96135K39960j7287A59258K2553J93717K84075k19753A52225L99195p4179
$$ 296135 536095 518808 159258 181811 375528 659603 439850 152225 551420 477241
11060D77241l0513J81670k70653J10468K05102B40384L74771C00696L50663q4342
$$ 477241 446728 628398 357745 468213 673315 240384 615155 300696 651359 567017
11050E67017o2293K09145q7094k14266n8914M31558j20626l22505L29438j44329
$$ 567017 504724 713869 626775 412509 353595 785153 664527 342022 671460 527131
11040E27131k50945K53696O5462B66302L22150j24155O6560K46564l24657J23816
$$ 527131 276186 529882 595344 266302 588452 464297 530857 777421 452764 576580
11030E76580k3538K37285q563j57946j17109O9483J61200j43371j72150q3500
$$ 576580 553042 790327 781764 623818 506709 576192 737392 594021 421871 338371
11020C38371J83958l6586J12454j85452J55641G1795N17482J74002l16167l3424
$$ 338371 522329 485743 598197 412745 568386 71795 589277 763279 447112 413688
11010D13688J24259j13222Q9895J04437M3064B92414L74006J95446k29864n062
$$ 413688 537947 424725 514620 619057 662121 292414 666420 861866 632002 626940
11000F26940p0893K66126j74565o6229r7407L46280k24006k85928O48021o0788
$$ 626940 556047 822173 647608 581379 483972 830252 606246 320318 968339 907551
10990I07551C89226J39633J01294J80400J42270m7877J05659k02626K37943K5355
$$ 907551 389226 528859 630153 810553 952823 904946 1010605 807979 1045922 1071277
10980A071277l19174L23942J83954m4452L74885l7266L00634P5310J89326O9632
$$ 1071277 752103 1076045 1259999 1215547 1590432 1553166 1853800 1929110 2118436 2188068
10970B188068j32283L73314j29434n82947m2211K15465l68039m08081K87312L46163
$$ 2188068 2055785 2429099 2299665 1716718 1674507 1889972 1521933 1113852 1401164 1747327
10960A747327j365R1628j17119j86191K38650j65931o3401J3748k39664j18274
$$ 1747327 1745962 1837590 1720471 1534280 1772930 1606999 1543598 1557346 1317682 1199408
10950A199408n02343n539k3492l28528R9681A97998M54513k24467A10542K13448
$$ 1199408 697065 691526 668034 339506 439187 197998 652511 428044 110542 323990
10940C23990a51771A75883j0515E7402J91878g1306B7001J48030G5930K21889
$$ 323990 -151771 175883 165368 57402 249280 -71306 27001 175031 75930 297819
10930B97819q4650F4769b48670H531J02967c72836h7209F1697N4642c046n6492
$$ 297819 213169 64769 -248670 8531 111498 -372836 -87209 61697 116339 -3046 -59538
10919e9538I4950a12249d2933A40630n3465c06802a10754B35985q5001c1033A60145
$$ -59538 94950 -112249 -42933 140630 87165 -306802 -110754 235985 150984 -31033 160145
10907C59302d9037j14453k9411B73636d69762a79402g0492m39768a27928o4698
$$ 359302 -49037 -163490 -192901 273636 -469762 -179402 -70492 -510260 -127928 -192626
10897a92626H6452b44307O4185A26097i9127j58372A38114b05511C41095e2074
$$ -192626 86452 -244307 -180122 126097 -99127 -257499 138114 -205511 341095 -52074
10886b1771E573e2173E02489a66146l2106B9216J18480R2545a27545B36856a42891
$$ -21771 5573 -52173 502489 -166146 -198252 29216 147696 240241 -127545 236856 -142891
10874H1190L20055n1405b40124E8611K6733a15846a5690f347G6838b21860A01201
$$ 81190 401245 349840 -240124 58611 85344 -115846 -15690 -6347 76838 -221860 101201
10862A35764b36530f0732b9230l8499j49298C33379a3387A40199B9378j2836P3890
$$ 135764 -236530 -60732 -29230 -67729 -217027 333379 -13387 140199 29378 16542 90432
10851I0432J99870q7037b13470R5140A79773o5502i6473l1916C4700J76014b1601
$$ 90432 290302 203265 -213470 -118330 179773 114271 -96473 -128389 34700 210714 -21601
10839f1065l1792l16948d3766m5231a0620j77185m2708Q3422M5579o9313C29937
$$ -61065 -92857 -409805 -43766 -88997 -10620 -187805 -230513 -147091 -101512 -170825 329937
10827B11523q3315J93990c05182A98857e9282j95897I2272a85138e739n1675j7042
$$ 211523 128208 322198 -305182 198857 -59282 -255179 92272 -185138 -5739 -57414 -74456
10816g4456C9956A8396J03649f7877F7180b92879D0622a4019L484p2856E6170
$$ -74456 39956 18396 122045 -67877 67180 -292879 40622 -14019 -10535 -83391 56170
10804A10141e2107K2276D4273b37178K9004G0937e7036j76417h3708j40070f1117
$$ 110141 -52107 -29831 44273 -237178 -208174 70937 -57036 -233453 -83708 -223778 -61117
10792B9773b22327A98020p8816j2761a33102r7161A21786b05312q0190A2748d883
$$ 29773 -222327 198020 119204 106443 -133102 -230263 121786 -205312 -285502 12748 -4883
10780a35627q2784p460l507n1213D9164b21684A66946h49k34389Q9822A7067J1893
$$ -135627 -218411 -225871 -229378 -280591 49164 -221684 166946 -849 -235238 -145416 17067 28960
10768B8960O0790e5985a5417k19223R4737G7667f6333j03920m3295A54653a6198
$$ 28960 89750 -55985 -15417 -234640 -139903 77667 -66333 -170253 -213548 154653 -16198
10756b83091b9653q8613g340G8612C8972c180m29429J13321A88320A6204Q0935
$$ -283091 -29653 -118266 -7340 78612 38972 -3180 -432609 -319288 188320 16204 97139
10745I7139g3060f306k24843E3204a32303O1655j44824E236d9582K2891q8238
$$ 97139 -73060 -6306 -231149 53204 -132303 -70648 -215472 5236 -49582 -26691 -114929
10734a14929B33582r5385Q7243a22855L1709K0280C0724J0419a70727j90127A24989
$$ -114929 233582 138197 225440 -122855 -91146 -70866 30724 41143 -170727 -360854 124989
10722e00634G4230d03733a56093B708K83987b56444A41269N377e6431k04277I7813
$$ -500634 74230 -403733 -156093 2708 286695 -256444 141269 146646 -56431 -260708 97813
10710A27779B3760a11530d7269l4046L9840j44156L6405l501M6179N2667I4372
$$ 127779 23760 -111530 -47269 -81315 -41475 -185631 -149226 -152727 -106548 -53881 94372
10698c37416G5500c41738B00280A0823O0848K23568A12219k6698d50244A49809
$$ -337416 75500 -341738 200280 10823 71671 295239 112219 85521 -450244 149809
10687c22307J00478r2109b624o759k2366j48192c4499A31216a65176j9363c1653
$$ -322307 -221829 -313938 -2624 -9383 -31749 -179941 -34499 131216 -165176 -184539 -31653
10675A08186a05150j47165B32417p6010c26921A7477c04428d0687F858c19928
$$ 108186 -105150 -252315 232417 156407 -326921 17477 -304428 -40687 6858 -319928
10664a86886C10197a05368r7947O4151I0353b2059D502P5950a47661g2277B06654
$$ -186886 310197 -105368 -203315 -139164 90353 -22059 4502 80452 -147661 -72277 206654
10652b05418H9201h363D8641i0644k12746A7531P9567a44670f4976C6483R743
$$ -205418 89201 -8363 48641 -90644 -303390 17531 97098 -144670 -64976 36483 46226
10641D6226A1902R0857c29157G6086a48041K6673d1947B6336e6384l42455a47620
$$ 46226 11902 102759 -329157 76086 -148041 -121368 -41947 26336 -56384 -398839 -147620
10629B43921d52345I8149c29q6887k2495a89j45118A02545a42559O0396E5008
$$ 243921 -452345 98149 -329 -87216 -109711 -189 -145307 102545 -142559 -82163 55008
10617a33951E431b67987P6356C62191g3514n4124E0660I651L89743d7399k06480
$$ -133951 5431 -267987 -191631 362191 -73514 -127638 50660 9651 399394 -47399 -253879
10606b53879a8943G3767c33587h3111C50494A4096K49057a12631B82386b86903
$$ -253879 -18943 73767 -333587 -83111 350494 14096 263153 -112631 282386 -286903
10595A92657e1928m2191K0819E8937a24561j95269B52362a35390C7322a30748
$$ 192657 -51928 -94119 -73300 58937 -124561 -319830 252362 -135390 37322 -130748
10584a734A78741c38837A65745i502j22006C01002b14518P7712A39849A9719g1354
$$ -1734 178741 -338837 165745 -9502 -131508 301002 -214518 -136806 139849 19719 -71354
10572H7742b45081k13625h4002j24894P9433A10623D3483b06475k5704m1986g8272
$$ 87742 -245081 -458706 -84002 -208896 -129463 110623 43483 -206475 -232179 -274165 -78272
10560a51281B67274I0822f8868A912M85130i7673m4819K4090j41314B00441q4632
$$ -151281 267274 90822 -68868 1912 487042 -97673 -142492 -118402 -259716 200441 115809
10549A15809O1470d5795A01763c6514B47795b56738a24701k19934I6885C6906
$$ 115809 177279 -45795 101763 -36514 247795 -256738 -124701 -344635 96885 36906
10538e6403B1348e7866k9499l38112B3820P7856c9369k27581o2843B06681E7621
$$ -56403 21348 -57866 -87365 -425477 23820 101676 -39369 -266950 -329793 206681 57621
10526a7354C5804d4238p4553o4441B4607a52739A61904l6538i824j67770C09311
$$ -17354 35804 -44238 -118791 -183232 24607 -152739 161904 125366 -9824 -177594 309311
10514A1839P0174J5559K83295A59897d4733k8305J7327I9157a04716B4084L29425
$$ 11839 82013 97572 380867 159897 -44733 -73038 -55711 99157 -104716 24084 353509
10503C53509b53203a06038A6419C537L30131e0157m9004e913j13715e2935k46073
$$ 353509 -253203 -106038 16419 3537 333668 -50157 -99161 -5913 -119628 -52935 -299008
10492b99008k3309J31369D354b10273K1661e8437j0069A19801R6459L5113A16454
$$ -299008 -322317 -190948 4354 -210273 -188612 -58437 -68506 119801 216260 251373 116454
10480A12250M72262k42484r9197K35182j82046A21308K08189C3022K19496a37417
$$ 112250 584512 342028 242831 478013 295967 121308 329497 33022 252518 -137417
10469E5776b74056f2395B95755d2114j21042g2903A05725l7468g178B79397c13997
$$ 55776 -274056 -62395 295755 -42114 -163156 -72903 105725 68257 -7178 279397 -313997
10457F8153b61772j6798A65976O1879J38850a81564j6145J5414H1158J54879g5726
$$ 68153 -261772 -278570 165976 227855 366705 -181564 -197709 -182295 81158 236037 -75726
10445A10932A969Q2683b88087d6982E3068b24831e5170j93561f208p5542H1331
$$ 110932 1969 84652 -288087 -46982 53068 -224831 -55170 -248731 -6208 -81750 81331
10433b04805H4545a6143k5638C2661r010b84105a01105B85469a28811j48854J11181
$$ -204805 84545 -16143 -41781 32661 23651 -284105 -101105 285469 -128811 -277665 -166484
10422a66484A14336e5914k59350D8462a17428j73813F0042a36045A10583b21975
$$ -166484 114336 -55914 -315264 48462 -117428 -291241 60042 -136045 110583 -221975
10411g6633k93540B4718K2155b0572B99917k5419E6286c9844m7852j3525C2476
$$ -76633 -370173 24718 46873 -20572 299917 274498 56286 -39844 -87696 -101221 32476
10399b11488A60151o5485c3717p3165G0333a07214j7932A75875C1966P7537M2411
$$ -211488 160151 94666 -33717 -106882 70333 -107214 -125146 175875 31966 109503 151914
10388A51914L7444A4756R8294L5128K09a6246k03232A47859J97712j52675I3227
$$ 151914 189358 14756 113050 148178 148387 -16246 -219478 147859 345571 192896 93227
10376A37106N4060a47073A00326K13434j30489j9485J8976M89274b96A23470M31285
$$ 137106 191166 -147073 100326 313760 183271 163786 182762 672036 -296 123470 554755
10365E54755p1608i5518B45853H5424O3066L0621J87859a8138B02775C3980J71974
$$ 554755 483147 -95518 245853 85424 148490 179111 366970 -18138 202775 33980 205954
10354B05954J39196C5184f2811D99615K04843B33080J38569F2200a13510B37700
$$ 205954 345150 35184 -62811 499615 704458 233080 371649 62200 -113510 237700
10343D02114K65053A37712a04722K9369k21446J00618H4742a75237n0015M5544
$$ 402114 667167 137712 -104722 -75353 -296799 -196181 84742 -175237 -225252 -179708
10333a79708A45767L8843j5032J15893j6343D9292b21094M8280j32429F6783P5110
$$ -179708 145767 184610 169578 285471 269128 49292 -221094 -172814 -305243 66783 141893
10322A41893C4039L51774a47644A64208N48671A04080M9616d6702A91978c19644
$$ 141893 34039 385813 -147644 164208 712879 104080 153696 -46702 191978 -319644
10311A61967F1094h7186k50995e4325A42647a60005f8681j12355D19949b53416
$$ 161967 61094 -87186 -338181 -54325 142647 -160005 -68681 -181036 419949 -253416
10300a33564n9719C21121b34465F9306c32727g0030A23946E5577L08549f637G1994
$$ -133564 -193283 321121 -234465 69306 -332727 -70030 123946 55577 364126 -6637 71994
10288a31312c2498n0703p4087a3791j6322B4028J10795O6123e803l06802j33900
$$ -131312 -32498 -83201 -157288 -13791 -30113 24028 134823 200946 -5803 -312605 -446505
10277d46505K19709g1701C7770J17767a36058m1181K4636A24872K3286N2675a02780
$$ -446505 -226796 -71701 37770 155537 -136058 -177239 -152603 124872 148158 200833 -102780
10265a74430C6588i7123A04239l6510J20755L07209B38870L03079n1865e5901
$$ -174430 36588 -97123 104239 67729 188484 495693 238870 541949 490084 -55901
10254A84353a69788I7576a03812B21794F8191L51596f8631A77062h880r4675B3718
$$ 184353 -169788 97576 -103812 221794 68191 419787 -68631 177062 -8880 -103555 23718
10242C3617d71753h0667F6305M1145g9816h357E3275b47261A9100e7295j15434
$$ 33617 -471753 -80667 66305 107450 -79816 -8357 53275 -247261 19100 -57295 -172729
10231a72729f9068A51111r918i4827A2668K16203j13713B9458P9941C7930K55454
$$ -172729 -69068 151111 141193 -94827 12668 228871 115158 29458 109399 37930 293384
10220B93384L3441d62B42559E9009a79310h9202E2384L2357d62915B75756a34619
$$ 293384 326825 -462 242559 59009 -179310 -89202 52384 84741 -462915 275756 -134619
10208b2691o7809m092j28522a03878H0994a74161A1433N5742d5863n1698I6072
$$ -22691 -90500 -94592 -223114 -103878 80994 -174161 11433 67175 -45863 -97561 96072
10196a4734A39019a68264J2462j891o3523k4245J20048A71340O0656J33690i7863
$$ -14734 139019 -168264 -155802 -157693 -221216 -245461 -125413 171340 231996 365686 -97863
10184a31898B9475d6045k11911a18121r1744D1334a10367e0696k181E4990d9377
$$ -131898 29475 -46045 -257956 -118121 -209865 41334 -110367 -50696 -52877 54990 -49377
10172g4116j37472R7844B0490e4842B183b4341j20334a8714B8052a77977n1232
$$ -74116 -211588 -113744 20490 -54842 2183 -24341 -144675 -18714 28052 -177977 -229209
10161b29209J07730L9321j56579A1712d33527A2280J46553L7316E3476a09868
$$ -229209 -121479 -82158 -238737 11712 -433527 12280 158833 196149 53476 -109868
10150a00949E7305N039a11774B46380m5507J5732c36207N5552a8878N805E5779
$$ -100949 57305 62344 -111774 246380 200873 216605 -336207 -280655 -18878 -13073 55779
10138h1865j46463A53823o4198a04884M6355j31725f6195q3660L9028b4366o6410
$$ -81865 -228328 153823 89625 -104884 -58529 -190254 -66195 -149855 -110827 -24366 -90776
10127i0776q8944g402o9400b6185A74495a59872a154j05914M6591i369A01553
$$ -90776 -179720 -7402 -76802 -26185 174495 -159872 -1154 -107068 -60477 -9369 101553
10115h3654E5457A0769K86800B2314J67110a84257O169a5510k51356j61929K04772
$$ -83654 55457 10769 297569 22314 189424 -184257 -178088 -15510 -266866 -428795 -224023
10104b24023B4764M2752a11494j46584F1044f2202B20343A7570f002j53265g2172
$$ -224023 24764 67516 -111494 -258078 61044 -62202 220343 17570 -6002 -159267 -72172
10092b59464e3900p4354b7107l69558A32510b75051l3165A31072b90201a11299
$$ -259464 -53900 -128254 -27107 -396665 132510 -275051 -308216 131072 -290201 -111299
10081F1579a64835l30551f079j46674B13784A3466a46608e4866q9894H4612g5245
$$ 61579 -164835 -495386 -6079 -152753 213784 13466 -146608 -54866 -144760 84612 -75245
10069B11578a63520k00629B55575b21733A08001J29740A2966b5317k3957B26026
$$ 211578 -163520 -364149 255575 -221733 108001 237741 12966 -25317 -49274 226026
10058c63963D16297A1167J63998a83984j3945D9329e152l03122E7625c85880g0629
$$ -363963 416297 11167 175165 -183984 -197929 49329 -5152 -308274 57625 -385880 -70629
10046B57939d35q1492B18287J91189a58520A36559h8320c5748l09774j89931A2713
$$ 257939 -435 -81927 218287 409476 -158520 136559 -88320 -35748 -345522 -535453 12713
10034A53152a8662A87096h7360o3382b1893l8205a8918k60353k63143a87851q1993
$$ 153152 -18662 187096 -87360 -150742 -21893 -60098 -18918 -279271 -542414 -187851 -269844
10023b69844h73F4684B9870b6860n05072g6570k66058E097a21908H7954R685b46904
$$ -269844 -873 64684 29870 -26860 -531932 -76570 -342628 5097 -121908 87954 97639 -246904
10010b59364M8163A62006a46873L2876B2420a75556C94142A6956p748f4888H0137
$$ -259364 -211201 162006 -146873 -113997 22420 -175556 394142 16956 9208 -64888 80137
9998a30121H0931h6034C9455b31496D1642h1034n3683j33887B9481a57042e2767
$$ -130121 80931 -86034 39455 -231496 41642 -81034 -134717 -268604 29481 -157042 -52767
9986B93255a92944j7383Q1829M1628k22344r0837b289G7241J4811B7682K0198
$$ 293255 -192944 -210327 -128498 -86870 -309214 -400051 -2289 77241 92052 27682 47880
9975D7880b42615A43962A8240b52057c0842G061a51380F6657g2506o8668L0559
$$ 47880 -242615 143962 18240 -252057 -30842 7061 -151380 66657 -72506 -141174 -110615
9964a10615j7315L5093N265c5623j45089K6922L8068j35501F4868k6919J5196
$$ -110615 -127930 -92837 -87572 -35623 -180712 -153790 -115722 -251223 64868 37949 53145
9953E3145b4072A94523i4062k9558f0576B73657B328a12770B54292q9214m3853
$$ 53145 -24072 194523 -94062 -123620 -60576 273657 2328 -112770 254292 165078 121225
9942A21225d44443g9835j29680N3984N3296j12680M8310A26607B4092K8187C362
$$ 121225 -444443 -79835 -209515 -155531 -102235 -214915 -166605 126607 24092 52279 3362
9930D224f1540H0521c72676A03328d9191m36197D1179b1678j21017k04665C94433
$$ 4224 -61540 80521 -372676 103328 -49191 -485388 41179 -21678 -142695 -347360 394433
9918a01114A70768a08511A62659a90212B12435F2978c302B4799P7138M8473d566
$$ -101114 170768 -108511 162659 -190212 212435 62978 -3302 24799 101937 150410 -4566
9906A1502J19579l0019i0913J2796j9862A3975R0398a46678A23751a06811F4844
$$ 11502 131081 101062 -90913 -78117 -97979 13975 104373 -146678 123751 -106811 64844
9894a72979k04786a69690K117f2387K9554k51302e4355o4381G7118a87635B61502
$$ -172979 -377765 -169690 -167573 -62387 -32833 -284135 -54355 -118736 77118 -187635 261502
9882a66095B6257h7258c234j8137C4157M91907H6124a06654d1800C3520f5000
$$ -166095 26257 -87258 -3234 -21371 34157 526064 86124 -106654 -41800 33520 -65000
9870E7953K5109N1061a20863a0005j78204k9092D4183b28093A86084a61565A66893
$$ 57953 83062 134123 -120863 -10005 -188209 -217301 44183 -228093 186084 -161565 166893
9858A97812n6177h397A54603B3490N6127a65478A01376J55173a31676j14149B56555
$$ 197812 141635 -8397 154603 23490 79617 -165478 101376 256549 -131676 -245825 256555
9846E9453c4856H5795b88205b8807B199a1093q4937n0676N5326d4401H0252K27512
$$ 59453 -34856 85795 -288205 -28807 2199 -11093 -96030 -146706 -91380 -44401 80252 307764
9834C07764j41300a520j44053a7635A76726d06505e2271a6363l64312A05164P2554
$$ 307764 166464 -1520 -145573 -17635 176726 -406505 -52271 -16363 -380675 105164 177718
9823A77718a56110i521j01593K8691B6296a16476k0815M9245j5923K8769I3780
$$ 177718 -156110 -9521 -111114 -82423 26296 -116476 -137291 -88046 -103969 -75200 93780
9811g0178A51549A9425b47452D2308a73650A53933d69791a26917j48121D8588
$$ -70178 151549 19425 -247452 42308 -173650 153933 -469791 -126917 -275038 48588
9800a52847j09478Q7855j05110m9137A38782m8972K6417g2433a7045r6750K1206
$$ -152847 -262325 -174470 -279580 -328717 138782 89810 116227 -72433 -17045 -113795 -92589
9789i2589K2349C81909a59943A09687C9606c36952B61751r2170q093N3121b49360
$$ -92589 -70240 381909 -159943 109687 39606 -336952 261751 169581 161488 214609 -249360
9777D0541J9277c31124E3041L5388B8048d05314J45371G8852a97619A51173c8285
$$ 40541 59818 -331124 53041 88429 28048 -405314 -259943 78852 -197619 151173 -38285
9765b1826n8454n9767E2070c05850J44316j90954A2727a63616F8199k9832n979
$$ -21826 -80280 -140047 52070 -305850 -161534 -352488 12727 -163616 68199 38367 32388
9754C2388b63045K4284L9032c5451C2340J92973E6903K1346e8182q5558C56181
$$ 32388 -263045 -238761 -199729 -35451 32340 225313 56903 78249 -58182 -143740 356181
9742g2647j1166A64539Q1172C3869c76855b0259m16155a30458A21168b95576C4703
$$ -72647 -83813 164539 245711 33869 -376855 -20259 -436414 -130458 121168 -295576 34703
9730b24393M7901j44841f3879r7200G2969J85759I4031C9275b45528J1258G0014
$$ -224393 -176492 -321333 -63879 -161079 72969 258728 94031 39275 -245528 -234270 70014
9718a434j38927G8286d2918J2070l0634p7998b8262l57712R7729E5538a5515A71386
$$ -1434 -140361 78286 -42918 -30848 -61482 -139480 -28262 -385974 -288245 55538 -15515 171386
9705I2344A7236e39393d1170r2221j5285A33157b49794D9512c73807J27674A72016
$$ 92344 17236 -539393 -41170 -133391 -148676 133157 -249794 49512 -373807 -246133 172016
9693c70105E2047A0346d4710p9611g546l68008J20221e8038A91227a48811j30694
$$ -370105 52047 10346 -44710 -124321 -7546 -375554 -255333 -58038 191227 -148811 -279505
9682b79505A74938a6857n9081C4914J03655L4941b49067d9907C04602l4273d27962
$$ -279505 174938 -16857 -75938 34914 138569 173510 -249067 -49907 304602 270329 -427962
9670B59991a8668r1490o14d2589o3796m094A14203a63654N4512D1407g7854b8113
$$ 259991 -18668 -110158 -110772 -42589 -106385 -110479 114203 -163654 -109142 41407 -77854 -28113
9657D4071J2340N6530l2374b57894O3540O5764F9776K3278b60251F3458b57188
$$ 44071 56411 112941 80567 -257894 -194354 -128590 69776 93054 -260251 63458 -257188
9645C6877c6359j19289G4225b9473j45287G0472L4616J30443d5105n8803j24985
$$ 36877 -36359 -155648 74225 -29473 -174760 70472 105088 235531 -45105 -103908 -228893
9634b28893A84895h9306p3711l291q4715e8405B8806J41880c49751i4125A3849
$$ -228893 184895 -89306 -163017 -166308 -251023 -58405 28806 170686 -349751 -94125 13849
9622E1962a9171B14734c37823a1408j0245J0319k75515D5339R1092N2943J2708
$$ 51962 -19171 214734 -337823 -11408 -21653 -11334 -286849 45339 136431 189374 202082
9611B02082H7168b49917d4283j26844j30662f3121j81888a15247b431j07757k0956
$$ 202082 87168 -249917 -44283 -171127 -301789 -63121 -245009 -115247 -2431 -110188 -131144
9600a31144C1755c13544A14053C6717a80350D5446c2338j032e986j75440H9442
$$ -131144 31755 -313544 114053 36717 -180350 45446 -32338 -33370 -5986 -181426 89442
9588A56975a9050m7223j62521M6033c0361E7043c32287j2673a5087B37328E0420
$$ 156975 -19050 -66273 -228794 -182761 -30361 57043 -332287 -344960 -15087 237328 50420
9576B30592a81982l5164A89866J47273M5666b99854I0724h1449j32984N0013D7596
$$ 230592 -181982 -217146 189866 337139 382805 -299854 90724 -81449 -214433 -164420 47596
9564D4365a6694A28624a65144e9161B90830g8103k9732A72751n0138A9006J14567
$$ 44365 -16694 128624 -165144 -59161 290830 -78103 -107835 172751 122613 19006 133573
9553A33573a68644N0841j3298k35232P6535c9347N613C05650a32998k5454E91
$$ 133573 -168644 -117803 -131101 -366333 -289798 -39347 -33734 305650 -132998 -158452 591
9541g3061d974A08012n3968a79576l6825I5336a32998A40799A5326b18343A42842
$$ -73061 -4974 108012 54044 -179576 -216401 95336 -132998 140799 15326 -218343 142842
9529a0581n6864a1572l4342k11958a08560b2489A11437b30969A42147c9543C10937
$$ -10581 -67445 -11572 -45914 -257872 -108560 -22489 111437 -230969 142147 -39543 310937
9517b44027K997a01438D6044b74429a9509j84286K4683D26428A76592a98443f1243
$$ -244027 -241030 -101438 46044 -274429 -19509 -203795 -179112 426428 176592 -198443 -61243
9505G6519L40854a10161G842a70061p1779A00001b56802e0000l83524a28480j0226
$$ 76519 417373 -110161 7842 -170061 -241840 100001 -256802 -50000 -433524 -128480 -138706
9494a38706i819m71244B01799a40219f7171l5961F5920b23139f0308A11312B955
$$ -138706 -9819 -481063 201799 -140219 -67171 -103132 65920 -223139 -60308 111312 2955
9482d8840G4668B4499A0463a22786D7472O6394c3031A68574q4218A7710a8436
$$ -48840 74668 24499 10463 -122786 47472 113866 -33031 168574 84356 17710 -18436
9470a11796L7702C1554R058b65451A3684a92030A05443a45352B064b1049j07517
$$ -111796 -74094 31554 40612 -265451 13684 -192030 105443 -145352 2064 -21049 -128566
9459a28566A12100l5594a91999d0511I5020c03366M6052A54657A5670b06532d5463
$$ -128566 112100 76506 -191999 -40511 95020 -303366 -257314 154657 15670 -206532 -45463
9447c5067H8805a06248E2747a17560J1776A30100i6115n1309k58758D9125M4337
$$ -35067 88805 -106248 52747 -117560 -105784 130100 -96115 -147424 -406182 49125 93462
9436I3462b07816j5966Q3368o4037j13031O7149k7177B6161L8962N000j0907a61222
$$ 93462 -207816 -223782 -140414 -204451 -317482 -250333 -277510 26161 65123 70123 59216 -161222
9423d36062a19305b9252I6024C9949a8835j09466A96124c14281D8102C840b08595
$$ -436062 -119305 -29252 96024 39949 -18835 -128301 196124 -314281 48102 3840 -208595
9411E8840a94749M2340j76402a34732j13217B6632O5851n572a94173j21172f5993
$$ 58840 -194749 -152409 -328811 -134732 -247949 26632 92483 86911 -194173 -315345 -65993
9399e354p4593A05610m2531G652c15840B77567j03543G6252e6476j77280j2252
$$ -5354 -79947 105610 63079 7652 -315840 277567 174024 76252 -56476 -233756 -246008
9388b46008A23381G041a12816d2499l17703H0986a32443B2035d2715r2814a4365
$$ -246008 123381 7041 -112816 -42499 -360202 80986 -132443 22035 -42715 -135529 -14365
9376f0757p064E6769c72851h7311a5045C3984f8598c0715B2405O9190l4704J25777
$$ -60757 -67821 56769 -372851 -87311 -15045 33984 -68598 -30715 22405 91595 56891 182668
9364A82668q6170P3324e013k59273A92882o9918a02906B3217a747j26951e2100
$$ 182668 96498 169822 -5013 -264286 192882 122964 -102906 23217 -1747 -128698 -52100
9352G2689b1482k18910C17591j37447G3960A6403b71664a4808l80777e0753l7932
$$ 72689 -21482 -240392 317591 180144 73960 16403 -271664 -14808 -395585 -50753 -88685
9341h8685f130j46012P3597A15038i1555j82635A41464b5548k9663k20862b5826
$$ -88685 -6130 -152142 -78545 115038 -91555 -274190 141464 -25548 -55211 -276073 -25826
9329a18898F3059a01524E7054G923c31114a22839A24951a3059k61263E0247d26480
$$ -118898 63059 -101524 57054 7923 -331114 -122839 124951 -13059 -274322 50247 -426480
9317c82068B13570a3991B38750l3878D5953b45136M5266a3992A29688M1739b11135
$$ -382068 213570 -13991 238750 204872 45953 -245136 -199870 -13992 129688 171427 -211135
9305a80011e0672A5008d80025d6161m8612m1297E4950d09253J98120f2550b0358
$$ -180011 -50672 15008 -480025 -46161 -94773 -136070 54950 -409253 -211133 -62550 -20358
9293b26346d4336J0885G2887a38783o2831l3690h4650e003k29905H4773l1672
$$ -226346 -44336 -33451 72887 -138783 -201614 -235304 -84650 -5003 -234908 84773 53101
9282E3101b24473R8625A26044b55218i7169D9358k0211c41260f8017j84434O9851
$$ 53101 -224473 -125848 126044 -255218 -97169 49358 29147 -341260 -68017 -252451 -182600
9271a82600g3834j77017L3613Q8525o1397q63A91716f7834n5479c3505B21800
$$ -182600 -73834 -250851 -217238 -128713 -190110 -190973 191716 -67834 -123313 -33505 221800
9259h8679j05680b1508k80728D9648b75896A4660b80664B04502e0112E7987a78732
$$ -88679 -194359 -21508 -302236 49648 -275896 14660 -280664 204502 -50112 57987 -178732
9247a30090A27803a57729B7174b90517e1079H291a2347l34352a36538l0782f265
$$ -130090 127803 -157729 27174 -290517 -51079 8291 -12347 -346699 -136538 -167320 -6265
9235B46039p1015b40729D2983J05624a32632k3792m6960p9979a18064r048A2807
$$ 246039 175024 -240729 42983 148607 -132632 -156424 -203384 -283363 -118064 -127112 12807
9223b60635F3397a49907l190A64287g6265k94795A1621a14674a5046B81238d61997
$$ -260635 63397 -149907 -153097 164287 -76265 -371060 11621 -114674 -15046 281238 -461997
9211B95393b15831i8174B6688a09324D9261K191a68315g7930j05762F7756a5963
$$ 295393 -215831 -98174 26688 -109324 49261 51452 -168315 -77930 -183692 67756 -15963
9199d11356A18476b43356o9412B1926b07406B1888J9254j6812j0379P2690K44421
$$ -411356 118476 -243356 -312768 21926 -207406 21888 41142 24330 13951 86641 331062
9188C31062b74373f3297H882a53313q5022j03709a56315o0337e8408g567j36201
$$ 331062 -274373 -63297 8882 -153313 -238335 -342044 -156315 -216652 -58408 -7567 -143768
9177a43768D533i8412k88853A43770d060A39399e5493k14682A3141d30026N0458
$$ -143768 4533 -98412 -387265 143770 -4060 139399 -55493 -270175 13141 -430026 -379568
9166c79568D6545K0027j3596b7808F7128a2362k30588O9052B27660b48698A39643
$$ -379568 46545 66572 52976 -27808 67128 -12362 -242950 -173898 227660 -248698 139643
9154A22573g2972I5567d98479K34388j22450D2867j9962b52314c3065k61686e6372
$$ 122573 -72972 95567 -498479 -264091 -386541 42867 22905 -252314 -33065 -294751 -56372
9142D0624b71709A33640a03458b7616A02813j5254c64875A4288c15686B03918
$$ 40624 -271709 133640 -103458 -27616 102813 87559 -364875 14288 -315686 203918
9131H9735D017Q9962A5322a64354B1060b3082g714l4452I2105Q9192G7125b65939
$$ 89735 4017 93979 15322 -164354 21060 -23082 -7714 -42166 92105 181297 77125 -265939
9118a75305P0661A7341L3230F770R706g2274J7428q0518C72618A67549b15980
$$ -175305 -104644 17341 50571 6770 16476 -72274 -54846 -135364 372618 167549 -215980
9106B92062e8890r314c489A24475a28861C35214D9689d9547l9743l33306c7548
$$ 292062 -58890 -68204 -3489 124475 -128861 335214 49689 -49547 -89290 -422596 -37548
9094d43432J95278Q7317f908j87396H0780J284J16261f4302E882d330C47573a34592
$$ -443432 -248154 -160837 -6908 -194304 80780 82064 198325 -64302 5882 -4330 347573 -134592
9081H8550B8121b56433R4655D16812h0197f425r6010K8104C9359a6169C02126
$$ 88550 28121 -256433 -161778 416812 -80197 -6425 -102435 -74331 39359 -16169 302126
9069c11832e4150A89720c10432H1517a11760j07678B11562d30070g9570E2016
$$ -311832 -54150 189720 -310432 81517 -111760 -219438 211562 -430070 -79570 52016
9058c05132O9578K8260e0124A01421f2327C250b23438d9755J6708j88037A2694
$$ -305132 -235554 -207294 -50124 101421 -62327 3250 -223438 -49755 -33047 -221084 12694
9046G6894b66523I824h4423B1124Q7523B5141b43765O1788I2625a15205j67260
$$ 76894 -266523 9824 -84423 21124 108647 25141 -243765 -181977 92625 -115205 -282465
9035b82465A97644o5593c60596R5733l2083B48861a45086b5633j35965H5797K8809
$$ -282465 197644 132051 -360596 -264863 -296946 248861 -145086 -25633 -161598 85797 114606
9024A14606d90607a00993B51372a6104j20802n7663C5631i2892r9987j56375A36579
$$ 114606 -490607 -100993 251372 -16104 -136906 -194569 35631 -92892 -192879 -349254 136579
9012A69506c04778i5725I0255d8290B25287D9092a92851p583B31524c0925k24782
$$ 169506 -304778 -95725 90255 -48290 225287 49092 -192851 -200434 231524 -30925 -255707
9001b55707A0875L0183b43410c6964j68375E5520h1555A86470a24040L7383q5094
$$ -255707 10875 41058 -243410 -36964 -205339 55520 -81555 186470 -124040 -86657 -171751
8990a71751A1772b53132M0193R4752d4628A37107m1102a3014q8892R923K1299
$$ -171751 11772 -253132 -212939 -118187 -44628 137107 96005 -13014 -101906 -91983 -70684
8979g0684j8392E4370b19289M3450h3807K0123A86999j9505A1227J53044b30337
$$ -70684 -89076 54370 -219289 -175839 -83807 -63684 186999 167494 11227 164271 -230337
8967b46014M2019f0361A16081J13587r8872A9630o571f4718A22877b18546R8556
$$ -246014 -203995 -60361 116081 229668 130796 19630 13059 -64718 122877 -218546 -119990
8956a19990k28998a9322G3489P119J72089q0005E4076a68176H9860a55557D9739
$$ -119990 -348988 -19322 73489 80608 252697 172692 54076 -168176 89860 -155557 49739
8944d1090j27661A77238q6063M3195b27668A88514O0113C9893a49656C48597A68804
$$ -41090 -168751 177238 91175 134370 -227668 188514 248627 39893 -149656 348597 168804
8932B342a35698k03752E6891d43936d1470J5107A01122M37377K40933N63454K534479
$$ 2342 -135698 -339450 56891 -443936 -41470 -26363 101122 538499 779432 1342886 3877365
8921C877365K744716A972970B91958g4231A35974M3875d2042j97448k25115A34755
$$ 3877365 6622081 1972970 291958 -74231 135974 179849 -42042 -239490 -464605 134755
8910a16312k4137A36919K0920g4567n6406a0104A39822a43568n6325e522j1417
$$ -116312 -140449 136919 157839 -74567 -130973 -10104 139822 -143568 -199893 -5522 -16939
8899a6939p1771k0093A0039d7788k29182A58355M1780b47041j9417D6979f25536
$$ -16939 -88710 -108803 10039 -47788 -276970 158355 200135 -247041 -266458 46979 -625536
8887D5370d8472o7573J6196q1644k4109G7680a28195A33308D1334N4356f9081
$$ 45370 -48472 -116045 -99849 -181493 -205602 77680 -128195 133308 41334 95690 -69081
8875B36323e2872b3105j20823A12610P7350E656J08489O6186a92415O5247l14691
$$ 236323 -52872 -23105 -143928 112610 189960 5656 114145 180331 -192415 -127168 -441859
8864d41859g2684A39309a11129j20959o1274a0149n5169n9906k84251A83438G8930
$$ -441859 -72684 139309 -111129 -232088 -293362 -10149 -65318 -125224 -409475 183438 78930
8852g1804B51998b197A08396h470l58003R0116e2331I4131b07196L5323a8365
$$ -71804 251998 -2197 108396 -8470 -366473 -276357 -52331 94131 -207196 -171873 -18365
8840b28448E8590J58251a02769A73491a70791j07569i905B58739b30094q9110
$$ -228448 58590 216841 -102769 173491 -170791 -278360 -9905 258739 -230094 -319204
$$ [...]
##END NTUPLES=NMR SPECTRUM
##END=
