##TITLE=AC1685_PANAH14366_8637465_tnnQyLi04W
##JCAMPDX= 6.0         $$ Bruker NMR JCAMP-DX V2.0
##DATA TYPE= NMR SPECTRUM
##DATA CLASS= NTUPLES
##ORIGIN= BRUKER
##OWNER= Administrator
$$ 1.72 TOPSPIN		Version 2.1
$$ 2014-05-30 18:39:50.648 -0700  Administrator@X
$$ Compression mode = diff/dup
##.OBSERVE FREQUENCY= 400.02188249412
##.OBSERVE NUCLEUS= ^1H
##.ACQUISITION MODE= SIMULTANEOUS (DQD)
##.ACQUISITION SCHEME= undefined
##.AVERAGES= 64
##.DIGITISER RES= 22
##SPECTROMETER/DATA SYSTEM= spect
##.PULSE SEQUENCE= noesygpps1d.comp
##.SOLVENT NAME= COFFEE_meoh
##.SHIFT REFERENCE= INTERNAL, COFFEE_meoh, 1, 14.96103
##AUDIT TRAIL= $$ (NUMBER, WHEN, WHO, WHERE, PROCESS, VERSION, WHAT)
$$ ##TITLE= Audit trail, TOPSPIN		Version 2.1
$$ ##JCAMPDX= 5.01
$$ ##ORIGIN= Bruker BioSpin GmbH
$$ ##OWNER= Administrator
$$ $$ E:\/data/COFFEE/nmr/AC1685_PANAH14366_8637465_tnnQyLi04W/22/pdata/1/auditp.txt
$$ ##AUDIT TRAIL=  $$ (NUMBER, WHEN, WHO, WHERE, PROCESS, VERSION, WHAT)
(   1,<2014-05-30 18:39:45.616 -0700>,<Administrator>,<X>,<go>,<TOPSPIN 2.1>,
      <created by zg
	started at 2014-05-30 18:28:16.193 -0700,
	POWCHK enabled, PULCHK disabled,
       configuration hash MD5:
       C8 4E 4E 5D D3 5C D8 9E 9F 52 82 E0 59 8A DE 15
       data hash MD5: 64K
       8D 04 59 A8 60 D4 CE B6 B5 53 04 4A D8 8B 52 25>)
(   2,<2014-05-30 18:39:48.585 -0700>,<Administrator>,<X>,<proc1d>,<TOPSPIN 2.1>,
      <Start of raw data processing
       efp LB = 0.3 FT_mod = 6 PKNL = 1 PHC0 = 0 PHC1 = 0 SI = 128K 
       data hash MD5: 128K
       22 4E 89 20 F1 BA 2E EB 4F CA D1 36 32 8F EC F6>)
(   3,<2014-05-30 18:39:49.585 -0700>,<Administrator>,<X>,<proc1d>,<TOPSPIN 2.1>,
      <pk PHC0 = -84.08936 PHC1 = 0 
       data hash MD5: 128K
       04 AE 28 30 FF 77 5B 2A AE 0D 89 C3 CE FC 2F 42>)
(   4,<2014-05-30 18:39:50.038 -0700>,<Administrator>,<X>,<proc1d>,<TOPSPIN 2.1>,
      <abs ABSG = 1 
       data hash MD5: 128K
       81 82 4C C8 31 A4 6D C0 9F 1E 3D 0A 61 F8 F6 40>)
(   5,<2014-05-30 18:39:50.163 -0700>,<Administrator>,<X>,<proc1d>,<TOPSPIN 2.1>,
      <abs ABSG = 2 
       data hash MD5: 128K
       27 A0 CE 56 91 01 14 8D F1 1C 99 BD E4 F2 FC 50>)
(   6,<2014-05-30 18:39:50.257 -0700>,<Administrator>,<X>,<proc1d>,<TOPSPIN 2.1>,
      <abs ABSG = 3 
       data hash MD5: 128K
       69 FE F4 8E 15 CC D4 5D 2A 25 15 06 B9 AA 7E 89>)
(   7,<2014-05-30 18:39:50.351 -0700>,<Administrator>,<X>,<proc1d>,<TOPSPIN 2.1>,
      <abs ABSG = 4 
       data hash MD5: 128K
       6E 13 8E 62 26 7D 2B 11 DF 1F EF 3C 0F 87 CE F5>)
(   8,<2014-05-30 18:39:50.444 -0700>,<Administrator>,<X>,<proc1d>,<TOPSPIN 2.1>,
      <abs ABSG = 5 
       data hash MD5: 128K
       7B 83 C5 6C AA CC 0A C8 B3 32 43 4A 63 53 A8 1B>)
$$ ##END=
$$ 
$$ $$ hash MD5
$$ $$ 36 DC 63 A1 4A 0A 63 0F 3A E2 AC 09 F3 2D BE 65
##$RELAX= 
##$RELAX= 
##$RELAX= 
##$RELAX= 
##$RELAX= 
##$RELAX= 
##$RELAX= 
##$RELAX= 
$$ Bruker specific parameters
$$ --------------------------
##$DU= <E:\>
##$EXPNO= 22
$$ [...]
##$TP07= 0
##$TPNAME0= <>
##$TPNAME1= <>
##$TPNAME2= <>
##$TPNAME3= <>
##$TPNAME4= <>
##$TPNAME5= <>
##$TPNAME6= <>
##$TPNAME7= <>
##$TPOAL= (0..7)
0.5 0.5 0.5 0.5 0.5 0.5 0.5 0.5
##$TPOFFS= (0..7)
0 0 0 0 0 0 0 0
##$TUNHIN= 0
##$TUNHOUT= 0
##$TUNXOUT= 0
##$USERA1= <user>
##$USERA2= <user>
##$USERA3= <user>
##$USERA4= <user>
##$USERA5= <user>
##$V9= 5
##$VALIST= <valist>
##$VCLIST= <CCCCCCCCCCCCCCC>
##$VD= 0
##$VDLIST= <DDDDDDDDDDDDDDD>
##$VPLIST= <PPPPPPPPPPPPPPP>
##$VTLIST= <TTTTTTTTTTTTTTT>
##$WBST= 2048
##$WBSW= 25
##$XGAIN= (0..3)
0 0 0 0
##$XL= 0
##$YL= 0
##$YMAX_a= 5729651
##$YMIN_a= -12417382
##$ZGOPTNS= <>
##$ZL1= 120
##$ZL2= 120
##$ZL3= 120
##$ZL4= 120
##$ABSF1= 14.96103
##$ABSF2= -5.597152
##$ABSG= 5
##$ABSL= 3
##$ALPHA= 0
##$AQORDER= 0
##$ASSFAC= 0
##$ASSFACI= 0
##$ASSFACX= 0
##$ASSWID= 0
##$AUNMP= <proc_prof1d_extract.lims>
##$AXLEFT= 0
##$AXNAME= <>
##$AXNUC= <1H>
##$AXRIGHT= 0
##$AXTYPE= 0
##$AXUNIT= <>
##$AZFE= 0.1
##$AZFW= 0.1
##$BCFW= 0
##$BC_mod= 0
##$BYTORDP= 0
##$COROFFS= 0
##$CY= 15
##$DATMOD= 1
##$DC= 0
##$DFILT= <>
##$DTYPP= 0
##$F1P= 0
##$F2P= 0
##$FCOR= 0.5
##$FTSIZE= 131072
##$FT_mod= 6
##$GAMMA= 0
##$GB= 0
##$INTBC= 1
##$INTSCL= 1
##$ISEN= 128
##$LB= 0.3
##$LEV0= 0
##$LPBIN= 0
##$MAXI= 10000
##$MC2= 0
##$MEAN= 0
##$ME_mod= 0
##$MI= 0
##$NCOEF= 0
##$NC_proc= -2
##$NLEV= 6
##$NOISF1= 0
##$NOISF2= 0
##$NSP= 0
##$NTH_PI= 0
##$NZP= 0
##$OFFSET= 14.96103
##$PC= 1
##$PHC0= -84.08936
##$PHC1= 0
##$PH_mod= 1
##$PKNL= yes
##$PPARMOD= 0
##$PPDIAG= 0
##$PPIPTYP= 0
##$PPMPNUM= 2147483647
##$PPRESOL= 1
##$PSCAL= 4
##$PSIGN= 0
##$PYNMP= <proc.py>
##$REVERSE= no
##$SF= 400.02000962497
##$SI= 131072
##$SIGF1= 0
##$SIGF2= 0
##$SINO= 400
##$SIOLD= 131072
##$SPECTYP= <>
##$SREGLST= <1H.CDCl3>
##$SSB= 0
##$STSI= 131072
##$STSR= 0
##$SW_p= 8223.68421052631
##$SYMM= 0
##$S_DEV= 0
##$TDeff= 65536
##$TDoff= 0
##$TI= <>
##$TILT= no
##$TM1= 0
##$TM2= 0
##$TOPLEV= 0
##$USERP1= <user>
##$USERP2= <user>
##$USERP3= <user>
##$USERP4= <user>
##$USERP5= <user>
##$WDW= 1
##$XDIM= 131072
##$YMAX_p= 401964445
##$YMIN_p= -12181
##$CURPLOT= <Network HP LaserJet P1505>
##$CURPRIN= <$Network HP LaserJet P1505>
##$DFORMAT= <normdp>
##$LAYOUT= <+/1D_H.xwp>
##$LFORMAT= <normlp>
##$PFORMAT= <normpl>
##$SURQMSG= 1
$$ End of Bruker specific parameters
$$ ---------------------------------
##NTUPLES= NMR SPECTRUM
##VAR_NAME=  FREQUENCY,     SPECTRUM/REAL,   SPECTRUM/IMAG
##SYMBOL=    X,             R,               I
##VAR_TYPE=  INDEPENDENT,   DEPENDENT,       DEPENDENT
##VAR_FORM=  AFFN,          ASDF,            ASDF
##VAR_DIM=   131072,        131072,          131072
##UNITS=     HZ,            ARBITRARY UNITS, ARBITRARY UNITS
##FACTOR=    0.0627417313425164, 1,          1
##FIRST=     8223.62146879497, 10,           -59621
##LAST=      0,             2665,            -60041
##MIN=       0,             -12181,          0
##MAX=       8223.62146879497, 401964445,    0
$$ Real data points
##PAGE= N=1
##DATA TABLE= (X++(R..R)), XYDATA
$$ [...]
63913C851410l00902k88497k73347k55912k36585k15802j94154j72549j51969
63904A761693j32986j15588r9645q5257p2616o1764n2669m5283l9359l4470l0442
63893I91614k7512k5845k5125k4859k4790k4691k4152k3079k2106k1837k1841
63882G25777k1042j9115j6760j4441j1711q248m822k513j330k59J515M044P008
63869F38103R939J2188J3373J4055J5257J7184J8954J9820J9931J9691J9099J8221
63857H35815J7540J7123J6057J3567J0343P749N974L941J021k162m836p051r209
63844I05872j1357j3438j5629j8095k0738k3427k6031k8097k9160k9464k9700
63833F60736k9827k9020k7178k5437k4582k3848k2148j9716j7526j5728j3785
$$ plain form
63913 3851410 3550508 3262011 2988664 2732752 2496167 2280365 2086211 1913662 1761693
63904 1761693 1628707 1513119 1413474 1328217 1255601 1193837 1141168 1095885 1056526 1022056 991614
63893 991614 964102 938257 913132 888273 863483 838792 814640 791561 769455 747618 725777
63882 725777 704735 685620 668860 654419 642708 634460 629638 627125 625795 625536 627051 631095 638103
63869 638103 648042 660230 673603 687658 702915 720099 739053 758873 778804 798495 817594 835815
63857 835815 853355 870478 886535 900102 910445 918194 924168 928109 929130 926968 922132 915081 905872
63844 905872 894515 881077 865448 847353 826615 803188 777157 749060 719900 690436 660736
63833 660736 630909 601889 574711 549274 524692 500844 478696 458980 441454 425726 411941
63822D11941j1788j0452r933r614r070q376p525o461n582n368n488n087m009k904
63808C10284k113j400q21q79j495j786j316q28j177k204l146l641l870m051m235
63793B77322m340m144l561k926k683k676k382j806j539j771k002k003k201k722
63779B40566k817j852k98R08J497J709J534P82l12j216j741j981j900j432q70
63764B32577n75m20l4M70N43L6n26o05k74J7J0j94m05m99l34K47J094J569J084
63745B33781jm69M11J913K769K759K727L163L565L402K890K519K309K015J609
63730B65362J236R97J063J616K501L243L620L836M076M305M622N121N319M435
63716C11352K600J059P01J013R69L85k79r17j739k554k808k272j254k81J91%m31
$$ plain form
63822 411941 400153 389701 379768 370154 361084 352708 345183 338722 333140 327772 322284 317197 313188 310284
63808 310284 308171 306771 305950 305071 303576 301790 300474 299646 298469 296265 293119 289478 285608 281557 277322
63793 277322 272982 268838 265277 262351 259668 256992 254610 252804 251265 249494 247492 245489 243288 240566
63779 240566 237749 235897 235599 236507 238004 239713 241247 242029 241717 240501 238760 236779 234879 233447 232577
63764 232577 232002 231582 231548 232018 232561 232597 232071 231466 231192 231209 231219 231025 230620 230121 229787 230034 231128 232697 233781
63745 233781 233780 233311 233722 235635 238404 241163 243890 247053 250618 254020 256910 259429 261738 263753 265362
63730 265362 266598 267595 268658 270274 272775 276018 279638 283474 287550 291855 296477 301598 306917 311352
63716 311352 313952 315011 315712 316725 317694 318079 317800 316883 315144 312590 309782 307510 306256 305975 306166 306166 305735
63699C05735m23L8K61M7K23J396K796L289K980K870L209L244K502J419N57P4p
63682C30210K92N24Q4r37j638j370m31L77N20J5o53p80q5Q16J015M61j2J54N16
63663C29078L15n52j562k268k701l156l805m487m878m853m611m294l741k833j845
63648B83807j212j018j020j040r97p66l17J66N75J150K065L014L573L803M040
63633B95823M292M371M426M810N466N982O202O266O188O007O209P288Q842R896
63619C82068J0235J0693J1863J3252J4170J4819J5963J7823J9840K1423K2576
63608E54725K3800K5485K7358K8567K8452K7157K5107K2145J7720J1913N631k65
63596G97795n363r109j0727j0252r008q388q553q875r248j0281j2389j5299j8393
$$ plain form
63699 305735 305312 305350 305611 305658 305881 307277 310073 313362 316342 319212 322421 325665 328167 329586 330143 330217 330210
63682 330210 330502 331026 331110 330173 328535 327165 326734 327111 327631 327646 326993 326213 326128 326944 327959 328420 328408 328562 329078
63663 329078 329393 328841 327279 325011 322310 319154 315349 310862 305984 301131 296520 292226 288485 285652 283807
63648 283807 282595 281577 280557 279517 278520 277754 277437 277603 278178 279328 281393 284407 287980 291783 295823
63633 295823 300115 304486 308912 313722 319188 325170 331372 337638 343826 349833 356042 363330 372172 382068
63619 382068 392303 402996 414859 428111 442281 457100 473063 490886 510726 532149 554725
63608 554725 578525 604010 631368 659935 688387 715544 740651 762796 780516 792429 798060 797795
63596 797795 792432 783323 772596 762344 753336 744948 736395 727520 718272 707991 695602 680303 661910
63583F61910k1014k2542k2682k1741k0297j8598j6591j4360j2096r759p246m896
63571D70088l228k125q74P83K209K846L169M051N527O843P614Q190Q745Q829Q206
63556E30873P636Q119R741J1795J3925J6309J8827K0912K2578K4753K8015L1568
63544G45051L4157L5497L5806L4274K9259K0416R747q0p778j3322j6525j6920
63532H89582j4950j2241j0259r273r006r618j1476j4355j7659k1229k5150k8738
63520G05628l0613l0294k8900k7735k6670k4769k2008j9407j7493j5707j3521
63509D48511j1303r612q373p226o164n378m866m637m813n154m946l898k684k018
63495C67439j653r37J6M82K88k3j36l58r13j424j314m20Q65J840J988J546J406
$$ plain form
63583 661910 640896 618354 595672 573931 553634 535036 518445 504085 491989 482230 474984 470088
63571 470088 466860 464735 463861 464644 466853 469699 472868 476919 482446 489289 496903 505093 513838 522667 530873
63556 530873 538509 546628 556369 568164 582089 598398 617225 638137 660715 685468 713483 745051
63544 745051 779208 814705 850511 884785 914044 934460 944207 944127 936349 923027 906502 889582
63532 889582 874632 862391 852132 842859 833853 824235 812759 798404 780745 759516 734366 705628
63520 705628 675015 644721 615821 588086 561416 536647 514639 495232 477739 462032 448511
63509 448511 437208 427596 419223 411997 405833 400455 395589 390952 386139 380985 376039 372141 369457 367439
63495 367439 365786 364849 364865 365347 365635 365612 365476 365118 364205 362781 361467 361047 361912 363752 365740 367286 368692
63478C68692K090K991L152K542J940J643J126L1j141j667j466j061r89j395j947
63463C74541k104j709j243j168j164n51O68J772K323K555K774L011L461M488N923
63448C93577O992P350P573Q259R176R795J0117J0371J0362R777R015Q992J0111
63435E11467J1943J4004J6427J9633K3436K6653K7659K5539K0919J5537J0958
63424G24175P776O014N759P116R719J2844J5955J8937K1827K4600K7144K9129
63412I10995K9843K8490K4843J9467J3169O487j71o079j0409j2993j4436j5261
63400I73945j5270j4217j2872j2732j4583j7844k1487k4994k8176l0576l1686
63389G49508l1436l0083k7886k5243k2814k0959j9317j7390j5203j2980j0482
$$ plain form
63478 368692 370782 373773 376925 379467 381407 383050 384176 384207 383066 381399 379933 378872 377883 376488 374541
63463 374541 372437 370728 369485 368317 367153 366602 367270 369042 371365 373920 376694 379705 383166 387654 393577
63448 393577 400569 407919 415492 423751 432927 442722 452839 463210 473572 483349 492364 501356 511467
63435 511467 523410 537414 553841 573474 596910 623563 651222 676761 697680 713217 724175
63424 724175 731951 737965 743724 750840 760559 773403 789358 808295 830122 854722 881866 910995
63412 910995 940838 969328 994171 1013638 1026807 1033294 1033123 1027044 1016635 1003642 989206 973945
63400 973945 958675 944458 931586 918854 904271 886427 864940 839946 811770 781194 749508
63389 749508 718072 687989 660103 634860 612046 591087 571770 554380 539177 526197 515715
63378E15715p370l995j129R74K645M159N653P467R722J1713J2646J2928J3724
63365E84852J5141J5955J5509J4876J5501J7447J9723K1707K3491K5249K6958
63354G96409K8648L0281L1486L1664L0279K6867K1156J3537N199k441q408j2261
63342I92416j3997j4105j3374j2399j1456j0915j1311j2870j5354j8463k1931
63331H36241k5113k7149k7760k7333k5971k3287j9486j5887j3581j2159j0457
63320F08058q116n623l213q01J012P39k716q791j5316j9773k0829j9138j6582
63307D88911j4510j2861j1058r137p522o136m527k688j138j89L04M89K56n18j724
63292D17952l033l986m327m446n078o198o699n822m431m037m738n140m368l163
$$ plain form
63378 515715 508345 504350 503221 504195 506840 510999 516652 524119 533841 545554 558200 571128 584852
63365 584852 599993 615948 631457 646333 661834 679281 699004 720711 744202 769451 796409
63354 796409 825057 855338 886824 918488 948767 975634 996790 1010327 1015526 1013085 1004677 992416
63342 992416 978419 964314 950940 938541 927085 916170 904859 891989 876635 858172 836241
63331 836241 811128 783979 756219 728886 702915 679628 660142 644255 630674 618515 608058
63320 608058 599942 594319 591106 590305 591317 592056 589340 580549 565233 545460 524631 505493 488911
63307 488911 474401 461540 450482 441345 433823 427687 423160 420472 419334 419145 419449 419938 420194 419676 417952
63292 417952 414919 410933 406606 402160 397082 390884 384185 378363 373932 369895 365157 360017 355649 352486
63278C52486k622k709k594j907r92k17L16N53M16P0j14O8N30J082J554J756J603
63261C49279J338J422K024K739L048K988L119L832M916N918O638P104P319P348
63247D09032P435P754Q212Q759R629J0914J2244J3392J4842J7079J9576K1335
63235E60203K2325K3362K4621K5423K5838K7097K9732L2281L2978L1974L0879
63224H66713L0557L0470K9988K9230K8602K8229K8043K7939K7830K7811K8005
63213A183417K7920K6395K2787J7813J2576P139R27n904j2469j8378k3920k9030
63201A209273l3066l5773l7542l8421l7723l5078l1117k6759k2395j8128j4264
63190H79007j1026q233n682l384j080J952O065J0454J3862J5930J7421J9184K1243
$$ plain form
63278 352486 349864 347155 344561 342654 341662 341445 341761 342314 342730 342800 342686 342754 343284 344366 345920 347676 349279
63261 349279 350617 352039 354063 356802 359850 362838 365957 369789 374705 380623 387261 394365 401684 409032
63247 409032 416467 424221 432433 441192 450821 461735 473979 487371 502213 519292 538868 560203
63235 560203 582528 605890 630511 655934 681772 708869 738601 770882 803860 835834 866713
63224 866713 897270 927740 957728 986958 1015560 1043789 1071832 1099771 1127601 1155412 1183417
63213 1183417 1211337 1237732 1260519 1278332 1290908 1298047 1298974 1293070 1280601 1262223 1238303 1209273
63201 1209273 1176207 1140434 1102892 1064471 1026748 991670 960553 933794 911399 893271 879007
63190 879007 867981 859748 854066 850682 849602 851554 857619 868073 881935 897865 915286 934470 955713
63177I55713K2987K3865K3790K3015K1835K0470J9130J7961J6803J5202J2915
63166A173686J0253P635M969J770k136o478j1126j6304k2016k7588l2066l4986
63154A045613l6581l7399l7792l7686l6706l4640l1757k8625k5651k2953k0548
63143F95275j8428j6425j4265j1868r542p803o921o509n647l732j352J40J97k00
63129E92920K61J682L196M337N440O798Q139R061R449R305Q671P823P006N966
63115F80054M250K093L76n25j210k202l011k772j515k19K56j03q12j572k476l604
63099F67008m552m571l351j596m45l04n77n87l60k68k55J17R66J844K235K081
63083F57385J750J621J928K848M434O236P306P093O295O312P636R314J0299J0745
$$ plain form
63177 955713 978700 1002565 1026355 1049370 1071205 1091675 1110805 1128766 1145569 1160771 1173686
63166 1173686 1183939 1191574 1196543 1198313 1196177 1189699 1178573 1162269 1140253 1112665 1080599 1045613
63154 1045613 1009032 971633 933841 896155 859449 824809 793052 764427 738776 715823 695275
63143 695275 676847 660422 646157 634289 624747 616944 610023 603514 597867 594135 592783 592923 593120 592920
63129 592920 593181 594863 598059 602396 607836 614634 622773 631834 641283 650588 659259 667082 674088 680054
63115 680054 684304 686397 686773 686248 685038 682836 679825 677053 675538 675319 675575 675472 674660 673088 670612 667008
63099 667008 662456 657885 654534 652938 652493 652189 651612 651025 650665 650397 650142 650259 651225 653069 655304 657385
63083 657385 659135 660756 662684 665532 669966 676202 683508 690601 696896 703208 710844 720158 730457 741202
63069G41202J1445J2500J3364J3957J4841J6285J7897J9379K0991K3088K5700
63058I30649K8736L2134L5666L9099M2642M6712N1104N4980N7922O0490O3433
63047A443567O6782O9989P2486P3831P3848P2966P2037P1370P0364O8474O6141
63036B221855O4317O3354O2792O2001O0505N7869N3742M8008M0574L1120J9395
63025B785532N666r349k4877m0185n4490o7087p7564q5610r0788r2801r1928q8841
63013B067678q4075p7891p0637o2772n4464m5505l5825k5942j6636q239m22P210
63001A592480J4514K0876K5895K9769L2987L5791L8057L9507L9908L9265L8020
62990A947069L6855L6045L5135L3569L1379K8882K5887K1805J6471J0203K996
$$ plain form
63069 741202 752647 765147 778511 792468 807309 823594 841491 860870 881861 904949 930649
63058 930649 959385 991519 1027185 1066284 1108926 1155638 1206742 1261722 1319644 1380134 1443567
63047 1443567 1510349 1580338 1652824 1726655 1800503 1873469 1945506 2016876 2087240 2155714 2221855
63036 2221855 2286172 2349526 2412318 2474319 2534824 2592693 2646435 2694443 2735017 2766137 2785532
63025 2785532 2791198 2781849 2756972 2716787 2662297 2595210 2517646 2432036 2341248 2248447 2156519 2067678
63013 2067678 1983603 1905712 1835075 1772303 1717839 1672334 1636509 1610567 1593931 1585692 1585270 1592480
63001 1592480 1606994 1627870 1653765 1683534 1716521 1752312 1790369 1829876 1869784 1909049 1947069
62990 1947069 1983924 2019969 2055104 2088673 2120052 2148934 2174821 2196626 2213097 2223300 2226296
62979B226296n629j5691k6204l6050m4967n3323o1116o7679p2202p4390p4632
62968A694413p3724p2196o9796o5945o0749n5266n0473m6402m2604l9090l6261
62957A081907l4170l2352l0437k8524k6857k5477k4309k3341k2526k1640k0448
62946G91826j8997j7618j6540j5645j4677j3589j2492j1303r878q449p526p112
62934F38000o536n396m168l421k891k074j261j034j028l13R64J510O87o71j618
62919F10750k219k759k945k682k702l540m527m780m552m622m911m793m429m538
62905E56751n019m990m250l529l112k403j236n09q39j438j189l02P0m44j010r35
62889E25616n88o51r88q30L9Q53P84Pn02j51O44J059Q13K85p5j65j72l09o52j083
$$ plain form
62979 2226296 2220667 2204976 2178772 2142722 2097755 2044432 1983316 1915637 1843435 1769045 1694413
62968 1694413 1620689 1548493 1478697 1412752 1352003 1296737 1246264 1199862 1157258 1118168 1081907
62957 1081907 1047737 1015385 984948 956424 929567 904090 879781 856440 833914 812274 791826
62946 791826 772829 755211 738671 723026 708349 694760 682268 670965 661087 652638 645112 638000
62934 638000 631464 626068 621900 618479 615588 613514 612253 611219 610191 609878 610842 612352 613039 612368 610750
62919 610750 608531 605772 602827 600145 597443 593903 589376 584596 580044 575422 570511 565718 561289 556751
62905 556751 551732 546742 542492 538963 535851 533448 532212 531703 530864 529426 528237 527935 528005 527561 526551 525616
62889 525616 525028 524377 523389 522559 522598 523451 524235 524242 523740 523589 524233 525292 526105 526390 526315 526150 525978 525669 525017 523934
62869E23934j438j703j924k013j840j555j468j497j154l02M62N52J85pJ49L44
62853E10725M75P41J146J398J353J149Q78N07J40mN6R3L9L2O9o3m49j023j853
62834E15409k940l676l121j173R31J772J234M84N73J379K002J881J430J603K887
62819E20675M749O108O317N625M746M237M293M858N596N946N531M642M047M212
62805E91582M853N408N803O485P713R177J0401J1319J2167J3024J3840J4860J6574
62792G23206J9069K1824K4397K7115L0712L5422M0749M6138N1563N7285O3247
62781A140727O9020P4429P9989Q6416R3602J00337J05261J07917J08714J08016
62771B074428J05664J01327R4853Q6132P4936O1083M4667K6097O132j4136l3690
$$ plain form
62869 523934 522496 520793 518869 516856 515016 513461 511993 510496 509342 509040 509502 510054 510239 510232 510381 510725
62853 510725 511200 511941 513087 514485 515838 516987 517865 518372 518512 518508 518564 518657 518696 518728 518797 518734 518285 517262 515409
62834 515409 512469 508793 505672 504499 505430 507202 508436 508920 509493 510872 512874 514755 516185 517788 520675
62819 520675 525424 531532 537849 543474 548220 552457 556750 561608 567204 573150 578681 583323 587370 591582
62805 591582 596435 601843 607646 614131 621844 631021 641422 652741 664908 677932 691772 706632 723206
62792 723206 742275 764099 788496 815611 846323 881745 922494 968632 1020195 1077480 1140727
62781 1140727 1209747 1284176 1364165 1450581 1544183 1644520 1749781 1857698 1966412 2074428
62771 2074428 2180092 2281419 2376272 2462404 2537340 2598423 2643090 2669187 2675319 2661183 2627493
62760B627493n1960o8544q2688r3576j01206j06373j09588j10555j09008j05514
62750A688481j00990r5830r0010q3689p7196p0708o4406n8695n3754m9138m4333
62739H99732l9555l5400l1881k8396k4682k1153j8249j5886j3726j1621r616p867
62727F41700o653o104n826n071l480j460K83J417K136K860L895N282O914Q777
62713F44670J0982J3507J6096J8563K1034K3680K6434K9247L2411L6298M0811
62702I13733M5409M9687N3711N7856O2458O7507P2473P6570P9408Q1267Q2511
62691A642590Q2972Q2084P9362P4456O7041N7105M5130L1562J6370k95j7329l3218
62679B127830m7323n9943p1122q0126q6324q9869r1221r0538q7934q3934p9205
$$ plain form
62760 2627493 2575533 2506989 2424301 2330725 2229519 2123146 2013558 1903003 1793995 1688481
62750 1688481 1587491 1491661 1401651 1317962 1240766 1170058 1105652 1046957 993203 944065 899732
62739 899732 860177 824777 792896 764500 739818 718665 700416 684530 670804 659183 649567 641700
62727 641700 635047 628943 623117 618046 614566 613106 613389 614806 616942 619802 623697 628979 635893 644670
62713 644670 655652 669159 685255 703818 724852 748532 774966 804213 836624 872922 913733
62702 913733 959142 1008829 1062540 1120396 1182854 1250361 1322834 1399404 1478812 1560079 1642590
62691 1642590 1725562 1807646 1887008 1961464 2028505 2085610 2130740 2162302 2178672 2178377 2161048 2127830
62679 2127830 2080507 2020564 1949442 1869316 1782992 1693123 1601902 1511364 1423430 1339496 1260291
62668A260291p4043o8451o2588n6899n1858m7641m3938m0127l5902l1686k8153
62657G19005k5383k2888k0453j8351j6642j4865j2849j1225j0602j0513r871q330
62645E37033o740o109o558p363p678p073n584l607j723m03K79O04P98O95mj134
62629D85433j978k023j605j493j935k411k341j683p77R1Q46J588K513L730N017
62614D82972N945O387O732P420Q415R266R676R869J0318J1254J2520J3918J5552
62601F10244J7649K0134K2705K5346K8437L2133L5971L9408M2477M5514M8423
62590I68441N0649N1795N1914N1147M9425M6477M1874L5195K6512J6646O584l327
62578A393332j3189k2727l1131l7827m2953m6931m9920n1762n2168n0938m8370
$$ plain form
62668 1260291 1186248 1117797 1055209 998310 946452 898811 854873 814746 778844 747158 719005
62657 719005 693622 670734 650281 631930 615288 600423 587574 576349 565747 555234 545363 537033
62645 537033 530293 524184 517626 510263 502585 495512 489928 486321 484598 484195 484474 485078 485876 486571 486567 485433
62629 485433 483455 481432 479827 478334 476399 473988 471647 469964 469187 469278 470124 471712 474225 477955 482972
62614 482972 488917 495304 502036 509456 517871 527137 536813 546682 557000 568254 580774 594692 610244
62601 610244 627893 648027 670732 696078 724515 756648 792619 832027 874504 920018 968441
62590 968441 1019090 1070885 1122799 1173946 1223371 1269848 1311722 1346917 1373429 1390075 1396659 1393332
62578 1393332 1380143 1357416 1326285 1288458 1245505 1198574 1148654 1096892 1044724 993786 945416
62567I45416m5385m2803m0463l7561l3877l0061k6608k3349k0198j7677j6074
62556F11360j4704j2713j0298q401p416o814o018m981l907k903k124j738j657
62543E27686j571j447j589k039k270j752o33M63J160J462J413J039P39J226K727
62528E26614M562N944O969Q393J0522J2850J4916J6885J9062K1327K3492K5853
62516F97389K8854L2393L5918L9037M1719M4089M6411M8987N1500N2818N2110
62505A171225M9988M7697M5217M1144L4631K6616J8596J1121M102k117o835r861
62493A431524j1473j1656r987o270q30N790J2985K0120K6821L3270L9647M5352
62481A575293M9412N1790N3641N5681N6519N3151M3458K8334J1513k849j3047
$$ plain form
62567 945416 900031 857228 816765 779204 745327 715266 688658 665309 645111 627434 611360
62556 611360 596656 583943 573645 565244 557828 551014 544996 540015 536108 533205 531081 529343 527686
62543 527686 526115 524668 523079 521040 518770 517018 516385 516848 518008 519470 520883 521922 522661 523887 526614
62528 526614 531176 537120 544089 552482 563004 575854 590770 607655 626717 648044 671536 697389
62516 697389 726243 758636 794554 833591 875310 919399 965810 1014797 1066297 1119115 1171225
62505 1171225 1221213 1268910 1314127 1355271 1389902 1416518 1435114 1446235 1450337 1448220 1441385 1431524
62493 1431524 1420051 1408395 1398408 1392138 1391308 1397098 1410083 1430203 1457024 1490294 1529941 1575293
62481 1575293 1624705 1676495 1730136 1785817 1842336 1895487 1938945 1967279 1978792 1975943 1962896
62470A962896k0875k9938m2526n7710p2199q2863q8510q9814q8305q5543q2599
62459A222014p9577p5615o9794o2199n3941m6126l9105l2720k6841k1442j6513
62448F98141j2207q791o207l880j324J263L346M792N967P206Q485R539R964R390
62434G25684P938O347N196M083K055j126m593p382r307j0779j2089j3211j4008
62421F78808j4387j4302j3782j2948j2026j1331j1075j1060j0814j0205r671r500
62409E37707r250q330o915n733n063m490l650k623j622q33n35q30j201q92K07
62394D85947J553K789L911M600M264L034K012K093L053M119M876N238N146M781
62380E37416M684N196O068O972P944R007R803J0050J0027J0170J0515J0947J1633
$$ plain form
62470 1962896 1942021 1912083 1869557 1811847 1739648 1656785 1568275 1478461 1390156 1304613 1222014
62459 1222014 1142437 1066822 997028 934829 880888 834762 795657 762937 736096 714654 698141
62448 698141 685934 677143 670936 667056 665732 666995 670341 675133 681100 688306 696791 706330 716294 725684
62434 725684 733622 739969 745165 749248 751303 750177 745584 738202 728895 718116 706027 692816 678808
62421 678808 664421 650119 636337 623389 611363 600032 588957 577897 567083 556878 547207 537707
62409 537707 528457 520127 513212 507479 502416 497926 494276 491653 490031 489198 488663 487833 486632 485740 485947
62394 485947 487500 490289 494200 498800 503064 506098 508110 510203 513256 517375 522251 527489 532635 537416
62380 537416 542100 547296 553364 560336 568280 577287 587090 597140 607167 617337 627852 638799 650432
62367F50432J2808J4327J5921J7603J9553K1831K4512K7732L1265L4488L7194
62356I07666M0014M3497M7142M9911N1316N1363M9718M5826L9798L2465K4444
62345A383160J5876P197n38o547j1152j5327j9614k3823k7572l0694l3055l4330
62333A203581l4303l3329l2125l0946k9182k6216k2501j9334j7555j6885j6581
62322I24624j6325j6207j6419j7191j8692k0608k2208k3001k3067k2568k1404
62311G06934j9604j7553j5456j3091j0491q318o945n702l742j328N26J503K237
62298F08970L270M458N466O094O095N355M415M202M965N983O499O375N772M671
62284F82590L209J909J159P38L10O4M02J113J375P99QL6J330L469N735P622Q892
$$ plain form
62367 650432 663240 677567 693488 711091 730644 752475 776987 804719 835984 870472 907666
62356 907666 947680 991177 1038319 1088230 1139546 1190909 1240627 1286453 1326251 1358716 1383160
62345 1383160 1399036 1406233 1405695 1399148 1387996 1372669 1353055 1329232 1301660 1270966 1237911 1203581
62333 1203581 1169278 1135949 1103824 1072878 1043696 1017480 994979 975645 958090 941205 924624
62322 924624 908299 892092 875673 858482 839790 819182 796974 773973 750906 728338 706934
62311 706934 687330 669777 654321 641230 630739 622421 615476 609774 606032 604704 605230 606733 608970
62298 608970 612240 616698 622164 628258 634353 639708 644123 648325 653290 659273 665772 672147 677919 682590
62284 682590 685799 687708 688867 689605 689915 689979 690381 691494 692869 693668 693676 693712 695042 698511 704246 711868 720760
62267G20760R550R983J0872J2572J4702J6601J8246K0311K3315K7067L1150L5549
62255I50678M0417M5429M9719N2518N3657N3439N2068M9200M4191L6912K8244
62244A456472J9491J1292L411m418j1938j8815k5201l1518l7874m3909m9018n2593
62232A215382n4314n4357n3098n0576m6565m1346l5926l1289k7650k4613k1718
62221G73930j8688j5632j3102j1510j0384q820o839n482n193m998l927k486j762
62208F65107j691j276k12Q14J369J820K546L461M466N609O609O955O740O771P440
62193G16528Q050P658O269M731L714L228L095L450M492N941P122P726Q187Q943
62179G99134R610R418Q413P481P125O922O535O499P489R462J2070J5255J8826
$$ plain form
62267 720760 730310 740293 751165 763737 778439 795040 813286 833597 856912 883979 915129 950678
62255 950678 991095 1036524 1086243 1138761 1192418 1245857 1297925 1347125 1391316 1428228 1456472
62244 1456472 1475963 1487255 1490666 1486248 1474310 1455495 1430294 1398776 1360902 1316993 1267975 1215382
62232 1215382 1161068 1106711 1053613 1003037 956472 915126 879200 847911 820261 795648 773930
62221 773930 755242 739610 726508 714998 704614 695794 688955 683473 678280 673282 669355 666869 665107
62208 665107 663416 662140 661928 662742 664111 665931 668477 671938 676404 682013 688622 695577 702317 709088 716528
62193 716528 724578 732236 738505 743236 746950 750178 753273 756723 761215 767156 774278 782004 790191 799134
62179 799134 808744 818162 826575 834056 841181 848103 854638 861137 868626 878088 890158 905413 924239
62166I24239K2049K4547K7077L0519L4382L7260L8404L7953L5872L1781K5964
62155A270047J9491J3091O713M02n199r606j3168j6663k0499k4480k7983l0348
62143A161798l1393l1529l1103k9918k7845k5396k3064k0430j6873j2844r468
62132I01935p042n065l639l607m999o584p413p728p956p903p529p406p532o693
62118H10839m113j023N78L95k6N12J577K010J218o73l185n619p184p493o851n945
62102G75017n241m745m298m002m254n145o032n983m729k846j007O09K017L048
62088G32409L610M015M613N289N594N429N271N678O696P858Q777R608J0778J2340
62074H27965J3863J5063J6153J7290J8102J8202J7874J7716J7809J7789J7650
$$ plain form
62166 924239 946288 970835 997912 1028431 1062813 1100073 1138477 1176430 1212302 1244083 1270047
62155 1270047 1289538 1302629 1309342 1309744 1304545 1294939 1281771 1265108 1244609 1220129 1192146 1161798
62143 1161798 1130405 1098876 1067773 1037855 1010010 984614 961550 941120 924247 911403 901935
62132 901935 894893 889828 886189 882582 877583 870999 863586 855858 847902 839999 832470 825064 817532 810839
62118 810839 806726 805703 806281 806676 806650 807162 808739 810749 811967 811294 808109 802490 795306 787813 780962 775017
62102 775017 769776 765031 760733 756731 752477 747332 741300 735317 730588 727742 726735 727344 729361 732409
62088 732409 736019 740034 744647 749936 755530 760959 766230 771908 778604 786462 795239 804847 815625 827965
62074 827965 841828 856891 873044 890334 908436 926638 944512 962228 980037 997826 1015476
62063A015476J7837J8590J9734K1032K2139K2224K0425J6813J2287P417K049l713
62051A192310q935j2727j5225j7313j9739k2799k6427l0160l3281l5312l6300
62040I34092l6548l6258l5475l4124l2112k9642k7262k5164k2727j9446j6126
62029F19208j4194j3781j3434j2004r926q210p128o435o085n957n529m587l793
62016E08145l810m275m357l975l707l691l442k696j795j148q13o87o49m14L77
62001D73063J694K939L397K942K247K184K892L574L461K736K126J744R32p03k790
61986E02438m772o401p474p741p416p223p498p772p520o861o165n473m753m250
61972D11119m127m144l984l632l109k358j604j306j408j300q54p92j471k069j670
$$ plain form
62063 1015476 1033313 1051903 1071637 1092669 1114808 1137032 1157457 1174270 1186557 1193974 1196023 1192310
62051 1192310 1183375 1170648 1155423 1138110 1118371 1095572 1069145 1038985 1005704 970392 934092
62040 934092 897544 861286 825811 791687 759575 729933 702671 677507 654780 635334 619208
62029 619208 605014 591233 577799 565795 555869 547659 540531 534096 528011 522054 516525 511938 508145
62016 508145 504335 500060 495703 491728 488021 484330 480888 478192 476397 475249 474436 473749 473100 472686 473063
62001 473063 474757 477696 481093 484035 486282 488466 491358 494932 498393 501129 503255 504999 505931 505228 502438
61986 502438 497666 491265 483791 476050 468634 461411 453913 446141 438621 431760 425595 420122 415369 411119
61972 411119 406992 402848 398864 395232 392123 389765 388161 386855 385447 384147 383293 382501 381030 378961 377291
61957C77291n70L19P83J174J467J463J628K644M174N027M699L980L911M747O048
61942D18785P214P772P744P780Q435R305R425Q619P767P548P539O952N787M758
61928E25430M321M199L828K937J663L14q67j803k581l340m060m403l927k641j175
61913E17895j94K76P04J354K169L155M408N695O585P068P540Q032P989P044N438
61898E85158L561J602j26j195j661j980k059j205N31J840J716Q32N48J098J685
61883E90345J836J625Q43r67l592o072p761q855r788j0619j1052j0760r646q070
61869E07467o646n572m418k856j213P4J078K000K659K931L243L991M903N599O301
61854E19541P249Q019Q267Q691J0104J1947J2857J2563J2047J1927J1824J1393
$$ plain form
61957 377291 376721 377040 377823 378997 380464 381927 383555 386199 390373 395400 400099 404079 407990 412737 418785
61942 418785 425999 433771 441515 449295 457730 467035 476460 485079 492846 500394 507933 514885 520672 525430
61928 525430 529751 533950 537778 540715 542378 542692 541825 540022 537441 534101 530041 525638 521711 519070 517895
61913 517895 517701 517977 518681 520035 522204 525359 529767 535462 542047 549115 556655 564687 572676 579720 585158
61898 585158 588719 590321 590195 589000 587339 585359 583300 582095 582626 584466 586182 587014 587562 588660 590345
61883 590345 592181 593806 594649 593682 590090 584018 576257 567402 557614 546995 535943 525183 515537 507467
61869 507467 500821 495249 490831 487975 486762 486836 487914 489914 492573 495504 498747 502738 507641 513240 519541
61854 519541 526790 534809 543076 551767 561871 573818 586675 599238 611285 623212 635036 646429
61842F46429J0764R808Q084N773L646J829l09k728m358m674m513m622m449l222
61828F57458j381J01J173K469M019N295O230P191P922P524N676L136P56j374l496
61813G02699n396o515o622o009n145m372l875l662l537l282l054l381m672o712
61799F36465q797j0317j1102j1239j0824r899q541o943n525m773m759m910m644
61786E34192m098l768l563k883j780j131j355j689j304m78L4J94M68Q26Q76P41
61770E15282R28J432J778J920K439L655N157O282O689O500O297O777P963R007
61756E82106R266R187R400R330P768M687J472q33k527m300o189p891r334j0437
61742E91705j0879j0567r935r414q981q422p657o612n227l765k690k143j833j589
$$ plain form
61842 646429 657193 667001 675085 680858 684504 686333 686024 683296 678938 674264 669751 665129 660680 657458
61828 657458 656077 656178 657351 659820 663839 669134 675364 682555 690477 698001 703677 706813 707569 706195 702699
61813 702699 697303 690788 684166 678157 673012 668640 664765 661103 657566 654284 651230 647849 643177 636465
61799 636465 627668 617351 606249 595010 584186 574287 565746 558803 553278 548505 543746 538836 534192
61786 534192 530094 526326 522763 519880 518100 516969 515614 513925 512621 512143 512177 512371 512839 513665 514541 515282
61770 515282 516210 517642 519420 521340 523779 527434 532591 538873 545562 552062 558359 565136 573099 582106
61756 582106 591372 600559 609959 619289 627057 631744 633216 632383 629856 625556 619367 611476 602142 591705
61742 591705 580826 570259 560324 550910 541929 533507 525850 519238 514011 510246 507556 505413 503580 501991
61728E01991j426j076n5J470K526K432J594R00P11P83Q08O63L96K21L47O14N50
61711E13449m1q56j584k274l008l503l378k703k144k441l646m831m825l504k081
61696D72630j738k308k781k802k922l489m069m118l652l120k995l500m284m492
61682D26360l706k600k102k121j891j347j177j521j707j451j279j464j431o82
61668D01881M76J480K090K172J715J305J725K742L225K839K628L327M185M225
61654D36015L785L847M453M785M315L100J338n69j883k211k004j863j729j304
61640D50075p26j35Q12K178L030K514J298R49K010L560M545M619L757K004j49
61625D80341j949l173m259n467o468o843o602o045n484n108m826m303l498k923
$$ plain form
61728 501991 500565 499489 499434 500904 503430 505862 507456 508356 509067 509850 510658 511321 511717 511938 512285 512899 513449
61711 513449 513408 512552 510968 508694 505686 502183 498805 496102 493958 491517 487871 483040 478215 474711 472630
61696 472630 470892 468584 465803 463001 460079 456590 452521 448403 444751 441631 438636 435136 430852 426360
61682 426360 422654 420054 417952 415831 413940 412593 411416 409895 408188 406737 405458 403994 402563 401881
61668 401881 402357 403837 405927 408099 409814 411119 412844 415586 418811 421650 424278 427605 431790 436015
61654 436015 439800 443647 448100 452885 457200 460300 461638 461069 459186 456975 454971 453108 451379 450075
61640 450075 449349 449214 450026 452204 455234 457748 459046 459995 462005 465565 470110 474729 478486 480490 480341
61625 480341 478392 475219 470960 465493 459025 452182 445580 439535 434051 428943 424117 419814 416316 413393
61611D13393k984l278l185k914l210m053m469l846k755k112k059k108j966j779
61597C72675j804k218l028l896m130l253j699n98o85j477j794j161m53p99k045
61582C43635k817k220r40k70m53o15j36N34O37K12K7N62J383J676J228O45N70
61565C43658R63J375J699K172K737K927K524J899J465J226J086J207J682K083
61551C68703J837R26J5k41J69O45N98J28n3M95J249J319O02j88o11r06j182r34
61533C72571J06J250J647J411J327J662J864J425M86n04j280j820k153k320k398
61518C73274k461k439k030j003K72Q86M28k77j07Q11J284Q94O56J395K354K284
61502C76221J302P19J283K424L261L554L513L249K787K349K316K917L926M725
$$ plain form
61611 413393 410409 407131 403946 401032 397822 393769 389300 385454 382699 380587 378528 376420 374454 372675
61597 372675 370871 368653 365625 361729 357599 354346 352647 352049 351364 349887 348093 346932 346479 345680 343635
61582 343635 340818 338598 337658 337388 336935 336320 336184 336718 337355 337567 337594 338156 339539 341215 342443 343088 343658
61565 343658 344621 345996 347695 349867 352604 355531 358055 359954 361419 362645 363731 364938 366620 368703
61551 368703 370540 371466 371481 371240 371409 372054 372652 372780 372727 373222 374471 375790 376392 376204 375593 374687 373505 372571
61533 372571 372677 373927 375574 376985 378312 379974 381838 383263 383749 383245 381965 380145 377992 375672 373274
61518 373274 370813 368374 366344 365341 365613 366499 366927 366650 366543 367354 368638 369532 370188 371583 373937 376221
61502 376221 377523 378242 379525 381949 385210 388764 392277 395526 398313 400662 402978 405895 409821 414546
61488D14546M768M011K816J621Q50R40J880K880L109K813K970L767M257L853L178
61473D58259K921K703J848N85l74r40j473j896j945j951k485l270l428k839k461
61458D43254l088m333n126m784l505k085j179p25j66O11R66M56l39n40p6M92R76
61441D20809J563K014J745Q39J97L93Q94P34k97j452j806j111j1N83L56k13m77
61424D24760k20L96J067J391J183R58J580L017M069L746K457J246M23l10r17j063
61408D43783q70p93q98r64j089j427j541r25J7M28L42N98J335J659J059K27m6
61391D40895N7j5j80kM59P51Q17J108J866K764L256L199L002L211L934M748N205
61374D75075N288N255N238N172N020M693L973K762J368K37m96j001j396j642j694
$$ plain form
61488 414546 419314 423325 426141 427762 428612 429552 431432 434312 437421 440234 443204 446971 451228 455081 458259
61473 458259 461180 463883 465731 466316 465942 465002 463529 461633 459688 457737 455252 451982 448554 445715 443254
61458 443254 440166 435833 430707 425923 422418 420333 419154 418429 418263 418874 419840 420296 419957 419417 419341 419833 420809
61441 420809 422372 424386 426131 426970 427167 427560 428454 429188 428891 427439 425633 424522 424511 425094 425450 425237 424760
61424 424760 424540 424936 426003 427394 428577 429535 431115 434132 438201 441947 444404 445650 446073 445763 444846 443783
61408 443783 442913 442120 441222 440258 439169 437742 436201 435276 435293 435721 436063 436661 437996 439655 440714 440941 440895
61391 440895 440952 440937 440757 440755 441214 441965 442782 443890 445756 448520 451776 454975 457977 461188 465122 469870 475075
61374 475075 480363 485618 490856 496028 501048 505741 509714 512476 513844 514081 513585 512584 511188 509546 507852
61359E07852j514j135q37r42j231r46K36J627K316K187J722J208P32N78R29J317
61343E14099J031Q1q33j183r69l90L80J048J369J355J027K52p75j249o64L44O55
61326E15578L4p74j124r04j08J256K848M204N250O142O759P028P458Q598J0089
61311E72334J1093J1504J2002J2948J4066J5183J6410J7541J8110J8132J7998
61300G37321J7529J5948J2989R314N604J986j523m638p159r125j0475j1171j1638
61287G44962j2447j3460j3962j3714j3174j2613j1794j0608r351q142o815n504
61275F13378m651m208l573k462j225j90O54J242J475J627J979K114J579J059J701
61260F10499L237M116L864L755M596N299M628L065J832J051J62o65q39n94o79
$$ plain form
61359 507852 506338 505203 504366 503424 502193 501247 501483 503110 505426 507613 509335 510543 511275 511853 512782 514099
61343 514099 515130 515211 514378 513195 512226 511836 512216 513264 514633 515988 517015 517267 516492 515243 514579 514923 515578
61326 515578 515612 514838 513714 512810 512702 513958 516806 521010 526260 532402 539161 546189 553647 562245 572334
61311 572334 583427 594931 606933 619881 633947 649130 665540 683081 701191 719323 737321
61300 737321 754850 770798 783787 793101 798705 800691 799168 794530 787371 778246 767771 756600 744962
61287 744962 732515 719055 705093 691379 678205 665592 653798 643190 633839 625697 618882 613378
61275 613378 608727 604519 600946 598484 597259 597069 597723 598965 600440 602067 604046 606160 607739 608798 610499
61260 610499 613736 617852 621716 625471 630067 635366 639994 643059 644891 645942 646104 645439 644600 644006 643327
61245F43327j073j100o27j88KK18M21J60n72j087p93J74J235J850J771J185Q16
61228F45719J546L743O868R713J1138J0965J0264J0369J1480J2534J2570J1749
61216G58658J0798R984R098Q110P349P110P332P555P160N973M656M151M552M969
61202H57455M695M067L925M656O081P879R729J1232J2100J2373J2337J2238J2015
61189I70782J1103Q762M986Q68k444m923p199r226j0409j0885j1551j2599j3160
61176I14105j2885j2764j3738j5302j6265j6310j5994j5762j5615j5469j5218
61165G48783j4706j4023j3577j3495j3301j2452j0921r132p623o885o885o757
61153F19026n561l505j613k46J179K814L956M338M638M972M186J540j818m160
$$ plain form
61245 643327 642254 641154 640527 640339 640341 640559 640980 641140 640568 639481 638688 638862 640097 641947 643718 644903 645719
61228 645719 647265 651008 657876 667589 678727 689692 699956 710325 721805 734339 746909 758658
61216 758658 769456 779440 788538 796648 803997 811107 818439 825994 833154 839127 843783 847934 852486 857455
61202 857455 862150 866217 870142 874798 880879 888758 898487 909719 921819 934192 946529 958767 970782
61189 970782 981885 990647 995633 996501 994057 989134 981935 972709 962300 951415 939864 927265 914105
61176 914105 901220 888456 874718 859416 843151 826841 810847 795085 779470 764001 748783
61165 748783 734077 720054 706477 692982 679681 667229 656308 647176 639553 632668 625783 619026
61153 619026 613465 609960 608347 608101 609280 612094 616050 620388 625026 629998 634184 635724 633906 629746
61139F29746n137n418n121l848j860J7J434K665L865M986O183P572Q818R657J0536
61124F64095J2076J4257J6639J9025K1182K2479K2598K2251K2429K3197K3996
61113H84224K4673K5386K5802K5334K4020K2336K0367J7930J5364J3303J1688
61102A110427R834P439M842K274m34l350o276r154j2096j4976j7405j9154k0197
61089A031774k0476j9954j8813j7251j5329j3273j1574j0298q791o541m033k144
61077H83297r65J73J801L981O593R333J1627J3081J3928J4675J5593J6830J8625
61064A008572K0860K2858K4151K5073K6051K6786K6812K6389K6183K6257K6110
61053A286102K5458K4444K3275K2089K1002J9870J8416J6769J5361J3973J1699
$$ plain form
61139 629746 624609 619191 614070 610222 608362 608379 609813 612478 616343 621329 627512 635084 643902 653559 664095
61124 664095 676171 690428 707067 726092 747274 769753 792351 814602 837031 860228 884224
61113 884224 908897 934283 960085 985419 1009439 1031775 1052142 1070072 1085436 1098739 1110427
61102 1110427 1120261 1127700 1132542 1134816 1134382 1131032 1124756 1115602 1103506 1088530 1071125 1051971 1031774
61089 1031774 1011298 991344 972531 955280 939951 926678 915104 904806 896015 889474 885441 883297
61077 883297 882332 882505 884306 888287 894880 904213 915840 928921 942849 957524 973117 989947 1008572
61064 1008572 1029432 1052290 1076441 1101514 1127565 1154351 1181163 1207552 1233735 1259992 1286102
61053 1286102 1311560 1336004 1359279 1381368 1402370 1422240 1440656 1457425 1472786 1486759 1498458
61042A498458Q296M785K123J62j419k168j834j345j685k423k507j887j235o13
61028A496708M45J939L533N309P470R752J1936J4244J6537J8124J9366K2309K8395
61015A656067L6699M5928N6840P0845Q7366J04949J24254J47660J76489K10866
61005B717963K51603K99616L53837M12180M74236N40934O12961O92986P88217
60996G144533R06329J049436J215045J395531J559477J629586J503300J129671
60988A7532908N79069K3975l65997n18623m63416k72291k2545J89253K41328M2038
60978A6965699l91459r20494j366501j615977j660556j559499j382044j178986
60970F890183r82333q09535o65077n45507m46700l66195l01027k47551k03800
$$ plain form
61042 1498458 1506754 1511539 1513662 1513824 1512405 1510237 1508403 1507058 1505373 1502950 1500443 1498556 1497321 1496708
61028 1496708 1497153 1499092 1502625 1507934 1515404 1525156 1537092 1551336 1567873 1585997 1605363 1627672 1656067
61015 1656067 1692766 1738694 1795534 1866379 1953745 2058694 2182948 2330608 2507097 2717963
61005 2717963 2969566 3269182 3623019 4035199 4509435 5050369 5663330 6356316 7144533
60996 7144533 8050862 9100298 10315343 11710874 13270351 14899937 16403237 17532908
60988 17532908 18111977 18135952 17769955 17251332 16787916 16515625 16493080 16682333 16923661 16965699
60978 16965699 16574240 15653746 14287245 12671268 11010712 9451213 8069169 6890183
60970 6890183 5907850 5098315 4433238 3887731 3441031 3074836 2773809 2526258 2322458
60961B322458j69500j43639j23894j08445r6488q6920p8278p0172o3262n7553
60951A324307n1916m5539l8807l2639k7838k5083k4559k5432k6473k7191k7688
60940I71142k7732k6870k5331k3799k2419k0894j9416j8528j8047j7149j5603
60929G35354j4023j2820j1693j0331q861p482o349n765n840n926n254m092l494
60916F33424l780m112l730k788j749p80p9Ol99n58j46J68l37j392k178k500k869
60899F06201l593m316m597m536m632n184o037o890p634q249q478p982o883n829
60885E21361n298n087m830m644m900n508n901n679m931l945k983k335k162k184
60871D60974j804p62N49J499J823J784J804K096K582L124L693M254M636M688M507
$$ plain form
60961 2322458 2152958 2009319 1885425 1776980 1680492 1593572 1515294 1445122 1381860 1324307
60951 1324307 1272391 1226852 1188045 1155406 1127568 1102485 1077926 1052494 1026021 998830 971142
60940 971142 943410 916540 891209 867410 844991 824097 804681 786153 768106 750957 735354
60929 735354 721331 708511 696818 686487 677626 670144 663795 658030 652190 646264 641010 636918 633424
60916 633424 629644 625532 621802 619014 617265 616485 616406 616412 616013 615455 615309 615477 615140 613748 611570 609070 606201
60899 606201 602608 598292 593695 589159 584527 579343 573306 566416 558782 550533 542055 534073 527190 521361
60885 521361 516063 510976 506146 501502 496602 491094 485193 479514 474583 470638 467655 465320 463158 460974
60871 460974 459170 458408 458957 460456 462279 464063 465867 467963 470545 473669 477362 481616 486252 490940 495447
60856D95447M268L929L410K982K971L137K821J865Q44K98K42O02J399K143J834
60841E28192J74j742k704k860l293m469n878o922p414p290o616n874n571n476
60827D62257m867l585k321j701j630j705j832k181k824l614m245m419m169l971
60813D19193m209m635m629l978l026k124j408j047j225j695j871j508r59n82k71
60798C86026K04O90Q29N40J26o3R1M35O77P08Q15J372K305L049L194K917K608
60781D06523K340J989J620J318P83l44j668k128j304j37J40m66r37p99o07q30
60765D05493j102j004q15q55p26k2P13O30k2j91M07Q79N29l12j062j621j990j854
60747C97075j090j53N46J151J887K457K356J463oj730l204l837l583l077k836
$$ plain form
60856 495447 499715 503644 507054 510036 513007 516144 518965 520830 521674 521972 522214 522816 524215 526358 528192
60841 528192 528366 526624 523920 521060 517767 513298 507420 500498 493084 485794 479178 473304 467733 462257
60827 462257 457390 453805 451484 449783 448153 446448 444616 442435 439611 435997 431752 427333 423164 419193
60813 419193 414984 410349 405720 401742 398716 396592 395184 394137 392912 391217 389346 387838 386879 386297 386026
60798 386026 386230 386920 387749 388289 388415 388352 388443 388878 389555 390263 391078 392450 394755 397804 400998 403915 406523
60781 406523 408863 410852 412472 413790 414573 414229 412561 410433 409129 408992 409132 408666 407729 406930 406323 405493
60765 405493 404391 403387 402572 401717 400991 400969 401682 402312 402290 402099 402506 403385 403914 403602 402540 400919 398929 397075
60747 397075 395985 395832 396378 397529 399416 401873 404229 405692 405686 403956 400752 396915 393332 390255 387419
60732C87419k692k303j763j244n73K72O94K03o43q15j37N39N55J42j20l8K78P36
60714C80510J222J491J469J537K200L336M089L782K847K403K729K799J722J71
60700D12307m50M6M90J28m88o91q02j427k364k882k696k052j234m84j16k01l50
60683C96734j66L28R33J619K256K462K107J672J679K042K270K014J248K89k13
60668D17274J99J020J096J5j376k178k436k546k418j899j416j433j654j504r46
60653C99798k62N29J370J718J282P59J115K234L097L057K301J238J71n81r50j394
60637D15482k310l301l554k865j737o93mJ69l4m9M55J023J085Q60R20J197J210
60620D07854J016J088J346J142L21m30m47K50J151J678J470O90K8n0J83K33J32
$$ plain form
60732 387419 384727 382424 380661 379417 378844 379116 379810 380013 379370 378555 378418 378957 379512 379654 379534 379496 379774 380510
60714 380510 381732 383223 384692 386229 388429 391765 395854 399636 402483 404886 407615 410414 412136 412307
60700 412307 411857 411903 412393 412521 412033 411342 410540 409113 406749 403867 401171 399119 397885 397401 397285 397084 396734
60683 396734 396568 396896 397829 399448 401704 404166 406273 407945 409624 411666 413936 415950 417198 417487 417274
60668 417274 417473 418493 419589 419604 418228 416050 413614 411068 408650 406751 405335 403902 402248 400744 399798
60653 399798 399536 400065 401435 403153 404435 405194 406309 408543 411640 414697 416998 418236 418407 417826 416876 415482
60637 415482 413172 409871 406317 403452 401715 401022 401018 401187 401153 401104 401559 402582 403667 404527 405447 406644 407854
60620 407854 408870 409958 411304 412446 412767 412337 411890 412140 413291 414969 416439 417129 417157 417107 417290 417523 417655
60603D17655R0j05o72j141q44P1Q26J018P83L34oL67J605K809L011K447K025J914
60585D32187J706J525J721J682M95j193j541m4J709K328K244K440K833K974L280
60570D54346M375N835O637O607O534O987P752Q363Q611Q515Q087P217N743L705
60556E49314J517l98k042l549m573m494l374k051j151m55N93K199M170O045P232
60541E48983P509P451P930R091J0349J1366J2378J3520J4533J5352J6289J7287
60529F92038J7598J6483J3844J0036N614J278k451n681q712j1131j2084j1526
60517G05306j0428r566q830p910o795n324l201q91M46M73L58J293L059M796O455
60502F69241Q644J1411J4110J6285J8074J9899K2202K5281K8834L1851L3372L3197
$$ plain form
60603 417655 417745 417640 416968 415827 414983 415054 415880 416898 417681 418015 418009 418376 419981 422790 425801 428248 430273 432187
60585 432187 433893 435418 437139 438821 439316 438123 436582 436538 438247 440575 442819 445259 448092 451066 454346
60570 454346 458721 464556 471193 477800 484334 491321 499073 507436 516047 524562 532649 539866 545609 549314
60556 549314 550831 550433 548391 544842 540269 535775 532401 530350 529199 528744 529337 531536 535706 541751 548983
60541 548983 556492 563943 571873 580964 591313 602679 615057 628577 643110 658462 674751 692038
60529 692038 709636 726119 739963 749999 755613 756891 754440 748759 740047 728916 716832 705306
60517 705306 694878 685312 676482 668572 661777 656453 653252 652361 652807 653280 653638 654931 657990 662786 669241
60502 669241 677885 689296 703406 719691 737765 757664 779866 805147 833981 865832 899204 932401
60490I32401L1635K8955K5405K1464J7603J3958J0558P593N183L054O93k346o371
60477A089785j1470j7352k3629l0145l6560m1690m4149m3858m2120l9929l7040
60466G21843l3070k8581k4372k0586j7307j5145j4285j3624j1938r599p965p414
60454E17957p031o203n444n379n774n899n333m196l000k318k213k058j364n99
60440D61146o43j478k126j900j093k68M39R87J045M09m86r54q04m01j01K7j6k61
60422D53522n44m65J81J069J702K031K404K820K728J873R31P42J170J357J038
60407D72559Q58J292J940K193K016J733J515J468J760K238K370K017J862K530
60393D98351L624M171L822L105K659K722L230L896M170L657K652J900J794K125
$$ plain form
60490 932401 964036 992991 1018396 1039860 1057463 1071421 1081979 1089572 1094755 1097809 1098502 1096156 1089785
60477 1089785 1078315 1060963 1037334 1007189 970629 928939 884790 840932 798812 758883 721843
60466 721843 688773 660192 635820 615234 597927 582782 568497 554873 542935 533336 525371 517957
60454 517957 510926 504723 499279 493900 488126 482227 476894 472698 469698 467380 465167 463109 461745 461146
60440 461146 460503 459025 456899 454999 453906 453638 454077 455064 456109 456518 456032 455078 454274 453873 453772 453799 453783 453522
60422 453522 452978 452513 452694 453763 455465 457496 459900 462720 465448 467321 468252 468994 470164 471521 472559
60407 472559 473417 474709 476649 478842 480858 482591 484106 485574 487334 489572 491942 493959 495821 498351
60393 498351 501975 506146 509968 513073 515732 518454 521684 525580 529750 533407 536059 537959 539753 541878
60379E41878K558K908K933K415J602J175J391J628J185L46J28R64K141K760K752
60364E68764K600K504K413K590L398M546N364N851O649P747Q338Q339Q938J0707
60350F48748J2296J2176J0857R831R019P076L976J349j17j730m535p566r362r910
60336F82108r991r653q530p046o034n512m832l802k872k378k221k252k419k681
60322F11885l031l350l172k098o05L31O36J370L109N062O423P631R412J1405J2715
60307F57723J3261J3482J3214J1943R886P854O139M405K487M88j686m154o620
60294G28422q739j0656j2501j3727j3814j3174j2515j1559r551o860m909m379
60282F06038m480m227l552k905k527k477k823l486m288n222o261o955o770n792
$$ plain form
60379 541878 544436 547344 550277 552692 554294 555469 556860 558488 559673 560019 560147 561111 563252 566012 568764
60364 568764 571364 573868 576281 578871 582269 586815 592179 598030 604679 612426 620764 629103 638041 648748
60350 648748 661044 673220 684077 693908 702927 710003 713979 715328 715211 713481 708946 701380 692018 682108
60336 682108 672117 662464 653934 646888 640854 635342 630510 626708 623836 621458 619237 616985 614566 611885
60322 611885 608854 605504 602332 600234 599629 599960 600596 601966 605075 610137 616560 624191 633603 645008 657723
60307 657723 670984 684466 697680 709623 719509 727363 733502 737907 740394 740882 739196 735042 728422
60294 728422 719683 709027 696526 682799 668985 655811 643296 631737 622186 615326 610417 606038
60282 606038 601558 597331 593779 590874 588347 585870 583047 579561 575273 570051 563790 556835 550065 544273
60268E44273m641l718l037k623k469k252j762j463j845k382k016p28L16L80j7
60253E16016j41j08l04n11k38M54J024J134Q77M54j1m35p42q77q77r47j333j923
60235E11512k176j716q06O8Q57J790K772L505M043M642N225N552N786O303O914
60220E54271P052O748O774P610Q790R532R605R398R496J0178J1109J1549J1241
60207F73353J0760J0597J0314R353Q232P861P903P129N495M416M555M614L230
60194G67812R62o25j159j597k616l909m983n753o328o774p230p820q431q894r235
60179F93420r456r261q367o909n224l509k001j203j400k117k565k501k188j736
60165F34983j129q30j588l353m924n056l726k024j044j085j675k087j899j250
$$ plain form
60268 544273 539632 535914 532877 530254 527785 525533 523771 522308 520463 518081 516065 515337 515653 516033 516016
60253 516016 515875 515767 515463 514952 514714 515168 516192 517326 518203 518657 518646 518211 517469 516592 515715 514768 513435 511512
60235 511512 509336 507620 506814 506882 507739 509529 512301 515806 519849 524491 529716 535268 541054 547357 554271
60220 554271 561323 568071 574845 582455 591245 600777 610382 619780 629276 639454 650563 662112 673353
60207 673353 684113 694710 705024 714377 722609 730470 738373 745502 750997 755413 759968 764582 767812
60194 767812 768774 768149 766990 765393 762777 758868 753885 748132 741804 735030 727800 719980 711549 702655 693420
60179 693420 683964 674703 666336 659427 654203 650694 648693 647490 646090 643973 641408 638907 636719 634983
60165 634983 633854 633024 631436 628083 623159 618103 614377 612353 611309 610224 608549 606462 604563 603313
60151F03313n57N7Q95K109L254L676L278K631K351K562L017L457L777L975M172
60136F41967M581N349O335P164P418O931O012N366N473N976N971N134M171L905
60122G21753M237M521M632N016N737O222O117N760N516N236M744M325M240M134
60108G92190L481K357J242K23j015k397l270l264k973l352m503n369m831l028
60094G65491j225m38m89o18n79o49r28j336k160l778n765p017p029o423o014n973
60078G15070o150o530o909o821o217n702n671n826n901o172o682o760o077n468
60064F28184n823o622o566n355l905l006k647k519k305j605l55O70O27j60m47
60049E88166L76J699K783L636M600N647O455O815O725O343N904N461M836M042
$$ plain form
60151 603313 602756 602813 603708 605817 609071 612747 616025 618656 621007 623569 626586 630043 633820 637795 641967
60136 641967 646548 651897 658232 665396 672814 679745 685757 691123 696596 702572 708543 713677 717848 721753
60122 721753 725990 730511 735143 740159 745896 752118 758235 763995 769511 774747 779491 783816 788056 792190
60108 792190 795671 798028 799270 799493 798478 796081 792811 789547 786574 783222 778719 773350 768519 765491
60094 765491 764266 763828 763339 762721 762142 761493 760565 759229 757069 753291 747526 740509 733480 727057 721043 715070
60078 715070 708920 702390 695481 688660 682443 676741 671070 665244 659343 653171 646489 639729 633652 628184
60064 628184 622361 615739 609173 603818 599913 596907 594260 591741 589436 587831 587476 588146 588773 588613 588166
60049 588166 588542 590241 593024 596660 601260 606907 613362 620177 626902 633245 639149 644610 649446 653488
60035F53488L517L444L120J671o60k560l125k760k525l000l932m671m859m898
60021F32250n614p292r172j0270j0424j0186r961r643q920p516n414l264k137
60008E32437k358k842k304q77J67Q7o31j170j201p80r0N98J067J330J440J366
59992E26239J299J718K682L553L930M309N143N844N597M672L943L447K513J042
59978E75931m26j771l335m925n882o159o275o238n541m311l402l185l181l016
59964E18284k750k204j046L44J158J395J763K267K198J656J647K266K282J211
59950E30471L74R00J944K076J484J492K466L445L584K956K019J125N40L34K11
59935E55421j88q38j346j221n9K098M454O002O588O953P620Q260Q398Q042P261
$$ plain form
60035 653488 657005 660449 663569 665240 664580 662020 658895 656135 653610 650610 646678 642007 637148 632250
60021 632250 626636 619344 610172 599902 589478 579292 569331 559688 550768 543252 537838 534574 532437
60008 532437 530079 527237 524933 524056 524223 524310 523679 522509 521308 520528 520438 521036 522103 523433 524873 526239
59992 526239 527538 529256 531938 535491 539421 543730 548873 554717 560314 564986 568929 572376 574889 575931
59978 575931 575505 573734 570399 565474 559592 553433 547158 540920 535379 531068 527666 524481 521300 518284
59964 518284 515534 513330 512284 512628 513786 515181 516944 519211 521409 523065 524712 526978 529260 530471
59950 530471 530845 531745 533689 535765 537249 538741 541207 544652 548236 551192 553211 554336 554876 555210 555421
59935 555421 555233 554395 553049 551828 551769 553867 558321 564323 570911 577864 585484 593744 602142 610184 617445
59920F17445N792L584J284k88r27j059j211j598j877j359J30J676K127J454N54
59905F25727j05p69j424j635j536j825k480k568j719o95k8P52J964L025L584M306
59889F24574N648O764O770O299O660P944R031R136Q476P631P032O924P229P559
59875G27677P692P655P177N747L591J806Q85k1j684l476m389m684n365o437o886
59860G29288o268n254m612m364m086l411k244r11rK24J84K49K72J05J20O97J649
59843G01629K705L992N365N790M314J461j184k580k770k084o25J370L348M734
59829G25465N097M198K355N66k65j81J34K57J92j15p66j527j998k153k270k320
59813G26669j933j086m24o70j842l171l857l854l791m106m504m508m166l762l260
$$ plain form
59920 617445 623237 626821 628105 627817 626890 625831 624620 623022 621145 619786 619916 621592 623719 625173 625727
59905 625727 625622 624853 623429 621794 620258 618433 615953 613385 611666 610971 610943 611695 613659 616684 620268 624574
59889 624574 630222 636986 643756 650055 656715 664659 673690 682826 691302 698933 705965 712889 720118 727677
59875 727677 735369 743024 750201 755948 759539 761345 762230 762209 760525 757049 752660 747976 742611 736174 729288
59860 729288 723020 717766 713154 708790 704704 701293 699049 698138 698129 698353 698537 698786 699058 699163 699283 699980 701629
59843 701629 704334 708326 713691 719481 723795 725256 724072 721492 718722 716638 716013 717383 720731 725465
59829 725465 730562 734760 737115 737681 737416 737235 737369 737626 737818 737703 736937 735410 733412 731259 728989 726669
59813 726669 724736 723650 723226 722556 720714 717543 713686 709832 706041 701935 697431 692923 688757 684995 681735
59798F81735k697k753l952n521o095n631n378n788n755m418k525j336j164j698
59784F27024k750l836m012l033j970j797k036j639n31O22J567K474L256L725L995
59769F21059M186M131L939M155M791N023M500M103M503M933M423L488L383M227
59755F80844N153N769O388P018P320P335P324P111O347N185L969K647J199R6l51
59740G53354n93j030j311j212j363k101k444j465J63J241J893K866L746L573K720
59725G58037K416K739K688K119J768J570P03n11n46J035K786L309K695J655N40
59710G83003k71k33N68J409K004K747L666M345M934O062P467Q009P463O965P223
59695H45361P523P178O757O992P453P152N848L945J810k02j562k097k284k576
$$ plain form
59798 681735 679038 676285 672333 666812 660717 655086 649708 643920 638165 633747 631222 629886 628722 627024
59784 627024 624274 620438 616426 613393 611423 609626 607590 605951 605420 606042 607609 610083 613339 617064 621059
59769 621059 625245 629376 633315 637470 642261 647284 651784 655887 660390 665323 669746 673234 676617 680844
59755 680844 685997 691766 698154 705172 712492 719827 727151 734262 740609 745794 749763 752410 753609 753705 753354
59740 753354 752761 751731 750420 749208 747845 745744 743300 741835 741998 743239 745132 747998 751744 755317 758037
59725 758037 760453 763192 765880 767999 769767 771337 772040 771529 770983 772018 774804 778113 780808 782463 783003
59710 783003 782732 782499 783067 784476 786480 789227 792893 797238 802172 808234 815701 823710 831173 838138 845361
59695 845361 852884 860062 866819 873811 881264 888416 894264 898209 900019 899817 898255 896158 893874 891298
59681H91298k862k978l202l815m665n479o181o638o617o256o053o135o057n532
59667H18828m753l813k414n58J137K232L105M366N997P437Q258Q422Q104P547
59653H63895O964O420N861N227M419L324K031P25q10l150o307r354j1464j2852
59639H54929j4095j5045j5171j4559j3616j2228j0187q095o833o311n733m991
59627G28065m703n033n549o185p246q434q938q595q017p544p049o670o683o683
59613F30736n941m643l652l002j906l60O16O22M76Q05J213J286J298J427J361
59598F20336J133J359K130K673K538K138J727R36k36r80q92n91n89n18j96l75
59582F30593j616l199m026m018l861l933m056l938l348k275j266r84j309j514
$$ plain form
59681 891298 888436 885458 882256 878441 873776 868297 862116 855478 848861 842605 836552 830417 824360 818828
59667 818828 814075 810262 807848 807290 808427 810659 813764 818130 824127 831564 839822 848244 856348 863895
59653 863895 870859 877279 883140 888367 892786 896110 898141 898866 898056 894906 888599 879245 867781 854929
59639 854929 840834 825789 810618 796059 782443 770215 760028 751933 745100 738789 733056 728065
59627 728065 723362 718329 712780 706595 699349 690915 681977 673382 665365 657821 650772 644102 637419 630736
59613 630736 624795 620152 616500 613498 611592 611232 611848 612470 612946 613751 614964 616250 617548 618975 620336
59598 620336 621469 622828 624958 627631 630169 632307 634034 634970 634734 633754 632862 632271 631682 631164 630968 630593
59582 630593 628977 625778 621752 617734 613873 609940 605884 601946 598598 596323 595057 594073 592764 591250
59568E91250j455j669k116j970j131p06j282j826j218k7L80j59n61j62N70Q93
59552E78811P24O39J243K520L700M081L952M245N243O292O861P190P686Q436R557
59537F51180J1329J3791J6619J9301K0704J8800J2309K872n626j0396j1469j0172
59525G29242p424m165j762p72l05M02P44p0j575k914m250o066p792q424q107p861
59509F68901p950p603o393m948m109l982m000l528k389j029j51l4k86k41N56K049
59493F24863L464L763K838J995K425L603M148M005M419N746O787O674N965N428
59479F86123M934M214L551L098K546J948J902K398K627K338K218K342J714Pj577
59464G20383k047j925j966j790r18Q2N71R50J717K429K741L384M965O618P091
$$ plain form
59568 591250 589795 588126 586010 584040 582909 582203 580921 579095 577877 577850 578230 578071 577510 577348 577918 578811
59552 578811 579535 580174 581417 583937 587637 591718 595670 599915 605158 611450 618311 625501 633187 641623 651180
59537 651180 662509 676300 692919 712220 732924 751724 764033 766905 761279 750883 739414 729242
59525 729242 721818 717653 715891 715119 714814 715216 715960 715890 714315 711401 707151 701085 693293 684869 676762 668901
59509 668901 660951 653348 646955 642007 637898 633916 629916 626388 623999 622970 622819 622785 622499 622258 622814 624863
59493 624863 628327 632090 634928 636923 639348 642951 647099 651104 655523 661269 668056 674730 680695 686123
59479 686123 691057 695271 698822 701920 704466 706414 708316 710714 713341 715679 717897 720239 721953 721960 720383
59464 720383 718336 716411 714445 712655 711737 711819 712390 713340 715057 717486 720227 723611 728576 735194 742285
59449G42285O424N434M341K981J614M78q02k433l895n003o492q588j0054r830
59435G16460q528p199n698l672j925j209o27J025L079M008L952M472O153Q165
59421G18456R965J1826J3699J5130J6162J7180J7952J7944J7418J7189J7772J9483
59409I10176K2397K4797K2917J4483K207q243j3680j5029j4131j1336o588n48
59397I27422O163J3030J7977J7490R906k134j3596k0865k3385k2569k0172j7318
59385H71949j4309j1220q569o970o194n290l817k353j638j695k021k159j955j530
59371H02229j093o24P8Q72J247J082R13J126J484J900K902M677O450P587Q528
59356H39358R794J0854J1090J1105J1879J3293J4645J6004J7700J9047J9094J8220
$$ plain form
59449 742285 748709 754143 758484 761465 763079 763557 762755 760322 756427 751424 744932 736344 726290 716460
59435 716460 707932 700733 695035 691363 689438 688229 687602 688627 691706 695714 699666 704138 710291 718456
59421 718456 728421 740247 753946 769076 785238 802418 820370 838314 855732 872921 890693 910176
59409 910176 932573 957370 980287 994770 996977 988734 975054 960025 945894 934558 927970 927422
59397 927422 933585 946615 964592 982082 991988 989854 976258 955393 932008 909439 889267 871949
59385 871949 857640 846420 837851 830881 824687 819397 815580 813227 811589 809894 807873 805714 803759 802229
59371 802229 801136 800512 800590 801462 802709 803791 804704 805830 807314 809214 812116 816793 823243 830830 839358
59356 839358 849152 860006 871096 882201 894080 907373 922018 938022 955722 974769 993863 1012083
59344A012083J7576J7232J6286J4557J2676J0688Q038M847J766j314m907q415
59332A101113j0555j1469j2773j5190j7580j8797j9082j9125j8939j8308j7412
59321I21883j6493j5584j4862j4500j4051j2898j1398j0609j0753j0918j0446
59310G79371r626q850q079p354o905o549n779m614l463k219m10J759L550M913
59296G25745O417P913Q342P029M130j22n349j0068j2369j1989j0517r099p226
59283F92837m296j042J456L137M497N592O347P226Q741J0679J2413J3625J4361
59270G75573J4719J4797J4592J3812J2196J0144Q483P492O665N488L948K167K06
59257H90282j686l097l965m573n010n028m439l398k295j620j619j815j369j94
$$ plain form
59344 1012083 1029659 1046891 1063177 1077734 1090410 1101098 1109136 1113983 1115749 1114435 1109528 1101113
59332 1101113 1090558 1079089 1066316 1051126 1033546 1014749 995667 976542 957603 939295 921883
59321 921883 905390 889806 874944 860444 846393 833495 822097 811488 800735 789817 779371
59310 779371 769745 760895 752816 745462 738557 732008 726229 721615 718152 715933 715523 717282 720832 725745
59296 725745 732162 740075 748417 755446 759576 759454 754105 744037 731668 719679 709162 700063 692837
59283 692837 688541 687499 688955 692092 696589 702181 708528 715754 724495 735174 747587 761212 775573
59270 775573 790292 805089 819681 833493 845689 855833 864316 871808 878473 883961 887909 890076 890282
59257 890282 888596 885499 881534 876961 871951 866923 862484 859086 856791 855171 853552 851737 850368 850174
59243H50174Q60J377K023L186M061L991L682L809L396J161k234m982o603p972
59229H55929r336j0094j0298j0595j0852j0486j0010j0415j1224j1014r786q851
59217G32968q310o839m307k444k248k677k601k275k084j566n99N9K64J058K814
59202G01213M323M603M429N034O376P544P933P371O112N152N451O430O498N356
59188G83825M388M397M513M006L421L183K646J444K80n44j834l825n303n506n451
59173G89640o129o771o271n107m426m220l745k980k405k075j913k174k758k921
59159G35745k555k705l952n329n924o371p516q679q640p567o586o021n422m844
59145F53634m803n227n451n214m890m949n512o144n897m250k186j373j987k499
$$ plain form
59243 850174 851034 852411 854434 857620 861681 865672 869354 873163 876559 877720 875486 870504 863901 855929
59229 855929 846593 836499 826201 815606 804754 794268 784258 773843 762619 751605 741819 732968
59217 732968 724658 717819 713512 711068 708820 706143 703542 701267 699183 697617 697018 697077 697341 698399 701213
59202 701213 705536 710139 714568 719602 725978 733522 741455 748826 754938 760090 765541 771971 778469 783825
59188 783825 788213 792610 797123 801129 804550 807733 810379 811823 812103 811559 809725 805900 800597 795091 789640
59173 789640 783511 776740 770469 765362 760936 756716 752971 749991 747586 745511 743598 741424 738666 735745
59159 735745 733190 730485 726533 721204 715280 708909 701393 692714 684074 676507 669921 663900 658478 653634
59145 653634 648831 643604 638153 632939 628049 623100 617588 611444 605547 601297 599111 597738 595751 593252
59131E93252j938j004l70N63K229L744M327M707N904P588Q830R557J0141J0482
59117F58012J0568J1004J1979J2648J2488J2198J2249J1773J0134Q364P572P037
59105G86026N463L153J318M6j392k866l702m185n069o035o141n561n343n629n509
59090G44574m564l366k459j868j601j689j874j999k456l582m913n741n932n637
59076F96893m868l958l630l819l392j907n97n97j270j519j651k457l384l344k590
59061F57910k178k094j621j069j404k417k853k311j558j116q50q19j190j445r47
59046F34038j44K7l08k74Q8n8p29r97n58j11m4k4K6k74p92p59R9J145J799K180
59026F34330K737L842N667P873R637J0512J0893J1058J0484Q888P196O291N530
$$ plain form
59131 593252 591314 590310 589940 590503 592732 596476 600803 605510 611414 619002 627832 637389 647530 658012
59117 658012 668580 679584 691563 704211 716699 728897 741146 752919 763053 771417 778989 786026
59105 786026 791489 794642 795960 796006 794614 791748 788046 783861 778792 772757 766616 761055 755712 750083 744574
59090 744574 740010 736644 734185 732317 730716 729027 727153 725154 722698 719116 714203 708462 702530 696893
59076 696893 692025 688067 684437 680618 677226 675319 674722 674125 672855 671336 669685 667228 663844 660500 657910
59061 657910 655732 653638 652017 650948 649544 647127 644274 641963 640405 639289 638439 637620 636430 634985 634038
59046 634038 633894 633921 633613 633339 633427 633369 632640 631643 631085 630974 630930 630906 630932 630658 629866 629107 629206 630351 632150 634330
59026 634330 637067 640909 646576 654449 664086 674598 685491 696549 707033 715921 723117 729408 734938
59013G34938L808J543O7n61j464k809l374k535j242o09o25n67J44J727L839N524
58997G37804O081N947N943N927N147L778K932L073L461L376K923K463K074J798
58983G92727J797K093K659L749N534P527Q978R828J0654J1831J3236J4635J5885
58970I01133J6840J7445J7693J7319J6036J4323J3198J2716J1653R235O278L838
58958A057707J740n90k848m655o688r736j3199j5879j7638j9106k0256k0639k0474
58945I07739k0246j9647j8107j5954j3861j1705r156o781n299m289l018j957j979
58932G75740k573k422j408n30q8M26J009J120R18J030J308J119O42N33O37M35
58916G77896L53J101K038J943J217J513L192M796N354N584O491Q017R496J0465
$$ plain form
59013 734938 738746 740289 740356 739795 738331 735522 732148 729613 728371 727762 727137 726570 726714 728441 732280 737804
58997 737804 743885 749832 755775 761702 766849 770627 773559 776632 780093 783469 786392 788855 790929 792727
58983 792727 794524 796617 799276 803025 808559 816086 825064 834892 845546 857377 870613 885248 901133
58970 901133 917973 935418 953111 970430 986466 1000789 1013987 1026703 1038356 1047591 1053869 1057707
58958 1057707 1059447 1058857 1056009 1051354 1044666 1034930 1021731 1005852 988214 969108 948852 928213 907739
58945 907739 887493 867846 849739 833785 819924 808219 799063 792282 786983 782694 779676 777719 775740
58932 775740 773167 770745 769337 768807 768719 769145 770154 771274 772192 773222 774530 775649 776291 776824 777461 777896
58916 777896 778249 779350 781388 783331 784548 786061 789253 794049 799403 804987 811478 819495 828991 839456
58902H39456J0930J1597J3487J6440J8615J8629J7567J7350J7824J7359J5794
58891A015048J4760J5183J6399J7834J9669K1584K2537K2113K0736J8533J5400
58880A219796J2060R461P189M114M95k335m279o496r125j0905j1413j1740j2518
58867A184304j3083j2979j2671j2244j1166r716r116r752j0785j1750j3018j4371
58855A043653j4895j4648j4768j5491j5783j5311j4994j5072j4482j2878j1544
58844H83787j1439j1929j2180j2387j2782j2871j2424j1975j1617j0565q582o596
58832G48440n363m643m146l929l587k332l85J133J981L103M795O130O626O891
58818G54714P213P125O740O890P430P124N729M457L798K810J188P8o0m98k078
$$ plain form
58902 839456 850386 861983 875470 891910 910525 929154 946721 964071 981895 999254 1015048
58891 1015048 1029808 1044991 1061390 1079224 1098893 1120477 1143014 1165127 1185863 1204396 1219796
58880 1219796 1231856 1241317 1248506 1252620 1253115 1250780 1246501 1240005 1230880 1219975 1208562 1196822 1184304
58867 1184304 1171221 1158242 1145571 1133327 1122161 1112445 1103329 1093577 1082792 1071042 1058024 1043653
58855 1043653 1028758 1014110 999342 983851 968068 952757 937763 922691 908209 895331 883787
58844 883787 872348 860419 848239 835852 823070 810199 797775 785800 774183 763618 755036 748440
58832 748440 743077 738434 734288 730359 726772 724440 724055 725188 727169 730272 735067 741197 747823 754714
58818 754714 761927 769052 775792 782682 790112 797236 802965 807422 811220 814030 815218 815296 815236 814738 812660
58803H12660l820m765n481o532p149o783o401o851p314o807n991n958o305n889
58789G26614m626l276k073p95M55J539K843M682O640Q056Q633Q248P003N725N402
58774G75070N699N143L111M93j958m578p601j0333j2173j3220j3392j2253j0288
58761G03720q952q771q630p592o167n134m371l564k827k105j111k69l68r71o50
58746F42238Q06K102K738L764N573O920O990O676O840O972O613O404O728O863
58732G18227O484O421O951O971O006N345N984O926O746N562M249L104K357K721
58718G94054M269N896O796P372P987Q173P688O901N626L252L94j474k635n074
58704H49225r150j2676j4383j5689j7781j9488j9752j9794k0763k1441k0332j8140
$$ plain form
58803 812660 808840 804075 798594 792062 784913 778130 771729 764878 757564 750757 744766 738808 732503 726614
58789 726614 721988 718712 716639 715844 716299 717838 720681 725363 732003 740059 748692 756940 763943 769668 775070
58774 775070 780769 785912 789023 789516 787558 782980 775379 765046 752873 739653 726261 714008 703720
58761 703720 694768 685997 677367 669775 663608 658474 654103 650539 647712 645607 644496 644227 643859 642888 642238
58746 642238 643044 645146 647884 651648 657221 664141 671131 677807 684647 691619 698232 704636 711364 718227
58732 718227 724711 731132 738083 745054 751060 756405 762389 769315 776061 781623 785872 788976 791333 794054
58718 794054 798323 804219 811015 818387 826374 834547 842235 849136 854762 858014 858408 856934 854299 849225
58704 849225 840075 827399 813016 797327 779546 760058 740306 720512 699749 678308 657976 639836
58692F39836j6209j4251j1669r341q062o915n181m125m759n572m741l028k181
58679E43802j974j212l23l73p02nJ139J242N56N30J360K251L280M922O465O987
58663E67945P242Q456R946R970Q306N983L076r56n240p913q550q406q394q348
58649E73117q093p766p224o262n145m075k768j367p14q57n23Q46J899J574R52
58634E33594J363K099J842J073J071J533J193mj074j634j877j668j099r10j139
58619E34363n51J308K966L333L553M838O177O098N186M830M895M667M561M858
58605E91082M276K049l7l0J200J634J325J445J608Q70Q7N67J445J194O32J682
58589F11029M055N992P383R287J1189J1670J1283J1798J3088J3452J2619J1780
$$ plain form
58692 639836 623627 609376 597707 588366 580304 573389 568208 564083 559324 553752 549011 545983 543802
58679 543802 541828 540616 540293 539920 539218 539213 540352 541594 542150 542680 544040 546291 549571 554493 560958 567945
58663 567945 575187 583643 593589 603559 611865 617848 620924 619968 614728 606815 598265 589859 581465 573117
58649 573117 565024 557258 550034 543772 538627 534552 531784 530417 529703 528846 528323 529169 531068 532642 533594
58634 533594 534957 537056 538898 539971 541042 542575 543768 543764 542690 541056 539179 537511 536412 535502 534363
58619 534363 533812 535120 538086 541419 544972 549810 555987 562085 567271 572101 576996 581663 586224 591082
58605 591082 595358 597407 597370 597340 598540 600174 601499 602944 604552 605422 605509 606076 607521 608715 609347 611029
58589 611029 615084 621076 628459 637746 648935 660605 671888 683686 696774 710226 722845 734625
58577G34625J1077R731Q301Q097Q652Q352P361P462R103J1052J2846J5334J8850
58564H70843K2760K6626L0042L1982L2027L1444L1098K9471K4814J8020J1065
58553A160192M100l276r352j2112j2587j3211j3750j2283r305p394p275p676q679
58540A047392j1663j6061j9620k1937k4514k7264k8226k6923k4962k3094k0554
58529H02574j7546j5338j3809j1633r057p620p211o235m743m306m805m389k863
58516F93019k013k335k389j714j504k013k077j521j401j684j326o15p22j081j54
58501F70470J356J260k16o13N86J285O07J5K47L47L76J860M882P571R110J0456
58485G09599J1779J2134J1925J2730J4391J5264J5494J6873J9281K0541K0050
$$ plain form
58577 734625 745702 755433 763734 771831 780483 788835 796196 803658 812761 823813 836659 851993 870843
58564 870843 893603 920229 950271 982253 1014280 1045724 1076822 1106293 1131107 1149127 1160192
58553 1160192 1164292 1161016 1151664 1139552 1126965 1113754 1100004 1087721 1078416 1071022 1063747 1056071 1047392
58540 1047392 1035729 1019668 1000048 978111 953597 926333 898107 871184 846222 823128 802574
58529 802574 785028 769690 755881 744248 735191 727571 720360 714125 709382 705076 700271 695882 693019
58516 693019 691006 688671 686282 684568 683064 681051 678974 677453 676052 674368 673042 672427 671705 670624 670470
58501 670470 671826 673086 672870 672257 672843 674128 674735 674750 674997 675344 675720 677580 682462 690033 699143 709599
58485 709599 721378 733512 745437 758167 772558 787822 803316 820189 839470 860011 880061
58474H80061J9140J7592J3424O686l2n399j0311j4504j6000j4695j2936j1619
58462H51407r114m957j113J456M098P351R826J1193J2986J5418J6594J5817J4440
58449I45402J2624Q675K502l636q726j3881j8747k0835j9645j7886j7172j5903
58437H32772j2783r109o150l399p66N64O40J100K132K254J851L372P001R793J0174
58422H39446R733R487Q099N103K129l70l921q327j0925j0969j0972j2186j2590
58409H03737j0891q817p772o887n883o179p562p463n115k851j831m10J962L216
58395G37254K671K535L787M519L907L697M266L524J402Q95K817M055K999K152
58381G80480L197M147L775M177O367P805P006O322P466Q577Q345Q689J0640J1833
$$ plain form
58474 880061 899201 916793 930217 936903 936871 931472 921161 906657 890657 875962 863026 851407
58462 851407 842293 837336 836223 837679 841777 849128 858954 870147 883133 898551 915145 930962 945402
58449 945402 958026 966701 969203 965567 956841 942960 924213 903378 883733 865847 848675 832772
58437 832772 819989 810880 804730 801331 800565 801129 801769 802869 805001 807255 809106 812478 819479 829272 839446
58422 839446 849179 858666 866765 871868 873997 873627 869706 861379 850454 839485 828513 816327 803737
58409 803737 792846 784029 776257 769370 763487 757308 749746 742283 737168 734317 732486 732076 734038 737254
58395 737254 739925 742460 746247 750766 754673 758370 762636 766160 767562 768457 771274 775329 778328 780480
58381 780480 783677 787824 791599 795776 802143 809948 816954 823276 830742 839319 847664 856353 866993 878826
58367H78826J0901J0075J0874J1503J1116J2072J5098J6898J5505J3644J3642
58356A020154J3546J1379Q724O937M278O9k759k481j591j938j408J394L869M154
58342A064327M424O212P212O164O003Q584J1134J1553J2320J5353J8048J8227
58330A189561J8085J9323J9351J6379J3190J1853R759N070Q37m48j173l312m212
58317A294263k017K35L79J332M984P813P372P192J0122J2814J2137J1050J2552
58304A380228J3860J2430J1674J4587J7587J6963J5613J7038J8607J7289J6191
58293A552067J8631K1496K1274K0944K3944K7142K6757K5523K6942K8295K6560
58282A819575K5178K7584L0051K8419K5759K5878K5685K1795J8204J9253K1736
$$ plain form
58367 878826 889727 899802 910676 922179 933295 945367 960465 977363 992868 1006512 1020154
58356 1020154 1033700 1045079 1053803 1060740 1065018 1065087 1062328 1059847 1058256 1056318 1054910 1056304 1060173 1064327
58342 1064327 1068751 1074963 1082175 1088339 1094342 1102926 1114060 1125613 1137933 1153286 1171334 1189561
58330 1189561 1207646 1226969 1246320 1262699 1275889 1287742 1297501 1302571 1303408 1302960 1301787 1298475 1294263
58317 1294263 1292246 1292481 1292860 1294192 1299176 1306989 1314361 1321553 1331675 1344489 1356626 1367676 1380228
58304 1380228 1394088 1406518 1418192 1432779 1450366 1467329 1482942 1499980 1518587 1535876 1552067
58293 1552067 1570698 1592194 1613468 1634412 1658356 1685498 1712255 1737778 1764720 1793015 1819575
58282 1819575 1844753 1872337 1902388 1930807 1956566 1982444 2008129 2029924 2048128 2067381 2089117
58271B089117K2079K4298L2075M0088M2458M2852M6849N1443N1894N1672N5429
58260B550254N9209N8111N6544O0087O4468O3630O1358O3600O6776O5506O4272
58249C233815O9247P6126P8492Q0335Q7595R5572R8078J00576J10224J21511J26365
58238D277936J29712J39761J51932J58334J63977J76845J91304J98850K05772
58229E794423K21896K41632K55205K68465K91495L18119L38030L58409L91096
58220H478770M29311M60878M93161N39923N95338O47603P05920P85727Q80249
58211A4016880R76982J088846J236686J416076J617195J862715K188502K603956
58203B7007838L111897L745537M535212N458000O475099P597831Q854176J0212803
$$ plain form
58271 2089117 2111196 2135494 2167569 2207657 2250115 2292967 2339816 2391259 2443153 2494825 2550254
58260 2550254 2609463 2667574 2724118 2784205 2848673 2912303 2973661 3037261 3104037 3169543 3233815
58249 3233815 3303062 3379188 3457680 3538015 3625610 3721182 3819260 3919836 4030060 4151571 4277936
58238 4277936 4407648 4547409 4699341 4857675 5021652 5198497 5389801 5588651 5794423
58229 5794423 6016319 6257951 6513156 6781621 7073116 7391235 7729265 8087674 8478770
58220 8478770 8908081 9368959 9862120 10402043 10997381 11644984 12350904 13136631 14016880
58211 14016880 14993862 16082708 17319394 18735470 20352665 22215380 24403882 27007838
58203 27007838 30119735 33865272 38400484 43858484 50333583 57931414 66785590 76998393
58195G6998393J1614350J3060655J4600668J6265200J8118450K0335440K3085853
58188A94079009K6345996K9921982L3472820L6064214L5634213K9594761J6851450
58181D01964445n00998j7841266l0769164l7479249l8897165l7115742l3905722
58174B05455139l0236123k6490327k2799474j9265846j6039163j3250251j0922656
58167F6451299q997446p421316o161485n161391m347593l678746l142608k712102
58159B4828612k347153k033063j776540j568271j385021j222804j093102r90418
58151A2412240q95408q05856p34173o77734o20414n60461n09764m68128m23925
58142F716377l77943l42028l15770k87547k57090k35120k22163k08589j93939
$$ plain form
58195 76998393 88612743 101673398 116274066 132539266 150657716 170993156 194079009
58188 194079009 220425005 250346987 283819807 319884021 355518234 385112995 401964445
58181 401964445 401463447 383622181 352853017 315373768 276476603 239360861 205455139
58174 205455139 175219016 148728689 125929215 106663369 90624206 77373955 66451299
58167 66451299 57453853 50032537 43871052 38709661 34362068 30683322 27540714 24828612
58159 24828612 22481459 20448396 18671856 17103585 15718564 14495760 13402658 12412240
58151 12412240 11516832 10710976 9976803 9299069 8678655 8118194 7608430 7140302 6716377
58142 6716377 6338434 5996406 5680636 5393089 5135999 4900879 4678716 4470127 4276188
58133D276188j86062j82626j73159j58272j47999j42369j32090j17509j08582
58124B927520j06330j01750r3049q7339q5231p9905p1714o8118o8755o5587n8137
58113B041605n4002n3969n0974m4407m1416m3182m3362m0985m1678m5277m5128
58102A537225m0824l9119m1061m0394l5957l3798l5613l6682l6519l9975m6131
58091A111152m7429m1855l5520l1396k5901j8269j3006j1062q325m651m756q557
58079H60425j0248q641q827j1870j2566r524p922r745j0512q369p582r996j1491
58066G33132r909q706r752r998q044o857p501p060n092n178p896r231p978p787
58052F22143r830j0472q457p395q698q887o460m780n512n629l615k537m080n452
$$ plain form
58133 4276188 4090126 3907500 3734341 3576069 3428070 3285701 3153611 3036102 2927520
58124 2927520 2821190 2719440 2626391 2539052 2453821 2373916 2302202 2234084 2165329 2099742 2041605
58113 2041605 1987603 1933634 1882660 1838253 1796837 1753655 1710293 1669308 1627630 1582353 1537225
58102 1537225 1496401 1457282 1416221 1375827 1339870 1306072 1270459 1233777 1197258 1157283 1111152
58091 1111152 1063723 1021868 986348 954952 929051 910782 897776 886714 878389 873738 868982 860425
58079 860425 850177 841536 832709 820839 808273 798749 790827 781082 770570 762201 754619 744623 733132
58066 733132 723223 714517 704765 694767 686723 679866 672365 665305 660213 655035 647139 637908 629930 622143
58052 622143 612313 601841 593384 585989 577291 568404 561944 557164 551652 546023 542408 539871 535791 530339
58038E30339m860m500n586n835m365l818n276o193n417n204o356o544n252n147
58024D55986o787p222n604m863n932n809l372j686k445l249k629k580l908m127
58010C95773k266r41j440j487K7Q56k0l13J037J877J277J302K477K322L08n30
57994D00259R88J975P93k70K41K72j320k367j745j575k771k923r72N05Nl61O83
57977C91417J193M21Q76L364M652K901R43J216J884J015L48J520K515J317n74
57962D15008j408k426m738o364n593m068l705l634k954l120m847n933m907l694
57948C57617l927l990k414q37o97l51J550L033K364J477K705M909N975O373P255
57933C81042P670O709N886O448O724M964K324N16j064l256m850n015n335o880
$$ plain form
58038 530339 525479 520979 515393 509558 505193 501375 496099 489906 484489 479285 472929 466385 461133 455986
58024 455986 449199 441977 436373 431510 425578 419769 416397 414711 412266 409017 406388 403808 399900 395773
58010 395773 393507 392566 391126 389639 389666 390522 390502 390189 391226 393103 394380 395682 398159 400481 400789 400259
57994 400259 401247 403222 404015 403745 403986 404258 402938 400571 398826 397251 394480 391557 390585 391090 391095 390734 391417
57977 391417 392610 393031 393907 397271 401923 404824 405767 406983 408867 409882 410230 411750 414265 415582 415008
57962 415008 413600 411174 406436 400072 394479 390411 386706 383072 380118 376998 372151 366218 361311 357617
57948 357617 353690 349700 347286 346449 345752 345401 346951 349984 352348 353825 356530 361439 367414 373787 381042
57933 381042 388712 395421 401307 407755 414479 419443 421767 422283 421219 417963 413113 408098 402763 395883
57919C95883p886p056o308p440q743p954o005m826l903k098n37n77r82j27J010
57904C32451Q34N6p6l66j743k852k282j216j206j369m56M87K12o0J183K893L513
57887C30003L781M764N291M107K598K463K733J894R32J309J891R61m91n80O3k59
57871C61460j099j084p95j498k404k062j127r70j012j25Q08M97p3O80K034K465
57855C55695K527L512M623M386L454L288L332K271P35J18K5n21q02J1O41j85j048
57838C82062k18R71L07j300j329J20R56R08J317K067J953J416J754K319J522q0
57822C94745o76m52r72k008k030j267j326k220k663k699l300l979l709l603n578
57807C58263q789j0430r773q587p783o638n148m315m043l274k223k010k295j694
$$ plain form
57919 395883 387997 380941 374633 367193 358450 350496 344491 339665 335762 333664 333127 332550 331568 331441 332451
57904 332451 333285 333341 333265 332899 331156 328304 326022 324806 323600 322231 321775 322262 322474 322414 323597 326490 330003
57887 330003 333784 338548 343839 347946 350544 353007 355740 357634 358566 359875 361766 362727 362236 361656 361719 361460
57871 361460 360361 359277 358482 356984 354580 352518 351391 350421 349409 349284 350092 350589 350516 351196 353230 355695
57855 355695 358222 361734 366357 370743 374197 377485 380817 383088 383823 383941 383966 383445 382643 382654 383295 383110 382062
57838 382062 381844 382815 383122 381822 380493 380613 381569 382477 383794 385861 387814 389230 390984 393303 394825 394745
57822 394745 394069 393617 392645 390637 388607 387340 386014 383794 381131 378432 375132 371153 367444 363841 358263
57807 358263 349474 339044 329271 320684 312901 306263 301115 296800 292757 289483 287260 285250 282955 281261
57793B81261l54L02J75M64J357K009K441L102L226K013Q08J414K877K837J516
57778C05448J332K815M032M061M004M351M236L623L511L663K692P36m80n92j061
57763C42371k384l264l012k463k071j258m6O95Q62J110J231O46L20J794M308N331
57747C44170M134K517J787J459J244J801K936L255K279J006k3j265k527k870k429
57732C57474k419k944k813j742q07m98k15Q7k40r02q54k33j21l83J33J198J305
57715C46026L14l10j03j26n30o1J424K255J518L71P8M79R66J320J245O38M52J520
57697C57476K686K152N18J33J378K117J117n26j783l039m332m676l908l103k477
57682C43733r97J412L495N065P460J0968J4137J6444J9316K3569K8064L1889L5838
$$ plain form
57793 281261 280907 281209 281384 281848 283205 285214 287655 290757 293983 295996 296804 298218 301095 303932 305448
57778 305448 306780 309595 313627 317688 321692 326043 330279 333902 337413 341076 343768 344504 344024 343432 342371
57763 342371 339987 336723 333711 331248 329177 327919 327873 328568 329430 330540 331771 332417 332737 334531 338839 344170
57747 344170 348304 350821 352608 354067 355311 357112 360048 363303 365582 366588 366565 365300 362773 359903 357474
57732 357474 355055 352111 349298 347556 346749 346251 346036 346123 345883 344981 344127 343894 343773 343390 343523 344721 346026
57715 346026 346340 346030 345927 345801 345271 345210 346634 348889 350407 350778 350856 351335 352301 353621 354866 355504 355956 357476
57697 357476 360162 362314 362832 362965 364343 366460 367577 367051 365268 362229 357897 353221 349313 346210 343733
57682 343733 342736 344148 347643 352708 360168 371136 385273 401717 421033 444602 472666 504555 540393
57669E40393M0733M6279N2534O0306O8785P4229P1972N8723L3396j380l7816o6036
57657I42118q0709q3596p9303p0854o0105m9372m0291l2651k5937k0681j7153
57646C81466j4301j1228q349o098m037k093j149j394j774j816k270l205l386k531
57632C17835k158l051l826l256k140j569j135l00J47m91j402j627j542j790k074
57617B91621k080k258k706k629j822j200j133q52k16k44j094j481j046j085j962
57602B69813k045n64Q10P37K90O61R63K43m27K1M76l33j358j039j00k46j320j969
57584B64613j946j777j212m3O94K34l05K08O71n15k585l545l257l129l478l445
57568B41183k987k818k786k202j433j285j314n50N21N69l14p74m38k09l87k10
$$ plain form
57669 540393 581126 627405 679939 740245 809030 883259 955231 1013954 1047350 1045970 1008154 942118
57657 942118 861409 777813 698510 627656 567551 518179 477888 445237 419300 398619 381466
57646 381466 367165 355937 347588 341490 337453 335360 334211 332817 331043 329227 326957 323752 320366 317835
57632 317835 315677 312626 308800 305544 303404 301835 300700 300400 300547 300056 298654 297027 295485 293695 291621
57617 291621 289541 287283 284577 281948 280126 278926 277793 276941 276725 276481 275387 273906 272860 271775 269813
57602 269813 267768 267204 268014 268751 269041 269702 270665 270908 270481 270502 270978 270645 269287 268248 268148 267902 266582 264613
57584 264613 262667 260890 259678 259635 260329 260563 260258 260466 261137 260622 258037 254492 251235 248106 244628 241183
57568 241183 238196 235378 232592 230390 228957 227672 226358 225808 226329 226898 226584 225810 225372 225163 224776 224566
57552B24566O59J603K166K552L008L558M193M516L766J923K58j89K5j27n23m68
57536B51486j04m0k31l72p14j356j535p32L10P38Q44J113J084M17L0O38J302R70
57518B53848M36R47J878J724O90K97Q72J394J490J688J928J588Q88O86R37Q41
57502B72132L51J07O8l49r25r04m44m33r33j116p13k67p7K0l6l13l03L83J043
57483B67291P60j34o08n28m31k12N40J291J036o1q67r56q91j015j203j644k626
57466B59742l636l753k897j728n41P43J780K042J629J021L99n0J84J097J705J448
57450B59185J204J807K524K340J819K068K640K310J289Q79J261J479J342J601
57436B83748K321K692K526K427K549K487K283K270K166J590J120J505K167J989
$$ plain form
57552 224566 225225 226828 228994 231546 234554 238112 242305 246821 250587 252510 252768 252579 252604 252477 251954 251486
57536 251486 251382 251342 251111 250739 250025 248669 247134 246402 246712 247450 248294 249407 250491 250908 250938 251576 252878 253848
57518 253848 254284 255231 257109 258833 259523 259820 260692 262086 263576 265264 267192 268780 269668 270354 271291 272132
57502 272132 272483 272590 272658 272309 271384 270480 270036 269603 268670 267554 266841 266574 266497 266517 266481 266168 265865 266248 267291
57483 267291 268051 267917 267309 266781 266350 266138 266678 267969 269005 268944 268077 267121 266230 265215 264012 262368 259742
57466 259742 256106 252353 249456 247728 247187 247930 249710 251752 253381 254402 254801 254751 254935 256032 257737 259185
57450 259185 260389 262196 264720 267060 268879 270947 273587 275897 277186 278065 279326 280805 282147 283748
57436 283748 286069 288761 291287 293714 296263 298750 301033 303303 305469 307059 308179 309684 311851 313840
57422C13840J158P22O84K01o14q05l13NJ6L87J128J593J903K765L980M626M617
57405C35893M547M191K780P11p41j302j728k029j425n5J016J553K281L182L396
57390C52270K873K506K508K373K406L465N040N556M889M584N201N412M371L050
57376D06504K390J913J119P06J277K076K098J410O44k2o53j063j064o41K99J642
57360D18635K659K784K634L107L752L392K217J656K252L191M012N015N902N732
57346D66940M634L920M065M191L841L603L579L003J894J418J960K459K288K132
57332E09927K368K274J679J729K994M267M395L952M033M527M666M394M150M033
57318E59388L940L960M136M418M988N857O199N246L828L573M556N254N019M841
$$ plain form
57422 313840 314998 315720 316404 316605 315991 315186 314873 314878 314894 315281 316409 318002 319905 322670 326650 331276 335893
57405 335893 340440 344631 347411 348122 347381 346079 344351 342322 340897 340842 341858 343411 345692 348874 352270
57390 352270 355143 357649 360157 362530 364936 368401 373441 378997 383886 388470 393671 399083 403454 406504
57376 406504 408894 410807 411926 412632 413909 415985 418083 419493 420137 420115 419462 418399 417335 416694 416993 418635
57360 418635 421294 424078 426712 429819 433571 436963 439180 440836 443088 446279 450291 455306 461208 466940
57346 466940 471574 475494 479559 483750 487591 491194 494773 497776 499670 501088 503048 505507 507795 509927
57332 509927 512295 514569 516248 517977 520971 525238 529633 533585 537618 542145 546811 551205 555355 559388
57318 559388 563328 567288 571424 575842 580830 586687 592886 598132 601960 605533 610089 615343 620362 625203
57304F25203N301N626N417N513O339P033O982O779O845O678O244O526P723Q499
57290G16708Q067P530Q066R163R771R893R907R584Q912Q750R527J0358J0431J0244
57276H46911J0468J0723J0462R998R756R491R175R500J0643J1620J1817J1947
57264I72511J2649J3309J3261J2937J2827J2494J1678J1181J1583J2187J2288
57253A108905J2384J3024J3590J3371J2804J2604J2627J2649J3152J4322J5342
57242A254774J5670J5960J6695J7122J6631J5929J5663J5219J4168J3631J4692
57231A426154J6585J7908J8638J9407J9864J9340J8354J7895J7891J7812J8102
57220A627950J9407K1065K1758K1291K0441J9630J8898J8629J9053J9587J9720
$$ plain form
57304 625203 630504 636130 641547 647060 653399 660432 667414 674193 681038 687716 693960 700486 708209 716708
57290 716708 724775 732305 740371 749534 759305 769198 779105 788689 797601 806351 815878 826236 836667 846911
57276 846911 857379 868102 878564 888562 898318 907809 916984 926484 937127 948747 960564 972511
57264 972511 985160 998469 1011730 1024667 1037494 1049988 1061666 1072847 1084430 1096617 1108905
57253 1108905 1121289 1134313 1147903 1161274 1174078 1186682 1199309 1211958 1225110 1239432 1254774
57242 1254774 1270444 1286404 1303099 1320221 1336852 1352781 1368444 1383663 1397831 1411462 1426154
57231 1426154 1442739 1460647 1479285 1498692 1518556 1537896 1556250 1574145 1592036 1609848 1627950
57220 1627950 1647357 1668422 1690180 1711471 1731912 1751542 1770440 1789069 1808122 1827709 1847429
57209A847429J9971K0901K1980K2499K2813K3476K4018K3832K3546K4090K5106
57198B099661K5568K5402K5200K4949K4299K3574K3278K3078K2410K1491K0727
57187B359637J9817J8577J7812J8131J8584J7876J6367J5542J5996J7125J8365
57176B553829J9576K0572K1313K2088K2776K2541K1065J9264J8072J7430J7278
57165B775804J8250K0304K2037K2555K2839K3883K4887K4842K4552K5226K6246
57154C031425K6239K5482K5354K6128K7104K8158K9396L0126K9955L0087L1720
57143C341174L3950L5258L6151L8276M1590M4631M6977M9264N1175N1768N1462
57132C821676N1549N1856N1014M8968M7133M6161M5546M5515M7234N0980N5867
$$ plain form
57209 1847429 1867400 1888301 1910281 1932780 1955593 1979069 2003087 2026919 2050465 2074555 2099661
57198 2099661 2125229 2150631 2175831 2200780 2225079 2248653 2271931 2295009 2317419 2338910 2359637
57187 2359637 2379454 2398031 2415843 2433974 2452558 2470434 2486801 2502343 2518339 2535464 2553829
57176 2553829 2573405 2593977 2615290 2637378 2660154 2682695 2703760 2723024 2741096 2758526 2775804
57165 2775804 2794054 2814358 2836395 2858950 2881789 2905672 2930559 2955401 2979953 3005179 3031425
57154 3031425 3057664 3083146 3108500 3134628 3161732 3189890 3219286 3249412 3279367 3309454 3341174
57143 3341174 3375124 3410382 3446533 3484809 3526399 3571030 3618007 3667271 3718446 3770214 3821676
57132 3821676 3873225 3925081 3976095 4025063 4072196 4118357 4163903 4209418 4256652 4307632 4363499
57121D363499O1577O8703P7261Q6491R6189J06711J17603J27740J36929J46200
57111E388903J56779J70061J88185K13174K45739K86135L35695L96494M70632
57102G851797N61624O75604Q19437R98076J214265J468408J756382K069462K399324
57093A9814379K742099L095609L455095L814236M167194M505476M814701N074879
57085E1483668N251395N271277N016748M376298L334068K016328O39427o01736
57077G6787473j613445k403244l028082l543350l979080m339334m612287m781341
57069D8487310m832708m759987m567993m274453l906850l495970l070546k654545
57061A6924258k265816j916056j612274j357749j150971r85112q50657p39118
$$ plain form
57121 4363499 4425076 4493779 4571040 4657531 4753720 4860431 4978034 5105774 5242703 5388903
57111 5388903 5545682 5715743 5903928 6117102 6362841 6648976 6984671 7381165 7851797
57102 7851797 8413421 9089025 9908462 10906538 12120803 13589211 15345593 17415055 19814379
57093 19814379 22556478 25652087 29107182 32921418 37088612 41594088 46408789 51483668
57085 51483668 56735063 62006340 67023088 71399386 74733454 76749782 77389209 76787473
57077 76787473 75174028 72770784 69742702 66199352 62220272 57880938 53268651 48487310
57069 48487310 43654602 38894615 34326622 30052169 26145319 22649349 19578803 16924258
57061 16924258 14658442 12742386 11130112 9772363 8621392 7636280 6785623 6046505
57053F046505o44314n61744m88592m23985l67904l19809k78819k44340k15493
57044B501505j90659j68602j49475j33753j20861j09706r9783r0825q2068p2994
57034A282779o4083n5905m8220m0780l4038k8041k1666j4252o765L11Q945K0530
57022I98815L0809L0663J3969j5812m7584p0678q0973q0753p4566o5891n6566
57011E81433m7675l9902l3415k8185k4338k1773j9707j7397j5066j3365j2204
57000C08406j1143j0609j1355j2765j3247j2471j1756j1833j1804j0912r708q649
56988A72154p024m274j199J322L698O546R145J0008Q350M215j947q845j4415j7388
56974A60346j8286j8126j6882j4139j0391o715l597r37J303L224N227P454R541
$$ plain form
57053 6046505 5402191 4840447 4351855 3927870 3559966 3240157 2961338 2716998 2501505
57044 2501505 2310846 2142244 1992769 1859016 1738155 1628449 1528666 1437841 1355773 1282779
57034 1282779 1218696 1162791 1114571 1073791 1039753 1011712 990046 975794 969029 969340 978285 998815
57022 998815 1029624 1060287 1074256 1058444 1010860 940182 859209 778456 703890 637999 581433
57011 581433 533758 493856 460441 432256 407918 386145 366438 349041 333975 320610 308406
57000 308406 297263 286654 275299 262534 249287 236816 225060 213227 201423 190511 180803 172154
56988 172154 165130 160856 159657 160979 164677 171223 180368 190376 198726 202941 200994 192149 177734 160346
56974 160346 142060 123934 107052 92913 82522 75807 72210 71273 72576 75800 81027 88481 98022
56961I8022J1392J3498J6025J8499K0841K3550K6003K5683K0329J0357j609j2806
56949B69784k1295k5845k6361k4099k0640j6760j2665q614m718q04K922N813P794
56936A24512R741J2319J5339J8654K2645K7163L0971L2698L1289K5216J3130l522
56924C60155j9952l1575l7318l8579l6524l1932k6435k1845j8519j5780j3473
56913F8223j1840j0475q742o917n675m865l845k695k042j990k092j986j362Q2
56899C779J945L036K884K529L076M299N589P207R427J1417J2349J2889J4270J6487
56885A11183J8576J9920K0003J7637J2098M603k625q389j2504j4548j4071j1613
56873A40270q179m085M87M486P064R101J2092J5839J8888K1004K3541K7360L1939
$$ plain form
56961 98022 109414 122912 138937 157436 178277 201827 227830 253513 273842 284199 282590 269784
56949 269784 248489 222644 196283 172184 151544 134784 122119 113505 108787 107983 110905 116718 124512
56936 124512 134253 146572 161911 180565 203210 230373 261344 294042 325331 350547 363677 360155
56924 360155 340203 308628 271310 232731 196207 164275 137840 115995 97476 81696 68223
56913 68223 56383 45908 37166 30249 24574 19709 15864 13169 11127 9137 7045 5059 3697 3779
56899 3779 5724 8760 11644 14173 17249 21548 27137 34344 43771 55188 67537 80426 94696 111183
56885 111183 129759 149679 169682 187319 199417 204020 201395 193006 180502 165954 151883 140270
56873 140270 132091 128006 128493 132979 140043 149144 161236 177075 195963 216967 240508 267868 299807
56860B99807L6704M1621M5855M6963M2128L0102J2191p834k5183l6480m1201m0630
56848D04043l6155k9124k1279j3921o959J40O939J2704J7873K3528K9709L5624
56836D23122M1343M7960N6069O4968P2941P7007P2736N6294K7854p196m0658o5285
56824H27155p7645p8908p3168o4180n3562m1991l0795k1294j3418o283L69O383
56812C72663J2185J8286K4357K9898L5446M1816M8378N2860N2268M3470K4639
56801G56266j999k9564n0747o2590o6267o3659n6272m6573l7358k9384k1617j3960
56789B76276p807l716m82L010O720J0566J4899J9419K3149K5862K7889K8027K3404
56776D47216J2528k559j7806k9910l7243l9579l7941l4176k9867k5858k2609k0257
$$ plain form
56860 299807 336511 378132 423987 470950 513078 543180 555371 547537 522354 485874 444673 404043
56848 404043 367888 338764 317485 303564 296605 296745 303684 316388 334261 357789 387498 423122
56836 423122 464465 512425 568494 633462 706403 783410 856146 912440 940294 933098 892440 827155
56824 827155 749510 670602 597434 533254 479692 437701 406906 385612 372194 365911 366280 372663
56812 372663 384848 403134 427491 457389 492835 534651 583029 635889 688157 731627 756266
56801 756266 754267 724703 673956 611366 545099 481440 425168 378595 341237 311853 290236 276276
56789 276276 268469 264753 264271 267281 274001 284567 299466 318885 342034 367896 395785 423812 447216
56776 447216 459744 457185 439379 409469 372226 332647 294706 260530 230663 204805 182196 161939
56764A61939j8274j5932j3246j0769q634o659n207m811n092n085m583m073l534
56751E6040k495j296r16j442j825j362m38K97N67K45m82q75m16L44O22O88J178
56734D8434J600R82k43n83L41J448J960K104K025J517R07Q18R22L53o38q58r1
56717F0998O73R99J453K109K183J473P85N43M11M46J206K390K804K150J477J497
56701H3597J701J509J107P54M40M32J046J733J628J008R33J456J642J381J467
56686A01834J898J745J029R13J704K291K066J680J536J139N01M30R19Q72K6n73
56670A20010n24q10j794k302j569n11q5R3N69Q91O24J74k00r29j876j978r33J13
56652A08963M41Q21J778K320J560K65m91r70j788k341j702k81O61P49O38Q50J288
$$ plain form
56764 161939 143665 127733 114487 103718 95084 88425 83218 78407 73315 68230 63647 59574 56040
56751 56040 53545 52249 51333 49891 48066 46704 46266 46563 47130 47375 46893 46018 45602 45946 46568 47256 48434
56734 48434 50034 51016 50773 50190 50531 51979 53939 56043 58068 59585 60492 61310 62232 62585 61947 61089 60998
56717 60998 61671 62670 64123 66232 68415 69888 70673 71216 71627 72073 73279 75669 78473 80623 82100 83597
56701 83597 85298 86807 87914 88668 89108 89540 90586 92319 93947 94955 95888 97344 98986 100367 101834
56686 101834 103732 105477 106506 107419 109123 111414 113480 115160 116696 117835 118336 118766 119685 120557 120583 120010
56670 120010 119486 118676 116882 114580 113011 112500 112415 112508 113077 113968 114592 114766 114566 113637 111761 109783 108850 108963
56652 108963 109404 110225 112003 114323 115883 116148 115657 114687 112899 110558 108856 108575 109236 109985 110623 111473 112761
56635A12761J568J277K81r27j632j787j806j633j003m90r56j893j807n40L82Q3
56619A01878n01m34j43k80n69o25p03r05p45j57K17J33Q1J79Nk66N6P04O70P7
56599I8672J31R11J192P90J001K041K331J203J21J15J95m40p07L50J644J823J272
56582A12645R39O91K58L15J150J751J575J703K885M007L950L441L551L946M107
56567A46914M703O121P175O982O702P653R146J0009J0845J2743J4949J5730J4582
56554B74254J1874P540K039k563m542m731m941n142m268k842k542l559m445m385
56540B51747l950l738l804m174m737m922m514m225m493m554l770k843k555k418
56526A97050j898j790k830l993l910k995k539k581k319j869j859k055j990k240
$$ plain form
56635 112761 114329 115606 115887 114960 113328 111541 109735 108102 107099 106609 105653 103760 101953 101413 101795 101878
56619 101878 101377 100943 100800 100520 99951 99326 98623 97718 96973 96816 97033 97166 97247 97426 97431 97165 97221 97925 98595 98672
56599 98672 98803 99714 100906 101696 102697 104738 107069 108272 108393 108508 108703 108263 107556 107906 109550 111373 112645
56582 112645 113584 114275 114533 114848 115998 117749 119324 121027 123912 127919 131869 135310 138861 142807 146914
56567 146914 151617 157738 164913 171895 178597 186250 195396 205405 216250 228993 243942 259672 274254
56554 274254 286128 293668 295707 293144 288602 283871 278930 273788 269520 266678 264136 260577 256132 251747
56540 251747 247797 244059 240255 236081 231344 226422 221908 217683 213190 208636 204866 202023 199468 197050
56526 197050 195152 193362 190532 186539 182629 179634 177095 174514 172195 170326 168467 166412 164422 162182
56512A62182l377m424m037k648j749j645j485r58m62l5M14L85l84j021p71k97
56496A39688m96q61n08J29J40j83j20o5o99j409j214m33J10O83J746K431J710
56479A40649L86j3M37N93L70N00P73M32j44L7Q07J219J193J209R78Q7p17n89k33
56460A47974p51j550j292k75R0k12J53J552K875L275K865J929Q29L80J015J951
56444A60808K279K208K116J461o8j405j722j931k894l395j980L49J479J276J118
56429A59699J156N01n18o72j11q3o64p49o6O38J128J699K112K072K165K756K814
56412A73877J467k30q52q05j056j004J53J196N92o61n08P09J038L10O6N81P81
56395A75654O28R95J501J054J46K00J079J568J714K200K220O71j251j451l69o9
$$ plain form
56512 162182 158805 154381 150344 147696 145947 144302 142817 141859 141397 141362 141776 142161 141777 140756 139985 139688
56496 139688 139192 138331 137823 137952 138092 137909 137789 137724 137025 135616 134402 133969 134079 134762 136508 138939 140649
56479 140649 141035 141022 141459 142052 142422 142922 143695 144127 143983 144020 144827 146046 147239 148448 149426 149513 148796 148207 147974
56460 147974 147223 145673 144381 144106 144196 143984 144137 145689 148564 151839 154704 156633 157462 157842 158857 160808
56444 160808 163087 165295 167411 168872 168804 167399 165677 163746 160852 157457 155477 155826 157305 158581 159699
56429 159699 160855 161356 160838 160166 160055 159972 159308 158559 158493 159131 160259 161958 164070 166142 168307 171063 173877
56412 173877 175344 175114 174262 173457 172401 171397 171550 172746 173338 172677 172169 172878 173916 174226 174292 174873 175654
56395 175654 176282 177277 178778 179832 179978 180178 181257 182825 184539 186739 188959 189630 188379 186928 186559 186490
56379A86490n86k35R52J278O48N98J257J331J017J758L142L160J684O78Q21Q36
56363B04829K69j2r1q81j692r30Q39J549J208J625K716K614J515J730L477M280
56347B23045L144J828J288L71j053j226K48J487J773K628M424N161L949K622K580
56332B52269K834K511K487L252L746L535L671M401M506L761L411L490K469L29
56318B96672q91n31l07j000j192l17R8n27n54Q40K138K323K462L279L815L737
56302C10045M267N700O618O595O911P678P214N315M084M406M650M034M136N699
56288C87352P072P239P471Q541R298R298R866J1256J1830J1313J1648J3288J4091
56275E19563J3338J3279J5029J6461J6264J6529J9034K2192K4101K5683K8428
$$ plain form
56379 186490 185904 185669 186621 187899 188547 189145 190402 191733 192750 194508 197650 200810 202494 203172 203993 204829
56363 204829 205098 205086 204995 204114 202422 201492 202331 203880 205088 206713 209429 212043 213558 215288 218765 223045
56347 223045 226189 228017 229305 229676 228623 227397 227645 229132 230905 233533 237957 243118 247067 249689 252269
56332 252269 255103 257614 260101 263353 267099 270634 274305 278706 283212 286973 290384 293874 296343 296672
56318 296672 295781 295250 294943 293943 292751 292434 292532 292005 291451 292291 294429 296752 299214 302493 306308 310045
56302 310045 314312 320012 326630 333225 340136 347814 355028 360343 364427 368833 373483 377517 381653 387352
56288 387352 394424 401663 409134 417675 426973 436271 446137 457393 469223 480536 492184 505472 519563
56275 519563 532901 546180 561209 577670 593934 610463 629497 651689 675790 701473 729901
56264G29901L1751L4836L8493M3167M7643N1587N6788O4166P2327Q0601R0453
56253A341713J02198J13680J24056J35524J49191J62704J74319J85744J98276
56244B687405K09393K16103K18779K18872K15458K06905J93427J75529J52275
56235D494146J23433R0854N5744J7446k3090o1800r5803j26046j53300j75103
56225D146481j89479j98453k04672k07558k05756k00536j93641j84577j73080
56216B388729j61502j51653j41897j30474j19000j09603j01251r2108q3049p5607
56206A222585o8934o1872n5729n1834m8646m4191l9189l5017l1028k6529k2955
56195G36661k1276j9899j7640j5962j5682j4630j1483q691q451q921p702n926
$$ plain form
56264 729901 761652 796488 834981 878148 925791 977378 1034166 1098332 1170659 1251260 1341713
56253 1341713 1443911 1557591 1681647 1817171 1966362 2129066 2303385 2489129 2687405
56244 2687405 2896798 3112901 3331680 3550552 3766010 3972915 4166342 4341871 4494146
56235 4494146 4617579 4708433 4764177 4781623 4758533 4696733 4600930 4474884 4321584 4146481
56225 4146481 3957002 3758549 3553877 3346319 3140563 2940027 2746386 2561809 2388729
56216 2388729 2227227 2075574 1933677 1803203 1684203 1574600 1473349 1381241 1298192 1222585
56206 1222585 1153651 1091779 1036050 984216 935570 891379 852190 817173 786145 759616 736661
56195 736661 715385 695486 677846 661884 646202 631572 620089 611398 602947 594026 586324 580398
56183E80398n456n206l767k694l530m490l702k737l391l990k644j071j370k032
56169E34318j036J99j24l23J476L350L156K914N139P896Q250P686R259J2035J3267
56154F07462J3654J5495J7977J9136K0210K3235K6558K7610K7970L0853L5656
56143H65816L9751M3578M9088N5249O0001O4707P1761P9633Q4900Q7316Q8085
56132A589885Q5345P6410O3033M9749L8723L0306K6146K6797K8221K5575J8722
56121B058912R928j098j4877k7696l5028l7658l9634m2487m6200n2912o3993p5619
56109A631638q2782q5571q6531q4666p7715o7788n8800n0503m0743l1150k4802
56098I40587k0596j5770j1489j0075r371o059k012j025j792n17K093K945L017
$$ plain form
56183 580398 574942 569736 565969 563275 559745 555255 551553 548816 545425 541435 538791 537720 536350 534318
56169 534318 533282 533481 533357 533034 534510 537860 541016 543930 549069 556965 565215 572901 582160 594195 607462
56154 607462 621116 636611 654588 673724 693934 717169 743727 771337 799307 830160 865816
56143 865816 905567 949145 998233 1053482 1113483 1178190 1249951 1329584 1414484 1501800 1589885
56132 1589885 1675230 1751640 1814673 1864422 1903145 1933451 1959597 1986394 2014615 2040190 2058912
56121 2058912 2068840 2067742 2052865 2025169 1990141 1952483 1912849 1870362 1824162 1771250 1707257 1631638
56109 1631638 1548856 1463285 1376754 1292088 1214373 1146585 1087785 1037282 996539 965389 940587
56098 940587 919991 904221 892732 882657 873286 867227 865215 864190 862398 861881 863974 866919 869936
56085H69936N041P300O553M649N405P493P398O645Q803J2028J2072J0232J0729
56072I74284J2716J2605J1659J3381J5923J5271J3378J4829J7982J7985J6046
56061A136059J6781J8877J7567J4199J3985J6220J6066J4106J4613J6400J5117
56050A309990J2708J4613J9305K0678J9096J9914K2804K2972K1313K2599K5266
56039A531258K3791J9662J8930K0578J8777J5044J6193K1519K4181K4216K7810
56028A761959L4604L8220L8592M1242M5145M4175L9801L9336M2534M3123M2442
56017B211173M7443N6244O0161N9398O1971O7895O9775O8421P1912P9586Q3141
56006B937120Q3191Q8023R6409R9241R7944J03035J14352J21518J24198J32236
$$ plain form
56085 869936 874977 882277 888830 893479 898884 906377 913775 920420 929223 941251 953323 963555 974284
56072 974284 987000 999605 1011264 1024645 1040568 1055839 1069217 1084046 1102028 1120013 1136059
56061 1136059 1152840 1171717 1189284 1203483 1217468 1233688 1249754 1263860 1278473 1294873 1309990
56050 1309990 1322698 1337311 1356616 1377294 1396390 1416304 1439108 1462080 1483393 1505992 1531258
56039 1531258 1555049 1574711 1593641 1614219 1632996 1648040 1664233 1685752 1709933 1734149 1761959
56028 1761959 1796563 1834783 1873375 1914617 1959762 2003937 2043738 2083074 2125608 2168731 2211173
56017 2211173 2258616 2314860 2375021 2434419 2496390 2564285 2634060 2702481 2774393 2853979 2937120
56006 2937120 3020311 3108334 3204743 3303984 3401928 3504963 3619315 3740833 3865031 3997267
55996C997267J45296J52857J55382J64308J79744J90079J95264K07715K28026
55987E615938K43413K52866K69554K95337L17867L36170L63210L99717M32328
55978H526400M61191N01501N54376O05826O57759P28430Q18831R12746J013775
55969A4780835J145992J314272J504166J726375K019162K402074K873252L455220
55961C1221348M187700N066890O051006P134296Q348049R677010J1053407J2454465
55953I5194171J3928142J5515298J7257006J9299002K1845498K4947955K8445989
55946B36433061L2044212L5021905L5619041L1219682K0082556L365865j4804038
55939C78982284k9674026l8513863m1361014l9879885l5950432l1029036k6075153
$$ plain form
55996 3997267 4142563 4295420 4450802 4615110 4794854 4984933 5180197 5387912 5615938
55987 5615938 5859351 6112217 6381771 6677108 6994975 7331145 7694355 8094072 8526400
55978 8526400 8987591 9489092 10043468 10649294 11307053 12035483 12854314 13767060 14780835
55969 14780835 15926827 17241099 18745265 20471640 22490802 24892876 27766128 31221348
55961 31221348 35409048 40475938 46526944 53661240 62009289 71686299 82739706 95194171
55953 95194171 109122313 124637611 141894617 161193619 183039117 207987072 236433061
55946 236433061 268477273 303499178 339118219 370337901 390420457 393786322 378982284
55939 378982284 349308258 310794395 269433381 229553496 193603064 162574028 136498875
55932A36498875k1588445j7716853j4461843j1806220r690043p995135o620339
55925D6619997n522006m659006l960557l374910k895532k514108k194110j910998
55917A9588770j673862j486281j324750j173747j045297r46123q58863p71892
55909A0307955o96480o39046n85431n27111m75940m39216m05389l67042l34054
55900E838246l12003k90352k63371k41053k28407k14849j94529j77141j68465
55891C748076j59464j44506j31822j26252j19464j06737r6397r3308q9414p9574
55881B601138p1049o8642o5883n9406n6946o2301o6787o4174o0469o0835o0294
55870A904352n5553n2899n5987n8170n4815n1448n2107n1414m5756m0817m0535
$$ plain form
55932 136498875 114910430 97193577 82731734 70925514 61235471 53240336 46619997
55925 46619997 41097991 36438985 32478428 29103518 26207986 23693878 21499768 19588770
55917 19588770 17914908 16428627 15103877 13930130 12884833 11938710 11079847 10307955
55909 10307955 9611475 8972429 8386998 7859887 7383947 6944731 6539342 6172300 5838246
55900 5838246 5526243 5235891 4972520 4731467 4503060 4288211 4093682 3916541 3748076
55891 3748076 3588612 3444106 3312284 3186032 3066568 2959831 2863434 2770126 2680712 2601138
55881 2601138 2530089 2461447 2395564 2336158 2279212 2216911 2150124 2085950 2025481 1964646 1904352
55870 1904352 1848799 1795900 1739913 1681743 1626928 1575480 1523373 1471959 1426203 1385386 1344851
55859A344851l9602l4261k9873l0659l2458l2385l5077m2327m6952m4096l8823
55848I38338l5762l1313k2987j6469j5846j6085j2592r338j0413j2132j0725r484
55836G35192j1266j2032q804o136p807r724p886n831p350r161p662n942p277q528
55822F19786o712n521q474j1963j1647r795r844r709o838m183m721n578l642j566
55808E19593k272k918l42K751K927K264L709N298M660M250O375P927N633J927
55794E61782P8j740n984j0154j1231j1215j2767j3763j1690q985q517p979m490
55781D53345p39r08m045o785r069j2017j3655j1949q931p238n817l278j655k484
55767C64775l099j332J76j094k562j370O1j569m434n244n103o415p516n910l505
$$ plain form
55859 1344851 1305249 1270988 1241115 1210456 1177998 1145613 1110536 1068209 1021257 977161 938338
55848 938338 902576 871263 848276 831807 815961 799876 787284 777946 767533 755401 744676 735192
55836 735192 723926 711894 703090 696954 689147 679423 671537 665706 658356 649195 641533 635591 628314 619786
55822 619786 613074 607553 599079 587116 575469 565674 555830 546121 539283 535100 530379 524801 521159 519593
55808 519593 517321 514403 514061 516812 519739 522003 525712 531010 535670 539920 546295 554222 559855 561782
55794 561782 561860 560120 554136 543982 532751 521536 508769 495006 483316 474331 465814 457835 453345
55781 453345 452606 451698 447653 440868 431799 419782 406127 394178 385247 378009 372192 368914 367259 364775
55767 364775 361676 360344 360520 359426 356864 355494 355555 353986 349552 344308 339205 332790 325274 319364 315859
55752C15859l312m036l087j862k793m300l886l210m822o803o016l948l896m977
55738B58911m293k695k918m168l806k504k669l560k922j603j818k612j790m93
55724B21060j185k895l086k458l219m353l399j369j141k335k346j154o95p31L27
55709A91021J637J298J94M71J389Q01n54l52Q58O54r10j788j834k393l126k817
55693A84549k273k806l177j583O62J050O5j24L06r8n40O45K359K393J403J500
55677A84331K242J784P04P45J091j69k088k328j363j290j682p01Q31P22l02K35
55661A82762J917K269J423J709L125L412K298J648J715J137L72J153K736K530
55647B10206M37j100j317j849l313m651n752p372q580p662n417m289m422l862
$$ plain form
55752 315859 312547 308511 305424 303562 300769 296469 292583 289373 284551 277748 271732 267784 263888 258911
55738 258911 254618 251923 249005 244837 241031 238527 235858 232298 229376 227773 225955 223343 221553 221060
55724 221060 219875 216980 213894 211436 208217 203864 200465 199096 197955 195620 193274 192120 191425 190694 191021
55709 191021 192658 193956 194150 194621 196010 196811 196257 195905 196763 197417 196507 194719 192885 190492 187366 184549
55693 184549 182276 179470 176293 174710 175372 176422 176487 176363 176669 176571 176031 176676 179035 181428 182831 184331
55677 184331 186573 188357 189061 189806 190897 190728 188640 186312 184949 183659 181977 181276 182107 182829 182527 182762
55661 182762 184679 186948 188371 190080 193205 196617 198915 200563 202278 203415 203787 204940 207676 210206
55647 210206 210643 209543 208226 206377 203064 198413 192661 185289 176709 169047 163630 159341 154919 151057
55633A51057k327j432j388r07j48m34j165m91J167J586O42L47J042J008r4p27
55617A47736o12j098k216k451j655j235j418j187q11j430k315j661j7M04l76k20
55601A29438R91R87q06k205j966j393j594j983k178k688l130k328o47K22K7O3
55585A10810N18L34k48K23J644K435K431K970M040M161L312L033L511L391K712
55570A45277L109M754N948O075O139O072M468J482q75j846k694l938m597m623
55556A64751n236o365o375m988l792l418k833j836j544j932j661q28j083k455
55542A20405k893j638l07R6M67J139R29l84j221q08k69k65m9M14j23j732k709
55525A11052k316j857k199k509k235k039k058j528p77j200k543k744j211J84K32
$$ plain form
55633 151057 148730 147298 145910 145003 144855 144421 143256 142765 143932 145518 146160 146507 147549 148557 148463 147736
55617 147736 147124 146026 143810 141359 139704 138469 137051 135864 135053 133623 131308 129647 129630 130034 129658 129438
55601 129438 130429 131416 130610 128405 126439 125046 123452 121469 119291 116603 113473 111145 110498 110720 110747 110810
55585 110810 111328 111662 111414 111637 113281 115716 118147 121117 125157 129318 132630 135663 139174 142565 145277
55570 145277 148386 153140 159088 165163 171302 177374 181842 183324 182449 180603 177909 173971 169374 164751
55556 164751 159515 153150 146775 141787 137995 134577 131744 129908 128364 126432 124771 123943 122860 120405
55542 120405 117512 115874 115567 115663 116130 117269 118198 117814 116593 115785 115516 115251 115202 115616 115493 113761 111052
55525 111052 108736 106879 104680 102171 99936 97897 95839 94311 93534 92334 89791 87047 85836 86020 86252
55510H6252k9L32O08K95J27L36N9o81o49J90L43m79p61m7J71o56j041l85j90j160
55490H2635j626m41R99J211Q99J195J640J493J258J416J349P59N43J095J487J207
55474I7119J007J086M70q72j441p74m79j486k417k002j091q76j039j017j282k012
55458H2894k170j212j11M39J004J661J271k65j100k24Q84P70K92P13J373J022
55442H7241l7q05j272j673j446l67M65J63n15m92N1M66P57R11M18n97r94l17M21
55423H2378M03J16P0K2O7Q44J939J958Q75L07P33O52n31j162k37P30L15n23n18
55404H8438l85j071j631q48M86Q76M05n5o10j540k013j280j32L72M98Q05Q35K24
55386H3374j64K87O12q9r49q06j31L7j7N67J535K031J910J386L49r38j527j201
$$ plain form
55510 86252 86223 86555 87163 87458 87585 87921 87980 87299 86650 86840 87183 86704 85943 85896 86067 85411 84370 83985 83795 82635
55490 82635 81009 80568 81567 82778 83677 84872 86512 88005 89263 90679 92028 92787 93330 94425 95912 97119
55474 97119 98126 99212 99682 98810 97369 96595 96116 94630 92213 90211 89120 88244 87205 86188 84906 82894
55458 82894 80724 79512 79401 79840 80844 82505 83776 83511 82411 82187 83071 83841 84133 84846 86219 87241
55442 87241 87204 86399 85127 83454 82008 81641 82106 82269 81754 81262 81313 81779 82536 83447 83865 83268 82274 81957 82378
55423 82378 82781 82897 82967 82989 83056 83900 85839 87797 88672 88979 89712 90364 89833 88671 88434 89164 89479 88956 88438
55404 88438 88053 86982 85351 84503 84989 85865 86270 86215 85605 84065 82052 80772 80640 81012 81510 82315 83150 83374
55386 83374 83210 83497 84109 84020 83071 82265 82134 82171 82154 82721 84256 86287 88197 89583 89932 88994 87467 86266
55368H6266r30j145j018l26k38j122j501m96N10K32l67K4P89Q36O80J145J498
55351H4837Q52j6q7rn97r20lR58L64r91j191l22K2m63p08m61m50p01o03k83l27
55330G8901n17k90J25K82N67J255J484N83m61l70M17O41K08k00n21q47n89L60
55312H1028P18l85j726j792j059p55o12J79R58O70k4J32O96N07K4L82R46L44p45
55293G9486l54J462K593K079J101O63M11L3j00j8k61p37p86m23k23k40k25n06
55275H3955j248j503n37N44K19r25j044Q8R80Q97M70N0o43j256j010k22M1k13
55257G8643n5N51P45M80N23Q34O33Q3K07J072J661J527J142N66n60j720j814q69
55239H3649RL56N92P07K75k82n4P08Q12P6n21n89o69q00l77M07N40j40p30q34
$$ plain form
55368 86266 85336 84191 83173 82847 82609 81487 79986 79490 80000 80232 79865 79889 80678 81514 82194 83339 84837
55351 84837 85689 85673 85586 85577 84980 84060 84057 85015 85379 84388 83197 82875 82897 82434 81726 81265 80815 80114 79511 79228 78901
55330 78901 78384 78094 78219 78501 79068 80323 81807 82390 81929 81559 81976 82617 82825 82625 82104 81257 80668 81028
55312 81028 81746 81361 79635 77843 76784 76029 75417 75596 76554 77224 77200 77332 78028 78535 78559 78941 79887 80231 79486
55293 79486 79132 80594 83187 85266 86367 87030 87441 87474 87374 87356 87095 86358 85572 85149 84926 84686 84461 83955
55275 83955 82707 81204 80667 81211 81430 80505 79461 79549 80529 81426 81896 81946 81303 80047 79037 78815 78856 78643
55257 78643 78588 79139 79884 80364 80887 81721 82354 82437 82644 83716 85377 86904 88046 88612 88052 86332 84518 83649
55239 83649 83658 84014 84606 85313 85588 85306 85252 85960 86772 86848 86327 85738 85069 84269 83892 84299 84839 84699 83969 83135
55219H3135r21j038o51M6J74k93m18P9M56L84L55N02M20K56N86J012M06j169k197
55200H1124j765o15K27O20P11L87j93m88l86l03l62k95j68l02n14l56J4J56K43
55181G7735O36R41O57L22O93J207Q19m0m9P02Q12k8n71j31N66R05J160J382J109
55162H8827M93K67L52p7q83r20j0N68Q9o17o67k76O8L78N84L96J20M81J297J574
55142I2044J089O42N36K06m25o45l81m73j146j547j268r23q34n72j49k55p84o91
55124H4424J81O47J86j70L09Q03N28R7K67N61K98p7J76Q38J261J434J484R77k76
55105I3948j331j045M22J830K324K054J607J320J003J43j363k678k684j259N81
55090I4872J772J937J220J89k68K14Q18N39l24n96M1Q02J187J415J500J080K90
$$ plain form
55219 83135 82214 81176 80525 80571 80745 80452 80034 80113 80569 80953 81308 81810 82230 82486 83072 84084 84490 83321 81124
55200 81124 79359 78744 78971 79591 80302 80689 80496 80008 79622 79319 78957 78662 78494 78192 77678 77322 77336 77492 77735
55181 77735 78371 79312 79969 80291 80984 82191 83010 82970 82921 83623 84435 84407 83836 83705 84271 85176 86336 87718 88827
55162 88827 89320 89587 89939 89862 88979 88059 88049 88617 88706 88089 87422 87146 87214 87592 88176 88572 88692 89173 90470 92044
55142 92044 93133 93775 94311 94517 94092 93447 93066 92593 91447 89900 88632 87709 86875 86303 86154 85899 85115 84424
55124 84424 84605 85252 85438 85268 85577 86380 86908 87005 87272 87833 88131 88054 88230 89068 90329 91763 93247 94224 93948
55105 93948 92617 91572 91994 93824 96148 98202 99809 101129 102132 102275 100912 98234 95550 94291 94872
55090 94872 96644 98581 99801 99990 99722 99936 100754 101293 100969 100373 100414 101216 102403 103818 105318 106398 106688
55073A06688k36k88j32L21J192J789J290J52m63m53n73p41k55M34L9j275j869
55056A05620j211o02q51j094o34j79l83p29p22p62j052r74l35J32J46L74R66J072
55038I8782M76J56M73M66k09m05L57O29o66k204k126p69Q8j65n81l44M41J205
55020I5604J304M70n48n77L18P56J95k06L70R58M91m03n52j11P5K2J68K37j82
55001I8389o44n51k13j27N8P51J338J070L72J19K39J24j49q2K89O33J018J427
54983A04061J279L63m50m06p8l45q51o38K41R35J179J320J303P82jl85j81L09
54965A08437Q81J350J327P41K12K34N19O52P27P31J66r08j357n42M68L79l68m52
54947A13197J35K10n58j174r70m09q4J35N52J005J089O90J46LN43J408J988K237
$$ plain form
55073 106688 106452 106164 106032 106353 107545 109334 110624 110776 110313 109860 109287 108546 108291 108725 108764 107489 105620
55056 105620 104409 103807 102956 101862 101228 101049 100666 99937 99215 98453 97401 96427 96092 96224 96370 96744 97710 98782
55038 98782 99258 99414 99887 100353 100144 99739 100096 100725 100059 97855 95729 94960 95048 94883 94302 93958 94399 95604
55020 95604 96908 97378 96830 96253 96571 97327 97522 97316 97686 98644 99135 98732 98180 98069 98144 98166 98334 98571 98389
55001 98389 97745 97194 96981 96854 96912 97663 99001 100071 100443 100562 100801 100925 100776 100694 100983 101616 102634 104061
54983 104061 105340 105703 105253 104847 104769 104424 103573 102935 103176 104111 105290 106610 107913 108695 108694 108309 108128 108437
54965 108437 109318 110668 111995 112736 112948 113182 113701 114353 115080 115811 115977 115069 113712 113170 113638 114017 113649 113197
54947 113197 113332 113542 112984 111810 110840 110431 110347 110482 111034 112039 113128 113818 113964 113967 114510 115918 117906 120143
54929A20143K607L148L412L420L832M763N414N395N427O033O558O361N969O044
54915A88526N978M688K227m60k879n064o736p523p693p763p614o839n649m652
54901A38547l984l351k706k226j884j537j134n03N51J560J599O76Q4O86J755K257
54885A30390K421L044L996M533M554M553M760N171N920O770O853N797M493L877
54871A97132L501K323K63j987m134o188p728q352q367q108p089m985k836k004
54857A41441k315k465k026j733j935k057j729j325j206j286j556k190k987l348
54843A13283k958k111j281p34m80l35j50j21m74q00l79O82J448J608J887K534
54827A11619K550J237n17j426j443j249r75n07k75o11r32o02jK46M52J174J951
$$ plain form
54929 120143 122750 125898 129310 132730 136562 141325 146739 152134 157561 163594 170152 176513 182482 188526
54915 188526 194504 199192 201419 200959 198080 193016 186280 178757 171064 163301 155687 148848 143199 138547
54901 138547 134563 131212 128506 126280 124396 122859 121725 121222 121773 123333 124932 125608 125692 126378 128133 130390
54885 130390 132811 135855 139851 144384 148938 153491 158251 163422 169342 176112 182965 188762 193255 197132
54871 197132 200633 202956 203219 201232 197098 190910 183182 174830 166463 158355 151266 146281 143445 141441
54857 141441 139126 136661 134635 132902 130967 128910 127181 125856 124650 123364 121808 119618 116631 113283
54843 113283 110325 108214 106933 106199 105719 105384 105234 105113 104639 103839 103460 104142 105590 107198 109085 111619
54827 111619 114169 115406 114889 113463 112020 110771 109796 109289 109014 108403 107471 106869 106868 107114 107566 108740 110691
54810A10691J865R19j10p17q01k92M71P38M54N76J472K045J455N25K93L03k32
54793A19655p50m38Q2j20l84L32J244Q51l97p40J0M97M84J157K596L177K096O11
54775A29963J74P85J725K579L124L351L889N295O881P396O865O488O772P104O993
54760A99384O360M693J579j982m362n516o735q180q553p524o478o269o010m909
54746A45498l704l229k955j981n04O37J074R17L90kK49Q69J095R59J302K260K890
54729A45765K720K434K573K701K506K655L740N225O191O469O393N978M952L234
54715B03536J016j315l284m772o206p717q439p573n903n041n277n385m633l695
54701A35312l318l278l064k554j668l33Q77J082L58l17n29q11j332j404o52L28
$$ plain form
54810 110691 112556 113475 113365 112648 111847 111555 112026 112764 113218 113794 115266 117311 118766 119291 119584 119887 119655
54793 119655 118905 118467 118549 118429 118045 118377 119621 120472 120075 119335 119345 119842 120326 121483 124079 127256 129352 129963
54775 129963 130137 130922 132647 135226 138350 141701 145590 150885 157766 165162 172027 178515 185287 192391 199384
54760 199384 205744 210437 212016 210034 205672 200156 193421 185241 176688 169164 162686 156417 150407 145498
54746 145498 141794 138565 135610 133629 133125 133762 134836 135753 136143 136141 136390 137259 138354 139313 140615 142875 145765
54729 145765 148485 150919 153492 156193 158699 161354 165094 170319 176510 182979 189372 195350 200302 203536
54715 203536 204552 203237 199953 195181 188975 181258 172819 165246 159343 154302 149025 143640 139007 135312
54701 135312 131994 128716 125652 123098 121430 121097 121974 123056 123414 123097 122568 121757 120425 119021 118369 118697
54685A18697R24J162J087M70n50j322j577j619j517j020l42m8o2J69M66P6q31
54668A14163j157n55J41M04O24R31Q05K52O1M13M98q8p96j314j932k363j753l64
54650A07970L79J42L15J576K493J766K83l76k62l96q13p45j74J81K9l05n28n23
54632A11012k11J82K25M9K68Q57R88M82K89R16J446R22k39j002j024n06L54J131
54614A16139J234Q60Q94J346J057l22j378r41J60M72l3m95p52j070j115m72L40
54597A15924M64r1p59j264j377o15Q17J611R40k38m80K02P84Q88Q00N14p4m60
54579A17586j91J62j57p31n53L35R19P16J80k07l91l56j33Nj21k71k02p9N9N18
54559A17088J178J241M65j78J19P57P58L08K05M18L27n1j93J8L39P73J243J278
$$ plain form
54685 118697 119621 120783 121870 122340 121790 120468 118891 117272 115755 114735 114393 114345 114283 114452 114918 114994 114163
54668 114163 113006 112451 112592 112996 113620 114551 115356 115608 115669 116082 116580 116492 115696 114382 112450 110087 108334 107970
54650 107970 108349 108491 108806 110382 112875 114641 114924 114548 114286 113890 113077 112332 112158 112339 112368 112063 111535 111012
54632 111012 110801 110983 111208 111257 111525 112382 113370 113852 114141 115057 116503 117425 117186 116184 115160 114654 115008 116139
54614 116139 117373 118233 119127 120473 121530 121208 119830 118889 119049 119521 119488 118993 118241 117171 116056 115584 115924
54597 115924 116388 116297 115538 114274 112897 112282 113099 114710 115650 115412 114932 115134 115918 116806 117606 118120 118046 117586
54579 117586 117395 117557 117400 116669 116116 116451 117370 118086 118266 118059 117668 117312 117179 117184 117063 116792 116590 116511 116570 117088
54559 117088 118266 119507 119972 119794 119913 120670 121428 121736 121941 122359 122686 122635 122442 122460 122799 123572 124815 126093
54541A26093Q30P77J592K238J506j18j155j190r16o14L4P86Q80K65l38o14r31
54524A29125j362j459j057m97k0L58M77K05q5J3K22Qm85n62Q3J068J768J589L26
54505A29715j297j967j315m66m00o04j95M81N08l7l87m46n77n26J68J060J297
54488A25012R15N02K7p66j252o56M49P78K94R2M97P98Q03J079J501J135m6p64
54470A30398j72J129K229K901L097K603J701J214J397J622J412R75M60l17j163
54455A49486j463j203j080j295j258p96o37j119j501j115m33k04k65MN91R19P06
54438A39337J65m32q91j007o75r3L58M03P3k52j59K36K93j81m49J29R59R28J8
54419A38760o98o30k25O5L71P65Q34M13M7L22J164J972K060J025p46j958j505
$$ plain form
54541 126093 126923 127700 129292 131530 133036 132918 131763 130573 129657 129043 129077 129863 130743 131008 130670 130056 129125
54524 129125 127763 126304 125247 124750 124730 125088 125565 125770 125685 125698 125920 125928 125443 124881 124964 126032 127800 129389 129715
54505 129715 128418 126451 125136 124670 124270 123666 123471 123952 124460 124423 124036 123590 123013 122487 122655 123715 125012
54488 125012 125927 126429 126456 125690 124438 123782 124231 125009 125303 125395 125892 126690 127493 128572 130073 131208 131162 130398
54470 130398 130226 131355 133584 136485 139582 142185 143886 145100 146497 148119 149531 150506 150966 150649 149486
54455 149486 148023 146820 145740 144445 143187 142391 141754 140635 139134 138019 137586 137382 137117 137121 137712 138631 139337
54438 139337 139502 139070 138179 137172 136497 136404 136762 137165 137238 136986 136827 137063 137356 137175 136726 136855 137814 138742 138760
54419 138760 138062 137432 137207 137272 137643 138408 139242 139655 139702 140024 141188 143160 145220 146245 145499 143541 142036
54402A42036J28J260J000J91O8P58J394J300N62k37n57l40m2o0k12k0N61J112
54384A48902J285J020L65m87j106j163p40l1R21J858K163J674J141J217J492J294
54368A59805R73J374K463L486M217M933N323M655L027J332K3j074j746j462n93
54353A86736l83j350k717l650m072m032l353k308j651j591j561j300j230j454
54339A56084j403q58m56o62j055j077p39k67K64N91L68q9j1N61P00R1m31l08j47
54320A51156m89p84m14J11o6p88j217j075p40m73l33n33j179j841j984j558q49
54303A36944l9O72R37P55P12J246J928J948J157J80l17j59L48P35P48N61M13J71
54285A48940l62q63q01l40j92m77m79K20J083J432J314J173J164J087O50l91j785
$$ plain form
54402 142036 142164 143424 144424 144615 144683 145441 146835 148135 148697 148460 147903 147563 147521 147461 147249 147229 147790 148902
54384 148902 150187 151207 151572 151085 149979 148816 148076 148045 148966 150824 152987 154661 155802 157019 158511 159805
54368 159805 160778 162152 164615 168101 172318 177251 182574 187229 190256 191588 191611 190537 188791 187329 186736
54353 186736 186353 185003 182286 178636 174564 170532 167179 164871 163220 161629 160068 158768 157538 156084
54339 156084 154681 153823 153367 152705 151650 150573 149834 149567 149831 150422 150790 150701 150690 151251 151951 152042 151611 151303 151156
54320 151156 150667 149883 149469 149580 149514 148726 147509 146434 145694 145221 144888 144355 143176 141335 139351 137793 136944
54303 136944 136905 137577 138514 139269 139981 141227 143155 145103 146260 146440 146123 145964 146312 147047 147795 148356 148769 148940
54285 148940 148578 147715 146914 146574 146382 145905 145426 145646 146729 148161 149475 150648 151812 152899 153549 153158 151373
54268A51373k514j719K7J206J281J205J712K198J900J197R12J071J141R92Q46
54253A62828P49O84P89R65P30lo31q14j077j767k193j630o11l03q96j572j819
54236A53429j869j880j584q65q1L76M71M63O69J270K051K496K298J642Q25Jn62
54219A59150m86J31O08N19K02l0n39j577k396j998o09M78M70j76p16j049j405
54202A50577j588j084Q4J070R76o8r47p97P0P03P10M17R8k46m21p4O13R51O67
54183A51711K74K62N32Q65J243J486J185L75k61k51J37M25M11p6j118k127k120
54166A52953j061j30j27m29j89L29M14J92K08K94j17q51j187r92p78p63o80m53
54148A46633k88j26K87P56P89M06J92M23O98N77J55j41m6L77Q40J086J172J280
$$ plain form
54268 151373 148859 147140 147167 148373 149654 150859 152571 154769 156669 157866 158778 159849 160990 161982 162828
54253 162828 163577 164261 165050 166015 166745 166742 166111 165297 164220 162453 160260 158630 158019 157716 156820 155248 153429
54236 153429 151560 149680 148096 147231 147150 147526 147997 148460 149129 150399 152450 154946 157244 158886 159711 159712 159150
54219 159150 158664 158795 159403 159922 160124 160094 159555 157978 155582 153584 152975 153453 153923 153747 153031 151982 150577
54202 150577 148989 147905 147989 149059 150035 149967 149020 148223 148293 148996 149706 150123 150221 149975 149554 149480 150093 151044 151711
54183 151711 151985 152247 152779 153644 154887 156373 157558 157933 157672 157421 157558 157983 158394 158318 157200 155073 152953
54166 152953 151892 151762 151635 151206 151017 151346 151760 151952 152160 152454 152337 151486 150299 149307 148529 147766 147086 146633
54148 146633 146345 146219 146506 147262 148051 148457 148649 149072 149770 150347 150502 150361 150315 150692 151532 152618 153790 155070
54130A55070J292Q48R5k24J88N58J01o92o22N42J693J810J048K74O6M64J246K112
54112A65869K692K784K526K299K296K353K239K096K309K844L058K487J510P70
54098A98132K24o31j723k375k305j965j713j388q46l10L7J88Rn77j031o94M5J12
54080A83189n67q66l06J49j78m85N4P36N00j82oJ073J766J341M32LK92Q42R78
54061A88765L15p72j410j315j130j281j285p20j14J1J81R97J881J970J727K292
54045A90112L565M295L951L283K989L073L519M418N293N376M813M608N150N713
54031B50158N669N267M926M665M442M311L971K919J355K15k1J28N1j99l68n35
54015B86954q40j184j534k054k736l337l846m443m974n089m940n059n345n005
$$ plain form
54130 155070 156362 157210 157305 157081 157269 157827 157928 157236 156614 157156 158849 160659 161707 161981 162047 162511 163757 165869
54112 165869 168561 171345 173871 176170 178466 180819 183058 185154 187463 190307 193365 195852 197362 198132
54098 198132 198356 197725 196002 193627 191322 189357 187644 186256 185410 185100 185137 185325 185334 184757 183726 183032 183077 183189
54080 183189 182622 181756 181450 181599 181421 180936 180990 181726 182226 182044 182038 183111 184877 186218 186650 186653 186945 187787 188765
54061 188765 189080 188308 186898 185583 184453 183172 181887 181167 181053 181064 181245 182242 184123 186093 187820 190112
54045 190112 193677 197972 201923 205206 208195 211268 214787 219205 224498 229874 234687 239295 244445 250158
54031 250158 255827 261094 266020 270685 275127 279438 283409 286328 287683 287898 287877 288005 288056 287857 287489 286954
54015 286954 286114 284930 283396 281342 278606 275269 271423 266980 262006 256917 251977 246918 241573 236568
54001B36568l859k829k663k866k546j730j151j068j099r74q62r50j185j455j679
53986B09652j667j265o30j43Q2L13P35J069Q45L0q07j045n72L07J294K190K790
53969B13178L037L232L694M271M633M980N862P217Q260Q457P801O049K642j955
53955B81358n850p532p433o840o009m452k503j164n51K09J445K408K536K274K335
53940B50231K870L670M501M974M708L911L246L001K859K571K284K089J844J629
53926B94388J786K275K592K527K536L092M040M874N308N424N497N755O071O030
53912C52195N532N133N281N474M901L720K931K821K459J022r86k321k391j720
53898C84051j314j826l084m253m647m365m055m131m569n243o013o549o631o561
$$ plain form
54001 236568 232709 229880 227217 224351 221805 220075 218924 217856 216757 215783 214921 213971 212786 211331 209652
53986 209652 207985 206720 206090 205947 206029 206342 207077 208146 208991 209021 208214 207169 206597 206904 208198 210388 213178
53969 213178 216215 219447 223141 227412 232045 237025 242887 250104 258364 266821 274622 280671 283313 281358
53955 281358 275508 267976 260543 253703 247694 243242 240739 239575 239024 239233 240678 243086 245622 247896 250231
53940 250231 253101 256771 261272 266246 270954 274865 278111 281112 283971 286542 288826 290915 292759 294388
53926 294388 296174 298449 301041 303568 306104 309196 313236 318110 323418 328842 334339 340094 346165 352195
53912 352195 357727 362860 368141 373615 378516 382236 385167 387988 390447 391469 390483 388162 385771 384051
53898 384051 382737 380911 377827 373574 368927 364562 360507 356376 351807 346564 340551 334002 327371 320810
53884C20810o773p085o792n637m199l292l302m000m710m753m183l868m321m846
53870B53049m485l508k992l116k965k136j480j809k712l250l141k745k283j710
53856B14717j117q18j014j459j552r13k2R8p81j495q94M76J041K97o79q80n08
53839B04497j67Q0L02J79n10j263j299m73O31J309J282P68K00k29n74o72o4J196
53821B05193K131J910R62L56L87N85P45J043J301J265J454K549M003M507L974
53806B32365L725M364M889M444L689L617M063M297M327M602N012N061M623L945
53792B93023L205K561K260K280K228J883J413Q83J66n19p05o36j226k721m236
53777B99859n056n473n817n627m673l819l973m753n164n028m795m453l672k691
$$ plain form
53884 320810 314037 306952 300160 294523 290324 287032 283730 279730 275020 270267 266084 262216 257895 253049
53870 253049 248564 245056 242064 238948 235983 233847 232367 230558 227846 224596 221455 218710 216427 214717
53856 214717 213600 212782 211768 210309 208757 207844 207822 207920 207139 205644 204750 205226 206267 206564 205885 205005 204497
53839 204497 204330 204410 204712 204891 204381 203118 201819 201346 201977 203286 204568 205336 205536 205307 204733 204061 203997 205193
53821 205193 207324 209234 210196 210552 210939 211524 212269 213312 214613 215878 217332 219881 223884 228391 232365
53806 232365 236090 240454 245343 249787 253476 257093 261156 265453 269780 274382 279394 284455 289078 293023
53792 293023 296228 298789 301049 303329 305557 307440 308853 309736 309902 309383 308678 308042 306816 304095 299859
53777 299859 294803 289330 283513 277886 273213 269394 265421 260668 255504 250476 245681 241228 237556 234865
53763B34865k134k027j887j623j600j931k317k549k615k417j904j344r87o62j84
53748B08684J00k13q17r87n49J6L44N35P05O97L68j38n42o39l78J73R13J731K329
53729B12332K196J173l1m30Q3O84Q26P77Q51Q39O63Q08J563K364K503K049J597
53712B30847J439J512J701J806J567J146J107J597K046K075K082K423K667K339
53698B56354J885K179L348M723N657N794M966L421J886Q72K29k42k85J46L52k38
53682B91047j106j380j104r57j039q98n10l46m64m14p4J77J84K78O31R20P85K78
53664B86008k87n92m49K9M54N02K50k3j24N4M70P25L90k90n47k26k6k46j10R82
53644B86944K253K526J799R76M86J06j64n0L60Q08J449K455L310L384K955K787
$$ plain form
53763 234865 232731 230704 228817 227194 225594 223663 221346 218797 216182 213765 211861 210517 209530 208868 208684
53748 208684 208784 208571 207754 206767 206218 206234 206578 207113 207818 208515 208883 208745 208203 207564 207186 207359 208272 210003 212332
53729 212332 214528 215701 215670 215240 215323 216007 216833 217610 218461 219300 219963 220771 222334 224698 227201 229250 230847
53712 230847 232286 233798 235499 237305 238872 240018 241125 242722 244768 246843 248925 251348 254015 256354
53698 256354 258239 260418 263766 268489 274146 279940 284906 288327 290213 291085 291314 291072 290787 290933 291285 291047
53682 291047 289941 288561 287457 286500 285461 284563 284053 283707 283243 282829 282755 282932 283116 283394 284025 284945 285730 286008
53664 286008 285721 285129 284680 284709 285163 285665 285915 285892 285768 285822 286292 287017 287407 287117 286570 286344 286318 286072 285962 286944
53644 286944 289197 291723 293522 294498 294984 295090 294926 294876 295236 296044 297493 299948 303258 306642 309597 312384
53628C12384K928K930L015L786M892N213M535L839L634L215K081J034J039J763
53614C56288K122J778J401J663K545L491L861L356K321J550J588K306L154L629
53600C91053L462K714J802J182Q97O72M75N58R05J008M52n13j254j424j214j023
53584C99752j105j493k067k601k763k356j664j392j924k776l171l025k831k634
53570C67950j902o20L40M24K13L93O04J10q35j219o85J08N09N56N65O62Q15R53
53552C68941R84Q77P08M94K49L20J134K390L095K804K231K105K122J716J246J487
53536C92903K443L513M475N411O015N949N687O025O914P678Q183Q860R701J0243
53522D84000J0537J1168J2219J3139J3705J4306J5182J6126J7012J7835J8304
$$ plain form
53628 312384 315312 318242 321257 325043 329935 335148 339683 343522 347156 350371 352452 353486 354525 356288
53614 356288 358410 360188 361589 363252 365797 369288 373149 376505 378826 380376 381964 384270 387424 391053
53600 391053 394515 397229 399031 400213 401110 401782 402257 402815 403720 404728 405180 404667 403413 401989 400775 399752
53584 399752 398647 397154 395087 392486 389723 387367 385703 384311 382387 379611 376440 373415 370584 367950
53570 367950 366048 365428 365768 366192 366405 366798 367402 367512 366677 365458 364773 364881 365390 365946 366511 367173 367988 368941
53552 368941 369925 370802 371510 372004 372253 372573 373707 376097 379192 381996 384227 386332 388454 390170 391416 392903
53536 392903 395346 398859 403334 408745 414760 420709 426396 432421 439335 447013 455196 464056 473757 484000
53522 484000 494537 505705 517924 531063 544768 559074 574256 590382 607394 625229 643533
53511F43533J8289J8555K0060K2382K3947K4025K3514K3430K3652K3565K3024
53500H87976K2106K0693J8974J7691J7334J7458J7367J7019J6818J6869J6942
53489A087247J6928J6954J7119J7353J7492J7436J7268J7166J7098J6837J6470
53478A275368J6417J6623J6231J4616J2306J0176Q252O102L934K220N95j684m327
53465A376829o297p515q928j0765j2099j2507j2878j3891j4794j4519j3275j2320
53453A237041j2603j4162j6326j8044j8529j7917j7019j6311j5719j5310j5364
53442A059737j5573j5004j3226j0758q270o043m334l404k935k264j408r04o16
53429I74998K45J635K531K634K999M291N760O678P604R256J1184J2653J3899J5477
$$ plain form
53511 643533 661822 680377 700437 722819 746766 770791 794305 817735 841387 864952 887976
53500 887976 910082 930775 949749 967440 984774 1002232 1019599 1036618 1053436 1070305 1087247
53489 1087247 1104175 1121129 1138248 1155601 1173093 1190529 1207797 1224963 1242061 1258898 1275368
53478 1275368 1291785 1308408 1324639 1339255 1351561 1361737 1369989 1376091 1380025 1382245 1382840 1381156 1376829
53465 1376829 1370532 1363017 1354089 1343324 1331225 1318718 1305840 1291949 1277155 1262636 1249361 1237041
53453 1237041 1224438 1210276 1193950 1175906 1157377 1139460 1122441 1106130 1090411 1075101 1059737
53442 1059737 1044164 1029160 1015934 1005176 996906 990863 986529 983125 980190 977926 976518 975614 974998
53429 974998 975243 976878 979409 982043 985042 989333 995093 1001771 1009375 1018631 1029815 1042468 1056367 1071844
53415A071844J7138J8454J9796K1596K3333K4332K5039K6278K7794K8799K9474
53404A333877L0657L2276L3427L4018L5056L7132L9592M1609M3218M4923M6874
53393A752659M8757N0075N0453N0018M9507M9598N0115N0208M9330M7692M5835
53382B294247M4120M2598M1041L9164L6885L4265L1115K7083K2309J7494J3021
53371B643342Q497L559j408n813r683j3442j7346k1677k6906l2898l8404m2095
53359B445726m3933m4824m5253m5049m4332m3772m3727m3692m2867m0975l8497
53348A968805l6334l5047l4251l3066l1437l0524l1284l3045l4148l3656l1904
53337A604109k9602k7169k4869k2950k1496k0435j9620j8691j7168j5049j3033
$$ plain form
53415 1071844 1088982 1107436 1127232 1148828 1172161 1196493 1221532 1247810 1275604 1304403 1333877
53404 1333877 1364534 1396810 1430237 1464255 1499311 1536443 1576035 1617644 1660862 1705785 1752659
53393 1752659 1801416 1851491 1901944 1951962 2001469 2051067 2101182 2151390 2200720 2248412 2294247
53382 2294247 2338367 2380965 2422006 2461170 2498055 2532320 2563435 2590518 2612827 2630321 2643342
53371 2643342 2651839 2655398 2653990 2648177 2638494 2625052 2607706 2586029 2559123 2526225 2487821 2445726
53359 2445726 2401793 2356969 2311716 2266667 2222335 2178563 2134836 2091144 2048277 2007302 1968805
53348 1968805 1932471 1897424 1863173 1830107 1798670 1768146 1736862 1703817 1669669 1636013 1604109
53337 1604109 1574507 1547338 1522469 1499519 1478023 1457588 1437968 1419277 1402109 1387060 1374027
53326A374027j1782j1261j1278j2139j4154j6730j8643j9094j8134j6434j4966
53315A209412j4444j4417j3453j0894p989o384n966n219l410j300K56J301K219
53302A129712L202M480O281Q313R979J1269J2719J4366J5607J6301J7230J8987
53290A268446K1112K2729K3578K3860K3614K2718K1247J9450J7537J5683J4041
53279A494015J2522J0848Q896O785M526J946r92m054p007r728j2021j3711j5001
53266A477024j6345j7879j9350k0711k2208k3753k4728k4773k4393k4318k4550
53255A234016k4519k4015k3460k3197k2969k2297k1177k0082j9373j9050j9054
53244I94823j9505k0329k0997k0995k0474j9988j9629j9000j8011j7104j6466
$$ plain form
53326 1374027 1362245 1350984 1339706 1327567 1313413 1296683 1278040 1258946 1240812 1224378 1209412
53315 1209412 1194968 1180551 1167098 1156204 1148215 1141831 1135865 1130646 1127236 1125936 1126192 1127493 1129712
53302 1129712 1132914 1137394 1143675 1151988 1161967 1173236 1185955 1200321 1215928 1232229 1249459 1268446
53290 1268446 1289558 1312287 1335865 1359725 1383339 1406057 1427304 1446754 1464291 1479974 1494015
53279 1494015 1506537 1517385 1526281 1533066 1537592 1539538 1538546 1534492 1527485 1517757 1505736 1492025 1477024
53266 1477024 1460679 1442800 1423450 1402739 1380531 1356778 1332050 1307277 1282884 1258566 1234016
53255 1234016 1209497 1185482 1162022 1138825 1115856 1093559 1072382 1052300 1032927 1013877 994823
53244 994823 975318 954989 933992 912997 892523 872535 852906 833906 815895 798791 782325
53233G82325j5654j4364j2983j1952j1000r657q105p047o881p517q631r713j0157
53220F48664r862r577j0150j1648j3546j5362j6669j6934j6105j4977j4237j3507
53208D86090j2039j0142q868q512q291p601o662n858n334n341o176p456q280q341
53194C77189q273q553q789q433p636o903o387n915n424m945m460l961l472k913
53180B91125k268j821j825j955j672j113j021j607k130j947j348r57q67q25q86
53165B68883j292j912k231j872j006k54k20q60j336q69K45Q63L97n50j054q53
53149B56079k14N89J210J158L60m61n05J54O96O15J64j81k65j98o0J09K29K70
53131B59749L99Q06J333J471R33J54p3M84J265J654J611J449J380J538J992K462
$$ plain form
53233 782325 766671 752307 739324 727372 716372 706715 698610 691563 684682 677165 668534 658821 648664
53220 648664 638802 629225 619075 607427 593881 578519 561850 544916 528811 513834 499597 486090
53208 486090 474051 463909 455041 446529 438238 430637 423975 418117 412783 407442 401266 393810 385530 377189
53194 377189 368916 360363 351574 343141 335505 328602 322215 316300 310876 305931 301471 297510 294038 291125
53180 291125 288857 287036 285211 283256 281584 280471 279450 277843 275713 273766 272418 271461 270594 269769 268883
53165 268883 267591 265679 263448 261576 260570 260316 260096 259236 257900 257031 257276 258139 258536 257986 256932 256079
53149 256079 255865 256454 257664 258822 259182 258721 258216 258370 259066 259681 259845 259664 259399 259201 259141 259250 259479 259749
53131 259749 260148 260954 262287 263758 264691 264845 264772 265256 266521 268175 269786 271235 272615 274153 276145 278607
53115B78607K435J969J800K190K280J372K60K11R21P86q07k664l513l454l256
53100B79137l179l050k797k315j441m87k22p69j284j175j011j557k450k671j927
53085B52802q37N4O95J029P93o7j079j517r65J92Q73K70j169k202k311k136k207
53068B42218k131j558j098j336j612q97M39Q79j49j559k102j695q78J11J215K077
53052B31924K331K154J961J756J152Lj246j906j617o63K21M36j8o57j050j046
53036B33735o82j14K51jp16j137o93L07J045J139R01P48P23P56R69J448J859J712
53018B42250R95K09k54m89o82p18m55j54k10n63p16l80K10O77R14R94R14O09J86
52999B43337q8J7M23P36O41L11K96Q30J485J733J634J635J848J944J750J474J327
$$ plain form
53115 278607 281042 283011 284811 287001 289281 290653 290913 291124 292045 292831 292024 289360 285847 282393 279137
53100 279137 275958 272908 270111 267796 266355 265868 265646 264877 263593 262418 261407 259850 257400 254729 252802
53085 252802 251965 252019 252714 253743 254536 254469 253390 251873 250908 251100 251973 252243 251074 248872 246561 244425 242218
53068 242218 240087 238529 237431 236095 234483 233586 234025 234904 234755 233196 231094 229399 228521 228632 229847 231924
53052 231924 234255 236409 238370 240126 241278 241281 240035 238129 236512 235849 236070 236506 236488 235831 234781 233735
53036 233735 233053 232939 233190 233189 232473 231336 230643 230950 231995 233134 234035 234783 235506 236262 237231 238679 240538 242250
53018 242250 243245 243454 243200 242711 242029 241311 240856 240702 240492 239929 239213 238833 239043 239720 240634 241628 242542 243151 243337
52999 243337 243249 243266 243689 244425 245066 245377 245673 246503 247988 249721 251355 252990 254838 256782 258532 260006 261333
52982B61333J305J432J842K339K290J296k04j293j491j101o89m49k11J37M32N43
52966B67511O35R35J273J216O78Q8j31N7M71R03R29J33j210k181k339k305k665
52949B63998k941k376j293o78o82n41P6O13O24L43M7k83n30l86J6J20j68l19p8
52930B55562K01K88L25J80n28j416j357m4J317J548R26M18K83J57o4k87o29r85
52912B55895p38L01J220J106L65M9K70K88j42n77q82j334j781j692j208j041j231
52895B48868r01K87J405J508R85R48J698K462K436J614N97l9j38O8K87M43O17
52878B63145Q08R71J180J587K169K705L009L030K855K704K816L171L412L215K561
52863B99338J581L90p33j369j536j864k778l808m224m017l727l503l135k787k882
$$ plain form
52982 261333 262638 264070 265912 268251 270541 271837 271633 270340 268849 267748 267059 266610 266399 266536 266968 267511
52966 267511 268146 269081 270354 271570 272248 272336 272205 272262 272733 273636 274565 274698 273488 271307 268968 266663 263998
52949 263998 261057 258681 257388 256710 256028 255487 255563 256176 256800 257143 257190 256907 256377 255991 256007 256127 255959 255640 255562
52930 255562 255763 256051 256376 256556 256028 254612 253255 253211 254528 256076 257002 257420 257703 257860 257796 257509 256880 255895
52912 255895 255157 255458 256678 257784 258149 258198 258468 258756 258614 258037 257155 255821 254040 252348 251140 250099 248868
52895 248868 247967 248254 249659 251167 252152 253100 254798 257260 259696 261310 261907 261868 261730 261798 262085 262528 263145
52878 263145 263953 264924 266104 267691 269860 272565 275574 278604 281459 284163 286979 290150 293562 296777 299338
52863 299338 300919 301309 300576 299207 297671 295807 293029 289221 284997 280980 277253 273750 270615 267828 264946
52848B64946l201l005k256j891k506l459l756l235k377j548r22p20q29n62M95
52833B35174J640J770Q34j01k57Q8L22L30K91K12K1k18m76q30j057o75K55Q11
52815B38134K97p32j166q30m63l36N7P76R59J80o10l70M36N10m20j406j831k012
52797B31173k267k311j968j546j215o90l9J0q84j835j679l43J298K522L072K721
52781B26019J383k93j177p44M27J397J703J380O25k69q57q22l13J29N7m44r04
52764B27297j033j005j069j015m09O81J584J848J784J965K362K371J585L34n75
52749B36705n43K97J145J242O43J81N98J739K716K718J667K31p53r23m98J56Q14
52732B48135J176Q30j40q79p36k17k08n47l66J75j62j654k764k176o77ln35j265
$$ plain form
52848 264946 261745 258740 256484 254593 252087 248628 244872 241637 239260 237712 236790 236070 235241 234679 235174
52833 235174 236814 238584 239418 239317 239060 239148 239470 239800 240091 240303 240324 240106 239630 238800 237743 237068 237323 238134
52815 238134 238431 237699 236533 235703 235240 234904 234961 235737 236696 236876 236266 235896 236332 236842 236422 235016 233185 231173
52797 231173 228906 226595 224627 223081 221866 221176 221137 221147 220263 218428 216749 216406 217704 220226 223298 226019
52781 226019 227402 227109 225932 225188 225615 227012 228715 230095 230720 230451 229594 228772 228459 228588 228645 228201 227297
52764 227297 226264 225259 224190 223175 222766 223447 225031 226879 228663 230628 232990 235361 236946 237280 236705
52749 236705 236162 236459 237604 238846 239489 239670 240268 242007 244723 247441 249108 249339 248586 247663 247165 247321 248135
52732 248135 249311 250141 250001 249122 248386 248169 247961 247414 247048 247223 247061 245407 242643 240467 239790 239787 239252 237987
52714B37987j501j401r71J36J652K531K193J233N61M21N35P08Q54P68L33j69k98
52697B45572qK66J28k75m39j94K1k47p59p93o0R68J631J604R22o2o74n02o8k85
52677B46746j087j329m46O78R67N73L32M78P10R68J268J178L93m61n19J08O57
52660B51214J031J762K797L330K993K262J573R04M35O91J604K227J813O23o89
52645B74570j913l032l630l181j781k06P29P67K76j05o9J35J13j36k44P3P70J565
52627B64701K056K037J893K242K881K652R94r24j514q52l81p48j116p40m7K58
52611B73392K21K21K79L22N07Q27R19P63R23J624K116J647N97%J62M12J35n09
52593B84558r46q59l83J39M70O41P92Q69O66K15j2M44J459K294K226J290L15P1
$$ plain form
52714 237987 236486 235085 234114 234250 235902 238433 240626 241859 242420 242841 243376 244084 244938 245706 246039 245870 245572
52697 245572 245564 245830 245958 245683 245244 245050 245071 244824 244065 243272 243212 244180 245811 247415 248337 248275 247601 247099 247031 246746
52677 246746 245659 244330 243884 244562 245529 246102 246434 246912 247622 248590 249858 251036 251429 250968 250449 250557 251214
52660 251214 252245 254007 256804 260134 263127 265389 266962 267866 268301 268992 270596 272823 274636 275259 274570
52645 274570 272657 269625 265995 262814 261033 260827 261556 262323 262599 262494 262425 262560 262673 262537 262293 262366 263136 264701
52627 264701 266757 268794 270687 272929 275810 278462 279456 278532 277018 276166 275785 275037 273921 273181 273134 273392
52611 273392 273613 273834 274113 274435 274942 275769 276688 277451 278374 279998 282114 283761 284358 284358 284520 284932 285067 284558
52593 284558 283612 282753 282370 282509 282979 283620 284412 285281 285947 286162 286150 286594 288053 290347 292573 293863 294178 294249
52575B94249M04N52K94K22O01P34Kj020j375j196j316j672j357k97L70l5p90j064
52557B87306j137j594k070j755p23J03J90q0p4M00J051J444J390J107R18P38K09
52540B87423o29j199j133p29m66m35m76n10m34p8M89R23J043J064J196J393J613
52523B89055J889K010J645R49N44O25O67K74j78j66L20J084K180L552M706N200
52507C14356N128M667L602J828j94j955l497m902n698n447m625m074l877l414
52493B91898k396j195k81Qo05j937k954k632j242n1K97L25O05R37J008J073J412
52476B84270J623J109m1j131j602j274j69J399K654K919K402K015K305K962L490
52461C02931L852M172M190L511K188O23r67k506l585l734l265l158l779m274l716
$$ plain form
52575 294249 294653 295205 295499 295721 296322 297056 297058 296038 294663 293467 292151 290479 289122 288825 289195 289160 288370 287306
52557 287306 286169 284575 282505 280750 280027 280130 280320 280240 280166 280566 281617 283061 284451 285558 286476 287214 287423
52540 287423 286794 285595 284462 283733 283267 282832 282356 281846 281412 281334 281823 282746 283789 284853 286049 287442 289055
52523 289055 290944 292954 294599 295548 296092 296717 297384 297658 297480 297314 297634 298718 300898 304450 309156 314356
52507 314356 319484 324151 327753 329581 329387 327432 323935 319033 313335 307888 303263 299189 295312 291898
52493 291898 289502 288307 288026 288034 287429 285492 282538 279906 278664 278613 278910 279235 279840 280777 281785 282858 284270
52476 284270 285893 287002 286961 285830 284228 282954 282785 284184 286838 289757 292159 294174 296479 299441 302931
52461 302931 306783 310955 315145 318656 320844 321467 320500 317994 314409 310675 307410 304252 300473 296199 292483
52446B92483k383j296r05q40p25n17j86K56M70J55l40m13j70k72q65j398j614
52429B81440j800j878j180L56J670J846J270R00R82J250J782K758L630L551K597
52414B99174J768J670J860J798J787K501L951N390O262O803P553Q528R218R224
52400C67487Q497O864L932j50m211o969q215q573q355p362n733m165l061k160
52386C27826j209m22j0J11l4m51o73L6J593K932L310L092K891K730K601L069M467
52369C51859O007O529N836M632L429K222J021lq65j695k362k542k075j089P3Q64
52353C71841Q76M41M14J037J626J687J749K390L150L185K619K350K817L655M436
52338D04273N025N354N522O039P330R028J0328J0947J1276J1776J2739J4398J6601
$$ plain form
52446 292483 290100 288804 287899 287059 286334 285817 285631 285887 286357 286512 286172 285759 285589 285317 284452 283054 281440
52429 281440 279640 277762 276582 276938 278608 280454 281724 282624 283606 284856 286638 289396 293026 296577 299174
52414 299174 300942 302612 304472 306270 308057 310558 314509 319899 326161 332964 340517 349045 358263 367487
52400 367487 375984 382848 386780 386630 382419 375450 367235 358662 350307 342945 337212 333047 329986 327826
52386 327826 326617 326195 326185 326296 326262 325811 325138 325174 326767 329699 333009 336101 338992 341722 344323 347392 351859
52369 351859 357866 364395 370231 374863 378292 380514 381535 381532 380667 378972 376610 374068 371993 370904 370977 371841
52353 371841 372717 373158 373572 374609 376235 377922 379671 382061 385211 388396 391015 393365 396182 399837 404273
52338 404273 409298 414652 420174 426213 433543 442571 452899 463846 475122 486898 499637 514035 530636
52325E30636J8586J9702K0301K1241K2557K3294K2763K1341J9963J9168J8884
52314G58436J8829J9001J9823K1605K3785K5166K5112K4110K2905K1705K0623
52303A001100K0058J9947J9364J7738J5868J4771J4018J2410R851P255M791J656
52291A158827k346o279r338j1524j2798j2819j1864j0944j0462r705q221o688
52279A045839n796n069l678j672K99K006L646N246O766Q493J0619J2718J4121
52266A093538J4754J5082J5452J5910J6508J7256J7817J7811J7420J7320J7792
52255A276660J8135J7267J5038J2663J1569J1717J1494R506O073K514o46l921
52243A388069p533j0749j2821j3865j4430j4886j5490j6525j7821j8591j8319
$$ plain form
52325 530636 549222 568924 589225 610466 633023 656317 679080 700421 720384 739552 758436
52314 758436 777265 796266 816089 837694 861479 886645 911757 935867 958772 980477 1001100
52303 1001100 1021158 1041105 1060469 1078207 1094075 1108846 1122864 1135274 1145125 1152380 1157171 1158827
52291 1158827 1156481 1150202 1140864 1129340 1116542 1103723 1091859 1080915 1070453 1060748 1052527 1045839
52279 1045839 1040043 1034974 1031296 1029624 1029923 1031929 1035575 1040821 1047587 1056080 1066699 1079417 1093538
52266 1093538 1108292 1123374 1138826 1154736 1171244 1188500 1206317 1224128 1241548 1258868 1276660
52255 1276660 1294795 1312062 1327100 1339763 1351332 1363049 1374543 1384049 1390122 1392636 1391990 1388069
52243 1388069 1380536 1369787 1356966 1343101 1328671 1313785 1298295 1281770 1263949 1245358 1227039
52232A227039j7450j6692j5945j4567j2600j1035j0613j0871j0698r623q124o764
52220A082057n439l844k270j386j185p65M89K013K809K759K614K952L722M704
52206A089230N713O369O285N702N408N788O329O329N785N346N573O400P197P336
52192A174790O836O364O463O880O839N847L981J626p59k774m368n852p409q725
52178A189739r502r970j0488j0851j0563r556q186o743n424m524m031l315j894
52165A094692k54P98J297J895K739L487M184N100N749N226L531J623O1j338k390
52150A126400k401j429n73m24k85M84J427J939K358L266M401N060N068M663L949
52135A153903L239L389M980P427R521J0778J1715J3093J5248J8060K1136K4145
$$ plain form
52232 1227039 1209589 1192897 1176952 1162385 1149785 1138750 1128137 1117266 1106568 1096945 1088821 1082057
52220 1082057 1076618 1072774 1070504 1069118 1067933 1067168 1067657 1069670 1072479 1075238 1077852 1080804 1084526 1089230
52206 1089230 1094943 1101312 1107597 1113299 1118707 1124495 1130824 1137153 1142938 1148284 1153857 1160257 1167454 1174790
52192 1174790 1181626 1187990 1194453 1201333 1208172 1214019 1218000 1219626 1218867 1216093 1211725 1205873 1198464 1189739
52178 1189739 1180237 1170267 1159779 1148928 1138365 1128809 1120623 1113880 1108456 1103932 1099901 1096586 1094692
52165 1094692 1094438 1095236 1096533 1098428 1101167 1104654 1108838 1113938 1119687 1124913 1128444 1130067 1130128 1128790 1126400
52150 1126400 1123999 1122570 1121997 1121573 1121288 1121772 1123199 1125138 1127496 1130762 1135163 1140223 1145291 1149954 1153903
52135 1153903 1157142 1160531 1165511 1172938 1182459 1193237 1204952 1218045 1233293 1251353 1272489 1296634
52123A296634K7055K9804L1810L2471L2176L2019L2264L1895L0183K7795K5800
52112A629906K4214K2367K0123J7988J6267J4781J3175J1146Q667O294M891M616
52100A794435M622M017K590M29k439n625q447j0943j3960j7651k0818k2506k3361
52087A680343k4371k5093k4403k2396k0205j8231j5897j3044j0356q257o394m326
52075A487370j932Q83M100P141R333J0779J2141J3587J4758J5687J6780J7968
$$ plain form
52123 1296634 1323689 1353493 1385303 1417774 1449950 1481969 1514233 1546128 1576311 1604106 1629906
52112 1629906 1654120 1676487 1696610 1714598 1730865 1745646 1758821 1769967 1778634 1784928 1789819 1794435
52100 1794435 1799057 1803074 1805664 1806093 1803654 1798029 1789582 1778639 1764679 1747028 1726210 1703704 1680343
52087 1680343 1655972 1630879 1606476 1584080 1563875 1545644 1529747 1516703 1506347 1498090 1491696 1487370
52075 1487370 1485438 1486321 1490421 1497562 1506895 1517674 1529815 1543402 1558160 1573847 1590627 1608595
$$ [...]
##END NTUPLES=NMR SPECTRUM
##END=
