##TITLE=AC1685_PANAH14366_8637465_tnnQyLi04W
##JCAMPDX= 6.0         $$ Bruker NMR JCAMP-DX V2.0
##DATA TYPE= NMR SPECTRUM
##DATA CLASS= NTUPLES
##ORIGIN= BRUKER
##OWNER= Administrator
$$ 1.72 TOPSPIN		Version 2.1
$$ 2014-05-31 00:38:55.763 -0700  Administrator@X
$$ Compression mode = diff/dup
##.OBSERVE FREQUENCY= 400.02188249412
##.OBSERVE NUCLEUS= ^1H
##.ACQUISITION MODE= SIMULTANEOUS (DQD)
##.ACQUISITION SCHEME= undefined
##.AVERAGES= 8
##.DIGITISER RES= 22
##SPECTROMETER/DATA SYSTEM= spect
##.PULSE SEQUENCE= zg30
##.SOLVENT NAME= COFFEE_meoh
##.SHIFT REFERENCE= INTERNAL, COFFEE_meoh, 1, 14.98509
##AUDIT TRAIL= $$ (NUMBER, WHEN, WHO, WHERE, PROCESS, VERSION, WHAT)
$$ ##TITLE= Audit trail, TOPSPIN		Version 2.1
$$ ##JCAMPDX= 5.01
$$ ##ORIGIN= Bruker BioSpin GmbH
$$ ##OWNER= Administrator
$$ $$ E:\/data/COFFEE/nmr/AC1685_PANAH14366_8637465_tnnQyLi04W/10/pdata/1/auditp.txt
$$ ##AUDIT TRAIL=  $$ (NUMBER, WHEN, WHO, WHERE, PROCESS, VERSION, WHAT)
(   1,<2014-05-31 00:38:48.560 -0700>,<Administrator>,<X>,<go>,<TOPSPIN 2.1>,
      <created by zg
	started at 2014-05-31 00:37:42.294 -0700,
	POWCHK enabled, PULCHK disabled,
       configuration hash MD5:
       C8 4E 4E 5D D3 5C D8 9E 9F 52 82 E0 59 8A DE 15
       data hash MD5: 64K
       2B 56 76 BA 1F 68 CA 0A 9D 04 FB 26 64 91 DA 94>)
(   2,<2014-05-31 00:38:51.638 -0700>,<Administrator>,<X>,<proc1d>,<TOPSPIN 2.1>,
      <Start of raw data processing
       efp LB = 0 FT_mod = 6 PKNL = 1 PHC0 = 0 PHC1 = 0 SI = 32K 
       data hash MD5: 32K
       95 B5 9F EA AD 34 18 98 05 89 59 41 D9 65 17 FD>)
(   3,<2014-05-31 00:38:52.013 -0700>,<Administrator>,<X>,<proc1d>,<TOPSPIN 2.1>,
      <pk PHC0 = 90.55481 PHC1 = 0 
       data hash MD5: 32K
       93 17 99 A4 C3 FC C2 89 75 BF 37 C1 22 6D 10 92>)
(   4,<2014-05-31 00:38:52.185 -0700>,<Administrator>,<X>,<proc1d>,<TOPSPIN 2.1>,
      <abs ABSG = 1 
       data hash MD5: 32K
       6E 76 A2 C7 0F B9 58 49 2D D3 75 6A 75 A0 E4 64>)
(   5,<2014-05-31 00:38:52.247 -0700>,<Administrator>,<X>,<proc1d>,<TOPSPIN 2.1>,
      <abs ABSG = 2 
       data hash MD5: 32K
       72 31 3A 05 9B B6 C1 16 5E BE 39 FE AD B9 06 28>)
(   6,<2014-05-31 00:38:52.325 -0700>,<Administrator>,<X>,<proc1d>,<TOPSPIN 2.1>,
      <abs ABSG = 3 
       data hash MD5: 32K
       25 6D 26 CC 79 12 C0 1B EF 93 2D 57 B2 6B 5D B4>)
(   7,<2014-05-31 00:38:52.372 -0700>,<Administrator>,<X>,<proc1d>,<TOPSPIN 2.1>,
      <abs ABSG = 4 
       data hash MD5: 32K
       F3 7C 13 80 F3 66 E8 70 2E 2C 0C 7D 90 67 C9 90>)
(   8,<2014-05-31 00:38:52.419 -0700>,<Administrator>,<X>,<proc1d>,<TOPSPIN 2.1>,
      <abs ABSG = 5 
       data hash MD5: 32K
       6C 94 D5 3F F8 58 BB 41 45 DD 2E AC 26 3F F5 A9>)
$$ ##END=
$$ 
$$ $$ hash MD5
$$ $$ DC 78 93 A6 B0 7A 0C 42 E0 42 88 E2 D7 A6 0E 4D
##$RELAX= 
##$RELAX= 
##$RELAX= 
##$RELAX= 
##$RELAX= 
##$RELAX= 
##$RELAX= 
$$ Bruker specific parameters
$$ --------------------------
##$DU= <E:\>
##$EXPNO= 10
##$NAME= <AC1685_PANAH14366_8637465_tnnQyLi04W>
$$ [...]
150 150 150 150 150 150 150 150
##$TP07= 0
##$TPNAME0= <>
##$TPNAME1= <>
##$TPNAME2= <>
##$TPNAME3= <>
##$TPNAME4= <>
##$TPNAME5= <>
##$TPNAME6= <>
##$TPNAME7= <>
##$TPOAL= (0..7)
0.5 0.5 0.5 0.5 0.5 0.5 0.5 0.5
##$TPOFFS= (0..7)
0 0 0 0 0 0 0 0
##$TUNHIN= 0
##$TUNHOUT= 0
##$TUNXOUT= 0
##$USERA1= <user>
##$USERA2= <user>
##$USERA3= <user>
##$USERA4= <user>
##$USERA5= <user>
##$V9= 5
##$VALIST= <valist>
##$VCLIST= <CCCCCCCCCCCCCCC>
##$VD= 0
##$VDLIST= <DDDDDDDDDDDDDDD>
##$VPLIST= <PPPPPPPPPPPPPPP>
##$VTLIST= <TTTTTTTTTTTTTTT>
##$WBST= 2048
##$WBSW= 25
##$XGAIN= (0..3)
0 0 0 0
##$XL= 0
##$YL= 0
##$YMAX_a= 638113
##$YMIN_a= -549573
##$ZGOPTNS= <>
##$ZL1= 120
##$ZL2= 120
##$ZL3= 120
##$ZL4= 120
##$ABSF1= 14.98509
##$ABSF2= -5.573092
##$ABSG= 5
##$ABSL= 3
##$ALPHA= 0
##$AQORDER= 0
##$ASSFAC= 0
##$ASSFACI= 0
##$ASSFACX= 0
##$ASSWID= 0
##$AUNMP= <proc_prof1d_extract_pilot.lims>
##$AXLEFT= 0
##$AXNAME= <>
##$AXNUC= <1H>
##$AXRIGHT= 0
##$AXTYPE= 0
##$AXUNIT= <>
##$AZFE= 0.1
##$AZFW= 0.1
##$BCFW= 0
##$BC_mod= 0
##$BYTORDP= 0
##$COROFFS= 0
##$CY= 15
##$DATMOD= 1
##$DC= 0
##$DFILT= <>
##$DTYPP= 0
##$F1P= 0
##$F2P= 0
##$FCOR= 0.5
##$FTSIZE= 32768
##$FT_mod= 6
##$GAMMA= 0
##$GB= 0
##$INTBC= 1
##$INTSCL= 1
##$ISEN= 128
##$LB= 0
##$LEV0= 0
##$LPBIN= 0
##$MAXI= 10000
##$MC2= 0
##$MEAN= 0
##$ME_mod= 0
##$MI= 0
##$NCOEF= 0
##$NC_proc= -8
##$NLEV= 6
##$NOISF1= 0
##$NOISF2= 0
##$NSP= 0
##$NTH_PI= 0
##$NZP= 0
##$OFFSET= 14.98509
##$PC= 1
##$PHC0= 90.55481
##$PHC1= 0
##$PH_mod= 1
##$PKNL= yes
##$PPARMOD= 0
##$PPDIAG= 0
##$PPIPTYP= 0
##$PPMPNUM= 2147483647
##$PPRESOL= 1
##$PSCAL= 4
##$PSIGN= 0
##$PYNMP= <proc.py>
##$REVERSE= no
##$SF= 400.02
##$SI= 32768
##$SIGF1= 0
##$SIGF2= 0
##$SINO= 400
##$SIOLD= 32768
##$SPECTYP= <>
##$SREGLST= <1H.CDCl3>
##$SSB= 0
##$STSI= 32768
##$STSR= 0
##$SW_p= 8223.68421052631
##$SYMM= 0
##$S_DEV= 0
##$TDeff= 65536
##$TDoff= 0
##$TI= <>
##$TILT= no
##$TM1= 0
##$TM2= 0
##$TOPLEV= 0
##$USERP1= <user>
##$USERP2= <user>
##$USERP3= <user>
##$USERP4= <user>
##$USERP5= <user>
##$WDW= 1
##$XDIM= 32768
##$YMAX_p= 461822730
##$YMIN_p= -781120
##$CURPLOT= <Network HP LaserJet P1505>
##$CURPRIN= <$Network HP LaserJet P1505>
##$DFORMAT= <normdp>
##$LAYOUT= <+/1D_H.xwp>
##$LFORMAT= <normlp>
##$PFORMAT= <normpl>
##$SURQMSG= 1
$$ End of Bruker specific parameters
$$ ---------------------------------
##NTUPLES= NMR SPECTRUM
##VAR_NAME=  FREQUENCY,     SPECTRUM/REAL,   SPECTRUM/IMAG
##SYMBOL=    X,             R,               I
##VAR_TYPE=  INDEPENDENT,   DEPENDENT,       DEPENDENT
##VAR_FORM=  AFFN,          ASDF,            ASDF
##VAR_DIM=   32768,         32768,           32768
##UNITS=     HZ,            ARBITRARY UNITS, ARBITRARY UNITS
##FACTOR=    0.250966925370066, 1,           1
##FIRST=     8223.43324360094, 27913,        -118392
##LAST=      0,             -29729,          -275726
##MIN=       0,             -781120,         0
##MAX=       8223.43324360094, 461822730,    0
$$ Real data points
##PAGE= N=1
##DATA TABLE= (X++(R..R)), XYDATA
$$ [...]
23850 -146269 -68893 -386552 42886 25836 -263114 47260 14379 283387 99826 19663 138889
23839 138889 158877 -229641 -182498 -38692 269637 54871 319298 -125493 -120654 -322745 64751
23827 -62617 -156562 -125141 142136 53448 -255751 -65056 59078 -9494 77657 20664 222594
23816 222594 -153212 395043 19939 -214888 105671 -123920 -204815 -58988 127173 12661
23805 78068 40193 75897 -225788 -144572 -82143 -81144 -237566 110017 6035 73701 197510
23794 197510 47241 -145491 -24719 110827 237845 27260 -117098 165422 37524 -19878
23783 3231 -199528 15476 92418 -73281 -11170 93329 1849 5764 258048 77789 -398354 -11657
23770 148479 29098 86500 277693 -162591 -60155 -160610 -110387 -261392 216298 -236523
23759 132574 -190477 107357 27229 -245740 197302 224855 -201944 186279 159750 -20583
23748 18071 -151473 20431 -164603 142530 -239466 -229779 65014 3722 256224 54515 -183637
23736 250315 -308970 -183187 14000 -74240 -182154 84123 247604 134840 59985 -239279
23725 -137682 65157 -641051 -196724 -114416 72076 257279 116708 16521 252549 71538
23714 -194366 179979 12336 -135355 225154 27206 -18236 239732 -372625 -199275 -76051
23703 161572 -207715 -250000 -277794 -148246 206777 184096 152223 -6832 73836 99728 -48277
23691 -173364 61763 -208724 -104222 -181475 -266120 140804 -298861 -189330 122079 209616
23681 209616 65540 -356549 -105 -139411 -66207 5279 121743 -75651 -226725 81365 43154
23670 43154 35353 -93340 -268785 -474771 100128 325830 172091 -19113 -240019 -170366 157503
23658 178997 -28968 202975 -16542 26827 -14287 -52658 209854 -85969 -195040 14096 267061
23647 267061 231006 -255935 -306775 -370632 147474 -122411 72825 -68464 -7689 91152 15044
23635 -333014 277320 -90788 156971 -122303 -29697 62789 50224 -5326 149760 -92055 -3966
23623 -113618 95123 -1266 37083 17680 135687 59208 -66450 -13757 -143971 -215011 71829
23611 49069 -208800 -90066 -56559 168626 68698 247338 196219 -101778 -287557 -70785 12937
23599 14983 16815 -118814 -62193 -52634 222199 73053 155320 138186 42943 -208047 63033
23587 -94713 -2016 -8115 -147648 77119 -146157 -141805 -229292 -180373 208169 -119628 167588
23575 -163915 57847 320167 -114119 72036 47924 -31332 -134232 -37460 -24915 -290292 -185254
23564 -185254 -428414 -193960 -574655 132328 -102243 34322 -89660 -267904 -136404 -171583
23554 -171583 134847 -180758 -109339 37987 36064 -146407 135976 -396245 -335785 326977
23543 192280 -16153 -94763 46070 43098 -91910 -37595 151771 -154718 56929 38924 -154094
23531 -175740 -156844 135381 -217013 268456 97889 278936 75439 78619 -140694 -216028 269642
23519 -233505 -171905 62015 -4914 90713 -16443 -52192 -200756 -31510 70961 10782 33606
23508 33606 -69953 38557 -285271 121753 54364 162056 193178 -256679 168261 118744 -92184
23496 26550 -175096 -181589 178208 55050 166146 20190 539085 308618 228825 -37608 -182574
23485 -182574 -338016 295640 -42923 210589 -156069 -24081 19629 63930 271588 97557
23474 236212 -334200 134557 -274389 -9934 -43210 -212722 -41221 7833 -125492 -391412 -46510
23462 169974 -170629 -72679 256747 -72822 60321 139063 -170025 -115092 -86203 188912 -112813
23450 150293 -76460 -217893 -70850 -204911 52579 42438 -167556 -188557 4895 178624 -64821
23438 241686 -215170 -241400 -21491 -72480 -401970 -58859 117529 -194245 -109559 181148
23427 164290 -157123 42811 -114191 -142361 26029 232423 93001 -87600 -21009 -90188 217355
23415 236289 -508940 437376 272314 -285377 -48570 -371735 202892 8037 33883 33433 114447
23404 114447 -327504 -214064 -234327 -259879 -209259 165300 587800 -104244 -67320 91955
23393 -126620 82045 -303349 -176795 -212028 192475 240013 58051 -25944 -432961 -41702 -154081
23382 -154081 174443 166565 -73227 56935 -183726 -48222 161101 20796 -357716 191508 -378635
23370 80943 -76038 266652 -4343 -120538 -89840 51441 91160 187054 -247874 142143 -141251
23358 -300776 -38270 216073 237638 -152477 209520 291985 132788 263036 -32642 139239
23347 -137667 -44803 -426074 -176823 28156 164727 24101 -1377 -71971 -57691 -9546 -170344
23336 -170344 -4987 -230976 259903 -220312 -188843 -43016 62215 313651 -341153 -9364 -49584
23325 -49584 13561 -244172 25293 -64346 149195 27343 58884 -212002 -164413 146730 47081
23313 16176 24773 88515 102153 -319795 161176 -79646 -15054 -266504 -28369 69755 106112
23302 106112 -44031 -23892 -64230 35600 -92695 7431 245703 -197635 -19076 178153 34046
23290 43220 -253334 156298 -246248 129580 -92945 13314 -141538 -170127 -212793 152504
23279 106966 -163002 287899 -36336 137672 -186827 90039 92010 -248136 -288785 5486 -59537
23267 -41515 188163 -86505 28104 121930 -150123 -235800 4381 83571 -63200 319723 34479
23255 216615 -111965 60239 31701 136876 -126899 217009 171241 -218697 -117962 -77584
23245 -77584 4591 -50 -184638 40328 -237932 -132128 -60952 57930 -211134 -100511 22505
23233 205565 123146 -55651 117205 -61141 -20679 93568 224710 -83236 93983 -337984 20374
23221 -316090 148946 92181 -198603 -73418 -336690 -102178 -353256 80999 162004 15383
23210 -106801 12403 39262 -218745 9093 274282 118296 23868 47480 2218 -225902 -44596
23198 249091 -205873 313096 -92415 -114972 -120848 214876 45127 132051 -122656 110994 -21277
23186 136381 51727 -89072 -138221 -46481 83776 -115564 51695 355842 -267780 255676 -117912
23174 129057 -195044 -136275 -269343 -262258 218038 44311 -392472 212186 -197290 -200867 -368756
23163 -368756 -93692 24498 -73915 64502 33963 -101705 -339086 -97356 -145606 -195707 240967
23151 -160412 302506 219801 78263 162901 -74773 -243029 109557 -112054 -68599 -32919 -83843
23140 -83843 10027 -315603 -98334 -5278 387052 80464 226651 112922 84068 338503 314789
23129 314789 -158698 62865 250624 -248408 75832 -5651 346416 161916 341871 -197437
23118 78597 -247020 -111090 85143 440540 -411368 -36853 33586 170728 161251 -132430 -170789
23107 -170789 33292 212527 175315 94526 132765 -188453 298016 20282 200906 -186840
23096 81233 198263 176863 104492 5724 -285211 452588 25210 -34319 69798 278084 -202152
23084 -33835 -63160 -253802 123890 -41280 -308412 82774 103739 208846 -148156 109997
23073 43901 -225190 30136 211674 -210018 286043 -106373 -95347 41390 -203815 48476
23062 -29123 2977 -281495 -110571 -183523 36603 150737 42636 -201534 301522 162964 -126170
23050 -86794 -339253 -55889 67428 -229915 -80159 90310 -252442 -171735 -26822 -127321 -137945
23039 -137945 -214235 122568 81435 276836 279785 151731 460536 -316972 -50167 15898 224162
23028 224162 201961 55438 -136628 -186909 336842 -4722 -120453 -95478 -145122 -122515 67719
23016 148287 -4739 121579 -89522 -6381 48001 83485 12096 10399 -772541 27439 14344 -43319
23003 -3117 185218 114382 446564 65145 -128185 92498 1415 -75310 178588 -150502 -82838
22992 -82838 -127998 154495 119853 25117 -206518 -57099 -60325 -109649 -126561 -151086 -81440
22981 -81440 -174737 -109665 -369983 71086 -22912 -72377 139443 -100843 104696 -173692 -90971
22970 -90971 95015 -30046 217070 -113774 134827 73750 -127570 -380602 67573 -492930
22959 91404 122840 73038 297361 -5329 -149271 -138697 -342350 -349573 -47590 154130 -735 37670
22946 89616 358873 -76858 -163321 -176921 324826 7557 -22955 224226 -163247 -144029 -151529
22935 -151529 -159168 182256 173480 -212635 -145185 -29379 232927 49809 -244395 -113602 -202190
22924 -202190 11143 168465 -173795 17226 -14783 -69599 67157 -265846 -146088 124526
22913 -14923 -70161 -48018 -44404 196268 -255794 -95963 -192644 -77953 302214 162831 293105
22902 293105 -20960 -467390 38047 -60215 -102905 -230138 284880 318315 -406670 22311 -102877
22890 44788 46772 38682 -168141 -203717 39560 -9607 185810 352145 63637 -73089 -160672 91169
22877 42124 -318987 -80600 3511 -263223 -75704 -162407 -174370 -285511 142343 -30535 140910
22865 -27631 -154527 -15892 134469 240455 -6675 -6421 194469 -16097 -250126 7727 105544
22854 105544 99610 -80950 -19525 -397848 69737 -114815 -167554 -78157 23044 -248361 152053
22842 -293229 -189597 -24463 -255390 -166685 -317053 -10618 -35504 -190622 246138 -9094 99001
22830 126214 -110795 -212132 -148295 102929 130288 98976 47264 -526189 163479 -53759
22819 25355 -115873 183987 -27748 -294834 129705 359637 255126 -217979 -16818 42071
22808 331472 -89594 98274 -107878 46968 -152630 -95479 47644 373042 66786 98934 -93840
22796 -350934 -10014 231985 -196768 36156 -109929 319482 -365379 -194199 122274 -138399
22785 -27929 141615 96472 -152321 -246614 -212100 -146355 -39985 -131635 -134193 -249792 -287937
22774 -287937 54731 -311986 -136291 27130 10780 88169 57818 62748 -158206 250370 -382139
22762 -249064 327965 158860 -51172 -225244 -91518 177405 -79765 -127327 -15979 38645 12990
22750 64270 242361 -153976 -57890 -52284 -257125 77502 120920 195249 309953 250673 55776
22738 -96084 -54863 45289 211975 77902 -4684 -27498 41530 237600 120422 -112563 -15320
22726 118286 135309 -203762 63665 210828 443865 -91067 -10346 213084 -113670 -177756
22716 -177756 -52893 -56428 66470 227095 -207788 -401163 536341 -83957 -262279 -148378
22706 -148378 266759 -89386 -173233 -80728 -45417 35720 -383384 301458 -68771 -23352 287875
22694 71847 -54284 -113443 -202718 -31996 80883 -158591 -107757 42412 387273 -67808 231155
22682 286922 17067 -83554 -120591 -53437 -332048 51381 -299679 -160020 -15835 -165278 -36381
22670 -439172 136648 -226815 139498 -63461 89783 -43498 -66568 304134 42111 -32362 33438
22658 -204384 274485 -20108 -18442 -459686 -323741 -118226 82559 431864 455493 -22990 54487
22646 -120469 45750 -115258 -122678 32385 -202439 -90295 -174922 102447 -310896 248068 332514
22635 332514 -88671 -286729 -210453 251935 -179463 167032 -7543 14779 -817 -92037 11190
22623 53880 -279913 -147573 -6640 76577 -244561 -261082 -284381 -25736 19222 205941 88646
22611 106584 -242763 -431772 -231728 145970 87782 92736 132816 -27312 132156 -5637 251
22599 -71458 -59494 10173 -119176 -450528 -271828 24628 233521 104322 168411 -139500
22588 -141268 -109829 -179549 193228 324588 47659 138736 226860 -209506 -229027 36416 155743
22577 155743 -110052 59575 -5443 -203756 -308411 267130 -66480 27205 -62849 -26304 24766
22565 -130060 -181277 176612 -75075 328995 -262537 -64879 -41909 -319003 152592 -317567
22554 -66684 184968 -20331 -97395 238161 150799 -101864 -265628 -171593 -94551 102022 -24031
22542 122375 -18491 219099 3875 -25878 -247624 144617 -93197 159821 -164014 113135
22531 -215590 -191234 -194 -81244 -183527 416983 -54811 -146748 158992 -20157 -80636 312872
22519 -65918 -58412 -66842 -16720 -120517 -51958 35202 -357225 217043 -412960 -106042 157823
22507 -325588 -110769 -250991 972 12238 -109226 10203 -226125 62515 -243116 59137 49345
22496 49345 200730 42798 -14496 80929 -255384 -130237 -209996 176105 -126170 -32357 -95881
22485 -95881 -121419 -121792 -267218 -169272 93871 -17916 305704 -101476 302657 -20226 -33608
22474 -33608 46025 -33699 -279298 -50517 9336 25766 -377321 -12711 104635 -6189 354764
22462 -116670 -135682 -151527 -52018 238296 -196644 -169640 -448033 -195750 172262 127244
22452 127244 -102684 99702 -118026 32922 -16185 126027 -170989 77996 -402862 -80415
22441 236024 -255858 56989 -87743 -40634 -357158 181266 55521 33944 291623 156761
22431 156761 -135820 -106945 266708 -109104 -12487 -161761 -310164 32481 -202264 -364575
22421 -364575 292330 159925 -252196 -63032 229055 6319 -200748 -662913 -116376 108634
22410 -128346 -203933 -231321 70731 -36763 390501 -34224 302904 123090 12794 70220 -23996
22398 -82627 -52240 20475 85572 -59909 297061 -189494 114694 18390 -43552 165069 -181868
22386 -63417 120235 359370 51711 -5947 -10882 106184 -69996 115512 34066 -53907 7330
22374 -162028 -165862 -26314 -90476 334946 78194 115076 -14528 -235463 -211749 -15139 -208633
22363 -208633 -155474 117141 244249 -11911 -60779 -103433 -200826 -55808 99623 -135783 -101780
22352 -101780 -324146 209 -57388 -267012 -128903 88514 -43531 137302 -268613 189395 143220
22341 143220 32348 -71920 -125690 -273994 -101287 101198 -71371 35064 -56 95943 -341878
22329 161333 -80127 38967 206566 139690 -176193 -105408 -111120 -173689 184821 167390 168140
22318 168140 103070 -311880 -118044 -60034 10564 -104318 159778 36798 -1048 -26596 -183071
22307 -183071 182125 -28865 -138591 370552 -48518 -77777 106761 101797 234721 -277865
22296 -28490 -113669 -162650 -446487 63797 -137451 -300417 -25693 -286539 -20738 132361 406955
22285 406955 204057 -163263 349791 -289517 94316 55709 -238362 -280334 -436513 -310231
22275 -310231 113638 -354887 -127192 129515 132341 61524 -293460 -104716 -338780 -141825
22264 225758 -22460 -188983 -325996 152465 -221090 -17252 103371 159561 259643 129166
22253 -77653 30196 37066 -315761 -80334 47031 -7294 -132510 20178 -39694 -36836 -2820 7200
22240 -184547 143345 -263541 -36483 176371 128248 -105041 -85488 104389 81659 -346405
22229 167430 246250 -46075 -65960 117840 -268555 -159771 155888 -35794 -247835 -103466
22218 60159 54533 -173140 286255 39448 -5117 -346914 138433 -152429 -283904 131565 363803
22207 363803 -191221 66052 -19242 -204780 140749 -284545 -215311 2086 -51367 -69612 246084
22195 -145582 -136438 159319 -25642 376383 -30571 54116 70964 -69176 229390 -27854 -90006
22184 -90006 -44118 123814 -15638 130431 -236749 -95490 3744 -199090 153216 -152528 -72691
22172 -414617 390728 -90288 -70336 115615 -204302 244032 -73530 230207 161777 -41286
22161 -126356 47663 -88170 151590 -170062 -23491 23676 92033 -62268 275477 153697 75658
22149 2827 41722 -258812 -106473 278976 -95785 117912 48730 13790 174105 -129048 -28112
22137 244862 8019 -248805 -114139 -425396 179412 -144664 28510 -100914 -31991 236541
22126 112139 23823 43570 103880 -2741 -137021 -100693 -197019 -132878 -22568 300122 -196260
22114 111226 -209701 -119507 -310673 97200 60164 -148656 99922 224092 80460 82950 67950
22103 67950 93380 -146659 189711 60205 147887 -291740 149050 -277745 -78385 -279002
22093 -279002 -84097 -45516 31039 1661 17315 -261063 193521 79829 99314 31531 76676
22082 76676 -2753 -194175 -460453 88901 -113843 -28933 68011 -139880 -154469 -28384 -48242
22071 -48242 329728 -272831 31178 20394 -58651 -83582 -146307 285923 -93762 -109059 127039
22059 271034 113452 381382 -116376 -49159 -212082 -121229 -208842 -42919 -38838 -110174 -195293
22048 -195293 297876 -78 49884 108965 119956 -128294 75625 -189319 -49690 46593 -124368
22036 -3110 78941 -133631 52773 -50160 307549 -1437 -148906 -222092 -175034 -272345 -127700
22024 -207629 67518 -229745 219722 80273 -61259 462906 -133507 84432 225835 -136459
22013 -286921 259274 -214158 -142358 -71798 -118758 250540 122290 -61216 -139064 -8979 -165970
22002 -165970 -183913 85548 -29523 -192911 -226135 39953 129132 27389 -176906 -403744 -241701
21991 -241701 182586 -107929 -36246 19258 154712 91460 -273101 -332309 213249 -67839
21980 -152886 -92116 -192283 -208230 -156577 31814 -66702 -101627 -126178 -164332 -167752 202941
21968 -82143 -30057 -487358 28524 -40963 -65155 -223984 -144970 -320557 95448 55564 273054
21957 273054 45108 -150270 12046 -34037 -253930 -30613 85073 -97134 98860 -295250 -190617
21946 -190617 16090 -65172 -66066 -107153 -4041 -394943 -42659 -19570 65364 -233790 393039
21934 169174 -99094 -77111 -178862 -66487 -206527 -44254 -287698 -330948 -254668 100469 -13656
21922 -390150 -137258 -108000 -322794 77107 34141 86712 -82644 -14436 222929 -240723 68915
21910 118072 -102878 -301353 -201597 -73405 -110299 -3595 -264027 82792 169684 193650 146451
21899 146451 21660 -73963 -52618 -220207 -205066 16136 -181297 44891 120176 90834 2450
21887 -143076 -348765 -66702 -113015 187892 -200309 -77303 -103895 318336 69679 -192084
21876 -15935 -285170 -104924 -98780 -212659 -345223 886 262769 -77806 -340499 19936 -29098
21864 -56211 -25887 -98655 40273 -226746 -374604 234327 -38786 155194 94077 -125013 425313
21852 -318625 48697 -153654 80565 171711 -66189 -106569 11676 -70914 28865 -37895 -106383
21841 -106383 24364 80080 63821 -162284 -228320 -177449 -39121 208695 -168970 -239481 94315
21829 4741 208226 134914 -85139 -71862 -62222 -105819 -84541 -193833 -126547 -47868 -275113
21818 -275113 -26033 -79132 -96807 22003 -51009 -268316 118689 -34775 -2039 420124 -39917
21806 56554 190467 -114823 18875 -92487 -109844 -83004 -236023 -349600 11014 134374 -15386
21794 42417 -37833 -312385 -14777 155695 -21737 -54045 30531 -75909 -7304 -31640 31066
21782 -58536 134077 -393591 -112657 -15857 -314891 -110177 -110483 192036 -147772 -274166
21772 -274166 -105048 15562 296324 -8133 -103334 -122598 29234 -89532 30289 -70229 260155
21760 -73553 -295475 10587 -187138 -103052 186105 95255 -291613 -211444 174399 141948 -309265
21748 -19549 -9263 -55798 -117574 -239494 13478 -337345 -120554 -16919 -45713 -87194 -183261
21737 -183261 -9438 -154730 -168705 -109456 -33693 194667 -145876 266584 -60083 -54485 52194
21725 194599 113509 215760 -430210 84358 -74284 226149 144966 -115052 149260 -66959
21714 -234637 -16285 -11519 49854 -192015 64644 -193463 -233575 -70284 -201400 49363 33092
21703 33092 -10405 -1149 -188714 22436 18841 -52057 -282331 11106 -136559 127453 84501
21692 84501 -49922 -262896 -29813 233425 -38114 -108481 -429797 125599 64912 51548 -135551
21680 -113737 52902 -117904 -236658 188093 -69213 -57615 162646 147898 -99296 249362
21669 -182751 144892 -92213 66215 -245422 -65241 -154933 -103048 77213 -147522 -135439 -42469
21657 -12737 -273743 22173 370266 -235635 -282110 80218 -290316 -13136 -72791 16490 141928
21646 141928 -80211 -198821 -317746 -85174 -322135 36363 276138 -153854 -296960 -317000
21636 -317000 -102696 188390 -147868 -161005 239145 -117054 199543 255512 -341278 -112499
21625 -26520 -342522 262948 70595 -35440 75963 -445220 176980 130226 366330 -291048
21614 -291797 -359154 -306546 -23575 -97452 -213914 -87651 -103156 36305 262655 -1316 28390
21602 -232110 149176 -122648 -83339 -20373 33434 70391 -166368 130026 75432 -70163 -152924
21591 -152924 -76405 54896 186830 285996 -140333 77554 111191 -127855 -78217 42818 -79697
21579 161606 -36129 -153455 -325824 -385439 -251048 -280594 -133657 -48932 -280521 -70991
21568 182061 -128468 233859 -131420 283036 -55811 351720 114162 180088 148754 73173
21557 41800 368357 -328169 -221964 70773 64839 -130805 251762 140278 -256415 163896
21546 -359263 -227523 133258 -32363 -292372 155852 -191246 10688 -197663 -27444 -30543
21536 -30543 -173923 -88830 -46207 21338 -81533 -46118 58424 29479 -143700 -127664 115605
21524 -96493 -40236 -119351 267203 52564 80616 37784 -205654 -13436 21172 -420366 138774
21512 58601 47716 -32919 -105148 -103051 219155 -214566 139682 1038 -189886 378983 -314585
21500 -150279 41790 99679 -327975 132760 -249541 -382164 -16676 30910 -240134 -390441
21490 -390441 -146503 -227961 -47741 -239409 -144541 -231012 -215941 -33535 -43012 -112082 -162409
21479 -162409 -37876 -40543 369871 -334189 -127349 -50410 19219 -309920 34342 20164 100918
21468 100918 133080 13213 55972 -116435 42418 -221432 110350 -204573 -462399 -190840
21457 -156490 -194567 -288257 -94714 190255 -45273 -95871 -365129 -542315 48130 -300415 -162851
21446 -162851 57089 140233 150459 101094 165276 23734 205789 95177 174958 248936 132580
21435 132580 126200 -331517 123528 -157037 191243 20379 109602 14601 -57127 -27244 -5662
21423 -195497 -134671 -69174 31089 44182 -27643 -111045 -37181 159802 -133425 -175111 114031
21411 -32204 190116 -215625 -196328 -139472 -4430 -221993 177782 -192758 -277051 19402 -210998
21399 227528 -71166 -121761 212149 -228632 1093 -380976 92241 128384 -243271 -81063 162856
21387 -10441 -117642 -437577 334967 -357554 -197675 204652 185456 9606 128460 -148714
21376 -45109 -34085 105725 31802 126448 -132819 -294549 264079 -661 -1488 2751 -118095 -84099
21364 -84099 -15335 -382051 -130921 57082 -159769 -74570 167502 -166172 -161150 148190 189290
21353 189290 -245237 -87542 27043 -80842 69314 238997 15214 135914 -21759 -7990 -92281
21342 -92281 -204577 -315866 -16029 181151 59846 -81800 47088 -207476 -159733 -103272 -158399
21331 -158399 132494 58076 12077 73016 22718 -339731 -121770 -197381 -22816 449535 -182650
21319 -290396 422293 64803 -578513 -262807 65372 44682 134992 282018 -321704 16693
21308 157974 292481 -51283 -253174 70590 52785 14712 -285286 -139509 -163736 3812 301911
21297 301911 -117715 -14355 310853 328235 -334250 -140043 -202308 -19693 192604 -260089
21286 123115 -165517 39288 -63384 228609 -185215 -263423 19544 95120 369274 204389
21276 204389 -175128 -71309 -266877 -210529 -158809 -98958 177940 -285286 -2695 -130353 -113681
21265 -113681 -32134 -173784 -300139 -128144 -186126 -35709 -120023 -35193 -198880 -35082 366566
21253 80210 50259 -77914 -181489 110229 38662 -44881 -28996 38267 117539 -49958 -244361
21242 -244361 -48645 -179267 -120029 -204102 125277 -24761 -101068 -16185 233136 -193595 -77364
21230 -177457 -349269 -172365 91972 -293183 41806 92640 70362 149651 -40433 -37412 317808
21218 28725 -284334 255213 129839 -101580 37120 -306980 93489 -323900 -138908 25896
21207 -101025 124167 38218 -92952 570 -4733 -220898 -250725 -282574 -89914 -88256 -68385 144700
21194 -313112 192370 -102991 17239 -229776 -378515 110071 -248388 -263944 -92086 289433
21183 -62332 -173648 -11244 -322810 -67667 -196005 -200274 -100767 198507 169616 -136789 118889
21171 -27626 91130 -28832 -102788 81865 -88989 114676 -329673 -12368 -53154 -441719 8818
21159 40055 -268588 90903 -251612 -34929 -8864 45340 105386 56411 160938 161233 -116244
21147 -125259 -114671 -16561 -221414 -123861 31722 -238710 -104776 -116470 -279425 -234358 -369428
21136 -369428 -141838 -148354 -78655 107356 -110928 43789 178562 -80914 57509 158440 -187648
21124 -247509 -30361 -149611 49101 9888 -92274 -194440 -310029 -88219 131960 -128787 -130790
21113 -130790 189086 -191064 -147395 -19920 -51874 -263314 -132617 34350 -178591 -133694
21103 -133694 -153606 -15450 -19562 315443 304371 92576 -138016 -54866 33100 -166098 -148057
21092 -148057 58392 209543 158690 8866 -70697 106160 216420 362989 163722 -146036
21081 20598 -215144 -19565 -4404 -190588 83826 192560 85117 -26492 143997 -369425 11014
21069 -203388 2902 240136 -157823 -61106 -327994 -260669 -309213 -146848 -223729 -71772 -283252
21058 -283252 180195 -58463 27655 8282 -267504 247328 -356134 81079 -3361 -4111 125113
21046 -98093 202675 -240955 287796 79786 89600 23176 195511 136687 110022 -257155 -42625
21034 -162349 -93936 -387487 48484 -170187 -349171 -221630 -58468 -79925 -113300 -183503 11515
21022 328157 69988 -21681 -217458 -92984 -146961 -166739 -139432 -151580 -19062 -58571 -34752
21011 -34752 -242627 -26420 102298 -250412 -73965 -93374 65313 497952 -163205 -145985 -11274
20999 -105439 -106992 -65748 -266070 56971 46828 46900 -250201 187251 196462 -76642 3612 -150014
20986 -263567 -106896 157837 221464 -176313 -138664 -305552 179032 13096 268680 -301153
20975 -32193 121974 -62060 231126 -209692 194658 -372106 -129833 213020 38506 -171364
20964 -250224 -8010 210002 -158004 -26192 3627 -9322 -5137 12354 -116876 103800 32175
20952 -137931 185380 -339476 -178850 -32200 -158872 -16911 -235033 7618 -390831 -184543
20941 -87143 -46586 -32412 -95599 211576 91691 849 120649 -46847 199560 -22911 -12980 18585
20928 -116005 -132099 31533 123102 -135731 -81767 -215027 -204177 172222 260315 -76280 -277962
20917 -277962 104925 35846 36728 -179977 -287336 9510 143692 202640 -16531 -53672 73795
20905 87040 47796 -59315 -8830 346199 97329 89329 -223245 22588 -279646 -295736 -382977
20894 -382977 -121975 -89896 -77693 -141287 64989 -10122 20553 -95084 -23635 68767 -384540
20882 -1590 -39118 -231906 -155684 51465 -155998 -97730 -4462 235803 -36764 197935 214404
20871 214404 103124 29463 -187587 133903 -121741 -163304 264276 -167753 -140991 -49066
20860 106486 239932 -82102 179573 -110323 -20365 -49391 18011 172352 -141888 -139739 196092
20848 196429 -63712 9293 -189041 118911 6521 -264738 165914 -417422 -373251 -14197 39738
20836 -38518 132415 -5318 -17877 -260004 34690 -264791 -285028 5760 -138276 -163145 -434661
20825 -434661 -52423 -16134 45560 199282 -87559 77363 82367 2164 146614 -243565 -177912
20814 -177912 -249950 -197036 142290 -68747 -94355 -167832 82339 -4825 -176014 -259331 47519
20802 -259564 -82882 42433 -160876 178654 199610 -351716 211829 -85994 36433 380078
20792 380078 44181 -52457 -102639 -110225 -49238 -153037 -113215 -36630 -43068 92898 188834 -442984
20779 -170872 -84047 -99778 -328004 334998 -49720 107297 -6918 -62773 -141701 -259710 -43726
20767 180014 -259827 -245404 -110640 -358084 143796 -103857 -317651 58567 -39514 10524
20756 19147 107412 -159469 8990 -394061 -180752 75923 -340338 -226275 -1496 -182629 71841
20744 -90282 -105588 -93510 -34094 -271141 168073 -245124 -36729 18503 -89883 -362063 -136129
20732 -104192 -94519 -122489 -90764 152435 -447816 -67753 -64372 -21815 111803 -296936 -102080
20720 -82182 -121250 -4465 158587 -107391 58259 47795 -257647 -79117 -105107 -29501 50612
20708 -59116 72401 -133487 6210 -9709 243916 -227994 -52377 41312 -268880 26571 -295483
20696 -342054 -229456 -13936 -268900 -308468 -262899 -67985 8884 9781 -142241 24534 199932
20685 199932 258372 -271631 76347 163579 -207782 -171141 -201763 -222119 -197070 -280045 -218075
20674 -218075 180220 -231123 -203352 -428468 -10734 -62296 -116167 -246810 92948 -118154
20663 -39221 -55213 32910 -152205 1377 -278450 -86368 -14776 46672 -289114 216717 -165052
20651 -89683 210118 -249920 -114076 -117705 289902 -305818 69558 -183243 -156668 -97213 261410
20639 126665 -28455 -227715 -31143 -145779 -139194 -130970 259199 -103898 54897 13842 -158236
20627 -99800 49035 -116149 352332 207474 -4366 1854 -31806 -94217 -27351 165544 -163433
20615 -181099 -117133 -222076 -179731 -97334 -309843 -235429 -3675 -348733 -83576 -159588 -360734
20604 -360734 32811 -78173 78488 131408 -71882 -39414 -107356 -322687 232973 -27009 -136832
20593 -136832 -116576 -185658 -54193 19061 149592 -317778 210026 11951 42844 -29517 42310
20581 -104397 -49227 227732 213852 96833 34353 -304290 -146529 -179793 48987 63562 -134089
20569 -286695 109772 -163963 -289689 -162322 304484 304569 179113 164816 -20016 -15505 19599
20557 -305731 175072 130648 -88373 -140288 182082 291751 242204 -154365 -64090 -153143 227630
20545 -277404 -190205 56000 81279 74498 -4377 -81695 -187769 40409 -298459 163077 -228716
20533 -167748 58721 -206542 43741 -203427 -318154 -93725 -95294 -210470 42077 -196477 51562
20521 -50904 241889 -181261 3522 -24907 -26886 137257 148320 51795 -115412 9388 76939
20510 76939 -222979 -241217 84215 -69320 -87564 -202551 5681 118155 -142977 96719 -2775
20498 125977 286368 -154110 -180980 199327 -40126 21107 261576 -97260 -71385 -125962 135465
20486 65537 104511 -57405 307720 -315458 98084 63080 -211458 -129136 -94589 -17547 238483
20474 -78249 -207315 -26152 -243118 34053 33453 81581 117869 -221144 123756 -188345 74318
20462 27910 154149 117155 367742 178450 -174100 36189 -120756 -6452 230715 -252882
20451 126068 -236471 -308267 -198825 76796 146241 -185504 283293 -80124 -128595 5403 -278971
20439 108185 -209286 -180623 80141 -259966 21832 -326652 -71345 51407 -346498 65824 130794
20428 130794 -235900 -245447 79208 317514 66587 -298546 -410022 -201061 185237 168011
20418 168011 -291116 133381 14032 -190032 -126159 -317902 41035 -173853 -274564 239417
20407 -122682 100242 -3227 -375128 -102133 -100691 122781 312022 70704 -77377 -44710 79468
20395 -217927 213582 -68542 -404916 140146 -301128 -233594 -68052 160715 98532 -146168
20384 49167 -19578 44339 49215 -288619 198935 -48065 23649 -2578 8714 7654 228946 2545
20371 135198 152363 -300468 -114960 -51160 -65518 196922 -139872 222677 65535 82687
20361 82687 -75317 26775 -202591 -80582 61490 -2278 4281 192727 -182288 28201 70639
20350 70639 -394623 -296522 57065 30706 -107303 54106 -214112 -82239 -335349 -8045 -231273
20339 -231273 -9598 213831 174439 -184923 -35625 117604 -61054 -85979 -64032 -283243 -239756
20328 -239756 -18471 -350432 -238101 -170597 187425 103006 -85457 52557 -165247 81040 -15719
20316 114951 51870 -153361 -259504 96645 -244975 -196770 -199222 -352200 -152788 -94579 -14250
20304 -91168 143140 -216597 -102809 -25290 -84085 -87856 -216469 -18514 40292 -69326 -36598
20293 -36598 -246569 -96518 294602 41473 -24135 340548 123205 -100600 82241 364243
20283 364243 -223158 -20496 -215079 204362 -83323 -226207 285230 34847 -128304 -421023
20273 -421023 -247551 -104479 186858 341361 -199789 -40704 -308420 -287168 126952 -92630
20262 -263307 5799 -35116 90606 -117274 -30735 258315 147652 -207825 -190060 198399 -88198
20250 -364744 -213543 -23501 -137021 93635 254730 -439667 -5337 -51565 200508 216347 -182502
20238 -177169 -19534 -84705 29074 10595 403076 -171331 -30793 -108090 -268492 -245317 41468
20226 -100055 -26839 -116141 -111887 -129438 -374043 -743 13064 121474 -265667 -149772 -449689
20215 -449689 -59371 -66072 -155595 -35856 168040 -227105 40504 -312551 189762 44477 -388812
20203 146080 -288558 72024 -421084 -83261 17529 -287476 -90941 -99027 -155955 -51846 -96432
20192 -96432 -36196 177193 188338 -94441 -134713 -116152 -182774 245073 -47326 -364672 -166349
20180 416657 -276668 86896 110006 -75568 -90509 538254 93801 34624 45241 -52178 -232630
20169 -232630 -540397 25558 115066 -99528 166401 41124 -113436 -36475 -93120 -204428 -158045
20158 -158045 150353 -173164 240370 -158927 263554 185964 -44041 -201702 231344 6307
20147 -26637 144870 65604 28191 -19997 -217680 13719 -12134 -364132 30180 -133237 -70219
20136 -70219 -36914 -72740 -12193 47315 -19489 299022 -168964 -82692 -264967 -228618 -131536
20125 -131536 -44191 -212338 -42119 105100 -370012 -169345 -69509 -43377 75315 -243369
20114 -202874 216477 74768 -134561 15309 136295 -120418 -418065 -155041 74969 -274516
20103 -388400 254977 -111147 -63026 -180556 -100456 -366449 -295918 2715 -50649 -62338 -46503
20092 -46503 -374176 -24046 -54516 -225317 132083 70848 82624 -294828 -357352 119868 2897
20080 53663 -34935 -153661 200334 -787 205331 152045 -138599 88729 -235712 -18971 30005
20068 -221309 165617 -239667 -240887 128705 -109940 52578 75557 -280571 -242254 19467 219062
20057 219062 -99740 -159078 -250602 -50403 -251734 -124509 129104 43760 -40607 63051 122103
20046 122103 20563 41668 -152644 13598 -37860 238785 -243372 307202 -66581 -92608 -195984
20035 -195984 82793 -403940 -296264 -71011 84977 110233 -244316 -26830 -105396 184084 109237
20024 109237 11633 -177440 -305828 -183227 -291197 -215663 186589 -201684 -219088 -177191
20014 -177191 47660 -29964 51157 49395 72722 -389516 258995 -19671 69507 -93066 137863
20002 -275013 -198624 -155984 -281534 -424024 -536839 -190690 -119582 -264982 -77830 -293792
19992 -293792 -120379 -54252 48519 18658 -17746 -19969 -32572 -17536 83231 -87579 -127614
19981 -127614 41505 3661 -59719 -19860 -82132 156384 -52491 -22912 -87074 -260384 -150825
19970 -150825 124930 14850 -2817 -325535 256270 -269093 24779 -118984 -159328 -74790 56268
19958 -282643 -49732 -131161 111962 -318315 260176 10027 -103441 -58933 -96058 -119741 -130758
19947 -130758 -28102 -282095 82321 36390 79925 -45452 -289335 -95415 33499 81578 361178
19936 361178 -148264 -96965 138105 75053 -99329 -53639 -147832 -167209 -55255 272220 -318410
19924 -37221 -169596 220569 47084 75303 -100340 -185347 -110563 -63186 -110155 -310549 -504922
19913 -504922 -350119 -450041 -257562 51022 -15980 5422 160897 9985 120693 197763 -314550
19901 -109976 -43823 -160748 -49947 -378936 202760 -211211 151282 -39435 -276542 -260710
19891 -260710 216369 -29874 -115300 53757 82757 -89028 -52935 -102004 -97407 -173768 -109706
19880 -109706 52828 72708 -95684 58656 75708 -10469 192048 -339170 10298 -291696 -449806
19869 -449806 86626 113493 -123538 245240 105315 9479 -53379 77935 133703 -194248 -46884
19857 24247 58885 109072 -260779 60918 -221125 -180688 -120330 -58023 -94904 -335600 175998
19845 -74701 -198898 -202968 -77983 -274262 -60064 -168225 40286 255054 373645 -127405 -15951
19833 -43206 -74316 17448 -111196 -46552 216685 -139670 -510583 -254872 -196921 -13115 281636
19821 -32670 946 -423286 -74691 57090 -59736 -26744 -138479 -42031 -210490 -32432 52563
19809 -370997 109210 -127087 134161 178951 149474 -215181 -196614 -76508 -17009 95206 141546
19798 141546 -123858 143982 -133151 -70447 -55840 311384 -130368 68762 -124289 -62741
19788 -62741 96706 -397863 2577 61675 -62768 -348442 227204 55044 237572 102193 37114
19776 -266962 -191891 384699 -231217 133310 -48850 11560 242798 -12797 -177619 229914
19765 -160905 -113696 -263505 12924 147456 -71451 -119271 255724 -16227 -1668 136604 -471078
19753 159610 109351 -91004 -168174 93299 157853 -238864 -329634 -101482 152431 14746 -105847
19741 62906 -25240 174335 -220495 11004 100156 -260057 -105171 -112763 -233859 -137698 31440
19729 139195 32669 -131509 266999 -362378 -586 90108 -250475 -246899 -42455 105705 -38542
19717 -277211 233394 -39962 315809 -216932 12112 63860 -157040 84947 -125311 -86004
19707 -86004 -236351 303037 -52625 -127143 -51936 155297 -35947 -106488 -36638 -241702 -9256
19695 320766 -50172 89110 -111595 139758 -76046 -10696 -279518 -135912 75658 -254772
19684 -214076 -74641 -18529 113535 -113010 -212068 145101 -167463 64208 90002 -277539
19673 158148 -17410 -170866 -126472 -256320 -65442 -375446 -243564 -5724 -31004 -369969 -178728
19661 133075 106956 -224410 247969 -175811 -58991 -17545 -42018 238972 120271 96438
19651 96438 -135640 8332 102391 195426 -272203 -147895 -55622 131668 111879 105296 -104403
19639 -85013 19958 -127842 -83665 -163588 89881 -99171 -282255 -376896 -117773 155179 -319939
19627 -8561 -399600 -290099 70363 78608 -330715 -19969 -346759 -40272 -244636 17580 1892
19615 -12597 -52068 -46526 -113335 -421315 204838 -105093 -15361 122488 129362 -158198 -55304
19603 20335 2645 -400978 -200083 182475 148457 -192501 93904 -105731 207583 99762 136410
19592 136410 -269823 -160491 -127541 -91821 -198920 -42983 -191691 157985 169091 -16851
19581 109557 204917 -219938 -357702 -781120 -16069 107485 -218387 -244281 145193 2808
19570 -45418 150512 -84060 124899 -86858 47299 -80661 -186419 -104352 -119858 122287 -236259
19558 -221595 259661 -169012 -122898 70961 160682 187376 -344596 -139335 -136802 -355295 -69841
19546 -47277 406958 -156768 135417 -37263 312623 -195898 131121 -157475 -29687 74407
19535 130757 -219909 -227360 -122513 -54574 398184 21044 -115115 97837 -13243 233448 -322009
19523 245651 -154513 -150131 21589 72551 -403752 59653 140140 -220976 -452013 7693 -36605
19511 260645 -279821 298994 90046 -138134 -730 -259850 -312548 -37986 171847 -4787 -36691
19500 -36691 -65158 -55437 -11305 -484547 118489 -131352 -115424 -156413 -61866 -58735 -139826
19489 -139826 -53467 31843 -412150 -248799 77976 -249129 -202547 -31286 -186263 38955 -167507
19477 229904 98745 18636 -33548 244906 99361 12821 -244574 407814 -7860 93894 -173434
19465 -121336 -76438 -234386 -183658 -3001 -148928 8111 -160794 -308461 76520 -57685 -236082
19454 -236082 65244 71700 -46850 42037 201871 372398 4004 -175629 201582 -204600 -129305
19443 -129305 -182416 -70166 -70305 -69371 -322413 -102646 -38765 159598 -39762 -156208 -273170
19432 -273170 -28034 -38341 33434 -295671 -264212 -81031 -40467 228817 32032 -51155 18021
19420 -44506 -15004 36543 -242123 69503 99092 -331847 -315982 -202721 -201462 4901 -223073
19408 86342 -148801 -62994 -2711 -83253 -26318 -77065 129024 36377 -183723 -19740 -158158
19397 -158158 100498 -102442 -4419 51427 -100847 -159140 9880 50123 141637 88074 12608
19385 -178437 -127191 -49301 -31897 78726 -159879 -33774 -38651 287587 186576 -300788 141450
19373 -121963 -157839 -59441 -4701 -330405 38611 -62028 -165692 -141471 -115372 -152992 133697
19361 43625 117016 -309408 -29525 95855 -149838 63029 -147406 -388067 -263918 -426883
19351 -426883 -155208 -191816 -5725 66802 -33542 308076 64958 -221073 -239432 -184339 -158946
19340 -158946 112391 -100960 -192571 -444532 -133224 -84067 -29300 -152398 -28383 75333
19329 -197536 -67543 -108741 -159509 -162505 63287 148592 103776 163465 -37768 -6891 67811 175552
19317 175552 23981 -380961 -259665 147400 -76750 -113068 13831 102662 -104998 169241
19306 -80910 -151454 -98740 309253 156793 81080 147138 5610 23294 1614 -345200 -34099
19294 -106962 69328 156955 -21591 -42483 -182230 89033 -317590 -124512 -31029 -5081 45095
19282 54891 -30554 -146990 -239144 179702 -24970 19830 -213444 59509 45470 -89011 -96824
19271 -96824 -225437 -119856 -82551 8272 122746 -331598 -72909 -205937 10333 -23296 -218928
19260 -218928 -60155 -33701 -173018 48879 -143442 -8133 -37549 -206399 -134479 -315417 48481
19248 59271 76632 31477 -183992 96642 -330769 -316401 -131954 76192 135600 -252882 -35028
19236 -153957 -317974 -62843 -188231 303524 184347 -104578 -203452 -50299 -161571 66390
19225 -330700 209544 -28378 -206366 475837 -209110 -129783 45234 -229735 -56128 84064
19214 104718 -138807 -5534 -61130 269661 182197 -128109 -140422 299016 -124307 38299 -10978
19202 -159380 182687 70561 283771 141956 69203 5948 67520 18775 27245 125125 -347433
19190 -270094 -125210 -37791 -304091 -378237 78477 -162777 -163919 -26378 -226282 -112010 -15577
19178 105416 49034 -477108 93276 -184383 -292514 -45391 41110 -6198 43733 -161497 145196
19166 -10197 -88974 -28725 -3457 -345266 -289729 -172698 -146231 329476 40066 208916 -129429
19154 127339 -142859 -274044 -106017 -147220 335631 -161581 -356647 -19594 -246434 -9316
19143 -189907 -215209 -136641 -95877 -306385 79809 -376549 -110782 -98359 -36166 154028 -53664
19131 91871 -225825 -319535 166371 -292766 -2159 -64899 30719 -268091 273047 -143266 34221
19119 164963 -230460 133677 -97262 -139271 -134911 142087 88441 47611 -349 -550649 -94695
19107 -163049 75709 -359896 -205474 -469373 -202802 59049 104820 -206511 -45341 34240
19096 -143853 159668 -393562 -173562 108999 -226077 98326 -37578 -157702 -165479 -242152
19086 -242152 -44893 -145544 19903 61908 -93801 -281698 277264 517494 59583 130643 239330
19075 239330 -357534 -92879 202931 -125196 -41887 386394 -148843 8047 -110190 181445
19064 133832 -231413 -63982 -126127 -381443 126870 327932 -206671 -154631 14971 -72477
19053 -193690 -10797 -23291 -325508 115424 -142947 -305209 31309 -37112 -2985 -94906 -293453
19042 -293453 -70345 -87141 -269564 178315 -46493 -222304 -262425 -67244 -139658 229513 -9402
19030 -222782 182426 10816 32549 -106773 51841 104826 44623 28556 171420 -77685 -8677
19018 -319903 8028 7908 -297843 84456 2033 -16372 330361 -55425 -115119 -109527 1389 -191202
19005 65802 130191 36009 164407 -295106 -51738 8129 -93577 22296 -105152 -150070 -57500
18993 189110 20035 -142859 146322 -168090 -26540 21624 49260 -22629 238273 -29982 -180985
18982 -180985 85617 -161663 32110 102370 -251918 8268 -164947 159152 -288021 48996 130444
18971 130444 -144837 -309171 -204457 -61406 117053 43723 -110502 -120033 -100131 38019 46478
18960 46478 -101526 -26733 158514 110221 -47254 90073 -192910 -165417 -322339 -260009 -137729
18949 -137729 -250648 41219 -124660 268409 241197 -236857 -87392 -107729 203897 117208
18939 117208 -63858 250933 53989 -26946 -346896 -118139 -126456 11479 2205 -209011 235728
18927 -9886 77486 -166614 15722 -195660 -406253 12290 6142 -69623 43969 -95032 232219
18915 16482 -241573 -298927 -67216 -321039 -2198 -182258 -72761 -230309 -197110 -193945 -446487
18904 -446487 340650 -147111 -194237 18621 -252483 358042 -225899 7365 224503 -51252
18893 -161849 -304598 174554 -117413 -62794 -63612 -4563 -60126 -44093 -129838 26240 -17385
18881 49714 -27149 310302 -272335 111544 311340 -139333 -175640 -167129 -303091 -154853
18871 -154853 233174 -70308 -345628 156159 301388 179097 -99417 -73516 185298 -163827
18860 -231542 49210 -115513 -214350 126181 -76199 -361512 -56760 -171462 -193634 -277541 181205
18848 55223 24260 -68293 2761 63264 -161604 -123937 25903 -428078 -20498 -229306 239889
18836 -109104 42958 -8391 17362 -163555 316247 -218979 -84619 189177 -68870 -168972 80373
18824 -214153 -140496 -100629 -137137 78591 132055 215383 84777 -239742 269200 -135398 266683
18812 84417 -201117 190326 -117336 59075 198164 -293412 -88597 70745 59268 138070 -3838
18800 58188 -276365 211193 -529740 198427 -47325 98650 -41291 339090 10320 -178309
18789 45739 -43187 40893 -111071 122780 -229524 -249434 -582903 -241093 -289758 -115513
18778 -25672 -141982 -244080 -289434 -70248 -515508 -96915 193391 -41060 -299367 -29180 -286048
18767 -286048 -94616 112389 16382 -137536 -123898 158493 115359 -28261 -340665 238049
18756 234990 -166135 238241 -44728 -136040 25647 44538 -318403 -227014 46477 385713 -40157
18744 34914 102702 175425 77507 192436 78202 -17573 -119117 4881 213209 59483 -312449
18732 -277248 58454 -299836 -318266 -25761 33188 45335 -314943 -317004 264714 -179409 42156
18720 126509 2320 -57613 218235 -108713 -5064 -32872 -489908 59281 71504 -94219 -367373
18709 -367373 -219062 -119626 -69420 41526 -11429 175983 -148679 -65810 151567 74285 113819
18698 113819 77051 -366723 -30754 200583 -84477 -382332 61330 59198 -34546 -258490 176935
18686 -95662 -49867 -208050 74517 -440829 23225 -278332 321757 -144642 -150019 -280304 -75098
18674 -8819 -412345 6877 -209127 -118326 92700 -127695 -382346 -49565 112602 -219182 -187841
18663 -187841 -159329 -164469 233391 76855 73683 -249894 -13952 -116664 -245425 111365 -7787
18651 -196788 -408154 -192463 -187047 -179302 20781 91645 -130818 -51118 -274991 213817 -9354
18639 152855 -105261 -76375 -290332 -61167 -143824 -35797 -71361 44729 -33010 -286769 -252823
18628 -252823 -184812 -306335 -71069 25180 -8007 36084 7134 -80346 -228279 -209113 -391829
18617 -391829 -302894 154419 153106 -128203 -26111 170459 5205 195014 -66772 -229715 -315933
18606 -315933 153722 -103713 98014 54159 53029 82288 -97722 89711 133456 -296060 -87246
18594 -242145 -109559 -138948 -145586 -276975 -8871 -78724 -5289 -252056 -178500 46 -151792 -60658
18581 -216594 170834 26704 37289 -97293 -2495 89721 -285251 -81773 97791 -4024 -3792 385016
18568 -140637 10482 36297 209014 76426 381962 -22830 248771 -96443 -224124 122869
18557 -154570 -60885 -138859 68394 -47818 83682 318463 52902 -15529 -228556 238171 -118484
18545 -49911 21626 213489 -86506 136956 -260121 -161264 124463 -258075 -101358 -266821
18535 -266821 48437 -190598 51444 -89857 -14789 261167 -88544 -141911 27077 178750 -344745
18523 -2247 -450794 -197569 367444 -23580 -156509 -46731 -355987 66683 -316548 -67442 46
18511 -326652 -201100 -165578 -175372 -106917 -283280 -31651 105953 -147628 -90473 -55670 -99646
18500 -99646 56825 476756 -402018 -482889 -84452 127269 106874 13371 31390 -65849 -88998
18489 -88998 -117360 -189326 394589 234981 81760 -350804 274808 -136878 -31426 -195017
18479 -195017 -443687 55559 -106224 214198 -204921 -11851 -340508 -13921 -103193 117276
18468 -261292 97303 -159805 -117980 166611 33171 -130418 50100 -168652 -133772 -39191 180435
18456 -122701 -13326 -214463 166759 -193368 306116 -64670 362462 166001 51005 -308614
18445 -189720 -92839 -134558 -3453 -204767 -145727 61651 179531 -185671 -60560 -236843 129894
18433 -187984 -147528 -121531 -370212 -132733 -165859 -115107 112920 295236 178196 178007 -86743
18421 -87628 -344917 -267517 -83162 200416 -160781 21211 119122 334703 5852 100277 -161816
18409 157652 204542 -46433 -274340 8575 -90639 438617 208070 183575 -10174 -126616 34422
18397 -192247 -214032 -44652 -118804 116369 -7959 -264658 186281 23435 -194219 -190921 -18085
18385 2797 164346 321159 506521 -383612 -91620 64241 -123145 -77615 -41358 64665 99437
18374 99437 72863 -105072 -124794 32039 149851 161999 330868 -230924 321100 -168535
18363 56254 -44888 108970 -14753 -63904 10626 -6784 -12723 -202539 100872 273331 -261507
18351 78120 24578 -272330 -185140 -14761 -428697 -98005 27208 -62317 -30973 -247584 -12201
18339 130598 86257 -101316 -48704 273750 -91801 180357 -208394 -190838 -5637 -52507 86560
18327 -57775 43831 -31063 -70160 -126475 -183078 -107495 57961 -211059 -262630 -115291 -342264
18316 -342264 -225762 -82563 -179642 -96437 89467 -108493 -117874 -260214 24017 -7506 -67871
18305 -67871 34028 13294 -234711 -2447 182 -163405 183204 367500 -445387 227 -28041 -29289
18293 -29289 -132780 67237 43501 17956 -100705 -104960 -196919 -135798 7584 -103517 -63542
18282 -63542 -21816 -280467 70324 199832 104209 97743 279840 118724 342921 -368583 -195576
18271 -195576 379626 -142243 -102764 -115783 -278881 -161094 -327230 -144828 -134221 166482
18260 -107338 -158415 -228916 -306166 104166 37458 -286854 -24906 -86637 298790 63464 204320
18249 204320 -187016 -171292 91903 173543 -5204 -11593 -53037 152485 -126220 -615394 79385
18237 -157236 -55523 -169455 -114459 40336 -118033 -61469 -14615 -326285 172881 112184 -50978
18225 34788 -289205 -316872 186167 -129586 -32986 -299198 120696 -150786 -230331 -9188 -53397
18214 -53397 15538 -337563 208128 95283 -39178 -3922 -10186 146216 -303271 -68655 -97561
18203 -97561 -93574 23489 -178894 -250971 -346587 -189325 -149516 -52104 -168317 32803 -278146
18191 -91758 86154 -27055 -109897 -77150 201420 -253626 -144940 -82699 -83222 34374 -84966
18179 120297 -191305 -255123 -149969 119476 -287959 139549 -62217 98668 -127163 86817
18168 -231888 -172716 161994 131685 165800 282434 -319806 -72022 -130791 276391 286952 -212838
18156 -239492 79030 -545 -106067 372951 -6420 196218 -326530 -66135 -257834 -216682 -53231
18144 68607 186162 -17054 146096 118131 -34206 -14134 59483 335541 -191397 64672 -426956
18132 146936 -179470 295212 -197473 90753 -170507 67798 9691 -198184 -71486 -80533 -215394
18121 -215394 -14901 -41467 -35409 204712 194518 -115582 260733 -74399 -38085 -70645 -30459
18109 -78587 -81568 96153 59979 -330044 -77974 -44505 -93517 -127778 -42760 -108057 -41650 -122075
18097 -122075 -465547 -120047 -405691 -291687 -8580 411222 -212854 -95457 127794 -165017
18086 249345 -298857 -203529 20020 -13896 165453 75293 -299975 -27570 123701 219065 93585
18074 75340 -124118 -355665 -74524 -331026 46310 11816 -274853 -117198 126884 167613
18064 167613 -95246 123474 -301072 -109846 57462 234647 104423 -106090 -284134 -108005
18053 55365 69507 -5879 13048 90359 -145552 -54424 -4574 -6161 118294 -137816 171401
18041 313259 39638 63909 107375 -230362 269008 -271125 -67666 -56270 -6213 337960 33971
18029 4417 15521 39940 115727 188283 -197720 -78902 -187441 -20958 -328262 -115355 -77826
18018 -77826 3443 -312642 1494 62827 -29689 12843 -284692 -203264 -120952 -290088 -92826
18006 -2758 -290137 -25384 64728 -130524 -197923 216178 -115529 54929 67254 -97736 -263758
17995 -263758 93723 -53934 128687 15316 295211 -117387 -48108 212904 -96374 53371 -130668
17983 -115603 81174 29374 -27748 -10108 -151246 66057 -120820 -122316 251630 297715 -187367
17971 86913 106457 -180184 371023 105253 168045 52000 -38286 19414 -15960 -441349 -2203
17959 557872 140791 101076 -353151 -210941 96241 96375 -178119 -102085 101191 466591 -419005
17947 153711 28187 -1359 -44374 94255 119649 28674 -127765 -22178 182309 61999 -263791
17935 -115295 -312996 -59923 -96623 -34434 -113877 241478 50285 -159307 270608 -27707 35602
17923 62077 -218992 59678 -240874 138357 137870 -217856 -280489 -159542 84051 134011 25314
17911 -146130 358243 -42781 -432257 -76768 -160803 -42537 9913 6743 61652 144941 -16175
17899 -49026 -133821 -93749 -118071 48459 -327066 -289101 -163432 377820 -185100 -245755 -20653
17887 234952 -79918 -190244 -41471 -244963 -295191 -15801 328716 -134810 161866 333164
17877 333164 109121 -12984 -69285 6800 -321626 125403 8457 -83714 207044 -106119 186924
17865 -98388 -802 128181 -235336 -3407 53601 -361333 -45861 231860 43389 -80079 129268
17853 -108511 -274681 -18927 -129444 226576 -177867 -36671 -60417 113446 135449 -251795
17842 -64473 -56862 -178364 -261686 -4706 -51270 -158434 -58731 -119207 -226437 -93585 225834
17830 157815 -59575 156385 145192 217753 -301127 -310780 269759 -300337 27777 -175980 29501
17818 -250762 -113497 32425 -263823 -179154 85894 -166889 -155260 55611 -42702 398640 212512
17807 212512 -49217 196071 -240373 -128493 87558 -176198 210564 -83182 147379 45891
17796 -71259 -308758 -64080 29762 296273 218392 38577 315068 -337313 48737 -120199 -85588
17785 -85588 176072 -124008 106904 164933 15583 197562 -102002 136572 18421 -313473
17774 -56783 89991 -69962 -52033 -73231 131498 -50391 -114092 -167750 290718 163956 -158859
17762 -132316 136119 -53050 7264 -74389 6659 -173135 75987 -267347 265046 214611 -129548
17750 89525 109593 -52514 -58882 112698 193234 96957 -131361 -17897 -238190 111241 276638
17739 276638 227596 -29639 -18014 -134679 129435 -34470 -120676 -91525 -219812 170831 152360
17728 152360 -18364 58734 316830 263465 -133045 -4055 436992 -245475 -345260 253351 -66935
17716 -244138 -164463 -31873 385632 -52541 -4658 -44197 173883 8730 -59577 -147907 2454 218969
17704 218969 264542 -194927 87446 -124566 83970 -115374 -407769 -302461 170442 182298
17694 182298 71568 -299946 97070 235762 299126 -283999 186755 399047 2459 188680
17684 188680 -11544 148497 -72226 84731 -112831 108568 164226 202381 94421 -104866 -163917
17673 -163917 -250807 -269460 227867 127887 -39210 94708 -5597 -125412 -238335 51833 -157145
17661 217651 -175282 30236 183112 156781 33376 -77796 248611 221771 -191756 101798
17650 214172 -53921 -227171 8629 81368 150292 -102768 43678 -13551 47572 101572 -19402
17638 147351 119121 75487 81851 81837 -320792 28825 -123256 -42940 -155392 192799 118605
17627 118605 -220235 -483760 162660 184365 162021 64236 176686 -61457 84429 48533 54544
17616 54544 -170860 -89355 -86720 -95045 -203643 127033 11976 -250191 74304 -384044 179427
17604 -117005 186516 37034 10366 145602 114766 52142 221469 -78275 -266544 -88496 328714
17592 -196058 -127872 142368 91783 102927 -259341 34879 107717 107416 -42333 -153503 -23420
17580 -141779 113381 -188049 -10571 245491 47047 89957 -90321 127039 148713 358206
17570 358206 -156306 -7858 -101924 170930 136476 131002 246994 -97565 155127 143571 -152854
17558 198600 -25397 -109674 1836 32347 83560 -91891 -171918 186434 -148516 105199 224413
17547 224413 -6975 271187 65027 -89554 399474 -43335 -100432 -50706 12299 149033 7927
17535 -97542 -104358 -70340 298159 -40059 -211573 -15638 -89332 -45753 128932 142685 203455
17524 203455 189706 35703 25546 146914 -160065 52796 293277 70386 232078 -15411 -45877
17513 -45877 -49399 339773 291956 134742 6737 -87038 -79309 162630 16284 -202823 -130964
17502 -130964 -92928 108090 -24312 165495 -67094 14745 -44125 313414 343261 460641 82165
17490 46606 396244 121285 334130 185420 170072 -89818 426497 237852 145529 -83330
17479 224547 347606 194836 -150897 -91637 206193 -1559 356291 177362 710468 252588
17468 5657 -81393 -454 359430 -87838 -180284 178169 69026 128663 145616 -219532 141899
17456 273035 94022 95053 317706 739630 261806 8047 142064 345750 97208 281193 84640
17444 76283 373554 160705 31795 30292 -24498 237364 -5097 423989 -199734 58183 74555
17433 74555 184546 330328 162396 267239 316573 502142 236963 311762 494704 628184
17423 628184 560154 396159 169292 212550 333421 429902 222608 -11207 310286 124748
17412 139098 6111 172169 134755 291604 -3023 184781 83512 -322151 317089 154348 203631
17401 203631 132529 2856 -117226 -131266 188881 345324 208302 464174 305958 14636
17390 -246266 -14972 100036 7625 -4623 49958 -103836 282079 36616 81501 278803 297633
17379 297633 310522 199300 67849 -2340 288284 188189 343040 333923 55025 54163 65998
17368 65998 337610 -113299 73330 194979 111745 34385 -43818 368023 27701 104062 82658
17357 82658 228339 -237525 -14012 166699 -150632 437945 206177 36216 -62098 43194
17346 125655 66549 -24403 284230 146092 292062 14670 296019 53986 195206 -89367
17335 239074 190162 163549 115001 87085 125248 278430 458746 -4357 277974 114840 17819
17323 -247459 507769 368718 241392 -141823 143143 130508 242087 239242 78517 211204
17313 211204 199350 413701 317110 229798 556682 231378 187709 2588 33787 1423 156633
17302 156633 -54448 56939 158782 32049 195433 313976 261547 209881 -122691 195979
17291 218043 511768 348370 273654 324264 70389 29094 26273 176482 255836 184844 -103147
17279 378829 -166585 296646 99510 -234980 209244 100948 74640 332199 -47549 26418
17268 207849 -116968 92255 130466 270524 62674 434321 340704 349051 68430 144290 94882
17257 94882 227533 128653 394978 195130 243248 -170645 -132522 42947 267356 167717 359557
17246 359557 377288 210261 226729 96730 104989 390506 -56072 -27067 551266 273023 440473
17235 440473 90104 382853 419735 181541 68875 235095 370393 308957 144893 139517 280407
17224 280407 76465 94791 210831 322068 85911 248795 126242 282159 298730 261840
17214 261840 -153680 355321 143290 295710 -6133 145146 215629 89690 -27994 181704
17203 221255 210380 280330 24716 -63693 61809 211470 87002 142463 269391 99826 643531
17192 643531 390068 -155775 291332 30332 388064 57255 81285 254095 229150 472683
17182 472683 339128 123661 411859 412885 202434 280028 346712 189473 242306 261715 381333
17171 381333 175273 299682 82864 123862 438107 274987 460720 137025 232863 413639
17161 413639 94987 455528 237243 168639 253684 436241 313100 368678 136632 329619
17151 329619 27155 150988 245513 403024 408047 550432 520320 269783 311067 475811 -56691
17139 187475 423439 244088 592677 132255 363634 260811 397997 374601 438591 342959
17129 342959 848417 370774 51835 282301 542832 397214 109489 567012 660086 365401
17119 365401 234286 306829 198842 535947 309467 419316 211731 362387 177765 300465
17109 300465 536949 403532 641416 268948 366852 703165 449736 546962 332514 319664
17099 319664 524423 724180 315320 384157 623083 396023 313852 347395 526399 525959 539378
17088 539378 39648 420650 279157 424012 23736 423601 563963 417215 269527 426085
17078 426085 108777 494382 607976 179814 456244 671141 585928 559335 578774 460819
17068 460819 469334 475344 227245 454588 432777 248656 711103 308614 350523 276848 509375
17057 509375 547565 789844 370425 307327 607537 239852 520986 469153 76690 639132
17047 639132 412492 631798 644067 469820 727529 292598 378744 583942 298779 383843
17037 383843 513595 662664 893024 719634 527430 607577 727035 763927 471961 685210
17027 685210 804681 781119 689008 -27715 900249 664661 808273 333354 537119 412690
17017 412690 544446 646714 725869 830161 650559 868612 813298 544358 630608 750935
17007 750935 494233 813094 797649 959028 953483 687873 626604 360244 1106411 746952
16997 746952 927920 743371 432473 570760 354909 751010 1113936 917714 809114 894227
16987 894227 899274 1000563 959258 803062 949435 485580 830023 961412 919310 865231
16977 865231 682110 827117 689971 1077954 918311 790584 1155331 1074144 778949 1028776
16967 1028776 868463 807386 919740 949545 1208234 1093895 897579 976397 1235351 1227672
16957 1227672 1030851 833191 1180279 822730 1080734 1082600 1056208 809746 1101559 1295098
16947 1295098 807812 727416 896416 1020067 1148863 1145821 1313466 1151188 1421091 1348735
16937 1348735 1751230 1209011 996324 1218793 1108078 1653174 1247364 1281228 1630932 1199437
16927 1199437 1233620 1278616 1148501 1184118 1146510 1505933 1433894 1326234 1220094 1280040
16917 1280040 1772308 1374464 1552379 1400260 1706138 1538482 1485247 1691816 1512003 1729465
16907 1729465 1809744 1466757 1687830 1711196 1461555 1530489 1653198 1951204 1744186 1505809
16897 1505809 1756571 2161898 1952477 1881884 1720724 1716790 2338927 2018775 2225581 2256277
16887 2256277 1803172 2055293 1838173 1918966 1979771 2152605 2358073 1996670 2240861 2135100
16877 2135100 2058110 2220951 2228120 2262554 2461631 2225019 2441486 2386606 2427858 2462836 2543299
16866 2543299 2809152 2907693 2338335 2701976 2837376 2876624 2997950 2538709 3038782 2720545
16856 2720545 2403568 3019525 3201292 3255472 3147629 3167796 3346678 3328485 3413628 3803723
16846 3803723 3479967 3463690 3457408 3626313 3552423 3553667 3909824 3997200 3942286 3812989 4033005
16835 4033005 4100760 4108904 4490240 4098218 4171725 4660108 4607862 4761983 4594840 4853763
16825 4853763 4762228 5090444 4833514 4886977 5394605 5331223 5346119 5500480 5414435 5555136
16815 5555136 5862714 5908985 5862771 6505388 6121117 6209617 6559276 6884814 6742871 7086984
16805 7086984 7308860 7285773 7388249 7986887 8212844 8200534 8125799 8457006 8823018 8873925
16795 8873925 8824367 9283137 9501078 9655295 10001115 10226630 10214318 10965988 11063636 11328378
16785 11328378 11291719 11847546 12277771 12573511 12709660 13576042 14147447 14098165 14948450 15063953
16775 15063953 15423198 15971451 16690712 17146629 17678826 18036071 18841432 19619077 20066370
16766 20066370 20983625 21947074 22401435 23374946 24249194 25373637 26069349 27305119 28301462
16757 28301462 29235113 30722944 32192676 32867253 34636923 36714396 38022240 39854290
16749 39854290 41662687 44019820 45709761 47740425 50159678 53437088 55570119 58966639
16741 58966639 62078085 65547555 69162547 73412835 77480255 81845263 86551278 91231958
16733 91231958 96604641 102199509 108302275 114061981 120616405 127247477 134521205 141587168
16725 141587168 148316852 155878548 162384005 168746500 174693717 180392394 184739979 188413954
16717 188413954 190713785 192179221 192145458 191368775 188867523 185679269 180894643 175443584
16709 175443584 169831583 162883319 155746047 148548801 140818386 133449307 126541384 119346191
16701 119346191 112697957 105972336 99893307 94087770 88750149 83279930 78522149 73854732
16693 73854732 70003637 65902647 62209910 58691648 55474698 52597814 50090835 47240170
16685 47240170 44910447 42738889 40341593 38653827 36588551 34833033 33323697 31971619
16677 31971619 30511391 28927948 28047610 26662711 25503844 24435316 23585086 22696829
16669 22696829 21866706 20796652 19976744 19430592 18819298 18193893 17128317 16970353 15866926
16660 15866926 15762880 14970247 14684424 13695511 13234317 13100515 12723294 12224128 12034981
16651 12034981 11762866 11482370 11034504 10696802 10382240 9951373 9828572 9553503 9541477
16642 9541477 9139735 8741295 8556366 8571825 8280150 7829923 7949238 7786442 7165569 7218458
16632 7218458 7092836 6881016 6570577 6245636 6598381 6278574 6113758 5974940 5408074
16623 5408074 5637558 5480896 5071094 5272417 5206401 5301680 4852901 4739165 5342693 4945148
16613 4945148 4738137 4666543 4778464 4494930 4374981 4348690 4047039 3914393 4229273 3664080
16603 3664080 4009732 3631001 3525794 3656478 3868586 3619614 3296407 3278772 3293312 3147780
16593 3147780 3198657 3468145 3123605 3194928 2932033 3075229 3004146 2991669 2877944 2897937
16583 2897937 2501585 2812826 2731862 2476816 2652922 2184774 2636191 2351369 2317234 2314278
16573 2314278 2404885 2312881 2458393 2144039 2279921 2360767 2519397 1967268 2028695 2248119
16563 2248119 2013667 1970332 1973139 1879394 1724195 1797547 1966127 1696754 1835153 1685867
16553 1685867 1863842 1444819 1640327 1628082 1502376 1949492 1605321 1961817 1822765 1658246
16543 1658246 1402571 1520613 1589625 1483092 1502005 1420657 1319353 1499968 1495845 1547902
16533 1547902 1630236 1519150 1246276 1236395 1336708 1369051 1386439 1171786 1164436 1238560 1137124
16522 1137124 1206796 814659 1381979 843608 1537125 1518341 960489 1102014 999721 1127929
16512 1127929 1251075 988215 1055048 883869 997285 1118218 951728 908486 831651 958501
16502 958501 1163859 900707 1039550 640395 1125283 1237296 773339 781272 663194 683553
16492 683553 849529 840367 1104601 1083767 1106406 458160 453435 929692 658326 902940 793506
16481 793506 702935 830621 648473 755983 798658 1093281 593434 576703 522840 439162
16471 439162 553890 701563 561575 756716 477425 858470 817927 622144 356058 482487
16461 482487 495592 634400 709806 650456 644226 394216 661399 677691 622771 656012 633169
16450 633169 595162 693770 666366 788763 317615 598334 466468 282256 615849 106099
16439 491976 653826 463350 798253 719201 610298 429573 805875 407620 699407 142171
16428 296061 141985 710773 563558 558210 684689 464656 329703 241921 323625 526755
16418 526755 638185 499013 249854 217315 415597 376849 421798 628263 468587 415848
16408 415848 502144 469078 225095 76183 399572 336900 447231 260361 216407 392788
16398 392788 211965 154271 380946 247186 218567 230518 502921 347762 560747 196836
16387 62807 238595 759818 53051 57221 312039 -51477 300475 566053 374277 264020
16377 264020 70896 235821 48985 318385 657144 194693 363918 235592 228625 341742
16367 341742 434362 243350 138731 262903 298453 243316 449506 482333 378266 123610
16356 417932 154391 -78733 212742 239517 353046 238158 330425 273292 67802 348252
16346 348252 303997 404381 127416 -29324 115190 137364 277613 315783 277551 30706 230961
16335 230961 291914 -20586 280446 253531 410851 359682 161872 470435 238532 239891 141531
16324 141531 21517 390676 259452 144561 33206 133987 37372 201396 -87576 -31494
16313 38653 225605 232346 -243072 448374 250781 -181813 202723 285252 87937 365000
16303 365000 -124912 210194 147138 -199281 57653 24945 203991 162529 75426 -7952 14684
16291 16372 331314 168259 59590 432767 221834 57936 157649 184435 98654 -36554 -64419
16280 -64419 75465 -6986 -29026 412018 178302 -80236 -66498 -234169 67703 321525 141385
16268 394992 68208 109245 60889 113631 105553 139334 380748 206012 26127 241267 -86605
16256 63038 -48499 285608 146675 298408 264513 -101984 167051 79226 156613 27268 68540
16245 68540 168362 -58690 324818 -37373 211314 107888 282024 139947 193475 233763 -14992
16233 99755 240981 191227 97809 -1930 -23640 88142 -15655 -6150 85301 -98746 281372 -138319
16220 -290414 -89641 131082 93750 242699 329531 -84088 112668 -93842 -299244 -140096
16209 235631 -115009 85632 -161040 -9776 164689 261156 122059 263020 -63892 160666
16198 223692 -171229 16875 226620 310953 -76519 -161183 87068 -160957 -243292 154397 186987
16187 186987 409147 -119186 37945 -176086 352168 113178 -24893 231337 -285843 -56044
16176 136518 172516 -150521 129674 259764 141303 -230746 -163393 -106106 -3679 153547
16165 314153 -69681 268012 146482 87452 118068 -117576 -88509 41823 -176541 -40443 -297826
16154 -297826 -351774 -73167 -241229 217953 -197460 -139673 254820 334065 241642 43562 -126807
16142 139397 11049 -40491 -194926 -208194 203375 215268 93677 3626 -185531 51100 -20749
16130 81368 -20177 -166477 99719 523443 -10750 -12924 394737 218883 -139709 110891 -103062
16118 14602 -155789 17367 164118 126183 -111927 -232817 -398706 -11281 339189 269392
16108 269392 78652 57805 -96124 31807 56441 27706 225622 88495 168258 106114 -181829
16096 59186 249121 110976 -223317 -118680 -272894 169922 97289 -184467 -92676 -63259
16086 -63259 167572 -30633 -16810 203396 205153 150650 -53314 -57911 26932 146128 103020
16075 103020 -293915 47469 104378 195983 -158208 43538 18278 -122940 -109360 39067 -235729
16063 -216992 54490 -152426 -279526 -140215 69930 328950 -139125 -23437 -27025 -88006 -199787
16052 -199787 -57912 278186 48292 49478 -67142 -177334 -54829 -93607 -14685 288902 -66019
16040 45878 157890 -16539 -265023 60774 130718 -250554 232147 -221184 -127122 -263200
16030 -263200 -172465 120469 27916 354060 -104730 -384494 29167 33593 -344902 231193
16019 -75126 -425305 43355 2671 37496 133766 180947 207914 264460 18937 -48444 -57687 -20019
16006 41874 375604 -41587 -49988 -150916 78021 -30426 -218817 -315386 84368 -261004 -35993
15994 39646 231408 -170815 -34774 -262428 -91466 140983 126526 45401 -36148 161005 53722
15982 279090 433496 480046 169441 215701 18169 16074 70541 -131777 75392 324602 -75433
15970 5655 132862 -56889 -208610 -175458 33844 -114454 -14647 48039 -290808 145240 -49341
15958 -33046 186625 255787 -114458 -138505 -352851 18831 -107257 246087 -287713 -190788
15948 -190788 -65325 -492466 -236208 -143728 175910 -309666 -130788 -396906 9550 332448
15938 332448 243502 2192 147910 -29606 305348 -66364 -191801 -23533 386412 224861 -281061
15926 -75783 -219791 -265541 -134050 219649 92013 167538 -61339 -61968 -264707 -348802 -37217
15914 341178 -264501 -278133 -126348 -166875 -209241 -117282 -372596 187612 -30962 239465
15903 -32280 218512 51038 128081 -108163 213652 -155436 -17366 -113996 92509 -70304 -171150
15892 -171150 128843 225709 -354523 -198405 -152307 160758 164781 -9224 -213049 -155997 -212360
15881 -212360 5886 41647 -126612 -221762 -110394 -64677 -29537 190627 -208104 -275162 39809
15869 -239050 57096 -242609 80512 304284 285022 -224030 36490 -61839 177480 -109364
15858 17108 -143803 -10105 -61420 -246558 25518 902 56505 -88244 107348 234441 -11228
15846 75120 72515 -213127 -94693 126871 -4450 -182047 -169182 -330026 210933 124755 41603
15834 -363929 187978 -139642 -272446 -185634 89216 91756 -369379 -193199 230067 -71906
15823 43780 -509774 -351488 -220270 4574 -7183 -142094 -502041 -224388 -83228 120850 -91339
15811 42290 5134 -224258 25882 -132877 137111 -74545 66388 -189245 1274 -27904 246763
15799 22478 91084 175218 10950 -26210 -238880 -164688 26067 301750 109487 -280463 -79501
15787 51422 -80133 104652 102492 246532 118396 -243468 193383 -41827 138682 218733 546492
15776 546492 177614 -281145 -140347 84854 -85797 -115810 89028 20763 65275 -324746 116799
15764 -65092 -178574 158437 -2922 8317 -25895 173930 41681 124494 399345 260319 259624
15753 259624 -167046 -58334 -178230 67144 5597 221795 -61977 2464 72177 102850 94484
15742 94484 104408 -39434 -158676 -36949 75308 -245316 -220361 203703 -118046 52235 -244595
15730 -89086 -219785 -142669 -34889 177736 72566 17711 -180530 -22786 53947 -87884 36574
15718 204231 -98672 -232424 85856 -137144 -124620 -261263 -183126 -425613 -119133 -291815
15708 -291815 -14878 -120471 197830 23557 218641 -7324 -280223 -244640 118682 -142464
15697 40626 152875 -358977 -67486 190767 -46812 -263772 -295567 -89591 406751 298581
15687 298581 37358 -60561 6274 -148909 -79093 60065 -380838 -56211 121058 -95420 130552
15675 34874 8520 -15713 40625 -77300 -135614 142951 -47210 -98051 -185317 266254 51835
15663 -52375 269066 194201 -26767 44534 95935 -47671 -214875 123540 -54644 -297600 -152498
15652 -152498 304489 89052 -314699 15946 -311417 17606 -208271 234019 59789 -128143
15641 13067 -12445 76209 -51691 108752 293618 43104 -260305 -108499 107526 -327510
15630 43029 326583 -37074 11689 39175 121516 95460 -213961 -284380 -86460 33748 360345
15619 360345 229972 266981 63326 -26901 -243257 5040 229080 -240382 7195 -196225 -101990
15608 -101990 -180174 101476 121060 -36331 34534 164981 -163573 162172 -206756 -196583
15598 -196583 -34512 -172309 37092 -156488 53652 14555 18366 184173 -89360 -120559 101612
15586 -71533 22641 -18942 160943 -41065 -85178 103997 -144048 -98085 -79372 -71317 77479
15574 126902 141147 -5503 127105 74152 36048 132333 64036 20188 133193 16504 211233
15563 211233 128725 24733 20563 257594 -53778 232368 34678 -449700 -72672 -199455 -217125
15552 -217125 199063 -336468 291684 32899 -330040 -87647 80131 73941 63213 23517 -225734
15540 -24877 -39849 -5684 210140 -268061 -48973 -9121 198528 -269290 23703 -317891 -213139
15529 -213139 -121236 -53869 -175486 -309878 -66480 -242756 -25905 -58001 -170898 -188931 -136285
15518 -136285 153835 -135438 10775 41763 -275232 -169713 -70077 -103555 186309 -145200
15507 -4756 291074 -102459 178211 -28582 -202917 32868 -243779 -118283 61710 -135771
15496 -23158 358604 -133504 168948 1075 -4153 6153 168965 -400709 25843 -56218 -247637
15485 -247637 150003 -459806 -226223 248746 2729 27807 14926 -415214 -44010 46935 -43800
15473 189840 130751 116711 188768 -424335 -277419 -120085 705 -198059 -91811 1201 -38549
15461 203309 151386 -33686 350856 109645 -193288 -196331 -43765 -32570 -17037 -19257 131407
15449 46415 -343831 171397 108927 -129253 305619 195702 93999 74456 -162940 89443
15438 135751 214716 -138457 -303813 -142729 -74709 -69620 190662 63255 241627 14964 -59802
15426 134014 48600 70854 -252674 338753 63962 89629 197158 12006 -293557 -149989
15416 -149989 -294988 -230861 259425 -116975 -112413 -154206 113767 213305 -218563 416909
15405 136429 165863 174676 -386516 1533 -65246 -18675 -16269 76967 115990 209561 -363561 18980
15392 -191661 141485 180910 -81185 148535 159925 -277387 40531 -12311 150001 214142 69865
15380 -306552 72674 -52975 -598323 7661 194655 -203044 152332 188294 18429 140690 217697
15369 217697 312186 -355676 156679 -300186 525842 -179292 -87486 -53756 -103200 217207
15358 -113165 235512 152375 -420393 -68839 96245 -86317 -245175 -136541 -188701 -80120 36314
15346 111884 86705 -93646 227581 -119234 -198600 -160480 -160502 -338885 -209827 -210198 47516 -235413
15333 6677 166407 -186084 132320 -211439 -377432 54971 -125070 -187458 135282 173406
15323 173406 187727 175529 -179942 -131335 -54403 130975 -134293 135524 -259984 148111
15312 65483 24207 37398 218816 -131190 84114 132621 -58818 323451 -79710 187457 77110
15300 317335 -32534 94341 227607 338485 34148 242183 130032 -102339 -34414 45368
15289 -157025 105700 -29294 -131714 248314 82948 191679 39790 -174246 -192161 144272
15278 -66327 128282 -75672 314641 123837 -35079 -137967 176165 -212961 155525 85611
15268 85611 34927 129104 64269 191753 115841 156956 5998 102617 -95475 -108551 -147662 -32969
15255 409141 204043 385601 93672 385770 -144086 -32479 630010 958956 1111095 904460
15245 904460 584913 763211 253074 221688 -24551 -113637 209978 250204 -209173 -26183
15234 -24995 95892 -105730 242594 124386 -91770 91268 239505 218704 130205 -24100 80382
15222 -149604 -447208 14313 -61308 -17063 -11178 281064 76723 -192824 -50077 -46136 187134
15210 37589 -37312 48061 165412 260211 -58235 134777 269761 147957 320863 70143 162184
15199 162184 124818 149247 -107552 -26567 -193053 -81849 -32417 -59221 108506 118203 150048
15188 150048 -17502 212503 -171207 -74062 347026 -85560 181225 -475468 -42849 -334226
15178 -334226 222545 226385 148512 163091 510516 -22520 77065 76374 359292 294642 -39227
15166 118968 -264685 361695 -419320 516606 68357 120841 171700 -61659 -6857 -177570 452280
15154 -96655 -49740 267050 -261134 -94341 -400543 390096 -54892 -94560 143401 208163 -123873
15142 -163117 197582 -170667 56921 -46912 14022 118993 -739 144532 -143862 141696 41960
15130 35350 -119782 363201 156908 219202 277453 -98065 134843 131792 -164283 155097 -20657
15118 14176 -121028 146109 83121 246781 -59773 -79752 -33833 48493 39405 -46845 526032
15106 -152263 313539 257859 161628 329080 41282 113126 337666 -13810 184256 -145812
15095 111283 316976 227130 248197 304343 193426 96802 279991 -127757 28217 163530
15085 163530 14855 -35796 -12468 213802 139746 143883 -202737 -97340 51732 350109 288530
15074 288530 147852 477157 107308 13926 104519 55008 158997 131778 133942 -109732 118326
15062 232978 -227191 303852 271451 116668 60985 -116530 148655 -53544 73122 -3785 208936
15050 227210 163473 10632 299861 145724 247186 287115 148136 111691 109113 403999 494905
15039 494905 158010 248962 118136 43616 -109855 -17842 133919 -42940 146120 153630 -29213
15027 224072 -79307 291225 326257 155254 46664 323494 386490 189761 -20268 -147333
15017 -147333 -147866 146798 156792 37662 90025 97539 397891 422624 468834 151681 175665 -14270
15004 131625 326642 234970 135937 109802 33653 310606 265626 51882 445245 201657 165295
14993 165295 436437 -1020 186505 158604 278253 120926 158702 273639 164673 348437
14983 348437 3330 556965 -58740 257581 198938 455721 338843 85201 221950 290575 259583
14972 259583 341413 -22720 315984 196460 197393 156792 224915 175224 180072 -213417 320497
14960 295317 -107668 494890 571396 -105787 316796 214053 107450 386630 9285 13395
14950 13395 298411 197740 433074 451370 200291 314250 317838 60761 383779 352547 -32104
14938 277552 142796 189024 186361 171101 280244 481591 218795 421609 80360 218791
14928 218791 68317 407532 122622 354698 162025 95590 75657 321993 473384 177011
14917 246529 233235 227884 90629 145627 317487 434013 643247 146656 449357 590019
14907 590019 256451 -13109 117240 195946 106863 452928 612283 272184 483188 448006
14897 448006 677678 537728 212268 261747 53026 351487 209708 436705 517286 413994
14887 413994 361864 190275 142610 165886 116184 170780 717938 313730 103192 589687
14877 589687 28204 476216 554746 367505 301813 -60095 149834 292096 437323 109359
14866 499377 832060 505484 226000 331405 394073 393387 491832 693744 460771 703817
14856 703817 528059 249954 324546 366448 815614 320599 372157 578044 310328 -102410
14845 583906 234874 585589 536943 126619 735102 386109 803054 848152 676731 422413
14835 422413 529834 614284 199739 367879 428163 251692 389229 450201 365220 409599
14825 409599 606418 591094 431682 158530 250028 346180 438188 268892 502001 385834
14815 385834 667710 394037 673726 469887 418126 516451 344097 384814 572821 474367
14805 474367 777350 254501 353754 516879 591980 324147 774822 357582 688715 391281
14795 391281 302734 705204 502084 549909 794003 763459 926796 689940 301886 858807
14785 858807 228682 467004 358382 212228 652619 408698 455685 565524 402417 471724
14775 471724 659692 420373 839633 547469 594488 423210 536203 558933 722704 576696
14765 576696 431235 563773 741669 316003 394461 535037 421463 406026 1011685 739071
14755 739071 488057 655204 621744 488522 725766 719642 600374 464614 754624 702282
14745 702282 634746 618067 976458 551764 897421 705567 693770 956854 729844 399140
14735 399140 853206 631034 1108503 873203 489363 505262 616808 698391 728319 596584
14725 596584 871357 616270 530019 447623 899657 901344 945129 516153 740192 386268
14715 386268 886368 667324 741534 810719 879002 697834 518224 909340 921284 709234
14705 709234 593910 801801 821539 697693 559313 976578 693613 587895 707244 547563
14695 547563 873081 878506 864801 1189515 1065009 1223587 879021 711911 1022686 906886
14685 906886 703940 905041 1137136 1040931 854702 809738 882061 997032 609865 1005946
14675 1005946 1124063 956447 987616 1115394 886568 962216 827270 978386 1193663 1084978
14665 1084978 715064 1071824 1311360 850967 1252475 1146010 1194221 1099328 905869 1010606
14655 1010606 1252721 1149650 1064322 1303431 1277307 1184212 1317956 1332387 1277486 1038693
14645 1038693 1157034 1348700 1170440 1177893 1492207 1089309 1535768 1508579 1008116 1271729
14635 1271729 1641381 1554837 1270588 1159788 1219346 1040225 1224662 1235545 1346864 1218963
14625 1218963 1133993 1372895 1516392 1651561 1427275 1384624 1546032 1478791 1243455 1396087
14615 1396087 1399412 1239913 1324991 1358735 1338916 1668927 1584480 1397783 1664828 1438494
14605 1438494 1422841 1787555 1297542 1570536 1416271 1755780 1548220 1680775 1294749 1686037
14595 1686037 1565239 1386908 2007630 1776903 1760418 1759382 1929427 1947228 1618638 1287656
14585 1287656 1774747 1619847 1968358 1750902 1938739 2064086 1948992 1406160 1786420
14576 1786420 1912631 1934200 2015049 1817170 1925930 1913367 2124190 2142594 2122642 2375891
14566 2375891 1998373 2436771 2193908 2223685 2352942 2749189 2644832 2908646 2965920 2760222
14556 2760222 3337200 3357684 3472114 3879726 4299898 5162109 6307870 8186519 13292495
14547 13292495 20987479 34905808 47234360 22395463 8732660 4075906 2831232 2322894
14539 2322894 2146966 2013852 2259497 1767044 1988634 2126728 1854714 1852103 1975846 2206705
14529 2206705 2265234 2202679 1932976 2521337 2016499 2139959 2278992 2316847 2147666 2402170
14519 2402170 2472866 2867691 2537103 2481062 2458666 2490527 2847613 2665041 2854746 2581421
14509 2581421 2863187 2613617 2856956 2919798 3063915 2781377 3062959 3169246 3214481 3046813
14499 3046813 3096697 3315775 3001999 3036747 3201491 3494427 3154316 3017915 3587579 3261299
14489 3261299 3666028 3779544 3755759 3500016 3806122 3591401 3716791 3763000 3839319 3762194
14479 3762194 4102136 3946341 3846776 4261841 3916337 3894916 4196395 4423668 4414600 4412805
14469 4412805 4323645 4206412 4476483 4254788 4558167 4532219 4794614 4882642 4553897 4543775
14459 4543775 4786063 4796677 5177290 5398258 5020544 4932404 5408902 5252701 5256030 5701731
14449 5701731 5341795 5873294 5650699 6135490 5712046 5672233 5654116 6020013 5888246 6064218
14439 6064218 5938444 6252102 6294583 6817506 6975428 6508534 6655046 6635442 6854958 6934449
14429 6934449 6949830 6801528 7193470 7024785 7386286 7431492 7738571 7711912 8013699 7719886
14419 7719886 8040871 7848467 8195938 8542992 8689023 8701243 8446133 9027754 9079651 9089940
14409 9089940 9003654 9430278 9457007 9596952 9699182 9890780 10176624 10453500 10580115 10507275
14399 10507275 10783582 10714478 11214627 11564039 11435231 11775927 11875036 11761082 12271643 12621014
14389 12621014 12602757 12804104 13124861 13068216 13692333 13787302 14467751 14389065 14515498 14947425
14379 14947425 15368055 15495685 15554808 15778862 16454980 16787419 17000423 17328323 17683533
14370 17683533 18253339 18639119 18962505 19307651 19606618 20453364 20378249 21051536 21617607
14361 21617607 21757237 22502354 22690109 23181236 23825632 24636031 24987242 25541842 26188520
14352 26188520 26882431 27715729 28013638 28901322 29671458 30439901 31318630 32150293 32913481
14343 32913481 33897183 34889358 35470274 36530508 37816631 38757813 39962115 40964182 41994409
14334 41994409 43449718 44648832 46203466 47413473 48914041 50401053 52174556 53653974
14326 53653974 55816815 57223792 59238308 61785627 63741233 65826940 68802960 70856702
14318 70856702 73482074 76013028 79194710 82226493 85544740 88746111 92317278 96394402
14310 96394402 100194952 104401328 109076665 114326362 119131135 124631130 130025604 136304405
14302 136304405 142394541 149305843 156563782 164200515 171671322 180624320 189020526 198163194
14294 198163194 207776814 218073868 228714120 240389430 252267493 264888303 278010053
14287 278010053 291344337 305264885 319237064 333721807 348623935 363441075 377825702
14280 377825702 392148612 405969240 418983486 430872860 442062809 451584058 458745615
14273 458745615 461822730 460764590 459871809 460247502 461315333 460231826 454888984 447428428
14265 447428428 437071961 424784016 411278090 396390775 381095898 365198951 349084105
14258 349084105 333241356 317637435 302320954 287747041 274214528 260133597 247249892
14251 247249892 234704429 222992878 211846337 201346801 191418025 182067530 173157236
14244 173157236 165296977 157525707 150042823 142963229 136445483 130193133 124486975 119701945
14236 119701945 114247559 109515902 104467692 100384618 96715666 92871781 89304813 85419210
14228 85419210 82036658 79382771 76232679 73056732 70465013 68185661 65805261 63673759
14220 63673759 61566300 59797815 57362516 55524462 53725516 51935024 50371113 49461618
14212 49461618 47833534 45903520 44812258 43718897 42370128 41491416 40176336 38511808
14204 38511808 37670066 36708694 35734250 34948579 34398462 33275597 32407266 31527538 30426687
14195 30426687 30054528 28908359 28792516 27993325 27081542 26505363 25847906 25113195 24429577
14186 24429577 24035981 23753822 23014009 22527303 22276244 21708769 21265480 21025506 20320891
14177 20320891 20200649 19177623 19097796 18683462 18276144 18059713 17695950 17301867 17157077
14168 17157077 16789373 16382247 16141082 15991260 15639330 15573108 15188765 14776418 14406871
14159 14406871 13957031 14188521 13626625 13737941 13420429 12915978 12795772 12841848 12531641
14150 12531641 12306378 11881021 11881065 11921309 11514933 11299028 11082827 11148799 11001558 10809707
14140 10809707 10540006 10229099 10677594 10260733 9944126 9654412 9923126 9530021 9312718
14131 9312718 9241889 9255621 8964445 9067670 8660970 8707686 8489676 8407476 8350141 8061307
14121 8061307 7987633 7603597 7519914 7575630 7603186 7233085 7295778 7283243 7107308 7036827 7062648
14110 7062648 6897799 6741387 6738604 6848280 6692566 6992738 6464412 6448094 6469365 6197547
14100 6197547 6265333 6159528 5997760 5474760 5748156 6110781 5729209 5810976 5431459 5643246
14090 5643246 5884097 5651959 5574918 5251164 5169091 5098984 5429290 5127739 5177085 4821563
14080 4821563 4949934 4977463 4820265 5150134 4855354 4674846 4909236 4569471 4528558 4552605
14070 4552605 4439366 4388050 4224128 4140562 3989708 4414007 3986305 4460578 4321601 4038819
14060 4038819 4431946 4277755 4147985 4159754 4006413 4038490 4032645 3836921 3805819 3736829
14050 3736829 3932800 3579825 3771676 3660115 3485010 3914169 3438508 3344193 3356685 3593835
14040 3593835 3465215 3046532 3443363 3291601 3219166 3573396 3194163 3481388 3192684 3410065
14030 3410065 3490843 2801974 2922766 3216037 2729299 3062510 2807887 3105177 2746957 2937907
14020 2937907 2883610 3197586 2621498 2500360 2837562 2972137 2562727 2669181 2469249 2842483
14010 2842483 2765412 2383579 2656475 2308134 2281272 2204677 2563679 2662924 2084720 2217862
14000 2217862 2401766 2450106 2306113 2335324 2268898 2097249 2377639 2454083 2163068 2627162
13990 2627162 3296083 4667837 8028272 14661298 28112228 46601106 27712370 13755942
13981 8047673 5694937 4434488 4103801 3857750 3695469 3585865 3246905 3048578 2933488
13972 2933488 2708830 2813935 2562372 2486812 2223292 2664488 2233614 2620663 2417704 2503485
13962 2503485 2498940 2330203 2144918 2031079 2124123 1998351 1898305 2400863 1976700 1942864
13952 1942864 1822456 1895087 1849739 1914869 2030581 1867377 2262983 1974991 2140023 1785888
13942 1785888 1878521 2166828 1983252 1763894 1936638 1958566 1701073 1771379 1753675 1701064
13932 1701064 1623688 1534382 1609665 1555772 1459881 1557425 1937569 1963354 1516330 1849406 1482434
13921 1482434 1790974 1459187 1885831 1483484 1482933 1524309 1369450 1472897 1465362 1569371
13911 1569371 1416979 1404702 1311288 1524045 1191430 1687790 1666095 1255261 1406380 1374971
13901 1374971 1557287 1399145 1236067 1611922 1419181 1457725 1468359 1220004 1436272 1258460
13891 1258460 1542972 1033318 996614 1397540 1291008 1408944 1433791 1511985 1401473 833853
13881 833853 1232924 1392167 1455949 1338578 1189781 1048867 1438749 1133963 1113311 1141641
13871 1141641 1081775 1338026 1205299 1358971 907775 1412222 969922 1287624 999372 1376819
13861 1376819 1093425 893998 823074 1227957 842562 1220194 1222044 1063762 1392196 1051922
13851 1051922 1074709 1187566 1016896 1490282 1273710 1135245 696625 1221408 1084699 1063319
13841 1063319 900256 1250771 957770 894390 1345146 1199923 700114 1247700 985789 957318
13831 957318 1074941 1050634 1069639 922111 999973 1059665 858166 891341 850672 895824 947994
13820 947994 921854 890479 976546 607918 1157290 747785 998280 818267 794266 555154
13810 555154 659419 745684 739381 1131372 1063582 708479 979826 739534 993763 914253
13800 914253 1130254 1076879 906597 834925 856881 914779 606674 693248 746066 715498 693256
13789 693256 851291 1179219 779112 538530 996174 832799 794982 899213 832250 819123
13779 819123 1074561 854579 1054511 1092487 1009467 929931 862034 977703 683927 1082357
13769 1082357 746655 1130241 823566 925463 558550 927046 424895 1200991 624396
13760 624396 861370 1229681 621160 747714 652186 783250 797101 677381 712033 460286
13750 460286 479616 870608 580240 839332 457505 813320 916975 597357 418132 800306
13740 800306 772031 480855 903639 788772 760859 494243 927673 397604 375073 422833
13730 422833 193268 660127 763232 443871 535103 388403 822405 479298 145633 706340
13720 706340 704969 560728 500780 583749 683754 396702 721194 649607 720587 45332 709753
13709 709753 703603 535956 796862 701715 738900 381122 762040 540357 509245 597603 816612
13698 816612 730055 676395 611191 676325 537761 557047 425880 523626 797794 102342 300231
13687 300231 731300 686364 499652 383406 222452 850874 754316 109354 365972 506731
13677 506731 503582 516184 727047 380909 741179 581200 636225 561519 258602 738478
13667 738478 615456 373940 683577 478816 353884 469151 542891 699940 420184 326771
13657 326771 441448 58417 690606 493130 335702 468000 440882 795321 506124 861316
13647 861316 346299 477322 422571 594651 524985 403197 483096 295285 610150 647072
13637 647072 507864 401658 443961 128032 416916 515022 298648 577086 587989 418581
13627 418581 370346 534246 469352 341166 369468 608177 364133 76022 264018 192552
13617 192552 382754 111107 383659 328115 293248 263146 124143 710572 505512 475215
13607 475215 747427 397797 131285 658841 308714 521359 645991 348141 723883 431951
13597 431951 413022 430359 201262 776321 319229 418221 589137 249773 688613 770581
13587 770581 393084 243131 413375 661686 138759 327521 305688 558544 56297 404748
13577 404748 364237 -121915 443740 97858 74977 309388 406593 512558 360107 428883
13567 428883 8327 489482 443023 420847 473158 345345 172926 137566 520328 227534 30550
13555 208147 496486 651763 223327 452320 393532 596060 251973 290147 233155 361424
13545 361424 77043 78379 133979 418914 243227 353657 348734 -120571 480669 301915 127642
13533 197027 611855 133427 268385 219974 64723 190690 161809 70520 177211 420086
13523 420086 348445 89626 649982 193972 145445 193347 221158 -95867 346923 248109 255796
13512 255796 339723 318298 -31969 159094 103412 404501 91950 -3943 268620 389420 243890
13501 243890 511704 166089 174249 435134 6725 397839 398317 436469 639078 281449 211284
13490 211284 27150 -248 140131 13740 78020 292917 536174 -19857 105150 205843 20009
13478 650583 313150 182748 117578 326617 361430 -6871 99213 152559 285062 173761 258750
13467 258750 -44562 557232 5874 423969 377397 59303 188517 460095 325344 249749 434379
13456 434379 283013 454742 278904 272136 182452 354962 725022 293808 83216 100299
13446 100299 247003 177687 170561 393227 308334 214501 645366 15017 102685 238510 51689
13434 41769 80924 268834 298698 391391 315907 111453 227831 455524 172328 182320 541538
13423 541538 54503 412162 125076 268286 176935 202641 519994 202270 -33569 196974
13412 307799 191387 225842 217861 442512 27380 118546 165386 40344 485389 367858 364371
13401 364371 232650 284664 -55686 263964 180480 -26598 -22542 213579 428113 -60758 169485
13389 516164 201397 427966 114257 305800 102835 137259 145242 213580 517429 -139649
13378 59146 99982 130647 362965 8532 -492 416004 276113 305575 371471 354923 482827
13367 482827 338598 151507 128082 334595 203717 207504 303593 27112 339993 217210
13357 217210 264243 91529 119291 448128 26372 276365 188074 271165 137811 379190 314364
13346 314364 17268 259568 205858 426070 380632 369624 469361 61386 151327 180282 322981
13335 322981 361356 634248 225622 50036 145811 146815 216088 314454 347884 -140231 395945
13323 267608 199672 203490 141284 265957 100573 332938 242736 385418 27972 227051 491054
13312 491054 402237 -80840 -226284 543696 88647 -23313 380693 74680 575043 424640
13302 424640 48436 -182610 106122 49651 -36453 180571 73047 276856 158477 46727
13291 211689 229093 247601 -51175 251249 -18873 440780 92799 209043 -56859 398439 138400
13279 307810 533073 346824 313580 30623 141976 184538 264692 229638 159224 -210904 473042
13267 65011 139447 199443 133031 280203 243008 -63689 370345 120706 -27366 98161 144584
13256 144584 -63946 403325 156290 44844 65056 103854 1502 230288 -211084 101679 40738
13244 -115887 -155821 135494 -55476 103819 -288 -12007 142534 422873 -90069 44153 311522
13233 311522 -99799 431425 451754 338699 -222506 264510 278223 97821 -43536 440632
13222 400338 -85336 115047 -22298 578490 -4229 164056 140470 105560 8241 160490 53149
13210 -166755 -128042 -93575 71796 44162 283536 120871 30164 -40379 221653 323770 -52582
13198 -5621 189202 -17851 287149 310917 -39266 145216 89702 -126329 214059 118167 -79029
13186 236157 465928 277191 60067 130472 -249946 499782 220859 184750 182521 248900 368384
13175 368384 552374 369122 293611 107441 420939 279021 -61930 32126 4385 173441
13165 173441 -165421 116196 48354 -164588 47140 -84455 274043 15484 95195 213584
13155 213584 -68987 271522 65511 -224416 102252 -161704 -41486 285123 -74704 -73531 120337
13143 -20646 -47098 153300 238381 161126 -64209 388257 432948 306606 45238 24906 -20792
13131 360740 299829 282957 72417 70301 -86327 -65949 344526 -84187 434345 -76099 24721
13119 -160223 265103 -27883 35755 140396 47796 178099 -179527 48158 -154480 -304144
13109 -304144 61412 -338076 96797 52499 137816 161263 142611 144370 -79837 -17512 154261
13097 -13030 -59821 -467634 118063 249793 419476 215247 266746 -50396 -288512 -27469
13086 -41791 290506 402468 51066 93126 328640 55611 18808 461607 121720 67088 1616
13074 36283 274105 -59017 206557 -17131 119943 80635 -84168 143185 277126 -41681 219901
13062 101437 175109 258243 24238 115852 -86037 64438 -30268 126017 231961 166047 -2096
13050 120607 473605 -1967 -31833 294575 289710 290671 85084 266 81589 112199 61073 50939
13038 50939 30335 340416 420871 146903 400154 -253047 145293 354499 16455 320162
13028 320162 -79803 114180 139127 6244 256038 93627 -52730 133646 105747 221609 229048
13017 229048 57178 198741 206127 -95692 -79736 308701 85937 58476 117177 -45862 40865
13005 -184565 576710 345289 4593 486878 -70266 160290 269667 155552 -15230 -280800
12995 -280800 69568 -3583 62606 153120 -165179 40871 230502 105140 -323079 127081 128470
12984 128470 -130188 16955 158618 16277 81416 -52119 357730 289123 -226518 50890 268757
12973 268757 55074 -82647 614836 237737 438932 -288714 165033 171064 222338 5527 73035
12962 73035 -36966 103980 140234 138414 -220669 7606 -22117 313018 163441 18626 40720
12951 40720 95450 49468 92236 -199957 221622 -5658 -111000 23010 -251421 -94101 254886
12939 239938 -163333 219043 177871 -57263 77275 89652 -55009 43822 391589 87111 157228
12928 157228 230355 320647 314814 1392 259792 230008 386 146404 67754 -1924 206142 -177385
12915 -140452 229397 -58636 109301 -182554 27653 157871 153277 -25334 245329 -286279
12904 -187419 197746 66129 163139 3941 240049 6282 159470 -251785 112564 -192579 96615
12892 265212 48516 146069 -45731 95329 86161 -97130 56194 264987 161498 -81684 -349697
12881 -349697 -96065 -20464 263246 -32051 101931 116659 112816 409707 165576 58532 227873
12870 227873 65420 -266760 15456 46542 -149673 -43806 300880 116144 250212 1203 -18446
12858 -224790 466787 -275406 212503 -126196 15519 -190980 -241683 -164102 85493 331986
12848 331986 -380401 163706 219545 118799 84406 -432 106449 84955 127445 498412 323857
12837 323857 134438 -132338 -149864 -29713 -170797 46847 -112339 -155635 276910 435454
12827 435454 219493 98161 302402 -240950 -127108 469343 -35352 44059 -33302 -193880
12817 -193880 -29939 -87217 180168 230041 -57845 -302956 348861 152613 126014 5609 64575
12806 64575 304715 -123286 209772 -137167 109022 -227445 153407 76858 -9707 346074
12795 -389102 -230221 -17115 -24865 184729 82545 263316 13605 454611 -82146 272247 -55516
12783 27054 -70354 -378960 291640 200089 -235505 -303142 146719 -169492 -106938 -93102 -61037
12772 -61037 -409844 181151 -172265 5361 -59488 21986 -57581 57276 286977 275438 -42158
12760 -200699 135564 -116947 263015 178269 -79665 75702 -193405 267875 75815 135286
12750 135286 173537 387363 37307 -301124 -116079 125976 -80270 239663 -26198 -207812
12740 -207812 42306 349392 232134 -144556 -239505 -21845 -15491 123048 303711 331772 125629
12728 14547 -265123 -24291 314458 176732 -94041 222710 19148 -285044 -182817 140774
12717 167305 -110986 -38638 268386 -21762 66030 36428 234304 12887 65716 239185 -60914
12705 418841 494485 -317246 48758 -217008 235792 -23630 427471 87761 158441 -347136
12694 178738 22836 7749 34823 -41717 -223947 -35730 58339 -14449 -17980 3247 64279 149011
12682 149011 140720 53911 169094 326330 170568 114296 176010 114115 430660 -34029 279908
12670 -265067 383684 -218812 75041 -49417 -27544 143549 105817 103278 -36559 -119742 174675
12658 -524621 -38379 437206 -148572 311013 91670 -157761 157082 412543 -78972 338370
12647 436654 168395 117262 86185 110447 -220765 59744 109300 -37161 -57694 44865 491505
12636 491505 332432 621260 56259 484487 123410 256270 149515 347822 -219860 265067
12625 -21393 -56134 236763 214695 90088 133690 -8874 336839 166332 -43539 -113019 264858
12613 269625 -351153 98427 -407728 285033 -325500 268671 23260 -185780 -182318 -20979
12602 139717 -264305 208302 268842 172190 9464 100970 12655 194120 182004 135939 -42140
12590 -201859 66070 173741 321360 -105323 146550 164823 -145668 310072 -234077 47878
12579 281546 64547 -72422 -117895 -87823 122871 330301 -46207 218385 261013 93682 381838
12568 381838 -336609 108107 272842 48060 335964 104476 111190 257869 246675 148833
12558 148833 191807 -145922 -105109 -266493 77344 -192147 190758 301719 35356 87958
12548 87958 -278135 136981 -231853 -90741 80638 -35584 348735 234535 43682 182171
12538 182171 19107 -126232 138892 286952 1490 -67793 -53168 188287 381281 116730
12527 4423 31152 -162673 14160 25120 242383 214552 48472 404325 94059 -13155 24192
12515 41174 -113479 -126272 83974 -14420 -162539 -191351 10656 -102121 159804 339684 -209015
12503 140830 -52099 284610 11696 -116099 -213909 226885 384325 381077 4884 -50564 -190933
12492 -190933 261994 -264750 -350114 -87372 342822 -66077 48840 349186 179773 -300861
12481 -11448 15939 170420 134509 -114517 -59392 -35435 -74151 -505626 70935 -31686 1393
12469 205162 -53771 -1214 -181384 93086 24982 -100462 150725 -138547 -118710 -51554 33397
12457 -78170 141269 -63837 -41445 209630 266442 -85902 50477 161021 197566 20249 208526
12446 208526 -202128 -133828 -1437 -119437 291928 -50431 -178993 374700 87007 -98421 22738
12434 211293 157654 -6951 -54001 -370607 -20577 388944 32176 -228605 216161 -189774 -103207
12423 -103207 178433 -24191 190847 26373 -157331 6999 67258 -257505 -371761 70417 -193328
12411 -118316 -206926 -241416 7436 163679 -500754 21336 87359 355647 -66779 -450983 -150478
12399 57165 5470 61628 6046 32474 404534 -102775 73274 -381583 -50754 -187469 -242775
12388 -242775 -46757 -228661 -2912 133510 15265 147836 -26388 -155023 -60313 64085 -74272
12376 -193018 -250428 400931 -48873 -143103 -105842 282354 285487 14733 -258630 219610 -196048
12364 -41387 205921 221350 -25419 46966 -239916 267490 39455 -42197 -119294 -95167 -153130
12353 -153130 -219324 -30421 -38018 -46382 139397 117086 17 133676 277954 -43705 541806 395216
12341 395216 273839 107172 -130505 -92997 -96531 -111657 169298 -5067 17350 -438787 -45592
12329 292297 -279391 -26363 -323996 555245 72546 42822 -5644 351486 96485 141164 -153787
12317 280749 -76953 -54814 280822 -178482 -76343 68355 -227377 -176899 -111776 -8619 356658
12305 -18632 -62749 -274590 -66158 114832 -115761 57948 -210980 -143928 165821 -285345
12294 -15862 -253509 -39490 183785 231352 -196925 190722 -42269 -162912 -143335 91246 175565
12283 175565 195454 260867 157183 99499 -106748 -4912 143131 160254 189159 702662 383002
12272 383002 368706 331831 429599 226805 267595 93595 138961 -33943 27886 363196 408876
12261 408876 146463 13170 435850 98149 389293 304945 15844 258186 151921 -23627
12250 86411 369672 203515 -92984 365319 384346 101546 25145 -147897 27027 244630
12240 244630 77062 -1349 -7319 160265 -219868 314790 168758 111233 -157926 -138212 554630
12228 390258 -172349 64249 318321 286566 4121 140 181717 408269 197143 -38498 176008
12216 -164112 270261 204584 101622 71788 454132 381769 184821 229023 243236 162740 95244
12205 95244 -204406 271694 324451 -90529 199880 282745 266557 269865 237069 146700 -974 264646
12192 30828 316274 267842 322508 103504 266911 -95275 109421 89477 212117 27734 378772
12181 378772 99016 90826 69819 148658 47538 62742 57630 499555 166711 648 156893 232724
12169 232724 105140 184815 118674 -21125 300119 75247 -114156 226001 33536 22850 -98562
12157 80383 -225509 60763 1731 -157947 30915 -102442 21771 71842 46489 -93385 -75055
12146 -75055 87654 234367 -22229 192600 159212 142942 -21736 -113865 -96101 62889 165214
12135 165214 36408 236082 -85564 29268 188658 287182 208618 53351 62539 140903 239211
12124 239211 -215060 211033 -101063 -146698 496741 -203286 118070 325577 15787 -366899
12113 -135397 -21210 332460 -26838 30223 189483 46607 -52101 241135 -96041 -119070 233216
12101 195953 -155666 120454 -292101 161470 78426 147784 -231882 -36565 54832 -12802
12090 6187 -144653 -186767 10036 157802 183679 -218976 126728 9871 120176 -40340 227162
12078 59205 244962 675332 1923187 1480222 435089 568313 6394 340004 380340 201987
12068 201987 20680 141172 -63666 118987 122059 -67383 -89460 284539 -211516 289112 99165
12056 -75351 18161 49875 -41476 79854 -123640 162380 -36954 -126072 16882 -142163 -108837
12045 -108837 -123194 173494 -177416 -194982 82911 -46100 -35340 -58674 -80525 -125132 260315
12033 -233162 12341 164646 259325 68148 -212119 370478 -158386 -338451 284385 -143265
12022 48380 -81230 74564 -149855 8125 136111 -331195 -91684 -294057 72956 341536 -64778
12010 -123503 -140541 -240080 110738 -117365 17573 -238536 98805 -224755 10500 -80617 -212162
11999 -212162 91882 -120088 46203 -150527 125492 -299792 70196 -296566 -87416 10268
11988 -219338 34739 -80225 -11223 -221817 7405 260943 114215 -31120 67878 105032 15834
11976 -251172 74630 204541 360295 145019 -24105 209572 -56019 7966 -26066 51415 -351453
11964 -161048 296915 185108 21714 226449 9271 -58069 -105100 342423 -285705 2844 -338916
11952 44007 -6090 8079 139400 213983 46487 -16659 145970 -332818 101611 93804 -156665
11940 -69974 155473 -239282 -59631 174080 56076 -302327 107087 -86046 -17714 -31103 106317
11928 -204357 -17663 -109527 -161009 151691 368656 -41902 -107903 64329 -257168 67709 -171939
11916 185080 -20454 -117328 5353 -210351 204480 51561 47922 -183739 13521 102982 -188463
11904 -40754 -124014 90265 -211522 183752 204144 228875 89767 -24789 166764 28763 187604
11893 187604 60566 -146191 292878 67271 -181352 169903 15735 121086 -347445 -28930
11882 -191883 27762 -122230 36364 -31871 -130177 -21390 475145 -32795 -235658 -442430 -98399
11870 225470 -267351 181498 -32827 -77871 -97841 167607 30409 -156227 -50069 273199
11859 97739 -1758 -160182 72381 236925 -129283 -164501 180854 -171317 -71033 -233550 -37822
11847 71911 -114385 133729 -24113 142034 293377 -300983 -182807 55519 -4979 3971 33724
11836 33724 -138632 -331079 -234092 -126842 137731 -295616 -80708 -6089 -26635 206451 149578
11825 149578 -102923 -132856 78130 -369434 -250580 46381 100031 -6802 -93569 -20816 -139921
11814 -139921 218123 -168868 18432 160689 -102238 102584 35686 95257 -287793 137439
11803 -281536 -278476 116586 -25458 245197 -114438 97578 -119852 -244504 159718 -121776
11792 241887 247819 275930 -180830 -98470 205539 -245558 435649 350401 -251471 107855
11781 196389 -88897 -145030 -68130 -63268 -264850 50725 95096 -187140 64708 -212417 -103646
11769 154013 -54040 -158308 6260 -5843 -29625 -179735 -166520 56170 -307344 -239224 -110015
11757 174641 93975 36456 315154 224411 423859 -255522 17469 197908 -144885 3063 8843
11746 8843 -83916 -37142 75841 5496 -49208 115400 -218839 32751 48570 32058 319495
11735 319495 -193327 -16367 359188 -301419 -85347 90026 98056 223776 -48031 -424448 91091
11723 -429317 149269 -20805 -117705 309694 101776 99896 65328 -139646 308732 188252
11713 188252 -35653 379614 234228 27663 269109 172104 -121650 61825 9338 227387 -129852
11701 -36263 -150887 208848 139457 -3046 -30689 142757 239034 -430166 88512 -34137 375148
11689 342196 66120 -132188 -23794 114142 81773 -38601 -180170 133288 62459 -104863
11678 19094 212282 148677 239424 29855 183999 347018 -298851 -20748 -263517 471313
11667 -39167 117266 98101 -88246 266101 -31506 -108331 190694 195422 -44426 -290632 -62494
11655 -112739 137221 9679 66041 76326 272984 -90077 309795 -239580 -43754 -20187 -38006
11644 -38006 335103 181684 -141338 -207694 -7873 186501 147844 38528 83346 172022 124248
11633 124248 -65068 -98160 158884 111154 46226 -247720 83098 237528 -363 199621 255297
11622 255297 -243700 79780 193864 103138 256730 -36212 356930 136107 138702 -73511 -122704
11611 -122704 28903 28937 -38502 -28450 124212 92347 252175 -308085 250704 -61297 172541
11599 16133 196692 98863 59727 -175690 243355 35208 29487 262000 41667 -95870 185370
11587 145858 108823 -29234 154159 91886 56779 -96409 -65691 -74885 148536 -220113 387812
11575 168656 302407 173860 16272 421212 213293 -44367 -179841 288620 123561 65444
11565 65444 210963 115466 45091 347664 270485 405546 194432 278342 123873 -267817
11554 286981 284310 19952 -271498 381483 253776 226460 137421 79138 30755 -155566 219240
11542 300255 41499 118834 42295 11428 210583 -206541 194725 -55776 202550 324797
11532 324797 134627 -214742 -51271 211574 -69782 119635 289539 352969 118916 114293
11522 114293 -35748 14145 213084 -43619 14830 -70656 53234 -13739 162564 197230 -66632
11510 40402 -25552 211586 69462 75228 115072 158732 269069 -139305 530223 144103 -129228
11498 -201274 475866 164473 109579 170954 215458 2876 99180 223972 53364 182078 -258154
11486 341315 -33124 26997 -316284 57042 394339 470163 -9922 256712 342546 -109865 228009
11474 -29820 220939 338896 211609 313827 -299060 -25296 301982 -240791 251047 48347
11463 294024 180913 -344104 -223385 33693 -98761 265991 147660 195548 -37224 48188
11452 63913 79747 -181059 -78654 -50796 -16065 163265 -145041 55171 88899 -17175 189633
11440 -257417 41353 13332 306122 165736 -18106 -206352 -224522 210359 187582 -3813 149152
11428 565836 102535 -139620 -71678 178889 23041 176780 69376 411415 480796 -212963
11417 80074 -178174 228938 -93391 132257 -250593 -350154 76751 -27934 -115782 23934 159215
11406 159215 382150 -3555 -153940 -214807 -80772 -126454 106255 189160 113133 -52868 211757
11394 269586 97679 -317863 -205458 -171884 -219878 -123422 -72378 220133 110439 423280
11384 423280 -141468 42558 -57427 71090 -375142 300021 425194 126957 9451 -302286
11373 210796 -295673 76045 225166 23238 28018 213230 -172921 -180493 -43771 -172978 16297
11361 -264579 -29057 100543 47454 123561 12823 -244315 81385 363827 -289417 -19175 42672
11349 -145299 707 134334 295005 -23504 -62579 -55848 85706 361030 -170740 13594 192893
11338 192893 -115687 -47149 79763 63904 193048 -100924 -161400 205410 -106465 307826
11327 -118435 -233264 34143 13969 -10035 39136 161988 86339 102714 61799 -125872 -97124
11316 -97124 -163122 -157673 -141169 -191999 44990 199910 14484 201319 -80301 -64456 -34756
11305 -34756 91288 110287 113325 -79130 16103 -349394 -28815 -215191 -59986 200278 -125924
11293 -132135 -120873 -22422 50475 168685 56298 272471 180246 92159 -61556 87268 206414
11282 206414 290571 -2796 -95197 -109980 322778 44716 -258587 -260724 -109233 13452 -72367
11270 408079 169926 21614 -92002 414900 -240179 -63013 -311434 142878 57716 -388282
11259 -285759 -58740 51068 48893 -52259 119231 -249867 -101878 137389 -426630 -244100
11249 -244100 148689 187337 -61960 205093 -170970 336824 -181684 -278280 -111819 -284149
11239 -284149 -236539 -285423 -46880 -58770 120696 -168675 -176796 95221 -238203 137102 245584
11228 245584 -56215 -316656 -6332 -98355 -61261 -344365 -133084 197042 245994 -164347 40117
11216 -40516 72750 -75853 157726 367377 25257 333301 -150587 -288106 16921 -67731 -42305
11205 -42305 130896 -6767 335605 192522 -81916 -35880 -90962 23816 71148 -27726 116268
11193 -155559 -130789 112405 119902 54637 -71560 49480 -289753 148400 74596 -162784 226797
11181 -108882 298394 -16890 -117486 13280 -251840 -15947 -23333 -36755 -157033 -28660 22621
11169 -19361 -13447 -142305 97565 32788 -218576 145666 -52451 -173674 -29346 -39324 -339097
11158 -339097 -100355 -37262 94560 187467 -186018 -131160 245879 -463820 -244516 -19211
11147 -104185 -335472 178641 11132 -148086 -740 -63875 49000 41840 -121944 -106003 -167495
11136 -167495 188653 -157697 -202747 -15272 132275 144233 210280 -243129 47126 66065 -67401
11124 232013 -34061 86137 288737 -29348 -44929 -148315 334053 -11453 57977 154184 -322403
11112 137859 266870 61189 41360 158474 226961 251956 189053 -101187 485783 28260 257589
11101 257589 58346 321680 -63410 224023 288300 277941 209460 -16972 204156 431289 130558
11089 -15492 78739 422956 -191623 71011 343162 465876 351126 207157 125878 312896
11079 312896 226076 242053 35120 150666 208341 433707 156968 -1533 303292 303461 376339
11068 376339 224984 468135 230776 497939 171022 307898 393564 365604 279119 546236
11058 546236 548069 769511 538150 743547 680603 461442 497103 720987 591306 783772
11048 783772 651201 979455 477689 800795 613750 907417 538584 711449 564348 614244
11038 614244 667111 600019 867784 552597 726928 896804 393257 632561 818419 838986
11028 838986 641338 643962 638888 655677 663191 682142 707996 809929 814175 612404 664437 647046
11016 647046 721205 1038015 564005 671455 602407 758801 830093 628070 538112 756209
11006 756209 478084 650266 612063 624985 581338 764556 601219 721749 839969 729587
10996 729587 436857 428955 591303 575324 691739 567648 667738 1010018 1052752 1148656
10986 1148656 866254 1134130 851058 1181802 1274959 1133219 1468293 1281852 1623899 1771078
10976 1771078 1775929 1792559 2077872 2775966 2444465 2411114 2885619 2278476 2344330 2434834
10966 2434834 1973100 1848369 1907520 2048165 1461925 1882995 1779891 1791230 2029240 1972465
10956 1972465 1886370 2150776 1448151 1504969 1528211 1473845 1174581 959256 729501 502377
10946 502377 235783 475323 800540 177661 321502 -169888 -22314 73472 220319 154963
10936 154963 -212219 452148 197190 -100720 218937 507412 247981 314470 -103432 111290
10925 -291938 -179377 -216570 126897 266646 56104 266850 33155 -96228 6384 92913 45861
10913 331 71913 -86200 -19271 -209183 227261 -70724 206809 -201713 -39052 87696 -210435
10901 67007 -358611 -312283 -118456 -237897 336657 -49718 76383 93735 255132 -383716
10890 91265 -195644 194291 201637 251527 261384 250322 -100883 -153808 -305696 -12072 -43381
10879 -43381 58339 56858 147340 -68833 155656 -221799 119493 -93179 516207 -25149 -144686
10868 -144686 -207456 124371 94225 -136286 -154553 149880 27111 -158855 319596 92623
10857 -47565 262452 -153389 -201161 -138221 -197501 114447 -29004 -84951 -322831 256006 51181
10845 11759 -216293 -23572 -358397 -108761 -143458 -141810 81415 111614 141680 85014 -27340
10833 -593339 100232 92528 368800 -273670 20807 -156244 16041 2004 -289652 365265 -108596
10821 232222 107962 -139895 -260943 -156024 171962 -145456 -413786 56558 27780 -51725
10810 15379 -182851 12945 6877 45708 110060 80607 240699 -16411 -137880 -248419 -358881
10799 -358881 -320218 160913 -3094 -39572 80874 30765 207807 84948 190055 15358 -192911
10787 -154776 169145 -30559 -103948 -158621 71663 10489 -112980 -186123 -127793 4319 253973
10776 253973 89039 -113026 -200941 -63172 191117 39114 -161475 157713 371935 -62808
10765 -69884 309206 -2872 212871 -199499 -106942 -238474 37140 -28826 -284843 186493 5303
10753 -208810 31121 323924 -25871 -248648 242669 181690 86131 -294703 -111345 -48448
10742 -441055 -82226 -359562 -219219 126085 -334060 -207999 48750 -177421 -79933 498456
10731 -33383 -166662 255580 135208 -51402 -159129 42 24296 79127 2393 -87133 -106736 -149795
10719 -149795 -85027 -42080 -89470 94112 -39336 -137544 20938 105402 149796 199649 -139796
10707 -48332 -241275 -123047 -134462 -153961 111039 131744 266426 -109406 -84026 503287
10696 -209869 283942 -216259 -26914 155891 -35832 -398289 111950 -131651 -49310 -135437
10686 -135437 41590 -58480 -391439 -132593 -197745 -10775 -161939 -107738 -61603 -53711 -4696
10674 -23270 -147600 114148 135251 278475 -326997 101581 -192652 -167662 -414240 -115373
10663 207238 310660 -156000 -169829 -218916 -230396 -76707 -104213 -92662 -158655 105682 -199426
10651 256462 65118 -31662 64511 -147797 278477 -142582 -76379 -227234 -162293 69287 -201836
10639 184850 76462 -106349 -180258 77637 -117414 -113470 -104268 -10752 -124595 -203893 80090
10627 55386 175913 -235635 -77140 327895 -156840 -154048 224649 -70917 300103 -20587 83318
10615 321311 -97337 -71664 87013 -18268 340969 195944 -5025 -95584 93242 -18456 106821
10603 80511 166415 -211015 -300832 -326918 -29229 -11845 19303 345556 -160792 59928 -64919
10591 -350631 215028 -140799 -54355 -150153 154259 -48548 -136263 -21856 133047 -248904
10580 -34902 -67106 -20763 -130650 84831 -66415 8224 17435 -162191 393779 -21209 -18514 114567
10567 -149237 -136351 55579 94415 -31297 1166 -40891 -344688 -95678 73274 -390364 34298
10555 134457 -258088 -369911 -276016 126203 -185519 72336 525447 -83913 -330369 137442
10544 -277813 -125253 -128137 63797 -39 -192979 218413 -164974 108778 318461 74503 2643
10532 -79044 -114829 -50584 76359 -169736 -67363 28611 -96215 382289 -136532 -5120 -186531
10521 -186531 299763 -197491 -84806 12566 -116319 -185032 112178 -284392 -68241 113082
10510 -94954 139309 -150487 140922 -108885 -97510 -42339 143975 80278 -87475 72401 33414
10498 -24541 22999 -117323 51058 83277 197504 -163621 -262788 72028 124840 186374 -316516
10486 -85866 -61673 213044 -3434 81048 57465 619917 632490 168735 330928 589394 40524
10474 68311 199530 232713 -164522 -95251 209031 382824 -137556 166816 159936 79214 -190537
10462 -120134 67015 346712 -58984 -178932 92342 -212616 76197 37131 127805 -267548 -232783
10451 -232783 120206 -137445 -131705 -20446 -252996 254337 -78813 -312109 -31901 -136009
10441 -136009 55575 -98312 6183 -13494 82381 -34425 73443 -293734 -203632 -136957 -83359
10430 -83359 170979 106038 -258118 15240 43934 -141701 -71558 -235998 -154407 147190 -52623
10418 96444 -114353 -221305 -49533 -230677 194228 -113045 35302 -86947 -22883 -47765 -40885
10407 -40885 -240694 158352 -44496 -284178 40465 -270654 -106300 133496 -214490 74366
10396 89011 53027 363759 -105871 63908 -104131 -17392 345772 27949 335148 -141772
10385 -127953 -186968 180585 -219080 287555 278031 180170 181443 164014 -90822 -135036 318226
10373 -92180 553254 202789 141834 59535 443128 284302 250992 549578 407415 330612
10363 330612 125969 675162 364279 425001 330742 232773 757003 444780 327952 198810
10353 198810 332845 164700 258911 674202 716791 486934 415273 277094 62500 -83948
10342 631561 629930 700168 149934 162362 160499 606401 201970 66339 -53824 340260 96989
10330 -23954 493001 295215 184228 128046 224603 -1053 148181 53524 196322 109661 161858
10319 161858 -260609 235286 379431 -97773 139216 336436 -75123 -21174 79576 -307772
10308 229468 110394 76158 31150 -52592 225183 -218366 91268 -292096 280998 7615 -69801
10296 -123783 33966 6952 -16602 -164451 -117482 283191 -139063 151023 -374589 -148053
10285 -78097 131580 173334 -116636 59613 -275455 292482 -341328 9506 -270841 164843
10274 52223 -39860 50971 251862 -507569 247264 -30188 223798 -54389 74515 -327004 -23897
10262 131197 269658 122117 74746 323480 190826 358043 372192 -84132 51824 374207
10252 374207 -63269 51486 262819 -216544 -242047 87289 11680 6601 -348197 -32397 105121
10240 -98217 -348825 -372141 321667 27919 2960 7529 95132 -20135 -10399 -123984 -227441
10229 -227441 -73471 12533 -233293 11943 -191977 6551 14176 -127465 49735 -169765 -63591
10217 -54457 -346827 -212514 -257956 118072 -310819 -464138 95613 74113 63157 8155 250253
10206 250253 136132 -344555 -281087 385603 -177483 -21015 65718 -116243 -213327 206848
10195 -17797 97981 -133614 238822 -71599 173262 -73693 -268780 -78012 96887 220732 225697
10184 225697 -66959 -117278 -187041 217529 -123308 5023 -30154 39752 -143162 -84303 1618
10172 -40586 -71632 109834 -154896 -385310 156803 -203570 -200755 -165432 253684 -236652
10161 -197230 347853 61639 -391066 -83863 -6531 -222520 85845 -250891 -183486 154113 129836
10150 129836 82181 -34262 -31390 -91795 -164490 54814 -72184 230752 264690 -117340 -9322
10138 -83076 -43645 -18187 -12206 13641 278712 76323 -58723 12458 88732 -173706 -43527
10126 -60874 -356549 -46678 -114192 -47788 58040 -287242 -194781 203319 -258716 -108305 269355
10114 -139089 242594 -118727 -185702 -128615 11092 179696 -16288 -294599 -125213 -76862
10104 -76862 -170657 -59987 -16888 -186980 -192208 -225872 407017 -301730 -118846 148054 -98713
10092 74901 -44263 50036 -193369 250237 -308173 -172458 -206520 -245274 -172215 -148878 264636
10080 -83074 -71293 -57874 171147 -13252 -73463 372014 201580 109854 123417 -33787 -34451
10069 -34451 -104563 76499 -242943 50497 102573 176083 -390454 -163051 42667 183248 -231756
10057 -108516 181083 -155407 -183114 4136 -249152 -125867 -220255 23079 -38459 188406 55998
10045 58573 -4377 -230228 -74152 318948 -273308 -29133 -190917 -6804 285533 -71629 -461868
10034 -461868 -198793 -70877 -230744 -46278 -79958 258616 -85812 -84996 -21104 52980 58474
10023 58474 -61609 -313985 -104124 -238435 5662 -319456 130250 155804 -148615 -40775 79235
10011 -85263 150387 201921 -69240 -107887 -221173 -169718 183477 -306530 -125060 32991 -236157
9999 349710 -148444 51219 -9308 126456 -92887 -113176 -43278 24857 -10233 -24693 402949
9987 -228296 -285497 117358 -54468 4367 2652 -3531 -562843 108311 -105939 215775 -326356
9975 -265574 16787 -151310 128216 -156541 -40812 122581 -155127 -71867 113347 97771
9965 97771 60454 -46793 -135570 349384 43279 -165470 -131159 -6717 -199352 138009 -177542
9953 -55805 175204 124700 -102626 -253982 -167572 -101183 -328358 454139 -134183 43690 131837
9942 131837 -125962 -161766 15990 -42108 -308849 190347 -45883 332823 242846 55857 -276128
9930 114757 -368698 212243 -142168 -3072 89518 17556 90193 368633 122151 -34464 314700
9918 -254292 -192488 8727 118810 -55994 -71363 -62845 238043 320816 247284 -131795 59177
9906 119519 72106 -80958 163730 -105588 77957 -206201 75662 89121 -304668 -264443 -171046
9895 -171046 -144428 -119571 236578 -194489 -326152 -38187 -238009 126203 -263363 127382
9884 53835 169105 211824 116664 -167129 -16354 -97609 -145000 -108124 -290768 -275861 -293813
9873 -293813 -13749 -244055 -31231 86091 -87196 -415172 -153387 -103053 14339 -263418 -208762
9862 -208762 -68177 -100254 112919 98430 17989 -107246 -455223 127764 -273358 101430
9851 -75398 -400546 -111471 -100513 -28767 -40437 -249810 -275610 195586 67711 -239161 -116072
9839 -33815 -338756 -43668 -136109 -70492 -3595 -252202 -251630 -141537 126071 -32179 -191833
9828 -191833 -535885 -186021 69385 38845 -170468 -83951 94757 -238204 -17979 -312599 -97996
9816 67795 -125686 59005 -66649 -183208 -331990 70415 -111129 -58899 -90793 70073 -362078
9804 -30965 111506 -99715 -76975 216586 -49556 -212064 -190181 -46673 -275368 -340714 -223664
9793 -223664 -243031 -167854 -189693 8029 79762 281003 -187894 204684 -246773 -936 141264
9781 -103763 108964 109285 211973 -249541 -215644 -53132 121020 -168365 -536 -144435 -47343
9769 -75635 -90631 -59594 -69555 -5487 -2704 141242 91428 -307362 26030 160636 -234042 -193938
9757 -193938 -248540 119798 -41405 11353 -130205 117122 146384 46736 -190830 -179743 52560
9745 -170939 189349 -136692 -326850 -269394 -330948 -135040 -189717 -77285 -111271 -83248 -121403
9734 -121403 111692 19805 -148294 -85049 47239 -318789 -272223 -230884 124530 162027 243256
9723 243256 137506 34357 145940 252388 36696 -303451 -207492 -84307 103580 -279762
9712 -121045 116577 -135472 -109339 -25325 -39193 -174612 129283 -69081 -141021 -68204 -190499
9701 -190499 66746 289974 209461 1019 -230171 -93659 339402 -211869 100084 -128039 139983
9689 115838 -63575 -275265 -102910 1259 -199815 260516 78128 -220315 110235 -518514
9678 -113408 -239281 -310257 211269 11576 117304 282922 -111201 -149772 133873 55060
9667 -112246 -75665 143472 -264729 164686 -276652 31940 -56573 318724 -88463 -268583
9657 -268583 131571 -266482 319240 322777 -207218 -967 116627 -379417 -291380 -30982 -21491
9646 -21491 24498 -90847 -301888 126221 14566 69360 -16534 16796 -9218 -256163 -209386
9635 -209386 -168413 92433 182184 -160861 -103659 64686 104636 171859 -71149 -118359 -138558
9624 -138558 -97662 -86405 57835 -162518 182795 84766 -309359 -310220 -493002 83071 -264205
9612 -11626 -18818 -77393 -103775 -87898 55553 -114902 -106520 -311568 -226614 -54396 -150947 86135
9599 124251 395464 -30158 13469 -223572 -87147 -83444 -194643 98592 -192702 164165 1220
9587 60265 -29884 52194 35753 -132107 127432 -188803 117385 108817 -213461 42200 -411349
9575 204299 -188316 -78437 84202 -108475 2401 78298 -167916 143064 -8818 -360008 -118818
9563 -196458 241440 -137680 -284913 -56078 -212465 59741 210702 66220 -145589 143392
9552 11086 12133 -154837 -224245 42308 43928 -286776 361 -285396 162222 141449 -211583 115510
9539 -15827 -201356 -83308 -457292 -161610 -234962 295934 -331368 54429 -210589 42641 -321889
9527 -165075 -257420 -238933 35423 -57313 146347 171987 39556 14883 145296 -21556 -108282
9516 -108282 23489 51564 -62574 -160136 -297329 31577 -129575 4161 -22880 -17755 -207576
9505 -207576 -144100 -27639 -158933 -81419 -262933 -236164 -364561 -91767 -167721 22172 53626
9494 53626 264617 176604 108915 130975 -339442 11095 178093 -134220 43125 -76870 -7223
9482 -67469 -9675 -199734 -96035 -357643 111875 -213550 -93004 -54419 -85386 -42477 15802
9470 38780 -144223 -70673 -74360 269184 -319672 -794 4761 -5000 27230 -217927 79981 -48062
9457 -281300 -125872 322503 -418681 46122 -131880 -278647 -105029 -72596 -1383 58290 75150
9446 75150 -298261 -131872 -143413 153436 294905 -273301 -84036 93671 -26060 -62500 -22564
9434 -144150 173432 -223074 94502 -177910 46163 -139570 -14458 136992 -35121 -283747
9424 -283747 -132392 -44591 -59258 -109685 -38238 -272599 -68777 223467 -47501 205151 -26848
9412 -92053 -205220 -145859 787 245285 -418529 98133 32467 21932 372267 -68217 -228317
9401 -228317 -301851 -36854 -133490 -118998 -140567 -105652 75255 -254743 49145 -324242 -114473
9389 -25149 -195479 -254646 74046 189757 -315965 -172089 -62586 104100 -52055 7860 161860
9378 161860 114310 -1741 195434 -167607 -361290 149263 -243300 -117513 -65428 -447233
9368 -447233 -55960 -16644 44904 -10688 70719 -200063 -289141 220965 -165978 -238932 -183406
9357 -183406 -219721 142504 -391130 342935 62056 57516 -136431 -324870 -221043 106615
9346 28294 -91200 -110326 -106089 -370943 48804 -175084 13814 96386 -91552 108189 -164299
9334 -196177 115151 -64875 -248451 -75973 -3619 13211 -125699 22541 -125757 -178572 91021
9322 -16432 -114371 179889 -127282 -147903 -33873 -405446 53664 -179119 87944 128105 -87022
9310 -467327 -71045 72183 67930 189045 183509 -47262 -49045 15035 -21901 -21489 2592 284018
9298 284018 -114345 59976 201620 -120296 -320037 -73148 -122442 -189042 -89530 -1237 -315592
9287 -315592 -201979 331363 5938 396385 -3077 -242915 -103477 11052 -287980 159998 17548
9275 212738 -57947 174075 -195348 161846 -404220 -64979 -142871 -84028 127821 83754 11585
9263 -38351 -76342 127079 137756 4246 93216 -156631 5076 -227078 70652 -107490 -206363
9252 -206363 247328 -155063 339204 -143680 -379629 -66784 84604 -195753 166291 -96407
9241 -66621 -297881 63098 67469 -179177 -203259 -97445 -122127 -188606 86302 -200362 -257163
9230 -257163 -344572 -399292 189905 -165688 61034 133175 -232293 86944 -312569 -67850 -90860
9219 -90860 -308405 -7206 987 -157033 315760 -198389 60320 -191226 462914 -229917 -125734
9208 -125734 42546 188161 195625 -244628 -197474 235700 -315300 39505 174125 -506365 -161762
9196 -303585 -99061 74989 -43327 -154842 -68612 -162839 79616 -80340 -47868 -189586 -136062
9185 -136062 63625 100064 -182792 -146467 131947 -295756 142197 78290 -28018 -339061 150052
9173 -167423 21208 -314716 87500 -34020 380008 -109537 -237763 -113953 -54930 -73147 237271
9161 -103789 -67761 -133583 -28626 -70437 -157509 188172 -10369 -453455 -136458 295879 -87819
9149 -98352 -98977 -55188 9707 122980 -225304 -108192 -236452 141284 -189876 -115455 178590
9137 -178092 125172 -222626 121852 -116600 -169866 61343 -22646 -116955 -39068 -245640 147990
9125 100695 -109846 -27081 -142657 -129097 210022 31998 -121271 -117684 169330 -249615 242183
9113 -57071 -50955 79276 5033 -31443 -56959 -153466 -191543 36470 150334 -248429 33943 -64148
9100 -15776 -51805 -26780 -334607 -416223 -121133 237032 -95923 -355968 96728 -165501 18977
9088 300458 45500 -217530 -63889 -62692 -34087 10849 -231830 -151012 33640 101533 -103369
9076 -30875 137288 84500 141506 -24058 76613 -431039 -362965 107243 130 134475 -189374
9064 -123850 60133 142193 -115930 -61026 2997 -133307 -222502 -108446 -50169 -141111 -488146
9053 -488146 156227 -20165 71057 -24321 61919 -186951 -137066 -953 -67224 27122 184591
9042 184591 79843 20645 1385 -103023 -45216 -164960 196565 -57335 -32185 -91844 -233916
9031 -233916 -289823 -65523 137393 -40223 -245 166191 -57898 -122337 -140382 -18584 -61848 53898
9018 -153119 -162786 -95982 -98786 -181300 -127891 -174023 22410 100285 192055 -39501 -303385 223928
9005 92670 -103284 -59171 -273532 4072 -161173 -130898 -416182 210015 -63091 415997 -65171
8993 -134007 119325 -56207 345310 42992 -102494 -295178 113035 -172793 54079 28982
8983 28982 -134911 114679 331153 -37937 -19522 -289266 214132 75541 -150579 20364 148273
8972 148273 26280 6219 -267735 82292 -138284 -144815 186537 -50553 -81663 141249 -95383
8960 -187392 -61513 38689 -54923 -106270 148347 -131449 237906 -110480 -133604 65807 109716
8949 109716 -247742 118366 -107549 -239867 219535 -250522 -17359 -253132 -110190 289517
8938 -67867 274883 -250931 -22729 242219 -327023 39599 -51564 -205746 18020 95768 178921
8927 178921 208643 227689 422226 730452 1937367 4201254 8364647 1878559 271263
8917 151694 256023 -89462 273684 173352 -288782 128390 39137 183932 645 378616 -53582
8905 -508059 -369114 -277118 -261213 118072 10911 194320 -121445 -169096 -102830 -326428 213712
8893 -109829 -160205 -44786 -118450 290765 13476 -81903 -82253 -191969 205968 -212194 -539869
8882 -539869 232618 -412471 -182147 124831 -25444 -318251 52851 -335226 226207 52018
8871 -86369 -181098 217592 98150 -72815 143735 -149301 -133179 220340 109474 296276 199024
8860 199024 -158012 -2092 -273152 43022 287119 -160295 59632 187058 -216741 -384422
8850 -384422 -216714 -11185 34987 10855 -150721 -102184 90112 11468 283719 38037 -172984
8838 21814 -364635 -172768 -115450 -166818 75222 -183981 46804 -10606 -3739 -328666 -337084
8827 -337084 65242 -276182 -289641 -86847 44187 -298056 -186066 55966 14470 128366 -88582
8815 -37027 -84839 -66773 53622 -657 -212735 2143 270059 55639 -534863 -30160 294547 -80854
8802 86197 -124097 6476 57247 200464 50547 -456986 3649 52267 -196007 98895 -67202
8790 -414223 62024 -110469 32394 262537 41169 -166690 -540719 -60934 -641954 13354 -196294
8778 -23144 -72336 -9589 -62896 335120 -122471 -115440 -80211 -191341 -137190 206787 -324832
8766 224827 -229627 -18880 -15464 289474 10324 25024 -41170 -38740 79471 -9471 -294883 -36728
8753 -230006 -117477 100982 21014 -5768 -86559 15215 -137821 7132 -67466 -189695 -124724
8742 -124724 -12217 84329 31285 -100488 -241234 -39014 145723 44558 55288 23743 59139
8731 59139 269733 -115436 -346531 4153 -200086 -269728 -175863 -169458 261022 -209176 41271
8719 291106 -34113 -563818 -354388 176013 -163639 -253021 -406 202825 -211284 -125811 318134
8707 -151359 -307244 -221873 85532 -84051 -356090 295432 -948 -92449 -158541 -48188 -122937
8696 -122937 113749 170374 162543 5731 84785 61609 -271941 -43041 -44855 3864 31184 -166965
8683 -171836 149568 -121765 137293 -247896 41046 90343 90289 -124203 -20689 -193747 -88773
8671 -42239 -96646 -190398 -353702 69645 31583 17332 -300111 399759 -526189 -60196 -95048
8660 -95048 87839 -113205 -82966 -10870 69138 235951 -93364 148577 51243 -186444 94376
8648 160078 154855 -35864 5872 -141282 159558 -132466 42721 172909 49703 -47835 -145922
8637 -145922 -33042 20510 -58323 -51677 202109 -158026 160832 1322 36434 -151735 -484249
8626 -484249 -25444 -441545 -186526 33454 -90655 -333228 16210 -555 -85943 -148020 -416146
8615 -416146 -182227 92416 18323 204488 156477 264036 -12773 132350 -375694 55410 -55767
8603 203461 -34817 -211946 -95651 -78830 -180986 -228178 -25964 393260 -167129 253143 -135160
8591 100040 -15337 -194461 -35900 -224729 24964 -189923 154851 102846 264190 274770 -69006
8579 -28454 35535 176835 -49212 256125 138239 -146134 -60198 -77809 -260526 154419 180646
8568 180646 -113248 -290350 53792 161281 -73671 -317680 454773 69366 25334 -181316
8557 -460263 -200865 -80402 268886 -5888 -79219 34922 -65616 -110871 130985 -348704 -289687
8546 -289687 15459 37427 -181507 -30033 42945 14515 -135650 -307802 -58857 187778 -119577
8534 348256 -119739 84673 60734 -165838 -244179 -64385 115680 -176607 -65748 -19622 44154
8522 -121420 71334 126130 -102274 -229676 -88972 -166081 -122717 253009 -70103 84001 -7439
8510 128850 -70419 -148599 -246386 -15115 -141964 -494882 -7962 -162818 -104576 -209873 167868
8498 -27460 288967 -87518 155821 -268714 -509967 -212192 -160466 -146162 -328956 -122376
8487 28833 -1531 -284829 -218093 78302 130733 -82926 32073 -138855 -21317 166375 -423821
8475 317209 122166 116379 -56665 58364 -86959 -141141 -152562 149176 9761 26691 -228579
8463 -127017 -126260 -18118 4764 136181 130300 208631 -122961 145562 53578 268976 236755 -247074
8450 310811 -78054 -170450 -327394 40038 303416 13258 -285516 6116 -255088 94610 74754
8439 74754 -115265 -3747 3392 -182052 -324739 -228288 84644 131809 -115126 -221511 -81481
8427 -256464 390092 160321 215641 54294 -121558 227372 -252167 -279429 -94702 72343 165062
8416 165062 262411 27952 -195948 65571 46073 -349818 7359 -2441 -60463 182738 -212463
8404 103709 66263 -1733 -564090 -439206 62706 -100283 -80953 79922 333516 -258453 148140
8392 -133221 -370645 -121261 324222 -137450 -65665 107577 -182338 -35477 -410200 556781
8381 -150856 -242897 243048 89288 36403 469018 -184887 -16594 128138 -108793 52161 -139867
8369 312625 206694 324885 257798 -178 -20346 -27458 -132122 -126642 118262 -164743 -129779
8358 -129779 253066 -45752 48312 -303850 -109814 -315703 -169953 50744 -10996 -10931 -220315
8347 -220315 -203966 -377431 8799 44163 35165 -121368 8335 47535 -274674 41365 -210647
8335 -336058 -133177 -101506 -272282 311930 104548 -181534 -258340 -99728 -94759 -354139 -228288
8324 -228288 -243198 -144865 -562683 -99376 134237 28453 -271160 -439857 -7598 -33175 4541
8312 46315 -245210 31939 25477 -187479 -55475 139961 -3274 -307731 32995 -31616 145899
8300 22508 181044 -78518 -204138 -211781 -151266 64019 -22496 -51488 -244829 -187385 102707
8288 -191978 19141 -204584 43125 -107972 -63469 -95871 -190009 -83166 -159230 -325117 -230355
8277 -230355 -353274 58385 91037 -190772 147881 -165063 46653 85154 121777 -129097 -25659
8265 -100166 -17482 -228340 329081 93100 69018 -42805 26432 -138346 -92687 -145606 104763
8253 -144971 44760 -53436 -41788 -8024 7934 111195 -107833 -92645 311322 -79770 8959 -12117
8240 186136 -47545 144137 59796 129690 -33050 -186120 -220620 28642 -2574 -52527 -233725
8229 -233725 -324437 294378 -14634 -134492 -282493 -367775 -310174 -218738 -1318 -22894 51433
8217 -166453 246880 165760 257195 -187345 -258125 -173132 20328 -230962 -96540 -330478 -89561
8205 38430 7472 -249954 73356 -140261 -47934 -322535 -11405 215389 177719 141706 98509
8194 98509 63178 -303487 44194 125188 -239261 160692 -154856 -283219 -193944 -53568 84494
8182 -75100 73231 -29167 -26087 -38965 -24489 -20603 -196573 -51877 -78571 -441345 -121144 -99328
8170 -99328 -211772 64362 92084 155651 -229874 -216191 49390 -17582 271981 99136 -78782
8158 -86634 150472 -20994 -18821 -20744 24704 13432 -141487 111671 45693 59292 164116
8147 164116 -190785 190670 299473 148692 -214211 283307 366715 65937 114158 151746
8137 151746 -271816 81694 -167778 6665 -349105 146209 -110987 212712 -83726 -312151
8127 -312151 207247 207302 -351888 34129 220742 156269 -108461 -90090 -41602 103387 -123488
8115 -33683 -298454 76189 10141 57507 -86393 -321252 54374 -160956 206517 95559 131281
8104 131281 -114877 -194876 -12845 163639 -130308 12014 -92040 96279 -195203 -164629 -126829
8093 -126829 474749 166183 259692 -207866 6089 -93434 59355 51038 -251938 191987 -328718
8081 -42831 -115774 -109690 128025 -80797 -62267 -36585 91688 27723 13189 -93723 -25913 -269092
8069 -269092 -135429 -82249 -72712 -81082 174074 -376348 9413 -104907 -404332 -234799 123569
8057 -237131 105431 129634 16781 -210751 -148983 -228129 -390703 130450 124640 -168643 108785
8045 -9918 -30452 -187864 358945 -289146 -71588 13895 -413555 -192347 -277573 -417042 125559
8033 353440 -42003 220095 -81266 -150444 22031 201895 9933 4878 120986 -265116 -165460
8022 -165460 -32298 422818 335665 13048 -297161 -225712 294542 390107 -82357 207756 -228708
8010 -172446 265622 -60933 152340 -112170 -363078 -102807 -34697 -35890 112520 -80968 -119442
7999 -119442 -121685 14286 -42187 -276056 -163383 -274848 -3864 -48493 -69504 299521 -139009
7987 200555 -58997 -300485 -24853 73160 154836 212596 -38737 -64397 -138966 149556 70357
7975 -309026 362263 -46923 -256797 167781 -85696 -247735 17168 -349541 -152319 -156449 -252615
7964 -252615 -188412 92251 -74119 70769 -126114 20111 22496 57869 40513 -79862 -50103 -115654
7952 -115654 205357 -70755 -84040 -124545 -240533 -130043 180519 251505 309367 73025 -126310
7940 176205 -265922 5707 29426 -180343 77947 -78534 -60133 -269838 -72950 -104714 61538
7928 89857 89330 150022 -348083 -345778 98839 -162297 -124296 93513 271765 -163460 -266120
7917 -266120 -53476 -213773 5981 -364251 -118587 -111899 115904 -328448 238688 -243346 -124596
7906 -124596 119050 -93229 277418 194420 -220221 -56187 -265035 -441765 72081 -172127
7895 -278878 8397 -364755 93227 -315244 46483 -13288 -36070 24776 50672 52388 -119742
7883 -182650 -289439 126444 -34588 -394849 -291685 141961 -107275 -238269 -147339 356932
7872 -180981 -456760 -1794 -227005 -86040 161100 453 184457 -22739 -260981 -3896 174276
7860 133606 96439 157735 123909 -5279 108896 139429 -35501 115552 -99989 -111553 54329
7848 5287 -292647 32716 274483 108517 -75856 19373 95881 -133734 -121548 238163 -234532
7836 317786 -248909 168617 -440565 -107776 -98116 -214179 -79454 -285010 -34057 45561 192200
7825 192200 -244163 -106656 196284 -83078 168053 173696 -223789 192066 -22962 -419927
7815 -419927 -56426 164678 68146 -44166 373562 184543 -198037 72360 67177 27552 -152527
7803 -193609 16054 147356 82756 -33472 -246814 -82735 -239258 -86440 -252461 52888 -46772
7791 12269 16422 107740 -396054 309767 -282982 -248971 10519 101199 -96494 77941 -312735
7779 70282 165492 43395 -24089 -99039 -180692 -87488 4027 -218623 -109722 247342 -689 -84253
7767 -84253 174974 -135900 31314 253323 -34699 2999 -25242 -201353 45977 -8575 350784
7755 75265 150878 -178617 146145 98430 -232515 -28795 -160676 -23842 -108004 -428736 -35782
7743 -79618 123175 -237753 171985 -138289 73115 -64324 -149436 -246228 61153 -100071 -98110
7732 -98110 -72699 468387 185896 -12954 178915 -230178 -56722 70410 27823 -193699 92148
7720 19779 -265131 119521 -105443 159997 6501 -194315 16054 -346206 -134062 -182869 39253
7708 20757 -47689 -11256 225834 349270 202952 -233389 112523 -40392 -101515 -162087 -202528
7697 -202528 197448 -238400 -42195 251980 -201387 5847 -162777 120979 187542 60009 136866
7686 136866 14060 217411 -137918 -283282 192074 85922 -20722 -159880 -9291 -85340 -101098
7675 -101098 -275651 -254944 -174696 61282 -69467 -108981 -423547 -109326 158594 -15122 154082
7663 -16643 57126 -86033 92625 101202 4561 -89627 -186830 -148336 -164483 76107 -346419 -86774
7650 216699 -174266 -120016 -183260 -80358 -47880 -27185 -93032 -217064 111382 29027 45386
7639 45386 94682 158256 -169606 -22003 -117735 26579 -345117 290771 171197 87691 -97466
7627 -124997 101428 178682 -219289 -222443 39912 72506 354190 -283034 -402990 -37409 -77210
7616 -77210 33917 -137393 -262122 -146986 46108 188488 -9329 -300347 43607 -11103 -61627
7605 -61627 101829 -260672 44310 -70519 55751 -73017 183533 19629 -85633 -39734 9698
7593 -26109 103198 -10201 68388 24735 212966 354 144388 -278238 254934 -109009 -134403
7582 -134403 -98102 -227917 58436 115888 573 182219 118567 55748 -5252 93094 30375 261333
7570 261333 184841 -51146 104604 -76741 -175709 -265551 20656 -135493 -6963 -123591 -168274
7559 -168274 -196810 -304156 122855 -88189 -80899 71016 10639 -3493 -824 -157195 -222441 -64726
7546 282888 -163481 174301 -97693 77676 56894 111930 -31910 105465 -298010 167388 -61931
7534 135590 -220230 -699 198204 55391 -238282 -213773 -153498 -107504 -162237 -180994 -371523
7523 -371523 43754 -56659 -389046 -35968 -203674 -74577 165303 -241943 35925 -164309 -125479
7512 -125479 27490 30621 -464116 -139748 -67051 -261411 26641 -78715 52741 -73081 449535
7500 -215729 -131543 -347545 -144331 -187518 -356427 217132 -433582 210053 22164 -100657
7489 -11277 119099 144907 222340 114065 54550 -31561 83155 -298808 -155925 -361765 -115465
7477 -226751 20904 -65554 -419189 72360 -147858 -256943 -158649 -104464 173017 -259628 167601
7465 103430 -61097 -35273 -164427 -171144 -358951 18069 78316 66796 -45678 -45142 -286468 177608
7452 121635 -256792 -267492 85327 -184127 34477 -184317 106795 -256626 -30534 -71723 -226796
7441 -226796 -171093 99654 -91904 -83989 -119368 -165978 -55618 110605 233166 271147 -80238
7429 -36575 303194 165923 -82313 111631 -60816 34305 -94603 -215064 -241137 233890 -91437
7417 45497 -90763 273377 178435 110474 -27374 66765 -202526 36080 159484 40409 -126094
7405 68809 106371 -32976 52111 -28063 -277134 -1618 -303677 33822 80396 -69958 -79774 -172713
7393 -172713 149861 -7542 -339238 45208 -217696 -176819 -100302 196892 -129905 255656 354568
7382 354568 -103663 185541 -295151 153824 24797 -219074 187155 -231557 -48758 -131566
7372 -131566 112801 -367460 70466 -135509 91658 11834 -170449 -102546 -31169 -177803 -207004
7361 -207004 -105625 156627 -187663 -36530 -45260 -48767 251486 -247469 -196971 -247102 -183798
7350 -183798 173614 172390 92992 158259 -438586 25996 53370 -121179 -28530 -105945 169959
7338 -3716 -17382 239072 -16597 -160232 110603 199388 -60114 -103096 3394 -181051 118701
7326 -554118 -294878 -217430 183396 -359280 -203896 -158269 -36758 -78028 -232598 -156153 164894
7314 -227457 -215269 112521 4526 23206 -38415 -60122 -74467 -329363 -36362 3591 -175355
7302 12233 76461 -16841 166819 236065 835 -405031 56671 -45903 27564 -42922 136201 296601
7290 296601 -24660 -234387 143444 13063 245714 -117664 -24462 -224 -344011 -205332 -24338
7278 -48313 -117233 -140605 -12612 -179710 130299 -478053 114055 -6811 92756 -144914 34498
7266 194682 -72616 158579 -130645 171484 309720 327424 -432140 -18166 175533 -110504
7255 100425 33938 151135 -116638 -518823 -6765 -1430 52282 -102401 52799 153390 104285
7244 104285 -97944 60576 242338 74231 -66554 -239976 -65295 -107357 18326 160974 -105455
7232 -212341 175117 194237 -175399 59789 57168 87104 68253 -225200 -26893 119100 56592
7220 -117630 70455 174987 -208124 -204308 152092 403069 -275049 -18082 -150932 -161728 -157291
7209 -157291 -66680 -250166 -26633 -171964 -276838 -60535 368285 109072 -101755 -57889
7199 -57889 -42931 181961 -119231 302711 97140 55444 165262 72063 -1169 -7992 -209867
7188 -209867 -26958 30595 -45869 31322 -76593 -17826 -214264 -168441 7881 -201106 -10310
7176 -20717 160650 41131 -61727 -73589 5488 -53327 -86625 -453713 3833 -77243 -510091 239898
7163 -74464 24080 298261 -411571 -237091 226895 78768 -105173 -84341 203809 414454
7153 414454 -163515 -142553 42311 -296974 -19660 -44925 -8981 -12301 152490 79637 -27317
7141 72333 -130677 25481 122676 153926 104160 -226792 278054 -8883 -74527 -104074 -81175
7130 -81175 -28614 -58259 315684 131172 64903 9210 -234452 10148 -326542 -220894 -210297
7119 -210297 400178 -208323 -111005 -59469 -56474 91828 -273265 -352461 -44931 2413 -170654
7107 -246300 -10431 86835 -356929 285784 -185801 -229179 -30560 -248438 -179288 -289106 355501
7095 -73038 -154949 -217583 69221 -9443 246318 -211156 -263992 94366 64761 -40277 357252
7083 208693 54774 -345863 -38973 -86857 46722 71052 -23372 26902 43296 266576 -183049
7071 -8092 58800 -134941 256397 5425 -103876 -72303 -51731 47249 -103742 -79123 -12978
7059 198504 -134729 -162611 218048 -100006 22849 -249965 -44238 -439149 79522 -152975
7048 -113046 226128 -325113 86030 -317124 85498 -174455 -198360 -54617 49834 8276 -226034
7036 -350682 -151220 116517 -198728 -23067 12145 -46981 -218570 211210 -112955 -86863
7026 -86863 227463 151979 -8571 -109273 -196393 105382 453701 -247229 -143136 160837 -62198
7014 -130551 -18597 53591 -118016 51759 100613 39373 30914 24712 -173056 95985 -328889
7002 -89224 104622 -28955 -301913 113224 -248081 -22137 -89312 -62919 -191846 -122814 -136900
6991 -136900 -124102 128679 150417 -49371 -125725 53174 -8679 94605 338679 90044 -24313
6979 50613 -222873 -77944 -7912 -125700 55899 18025 -174623 144910 -103456 -231503 21908
6967 97922 -323019 -37751 112945 83758 -345715 131650 -374771 -189804 434234 -169341
6956 64181 20506 122450 -218833 20922 387783 -239398 -205248 -155042 17665 -58012 294338
6944 -353063 72342 35368 -126068 57942 -67018 127223 104024 75899 -173787 123625 -222146
6932 218748 -39025 -181963 -232700 -311637 242212 -423 -170545 134049 90005 -119942 -295253
6921 -295253 266675 -186234 -153697 28726 -102072 169036 -76088 33302 81380 -124193 141776
6909 -60765 -112106 -95899 75894 201624 -3037 -97541 -164529 20267 224101 -27784 41609 -66900
6896 -41266 101515 -82584 22487 159729 112671 -96945 -64055 28293 -113790 -359250 177678
6884 90627 -263121 -132500 16822 -19308 -160476 -36501 233039 -366924 191332 138227 -97060
6872 97750 -62960 171400 -115371 -107435 -312501 -241790 -109528 -241685 110011 -313356 252827
6860 -134410 16922 -304944 -108819 182922 210652 -38327 94751 -93264 38618 93510 -62016
6848 -17915 62721 -167286 76603 70535 195540 87830 -435935 12835 207893 -52483 202880
6836 -9423 131599 -6897 21395 69259 -83403 140670 337882 -199667 -109821 233290 -343704
6824 -124895 171388 -205089 -140172 124217 -4205 247808 446226 -241324 -442806 52216
6813 224448 158636 11436 -534435 -29149 214389 -96998 137448 -46392 37695 255200 65565
6801 233815 -55449 75053 -282856 -67082 -144347 -350233 137531 -38148 184182 -7049 -21597
6790 -21597 170165 -250917 -237423 167365 -232248 -86691 42303 360292 -113975 -11861 514842
6778 20334 -93649 261645 -164571 -388744 60344 -86537 -267706 83670 20016 83575 -281654
6766 -64559 23969 -167526 -79432 171814 297389 252283 336871 -122940 20362 157587 83049
6755 83049 164782 177586 -202034 402079 22689 86769 -201110 -156188 -19599 143468 -21873
6743 -254691 -165361 188248 -66155 227873 -57020 86190 56655 5017 -317901 13004 -25673
6731 350124 -346996 -175990 -224031 -216013 -353371 143744 -225582 25978 136659 -159773
6720 -315799 56950 331062 -19026 -173784 -12488 33758 -283825 193437 -295781 235881
6709 -29611 -47443 -10377 18280 128817 145910 -236642 -61125 -72141 -24306 136808 38964
6697 -250149 113301 -63402 273299 -247337 -72709 -17056 -17136 -71660 -55205 230060 55990
6685 65657 -51291 66409 -246438 167232 -215569 -159048 -154776 -147121 -102478 -47892 -148197
6674 -148197 51442 -40417 -33602 42327 164941 -161808 -283376 -3159 258033 136882 369780
6663 369780 -236816 113791 -102197 -104771 282220 16162 -219104 -83919 138483 281285
6653 281285 -54075 -195071 -380363 328748 -131969 195296 -264690 184992 379289 212535
6643 212535 24480 -205639 46095 -146623 -14427 233764 144401 -305440 -505 -8999 -38033
6632 -38033 -202252 -231957 -69681 -60421 49139 31521 -241446 85581 -79485 108004 -231576
6620 191195 36088 27735 -22751 36915 132040 -180164 8944 -33146 -6200 -43924 150335 -141432
6607 -134027 -171590 93076 -112511 -278426 -203078 73266 -53946 -44120 40759 357263 188027
6596 188027 -130419 41499 -219121 390138 -75929 156363 80462 -21178 107639 -1563 486749
6584 82006 104210 -182393 292778 -217625 -350925 43774 289718 -220776 18256 140855
6574 140855 -44627 30147 -44505 17071 -156982 -52116 14710 -233898 -296239 -248168 235519
6562 -72724 -3100 -85344 -210110 73104 -97295 -196157 -473286 55452 33801 -169681 -112453
6551 -112453 -181424 -68320 155476 -156827 -99428 113965 -70196 163674 -58755 144639 -22902
6539 98963 230935 -86859 165437 -123037 -177857 74861 15023 -17067 100586 -137893 497662
6527 66627 -63611 92512 -81128 274907 200649 15977 -205232 133356 210502 -23813 -15908
6516 -15908 -32168 -46554 -161341 -313110 -236701 138288 271427 141288 26299 -229504 -110110
6504 -212767 -213857 -156605 29394 -65485 231488 -38877 -74919 47916 236004 -108839 273559
6492 65596 15121 -105460 -382261 -50405 -95984 -178462 48033 30312 -142038 -88627 -197991
6481 -197991 427613 -235385 -158782 -289715 -49300 230749 -122552 -197890 -11562 -105950 -18398
6469 -145234 137938 -111302 77786 -34065 -298912 -504974 -201133 331366 224368 -116221
6458 -110661 -234800 -148421 212521 -46077 -219010 123003 8407 -5552 22700 -280027 -92413
6446 -51153 60738 143716 -63357 -198053 346109 -119980 -135896 18823 -19696 -155831 -17067
6434 97974 48470 -11409 -373286 -474706 -207324 29285 138594 -172821 -288237 62334 -172045
6422 -72483 14270 252394 -140720 265274 129193 -142001 -19404 386392 -287537 263626
6411 312770 -90569 -47937 126050 21522 -77647 14255 118751 -25127 -93601 111968 63373
6400 63373 -6888 -213820 145241 15559 -39824 87763 35049 -152451 248093 131034 5776
6388 17039 197492 -32258 79812 157498 128083 97688 6705 -229035 -348187 -171912 -134672
6377 -134672 -10739 -254380 -321330 -1492 -175439 165775 -132260 40822 -62011 35463 215159
6366 215159 16353 28120 115818 -184977 381381 5499 -193261 -47291 245392 -164238 81721
6354 21027 87799 -148154 71551 284219 173672 92933 -219997 -47883 91866 95454 -463232
6342 -128062 29901 191760 229543 234026 -370249 -302355 3035 107015 -183695 311113 87440
6330 25148 100574 -243143 181162 264304 -249668 33691 -273695 179172 -113117 -59929 68838
6318 -25495 -133829 190522 -233525 -409414 18448 296282 43919 190062 -17305 -151144
6308 -151144 252825 126229 21202 93724 192526 -14253 -157217 -10971 286369 96988 -256973
6296 -46801 -108172 149263 133412 -66031 -57388 238340 279961 262516 -80798 -3649 -76897 -152830
6284 -152830 -273787 -172486 -112191 169512 -96605 -69387 -67648 -133326 98812 43708 222469
6273 222469 191769 -56593 -120166 50223 -73877 -23123 -238972 -168766 -321795 -318603 178489
6261 316764 133764 -214894 -146786 -7008 -189123 127363 78585 72040 -93081 102610 60117
6250 60117 -28394 204438 -103957 141427 -188182 239183 -72575 -47205 17343 -19059 -6771
6238 181729 89038 -154757 -74154 32042 104294 116509 -138522 46995 -205608 16455 55817
6227 55817 -56908 -96777 260812 -203146 299609 -133761 104079 46571 -385879 4046 -277644
6215 -411675 45875 -199273 -160127 -153691 -107717 -5972 29133 -37099 -273169 31024 41041 -68235
6202 66351 78401 270918 76246 -54160 -92341 -163673 -391624 137242 32607 161729 45418
6190 76795 -351529 128694 62558 -55209 165606 -107665 77330 -154601 -58986 -80079 -71549
6179 -71549 160028 -109402 -204120 59243 -32765 250630 -201990 217382 156000 -152728 -263255
6168 -263255 277317 -189719 355050 224644 202121 85788 124621 -383068 257190 -101245
6157 209485 -69221 -178277 -56859 -145431 89878 -58642 334315 -204926 186491 -96584 -198334
6146 -198334 -63026 -345692 -95929 -32514 61353 -54484 113906 -89213 -61704 83039 -205039
6134 18875 -202354 84835 155317 -69997 -99575 -7079 -350563 -3302 251863 -22388 25838 -164856
6121 429573 -151236 216602 -102855 -199199 98665 91586 -344404 22125 73412 -309374 55822
6109 276212 135725 -42225 -144273 -96115 -14547 265724 -39747 -60227 -72203 2156 -186331
6097 -342005 90482 -186568 418457 262179 28220 -136770 -55070 107276 -116178 165749
6086 -85365 -70361 325518 -82879 220572 186683 182019 -157599 279958 -63599 23392 284499
6075 284499 43229 -120740 -16361 -204899 74476 -90448 6476 138523 159226 246432 99733
6063 16662 116252 117268 30690 -4611 188365 -180390 5300 -192649 -49155 -71695 -26970 -22414
6051 -22414 154671 15544 -303055 54961 19474 -68108 -235947 -334678 149054 144004 237454
6040 237454 -31336 -57457 140426 -21670 26505 840 -172755 -119464 -100186 2282 25780 439642
6028 439642 -190257 24616 256360 48487 -249333 -179040 88973 -148629 226140 -348692
6017 124841 -199705 316953 -107195 37973 39020 -228885 -112256 216375 38963 183248
6007 183248 180674 293160 5254 -13590 113907 -290726 -183343 40434 113338 -161060 213954
5995 88299 -158669 51562 185001 -368638 -48053 53444 -3468 -36485 -496113 -23197 24613
5983 322939 49530 -95813 69525 -54051 -183828 105905 105753 -80993 14694 47245 -212817
5971 51018 214542 111175 -515353 125538 11226 346582 -185555 -289131 25738 16978 66339
5960 66339 51324 -110701 5734 -111022 479621 155744 -58406 272283 39844 -20193 -147412
5949 -147412 -120346 166203 -94793 -67009 -60721 138249 177825 -315305 220408 208276 -28167
5937 -320504 47738 139274 42852 -238932 9200 47397 -12527 30120 453015 -121448 -411499
5926 -411499 23844 12905 -163970 -155898 -168028 -298159 -181318 -85083 -201745 -68146 -22860
5914 -159282 498164 -208185 73408 13041 66049 228240 -28309 -11123 213081 -276993 68812
5902 -284704 -193528 329535 205752 80325 25266 93265 -152882 -75493 -172117 107983 179804
5891 179804 -92353 -267383 -58469 -63891 -201722 -95960 -138080 -422504 6738 -52839 -218243
5880 -218243 -207471 -89085 31774 -121793 489247 -356430 -89684 -392386 197275 69230 -287269
5868 -142184 -168585 -50124 83387 182294 85110 -110804 35090 302020 48896 -94051 -47954
5857 -47954 311277 -141302 263336 -177957 214502 85058 -36156 -361276 -135398 78221
5846 259361 -50656 -244852 313211 134814 -367 -180358 -64383 -229744 80308 -115208 38386
5834 233644 282330 172203 -91716 -226163 9274 -48738 52812 60287 12502 294985 -229534
5822 -140144 88024 8638 -326576 104541 -79947 -128285 93472 -175195 -296757 -109671 109745
5810 154907 314914 22413 97980 -146179 199592 -305833 -253115 161372 -129371 47930
5799 28892 107124 10858 204366 42321 292359 -59764 -92387 37014 84987 -117870 -474 -30932
5787 -30932 65977 5651 -104317 59968 293660 -394196 -63424 160345 -93367 -116961 -239206
5776 -239206 101272 -110692 216168 -91834 58956 151514 -16923 180864 -43993 -179880 70945
5764 65367 -73317 175282 31968 73285 479026 -10832 363973 -54991 13868 339574 28761
5752 -127283 166444 -144974 -101950 102456 -126388 238957 -36477 -197465 -96235 66346
5741 -58299 -113196 307405 148822 -89429 279780 69520 177156 28194 -95917 -54919 -285389
5730 -285389 -246663 -6035 135565 -320234 -95349 -184620 148578 96929 108225 -152681 -115397
5719 -115397 78732 -122599 -5882 -143015 -4680 -193061 -272404 221965 38845 -158192 75138
5707 -1474 -165264 -31868 883 -188798 112466 119398 -93319 -148541 -420815 -198681 116917
5695 -252690 304902 90466 -87101 -41772 87676 127605 113013 -125883 -259035 45058 -141414
5683 -96938 92081 -198142 144837 -40244 -41266 195824 368457 -63788 62206 -94682 107487
5671 172373 -229066 4410 -243433 -14544 -12891 -84966 -375374 -5439 44392 -130183 127667
5659 80070 82398 -82531 91146 -21455 104201 37579 153006 -19353 87466 -87114 -364065
5648 -364065 -336933 -132510 34051 -127523 -170212 136840 101712 -60600 65590 -153066 -7463
5636 240497 -243483 116172 50244 -229606 -17828 -40363 -8134 113449 372904 -165326 -170148
5625 -170148 26735 -140751 -60271 74442 -52879 140063 142652 -49320 56081 -408419 205188
5613 194055 -60501 355957 -75731 -331197 -139377 337103 35105 116235 -61605 -309056 139810
5601 206210 259907 35478 4275 142664 144959 87798 -202631 160164 -473511 88003 -3851
5589 146266 99818 73514 -133331 9429 -75229 -360144 -265220 -413307 -98996 -185581 76900
5577 -540714 103657 11458 185603 -259753 108123 -42640 228350 -133833 245936 -271474
5566 -38006 -174966 185840 329255 -78530 -64688 150666 227736 -249526 -231651 -214908 285055
5554 125097 -273488 -171910 231649 213278 -305614 199563 19747 124419 -83812 332378
5543 58359 -42658 51955 439564 395090 250596 -31487 -81747 -188617 112959 293972 -39844
5531 44544 213049 -123814 -376740 34608 -84151 70210 85847 101657 23367 137262 498449
5520 498449 -147738 -28415 313026 -3223 -39235 -237792 63613 80881 98088 -38057 312143
5508 221710 -54310 98602 209792 326146 349118 -105512 -218878 -345638 324917 260598
5498 260598 110839 1765 35225 65740 167901 -240630 -6234 -240931 293512 13585 258253
5487 258253 -80905 204719 -125004 107998 -93907 -33625 31037 2455 -79844 -159644 138662
5475 4353 -266036 -20300 195003 -324174 -213852 -125659 -111337 -40260 1515 33589 248214
5464 248214 193373 -71448 83227 -116950 -178924 251169 140416 184617 -30827 -197148 515561
5452 56697 -150527 240653 -108055 -55617 30753 69110 -121837 -126666 -240009 101294 14255
5440 -186306 111376 -224896 -473182 95893 91574 123845 -79077 -91259 -335727 -187808 212848
5428 -20300 -250489 -161455 18307 219735 -52695 62577 -234360 248116 -62097 -81994 -251050
5417 -251050 192987 127838 -45515 -92700 -88679 -211181 12016 -217262 12623 190440 -67634
5405 -275238 -108912 48783 22704 228348 -134635 -116631 137469 253537 -132949 229914
5394 152947 26142 118183 -252133 -33851 128260 -330277 -22389 266071 -247381 130562
5383 78108 254791 316485 -459188 127850 -14894 -97307 -279522 -51316 176106 -135451 223332
5371 -54960 205047 247654 -60700 -121601 19874 71592 -147912 72210 -309057 -106334 202798
5359 -113651 -360036 176946 -21503 -33933 99880 -23989 129464 221706 -6298 135657 -333923
5347 288658 -37675 64018 342689 197244 43331 -283211 320602 -140594 -291373 112507
5336 35182 218876 -17115 -159867 359807 282723 -82469 41743 -920 -10768 -145389 -100091 3400
5323 -125439 182449 291683 171246 1671 26628 -115085 50697 46908 339183 -8393 -141333
5312 -141333 -50755 -23897 -57145 -15207 20142 -97047 -59459 22266 239906 -286404 470324
5300 219715 -279161 -6323 -63796 -109246 288426 -180059 -219413 -43943 -40202 44352 -148352
5288 -22217 -159559 -216702 175454 -252723 202928 -207930 329996 140661 9401 -265120
5277 43099 -219571 -73104 147114 232076 -167686 -42824 82682 -170648 -394161 590774 -438
5265 122527 -157646 -221785 49905 -42466 -298696 -64637 -254183 -47490 -96503 -1699 -126532
5254 -126532 -36103 -190055 3158 101537 171026 52104 -172249 -29644 -8100 -232537 316959
5242 -70913 130424 153573 28218 133773 -34902 239589 -85071 330076 -31501 -128491 -324026
5231 -324026 -130334 -75060 -515612 -128225 44192 295859 -50604 158775 123333 97165 152024
5220 152024 -46578 82609 220538 467864 -119179 117622 -460053 30748 159635 95563
5210 95563 -287497 104010 -167607 130840 62475 124523 -73634 42767 149403 179765 154010
5199 154010 -244146 -77671 -58152 272571 70461 -284469 40845 224926 -226371 187693
5188 25763 476594 29151 205215 59145 134957 -27955 -14098 -232741 -228101 -192690 135231
5176 -44238 -148973 194096 -112548 -248059 36808 25228 -191396 21763 -325572 -197592
5166 -197592 -972 174818 -279119 -66035 51931 -172795 -19478 -108250 127513 -176505 -71138
5154 66397 -237741 -236209 -143821 21607 74083 -40716 71906 170553 -109408 74362 -155217
5142 -167089 -261693 17537 32082 73077 -303410 200064 -181222 42350 196944 49186 168647
5131 168647 -339574 353776 14775 77432 242691 -192662 -60923 111723 24131 -184175
5120 -71486 -192214 -122232 -339134 184161 16869 -23735 -29887 -42062 345293 34072 -166611
5108 -112222 -121142 -216921 -19398 -134222 -154541 -143640 -46073 -50586 -26052 242277 -14297 60544
5095 99615 -65603 40088 147489 111258 191073 -45992 83542 194345 119578 58073 136866
5084 136866 27594 -39613 188655 211332 203482 179939 -177340 -111607 -84765 12306 -41155
5072 158238 33163 115702 35545 12744 112665 155807 89558 -18268 184494 -277621 137712
5060 -249096 275485 76133 -213508 131594 263996 -319595 -40878 197869 -480304 -666 188863
5048 -358118 307559 107581 -179006 190998 76750 -9796 175730 -140570 41487 257682
5038 257682 140881 63853 125640 -48671 -104878 202154 -35111 -66275 -26359 -61733 -204216
5027 -204216 -327640 104585 181611 171729 125302 -317447 292356 -104325 -45451 -255786 -219931
5016 -219931 -174498 -331972 -175964 100808 -151093 -325568 -123664 -44050 -63973 337454
5005 -39241 314214 -178063 19191 189615 -137242 90483 -140015 46493 -175598 51897 -18242
4993 394231 -7785 -2755 163297 -17499 68750 180443 -122103 313156 -65719 -59415 72976
4981 241318 -206692 4229 -58277 -66343 -74793 -22460 5939 7563 198966 -74001 -252358 -203756
4969 -203756 -108635 -167214 -256322 -18606 -53305 -242525 -1488 32896 82571 38298 -16396 41590
4956 -211923 126351 -140524 32146 111975 323928 -116577 -20036 -385767 75597 -139413
4945 -13492 168470 163222 -157954 -59579 -80844 209013 -10541 -15293 -295356 -266297 120515
4933 94357 -72699 50488 -198594 136886 359788 -232292 -233530 64584 163386 -124872 130470
4921 105892 -47574 182992 92037 -97245 45243 6371 322162 12747 220954 264249 122291
4909 -38839 -170036 18848 46148 20261 -156877 107325 21101 124123 -203655 -72289 135753
4897 -162098 18810 -54639 -242896 -24106 -73947 18457 -5986 -243264 234275 249007 55992
4885 -87490 -2390 70241 223789 -113795 144955 213710 -89939 30715 -73247 11653 -335584
4873 4296 102065 -92491 12899 -240941 132546 -266267 7471 -291630 144654 -76854 -48792
4862 -48792 -45290 268555 48709 100689 37334 401001 77445 117259 -262415 6036 -277204
4850 -29326 -127788 34137 -65388 421485 -167076 -204359 48154 19973 2097 -59490 11886 -374778
4837 192191 -221286 -360958 16328 -12085 -80287 135329 -93283 319830 -174092 158635
4826 -21883 439668 -27205 17295 -25047 130779 -111402 34453 228188 19421 -279118 174937
4814 -221103 27118 -214787 -291452 256480 -343856 -326071 210494 -121017 220039 77861
4803 88358 -20531 309314 -273759 -238845 136934 -35270 76175 50993 -139872 -182899 -146697
4792 -146697 -65943 -370152 -206590 -168524 10671 109203 95442 25582 59734 -121342 150278
4780 4895 -217985 199292 -132478 31853 225549 43254 -241305 -52634 247119 -130598 336330
4768 -136872 30181 -245802 42129 214962 -253654 140344 -264245 63438 240465 -175813
4757 19195 -26928 -196676 -53743 298176 209159 110211 -93046 149364 -199623 296137 -152696
4745 -206889 -164860 -225734 114788 64711 -134781 298169 81395 -161628 207009 -260187
4734 -84342 198963 -178428 374066 218433 266582 -8824 -113709 169892 -180266 53790 88388
4723 88388 63875 44160 104973 -10982 67433 230025 -63814 -413315 122193 -39052 71111
4711 35055 284698 -25964 37183 -152855 30529 263239 147534 226332 -2259 208770 -125567
4699 -89937 20963 35646 -166712 -127160 -97935 278583 -80387 -9268 36286 -34429 -229105
4688 -229105 221886 -94520 48420 46347 -31770 -67246 -16375 -220071 -78419 224181 -64058
4676 31152 -324005 -8184 24162 26829 -169883 -1518 -94255 81347 -34060 -6829 -62579 110586
4663 72271 108626 -4044 -145091 52001 108350 139827 7123 -91395 -9439 -162355 -204919 -34664
4650 222419 24808 132700 -26268 138431 355180 29495 77416 -188581 12001 -10631 -87926
4639 -87926 219983 130985 419119 284891 -226538 -114572 -245784 -332614 -10700 158166
4628 53305 24591 330619 -253738 329889 140728 -239606 -99168 93530 146318 -43821 -167567
4617 -167567 98017 -280237 20321 -56727 96301 250543 160208 191278 221966 78554 -32649
4605 188502 255267 -229101 -1632 -72499 23309 -149080 153624 -18995 -135787 -72746 -103958
4594 -103958 233068 -22867 16208 207420 -323498 299710 71606 -178328 -131435 -217603 -140230
4583 -140230 106920 -72688 18219 -124659 173187 -4987 65509 96881 -131131 -150851 -85360
4572 -85360 62493 -28372 354073 331625 -159445 -69931 -63043 20782 18891 -50880 -53736 -308938
4560 -308938 161044 -189663 124811 154507 445554 113971 -10847 -74160 12379 -194443
4549 -203740 71288 85094 -11636 -182260 -17958 -18978 71745 272168 -25774 -39993 90793
4537 172667 -137999 147960 -162928 105290 -215916 -332957 -302707 395291 165461 -59470
4526 183875 276584 97621 -55951 -251560 471364 252741 -241758 108798 113856 -32624 -46623
4515 -46623 109388 27704 -96317 -324880 98806 85538 207931 -186601 50109 -86737 -382136
$$ [...]
##END NTUPLES=NMR SPECTRUM
##END=
