##TITLE=AC1686_PANAM14367_8637597_SyNThsx66L
##JCAMPDX= 6.0         $$ Bruker NMR JCAMP-DX V2.0
##DATA TYPE= NMR SPECTRUM
##DATA CLASS= NTUPLES
##ORIGIN= BRUKER
##OWNER= Administrator
$$ 1.72 TOPSPIN		Version 2.1
$$ 2014-05-30 16:56:38.906 -0700  Administrator@X
$$ Compression mode = diff/dup
##.OBSERVE FREQUENCY= 400.02188249412
##.OBSERVE NUCLEUS= ^1H
##.ACQUISITION MODE= SIMULTANEOUS (DQD)
##.ACQUISITION SCHEME= undefined
##.AVERAGES= 8
##.DIGITISER RES= 22
##SPECTROMETER/DATA SYSTEM= spect
##.PULSE SEQUENCE= zg30
##.SOLVENT NAME= COFFEE_meoh
##.SHIFT REFERENCE= INTERNAL, COFFEE_meoh, 1, 14.98509
##AUDIT TRAIL= $$ (NUMBER, WHEN, WHO, WHERE, PROCESS, VERSION, WHAT)
$$ ##TITLE= Audit trail, TOPSPIN		Version 2.1
$$ ##JCAMPDX= 5.01
$$ ##ORIGIN= Bruker BioSpin GmbH
$$ ##OWNER= Administrator
$$ $$ E:\/data/COFFEE/nmr/AC1686_PANAM14367_8637597_SyNThsx66L/20/pdata/1/auditp.txt
$$ ##AUDIT TRAIL=  $$ (NUMBER, WHEN, WHO, WHERE, PROCESS, VERSION, WHAT)
(   1,<2014-05-30 16:56:32.094 -0700>,<Administrator>,<X>,<go>,<TOPSPIN 2.1>,
      <created by zg
	started at 2014-05-30 16:55:26.312 -0700,
	POWCHK enabled, PULCHK disabled,
       configuration hash MD5:
       C8 4E 4E 5D D3 5C D8 9E 9F 52 82 E0 59 8A DE 15
       data hash MD5: 64K
       13 28 06 35 D1 34 A1 65 3B 17 67 A9 65 25 3F DC>)
(   2,<2014-05-30 16:56:35.078 -0700>,<Administrator>,<X>,<proc1d>,<TOPSPIN 2.1>,
      <Start of raw data processing
       efp LB = 0 FT_mod = 6 PKNL = 1 PHC0 = 0 PHC1 = 0 SI = 32K 
       data hash MD5: 32K
       C4 8C 29 AD B0 91 70 F5 27 D2 FA F0 DE FC 46 AA>)
(   3,<2014-05-30 16:56:35.406 -0700>,<Administrator>,<X>,<proc1d>,<TOPSPIN 2.1>,
      <pk PHC0 = 92.96082 PHC1 = 0 
       data hash MD5: 32K
       D5 C4 E1 CD 36 8F 4D B7 2B 4A A5 25 ED 90 BB 9A>)
(   4,<2014-05-30 16:56:35.516 -0700>,<Administrator>,<X>,<proc1d>,<TOPSPIN 2.1>,
      <abs ABSG = 1 
       data hash MD5: 32K
       A9 51 54 23 8C CA 76 54 55 89 90 09 8A DC 5A 85>)
(   5,<2014-05-30 16:56:35.578 -0700>,<Administrator>,<X>,<proc1d>,<TOPSPIN 2.1>,
      <abs ABSG = 2 
       data hash MD5: 32K
       28 58 3E 80 70 E4 1A 86 25 8B 4E 38 25 7E 8C 63>)
(   6,<2014-05-30 16:56:35.641 -0700>,<Administrator>,<X>,<proc1d>,<TOPSPIN 2.1>,
      <abs ABSG = 3 
       data hash MD5: 32K
       3B 61 27 52 97 46 E6 DC AC 2A D2 4D 34 B1 6E E3>)
(   7,<2014-05-30 16:56:35.687 -0700>,<Administrator>,<X>,<proc1d>,<TOPSPIN 2.1>,
      <abs ABSG = 4 
       data hash MD5: 32K
       22 C8 12 98 5F D9 A7 20 37 49 FC 14 44 F2 AF 5E>)
(   8,<2014-05-30 16:56:35.750 -0700>,<Administrator>,<X>,<proc1d>,<TOPSPIN 2.1>,
      <abs ABSG = 5 
       data hash MD5: 32K
       7B EA 2F D9 05 90 2C 48 50 18 78 C8 EF E7 E2 52>)
$$ ##END=
$$ 
$$ $$ hash MD5
$$ $$ A9 7D 44 2D 32 DD FD C7 8B 91 BF CA A5 97 E2 CF
##$RELAX= 
##$RELAX= 
##$RELAX= 
##$RELAX= 
##$RELAX= 
##$RELAX= 
##$RELAX= 
$$ Bruker specific parameters
$$ --------------------------
##$DU= <E:\>
##$EXPNO= 20
##$NAME= <AC1686_PANAM14367_8637597_SyNThsx66L>
$$ [...]
150 150 150 150 150 150 150 150
##$TP07= 0
##$TPNAME0= <>
##$TPNAME1= <>
##$TPNAME2= <>
##$TPNAME3= <>
##$TPNAME4= <>
##$TPNAME5= <>
##$TPNAME6= <>
##$TPNAME7= <>
##$TPOAL= (0..7)
0.5 0.5 0.5 0.5 0.5 0.5 0.5 0.5
##$TPOFFS= (0..7)
0 0 0 0 0 0 0 0
##$TUNHIN= 0
##$TUNHOUT= 0
##$TUNXOUT= 0
##$USERA1= <user>
##$USERA2= <user>
##$USERA3= <user>
##$USERA4= <user>
##$USERA5= <user>
##$V9= 5
##$VALIST= <valist>
##$VCLIST= <CCCCCCCCCCCCCCC>
##$VD= 0
##$VDLIST= <DDDDDDDDDDDDDDD>
##$VPLIST= <PPPPPPPPPPPPPPP>
##$VTLIST= <TTTTTTTTTTTTTTT>
##$WBST= 2048
##$WBSW= 25
##$XGAIN= (0..3)
0 0 0 0
##$XL= 0
##$YL= 0
##$YMAX_a= 603789
##$YMIN_a= -512115
##$ZGOPTNS= <>
##$ZL1= 120
##$ZL2= 120
##$ZL3= 120
##$ZL4= 120
##$ABSF1= 14.98509
##$ABSF2= -5.573092
##$ABSG= 5
##$ABSL= 3
##$ALPHA= 0
##$AQORDER= 0
##$ASSFAC= 0
##$ASSFACI= 0
##$ASSFACX= 0
##$ASSWID= 0
##$AUNMP= <proc_prof1d_extract_pilot.lims>
##$AXLEFT= 0
##$AXNAME= <>
##$AXNUC= <1H>
##$AXRIGHT= 0
##$AXTYPE= 0
##$AXUNIT= <>
##$AZFE= 0.1
##$AZFW= 0.1
##$BCFW= 0
##$BC_mod= 0
##$BYTORDP= 0
##$COROFFS= 0
##$CY= 15
##$DATMOD= 1
##$DC= 0
##$DFILT= <>
##$DTYPP= 0
##$F1P= 0
##$F2P= 0
##$FCOR= 0.5
##$FTSIZE= 32768
##$FT_mod= 6
##$GAMMA= 0
##$GB= 0
##$INTBC= 1
##$INTSCL= 1
##$ISEN= 128
##$LB= 0
##$LEV0= 0
##$LPBIN= 0
##$MAXI= 10000
##$MC2= 0
##$MEAN= 0
##$ME_mod= 0
##$MI= 0
##$NCOEF= 0
##$NC_proc= -8
##$NLEV= 6
##$NOISF1= 0
##$NOISF2= 0
##$NSP= 0
##$NTH_PI= 0
##$NZP= 0
##$OFFSET= 14.98509
##$PC= 1
##$PHC0= 92.96082
##$PHC1= 0
##$PH_mod= 1
##$PKNL= yes
##$PPARMOD= 0
##$PPDIAG= 0
##$PPIPTYP= 0
##$PPMPNUM= 2147483647
##$PPRESOL= 1
##$PSCAL= 4
##$PSIGN= 0
##$PYNMP= <proc.py>
##$REVERSE= no
##$SF= 400.02
##$SI= 32768
##$SIGF1= 0
##$SIGF2= 0
##$SINO= 400
##$SIOLD= 32768
##$SPECTYP= <>
##$SREGLST= <1H.CDCl3>
##$SSB= 0
##$STSI= 32768
##$STSR= 0
##$SW_p= 8223.68421052631
##$SYMM= 0
##$S_DEV= 0
##$TDeff= 65536
##$TDoff= 0
##$TI= <>
##$TILT= no
##$TM1= 0
##$TM2= 0
##$TOPLEV= 0
##$USERP1= <user>
##$USERP2= <user>
##$USERP3= <user>
##$USERP4= <user>
##$USERP5= <user>
##$WDW= 1
##$XDIM= 32768
##$YMAX_p= 439550738
##$YMIN_p= -737677
##$CURPLOT= <Network HP LaserJet P1505>
##$CURPRIN= <$Network HP LaserJet P1505>
##$DFORMAT= <normdp>
##$LAYOUT= <+/1D_H.xwp>
##$LFORMAT= <normlp>
##$PFORMAT= <normpl>
##$SURQMSG= 1
$$ End of Bruker specific parameters
$$ ---------------------------------
##NTUPLES= NMR SPECTRUM
##VAR_NAME=  FREQUENCY,     SPECTRUM/REAL,   SPECTRUM/IMAG
##SYMBOL=    X,             R,               I
##VAR_TYPE=  INDEPENDENT,   DEPENDENT,       DEPENDENT
##VAR_FORM=  AFFN,          ASDF,            ASDF
##VAR_DIM=   32768,         32768,           32768
##UNITS=     HZ,            ARBITRARY UNITS, ARBITRARY UNITS
##FACTOR=    0.250966925370066, 1,           1
##FIRST=     8223.43324360094, -145391,      43944
##LAST=      0,             -161202,         -330812
##MIN=       0,             -737677,         0
##MAX=       8223.43324360094, 439550738,    0
$$ Real data points
##PAGE= N=1
##DATA TABLE= (X++(R..R)), XYDATA
$$ [...]
19557a98126j42672C6197b03286B07649A0420P9651a76350K2970j18148a26808
19546G3757a59553A45727i8666k31541a2287A13304J60198l2530C2196L2377b11214
19534a26119p3001O1006f4914E2593A3988Q3516N5313d51901c7552H7537l1253
19523E6284c18114b4116B67615G9219B9693b26688A90219F0372k7579b7451r470
19512c6921j04023F7976J40335g6868p5769b7530B01221c4004K206j62971j05897
19501c00666A0679b46853a23176q8344N9184m5674f2109k86737H1040A3933d35352
19489B16492a85721b2903j10556j8772K5796j7412A38945D6881J67338p9193h309
19477b62905J14344J4592o3682L2952J723L7406k46221A03297m5910P6836P5119
$$ y = [-198126, -340798, 36197, -203286, 207649, 10420, 90071, -176350, -153380, -271528, -126808, 73757, -159553, 145727, -98666, -330207, -12287, 113304, 273502, 240972, 32196, 64573, -211214, -126119, -199120, -138114, -64914, 52593, 13988, 97504, 152817, -451901, -37552, 87537, 56284, -318114, -24116, 267615, 79219, 29693, -226688, 190219, 60372, 32793, -27451, -36921, -140944, 67976, 208311, -76868, -152637, -27530, 201221, -34004, -31798, -194769, -300666, 10679, -246853, -123176, -211520, -152336, -198010, -62109, -348846, 81040, 13933, -435352, 216492, -185721, -22903, -133459, -152231, -126435, -143847, 138945, 46881, 214219, 135026, -8309, -262905, -148561, -133969, -197651, -164699, -162976, -125570, -371791, 103297, 57387, 134223, 209342]
19466B09342i7936A83027b1947k64531I745a1868E3699b20162C25508a11805J7308
19455i4497d2160n4261M1375k51186G1047J9307g2357p2645o878o7357O7893c1571
19442D3412a98065b527j13581k5584O6857j73828N4631A31559b26731G8434d9136
19430G580b9042a527A62275a36454d3818j31115C9143a58140N3243q2427H7960
19418a89937q0486h6810H9427c00577J24661M0783F3088h4634B3026J056K56195
19407B80277E680a48188c2760k9759l62691a22712L9610m3850A0302b37359B3297
19395e2681A32359B3112K0587a75150O9960K0597L2322B36123c40791A12171a96014
19383e9562F6440b5957j03860J2919p6603p7556G0924a36262b0117A21953B166
$$ y = [209342, -97936, 183027, -21947, -286478, 9745, -11868, 53699, -220162, 325508, -111805, -94497, -42160, -96421, -55046, -306232, 71047, 90354, -72357, -145002, -151880, -219237, -151344, -31571, 43412, -198065, -2527, -116108, -141692, -74835, -248663, -194032, 131559, -226731, 78434, -49136, 7580, -29042, -1527, 162275, -136454, -43818, -174933, 39143, -158140, -104897, -187324, 87960, -189937, -270423, -86810, 89427, -300577, -175916, -135133, 63088, -84634, 23026, 24082, 280277, 5680, -148188, -32760, -62519, -425210, -122712, -83102, -126952, 10302, -237359, 23297, -52681, 132359, 23112, 43699, -175150, -105190, -84593, -52271, 236123, -340791, 112171, -196014, -59562, 66440, -25957, -129817, -116898, -193501, -271057, 70924, -136262, -20117, 121953, 2166]
19371A84136b1516j80136E8561a99183F1277a52009B8218b83108A85055a56139
19360A08228J47375c0364j60511q991A59320B7119K9255b42851A19781j0492J42633
19349B51922A5468J0353a64270g6874C2059K61775b34129A14320g8439L8590G7206
19337a86056h3814A36144D9165b0764k57822a28403J9430o1889M2059A44838J93940
19326C38778i3515L5622A6106g8789j81422j35192A95367a84739A53666h5464
19315A02991c8248a8721A96914i0588M2400G8924a39091o8201e1312A42813a83439
19303D18652b2551A2384d0777l81166A72982a26391A45920d4653n0183F6622c63931
19291c33007a25970n2962O9942j11881F4222b50435g7491G600a74103p722N2871
$$ y = [184136, -21516, -201652, 58561, -199183, 61277, -152009, 28218, -283108, 185055, -156139, 108228, 255603, -30364, -190875, -199866, 159320, 27119, 56374, -242851, 119781, 109289, 251922, 15468, 25821, -164270, -76874, 32059, 293834, -234129, 114320, -78439, -39849, 77206, -186056, -83814, 136144, 49165, -20764, -278586, -128403, -108973, -170862, -128803, 144838, 338778, -93515, -57893, 16106, -78789, -260211, -395403, 195367, -184739, 153666, -85464, 102991, -38248, -18721, 196914, -90588, -48188, 78924, -139091, -207292, -51312, 142813, -183439, 418652, -22551, 12384, -40777, -421943, 172982, -126391, 145920, -44653, -94836, 66622, -363931, -333007, -125970, -178932, -108990, -220871, 64222, -250435, -77491, 7600, -174103, -181825, -128954]
19280a28954k31413d2597a5447A24752a53721A73579a10583j07685R1713A87220
19269b79212L5492d4774I4190C3273Q6064A8a63658n2917C2054d13297A04083
19257B00267a56739N4316a9826j49615j47877B6008b0515A97142E7250a50253
19246b9382k05331m4466I6920k5312b9686q4335p7598E1301A0631c86259A99911
19234a96472b6983A36174b80550P5316i3315j27872P2042q3339M4275O2411j16362
19223b42160d4954C571J07053Q6884C0236c70116a35171k93688i7983j16405c2547
19211F1727i0972o1920k78026h5692j95186K5018C7625L7806d3631F4203R7408
19200A61611C6906b70277d6479m1438M00i395B44846a52797E0055c9454j78389
$$ y = [-128954, -360367, -42597, -15447, 124752, -153721, 173579, -110583, -218268, -126555, 187220, -279212, -243720, -44774, 94190, 33273, 119337, 18, -163658, -216575, 32054, -413297, 104083, 200267, -156739, -102423, -19826, -169441, -317318, 26008, -20515, 197142, 57250, -150253, -29382, -234713, -279179, 96920, 71608, -29686, -114021, -191619, 51301, 10631, -386259, 199911, -196472, -26983, 136174, -280550, -205234, -93315, -221187, -149145, -232484, -188209, -125798, -242160, -44954, 3571, 110624, 197508, 30236, -370116, -135171, -428859, -97983, -214388, -32547, 61727, -90972, -152892, -430918, -85692, -280878, -255860, 37625, 75431, -43631, 64203, 161611, 36906, -270277, -46479, -87917, -87517, -9395, 244846, -152797, 50055, -39454, -217843]
19189b17843B937N7290k2209L5362b9407l3816A5205b22855f9273B7922J33199
19178A61121D2777i8203j89497C51139i9024B6226b1026B05644e0974F6294b32716
19166A77690f11113a60862k4926B13102a66984A19574c52238g5935A08213b71085
19155E2528b0942A4519i7134h840k22384A46101b52201H7038a564p834k55479
19144b64877m5118Q7669E8150a9708k57174A82120N6914l4127b892j80395j8707
19133b01994Q8144l0350N3657L5627m9933E8391b39594i3608l0989E4519e06395
19121b21193r5989f2476G3373K25505A7208d8003A7012J95064a80724j30977f7764
19109b17398M2450j23760h3015p7526B69392b96304c7482f615j649j32593E4298
$$ y = [-217843, 2937, 60227, 38018, 73380, -29407, -63223, 15205, -222855, -69273, 27922, 161121, 42777, -98203, -287700, 351139, -99024, 26226, -21026, 205644, -50974, 66294, -232716, 177690, -611113, -160862, -185788, 213102, -166984, 119574, -352238, -75935, 108213, -271085, 52528, -20942, 14519, -97134, -8840, -231224, 146101, -252201, 87038, -1564, -9398, -264877, -309995, -222326, 58150, -19708, -276882, 182120, 239034, 204907, -2892, -183287, -201994, -113850, -144200, -90543, -54916, -104849, 58391, -239594, -93608, -124597, 54519, -506395, -221193, -317182, -62476, 73373, 298878, 17208, -48003, 17012, 212076, -180724, -311701, -67764, -217398, -174948, -298708, -83015, -160541, 269392, -296304, -37482, -6615, -8264, -140857, 54298]
19097A21000a52067n9689F9525I910K3633N297b53931Q2436L7515K9350A06668
19085C60602c1593D4319M7103a23939G203K76673M787H5132a13405a1057k75657
19074b86714A15053n3806i0050A42278E7649f2455K5724j71261G9277b90109a4928
19062B34658b43470B6065b09460J04298j50331A3787K37267b6771j48886a8864
19051a46187P2833A52947b139B57132n6863a05876b2106F0987a75978k2228j7150
19040b15356d9120C1044a62080I0701C6027O0906d7787E2017a56595B57008j0783
19029B46225J10315j16601G8861K04414a31761B65689c93004E0788J64058e5838
19018A66345F5021i6297H7011C7393J09815a0963j63753B53545a76502M0977N8137
$$ y = [121000, -152067, -211756, 69525, 9910, 33543, 38840, -253931, -171495, -133980, -104630, 106668, 360602, -31593, 44319, 91422, -123939, 7203, 283876, 288663, 85132, -113405, -11057, -286714, 115053, 61247, -90050, 142278, 57649, -62455, -36731, -207992, 79277, -290109, -14928, 234658, -243470, 26065, -209460, -105162, -255493, 13787, 251054, -26771, -175657, -18864, -146187, -73354, 152947, -2139, 257132, 200269, -105876, -22106, 60987, -175978, -198206, -215356, -49120, 31044, -162080, 90701, 36027, 96933, -47787, 52017, -156595, 257008, 246225, 356540, 239939, 78861, 283275, -131761, 265689, -393004, 50788, 214846, -55838, 166345, 65021, -96297, 87011, 37393, 147208, -10963, -174716, 253545, -176502, -135525, -77388]
19007g7388j54871J09895B65680A22114E337a16429j3034M5468I5173a78764A56337
18995a1640k8906j46842f1711m6113m1537j44444B49692d20526J81311F6946d9397
18983a47820A09634N1267b8008k00183h1690b6918l50098D7436L20860b55206
18972F3660a71851B71575A1355b5881A13929b01303h2858L3236i949j49278P4865
18961h4362K0521l47283A01627J24647j04008a139B03203p7447m1781b52528N9393
18950a93135o0801l96385B83446E2296b24592D7478c48647a0039l0943k75324
18940c16306H6506K19875o4969f3035k14353i3587b4060A42856L8910f5119A66439
18928c062I3085E976b16667D5116A4049a32017A40185a41829B5154c87374A61023
$$ y = [-77388, -232259, -122364, 265680, 122114, 5337, -116429, -129463, -83995, 95173, -178764, 156337, -11640, -40546, -187388, -61711, -107824, -149361, -293805, 249692, -420526, -239215, 66946, -49397, -147820, 109634, 160901, -28008, -228191, -81690, -26918, -377016, 47436, 368296, -255206, 63660, -171851, 271575, 11355, -25881, 113929, -201303, -82858, -49622, -9949, -159227, -84362, -63841, -411124, 101627, 226274, 122266, -1139, 203203, 125756, 83975, -252528, -193135, -253936, -650321, 283446, 52296, -224592, 47478, -348647, -10039, -40982, -316306, 86506, 306381, 241412, -63035, -277388, -93587, -24060, 142856, 181766, -65119, 166439, -3062, 93085, 5976, -216667, 45116, 14049, -132017, 140185, -141829, 25154, -387374, 161023]
18916B0847L58863d19993a78126J8861O571A09281a53059p014N7156A45146m8443
18905I6703N642m6327c4015p6741a3698j93526p7201a15376A93449b95392a47322
18893h054A27389b60009a29259M766B7400b49612N5835A96820f4512C99140a47523
18881B07639a9631I150K12089b39970B4931e6504l6560A86983a92992d7281l7397
18870h4678j41980b7759j80807C01852A04434D6548a08269A74212d6688f375H4846
18858a20424B25172B0092a99424n6572C06237d31764A83638K0861i0382A78461
18847B30004E6158O0729a73230A0618J98320J44815c11045A25832b41467D5605
18836a66977l0153d8657A33829g0964l2945k04176C2501K08707H0555k3787o805
$$ y = [20847, 379710, -419993, -178126, -159265, -152694, 109281, -153059, -160073, -102917, 145146, 96703, 102345, 56018, -34015, -110756, -13698, -207224, -284425, -115376, 193449, -295392, -147322, -8054, 127389, -260009, -129259, -124493, 27400, -249612, -193777, 196820, -64512, 399140, -147523, 207639, -19631, 9150, 221239, -239970, 24931, -56504, -93064, 186983, -192992, -47281, -84678, -226658, -27759, -208566, 301852, 104434, 46548, -108269, 174212, -46688, -6375, 84846, -120424, 225172, 20092, -199424, -255996, 306237, -431764, 183638, 204499, -90382, 178461, 230004, 56158, 116887, -173230, 10618, 208938, 353753, -311045, 125832, -241467, 45605, -166977, -197130, -48657, 133829, -70964, -103909, -308085, 32501, 241208, 80555, 56768, 49963]
18825D9963J74222b37792A63539l6994a9952A70635i6069j1133F6356j1991Q1993
18814A36358j1197b11153A75948h3007B25662c02792A28791a91649P2106k4399
18804a43942F0670B2902K43039i8701a8076j65484D0462h4808n6581J0259n0083
18793a81213p7269b7213j81345E0420a36231p9139j40254J70513k04807d269A20952
18781B59593f2941k30618A16753d73261B56423g2970j1386j21645i3508A48922
18770a52832o126A076c41500A04924k3209g6802j61841d887q4527b7223A95329
18758D7128j0353c9030I9231e90883A02672a17455J6532q3796B16912b42964M3030
18747a99934A87508E5573B351a74655j11232P6001h6341d0074Q807k4546m606
$$ y = [49963, 224185, -237792, 163539, 126545, -19952, 170635, -96069, -107202, 66356, 54365, 136358, 125161, -211153, 175948, -83007, 225662, -302792, 128791, -191649, -119543, -143942, 60670, 22902, 265941, -98701, -18076, -183560, 40462, -84808, -141389, -131130, -181213, -258482, -27213, -208558, 50420, -136231, -215370, -355624, -185111, -389918, -4269, 120952, 259593, -62941, -293559, 116753, -473261, 256423, -72970, -84356, -206001, -93508, 148922, -152832, -158958, 1076, -341500, 104924, 81715, -76802, -238643, -4887, -89414, -27223, 195329, 47128, 36775, -39030, 99231, -590883, 102672, -117455, -100923, -184719, 216912, -242964, -199934, 187508, 55573, 2351, -174655, -285887, -209886, -86341, -40074, -31267, -55813, -60419]
18736f0419C4364J3704a17857l6652B40251b0772o1876D01562G522a50351n6439
18725b06790A31543a10403j39356J00173c6591l1337q0477g3402G6594g6635C4438
18713a13373k43621e9871o9756C99246c99269a43008E8153J8843d8224j09892
18703a58116b3283k94260g1227o5374I4687a05023p1903E8817b7650j51141d071
18691e4759j8393j83706l1244A41912D8749b82446B25406b3388r4647L1096q5023
18680a71962j73573B2083c82814a75824I2411b33296M1785h9375k62916a31427
18669f3870f122k11697a6292k94117L4424F1735C895i1970c1244q945j36745E1147
18656B57846F640e1136a4437G5609B4123c17227J27624C6304a84862e3842C34739
$$ y = [-60419, 34364, 48068, -117857, -154509, 240251, -20772, -82648, 401562, 7522, -150351, -206790, 131543, -110403, -249759, -149586, -36591, -67928, -148405, -73402, 76594, -76635, 34438, -113373, -356994, -59871, -129627, 399246, -399269, -143008, 58153, 76996, -48224, -158116, -23283, -317543, -71227, -136601, 94687, -105023, -176926, 58817, -27650, -178791, -4071, -54759, -73152, -256858, -288102, 141912, 48749, -282446, 225406, -23388, -118035, -86939, -171962, -345535, 22083, -382814, -175824, 92411, -233296, -191511, -89375, -352291, -131427, -63870, -6122, -217819, -16292, -310409, -275985, 61735, 3895, -91970, -31244, -40189, -176934, 51147, 257846, 6640, -51136, -14437, 75609, 24123, -317227, -189603, 36304, -184862, -53842, 334739]
18644A14453g0355j66729J18227l4064B02605J42351j15021h5343a9786I9444
18633A35779c8537j38241a9910k58952C77579c06616c9717l55523g6044D1419
18622h6596p4185J8553J7572N822N5457F4697L5649a27077C95402E4562b32281
18610B59791j28319J0511b44519J08189j3957O0471A8618J7651b97574C01680
18599A78168B1917J7710q15A6304N0557a17424a9101E9769c04115A03172i3080
18587a9641j17266c3391j15263L1908p8895K4123e5939j9406m3147B6276D55K59736
18575B60191b27229b9504n3843A49467A7719b25261q0681a19965J6663d8708d75
18563A08538N223c2203A29482e5344l5904B5991g5800H1977a56194r9997e8850
$$ y = [114453, -70355, -237084, -118857, -152921, 202605, 344956, 229935, -85343, -19786, 99444, 135779, -38537, -176778, -19910, -278862, 377579, -306616, -39717, -395240, -76044, 41419, -86596, -160781, -142228, -124656, -118834, -63377, 64697, 100346, -127077, 395402, 54562, -232281, 259791, 131472, 141983, -244519, -136330, -150287, -89816, 18618, 36269, -297574, 301680, 178168, 21917, 39627, 38812, 16304, 66861, -117424, -19101, 59769, -304115, 103172, -93080, -19641, -136907, -33391, -148654, -116746, -195641, -171518, -55939, -75345, -118492, 26276, 455, 260191, -227229, -29504, -83347, 149467, 17719, -225261, -305942, -119965, -103302, -48708, -475, 108538, 113761, -32203, 129482, -55344, -91248, 25991, -75800, 81977, -156194, -256191, -58850]
18551d42590C36705A19066a5064j54211Q2201J6784r7083K1253A1887d1834P836
18540c3998k18084n8922i9450o843k7025f347k45552E2128a61797B080d22827
18528I3824J81878c02726R6399A27077g8354A32810F0824a48364d6554H643a87618
18516h2058I8802j3753K53608g9380b0974B51308a53806G1521a53294J4965J5343
18505a22986k73885J20209J27744A65611c6842j25637P9030j41968N1281f0703
18494a27138H3235a70041B81691b85399J16977f0401n1792q9746N5238a0239j76829
18483a87068H5850K30J91622a20221m5559r9126B7738J31049a22090b4615p1293
18472i5908A01663a58675A69405F5515O2382f4828j42840O9522M1447n0947D18711
$$ y = [-442590, 336705, 119066, -15064, -169275, -87074, -70290, -167373, -146120, 11887, -41834, -33998, -252082, -311004, -99450, -106293, -133318, -6347, -251899, 52128, -161797, 2080, -422827, 93824, 275702, -302726, -206327, 127077, -78354, 132810, 60824, -148364, -46554, 8643, -187618, -82058, 98802, 85049, 338657, -79380, -20974, 251308, -153806, 71521, -153294, -138329, -122986, -396871, -276662, -148918, 165611, -36842, -162479, -83449, -225417, -174136, -60703, -127138, 83235, -170041, 281691, -285399, -168422, -60401, -112193, -201939, -146701, -10239, -187068, 85850, 86080, 277702, -120221, -165780, -264906, 27738, 158787, -122090, -24615, -95908, 101663, -158675, 169405, 65515, 127897, -64828, -207668, -138146, -96699, -147646, 418711]
18460b33964B59815A7884J18590E2999K9499k2636a80892b3428A87358B6887M421
18449C1308m960c4061A10401a5374p0216D2360L3128i0942p6433G7847a94748
18437a3779o8123A51916c53104H6928b49683N517J997J05082L9521r2082b8666
18425B60991A05932a4032B59522p8184a39949j24800g5218A071a85942B40109
18414A60281a37505k0900f0960F0940a89147A52853J20869g3861B77131e6199
18403B1648L5973f868k13576I0725a70924O8721B34268c08783J10852M8919A59239
18391B3986g4488K1741A02337b33793a09311m5760A98977q3272a40066h125B55652
18379A361M135a91480j86440K9758c9377e998A85558E4672a21369k21713J09767
$$ y = [-233964, 259815, 17884, 136474, 52999, 82498, 59862, -180892, -23428, 187358, 26887, 31308, 26348, -34061, 110401, -15374, -85590, 42360, 75488, -90942, -167375, 77847, -194748, -13779, -81902, 151916, -353104, 86928, -249683, -244166, -242169, -137087, -97566, -189648, -28666, 260991, 105932, -14032, 259522, 181338, -139949, -264749, -75218, 1071, -185942, 240109, 160281, -137505, -158405, -60960, 60940, -189147, 152853, 273722, -73861, 277131, -56199, 21648, 57621, -6868, -220444, 90725, -170924, -102203, 234268, -308783, -197931, -149012, 159239, 23986, -74488, -52747, 102337, -233793, -109311, -155071, 198977, 115705, -140066, -8125, 255652, 1361, 5496, -191480, -377920, -348162, -39377, -5998, 185558, 54672, -121369, -343082, -233315]
18368b33315b1460B9436b21009f7109A18251d45915a21938C6211K77772A3706
18357a01579C31506c99764a17956b9595j17184O6986j5927A48223h412l48374
18347c56786L6431a45079C08362b38705R790L1045R8566A21435b99014H7327N9211
18336A46538a04702E6822b29488C9331a42560a9231j90644E1735R051b45302I1882
18324f0751B56936a3018p9932o5280g0678H3137N4703f7553D4112J43436E0675
18312a4949A63310g96k44981I1100C2718b05761d1808j40585o5474K9193H8694
18300b38134C1589e0313E8780K79773B7727a42211l1629B46930r5396a3949H2975
18288f093B70117k7423G2924e1568A06428a91675A07050h714k67455H6790j8595
$$ y = [-233315, -21460, 29436, -221009, -67109, 118251, -445915, -121938, 36211, 313983, 13706, -101579, 331506, -399764, -117956, -29595, -146779, -79793, -95720, 148223, -8412, -356786, -320355, -145079, 308362, -238705, -228915, -197870, -99304, 121435, -299014, 87327, 146538, -104702, 56822, -229488, 39331, -142560, -19231, -209875, 51735, 60786, -245302, 91882, -60751, 256936, -13018, -92950, -158230, -70678, 83137, 137840, -67553, 44112, 187548, 50675, -14949, 163310, -796, -245777, 91100, 32718, -205761, -41808, -182393, -247867, -218674, 88694, -238134, 31589, -50313, 58780, 338553, 27727, -142211, -173840, 246930, 151534, -13949, 82975, -6093, 270117, 242694, 72924, -51568, 106428, -191675, 107050, -8714, -276169, 86790, 68195]
18277F8195P0594O5376a60285f2701I5433k4172b44022o2325C679J5368b22401
18265A10026b20218M3915e0327A7460a19550A19129m454E2869c81271a520j62849
18254a64369Q0878p7626j31980N0338d6280J2357A68397K9521l2021a4465j28519
18243a42984H5641P3939n3705a22919e4847G2734f8620H5399b94573A69473A4701
18231a66829A11564M2389e3967a3464j39546B93901f3663l51163P1729A31556
18220e0424j81869J5901M6322r7430h1956K7902B09427e2650l9345o4736m4092
18209b00823h3011A46862c13362K9447Q7511j26648i9536e826j78603A44498e5569
18197a82465B65855f7143K5991A01235J02571a50440F7451J66562o251a23396
$$ y = [68195, 138789, 204165, -160285, -62701, 95433, 71261, -244022, -306347, 3679, 19047, -222401, 110026, -220218, -176303, -50327, 17460, -119550, 119129, 114675, 52869, -381271, -1520, -164369, -83491, -161117, -293097, -242759, -46280, -33923, 168397, 197918, 165897, -14465, -142984, 85641, 159580, 105875, -122919, -54847, 72734, -68620, 85399, -294573, 169473, 14701, -166829, 111564, 153953, -53967, -13464, -153010, 293901, -63663, -414826, -343097, 131556, -50424, -232293, -216392, -170070, -267500, -81956, -54054, 209427, -52650, -91995, -156731, -200823, -83011, 146862, -313362, -283915, -196404, -323052, -99536, -5826, -184429, 144498, -55569, -182465, 265855, -67143, -41152, 101235, 203806, -150440, 67451, 234013, 227762, -123396]
18186A270J09577a27248k15986B63051e2971p2767b6731D2954b03300G3884f1162
18174i2643c1260R814d094j21152A71672f9458I5264a3032A85663i8656j70489
18163b69145G7754h9067j29637j09078f0880e513n1732E0290K85459e459O98A71843
18150c3232q697I0639K79625h4428l3683D2504J00746e14744A40741a53823A77199
18138a96036k7631C2521a80616d1050A6923c02782j37921H782h6950E4670b39374
18126a99050j67585a76530L6661q2282P0601k2277A19729c67490a08162q9574
18116a97736O5413j05705B42772a06066j6339E3665l655B3581i5805B9812a14921
18104F1986a35392A15715A724a82790R116A06003J34682I2709K38545f959k71066
$$ y = [1270, 110847, -127248, -343234, 263051, -52971, -125738, -26731, 42954, -203300, 73884, -61162, -92643, -31260, -21446, -4094, -125246, 171672, -69458, 95264, -13032, 185663, -98656, -269145, 77754, -89067, -218704, -327782, -60880, -5513, -57245, 50290, 335749, -5459, -4761, 171843, -33232, -41929, 90639, 370264, -84428, -118111, 42504, 143250, -514744, 140741, -153823, 177199, -196036, -223667, 32521, -180616, -41050, 16923, -302782, -440703, 8782, -86950, 54670, -239374, -199050, -366635, -176530, -139869, -222151, -151550, -173827, 119729, -367490, -108162, -197736, -132323, -238028, 242772, -106066, -122405, 53665, 50010, 23581, -95805, 29812, -114921, 61986, -135392, 115715, 1724, -182790, -173674, 106003, 240685, 92709, 331254, -6959, -278025]
18093b78025A79692a2971j3692D6093B2314K22725j16867O1373q8984d7778k24314
18082b72092A05583f2783k62375J40605A30320O8891a73671A02638n1181a28997
18071a10187A55627n5731c9385A39038Q6398a21127r7980A88695E2163b95979
18060a27986F0444e3471j32693A4567b53816a2607j70417o5522A95459D3687c7281
18048a75681g6576c1274l8025C26883J10078j59551A28750e4970G1049a66415
18037b58137i1099j83581k8692c2525J1761B25004h5467m7862j39931A27830o2913
18026F4917a38800e6800m1758a0121A38685D3310b40503H9704c32741B58559D945
18014b8467H7621c371A84079f9269L0684k76153j15321C1777a6145o9389A19061
$$ y = [-278025, 179692, -12971, -26663, 46093, 22314, 245039, 128172, 189545, 100561, -47778, -272092, 105583, -62783, -325158, -184553, 130320, 199211, -173671, 102638, 51457, -128997, -110187, 155627, 99896, -39385, 139038, 225436, -121127, -219107, 188695, 52163, -295979, -127986, 60444, -53471, -186164, 14567, -253816, -12607, -183024, -248546, 195459, 43687, -37281, -175681, -76576, -31274, -69299, 326883, 436961, 277410, 128750, -54970, 71049, -166415, -258137, -91099, -274680, -303372, -32525, -20764, 225004, -85467, -133329, -273260, 127830, 64917, -138800, -56800, -98558, -10121, 138685, 43310, -240503, 89704, -332741, 258559, 4945, -28467, 87621, -3371, 184079, -69269, -38585, -314738, -430059, 31777, -16145, -85534, 119061]
18002A50851K77447a52515B87206C2997h9423j56298a0567j80681R5365G161J62107
17991A69268f2186n9314A28883c5952j7246H5587g2096n4609G5054B7408K78532
17980C05940a17320A14307l4545L921a0787B31020c18915i5121A03847a61053
17969a33734A00692M90Q8477N2100e8398k83494C30239g8918C8572b1596j42884
17958a64480A53612J053b45608q5283A7598g2035k3314A88564a56918f331l7774
17947d4105a8166A47462a02411a4744l9759E6148b11325K1175j22177B16617c73475
17935B42191b87589B05914q7982a40303D0870a70319A34634B6533M0779a46034
17924a5208j94189o1099B89534i3700M1999A72267R8585e24188B53272E4939N1148
$$ y = [150851, 428298, -152515, 287206, 32997, -89423, -245721, -10567, -191248, -95883, 7161, 169268, -62186, -121500, 128883, -35952, -53198, 85587, -72096, -126705, 75054, 27408, 305940, -117320, 114307, 79762, 83683, -10787, 231020, -318915, -95121, 103847, -161053, -133734, 100692, 101182, 189659, 241759, -58398, -341892, 330239, -78918, 38572, -21596, -164480, 153612, 154665, -245608, -330891, 17598, -72035, -95349, 188564, -156918, -6331, -44105, -18166, 147462, -102411, -14744, -54503, 56148, -211325, -190150, -312327, 216617, -373475, 242191, -287589, 205914, 117932, -140303, 40870, -170319, 134634, 26533, 67312, -146034, -15208, -209397, -270496, 289534, -93700, -51701, 172267, 270852, -524188, 253272, 54939, 106087]
17913A06087h7837I9468l4554Q2302c3235j31758F3593N883J20316B5080b31483
17901A98687o3300K3923d4989b2492O751P415l02261E1349K90137G4640O0997
17890A35637R9190A16461A6448J59152b05063D79094a65451A39099J0977c3865
17879B05789a03692j56780f978n259j08838K0376j02025D2842J23706D5377c8834
17867G9713M56001B29027r0453a55607N7876A44250a44757A3220Q328J52376b75842
17855G0519K3943M7121o5309C6605K578J16369b08926A49288k1198L6840d8660
17843b69790B84372c04108A50498K0063B3666e9361a5668B82903G0630g8064K1182
17832e6882F3097J787k4600f6479D36016a87563P7468J4499M2157j12653F9813
$$ y = [106087, -87837, 99468, 64914, 147216, -33235, -164993, 63593, 69476, 189792, 25080, -231483, 198687, 135387, 159310, -44989, -22492, -15741, -8326, -310587, 51349, 341486, 74640, 135637, 234827, 116461, 16448, 175600, -205063, 479094, -165451, 139099, 150076, -33865, 205789, -103692, -260472, -6978, -12237, -121075, -100699, -202724, 42842, 166548, 45377, -38834, 79713, 535714, 229027, 138574, -155607, -97731, 144250, -144757, 13220, 21548, 173924, -275842, 70519, 94462, 141583, 76274, 36605, 39183, 155552, -208926, 149288, 128090, 164930, -48660, -269790, 284372, -304108, 150498, 170561, 23666, -59361, -15668, 282903, 70630, -78064, -56882, 63097, 64884, 40284, -66479, 436016, -187563, -110095, -95596, -53439, -166092, 69813]
17820d01070A01097J4075g7635k03902h0038K5644K3685j75347A23070n3992l0696
17809C8382a22223B06760A8295J14677d804B02770f4074C0011a03299A56820O5313
17798B22133N5814d1797k37645J0627K7566H1339R9181n4227b94268C88623A04125
17786i2111l9094K9589K2628C15172b32123h7914I3559e5768A5951a86617E3505
17774c11006B97189a09855J8030j08172N5123O9859d299k47036A29340j5661J56152
17763B69831a09706I3690D0365K13595a25237L7297A28421B6156K69438b3570
17752b49286d1438j52053O2304j00512A07157K6267a22199A00640c56324a56291
17741B53431b34839p052C1245b9338j6825H4152Q6922b0449B73499B4820b1413
$$ y = [-401070, 101097, 115172, -77635, -281537, -80038, -54394, -30709, -206056, 123070, 69078, 38382, -122223, 206760, 18295, 132972, -4804, 202770, -64074, 30011, -103299, 156820, 222133, 277947, -41797, -279442, -268815, -241249, 81339, 180520, 126293, -294268, 388623, 104125, -92111, -131205, -101616, -78988, 315172, -232123, -87914, 93559, -55768, 15951, -186617, 53505, -311006, 297189, -109855, -91825, -199997, -144874, -75015, -4299, -251335, 129340, 113679, 269831, -109706, 93690, 40365, 253960, -125237, -87940, 128421, 26156, 295594, -23570, -249286, -41438, -193491, -131187, -231699, 107157, 133424, -122199, 100640, -356324, -156291, 253431, -234839, -241891, 31245, -29338, -46163, 84152, 171074, -20449, 273499, 24820, -21413]
17729a34728A14339F123a6979B09907F5543a95729B54225N8864a59115b2681H199
17717I2270N3877J41593j26866o9022b11719c9814L952G674d081A03048j5766
17706H7282K22336D8288e3397C61665b11470p904E4410b89091G5800a95650f9523
17694A56812A2211Q5905a80816F5306J04326A3528Q2523a07238G1439L2054B448
17682a39334d0008j7991J1301A38613M5155h8898o2884G4919h5205a7008j51677
17671a68685I7522a56781e9966B16845r5865e9706A45185b11051c3964A05737
17660F1094a70108B34002K38869a14437b4731A17301p307i1794n4280d4465B28970
17648a58638k5116r570Q7273j06742R8896L7901C08368b2358p321B97027j22695
$$ y = [-134728, 114339, 6123, -16979, 209907, 65543, -195729, 254225, 313089, -159115, -22681, 8199, 92270, 146147, 287740, 160874, 91852, -211719, -39814, -35862, 7674, -4081, 103048, 87282, 309618, 48288, -53397, 361665, -211470, -219374, 54410, -289091, 75800, -195650, -69523, 156812, 12211, 98116, -180816, 65306, 169632, 13528, 96051, -107238, 71439, 103493, 2448, -139334, -40008, -57999, -46698, 138613, 183768, -88898, -151782, 74919, -85205, -17008, -168685, 97522, -156781, -59966, 216845, 120980, -59706, 145185, -211051, -33964, 105737, 61094, -170108, 234002, 472871, -114437, -24731, 117301, 109994, -91794, -146074, -44465, 228970, -158638, -183754, -193324, -106051, -212793, -113897, -75996, 308368, -22358, -29679, 297027, 174332]
17637A74332c29595a25461p2922A55515m6836k5445l1583J48188J02148r7331
17627B04656a38690f1283B02452H8a13440j63468a9805E63K70750j06294K18330
17616C83349d955j02611A79278b14392K7368m5802D5413a09461A98839E5111R278
17605F4389K916e9343j37060m000N4888A50983G478a16234A22852L52572A8588
17593i8735C21138l1677D4216c54754A58490f62A777J01369J20999g311B14572
17581C14188C4831b21980P2327F2606A6505K25588i2752B686f6177B13161a1134
17569A6649J23923b95918B26970I8372M6885a6792C0994a28839A0014P2833K13176
17558B96023j18008b3081A42651b59098D44230A26597N58553B60646b27928L7607
$$ y = [174332, -329595, -125461, -198383, 155515, 108679, 83234, 51651, 199839, 301987, 204656, -138690, -61283, 202452, 88, -113440, -276908, -19805, 563, 271313, 165019, 383349, -4955, -107566, 179278, -214392, -187024, -232826, 45413, -109461, 198839, 55111, 64389, 67305, -59343, -196403, -200403, -145515, 150983, 7478, -116234, 122852, 475424, 18588, -98735, 321138, 289461, 44216, -354754, 158490, -662, 1777, 103146, 224145, -7311, 214572, 314188, 34831, -221980, -149653, 62606, 16505, 242093, -92752, 2686, -66177, 213161, -11134, 16649, 140572, -295918, 226970, 98372, 145257, -16792, 30994, -128839, 10014, 82847, 296023, 178015, -23081, 142651, -259098, 444230, 126597, 685150, 260646, -227928, -190321]
17548a90321C28180a04851A12024M8826k0909c4361B20693H6932J8181g1924q2750
17537a54674A8365J18272M130i4404A56030h6488N893B47777i3864C3123J42998
17526A76121q766q1166b5016C88824I4331J50608a58711B26632a21232G8912b56185
17514I7362J25303o076P0907G1384J73218j1812f1819n5066B73132H528Q8236
17503I6764a04418A19925k4480l6902R890J05743K3957J53284I499K47883K6525
17492B83907j01304L10954J1153B796J14590J16827d9690E33640A39510a38144
17481b55269C68485D9281L45232q4807G9019L819l4187M4440J80678N7552j16482
17470B14839e4610r2451D29154K6862b93181A83741b28255C22974p5827a99257
$$ y = [-190321, 328180, -104851, 112024, 160850, 139941, -34361, 220693, 86932, 105113, -71924, -154674, 18365, 136637, 140767, -94404, 156030, -86488, -80595, 247777, -93864, 33123, 176121, 167355, 86189, -25016, 388824, 94331, 244939, -158711, 226632, -121232, 78912, -256185, 97362, 222665, 216589, 287496, 71384, 244602, 232790, -61819, -116885, 273132, 8528, 96764, -104418, 119925, 95445, 58543, 68433, 174176, 198133, 351417, 9499, 257382, 283907, 182603, 493557, 504710, 2796, 117386, 234213, -49690, 533640, 139510, -138144, -255269, 368485, 49281, 394513, 309706, 79019, 82838, 48651, 93091, 273769, 331321, 214839, -54610, -147061, 429154, 456016, -293181, 183741, -228255, 322974, 247147, -199257]
17459B9369J40077J13172j2791j29127k9401a28702A42349K37670A37971J71706
17449C09677j5317D5030K69828K29751A57336m0019K48334D1812R6258D7792K22954
17438B70746L19676j90995A91216J18310K20616a4684A23076J2613L935O5583
17428B05207d0024B67495o0554L3407G7573K59349o5203P9533A01074L62204D7935
17416E57135B01805J05014O7619q4768B3023b4355i680C20687I5799f7284G7329
17404a87066A87594A0532L11229A51409a47576E4967J12395o8595c7877E3345
17393a64462B30598R0229I5949L36303j55350A27726l2838D6184J41689a93776
17382A57747F7009J56687A2787e0567C12821N1682j50478M1690F3203O7446l9451
$$ y = [29369, 169446, 282618, 269827, 140700, 111299, -128702, 142349, 380019, 137971, 309677, 294360, 45030, 314858, 544609, 157336, 117317, 365651, 41812, 138070, 47792, 270746, 590422, 399427, 191216, 309526, 530142, -14684, 123076, 135689, 139624, 205207, -40024, 267495, 206941, 240348, 77573, 336922, 271719, 351252, 101074, 463278, 47935, 557135, 201805, 306819, 374438, 289670, 23023, -24355, -9680, 320687, 95799, -67284, 77329, -187066, 187594, 10532, 321761, 151409, -147576, 54967, 167362, 98767, -37877, 53345, -164462, 230598, 320827, 95949, 432252, 276902, 127726, 94888, 46184, 187873, -193776, 157747, 67009, 223696, 12787, -50567, 312821, 364503, 214025, 255715, 63203, 130649, 91198]
17371I1198O2241m1406D1936J81973h5390B11814f0625E3952J31260b2330E94069
17359A45374a03321B75728E0343a5516B37440F5743L78814j70788a193q5239B22199
17347A40041R3262Q5029j12827e2335B38355j10031J5056F5476J49772J56969
17337C72217j37910j10818h4964A48189C442J11073D6891b30403i8215A45311
17326G8851O2707f3960j68923F4587J60776m0116a22973c6215F9713M29533j17618
17315C81628J11594E65a22739A32749O35K9475K7967P3124A11010K20184b43544
17303A19003P2345E6070K34779o6398a15743A67439q2544b21525A66192M32031
17293E98223k18879Q5808j50224a07198B34426f5082n8325C14947I86K52183n6821
$$ y = [91198, 153439, 112033, 41936, 223909, -85390, 211814, -60625, 53952, 185212, -22330, 594069, 145374, -103321, 275728, 50343, -15516, 237440, 65743, 444557, 273769, -1193, -86432, 222199, 140041, 233303, 318332, 205505, -52335, 238355, 128324, 143380, 65476, 215248, 372217, 234307, 123489, -84964, 148189, 3442, 114515, 46891, -230403, -98215, 145311, 78851, 141558, -63960, -232883, 64587, 225363, 185247, -122973, -36215, 69713, 499246, 381628, 493222, 565, -122739, 132749, 133384, 162859, 190826, 263950, 111010, 331194, -243544, 119003, 191348, 56070, 290849, 224451, -115743, 167439, 84895, -221525, 166192, 598223, 379344, 465152, 314928, -107198, 234426, -65082, -123407, 314947, 986, 253169, 196348]
17282A96348J24477j9559q7105F9153J89381J89700H9199m3500L29082A505c8260
17270A58268h7232C64124j79869l6546B0011J29737G2395a08789B43341F7366
17259A59906p6316M02545B01801G8049Q2784Q5882N9380B2510O3366D2495N57338
17248E99833k11494a7240B89586j23692l1268e0269A43502N53868j72718a16985
17237B45240m9059c8208A65530N1693J65431D0390K37809K65633A37954F5169
17226A47869q503L5023K89936A30458J580f2531B74673m2948H0444b8799A60266
17214A821a12515C3520J54636l610j3220P6159l6774C2283b00353A71229J45568
17203C16797j33897J35360p7972J25326J06198B07752K12848A62712J2687J08221
$$ y = [196348, 320825, 301266, 214161, 69153, 258534, 448234, 89199, 45699, 374781, 1505, -38260, 158268, -87232, 364124, 184255, 147709, 20011, 149748, 72395, -108789, 243341, 67366, 159906, 83590, 486135, 201801, 78049, 160833, 246715, 306095, 22510, 85876, 42495, 599833, 388339, -17240, 289586, 165894, 134626, -50269, 143502, 697370, 524652, -116985, 245240, 196181, -38208, 165530, 217223, 382654, 40390, 278199, 543832, 137954, 65169, 147869, 139366, 174389, 464325, 130458, 132038, -62531, 274673, 231725, 80444, -28799, 160266, 1821, -112515, 33520, 188156, 184546, 171326, 247485, 210711, 32283, -200353, 171229, 316797, 182900, 318260, 240288, 365614, 471812, 207752, 420600, 162712, 175399, 283620]
17193B83620I905J63945N2043k6671k7385K32355A72891J5874J32445A32360K96448
17182D28808A97385J84930p5474a85282B00793l8997J4433Q4033M3650A47965
17171H7500c7077A15937J88940j11259J23709R6716E706L54053j11814J75841
17161D23786J19247B22216J07101A19074b4955B54001l9807J47163r8618D0692
17150B22681a99824B22463K7243K92126k20887J45349J33604j31216A60977K57414
17140D18391A82961J05878m0055K00524l9462J582K00252k15848j8768L4045j03131
17129C07978K12132e9545C42083M99996A804K60743P8646J61567j59530L13196
17119F56426H4836J28345J06168M5542A54365L73698n1350j68042M7590K35087
$$ y = [283620, 9905, 173850, 225893, 199222, 171837, 404192, 172891, 188765, 321210, 132360, 428808, 197385, 382315, 306841, -185282, 200793, 161796, 176229, 260262, 303912, 147965, 87500, -37077, 115937, 304877, 193618, 317327, 414043, 5706, 359759, 247945, 423786, 543033, 222216, 329317, 119074, -24955, 254001, 214194, 361357, 262739, 40692, 222681, -199824, 222463, 249706, 541832, 320945, 466294, 599898, 468682, 160977, 418391, 182961, 288839, 248784, 449308, 409846, 411428, 611680, 395832, 377064, 411109, 307978, 520110, -59545, 342083, 842079, 1804, 262547, 341193, 502760, 343230, 656426, 84836, 213181, 319349, 364891, 154365, 528063, 476713, 308671, 356261, 591348]
17109E91348J3568K36282m10069j3750j03379K4840M24212l53877j4841p1479
17099C22855k5041l1636R3081m3741K94830o8608B47155K68168j16074K5078M8880
17088D73207J19231j17211r077B01943J37673C6774N34430j93279L81000B72998
17077D92149m3290K94442k33596A52138M2128M1554M49332k63273Q0830K25766
17067G28475l19802q3833N2074J58269Q9575q1663O222p61B35578L50189J54299
17056G40066K7801k11505N9866Q0805l39085m6852M22051k27215q6781J75369
17046E94520J94669r5147C21668K01515q4615K63227C13394R8154K37373k82927
17036C65994L95120j22884j07653J53506K09758C45994L03120K70250C98146L61323
$$ y = [591348, 604916, 841198, 431129, 417379, 314000, 338840, 763052, 409175, 394334, 322855, 297814, 266178, 359259, 315518, 610348, 541740, 247155, 515323, 399249, 424327, 473207, 592438, 475227, 466150, 201943, 339616, 36774, 571204, 377925, 758925, 272998, 492149, 448859, 743301, 509705, 152138, 194266, 235820, 685152, 421879, 502709, 728475, 408673, 324840, 376914, 535183, 624758, 543095, 549317, 548556, 235578, 585767, 740066, 767867, 556362, 616228, 697033, 357948, 311096, 733147, 505932, 419151, 594520, 789189, 694042, 321668, 523183, 438568, 701795, 313394, 411548, 648921, 365994, 761114, 638230, 530577, 684083, 893841, 345994, 649114, 919364, 398146, 759469]
17026G59469K46152C97467N92027C69643j5872L39829P2144j04550Q6744B57333
17015C12119L88229k31339N68060l60049j55497K46404B55391N16919k56614o060
17005E09636K41605M3557O3911k01109j34534K19265J05560J74129m41091P2387
16995F53316K22447k79829O4022J1856L26508k75887J87891J34595k67407p036
16985G70476R9954K204q4499J14558j49898r0738L8112J60562l9011K32252j36064
16974I17908j61140J37315j68182K99173k40786L59441k71902m8293Q220k10804
16964F20950K29295j27784Q149J52221l6645P9192P306K43911l33490N132K54987
16953A103224L252l75350L44055n03639P30865O2657l91769j88750K66789L28623
$$ y = [759469, 1005621, 397467, 989494, 369643, 353771, 693600, 765744, 661194, 747938, 257333, 312119, 700348, 469009, 1037069, 677020, 521523, 767927, 255391, 772310, 515696, 509636, 751241, 794798, 858709, 657600, 523066, 742331, 847891, 1022020, 580929, 653316, 875763, 595934, 659956, 671812, 998320, 722433, 910324, 1044919, 777512, 770476, 870430, 872634, 788135, 902693, 752795, 662057, 700169, 860731, 821720, 1053972, 917908, 756768, 894083, 725901, 1025074, 784288, 1143729, 871827, 823534, 831754, 620950, 850245, 722461, 730610, 882831, 846186, 925378, 932684, 1176595, 843105, 848237, 1103224, 1106476, 731126, 1075181, 571542, 1302407, 1365064, 973295, 784545, 1051334, 1379957]
16943A379957o9303k4026J86934p5636o78843N15200N3594k14046J82057J1352
16933A267240J34876n7122j74064K6905l8589J83300Q4465j26521L20467n71525
16923A049432N94813n58135O28014n98139K20590J65529J13013K0362j59610J43390
16913A619259r1223j39483K05735j11472K1197J88785l12178M19162l3073k21322
16903A545387J93789j67467J52009Q0806r5860p3078J13701k3638L04793m45730
16893A584712L05147K93670j22392p9289O3538k30664M90547l44901J02196j04652
16883A957912j8650N0367J5144L57053j99989J46066J39127l86690K19377m5853
16873B233864J23958K39155l25502M20961k77951K3971K08098n02046M66218p9361
$$ y = [1379957, 1310654, 1286628, 1473562, 1397926, 719083, 1234283, 1287877, 1073831, 1255888, 1267240, 1402116, 1344994, 1170930, 1197835, 1159246, 1342546, 1427011, 1300490, 1620957, 1049432, 1644245, 1086110, 1714124, 1115985, 1336575, 1502104, 1615117, 1635479, 1475869, 1619259, 1528036, 1388553, 1594288, 1482816, 1504013, 1692798, 1380620, 1799782, 1766709, 1545387, 1739176, 1571709, 1723718, 1804524, 1708664, 1635586, 1749287, 1725649, 2030442, 1584712, 1889859, 2183529, 2061137, 1981848, 2045386, 1814722, 2305269, 1960368, 2062564, 1957912, 1939262, 1989629, 2004773, 2361826, 2161837, 2307903, 2447030, 2060340, 2279717, 2233864, 2357822, 2596977, 2271475, 2692436, 2414485, 2438456, 2646554, 2144508, 2610726, 2531365]
16863B531365j5038M93557l16790K58282p5011j3272K43540k41944R1002M5610
16853C001301j37657M64207n71303N17965j31860J03871J26846J8948P6633l059
16843C465892j83076K21187j1669p6277L97880k55561L57231K02530J069J92097
16833D311303j99654N5975L3981L45244m5824J57891l17306k8254N22992Q8339
16823D924687r6326M82428l99657K03986j32660K1721M42900M60371k07145q7868
16813E612437O00194l46061K06338Q3992J94289K45633k10936L35904K09077L84966
16803G315833K06850j92474L50459j55103N28802R0364J20908j5742P34406J23349
16793I107652o9062L94717j20183O11431K26693K15879M24492M1452K92243M42483
$$ y = [2531365, 2516327, 3009884, 2693094, 2951376, 2876365, 2863093, 3106633, 2864689, 2955691, 3001301, 2863644, 3327851, 2756548, 3274513, 3142653, 3246524, 3373370, 3392318, 3468951, 3465892, 3282816, 3504003, 3492334, 3416057, 3813937, 3558376, 3915607, 4118137, 4119206, 4311303, 4111649, 4167624, 4201605, 4546849, 4501025, 4658916, 4341610, 4313356, 4836348, 4924687, 4828361, 5310789, 4911132, 5115118, 4982458, 5004179, 5447079, 5907450, 5700305, 5612437, 6212631, 5866570, 6072908, 6156900, 6351189, 6596822, 6385886, 6721790, 6930867, 7315833, 7522683, 7330209, 7680668, 7525565, 8054367, 8144731, 8265639, 8249897, 8984303, 9107652, 9038590, 9433307, 9313124, 9924555, 10151248, 10367127, 10791619, 10833071, 11125314, 11567797]
16783A1567797M36321Q4299L35158N67793J97121L44666L45935Q39441J04088
16774A4822619O13597J43313R45588L57841N02097N16901J016626P15555L76432
16765B0010569Q35832N23346J208381P05260P37807J097855P25090J017572J107375
16756B7969087J491254J178809J231702J167560K042327J309753J305758J988433
16748C9684683J916302J853888K263596K493206K663661K566512K787797K888052
16740E9117697K912750L843762L449196L983645M006563M271000M702775N020919
16732I1308307N245615N332456N979662N707493O767655O361381O362960O455427
16724A39520956O480001O094726N731498N352855M937497L689390K877123K523280
$$ y = [11567797, 12004118, 12088417, 12423575, 12991368, 13188489, 13533155, 13879090, 14718531, 14822619, 15436216, 15579529, 16525117, 16882958, 17385055, 17901956, 18918582, 19634137, 20010569, 20846401, 21369747, 22578128, 23283388, 24021195, 25119050, 25844140, 26861712, 27969087, 29460341, 30639150, 31870852, 33038412, 35080739, 36390492, 37696250, 39684683, 41600985, 43454873, 45718469, 48211675, 50875336, 53441848, 56229645, 59117697, 62030447, 65874209, 69323405, 73307050, 77313613, 81584613, 86287388, 91308307, 96553922, 101886378, 107866040, 113573533, 120341188, 126702569, 133065529, 139520956, 146000957, 152095683, 157827181, 163180036, 168117533, 171806923, 174684046, 177207326]
16716A77207326N35738q8610j198975k389625l555672m285749n195658n707696
16708A55321079o001277o512731o542494o883176o650449o746579o311421n851702
16700A03821250n810042o111462m817363n022953m929721m259269m127909l813277
16692F4929254l536225l502709k963083k948227k536362k635538k400745k130352
16684D2276013k191763j805693j698788k148117j449773j575143j303136j158554
16676B8945046j553173r93367j335175r65975p63439j063157p22625r94106q86977
16667A9667052n72426o07403o68287o68191p42799j07884p09145q06703j84592
16658A4599622o28682p13315m39340k41558n32429n13859K23775q14374o8014
$$ y = [177207326, 177743064, 177654454, 176455479, 174065854, 170510182, 166224433, 161028775, 155321079, 149319802, 142807071, 136264577, 129381401, 122730952, 115984373, 109672952, 103821250, 98011208, 91899746, 87082383, 82059430, 77129709, 72870440, 68742531, 64929254, 61393029, 57890320, 54927237, 51979010, 49442648, 46807110, 44406365, 42276013, 40084250, 38278557, 36579769, 34431652, 32981879, 31406736, 30103600, 28945046, 27391873, 26398506, 25063331, 24097356, 23333917, 22270760, 21548135, 20554029, 19667052, 19094626, 18487223, 17818936, 17150745, 16407946, 16300062, 15590917, 14784214, 14599622, 13970940, 13257625, 12818285, 12576727, 12044298, 11530439, 11754214, 10939840, 10871826]
16649A0871826n85048q4783l72661l69974o7910r3921l93396l18405k61294j5320
16639H309114k78114k72850j92069l19539p6552m51596J2797k10796j01865M0652
16629F459182p4190l20937j65805l23315j1520j72394n7128q8690l27490L7328
16619D955041K5737j93809l42350K96091l23555K06959l82091K74434m34294r3675
16609C988488j28403J05241L2779j62616j19688J8586j48283j72316o0949L23502
16599C676341m85548j26213K54274m27887J68290O3314L1902p0868l71837P9449
16589B791217J63429k29974j12705m9141J54865m22997K49265j67721J47183l82980
16579B140441L48205j20886j18436L2099j43336K68094l1533k27128p1646J87780
$$ y = [10871826, 10286778, 10201995, 9829334, 9459360, 9391450, 9297529, 8904133, 8585728, 8324434, 8309114, 8031000, 7758150, 7566081, 7246542, 7169990, 6718394, 6731191, 6520395, 6418530, 6459182, 6384992, 6064055, 5898250, 5574935, 5563415, 5391021, 5333893, 5245203, 4917713, 4955041, 4980778, 4786969, 4444619, 4740710, 4417155, 4624114, 4242023, 4516457, 4082163, 3988488, 3860085, 3965326, 3998105, 3835489, 3715801, 3734387, 3586104, 3413788, 3352839, 3676341, 3190793, 3064580, 3318854, 2890967, 3059257, 3122571, 3154473, 3083605, 2711768, 2791217, 2954646, 2724672, 2611967, 2562826, 2717691, 2294694, 2543959, 2376238, 2523421, 2140441, 2488646, 2367760, 2249324, 2281423, 2138087, 2406181, 2374648, 2147520, 2075874, 2263654]
16569B263654m28036J58463j49383L3024J9347K51876n71655J3774L11470j23052
16559A779482j92420N40190l77796j55717J69215J33462l44478Q4952K48278m06966
16549A478202P3059J96669m39165J7267N4116J94085j21677L7640L8306O8269
16539A596771l22791j38076K26929R8632k86627Q8047R3689M2353Q0019k89220
16529A189726J90936k46687M50552k56989l26922K3319J7379L49161j14442r1391
16519A184642j22413k4622J30092j25498k11821M02745k4305k42901j05879j47513
16509G12527K76627k69062k9908K12039O5089l49416Q5873K06398J30295o2757
16499I77705j23487l6263q2301Q6547p1403l66871O01564D42149m0358K81360
$$ y = [2263654, 1835618, 1994081, 1844698, 1877722, 1897069, 2148945, 1577290, 1591064, 1902534, 1779482, 1587062, 2127252, 1749456, 1593739, 1762954, 1896416, 1551938, 1636890, 1885168, 1478202, 1551261, 1747930, 1308765, 1326032, 1380148, 1574233, 1452556, 1490196, 1528502, 1596771, 1273980, 1135904, 1362833, 1461465, 1174838, 1262885, 1356574, 1398927, 1478946, 1189726, 1380662, 1133975, 1584527, 1327538, 1000616, 1023935, 1041314, 1390475, 1276033, 1184642, 1062229, 1037607, 1167699, 1042201, 830380, 1233125, 1208820, 965919, 860040, 712527, 989154, 720092, 690184, 902223, 967312, 617896, 703769, 910167, 1040462, 977705, 854218, 817955, 735654, 822201, 750798, 383927, 985491, 442149, 401791, 683151]
16489F83151L48916k8726m15164J39546k67315L02647O9315j91971r7035o1164
16479D82200J41884K30696M9567j48163K58365j46833o7130k54753J21251R382
16469F76466Q3227k78488L51501r4616J12559j95389k53451L20044n318L6527
16459G53062l73320j16181L63811j90274m1129K22006j44377r1143J9872K03463
16449F05790l00323N7162l9261N13355l54433J1805J81517l4164K28699l14446
16439E55701j69831K63730j83143M80778C59624k3285J4979j23522K99462J68046
16429F95304l323l06641J32259j03008n0613J5220j1915J22187A34081M14811
16419E48892k22336L99682k73530O5827p8783j22646L15341A79317J87587m5917
$$ y = [683151, 1032067, 1003341, 588177, 727723, 460408, 763055, 832370, 640399, 543364, 482200, 624084, 854780, 904347, 756184, 1014549, 867716, 800586, 545833, 667084, 676466, 759693, 481205, 832706, 738090, 850649, 655260, 401809, 721853, 716535, 753062, 379742, 263561, 627372, 437098, 395969, 617975, 473598, 382455, 402327, 605790, 305467, 362629, 323368, 836723, 482290, 494095, 675612, 641448, 870147, 555701, 385870, 649600, 466457, 947235, 359624, 336339, 351318, 227796, 527258, 695304, 691981, 385340, 517599, 414591, 363978, 379198, 367283, 489470, 134081, 548892, 326556, 726238, 452708, 518535, 439752, 317106, 632447, 179317, 366904, 320987]
16409C20987k3412g358C83506C1783L62421O603q180p6556M519B8177J98297K29869
16397D56343N241j13438K70177A08295L60156A88104P8282J98686A91064J35485
16387C26549r8599K36247A31901K89500J78431j98419O9237j57290r1483D2359
16376H7878K20058h6945A30036M82851j45215j71544I7885h1883D31928A01122
16365A76560J48452a3024C1108P0976Q3973j4981N07455F4941C0027J52293C2690
16353B81642e4647B59172m9193B8684O0395L0771J55556L2363r8011J79250p6258
16342C12750J1092r7097J86454n8640o3324c8265H5169K28991I2822C6037L79345
16331D15382A73854a6321C51470l8824q240J04222g8094b1394D8639c8343j33412
$$ y = [320987, 297575, -7358, 383506, 31783, 394204, 400807, 392627, 316071, 320590, 28177, 226474, 456343, 461584, 348146, 618323, 108295, 468451, 188104, 266386, 465072, 191064, 326549, 227950, 464197, 131901, 421401, 599832, 401413, 470650, 313360, 221877, 42359, 87878, 307936, -86945, 130036, 612887, 467672, 296128, 97885, -81883, 431928, 101122, 176560, 325012, -13024, 31108, 102084, 186057, 171076, 678531, 64941, 30027, 182320, 32690, 281642, -54647, 259172, 209979, 28684, 89079, 119850, 275406, 307769, 209758, 389008, 312750, 323842, 226745, 413199, 354559, 291235, -38265, 85169, 314160, 92822, 36037, 415382, 173854, -16321, 351470, 312646, 304406, 408628, -78094, -21394, 48639, -38343, -171755]
16320a71755J9777D14107a37379M1894B10191N0986J04151A0057a79775A09601
16309D86333q0791c4854A43506J01756K25188A17248J19613c36893B89499J49666
16299D39165A39679R2866k6378m3826M9672a48434C25438I4611J19411L9741B6975
16287C70772b24555e1674H810K97353K27116B02309i809C16623R5696A78486p7300
16276A01186m6513d6008A28364a87249A39623a6262C3946b77624C31696c16735
16265C15944d1765A41895C2357L55014A79568J75001b01486O2626F6577J66832
16255B33409f643n5233C9265M7513c9697B27737o9828G3320J61196r5936a73628
16243B24924a97466D22027C6560J51778G9823K66080A087a84064a2889j11375
$$ y = [-171755, -151978, 414107, -137379, -95485, 210191, 261177, 365328, 10057, -179775, 109601, 486333, 405542, -34854, 143506, 245262, 470450, 117248, 236861, -336893, 289499, 439165, 139679, 232545, 206167, 162341, 212013, -148434, 325438, 94611, 214022, 253763, 26975, 370772, -224555, -51674, 8810, 306163, 533279, 202309, -9809, 316623, 412319, 178486, 101186, 54673, -46008, 128364, -187249, 139623, -16262, 33946, -277624, 331696, -316735, 315944, -41765, 141895, 32357, 387371, 179568, 354569, -201486, -138860, 66577, 233409, -6643, -61876, 39265, 86778, -39697, 227737, 157909, 73320, 234516, 138580, -173628, 224924, -197466, 422027, 36560, 188338, 79823, 345903, 1087, -184064, -12889, -124264]
16233a24264d2050k3755H5862b64560f2108A1111D257P2768b47045A01893h2584
16221a43885a6195A93277J1467a39819A90384q5092K06154A34079h9469H858J67564
16210A76422l6320a96405B3285a09173o9829m4646A44143p39K3896l8844A6287
16198c30420a344C3401L25214O9859c8505F2077K43328f1023B43331e1435A4337
16186A55170a9348B23243F9570n57a95237A98952R8656O5289a11038H0346O6624
16175A46970n469A4413a31130A14906c65802J74605i1718i249A04966J30024G642
16163I9631f132B15455D59b740G1918b12266B14505a13319r346A72994p574h744
16150B36243a09557E8643b48323D854g7931j65676C86295c10151a06574k565k3394
$$ y = [-124264, -42050, -65805, 85862, -264560, -62108, 11111, 4257, 77025, -247045, 101893, -82584, -143885, -16195, 193277, 204744, -139819, 190384, 105292, 311446, 134079, -89469, 8858, 176422, 140102, -196405, 23285, -109173, -179002, -223648, 144143, 143404, 167300, 128456, 16287, -330420, -1344, 33401, 358615, 428474, -38505, 62077, 305405, -61023, 243331, -51435, 14337, 155170, -19348, 223243, 69570, 69013, -195237, 198952, 297608, 362897, -111038, 80346, 146970, 141501, 14413, -131130, 114906, -365802, -191197, -91718, -9249, 104966, 234990, 7642, 99631, -6132, 215455, 459, -2740, 71918, -212266, 214505, -113319, -122665, 172994, 165420, -8744, 236243, -109557, 58643, -248323, 4854, -77931, -243607, 386295, -310151, -106574, -109139, -132533]
16139a32533E8615j6115b3449C36549b54161B22330p8617e0286A17275d5803n8375
16128a04178k7508p8400C60761K5451D9440K37142a19888N2838A60728g73B20873
16116A61031a11204F118K21848a5498j29125o8746g0127B9082c12605c5021A27146
16104a47909C31376D6981J06005P0554H9097J13848b29289j14910a30219A57769
16093A9176a32192L5654j882a6852H1014J84591B8761a63903C03681j09355b03781
16081a77419C09920j25417D2872d2105A35792h5526l9439G8194C001L974J09167
16070A16142K12972A00901L8267K96494a18B81056a88236E3128d4831k3526C51894
16058H7312a25943L8173k7891A16560Q330b63842c2814A67583a17427o8995B7455
$$ y = [-132533, 58615, 42500, -23449, 336549, -254161, 222330, 143713, -50286, 117275, -45803, -104178, -131686, -210086, 360761, 386212, 49440, 286582, -119888, -67050, 160728, -773, 220873, 161031, -111204, 6118, 227966, -15498, -144623, -213369, -70127, 29082, -312605, -35021, 127146, -147909, 331376, 46981, 152986, 223540, 89097, 202945, -229289, -344199, -130219, 157769, 19176, -132192, -96538, -98420, -16852, 81014, 265605, 28761, -163903, 303681, 194326, -203781, -177419, 309920, 184503, 42872, -42105, 135792, -85526, -124965, 78194, 3001, 6975, 116142, 329114, 100901, 139168, 435662, -118, 281056, -188236, 53128, -44831, -68357, 351894, 87312, -125943, -87770, -115661, 116560, 124890, -263842, -32814, 167583, -117427, -186422, 27455]
16046a15585K7547H364J39386M2829a68628G600a30798d3192k35025A82283C6299
16034A86639C5660b43063I6499b03350O4903N3211J1102B89951j15214p6505a32913
16022f3050B08691I5584b75827h4550n0143C66593G1940K27595n6143a15111L7314
16011g7797j65430h9790l19047D851h4760l4186k00889J25580k33225e4078j93212
16000b47290d4300D4011K1676P5578b67896J15810I6839d27029A10199m2812J02364
15989A69751a1111l24786l9627C10519K32474k64803j18802L83953B25280J2620
15979B37900C8053r815K27730N5822k4940b38835j19134A89002a58144l19353
15969d77497b29068c5782B42899e8653m60803A67401f8978N309l5943B83839E6021
$$ y = [-115585, -88038, 8364, 147750, 190579, -168628, 7600, -130798, -43192, -278217, 182283, 36299, 186639, 35660, -243063, 96499, -203350, -138447, -85236, -74134, 289951, 174737, 98232, -132913, -63050, 208691, 95584, -275827, -84550, -134693, 366593, 71940, 299535, 243392, -115111, -77797, -243227, -89790, -408837, 4851, -84760, -118946, -319835, -194255, -427480, -54078, -247290, -44300, 44011, 65687, 141265, -267896, -152086, 96839, -427029, 110199, 67387, 169751, -11111, -335897, -375524, 310519, 542993, 278190, 159388, 543341, 225280, 237900, 38053, 28238, 255968, 311790, 286850, -238835, -357969, 189002, -158144, -477497, -229068, -35782, 242899, -58653, -519456, 167401, -68978, -63669, -99612, 283839, 56021]
15957b42714N762i2295A55086d7511a5530C709b620k33251A2384Q246J53355A0247
15944A68448K28023d5750k37857A11043M8835J12171c1096C42518p2001h9917
15933g1897n9639f1252j17056A17390i1451C5644A1414b53690i2589l9770H4410
15921h9665B30413L6078I3369j7729i8913K2140k01661a27055M1978B54488j18063
15910A36425b61919A24288E4139J93092p0370i5466l9740l7180d5532B1053b9642
15898a01556E9223J04382b17601B00509b5199j28305H0c6298D6818b02933D49049
15886B5223J0157K53166a81876B3261g4418H0599J66212c57339A72613J58078
15876C30691e4285M175m7718l18869B13278d10020E0550b61866J20656f2562l8610
$$ y = [-242714, -236952, -92295, 155086, -47511, -15530, 3709, -2620, -235871, 12384, 20630, 173985, 10247, 168448, 396471, -45750, -283607, 111043, 159878, 272049, -31096, 342518, 270517, -89917, -71897, -131536, -61252, -178308, 117390, -91451, 35644, 11414, -253690, -92589, -132359, 84410, -89665, 230413, 266491, 93369, 75640, -98913, -76773, -278434, -127055, -85077, 254488, 136425, -261919, 124288, 54139, 247231, 176861, -95466, -135206, -172386, -45532, 21053, -29642, -101556, 59223, 163605, -217601, 200509, -25199, -153504, 80, -36298, 46818, -202933, 449049, 25223, 35380, 288546, -181876, 23261, -74418, 80599, 246811, -357339, 172613, 330691, -54285, -50110, -97828, -416697, 213278, -410020, 50550, -261866, -141210, -62562, -101172]
15865a01172D9480h4109j66527R4133O0290L6708q6162b6172j12861N1853k56603
15854c43783e4905k04133Q8051A3033J00442c3491L360E6361a77927f3155I2585
15842A89181o835c93114E02145D5419b63745B43308b24780O4939J2824A74386
15831C59413d85660A3571d3260k87955e028j33375N4781n5913m52648C4032a60560
15819B0194R6069d7450a1873l41011h6215G9187J30492h6964K7409J1626m3181
15808i1110D2691h9090G8630H247K1289b05189R6682C1635G980a14293A05683
15796a69990O7952A70290K531c95081C7848P4229P0712b71875o3914E7909i9693
15784a38360B02004M6197b70091A76111R9771c32905a9202C4968b2699B97046
$$ y = [-101172, 49480, -84109, -250636, -156503, -96213, -59505, -145667, -26172, -139033, -87180, -343783, -54905, -259038, -170987, 13033, 113475, -33491, -30131, 56361, -177927, -63155, 92585, 189181, 182346, -393114, 502145, 45419, -263745, 243308, -224780, -159841, -147017, 174386, 359413, -485660, 13571, -43260, -331215, -5028, -138403, -83622, -139535, -592183, 34032, -160560, 20194, 116263, -47450, -11873, -352884, -86215, 79187, 209679, -86964, -59555, -47929, -91110, 42691, -89090, 78630, 8247, 29536, -205189, -108507, 31635, 7980, -114293, 105683, -169990, -102038, 170290, 172821, -395081, 37848, 112077, 182789, -271875, -335789, 57909, -99693, -138360, 202004, 248201, -270091, 176111, 275882, -332905, -19202, 34968, -22699, 297046]
15773b52680h4804n9726B62272B2364a55719B76568g2383j88763f4869E0986N384
15762E6370K18878b39338D6276c4705B40805o2056N0034N6658b45857c3229j08906
15751a42135a329H3628a58778A25000D7181J09792p5651h8048F8605b06432E0232
15739B044J32886n5271b21663J02540I6847K0118A0912k734J38458L00402D3350
15727F8082J40294d5724g120j5769A11191f3477k3878n6646F7564b39446B08324
15715b05170B59153j27806Q4550b79951m868A19227E4809a66089j21720A34836
15704a24511D0810J87432c4612k76653A89143b49657J12224b5040j88803A46558
15693A34848f8806i461k1668A74571R1280I3986b7006q7989o7634E5366K76986
$$ y = [-252680, -84804, -144530, 262272, 22364, -155719, 276568, -72383, -261146, -64869, 50986, 56370, 275248, -239338, 46276, -34705, 240805, 178749, 228783, 285441, -245857, -33229, -142135, -1329, 83628, -158778, 125000, 47181, 156973, 81322, -88048, 68605, -206432, 50232, 2044, 134930, 79659, -221663, -119123, 96847, 116965, 10912, 8178, 146636, 447038, 43350, 68082, 208376, -45724, -7120, -22889, 111191, -63477, -87355, -144001, 67564, -239446, 208324, -205170, 259153, 131347, 215897, -279951, -284819, 119227, 54809, -166089, -287809, 134836, -124511, 40810, 228242, -34612, -311265, 189143, -249657, -137433, -25040, -213843, 146558, 134848, -68806, -9461, -31129, 174571, 265851, 93986, -27006, -114995, -182629, 55366, 332352]
15682C32352K5674j30549d5893F1479a20043C28935n5431e2638j82379c9355G0949
15670h9127o4468A38539D7577K2774b97829B1373a1939q7078C13118a00519f388
15658c21616M2104a18413j9767R647K741e3611A32367J65310G8892K3738l8085
15647F4545B0269d15195A4361J57992O2736p9139i7619H6385f2549k7350j15400
15636b05299b4389j42600K1632B49443B5137O4146J01883a16081a7231o3334D9784
15624E1315a61006e8007j54609f1112G1246L6562k2877j8021c8408A10249G14
15612c03708J40311A75409q7266c9715A55928d8469D3792J10195b92860O7950
15602b24910B0007b50617a8043A0502a57714C0461K3192f8434b5859g977B9962
$$ y = [332352, 358026, 227477, -45893, 61479, -120043, 328935, 273504, -52638, -235017, -39355, 70949, -89127, -153595, 138539, 47577, 70351, -297829, 21373, -11939, -99017, 313118, -100519, -6388, -321616, -279512, -118413, -138180, -128533, -125792, -53611, 132367, 297677, 78892, 102630, 64545, 20269, -415195, 14361, 172353, 235089, 155950, -97619, 86385, -62549, -89899, -205299, -24389, -166989, -145357, 249443, 25137, 89283, 191166, -116081, -17231, -80565, 49784, 51315, -161006, -58007, -212616, -61112, 71246, 107808, 84931, 66910, -38408, 110249, 714, -303708, -163397, 175409, 88143, -39715, 155928, -48469, 43792, 153987, -292860, -224910, 20007, -250617, -18043, 10502, -157714, 30461, 53653, -68434, -25859, -7977, 29962]
15590G5686b88402A8720O1838J35923B1295b0252p8594j13886d7910b1629F5740
15578B11712c30524D1636J17478a08567n3571B13043E5501A9183b9714B71413
15567B86383j26459N4315l7407i2097B47435M484c5522l0816c959A55782a56453
15555c23826f8133b4841q4044A05370a74419A61356o3060N4900D0970d54551C02923
15543a28157B7961M05291b2519j07597j48095B40241o3026p5994j001b94586g4499
15531i0899B1578a42043B24652j02471J09190l2568r6725a56729B34a46128i884
15519i2305D4817L58018g7526A7038a64864A03976g5124k48978i3070m9005A33109
15507b24437f8186j14360D3573J34709b63895a08015C0029c04625b3745q5989
$$ y = [75686, -288402, 18720, 80558, 216481, 21295, -20252, -98846, -212732, -47910, -21629, 65740, 211712, -330524, 41636, 159114, -108567, -162138, 213043, 55501, 19183, -29714, 271413, 286383, 159924, 214239, 176832, -92097, 247435, 251919, -35522, -66338, -3959, 155782, -156453, -323826, -68133, -24841, -108885, 105370, -174419, 161356, 98296, 153196, 40970, -454551, 302923, -128157, 27961, 433252, -22519, -130116, -278211, 240241, 177215, 101221, 100220, -294586, -74499, -90899, 21578, -142043, 224652, 122181, 231371, 198803, 102078, -156729, 234, -146128, -9884, -92305, 44817, 402835, -77526, 17038, -164864, 103976, -75124, -324102, -93070, -142075, 133109, -224437, -68186, -182546, 43573, 178282, -263895, -108015, 30029, -304625, -23745, -109734]
15497a09734b3305G0631J39970B9655J06388J56950A18464c58644C10564j25262
15487A85302b06787f5788E13424a88961M4007n3806A36008J43684D3650a98309
15476B72148C8319a424j62979f1584e657l19918A27933f4020p5661A57600D7783
15464A32337b77311f4302m8671A76910M0385b49513d4202p1015H5777K70832A29026
15452b9180F5420J40124o6188a25819I8433B5934h5467b3046a118l24870B05510
15440B23162A02537J8586L7016b8401h262l10282A0957J48026G5471a6273A92732
15428B40534o1200O5897c55344g4422j24572I1708O7865M7459F1476R164J47825
15417B18465c1453k64382F2965b47272P0138k6778C7588M0567a43539A78526a3319
$$ y = [-109734, -23305, 70631, 210601, 29655, 136043, 292993, 118464, -358644, 310564, 185302, -206787, -65788, 513424, -188961, -144954, -198760, 136008, 279692, 43650, -198309, 272148, 38319, -1424, -164403, -61584, -5657, -325575, 127933, -64020, -139681, 157600, 47783, 132337, -277311, -64302, -112973, 176910, 217295, -249513, -44202, -115217, 85777, 356609, 129026, -29180, 65420, 205544, 139356, -125819, 98433, 25934, -85467, -23046, -1118, -325988, 205510, 223162, 102537, 121123, 158139, -28401, -8262, -318544, 10957, 158983, 75471, -16273, 192732, 240534, 179334, 245231, -355344, -74422, -198994, 91708, 159573, 207032, 61476, 70640, 218465, -31453, -295835, 62965, -247272, -177134, -203912, 37588, 78155, -143539, 178526, -13319]
15405B75729I8346J2225a5581A33586K9930c4767G4048b13873d2070C19008H6484
15393a09718B43183b78849d9599A08294J4010D3671b38791d5614n9279j7844N9966
15382f2771k5473l5383c9984B05748n6116Q5481g0281A16137a70012A6706h3135
15370d1561j04912b0408F2083K61289c78182a83418O3195q703j50829K1668A21369
15358C8798l70b05220I507a67275A8428J7005a67746A43634j2823o2659K7513
15347I5665b08346a715k81628A5639a27988A79234c5383G640c4186B85383b570
15335f8797j32976B74462G7915C1920b25807B7336a80377k5558B23816b12491
15324c02356A1460c61298g4474K467A21467k1781J51883r876G3432h4089D9854
$$ y = [275729, 98346, 110571, -15581, 133586, 163516, -34767, 74048, -213873, -42070, 319008, 86484, -109718, 243183, -278849, -49599, 108294, 122304, 43671, -238791, -45614, -104893, -122737, -62771, -88244, -123627, -39984, 205748, 149632, 235113, -70281, 116137, -170012, 16706, -83135, -41561, -146473, -20408, 62083, 323372, -378182, -183418, -120223, -128926, -279755, -258087, 121369, 38798, 38428, -205220, 9507, -167275, 18428, 35433, -167746, 143634, 130811, 68152, 95665, -208346, -1715, -283343, 15639, -127988, 179234, -35383, 7640, -34186, 285383, -2570, -68797, -201773, 274462, 77915, 31920, -225807, 27336, -180377, -205935, 223816, -212491, -302356, 11460, -361298, -74474, -72007, 121467, 99686, 251569, 241693, 73432, -84089, 49854]
15312a17739H467d6171I8749a06185d119A45520D8090J11033B8956b44509C28692
15300d2051A59810a79295A2207K7486j537c21372d0422a0342B90402b48449A60140
15288e0012E715J96726Q770o8132K97659c4864B64377h8096B41944j18531J37766
15277B61179f4277i013A04528Q307K70855A58940a71309B03616A5779d7151F7859
15265e7123E2388N11579k71659h0440A21259A7379J39898I089a20832L0191M3797
15254d6844A35500L75257a7439B29410j87M88446k02218M64457j15001M15939
15244A280846R6070B73063A0936M02922c92785A87707a3542o7454F3999B9564
15233C54070j55173d9777C59376O716j23196B4930N8587l7134J46250b00152I0011
$$ y = [-117739, 8467, -46171, 98749, -106185, -4119, 145520, 48090, 159123, 28956, -244509, 328692, -42051, 159810, -179295, 12207, 39693, 38156, -321372, -40422, -10342, 290402, -248449, 160140, -50012, 5715, 202441, 211211, 143079, 440738, -34864, 264377, -88096, 241944, 123413, 261179, -64277, -9013, 104528, 112835, 383690, 158940, -171309, 203616, 15779, -47151, 67859, -57123, 52388, 563967, 292308, -80440, 121259, 17379, 157277, 9089, -120832, -90641, -46844, 135500, 510757, -17439, 229410, 229223, 717669, 515451, 979908, 864907, 1280846, 1376916, 273063, 10936, 413858, -392785, 187707, -13542, -80996, 63999, 29564, 354070, 198897, -49777, 359376, 366092, 242896, 24930, 83517, 46383, 192633, -200152, 90011]
15221B30047L3990J323R5959m0672i4276A22588r403O2594J26764B4081a40124
15209B28261A8682e9863l54209I694a169B21759j03678B0795e5180k65798B88395
15197A33209B3293K5441O5554Q9855I2809L809a16120B68204q4415a1383j9889
15186c1272A86447G5536P6127a21012A81377e4527A35876l5522e5870A63400C1188
15174B2862L08588B3707J29509E4424O3045J5068n5912a51761M5875G6314N5833
15163A32147B6760J1908b3961k2994A17717Q7056A2676h5780A13443D4137J8184
15152F2321a54574l4128d3253A49058r709f9475A18187L07382A29068P3987E1832
15140A17903L91974C6645K81704G0696M1042J23490R0799J9524j61549J3276b3701
$$ y = [230047, 264037, 265360, 361319, 320647, -94276, 122588, 113185, 175779, 302543, 24081, -140124, 228261, 18682, -59863, -414072, 9694, -1169, 221759, 118081, 20795, -55180, -320978, 288395, 133209, 23293, 48734, 114288, 204143, 92809, 96618, -116120, 268204, 183789, -11383, -31272, 186447, 75536, 151663, -121012, 181377, -54527, 135876, 100354, -55870, 163400, 31188, 22862, 331450, 23707, 153216, 54424, 117469, 132537, 76625, -151761, -105886, 76314, 132147, 26760, 38668, -23961, -46955, 117717, 204773, 12676, -85780, 113443, 44137, 62321, -154574, -188702, -43253, 149058, 139349, -69475, 118187, 425569, 129068, 203055, 51832, 117903, 509877, 36645, 318349, 70696, 111738, 235228, 326027, 345551, 184002, 197278, -23701]
15128E1492L10148A30705K32686G7933B6453P7847P5226D1288L25622B3652Q9825
15117A13477K35982b13197n790e8175E46211b0743B17738k7632N060Q428N7538
15106B61132n3645G0074K90651O1025A05004b08954A47018K6081e5085p1851B83671
15094a74215K2620C36021d6175B84102a26272A27376a93604F0682R5679P8527
15084B34888K741O312M8042A35316f1310B57104D7765M4548L434R2284r0236b49652
15071B61102L592j24365J6920j0896a30319K2967G9312g9187A59292n1341K98041
15060D05992c5219l9061E8873K10629J24003P0381J2191l8145G2767a05459C17382
15048B72015j33621L88666B59609e1139B31977m6138p593q7849A1287R7975D0871
$$ y = [51492, 361640, 130705, 363391, 77933, 26453, 104300, 179526, 41288, 366910, 23652, 113477, 349459, -213197, -218987, -58175, 546211, -20743, 217738, 190106, 195166, 203594, 261132, 207487, 70074, 360725, 421750, 105004, -208954, 147018, 173099, -55085, -126936, 283671, -174215, -151595, 336021, -46175, 284102, -126272, 127376, -193604, 60682, 156361, 234888, 237629, 243941, 291983, 135316, -61310, 257104, 47765, 92313, 95747, 188031, 97795, -249652, 261102, 264694, 140329, 157249, 146353, -130319, -107352, 79312, -79187, 159292, 107951, 405992, -35219, -74280, 58873, 269502, 393505, 463886, 476077, 437932, 72767, -105459, 317382, 272015, 138394, 527060, 259609, -51139, 231977, 185839, 178246, 90397, 11287, 109262, 40871]
15036C31942L7035J0533j19325p2489n8200a55799A14242d6768B82524A27291
15025B01082a30149f024j70025e4505J3312A59864K15773C4849K35782J6150m0093
15014B46688F371J8700L0508b13918H4682M62813g9821D03528j08313q077n2617
15003B34521k1873B5054Q3798i2846D77048B29343M4882a43954G2534J60676J51844
14992C85054p4796K36369g9594B22427J06155O1226j71205A06259J26823e5804
14981C30753q8156p1194J5585P110m3859J01163A14083M82430B49924J02506K7629
14970C80059R8896A23534J4680n8712K2574L34881D9679L84947c1864C79253A63964
14958A58126L00216C7914N77316e9728A80171M2450J75666O6697B25868h2616
$$ y = [331942, 368977, 379510, 260185, 187696, 129496, -155799, 114242, -46768, 282524, 127291, 201082, -130149, -6024, -176049, -54505, -41193, 159864, 375637, 34849, 270631, 286781, 246688, 6371, 25071, 55579, -213918, 84682, 547495, -79821, 403528, 295215, 287138, 234521, 212648, 25054, 108852, -92846, 477048, 229343, 274225, -143954, 72534, 233210, 385054, 310258, 546627, -79594, 222427, 328582, 389808, 218603, 106259, 233082, -55804, 330753, 242597, 171403, 186988, 194098, 150239, 251402, 114083, 596513, 249924, 352430, 380059, 478955, 123534, 138214, 79502, 102076, 436957, 49679, 434626, -31864, 379253, 163964, 158126, 458342, 37914, 615230, -59728, 180171, 222621, 398287, 464984, 225868, -82616]
14947H2139L14730j59421J90326k00897A05136N44051b3213C70521K9756a10191
14936E07900j84919K62646A46980R8935K84929k01082j45573K44283j51012j10290
14926A67170J73356k3320a85952A19001N789M9628J98157A10187n2735M35181
14916D92633j56883l1767J90046A45636R0348P12727D60495R0061k68445K84798
14906E66909A87830n6506M117L15528j64948A32775N0452J69245k0874j00801
14896B30797J30546J40997o6963A70451J83737A36748J03326P5320A20989g652
14885E95548G7149J38586J06521p2193n6130J26289q7480C7861K16050p8862K07034
14874C82083K30037k50498P343J63935L8909r3159n3969j28859J28129J25983
$$ y = [82139, 396869, 237448, 427774, 226877, 105136, 649187, -23213, 370521, 400277, -110191, 507900, 322981, 585627, 146980, 245915, 530844, 329762, 184189, 428472, 277460, 167170, 340526, 317206, -185952, 119001, 124790, 174418, 372575, 110187, 57452, 492633, 335750, 303983, 494029, 145636, 235984, 948711, 460495, 550556, 282111, 566909, 187830, 131324, 135441, 450969, 286021, 132775, 183227, 352472, 331598, 230797, 361343, 502340, 435377, 170451, 354188, 136748, 240074, 315394, 120989, -7652, 595548, 77149, 215735, 322256, 250063, 193933, 320222, 232742, 37861, 253911, 175049, 382083, 612120, 361622, 368965, 532900, 571809, 478650, 424681, 295822, 423951, 549934]
14864E49934l4900B17533J44210K25970A78872K63938A97098K49527b9417C75757
14853B43423J23344j55184L78147j93613A43095Q2760j12892N39972j87538o9753
14843C95644J1379l0172K03889o9387m9294o391n9553K06728B41829M57390j31787
14832E67432B78728J38620L2676L13157l55253O1418c6288F79343k70366j0699
14822C98278K28824j65427L6749k09856K41047B37364N01730j90881j22501J11540
14812E37252P449J73253k25493j96638l0673L33782k43598J35937J79433K4586
14802F95290K27159m55796K50948j8995l38650K59762k2817j28578J2342L03587
14792G84252l282l05133J70848K66086m52834j5262J60238K40326l65598L52943
$$ y = [549934, 515034, 217533, 361743, 587713, 178872, 442810, 197098, 446625, -29417, 375757, 243423, 366767, 211583, 589730, 396117, 143095, 225855, 112963, 652935, 465397, 395644, 407023, 376851, 580740, 511353, 462059, 455668, 396115, 602843, 241829, 699219, 567432, 278728, 417348, 450024, 763181, 407928, 469346, -36288, 679343, 408977, 398278, 627102, 461675, 498424, 288568, 529615, 237364, 739094, 548213, 425712, 537252, 544701, 717954, 492461, 295823, 265150, 598932, 355334, 491271, 670704, 695290, 922449, 466653, 717601, 698606, 359956, 619718, 596901, 468323, 480665, 784252, 780970, 475837, 646685, 912771, 459937, 444675, 604913, 845239, 479641, 832584]
14782H32584j80015n2330K88412o1444C42646L59939R2479C32374N13347j12953
14772G32768k45348K74348k72055M3291k4835K09921j36653J4016J30695k4669
14762G01479K01797C08728L24374K21480m03839J42897K18617k39179K5721L264
14752F02063J03066l21324R9529K44O1253j9727K84934L4780J90948m64080J19160
14741F90846j08635l1610K30276k63320k3886J29781J2840N2758N2633p4841k28778
14730D38064L64372j62328r1242j3634K81204P8349C66501K83936P970K63451
14720I21858k72831J37443K76899m02495L39117m79122j3169L9178N11655O5275
14710A123808p9822k82644j63379R3792J49502m6150j1019l0706N727k57264K87898
$$ y = [832584, 652569, 600239, 888651, 827207, 342646, 702585, 795064, 332374, 845721, 732768, 487420, 761768, 489713, 533004, 508169, 718090, 581437, 595453, 726148, 701479, 903276, 308728, 633102, 854582, 450743, 593640, 812257, 573078, 598799, 602063, 705129, 383805, 483334, 483578, 544831, 525104, 810038, 844818, 1035766, 571686, 690846, 582211, 550601, 780877, 517557, 493671, 623452, 636292, 689050, 741683, 666842, 438064, 802436, 640108, 548866, 535232, 816436, 894785, 366501, 650437, 658407, 921858, 649027, 786470, 1063369, 660874, 999991, 520869, 507700, 546878, 1058533, 1123808, 1043986, 761342, 597963, 691755, 841257, 795107, 784088, 753382, 759109, 501845, 789743]
14699G89743J88680k03740O7542k11652j2359J40966J03692q3801p3196K59272
14689I65147l6068l16289L70298j71261J8977J96253k11782L02952l78560M52548
14679A192215l36783J29653K54144m25519J21167M0343Q7356K11899l23494K1771
14669I72752j20788K27415k90320M73548k60937J47471p8027L8132n7857j92919
14659H58470M8516J94956J82409j53925P5162J56685l67184n9844M03520m65923
14649H72842M62444k17445j04318K85341j61855k24220K42126K5371O7641M4519
14639A292446K1696l38330Q2633K55813j56232p048R2362M0299j72352K98442
14629A409729n9324l1958k25034J57692p2901K11460j8094q0972K02262r4634
$$ y = [789743, 978423, 774683, 842225, 630573, 618214, 759180, 862872, 779071, 705875, 965147, 929079, 612790, 983088, 811827, 830804, 1027057, 815275, 1118227, 739667, 1192215, 855432, 985085, 1239229, 813710, 934877, 975220, 1062576, 1274475, 950981, 972752, 851964, 1079379, 789059, 1262607, 1001670, 1149141, 1071114, 1109246, 1051389, 858470, 906986, 1101942, 1284351, 1130426, 1205588, 1362273, 995089, 935245, 1338765, 872842, 1335286, 1117841, 1013523, 1298864, 1137009, 912789, 1154915, 1180286, 1247927, 1292446, 1314142, 975812, 1058445, 1314258, 1158026, 1150978, 1243340, 1283639, 1111287, 1409729, 1350405, 1318447, 1093413, 1251105, 1178204, 1389664, 1371570, 1290598, 1492860, 1398226]
14619A398226j34578O1051L4897K34206n3759l17500J86231Q7200r255j00754
14609A385965k31563L37485K03696k17422k24825L83196j83742K92084k16668
14600A528206J1736k77885L52870R4762L2002r6592K9109m3002p5848J28442j5747
14589A668053J34737K50803l39793q64M874j20032N18238l79319Q4974J72093
14579A993764m76350L94993R1391j76106j91313M18564j64600J59802j29422K60476
14569B181199k53320R3739K23549J83393J0696j65031K58835k79481J71904j35495
14559B289988J66310M50927N27182l35178l2621J59027P3050O24909O65640R16681
14549E505915J604147L509659Q370055K0358652N753809A9612037H506523C958448
$$ y = [1398226, 1263648, 1324699, 1359596, 1593802, 1540043, 1222543, 1408774, 1495974, 1486719, 1385965, 1154402, 1491887, 1695583, 1478161, 1253336, 1636532, 1452790, 1744874, 1528206, 1539942, 1262057, 1614927, 1709689, 1741691, 1645099, 1674208, 1631206, 1555358, 1683800, 1668053, 1802790, 2053593, 1713800, 1712936, 1717810, 1597778, 2116016, 1736697, 1821671, 1993764, 1517414, 1912407, 2003798, 1827692, 1636379, 2054943, 1890343, 2050145, 1920723, 2181199, 1927879, 2021618, 2245167, 2428560, 2439256, 2274225, 2533060, 2253579, 2425483, 2289988, 2456298, 2907225, 3434407, 3099229, 3066608, 3225635, 3298685, 3923594, 4589234, 5505915, 7110062, 10619721, 18989776, 39348428, 45102237, 19612037, 8506523, 3958448]
14540B405615j42812k38987k26206J45051M13588j58521j12607j65990J70825
14531B089956o3620K13199j02385K5273J19571k77188m8708O4845p677K05808
14521B219074O8518J87076l8347j59268K10106M8004K19174j64539j05134j19702
14511B364962N05057j97686K26926k41142J84006M1164l16798J12846L02806p9727
14501B902414Q9828j85984K0506L30315k58397M74478j13480j86689K59978K9819
14491C362788j44926K59537m8614L2913n0705l94821P04919o4273R8400k92928
14481C462290J70286M21373r5962j85323k71539K21684N3542N9466m4583P1884
14471C863118J62581l5187J23228K1465J08316Q4928J52026P0065l26487Q5024
$$ y = [2405615, 2262803, 2023816, 1797610, 1942661, 2356249, 2197728, 2085121, 1919131, 2089956, 2026336, 2239535, 2137150, 2162423, 2281994, 2004806, 1956098, 2020943, 2013266, 2219074, 2287592, 2474668, 2436321, 2277053, 2487159, 2535163, 2754337, 2589798, 2484664, 2364962, 2870019, 2672333, 2899259, 2658117, 2842123, 2883287, 2566489, 2679335, 2982141, 2902414, 2992242, 2806258, 2826764, 3157079, 2898682, 3373160, 3259680, 3072991, 3332969, 3362788, 3217862, 3477399, 3428785, 3461698, 3410993, 3016172, 3721091, 3656818, 3755218, 3462290, 3632576, 4053949, 3957987, 3772664, 3501125, 3722809, 3776351, 3835817, 3791234, 3863118, 4025699, 3990512, 4113740, 4135205, 4243521, 4328449, 4480475, 4550540, 4224053, 4309077]
14461D309077L43637j10856l6133J30438O5492J97005J81597l66567O9318J57279
14451D940287j77606J47017J74468l1749K90820M0594p3726m756K68095K73386
14441E846830l01058L70831k84230L24885k70558L43095l0043M22683O5527k91616
14431F196346M59265k74309k3069K20681K48990k24160L66442P6344k8572J58568
14421G176526R2604L22229l24466L32651j5009L02482J40733r6845K76265N0079
14411H257249J72778K11593K9559j7321L89910J8119K798R0539L81475J48851
14401I685550L74245l28228O33834r1877l4929N27715m9236J18735M80241J7972
14391A1334022o4646O59740Q4962K86174k17956L75161J27544P6875O84147L34804
$$ y = [4309077, 4652714, 4541858, 4505725, 4636163, 4701655, 4898660, 5080257, 4713690, 4783008, 4940287, 4762681, 4909698, 5084166, 5052417, 5343237, 5383831, 5310105, 5305349, 5573444, 5846830, 5545772, 5916603, 5632373, 5957258, 5686700, 6029795, 5999752, 6422435, 6487962, 6196346, 6655611, 6381302, 6358233, 6578914, 6827904, 6603744, 6970186, 7046530, 7017958, 7176526, 7269130, 7591359, 7266893, 7599544, 7584535, 7887017, 8027750, 7930905, 8207170, 8257249, 8430027, 8641620, 8671179, 8653858, 9043768, 9061887, 9064685, 9155224, 9536699, 9685550, 10059795, 9731567, 10365401, 10273524, 10238595, 10766310, 10717074, 10835809, 11316050, 11334022, 11269376, 11929116, 12014078, 12300252, 12082296, 12457457, 12585001, 12661876, 13346023, 13680827]
14381A3680827J04345K36508J95799K52283M54778K88934J08415L00283P4304
14372A5696476N83569J04960O69217J88553L29874J47775M00773K43265M63382
14363A8827844P37456L79548M90457P8351N59334M71629L12291P01335Q54501
14354B3412746M97179K56364N37450P69395N11101Q03694O63633N36285P99232
14345B8787079J021254N79292Q22430O90597J043944R78179O47989J060537J400007
14336C7031308O66577J287240P19122J257512J363042J106140J759754J269594
14328D6460289J706379Q75036K105077J871117J816776J947339J772358K045443
14320F0599814K249176K124280K621657K509416K697893K998557K978429L082915
$$ y = [13680827, 13785172, 14021680, 14217479, 14469762, 14924540, 15213474, 15321889, 15622172, 15696476, 16280045, 16385005, 17054222, 17242775, 17572649, 17720424, 18121197, 18364462, 18827844, 19565300, 19944848, 20435305, 20513656, 21072990, 21544619, 21856910, 22558245, 23412746, 23909925, 24166289, 24703739, 25473134, 25984235, 26787929, 27451562, 27987847, 28787079, 29808333, 30387625, 31210055, 31900652, 32944596, 33922775, 34570764, 35631301, 37031308, 37697885, 38985125, 39704247, 40961759, 42324801, 43430941, 45190695, 46460289, 48166668, 49041704, 51146781, 53017898, 54834674, 56782013, 58554371, 60599814, 62848990, 64973270, 67594927, 70104343, 72802236, 75800793, 78779222, 81862137]
14312H1862137L513334L169752L958127L565184M148770L714794N008018M298318
14304A13238434N397003N393632N532447O021750O881968O559730O926483P846711
14296A63798158Q172033Q037565R352844R685295R959866J0270090J1162008J1526502
14288B41964361J1978530J2303259J3431114J3259207J3670524J4074156J4364470
14281C35045621J4305210J3931174J3952019J2930571J2877992J1335853J0263310
14274D24641750Q553923M892842J363672j09681K08232m86897n632916l632772
14266D29798153o684227q590827j0480389j2883838j3839392j4442013j4795689
14259C48081778j5452821j4852260j5030470j4926272j3463438j3274750j3102445
$$ y = [81862137, 85375471, 88545223, 92503350, 96068534, 100217304, 103932098, 108940116, 113238434, 118635437, 124029069, 129561516, 135583266, 142465234, 149024964, 155951447, 163798158, 171970191, 180007756, 189360600, 199045895, 209005761, 219275851, 230437859, 241964361, 253942891, 266246150, 279677264, 292936471, 306606995, 320681151, 335045621, 349350831, 363282005, 377234024, 390164595, 403042587, 414378440, 424641750, 433195673, 438088515, 439452187, 439342506, 439550738, 439063841, 433430925, 429798153, 423113926, 414523099, 404042710, 391158872, 377319480, 362877467, 348081778, 332628957, 317776697, 302746227, 287819955, 274356517, 261081767, 247979322]
14252B47979322j2546317j1600807j1254315j0839822r696546r894406q600749
14245A73546360q656479p611710p634997o866707o803456o622000n683964n014119
14237A18652928m817247n563370m596815m460692l728317m267554l160363l639736
14229H4418834l458210l117383l159403k603688k743696k768472j970571k311786
14221F2285625k632902j459073k164678k298784j413303j572455j827764j328296
14213D7588370j276175j576184j434102j322238j090799j087122j020221j007962
14205C7773567j193404j045942j169351n39508q73788p02272j253321o09740j020550
14196B9365691n92055q86070m00642p13013o40724p06456o16523o98433l68637
$$ y = [247979322, 235433005, 223832198, 212577883, 201738061, 192041515, 182147109, 173546360, 164889881, 157278171, 149643174, 142776467, 135973011, 129351011, 123667047, 118652928, 113835681, 108272311, 103675496, 99214804, 95486487, 91218933, 88058570, 84418834, 80960624, 77843241, 74683838, 72080150, 69336454, 66567982, 64597411, 62285625, 59652723, 58193650, 56028972, 53730188, 52316885, 50744430, 48916666, 47588370, 46312195, 44736011, 43301909, 41979671, 40888872, 39801750, 38781529, 37773567, 36580163, 35534221, 34364870, 33825362, 32951574, 32249302, 30995981, 30386241, 29365691, 28773636, 27887566, 27486924, 26773911, 26133187, 25426731, 24810208, 24111775, 23743138]
14187B3743138o95358o97852n89647j60665o32067n32691k79242j77215p98562
14178A9179839n50666j76334l58604m01245l91182l89595j84396m04292k32143
14169A6091382l31550j28040m61935L550n98723k1310k05510l35154m54461l07187
14159A3251062j74017j33031j33141J12430n65976k58164l09306j43885j87824
14150A1458148l33215K08582l17711k31244O9400m14341N5253k81526l67360J83075
14140A0029061j71220k25240n56449K33146k27422k9195m63649j73130r931J96543
14130H602514n02041M80912j79054k26459o8558k91725n4785l74845Q3601K0486
14120G490046o0521k85838Q1345k3037m28878N6518J08160l50280j18253r327
$$ y = [23743138, 23047780, 22349928, 21760281, 21599616, 20967549, 20434858, 20155616, 19978401, 19179839, 18629173, 18452839, 18094235, 17692990, 17301808, 16912213, 16727817, 16323525, 16091382, 15759832, 15631792, 15169857, 15173407, 14574684, 14553374, 14347864, 14012710, 13558249, 13251062, 13077045, 12944014, 12810873, 12923303, 12357327, 12099163, 11789857, 11645972, 11458148, 11124933, 11333515, 11015804, 10784560, 10853960, 10439619, 10494872, 10213346, 9845986, 10029061, 9857841, 9632601, 9076152, 9309298, 9081876, 9052681, 8589032, 8415902, 8405971, 8602514, 8100473, 8581385, 8402331, 8175872, 8107314, 7815589, 7760804, 7385959, 7469560, 7490046, 7429525, 7143687, 7225032, 7201995, 6773117, 6829635, 6937795, 6587515, 6469262, 6459935]
14110F459935J92823n4339m62820J01390m62565L69388l40154M0475J51469k71255
14100E724347O0251n47893J95804K00487k20586m9990k61058J9120J1705r9244
14090E032943k50119L40635l38225K33094j36982J04968k79186L23572l56438
14081D674262N9628m18092L86128m17990J34811k15813L17101o4014r3844j43914
14071D218263m06023L34713j72331l54472L56828j7635j35137j54904P4033n554
14061C737781j36908L76548j61350k14551R6808O8388N5154l67268J66634k04624
14051C416612j88486P9767j3532L0637q7880k71465N046K42828j45440j50642
14041B917445l16868M35164j6143K5500k6800j43218P9123k69718K35022M2521
$$ y = [6459935, 6652758, 6598419, 6135599, 6236989, 5774424, 6143812, 5803658, 5844133, 5995602, 5724347, 5784598, 5236705, 5432509, 5632996, 5412410, 5362420, 5101362, 5120482, 5132187, 5032943, 4782824, 5123459, 4785234, 5018328, 4881346, 4986314, 4707128, 5030700, 4674262, 4733890, 4315798, 4701926, 4283936, 4418747, 4202934, 4520035, 4456021, 4362177, 4218263, 3812240, 4146953, 3974622, 3620150, 3976978, 3959343, 3824206, 3669302, 3743335, 3737781, 3600873, 3977421, 3816071, 3601520, 3698328, 3766716, 3821870, 3454602, 3621236, 3416612, 3228126, 3307893, 3294361, 3324998, 3237118, 2965653, 2970699, 3213527, 3068087, 2917445, 2600577, 3035741, 3019598, 3045098, 3018298, 2875080, 2954203, 2684485, 2919507, 2962028]
14031B962028q7543m13483J63456J34788K88308l64909l30771J61724j70443M5490
14021B388645j21175L67243j55392k05248L97074m03411K74435J48782l19652
14012B371301J25153l91127L47118l41110j89925M41294l42052j99315M66880
14003B288217m50766L76550J7068l84730k54999K36454L08550J68282l70158j69121
13993A765347L53105o8144J48982q7006J096802K449683O505725J8667800J6916416
13984D7748710k3744401A1713264m669815k048909o32101r32662Q6996k21847
13976C294926m12376r3019k78701J9196k00402L82316l70136j46194J01849J33748
13966B431207m52732K32633j79992P0817j28251r4292k8207J77770R8439k52728
$$ y = [2962028, 2874485, 2461002, 2624458, 2759246, 3047554, 2682645, 2351874, 2513598, 2343155, 2388645, 2267470, 2634713, 2479321, 2274073, 2671147, 2267736, 2542171, 2690953, 2371301, 2496454, 2105327, 2452445, 2111335, 1921410, 2362704, 2020652, 1821337, 2288217, 1837451, 2214001, 2231069, 1846339, 1591340, 1827794, 2136344, 2304626, 1934468, 1765347, 2118452, 2050308, 2199290, 2112284, 3209086, 5658769, 12164494, 30832294, 47748710, 24004309, 11713264, 7043449, 4994540, 4362439, 3429777, 3516773, 3294926, 2882550, 2789531, 2510830, 2530026, 2329624, 2711940, 2341804, 2195610, 2297459, 2431207, 1978475, 2211108, 2031116, 2101933, 1973682, 1879390, 1851183, 2028953, 2127392, 1874664]
13956A874664m3141P8214j74988K59081L0512Q887j95433k41588J30172l45770
13946A380610P43285m26705J83730k893j82876O1454k13196K51771n8211q4450
13936A652519J11502l57298L55603k30982j45706K7670o16K28219n4036J6258
13926A603133r3758j90883P4039K79055k81031J13874j90102Q4756m6883J04209
13916A456409p7169J58468j11296L64686n65365L51701m08143K17704M527L9234
13906A430756K2535j40041n56557N81149j50545J01677l66260K81872L86500m83558
13896A107528K15048k99078M08278n17057N16690l15334k33713J44414K3015r5786
13886I54005J61178j16860J09580j43518K83425k05802J75044k71106k67364M59082
$$ y = [1874664, 1831523, 1909737, 1734749, 1993830, 2024342, 2033229, 1837796, 1596208, 1726380, 1380610, 2123895, 1697190, 1880920, 1878027, 1695151, 1756605, 1543409, 1795180, 1736969, 1652519, 1764021, 1406723, 1762326, 1531344, 1385638, 1413308, 1412692, 1640911, 1586875, 1603133, 1509375, 1318492, 1392531, 1671586, 1390555, 1504429, 1314327, 1399083, 1352200, 1456409, 1379240, 1537708, 1426412, 1791098, 1225733, 1577434, 1169291, 1386995, 1391522, 1430756, 1453291, 1313250, 756693, 1337842, 1187297, 1288974, 922714, 1204586, 1591086, 1107528, 1322576, 1023498, 1431776, 914719, 1431409, 1116075, 882362, 1026776, 1049791, 954005, 1115183, 998323, 1107903, 964385, 1247810, 1042008, 1217052, 945946, 678582, 1137664]
13876A137664p568Q5500R017K35396l73257M9785k64912L81112k15852l79519
13866F57366K61660j07393o3340L55181k33220J83510k19233J5839J52226j34290
13856H68306J97073k75912J06183K33709j61976J3842k41862j00901N13348k01082
13846I50728m1886m1985r2789P2350Q4777n930j17236J86029q7647J99462j59391
13835I46482K14392l58833J26658l02147N63236k50649Q5947N8383o8114k28451
13825G86904o4392J35676m6345M0015j040k3715k36465N7085J11302k7970L38639
13814A069694k68279j06866Q2460K55910m74354K80010J33368j26305k45429J34084
13804G34293n3251j94516O10803A98722Q3777M63344j38454J84304C37049L49622
$$ y = [1137664, 1130096, 1215596, 1224613, 1460009, 1086752, 1136537, 871625, 1252737, 1036885, 657366, 919026, 811633, 748293, 1103474, 870254, 1053764, 834531, 850370, 1002596, 868306, 1065379, 789467, 895650, 1129359, 967383, 981225, 739363, 638462, 1151810, 950728, 908842, 866857, 774068, 846418, 931195, 925265, 808029, 994058, 906411, 1105873, 946482, 1160874, 802041, 928699, 626552, 1189788, 939139, 1025086, 1083469, 1015355, 786904, 722512, 858188, 811843, 851858, 850818, 827103, 590638, 647723, 759025, 731055, 1069694, 801415, 694549, 777009, 1032919, 558565, 838575, 971943, 845638, 600209, 734293, 681042, 486526, 1097329, 198722, 282499, 745843, 607389, 791693, 337049, 686671]
13794F86671m241r0049k55665L19752K1920j8950j31001J9918J36435l31569K35557
13783E88778o0252L16482D00936L28933r0330J4956L6270M20980k96043j88441
13773F27261K28156l79837O2403R299J95253l06845k050L93597j48014j47494
13763E31729j72564K17717J0731J70406m0221J54738l62889L66539D21628K70874
13753F92502j44074l1155k22007J88835K87661K3027j38960j30362J81298r1365
13743F15400J33300m1989q1663j95245O2010n582l1970K63670k98141L21392k75161
13732D66021J08211M0635j24890L21720C68484J05508J27557q4853r7469k07128
13722B12099K65760j24337j7861M4734K92247B90031J91992J14373P2280k41500
$$ y = [686671, 682430, 592381, 336716, 656468, 678388, 659438, 528437, 548355, 684790, 353221, 588778, 528526, 845008, 400936, 729869, 639539, 654495, 690765, 1111745, 815702, 627261, 855417, 475580, 537983, 547282, 742535, 435690, 433640, 827237, 679223, 531729, 359165, 576882, 587613, 758019, 717798, 872536, 509647, 876186, 421628, 692502, 548428, 517273, 295266, 484101, 771762, 794789, 655829, 525467, 706765, 615400, 748700, 706711, 625048, 429803, 491813, 486231, 454261, 717931, 419790, 741182, 466021, 574232, 614867, 489977, 811697, 368484, 473992, 601549, 516696, 419227, 212099, 477859, 353522, 335661, 380395, 672642, 290031, 482023, 596396, 668676, 427176]
13712D27176N40426A98305L33680M1745B27341L22608M4650q1314j17717K97231
13702F92799A76459K85302n6939K30742j29460q4691N3018j14573J382J84219
13692E45459B51254K96703A55594M53537j59242J73079m1885q2695K00635j72060
13682E26963l5802H5717N91394N7123k82209K24498k57181J4993k12063K95028
13672E17300P3125j17244P6381B03764K41036J6702j98819o816K99800k31988
13662C23679J89457k46782K72350k58906L27857p8853j12469J00809B12958p7526
13652A35432O41984k38599m7482m7974j77062K99117k79102O2107M6212j17754
13642B76879O8824A54118M34130j16998k35152J8049L07239B13165l1862L21881
$$ y = [427176, 967602, 198305, 531985, 573730, 227341, 549949, 594599, 513285, 395568, 692799, 176459, 461761, 404822, 635564, 506104, 421413, 474431, 359858, 361240, 545459, 251254, 547957, 155594, 609131, 449889, 622968, 581083, 498388, 699023, 526963, 491161, 85717, 677111, 734234, 452025, 676523, 419342, 434335, 222272, 517300, 590425, 473181, 549562, 203764, 444800, 461502, 262683, 255867, 555667, 323679, 513136, 266354, 538704, 279798, 607655, 528802, 416333, 517142, 212958, 135432, 777416, 538817, 491335, 443361, 266299, 565416, 286314, 348421, 394633, 276879, 345703, 154118, 588248, 471250, 236098, 254147, 561386, 213165, 181303, 503184]
13632E03184J37728k65220m3927M13903l48066j61784L02643O0382j70653K19561
13622F47751l22496O3949R8441K03278B75319J1107J17172j91887M38552A86363
13611G85804l59323o1267J57144j20461j87595L0076J84994K23394j62582K3058
13601E13242B15047l6511a49409C35713a12440A93933J00951L01569G8000Q8879
13591A66879Q8749F8516L75467O3276p2661q6210O3025A53460K81542F9041L91695
13580D60736j32959e0036B24052L23422k22079j3858Q6813A33427K87316R7052
13570E17795J5113m6348J05894j48612k05535F7903R8329Q7904e7709D13194c1404
13558A79328R9417A33457N772P4559Q3485K32895B08365K31641A04828K43480
$$ y = [503184, 640912, 375692, 331765, 745668, 397602, 235818, 538461, 598843, 428190, 647751, 325255, 389204, 487645, 690923, 275319, 286426, 403598, 211711, 650263, 186363, 785804, 426481, 365214, 522358, 401897, 214302, 244378, 429372, 652766, 490184, 513242, 215047, 178536, -149409, 335713, -112440, 193933, 294884, 596453, 78000, 166879, 255628, 68516, 443983, 507259, 434598, 348388, 411413, 153460, 435002, 69041, 460736, 327777, -50036, 224052, 547474, 325395, 311537, 398350, 133427, 420743, 517795, 532908, 486560, 592454, 443842, 238307, 67903, 166232, 254136, -57709, 413194, -31404, 179328, 278745, 133457, 139229, 213788, 297273, 530168, 208365, 440006, 104828, 348308]
13548C48308o7806L3633L13680G0151K31799P7618L37679k91157J479q8421n3484
13537B85664J48158A72595b39261B99989A12982L2232A7518M49770A49597J53459
13527C03056j37442R6535j14704L72520k10204K09312j55302A37704l4428b0318
13516D05860j03718p1560K1490p72J10554n8380E5213N03329c33G5364g7924C09076
13503B55768l407J16280p9358n1290n6189E5378K90187A47511G408L8989J12994
13492A59391Q8355C1881K00905J6522j04084j2300J78076J03913A78246J04473
13482B82719e2847C92006b08370B95341j27304J22771F0493J90451K979j5138
13472B38785k0624q1100J00858n3120K56558q3211A47932N3717o5950J22424J87306
$$ y = [348308, 280502, 314135, 627815, 70151, 301950, 379568, 717247, 426090, 427569, 339148, 285664, 433822, 172595, -239261, 299989, 112982, 145214, 17518, 467288, 149597, 303056, 165614, 262149, 147445, 519965, 309761, 519073, 363771, 137704, 103276, -20318, 405860, 302142, 230582, 252072, 251300, 361854, 303474, 55213, 558542, -333, 75364, -77924, 309076, 255768, 252361, 368641, 289283, 237993, 181804, 55378, 345565, 147511, 7408, 46397, 159391, 247746, 31881, 232786, 249308, 145224, 132924, 311000, 414913, 178246, 282719, -52847, 392006, -208370, 295341, 168037, 290808, 60493, 250944, 253923, 238785, 218161, 137061, 237919, 184799, 441357, 358146, 147932, 201649, 135699, 258123, 445429]
13461D45429n6034r519j28875R479J6370H5214K59522o8730P427a02887C04836
13449H9858P5629o9528g1463B46886d3251A05137a02443B30993J29149c8385B41887
13437b1413E7060k0951K19119A02861K32089j66858G8908L19091p6406L84740
13427G06333I6746C3360J91213R6624H9170K41015A33932J55723j15045k2797
13417A51813J51699G7724L17777j64525C003L09830a16037K949A2610J90294Q4385
13406B87289j02297O8324H7264k841L31294q4851J97730d6454B06205q6846L07519
13395D26878g8316A02627J98679j30866i0459k25981B96496H092L02221a65240
13384A05112R8765O4700L969b06839H7322M26308j13866j62136E8402N21743C8212
$$ y = [445429, 389395, 379876, 251001, 260480, 276850, 85214, 344736, 276006, 283433, -102887, 304836, 89858, 165487, 95959, -71463, 246886, -43251, 105137, -102443, 230993, 360142, -38385, 241887, -21413, 57060, 36109, 255228, 102861, 334950, 168092, 78908, 397999, 321593, 706333, 96746, 33360, 224573, 321197, 89170, 330185, 133932, 289655, 174610, 151813, 303512, 77724, 395501, 230976, 3003, 312833, -116037, -113088, 12610, 202904, 287289, 184992, 253316, 87264, 84423, 415717, 330866, 528596, -46454, 206205, 119359, 426878, -78316, 102627, 301306, 170440, -90459, -316440, 296496, 8092, 310313, -165240, 105112, 203877, 268577, 272546, -206839, 87322, 513630, 399764, 237628, 58402, 580145, 38212]
13372B30307P9967O1532j03516j07166J16065a31708A94867K53887j81130q2547
13362A85077J93108a0340B8388L3618J55883q1798C1849A3080J88657K89406j70487
13351C20656O2108f0642A82042J71591A13215J86651j44608J17325J53784j32699
13341B93668B9817M7617L25176k00509G5106j6994L01189E0579a80718D20055
13330A52522K09216C5127J13043m3217C1817J20176J8189L06294C8277g2609i773
13318A41034c0065G7212M9192J04046K35500A77374o8681l7712L56172j38032
13308B89121a19086B05079H3366C7674N40279k77239o3267B8517N12661I988b0189
13296C28006j4626D3840K53152D9612M5076J98933m5582f0167j45801B15434N4204
$$ y = [230307, 310274, 371806, 268290, 161124, 277189, -131708, 194867, 448754, 267624, 185077, 378185, -10340, 28388, 62006, 217889, 136091, 31849, 13080, 201737, 491143, 320656, 382764, -60642, 182042, 353633, 113215, 299866, 155258, 272583, 426367, 293668, 29817, 77434, 402610, 202101, 75106, 58112, 359301, 50579, -180718, 420055, 152522, 361738, 35127, 148170, 104953, 31817, 151993, 170182, 476476, 38277, -72609, -9773, 141034, -30065, 77212, 126404, 230450, 465950, 177374, 108693, 70981, 427153, 289121, -119086, 205079, 83366, 37674, 577953, 300714, 237447, 28517, 541178, 9988, -20189, 328006, 313380, 43840, 296992, 49612, 94688, 293621, 248039, -60167, -205968, 215434, 269638]
13285B69638J19631a3917C24047A18686B7591e8135m5589c7481A3454J08249a94547
13273a10371A89970k1097L3430A00743l5401h7389c6342I904Q8468K88094A79139
13261C62108A03448B5817K93915A0281M67484q4754j89225c6803B27961B6034
13250A15957E0244J229J08114J37837C3462J19935e654D3759n175J98560K02960
13239D40104h1190G2024J33575H5505L226J24830p6093F1833L16191O3772j85764
13228B56032a54444D9844m165k2239a28893H5719d682j19072g635l95A92824j6774
13216A76050B9707a7424A61272l6441d63828D02539B0143J50177J06619g7258
13205H6012K0883K7135E8086L11262A31075d375A17666j9070i2760a760B4050
$$ y = [269638, 389269, -13917, 324047, 118686, 27591, -58135, -103724, -37481, 13454, 121703, -194547, -110371, 189970, 168873, 202303, 100743, 65342, -87389, -36342, 9904, 98372, 386466, 179139, 362108, 103448, 25817, 319732, 10281, 477765, 393011, 203786, -36803, 227961, 26034, 115957, 50244, 51473, 159587, 297424, 33462, 153397, -5654, 43759, 38584, 237144, 440104, -81190, 72024, 205599, 85505, 88731, 213561, 137468, 61833, 378024, 441796, 256032, -154444, 49844, 45679, 23440, -128893, 85719, -4682, -123754, -7635, -8030, 192824, 176050, 29707, -17424, 161272, 124831, -463828, 402539, 20143, 170320, 276939, -77258, 86012, 106895, 134030, 58086, 369348, 131075, -4375, 117666, 98596, -92760, -1760, 24050]
13193G4205L1472a96978A18608a31286C22958A01603k5986h5909A38402F9154
13182A13224J19888J75573j84545j06539l2590b267l9485l0235p2271G7499b0410
13170A0685a43882d7971B12447O8177h1443k9026E7291J52228n9831J47717a08518
13158F6761k3059L3174K78895A07821a42556f5074q6156c8935A19108K35198D5065
13146H7331K97657A30090j3154b66217H0005K71983A54624E9449f4689C19815
13135C73797a75505C79751n2839a67H608L5184L0423a42760G0928b6503o8485
13124i4988B32435r6624B0114g9867A52097K2118k0836n3825a65876D295a66703
13112f9365F8986c194B16611D2321K67006k0594P4096A30308d6973a4522j8223
$$ y = [74205, 105677, -196978, 118608, -131286, 322958, 101603, 75617, -85909, 138402, 69154, 113224, 233112, 408685, 224140, 117601, 85011, -2267, -41752, -71987, -144258, 77499, -20410, 10685, -143882, -47971, 212447, 280624, -81443, -110469, 57291, 209519, 149688, 297405, -108518, 66761, 43702, 76876, 355771, 107821, -142556, -65074, -151230, -38935, 119108, 354306, 45065, 87331, 384988, 130090, 116936, -266217, 80005, 351988, 154624, 59449, -64689, 319815, 373797, -175505, 379751, 326912, -167, 8608, 43792, 74215, -142760, 70928, -26503, -94988, 232435, 135811, 20114, -79867, 152097, 174215, 153379, 99554, -165876, 4295, -166703, -69365, 68986, -3194, 216611, 42321, 309327, 288733, 362829, 130308, -46973, -14522, -32745]
13101c2745C55823A18060p906a51938A88069C0054j0349b26433A73809J02701
13091B76510B6248Q1922J3902a28372E998Q4432a1246F8941h2083p9296A08317
13079A87392N1182G8461J35682a73721j25671B08578a07303A79063G8796b6408
13068h6442A82914H9489M3267h8988I1054J21914a79284O5324B000J62653j7052
13057A47601K5795k8653F6496a08712H8148J7058J16937b23281B50204L0384f7913
13045C504J98593l3266d3056A09653J11196m2431g3491A99356f7915B0602L9663
13034F0265k4600N00089B02967n7867A1349K89003a21424B33462b31954A06892
13023I9614q599C099K82903J65110A66381e0576D8654d501A4470K8137e8632K1020
$$ y = [-32745, 355823, 118060, 110154, -151938, 188069, 30054, 19705, -226433, 173809, 276510, 26248, 108170, 122072, -128372, 5998, 90430, -11246, 68941, -82083, -161379, 108317, 187392, 238574, 78461, 214143, -173721, -299392, 208578, -107303, 179063, 78796, -26408, -86442, 182914, 89489, 132756, -88988, 91054, 212968, -179284, -113960, 2000, 164653, 147601, 173396, 144743, 66496, -108712, 88148, 105206, 222143, -223281, 250204, 280588, -67913, 3504, 202097, 168831, -43056, 109653, 220849, 178418, -73491, 199356, -67915, 20602, 60265, 35665, 535754, 202967, 145100, 11349, 300352, -121424, 233462, -231954, 106892, 99614, 91015, 3099, 286002, 451112, 166381, -50576, 48654, -4501, 14470, 42607, -58632, -37612]
13011c7612A33912L7961J45135A29040j8314m9450f8241r179C5380J39780b51044
12999c66214F6322J9297e0714C20920o6713K7002a75151A43516J55130b14925
12988b12322c7573A20906a49722f5084B5492K18514R9326a26788B22102K0366
12978B42468a00832B2232b7527L424o8397r5506f6015H8062a06044K0550C25799
12966B19498B9948K4750L65414e6115k90373E6160e1264a8159B08046k957b94229
12954F6510c9955A56867J09591E1493N8404L43239A63017k4059g834k5676A29335
12942c4667B18967a40606c465D2071J35743b55542c0254I4541l1427a76728d898
12930a6202p1670A06600J11945a35215k8279H8928a45560B4163K10474a54321
$$ y = [-37612, 133912, 171873, 317008, 129040, 110726, 61276, -68241, -77420, 35380, 175160, -251044, -366214, 66322, 85619, -50714, 320920, 254207, 281209, -175151, 143516, 298646, -214925, -212322, -37573, 120906, -149722, -65084, 25492, 244006, 343332, -126788, 222102, 242468, -100832, 22232, -27527, -24103, -92500, -188006, -66015, 88062, -106044, -85494, 325799, 219498, 29948, 54698, 420112, -56115, -346488, 56160, -51264, -18159, 208046, 205089, -294229, 66510, -39955, 156867, 266458, 51493, 109897, 453136, 163017, 138958, -7834, -33510, 129335, -34667, 218967, -140606, -3465, 42071, 177814, -255542, -30254, 94541, 63114, -176728, -4898, -16202, -87872, 106600, 218545, -135215, -163494, 88928, -145560, 24163, 234637, -154321]
12919b13853b907A16489m3514b93140f3721H4428J4992R8278K7806b63087c0618
12907A19742J27215O7263Q0645d2337B8718J80649J37591a51191N2510A68470
12896b4542B16592C5010K48465e1437o4108a929q0279l1480C96655A50394a63310
12884C22303D2637A4722i7045F8907h944C40428c4250G5648g385l4167B7478h0324
12871B33572Q0791k786f3817a6958m0390B51359a0460c056l40860b5140j35011
12860a60151B63208H6177K09761e6188B8444j2471a23677B31161b50020D1611
12849b00403Q3468C20662e8052B5559a29711A11608J42957a76090E614b49224
12838A53635a01530C971a07025r4891A99003G0623j4444J46353B2880B783a13346
$$ y = [-213853, -2907, 116489, 72975, -293140, -63721, 84428, 99420, 197698, 225504, -263087, -30618, 119742, 246957, 314220, 394865, -42337, 28718, 209367, 346958, -151191, -98681, 168470, -24542, 216592, 35010, 283475, -51437, -115545, -1929, -82208, -113688, 396655, 150394, -163310, 322303, 42637, 14722, -97045, 68907, -8944, 340428, -34250, 75648, -7385, -41552, 27478, -80324, 233572, 314363, 311577, -63817, -16958, -57348, 251359, -10460, -3056, -343916, -25140, -160151, 263208, 86177, 295938, -56188, 28444, 15973, -123677, 231161, -250020, 41611, -200403, -116935, 320662, -58052, 25559, -129711, 111608, 254565, -176090, 5614, -249224, 153635, -101530, 3971, -107025, -201916, 199003, 70623, 56179, 202532, 22880, 2783, -113346]
12826A66342N5381a08117A91737g5499b196C5983M4150l7236I456K43457c58273
12814c71768J52076M4986A39895E0635A1513a79999j70427f0291E631h4744A18444
12802a40720n4973K4915A92429R8539A12735b98553B22013J1294a68055C31911
12791g2533q7419K0244K9101B54194B8229J86435C014a32442C5990J33862N8134
12780B27986f8853E2806h6385n6460f8200j3980b1726F7497L74615i2844h828
12768b0297l93203a33783A843i2471L3780F4700k0073h327A73642A1354a00704
12756h8305p5015a6119j8658A46431i5361G1460d38728a82424c6544j6847D30525
12744I1263L4170J15055J15410f4412j93153A48716K2559q1686A2919c6396A51562
$$ y = [166342, 221723, -108117, 191737, -75499, -2196, 35983, 80133, 42897, 9456, 252913, -358273, -371768, -219692, -174706, 139895, 50635, 11513, -179999, -350426, -60291, 5631, -84744, 118444, -140720, -195693, -170778, 192429, 290968, 112735, -298553, 222013, 233307, -168055, 331911, -72533, -159952, -139708, -110607, 254194, 28229, 214664, 3014, -132442, 35990, 169852, 227986, -68853, 52806, -86385, -142845, -68200, -82180, -21726, 67497, 442112, -92844, -8828, -20297, -413500, -133783, 1843, -92471, -58691, 64700, 44627, -8327, 173642, 11354, -100704, -88305, -163320, -16119, -34777, 146431, -95361, 71460, -438728, -182424, -36544, -53391, 430525, 91263, 125433, 240488, 355898, -64412, -257565, 148716, 171275, 89589, 12919, -36396, 151562]
12732C03895A47039g6458A51098e4698E4498a39513d677n9274B3052a6498C2944
12720a26200e2045j38824j0974E1035J10463F0296j2664a4070C91868R8520j3805
12709D76583A53797e5749C30689a7024E12548A31801L7532M5503L9969J14361
12699C69166j77740k6198q719a69085P3379M1169F3171L9058J20230i355K592
12688f763m9288E7857a44628A13271b8001k9416B15268c5912j87769A33115K21615
12677C54730i1698B41812P340a00685C36715J34707a13233B18394J02708E026
12666a89397n4167Q5318B88279E0664L7783a11243A52889a31859k1092E3985J51107
12655B05092K39696A91182J33948A40186b18819c0547C44850p7683l597H5331
$$ y = [303895, 147039, -76458, 151098, -54698, 54498, -139513, -4677, -63951, 23052, -16498, 32944, -126200, -52045, -190869, -201843, 51035, 161498, 60296, 47632, -14070, 391868, 490388, 476583, 153797, -55749, 330689, -17024, 512548, 131801, 169333, 214836, 254805, 369166, 191426, 165228, 156509, -169085, -95706, -54537, 63171, 102229, 222459, -9355, -6763, -56051, 57857, -144628, 113271, -28001, -57417, 215268, -35912, -223681, 133115, 354730, -91698, 241812, 249152, -100685, 336715, 471422, -113233, 218394, 321102, 5026, -189397, -243564, -158246, 288279, 50664, 88447, -111243, 152889, -131859, -152951, 53985, 205092, 444788, 191182, 325130, 140186, -218819, -30547, 344850, 267167, 263570, 85331]
12644f9327K6468H2307j5914J00067D8550a37731b3619A50486G1271L1302c5219
12632A1682Q2041Q7378h9945F214K99910j24728J36501j41472N0300B4338M1529
12621F5867c8010q7346A38456F1141Q8492J13637b33682A42232a04483C27583
12610e7623l9215b5928G2143A4103b38774B96444j33714k4780A7941q636M24659
12599D33964J2415A17090d2402B72131b18765j88154A47984b22445I0466e5767
12588a88187G0182g2940F7644e3734B43946e2434F1180a4437B11019f7465B85784
12576B04513N8189i9516B95145k0670a97508m1994k5735h278j31392o5501A16376
12564A91341b7043k08438a8340n2482B84384a66123a6334n9728m52c6938b109
$$ y = [-69327, -42859, 82307, 66393, 166460, 48550, -137731, -23619, 150486, 71271, 102573, -35219, 11682, 93723, 181101, -89945, 6214, 306124, 181396, 317897, 176425, 226725, 24338, 65867, -38010, -125356, 138456, 61141, 149633, 263270, -233682, 142232, -104483, 327583, -57623, -96838, -25928, 72143, 14103, -238774, 296444, 162730, 137950, 17941, 9305, 433964, 446379, 117090, -42402, 272131, -218765, -406919, 147984, -222445, 90466, -55767, -188187, 70182, -72940, 67644, -53734, 243946, -52434, 61180, -14437, 211019, -67465, 285784, 204513, 262702, -99516, 295145, 274475, -197508, -239502, -265237, -8278, -139670, -205171, 116376, 191341, -27043, -235481, -18340, -70822, 284384, -166123, -16334, -76062, -76514, -36938, -2109]
12552A09052J03230a69612C87912d492A38518N4934c8627A71515a48978c9799
12541b03015f9671A09858O668l1569K55033G7446k9308a50976A66416a2909j1885
12530b4794j39718B26603A0255J03444a48213j42973g9788j7160A63106a39846
12519g1937l4953k49238C47554a5969B61923E4797b58956a27495d8776r9960N0906
12508i7830j83968i2891A194e1326C23356c4288A60747p8362C5536R3348b8803
12496g6013C89024a0065K854A20092b5395j71976j66614a17861A42604e1131C23377
12484f7926j48963e1796A37736e15844a33803B09681A3230f4846K510H6943c21525
12472a8093E3854M7375J39180c349k6918k9876b6423q7458j43582A14310L09968
$$ y = [109052, 212282, -169612, 387912, -4492, 138518, 193452, -38627, 171515, -148978, -39799, -203015, -69671, 109858, 116526, 84957, 339990, 77446, 48138, -150976, 166416, -12909, -24794, -164512, 226603, 10255, 113699, -148213, -291186, -79788, -96948, 163106, -139846, -71937, -106890, -356128, 347554, -15969, 261923, 54797, -258956, -127495, -48776, -148736, -97830, -281798, -92891, 1194, -51326, 323356, -34288, 160747, 82385, 35536, 128884, -28803, -76013, 389024, -10065, -7211, 120092, -25395, -197371, -363985, -117861, 142604, -51131, 323377, -67926, -216889, -51796, 137736, -515844, -133803, 209681, 13230, -64846, -62336, 86943, -321525, -18093, 53854, 101229, 240409, -3349, -30267, -60143, -26423, -113881, -257463, 114310, 424278]
12461D24278b1363F9836B1472a10091D4202a61759j2115g6960E8663a57332B7384
12449a58423q2325C9883J2961J48944G9097J67514e5597A00175k0820Q6742f8825
12437a27271p6857A02337Q0475J19528C0255J57902b11363B41659a10253j32959
12427b43212I78i2718o903F8694J29350a50826A59770b17020B92581a18941F8231
12415A25317O262K9748a21186B4511a66114A14606f3214H0314k7697c60663D3704
12403H3922h83j34456j30109C0524L2330P0879a76112A13232J33786H0311c6785
12391E1282b56213B59646b3641C3528b6973I775L87539g8381E6508c0931k53077
12380b84008G1474k3525O7840m6205a17829E18247C6777J62929r5688h2359m3969
$$ y = [424278, -21363, 69836, 21472, -110091, 44202, -161759, -173874, -76960, 58663, -157332, 27384, -158423, -240748, 39883, 52844, 201788, 79097, 246611, -55597, 100175, 79355, 166097, -68825, -127271, -204128, 102337, 182812, 302340, 30255, 188157, -211363, 241659, -110253, -243212, 978, -92718, -99621, 68694, 198044, -150826, 159770, -217020, 292581, -118941, 68231, 125317, 131579, 161327, -121186, 24511, -166114, 114606, -63214, 80314, 52617, -360663, 43704, 83922, -883, -135339, -265448, 30524, 62854, 133733, -176112, 113232, 247018, 80311, -36785, 51282, -256213, 259646, -23641, 33528, -26973, 9775, 397314, -78381, 56508, -30931, -284008, 71474, 47949, 115789, 69584, -117829, 518247, 36777, 199706, 104018, -82359, -126328]
12369a26328A17078k2058n350q185j7446J38160n0967p0897L9455O6206K65401
12358D51397b02949m530h6064A17708E6814f4066A16760h4606l8765B16042e0921
12346C8614j593d96242B2940a48211a5833D1595N5067Q7804B0512L516M54549
12335D78577b36375B09575q6799C5573N3012k630J29214d4164j46406p7591i7548
12323a26110j78404D2792e55796B704a68534Q2168G3345e6660B05809G1666c09798
12311A33258f0141k72564a31749f4967L1320j98031j38503B4844C509a22548B65003
12299B71926b1850A932c25265a15796B77999o3656J21982j44577G1558e7568I9849
12287I4586a65761M2134L9916D50474a33960B06686N2019A18873B3343M34450
$$ y = [-126328, 117078, 95020, 89670, 81485, 64039, 202199, 151232, 80335, 119790, 185996, 451397, -202949, -207479, -86064, 117708, 56814, -64066, 116760, -84606, -123371, 216042, -50921, 38614, 37021, -496242, 22940, -148211, -15833, 41595, 96662, 184466, 20512, 24028, 478577, -236375, 209575, 122776, 35573, 88585, 85955, 215169, -44164, -190570, -268161, -97548, -126110, -304514, 42792, -555796, 2704, -168534, -86366, 73345, -56660, 205809, 71666, -309798, 133258, -60141, -332705, -131749, -64967, -33647, -231678, -370181, 24844, 3509, -122548, 265003, 271926, -21850, 1932, -325265, -115796, 277999, 214343, 336325, 191748, 71558, -57568, 99849, 94586, -165761, -123627, -83711, 450474, -133960, 206686, 258705, 118873, 23343, 457793]
12277D57793a18131G1559f0882D89384O2740j93029H0034g2187a5266L216A91347
12265a27579A29318J52786k7081j0139n6156q1937r855J14318a5942A49918L1272
12254A81190P3897G4313b04180E0011J77144J32816H8362C6796L3246O8271j109
12243A37204J5063D9735J58216D4545e6070D48308b3035m6389k6591A90821r622
12232A81199a74547H5109J24863a45702B78660a16291E9040K25062M812j14546
12222A74368k0569A3576J31628M7144d0597C99452A96425J39388a14087F8689
12211B2026J80268e2868A18821o910E4776o951N777e9849j22495g1915k1333q337
12199a01585d6447F2490R69K5476J74084J38091A75428c2753A92648J92491e1469
$$ y = [457793, -118131, 71559, -60882, 489384, 552124, 359095, 80034, -72187, -15266, -12050, 191347, -127579, 129318, 282104, 255023, 244884, 188728, 106791, 96936, 211254, -15942, 149918, 181190, 255087, 74313, -204180, 50011, 227155, 359971, 88362, 36796, 70042, 138313, 137204, 152267, 49735, 207951, 44545, -56070, 448308, -23035, -69424, -96015, 190821, 181199, -174547, 85109, 209972, -145702, 278660, -116291, 59040, 284102, 288914, 174368, 153799, 13576, 145204, 192348, -40597, 399452, 196425, 335813, -114087, 68689, 22026, 202294, -52868, 118821, 111911, 54776, 47825, 53602, -59849, -182344, -71915, -93248, -101585, -46447, 62490, 63459, 88935, 263019, 401110, 175428, -32753, 192648, 385139, -51469]
12187B73665a35594f3399K0871G8577b96423C20430I025K25749c8977G3306A3719
12175C6421b20776d6260A30539a83470C90676c497B49628j05388C7634K8962L73412
12164D40008L0122k05586p0741R8135q2003B7201O0440M18308A6264O2192J74587
12153B53043A3070g8975C07960i2466C67730F7801h8834A70769L3607k2672c00729
12141b94016A16513a88152b2108k31674B12534R4576a62866O9529C6032a05718
12130c88551J61196A30495a58116a4573B11679p1144a7307j17580j24491H0047
12119A4815e05916A68299c67097a6545m1406j3323A35454d8517r0522l2041F5282
12107D0536b53074J08272b8073A08825f3808j6861c7280a5395j1612F6452J10911
$$ y = [273665, -135594, -63399, -42528, 78577, -296423, 320430, 9025, 234774, -38977, 73306, 13719, 36421, -220776, -46260, 130539, -183470, 390676, -3497, 249628, 144240, 37634, 66596, 440008, 470130, 264544, 193803, 291938, 209935, 27201, 87641, 505949, 16264, 78456, 253043, 13070, -78975, 307960, -92466, 367730, 67801, -88834, 170769, 204376, 181704, -300729, -294016, 116513, -188152, -22108, -253782, 212534, 307110, -162866, -93337, 36032, -105718, -388551, -227355, 130495, -158116, -14573, 211679, 140535, -17307, -134887, -259378, 80047, 14815, -505916, 168299, -367097, -16545, -57951, -71274, 135454, -48517, -139039, -171080, 65282, 40536, -253074, -144802, -28073, 108825, -63808, -80669, -37280, -15395, -27007, 66452, 177363]
12096A77363G7915c6306B36720j16945k8468J45137D7201a05213C4213H980L151
12085A2131c6939l34664B4024L37369g9919n061D31348K51563J638295A036544
12074D4537L12483a79595k70123A97471a68075k42371C0240R2315a83944j78521
12064c62465a30237d7091J080p1459r3664c3608j06267j9886f5411B14907b9627
12052b31155A20499l5644a42721b4694I6958c73959h4975I8084d26094a41562
12041g928n2086A92845b777p9247A10522a94432G0312a37826I6525L290g7412
12029A30368B6503a57662o9570j8897f7784H6421J9216g0395C69604c9070F3430
12017G6619L9798J6711F4257K1040i322j74290j60326B42223I5340N0828J10232
$$ y = [177363, 77915, -36306, 236720, 119775, 91307, 236444, 47201, -105213, 34213, 8980, 12131, -36939, -371603, 24024, 361393, -79919, -84980, 431348, 682911, 2321206, 1036544, 44537, 357020, -179595, -449718, 197471, -168075, -410446, 30240, 122555, -183944, -362465, -130237, -47091, -46011, -117470, -211134, -33608, -139875, -159761, -65411, 214907, -29627, -231155, 120499, 84855, -142721, -24694, 96958, -373959, -84975, 98084, -426094, -141562, -7928, -60014, 192845, -2777, -82024, 110522, -194432, 70312, -137826, 96525, 99815, -77412, 130368, 26503, -157662, -227232, -246129, -67784, 86421, 105637, -70395, 369604, -39070, 63430, 76619, 116417, 133128, 64257, 85297, -9322, -183612, -343938, 242223, 95340, 146168, 256400]
12006B56400j18987P3922A2579a11800K9988j0721j30824G2268k2720a88076D8119
11994c88347N1010C1917K6704J31492B0433O4254J42816r7047a02669j08911b1973
11982a53114C31145A1407b5417o6318B41210J35173a10567A4219A052J53206c3175
11970a12645l8650f4988B49254A04257b22780F9959l2649e907A29311F1632h1677
11958E253g8127j58106A01703a76847d869j14791o3206B07055r3396d3473H9748
11946B2059J5032p492O2174b16586c9767B50877a89678C58600A26204a47203A8394
11934F9293J88588b1586j26482D77449e648n4819E1102B5286d6175A75218L4170
11923B09388B5323L4692a76577c5777C1953a45588F317J63494l2632b16948d35
$$ y = [256400, 137413, 211335, 12579, -111800, -81812, -92533, -223357, 72268, 49548, -188076, 48119, -388347, -337337, 31917, 58621, 190113, 20433, 84687, 227503, 130456, -102669, -211580, -21973, -153114, 331145, 11407, -25417, -91735, 241210, 376383, -110567, 14219, 1052, 154258, -33175, -112645, -151295, -64988, 249254, 104257, -222780, 69959, 37310, -5907, 129311, 61632, -81677, 5253, -78127, -236233, 101703, -176847, -4869, -119660, -182866, 207055, 113659, -43473, 89748, 22059, 37091, 29599, 91773, -216586, -39767, 250877, -189678, 358600, 126204, -147203, 18394, 69293, 257881, -21586, -148068, 477449, -5648, -60467, 51102, 25286, -46175, 175218, 209388, 25323, 60015, -176577, -35777, 31953, -145588, 6317, 169811, 137179, -216948, -435]
11911E531b3138o9105k2806p8953j6616j09425D3732c16860J09120p190D78845
11899e1983j80555N5513g994k24075H2828b32133L7307L6240j69601G6984b87654
11887a02240B16565b41316i0815B70088a69918O9821r1523J6968b5373k13512
11877b38885A81314K7467c01101j35597a36774B15372E0573c0146j53633Q3338
11867a00441D45387a6789k90069A28268a75924h4590D978A244i4230m5904A76153
11855C02688b29298h9737m1000L0419B92175j41488L0717R132J46505b32742C6284
11843A10040h6427r3970A01868J06314D3633d4445k29925f9097B53079b86327
11832e037B5476J96072a7783j83598A1091J30503d60857a07671A86120a37311
$$ y = [5531, -23138, -92243, -115049, -194002, -210618, -320043, 43732, -316860, -207740, -214930, 478845, -51983, -232538, -177025, -7994, -232069, 82828, -232133, -194826, -158586, -328187, 76984, -287654, -102240, 216565, -241316, -90815, 270088, -169918, -100097, -191620, -174652, -25373, -238885, 181314, 208781, -301101, -436698, -136774, 215372, 50573, -30146, -183779, -100441, 445387, -16789, -306858, 128268, -175924, -84590, 4978, 1244, -94230, -140134, 176153, 302688, -229298, -89737, -130737, -100318, 292175, 150687, 181404, 190536, 337041, -232742, 36284, 110040, -86427, -180397, 101868, 208182, 43633, -44445, -274370, -69097, 253079, -286327, -5037, 25476, 221548, -17783, -201381, 11091, 141594, -460857, -107671, 186120, -137311]
11821a38717j70213K1094C28661E0824a20863b2515r3186C7829Q7635m2441C8335
11809d2958A28790e4428j1106m5790A55L3606i0669I2932b7777D6177J29068H0049
11796C27063c51627F3468b71988H9356i1545C47176a09272j095H0918J05983a65909
11784C95696D0650A0446a88946D1667N7662O269a45239f8719A68341f8560A07964
11772D103b6865k43507C6343J43612c22605a08999A63012b14895f2498A13521
11761C29349a66479P3380C8303a20081A29609i4725b3834B56201b15738K6857
11751a88881e2184B36891a13853K4671C23170j55505a2664k03739D5206c02840
11740i3601j42871B29966c6236H037J41804a42306j2406A21935P0426e6828J0085
$$ y = [-138717, -308930, -287836, 328661, 50824, -120863, -22515, -115701, 37829, 125464, 83023, 38335, -42958, 128790, -54428, -65534, -111324, 155, 33761, -90669, 92932, -27777, 46177, 175245, 80049, 327063, -351627, 63468, -271988, 89356, -91545, 347176, -109272, -110367, 80918, 186901, -165909, 395696, 40650, 10446, -188946, 41667, 99329, 105598, -145239, -68719, 168341, -68560, 107964, 4103, -26865, -270372, 36343, 179955, -322605, -108999, 163012, -214895, -62498, 113521, 329349, -166479, -93099, 38303, -120081, 129609, -94725, -23834, 256201, -215738, -188881, -52184, 236891, -113853, -89182, 323170, 167665, -12664, -216403, 45206, -302840, -93601, -236472, 229966, -36236, 8037, 149841, -142306, -154712, 121935, 192361, -56828, -46743]
11729d6743j6033I5325k9260K38505a88751j09827I7087c8249j0025A04220a9565
11717C86312c33338H632R0707h929k47983f420m1751j43841H6795b72238D26599
11705B61180r0273c25797d0518B41131I2054a08806A26080n8049a80132D09252
11694a58927B9664a8102r7083A19452i3323A12291a15908a3740j23531B77301
11683B37225A259K45451b7203B58316j26413O1376q4850C3008O0783g1322B00021
11671d5941D17938F4466J09046J94739m7531K51121D1288K3179c6761C2492h360
11659b61949a0266p5929B63905A9375L85143I3273C1543K7082d2883j20723C05210
11647D0448K4118L83775G1516g2866G1950Q9512b94874F4800e1286j28177B57318
$$ y = [-46743, -62776, 95325, 66065, 304570, -188751, -298578, 97087, -38249, -48274, 104220, -19565, 386312, -333338, 8632, 99339, -8929, -256912, -6420, -48171, -192012, 86795, -272238, 426599, 261180, 170907, -325797, -40518, 241131, 92054, -108806, 126080, 68031, -180132, 409252, -158927, 29664, -18102, -115185, 119452, -93323, 112291, -115908, -13740, -137271, 277301, 237225, 1259, 246710, -27203, 258316, 131903, 193279, 108429, 33008, 93791, -71322, 200021, -45941, 417938, 64466, 173512, 368251, 320720, 571841, 41288, 64467, -36761, 32492, -8360, -261949, -10266, -86195, 263905, 19375, 404518, 93273, 31543, 58625, -42883, -163606, 305210, 40448, 64566, 448341, 71516, -72866, 71950, 161462, -294874, 64800, -51286, -179463, 257318]
11635A17843k0025b60741a7837P651A02087c2977A40083j0784m6160L71829j93438
11624B61530G7842L65795A55793K22054D4922Q0331b52882b8152r5494p7524L0022
11613a71148Q660B41755r8652a6925H19J49920R9394r0985j8761J90364A55218
11601b27004B85379a32318A07115N1441q212b5374o4638A2073J59693q4816d15411
11589d03788D8850J64829o2182M3910p4943b15053G1616d8812r8364m5957H1843
11577H2677a55917C4998b41472A7245J63798P8115J0227D1112J09320J67328j20517
11566A97243o8380J06008B8398J45291b3873A65012h9595j57396E0981K03405
11556B54386E2885L1694K0631Q9267b2970D9378a86153d0632B24149p8423c3434
$$ y = [117843, 97818, -260741, -17837, -10186, 102087, -32977, 140083, 129299, 83139, 454968, 261530, 77842, 443637, 155793, 377847, 44922, 125253, -252882, -28152, -123646, -201170, -171148, -162488, 241755, 143103, -16925, 819, 150739, 250133, 159148, 140387, 330751, 155218, -227004, 285379, -132318, 107115, 158556, 150344, -25374, -90012, 12073, 171766, 86950, -415411, -403788, 48850, 213679, 151497, 195407, 120464, -215053, 71616, -48812, -147176, -193133, 81843, 82677, -155917, 34998, -241472, 17245, 181043, 259158, 269385, 41112, 150432, 317760, 197243, 128863, 234871, 28398, 173689, -23873, 165012, -89595, -246991, 50981, 254386, 52885, 84579, 105210, 194477, -22970, 49378, -186153, -40632, 224149, 145726, -33434]
11544B01641b29489C59487E7917f0901A46634i3103C85365C9909M9437Q2320N4768
11533B26434c1631D3136b07055A86948a1000j02029d2738A24213b9401B7054M1248
11522F8302M0755a13591A26702b78856C74832f2359D8536Q5134P9921H2454a84430
11510A32947c6174j17634A03694J1091k6085D3080a04969C05902E0254K1031c7818
11498a30599J236C4463L2343K3627J44407a47378A72635b50240B5304L21590b20542
11486D95747a31504D76961a41063F0704a89490Q3533B15488J86309E165f1768
11475F7872K83962j43974J27308n7132K00067c9223B14035f8234A36045O0045
11465A96090l064J23572j21648m2300K0479d01121i2059c8923A37630J5238L0452
$$ y = [201641, -229489, 359487, 57917, -60901, 146634, -93103, 385365, 39909, 89346, 171666, 226434, -31631, 43136, -207055, 186948, -11000, -113029, -42738, 124213, -29401, 27054, 68302, 109057, -113591, 126702, -278856, 374832, -62359, 48536, 133670, 213591, 82454, -184430, 132947, -36174, -153808, 103694, 114785, 88700, 43080, -104969, 305902, 50254, 71285, -37818, -130599, -129363, 34463, 66806, 90433, 234840, -147378, 172635, -250240, 25304, 346894, -220542, 495747, -131504, 476961, -141063, 60704, -189490, -105957, 215488, 401797, 5165, -61768, 67872, 351834, 207860, 335168, 278036, 478103, -39223, 214035, -68234, 136045, 196090, 193026, 316598, 194950, 152650, 173129, -401121, -92059, -38923, 137630, 152868, 183320]
11454A83320N7588j5582a00614c1187A30713Q0189L6215c5720D2892e9426B64938
11442B31941b33284I8093e4249G7745a48181O3849H4898J76181N9841C9650P2165
11431A11815J21578m8148b6115C3138a14489j9135A39692b01664G179R0758i2650
11419A38954a3628m4171A32642e3934A63547E8899N85a46753A12342D1581b79581
11407b39153A93721g8182D5308J30986A2078J4990c3572n0215a6453H9948O9349
11396A59297n6889a64079A41702N9888i9169d2280m7390j53729G7152E494J70226
11385A75720a7598D9297c37360A0444P3862d4604k848j18050B49526a2263j19504
11374a31767B22656K4820j0325H1552J15791a8719I4324P1178E6802e3598q1892
$$ y = [183320, 240908, 225326, -100614, -31187, 130713, 210902, 247117, -35720, 42892, -59426, 264938, 231941, -233284, 98093, -54249, 77745, -148181, -84332, 84898, 261079, 320920, 39650, 111815, 233393, 185245, -26115, 33138, -114489, -133624, 139692, -201664, 7179, 97937, -92650, 138954, -13628, -57799, 132642, -53934, 163547, 58899, 59484, -146753, 112342, 41581, -279581, -239153, 193721, -78182, 45308, 176294, 12078, 27068, -33572, -83787, -16453, 89948, 159297, 102408, -164079, 141702, 201590, -99169, -42280, -89670, -243399, 77152, 5494, 175720, -17598, 49297, -337360, 10444, 84306, -44604, -47452, -165502, 249526, -12263, -131767, 222656, 247476, 237151, 81552, 197343, -18719, 94324, 165502, 56802, -53598, -135490]
11363a35490C51315a07426D1702a21038A14358a08472J5252K4458F0463R5418
11353A55881e48987I6062A2676c8163B04591N8350A20578N4461J57581H3473p483
11342G5990L14131g9904D6608L81530A36942A2538i2147h461I8709d41F8139K43723
11330C11862a11793b4519n795E1546L62316A34424a01852c2851k22681A0932d0742
11318e5208A00854a93528f9034A02510B6751J08467g0517j79163J16553J2056
11308a21071A46152B7869c85274F6638l0948b07148a4065o6372l2938D5567b1148
11296A2287b46237A31640f759j70033B90536c44955A53539a08126B19331k4602
11286A94729b88039J21272f6938A7007J15843a40799C18859b04170E1542b59729
$$ y = [-135490, 351315, -107426, 41702, -121038, 114358, -108472, -93220, -68762, 60463, 155881, -548987, 96062, 12676, -38163, 204591, 262941, 120578, 175039, 332620, 83473, 75990, 390121, -79904, 46608, 428138, 136942, 12538, -92147, -8461, 98709, -441, 68139, 311862, -111793, -24519, -30314, 51546, 413862, 134424, -101852, -32851, -255532, 10932, -40742, -55208, 100854, -193528, -69034, 102510, 26751, 135218, -70517, -249680, -133127, -121071, 146152, 27869, -385274, 66638, 35690, -207148, -14065, -80437, -113375, 45567, -21148, 12287, -246237, 131640, -6759, -176792, 290536, -344955, 153539, -108126, 219331, 194729, -288039, -166767, -66938, 17007, 132850, -140799, 318859, -204170, 51542, -259729]
11275I2117J3017g7707j78673a05890A01876J31630a84556C08216j32554P3973
11265B49635G0697c43844G1748j6762b5162k8378I9722D7010J49479a58130g1278
11253b13158o4251j19374I0607a26675r4264a4917C4397K2646j0678d58882B8076
11241b75356A57953a83947K8602C7234a45901F6742C812i357l23573B98910G4335
11229B49250F0040d7858j14090M7486k46641Q5737K3824l1628F6085c255A09163
11217b84399J30234e4188j99411d1962E23012A40813L1618l5822c25416c9950
11206b37035q961g3360m89528a29502B0292a16314p2738F0715j6449a04644M0619
11195f4025k44995A24651E4951J36610b83250m2076A61790e9816E3086b15356
$$ y = [92117, 105134, -77707, -256380, -105890, 101876, 233506, -184556, 308216, 175662, 249635, 70697, -343844, 71748, 54986, -25162, -53540, 99722, 47010, 196489, -158130, -71278, -213158, -277409, -396783, 90607, -126675, -220939, -14917, 34397, 57043, 46365, -458882, 28076, -275356, 157953, -183947, -155345, 37234, -145901, 66742, 3812, -9357, -332930, 298910, 74335, 249250, 60040, -47858, -161948, -114462, -361103, -275366, -251542, -283170, 66085, -3255, 109163, -284399, -154165, -54188, -253599, -41962, 523012, 140813, 172431, 136609, -325416, -39950, -237035, -245996, -73360, -562888, -129502, 20292, -116314, -189052, 60715, 44266, -104644, -64025, -309020, 124651, 54951, 191561, -283250, -325326, 161790, -59816, 53086, -215356]
11184A32550k7939b41327c4349j71242e6641B99104K7987e66451d910k10992C7665
11172D4952a55985B42489d256j2398k69852a4701A05377a38040n7483j20148i3894
11160b89949b3067C6021Q4390R7083k3425P2566A05760L7102o3715a44505B6728
11148b83574A35496a96508a9420B30629f9353J1599o0760B2122i5121c3088n6027
11137h9115k46319c6244D4274P2116K77288c32589A14662d0585k03967e1187A3285
11125A10337d1037E0439b83891A2265O4895K68260B6486a60414r0451A4595K4222
11114C8817h6574A95503i6900C98747j49123p4470m4295B415J52506a1249B89207
11102B24677B5661L31151o8419n3628A1786a9595j26323A35616K39528A55766
$$ y = [132550, 104611, -241327, -34349, -205591, -56641, 299104, 327091, -566451, -4910, -215902, 37665, 44952, -155985, 242489, -4256, -16654, -286506, -14701, 105377, -138040, -195523, -315671, -93894, -289949, -23067, 36021, 120411, 217494, 194069, 266635, 105760, 142862, 79147, -144505, 26728, -283574, 135496, -196508, -19420, 230629, -69353, -57754, -118514, 22122, -95121, -33088, -89115, -335434, -36244, 44274, 116390, 393678, -332589, 114662, -40585, -244552, -51187, 13285, 110337, -41037, 50439, -283891, 12265, 77160, 345420, 26486, -160414, -250865, 14595, 38817, -86574, 195503, -96900, 398747, 249624, 175154, 130859, 2415, 154921, -11249, 289207, 224677, 25661, 356812, 288393, 234765, 11786, -19595, -145918, 135616, 375144, 155766]
11091C38226G8916J36148b01056F3845f9824C29703F6796a65168A47924k2932
11081A24992j2804L92282j81586O5333m1534H1606L92109O5865k18573k6566J9599
11070C14040j56483L26880j30782j2779K6765K57086k58718j16754n7368L58181
11060E50068j48650l7821p9786J66061K32763j28123j16363Q4144P4206k65395
11050C31104N08866p6958j51492k4804J31086L89045l14497K23393l62278j21378
11040E32087L7862k2774B35171N56667K8305B52886J64102K41581j94803k7248
11030D36518K31990r1325j14327J51204j23352J91019k9722q2195j09144N84259
11020A044925l33878j78784L27042J03978k34693k47237J53808k24253L82637
$$ y = [338226, 78916, 215064, -201056, 63845, -69824, 329703, 66796, -165168, 147924, 124992, 112188, 504470, 322884, 388217, 346683, 81606, 473715, 539580, 321007, 294441, 314040, 157557, 484437, 353655, 340876, 367641, 624727, 366009, 249255, 191887, 550068, 401418, 363597, 283811, 449872, 682635, 554512, 438149, 522293, 596499, 331104, 839970, 763012, 611520, 586716, 717802, 1106847, 792350, 1015743, 653465, 532087, 569949, 547175, 235171, 791838, 820143, 252886, 416988, 658569, 463766, 436518, 668508, 577183, 462856, 614060, 490708, 681727, 652005, 569810, 460666, 1044925, 711047, 532263, 859305, 963283, 728590, 481353, 635161, 410908, 793545]
11011G93545K9247l98261M94511q5419B57638L72617J86390O1923m29894J58765
11001F07439M9407C02160K95786j08468N8370N494j18048N7352K46840j76325
10991E63161L0675J95352R1861k00421j05403J11944K82973o800j94041K98410
10981A067711E26160R3076Q54062M9248k62763J97313K28984O8706O46059K47183
10971B648028l10254m6432L24343n17472m8395o3035p46909N69665k31443P1898
10961A649994K01294N6314j83700J61691j0961M58442m87784k5479j67778l7505
10951A614528l42346q3024n57326O4514j26012j35230K90600k18818k20919j15699
10941A70268K58057B12578J92819E8962J6521D857L22151m1445e4650A51913o9745
$$ y = [793545, 822792, 424531, 919042, 833623, 257638, 630255, 816645, 878568, 448674, 607439, 656846, 302160, 597946, 489478, 547848, 553342, 435294, 492646, 739486, 563161, 593836, 789188, 881049, 680628, 575225, 687169, 970142, 963342, 769301, 1067711, 526160, 619236, 1473298, 1522546, 1259783, 1457096, 1686080, 1754786, 2400845, 2648028, 2337774, 2291342, 2615685, 2098213, 2049818, 1986783, 1239874, 1809539, 1578096, 1649994, 1851288, 1907602, 1723902, 1885593, 1874632, 2333074, 1845290, 1819811, 1652033, 1614528, 1272182, 1189158, 631832, 696346, 570334, 435104, 725704, 506886, 285967, 170268, 428325, 212578, 405397, 58962, 75483, 4857, 327008, 285563, -54650, 151913, 82168]
10930H2168e4572E6126M6046m7378a16158C60882a51067b2701B8790J18054k7554
10919A19290g163B14676n0827J96683A6789M4388J75176j16894K31953f3106b7524
10907g5155D36896A82896L4283c15144a6778r89r1572j2792j07181H8383m3328
10896D5055R1525J14554H1300a08419J6659B15153e6621A34653b24955B09244
10885a65257F974f0900B65466a29109k33831a52839f6171A8560K83114e6489B68980
10873I3504J44255C4438b48008A91254A0806g7423o7008G6802P9415c37886A57175
10861h4024j2926r9759B56676Q3962a88192h3544B68309a0384l2015j76644B26686
10849E07139k40493e5409j55707O7142B90279a7323o8987g478k09210d159j93732
$$ y = [82168, -54572, 56126, 102172, 54794, -116158, 360882, -151067, -22701, 28790, 146844, 119290, -7163, 214676, 163849, 360532, 16789, 61177, 236353, 119459, 351412, -63106, -27524, -75155, 436896, 182896, 217179, -315144, -16778, -17767, -109339, -122131, -229312, 88383, 45055, 136580, 251134, 81300, -108419, -91760, 215153, -56621, 134653, -224955, 209244, -165257, 6974, -60900, 265466, -129109, -362940, -152839, -66171, 18560, 301674, -56489, 268980, 93504, 237759, 34438, -248008, 191254, 10806, -77423, -144431, 76802, 156217, -337886, 157175, -84024, -96950, -196709, 256676, 340638, -188192, -83544, 268309, -10384, -42399, -219043, 226686, 507139, 266646, -55409, -211116, -143974, 290279, -17323, -86310, -7478, -216688, -4159, -197891]
10838a97891e6101A33329c71729J04378p6458a28242g888D69472g4951q6375B94504
10826e2428A00333p937a88209d4268o697q646J3699j34792B76910e5154k78008
10815c33162A48872a25191j05198l2465A57086a09917e87B00621a05741j45907
10805b51648g264j78071e5505o2388l5595O3095p1317H7307b56641e5524p4388
10794a29912J6899c3986n9208c4099D62810g2553G6669A2657J33843E5734a61723
10782c06129J39432J7836A08754D1422b0256k3655k59231j66459b22135P1836
10772a50299A2543K1623c4885A6422N0022c48692a48115B71955F8660c7747E9601
10760c43407A6744a07405C45637b88359B5143b00928l2989A37784l5114f3628
$$ y = [-197891, -56101, 133329, -371729, -267351, -343809, -128242, -7888, 469472, -74951, -161326, 294504, -52428, 100333, 92396, -188209, -44268, -50965, -59611, -45912, -180704, 276910, -55154, -333162, 148872, -125191, -230389, -262854, 157086, -109917, -587, 200621, -105741, -251648, -7264, -185335, -55505, -117893, -153488, -90393, -161710, 87307, -256641, -55524, -129912, -113013, -33986, -93194, -34099, 462810, -72553, 76669, 12657, 146500, 55734, -161723, -306129, -166697, -148861, 108754, 41422, -20256, -43911, -303142, -469601, -222135, -150299, 12543, 34166, -34885, 16422, 66444, -348692, -148115, 271955, 68660, -37747, 59601, -343407, 16744, -107405, 345637, -288359, 25143, -200928, -233917, 137784, 102670, -63628]
10749D89676b01337A27224b35290a02188F4757f831j27709k61485f8708j66605
10739b35313r9015a22320B86067c91231J02896B7085K2788a51333j7595B75534
10728a73171C127b27653d8418k13443e8930j05676M8165A19620Q2126q2072k1447
10717I8227L167b68919j2051b8387F9386B6536K3348a11284A26323B0221d9420
10705c5322k20746B8636a73487h374j56706R733c8969B1108e6264B20396J56667
10694C77063j39094a34804A35962f9540a6404n9388A04179b73041m3966J6873
10684c00134D0691R3886a41784e0375k75475b7378k304j06517j97003B04783h4238
10672a6923B00298b36469P4544J5533O1431j76238H1081g7450C3754K22078p7409
$$ y = [489676, -201337, 127224, -235290, -102188, 64757, -6831, -134540, -396025, -68708, -235313, -334328, -122320, 286067, -391231, -288335, 27085, 49873, -151333, -168928, 275534, -173171, 3127, -227653, -48418, -261861, -58930, -164606, -116441, 119620, 201746, 119674, 98227, 101394, -268919, -280970, -28387, 69386, 26536, 49884, -111284, 126323, 20221, -49420, -35322, -256068, 28636, -173487, -8374, -165080, -155347, -38969, 21108, -56264, 220396, 377063, 237969, -134804, 135962, -69540, -16404, -75792, 104179, -273041, -317007, -300134, 40691, 134577, -141784, -50375, -325850, -27378, -29682, -136199, -333202, 204783, -84238, -16923, 200298, -236469, -161925, -146392, -84961, -261199, 81081, -77450, 33754, 255832, 178423]
10661A78423h9987D3770d1593r7591D9737b06634A09149B898b2424k1431J2459
10650c1396j34657e1196p9688c6741l31297d6742B25030H4984c24847J12044A8056
10638d8981r8583F5876M8621a59448B10651m5653a52004n6038g415j81907k92345
10627d81667E7671h5476N416j63304I4179k6793K60867A05651b2043A08049K98867
10616D06916f2399A1766a55309M1530o4131B21206J25609G5502g8414A57821a46324
10604a94367j34152h1460A99505c0589D9006H43M9104r361J38392f2606k04285
10593b66891k38596N2130b21682f2233h746F6021g0583j21080A44605l0616Q1302
10582A95291d0043l17294e049k0228E3079a03487A38773F0494d1827k73068A3895
$$ y = [178423, -89987, 43770, -41593, -139184, 49737, -206634, 109149, 2898, -22424, -43855, -31396, -166053, -51196, -130884, -36741, -368038, -46742, 225030, 84984, -324847, -212803, 18056, -48981, -147564, 65876, 114497, -159448, 210651, 164998, -152004, -208042, -7415, -189322, -481667, 57671, -85476, -80060, -243364, 94179, 67386, 328253, 105651, -22043, 108049, 406916, -62399, 11766, -155309, -113779, -177910, 221206, 346815, 75502, -78414, 157821, -146324, -194367, -328519, -81460, 199505, -30589, 49006, 843, 49947, 40586, 178978, -62606, -266891, -505487, -453357, -221682, -62233, -8746, 66021, -70583, -191663, 144605, 113989, 195291, -40043, -357337, -5049, -25277, 53079, -103487, 138773, 60494, -41827, -314895, 13895]
10570c0797l37567i3470d3977j50692n0850A13854m5211J0741a69095C86298b84226
10558f5365C973a73413q7465C490L68912n8829f91p3995B0083L91861A4591g4285
10545F7532k2638a5250B80166I635d38736F1492J1533J34802a3463o327F6898
10533a04084a1985q3617k91393R2070g3067q8357j528c2151C23569j40041a39410
10521I5468a00495K3795F4516f8346E787J09069i5214d012k48271k5519A57697
10509b4617A832a7547B53188F7378J37461p3593A6202c8737n6203A77251a12916
10497C17271a8728j93751a05083p7108c3353m0041B81718a17662c615l12697J50115
10486a66197Q1694p3251L2149B62845E5929N55491q0407j26751P3241a12625M7318
$$ y = [-30797, -368364, -93470, -43977, -194669, -245519, 113854, 68643, 79384, -169095, 386298, -284226, -65365, 3973, -173413, -260878, 3490, 372402, 313573, -691, -74686, 20083, 411944, 14591, -74285, 67532, 44894, -15250, 280166, 9635, -438736, 61492, 73025, 207827, -13463, -19790, 66898, -104084, -11985, -95602, -386995, -294925, -73067, -161424, -162952, -32151, 323569, 183528, -139410, 95468, -100495, -76700, 64516, -68346, 5787, 114856, -95214, -4012, -252283, -277802, 157697, -24617, 1832, -17547, 253188, 67378, 204839, 131246, 16202, -38737, -94940, 177251, -112916, 317271, -18728, -212479, -105083, -182191, -33353, -73394, 281718, -117662, -3615, -316312, -166197, -84503, -157754, -125605, 262845, 55929, 611420, 531013, 404262, 477503, -112625, -65307]
10475f5307A68876a32194L1882I1659B0395K64196b76859B55416a05091p0913
10465a76004j827O5784A84283d6927E5818a82023j7740C14694c22933B62374e587
10453B28813A08507a33622k2810c6248A6278a36570q7211o6490M8082b8756l3790
10442f2546C07568F4770a94242d9238D6587a96974A85243a0120j34965D77589
10431G9429p70a65219H9067a64783N1131p751a9102k07620C7862I929a51469A00698
10418a30810m1106m8304Q0022E7141i6441A5249a15955I0512J06354a81946H0632
10406d4431k23838c0270k3418C92287a43295k19445J42616h7464M3386A59673
10395B05123a45316a1804B9640L7592J87852a25668A26195J3102A0997K48400
$$ y = [-65307, 168876, -132194, -100312, 91659, 20395, 284591, -276859, 255416, -105091, -176004, -177831, -112047, 184283, -46927, 55818, -182023, -199763, 314694, -322933, 262374, -5587, 228813, 108507, -133622, -156432, -36248, 16278, -136570, -223781, -290271, -242189, -28756, -62546, 307568, 64770, -194242, -49238, 46587, -196974, 185243, -10120, -145085, 477589, 79429, 78659, -165219, 89067, -164783, -113652, -121403, -19102, -226722, 37862, 9929, -151469, 100698, -130810, -171916, -220220, -140198, 57141, -96441, 15249, -115955, 90512, 196866, -181946, 80632, -44431, -268269, -30270, -53688, 392287, -143295, -362740, -220124, -87464, -44078, 159673, 205123, -145316, -11804, 29640, 67232, 255084, -125668, 126195, 139297, 10997, 259397]
10385B59397c39k57289H7387J53357a544A96661G9170K02072q3744J25098A13398
10373C72253m7429F0561M20544j63872Q8455L2894k02715o2631K82535N1438j62143
10362C45066j70016K67372k07571L6461q1143f4149H2411l2201M4791N1761J65055
10351C11817j02382K57104n1388K33923l16741J68921j37133J27064J66153A49818
10340B53186K3866J01038J944Q4412B12703a00119A33997I913L39091c87461I577
10328a87561B1276b92343A24362o0492R6024J56753j19978k3923m8333a20009
10317C25224I5144g3200A72187A0638J15979j4543a11336B4179J53882F1646H081
10305C29612A1845M3109J32472B0899a5167A43852j8733b63206R453b6758A08761
$$ y = [259397, -339, -257628, 87387, 240744, -1544, 196661, 79170, 281242, 197498, 322596, 113398, 372253, 324824, 60561, 481105, 317233, 405688, 438582, 235867, 173236, 455771, 507209, 345066, 175050, 442422, 234851, 271312, 190169, -64149, 82411, 50210, 95001, 146762, 311817, 209435, 466539, 415151, 649074, 332333, 501254, 364121, 491185, 657338, 149818, 253186, 277052, 378090, 380034, 464446, 212703, -100119, 133997, 9913, 349004, -387461, 9577, -187561, 21276, -292343, 124362, 63870, 159894, 316647, 196669, 172746, 124413, -120009, 325224, 95144, -73200, 172187, 10638, 126617, 112074, -111336, 24179, 178061, 61646, 8081, 329612, 11845, 54954, 187426, 20899, -15167, 143852, 125119, -263206, -253753, -26758, 108761]
10293d4470D6091J53194B8767O1110B6456b11435G5245J01598n8657c30638A56402
10281D0904q217N3178P7149h5306c1671D3516b12596j26920J23280J00557B5939
10269B19990n4573a19866m3271j28011a25224F4748a02491B7929J99799L6133
10259B63861B6404K76569K47328B08844K81228B08653a19312A17814f6398q4778
10249a51176c4556A65646m0276b21637g1793I3503c67756B05716b2860j09450
10239a32310j13334A51295a12465d7696m5373A8820L3192h2401F0577K6332g3627
10227C6890a26253B4411b104l83246A49322b27411D8617c12877Q5162Q5463a700
10215b69964Q4426a6477l32659O9830c7025B0447b76201C9911b344A5227b23329
$$ y = [-44470, 46091, 199285, 28767, 89877, 26456, -211435, 75245, 176843, 118186, -330638, 156402, 40904, 32687, 85865, 163014, -85306, -31671, 43516, -212596, -339516, -216236, -115679, 25939, 219990, 165417, -119866, -163137, -291148, -125224, 64748, -102491, 27929, 227728, 263861, 26404, 302973, 550301, 208844, 490072, 208653, -119312, 117814, -66398, -151176, -34556, 165646, 125370, -221637, -71793, 93503, -367756, 205716, -22860, -132310, -245644, 151295, -112465, -47696, -93069, 18820, 52012, -82401, 60577, 86909, -73627, 36890, -126253, 24411, -2104, -385350, 149322, -227411, 48617, -312877, -227715, -142252, -1700, -269964, -185538, -16477, -349136, -279306, -37025, 20447, -276201, 39911, -2344, 15227, -223329]
10203b033A09035a97843l62187I0923c68501i4189B05641D3206f1837m8974j38508
10192b49319A32455i2000d1061D09627a00500A48472J0818d7425B1207R8142N3457
10181A72806a41838b5617n9605A27402j3609m2849b02788B8397a25100j10540
10171b35640f0076B62071e547n5066J1663A25099a75280g1077G8073B2084P5720
10160I7804a47141E1971c00398a08520A96314f996I572N0741b33651m1906p3388
10149c48945h0942k45114h5664A02535K3300d622j79218G317J36075a75412m6953
10138b22365L3526G585a51247j20391M9705C37494H5829e2639B03184f1185J8294
10127d2891A31746D2245a18297G6536a44428A60641a43875h184k15049a11250
$$ y = [-2033, 109035, -197843, -560030, 90923, -368501, -94189, 205641, 43206, -61837, -110811, -249319, 132455, -92000, -41061, 409627, -100500, 148472, 159290, -47425, 21207, 119349, 172806, -141838, -25617, -85222, 127402, 113793, 70944, -202788, 28397, -125100, -235640, -60076, 262071, -5547, -60613, -48950, 125099, -175280, -71077, 78073, 22084, 97804, -147141, 51971, -300398, -108520, 196314, -6996, 9572, 60313, -233651, -275557, -348945, -80942, -326056, -85664, 102535, 125835, -4622, -183840, 7317, 143392, -175412, -222365, -188839, 7585, -151247, -271638, -221933, 337494, 85829, -52639, 203184, -61185, -42891, 131746, 42245, -118297, 76536, -144428, 160641, -143875, -8184, -223233, -111250]
10116c47600J58272K0119e1948F3305k4038J27010a57999o0577M3467K6480A91961
10104b02961A14152R9682g7864A41328n9602Q5325a29372J944k20984A68253a32228
10092e11743C6150a8513q066o5622C9283d7694A61J6715R8293a03416L2842K0527
10080e0047H1389C3842c5803L927F6518f1528j77122G2173d65876A05059J4927
10069A19986n1131c5536G3322f9290C27525c39598h4895E5108a13856A88489b46665
10057b99761L0987E2384d0585l44986Q3587D9504L12213c72003a7078B3219Q9471
10046A12690C1309b80034a07910L841m2763j47810O8850c941k3722k1969q6887
10035a36519J0376A15592a47047e2463n220D6894a27188j63674A34151n9021e4322
$$ y = [-347600, -189328, -169209, -51948, 63305, 39267, 166277, -157999, -218576, -175109, -148629, 191961, -202961, 114152, 213834, -77864, 141328, 81726, 167051, -129372, -127428, -348412, 168253, -132228, -511743, 36150, -18513, -26579, -92201, 39283, -47694, 161, 16876, 115169, -103416, -70574, -50047, 81389, 33842, -35803, -31876, 66518, -61528, -238650, 72173, -465876, 105059, 119986, 68855, -35536, 73322, -69290, 327525, -339598, -84895, 55108, -113856, 188489, -246665, -299761, -268774, 52384, -40585, -385571, -301984, 49504, 361717, -372003, -17078, 23219, 112690, 31309, -280034, -107910, -104069, -146832, -294642, -225792, -3941, -27663, -49632, -136519, -126143, 115592, -147047, -52463, -57683, 46894, -127188, -290862, 134151, 75130, -54322]
10023a62730C1163J33851c59133G6803i5766j25402r5527B6609c45081h9245G43
10011a40281f4689A86138a37757b1778D17421F0687M664K43427a7899A99470g943
9999d03667B32939c57557a38903F8148b24394b2796j6539l37550B93192n3640
9989B39552g3566l01316h3881n2869j71312G7558h2921B31572b047k1819F5713
9977b67137a12610G0742a00308D0823c11138C42560H7523k8566b87495R1930H8726
9965d6835o2451j11513A73416E5163a90130A10604J6401a35207c4489m5553D4040
9953b09670b6680j80563C3470a40926A73819J5324b57351A4798a67581l9011j12069
9942c18661a5158m57120A24002J2836K6561a66317A1404a42854j2949p2402g0506
$$ y = [-162730, 31163, 165014, -359133, 76803, -95766, -221168, -316695, 26609, -345081, -89245, 743, -140281, -64689, 186138, -137757, -21778, 417421, 60687, 65351, 308778, -17899, 199470, -7943, -403667, 232939, -357557, -138903, 68148, -224394, -22796, -39335, -376885, 293192, 239552, -73566, -374882, -83881, -136750, -308062, 77558, -82921, 231572, -2047, -23866, 65713, -267137, -112610, 70742, -100308, 40823, -311138, 342560, 87523, 58957, -287495, -195565, 88726, -46835, -109286, -220799, 173416, 55163, -190130, 110604, 127005, -135207, -34489, -80042, 44040, -209670, -26680, -207243, 33470, -140926, 173819, 189143, -257351, 14798, -167581, -206592, -318661, -15158, -472278, 124002, 136838, 163399, -166317, 11404, -142854, -155803, -228205, -70506]
9930A46675f3030A14139m8454J90707D7115a31698j31506a20003l74796C6340
9919a61809j54174B37967j05256g9214k19114a18272B3827d51053a12446a9809
9908a66726K3118c4376j84501d4250j23984c4904r2130A55392h6546B15048a12824
9896b61439c8989q3733B1653a08675k15540a3696j56280d4746d109k67835A71530
9884A24182c3110B31884f0779b3152A02798c60479c5253k59527f7382J8988j62188
9873b10582C1593O7263k6334g6777B29773a72592j32459B05840A1505a96584j19231
9862c15815f6907j6459A07590a62179a2861k52756A42262f1215j76269A89798
9851C0996a64531N6156o0900F1585a82485k97414b24496A35769R6584e0488n6169
$$ y = [146675, -63030, 114139, 65685, 256392, 47115, -131698, -263204, -120003, -494799, 36340, -161809, -315983, 237967, 132711, -79214, -298328, -118272, 23827, -451053, -112446, -19809, -166726, -143608, -34376, -218877, -44250, -168234, -34904, -127034, 155392, -86546, 215048, -112824, -261439, -38989, -122722, 21653, -108675, -324215, -13696, -169976, -44746, -4109, -271944, 171530, 124182, -33110, 231884, -60779, -23152, 102798, -360479, -35253, -294780, -67382, -48394, -210582, 31593, 98856, 72522, -76777, 229773, -172592, -305051, 205840, 11505, -196584, -315815, -66907, -83366, 107590, -162179, -12861, -265617, 142262, -61215, -237484, 189798, 30996, -164531, -108375, -169275, 61585, -182485, -479899, -224496, 135769, 232353, -50488, -106657]
9840a06657p7000H7041B5061c93304A70913c76648c7887A62003N4630c62735A15470
9828a74725M4018E1899K24649G8454b84565J39674Q116C9987b1613A52022b7920
9816a68221o5296a05504K9170f467m766q4995Q123o0303L9488B0415L49083h047
9803B39755A13530b561j95956c5535p9715c204r8605A48587k383a32663H6488
9791C66541h3443j28327D0115a80088F3501a36852B20832a66765B52983b59548
9780D0313J9092H484a59646B74474a90205K7226l8755i8351B69888a62744K1454
9769a41290F7936F531Q9240a51387j91278M1850L2921D8875L2742c99253J15459
9758b83794O886C09426g3222C46756d93664e7193k81769j30301a5087q5032j30585
$$ y = [-106657, -183657, 87041, 25061, -393304, 170913, -376648, -37887, 162003, 216633, -362735, 115470, -174725, -130707, 51899, 276548, 78454, -284565, -144891, -136775, 39987, -21613, 152022, -27920, -168221, -233517, -105504, -76334, -6467, -11233, -96228, -88105, -148408, -108920, 20415, 369498, -8047, 239755, 113530, -2561, -198517, -35535, -115250, -3204, -101809, 148587, 146204, -132663, 86488, 366541, -83443, -211770, 40115, -180088, 63501, -136852, 220832, -166765, 252983, -259548, 40313, 59405, 8484, -159646, 274474, -190205, -162979, -201734, -98351, 269888, -162744, -141290, 67936, 6531, 95771, -151387, -342665, -300815, -267894, 48875, 81617, -399253, -283794, -276908, 309426, -73222, 346756, -493664, -57193, -338962, -469263, -15087, -100119, -230704]
9747b30704c110j9482j14153K4515M9061r596k89973A56817h6143A47850i7692
9735b15904R0287A22793A8627g253A66268n4633f9900C3330a88036i2601b7291
9723c98104a14335r893C20215b82996A6916b1666k01402J03230N0760I5290a74259
9711A4627J99010j05487c77343a07403N1491k40936f9034A12677h5484b0092k87179
9700c07271E5624a7405C3815c523B82397a44817m2478K2471j56536c2312A88859
9688d8571J2337N74k41674j84474J60043A0819b8133k8066K3632m8785k54557
9677c35909a5361C5263P3185P430O4718j1050d5961Q338e659n5543k18276a12000
9664a31230L1773m9742D71004c2316M207q1354l74410a01609H605a18196o8455
$$ y = [-230704, -3110, -22592, -136745, -112230, -63169, -72765, -362738, 156817, -86143, 147850, -97692, -215904, -125617, 122793, 18627, -7253, 166268, 111635, -69900, 33330, -188036, -92601, -27291, -398104, -114335, -124228, 320215, -282996, 16916, -21666, -223068, -119838, -69078, 95290, -174259, 14627, 213637, 108150, -377343, -107403, -55912, -296848, -69034, 112677, -85484, -20092, -307271, 55624, -17405, 33815, -3523, 282397, -144817, -187295, -164824, -321360, -32312, 188859, -48571, -36234, -35660, -277334, -461808, -301765, 10819, -28133, -56199, -32567, -81352, -335909, -15361, 35263, 108448, 115878, 180596, 169546, -45961, -37623, -5659, -61202, -279478, -112000, -131230, -99457, -149199, 471004, -32316, -28109, -109463, -483873, -101609, 8605, -118196, -186651]
9653a86651A10817e57745a96327A42043d8981C0177a15977j84334H0872c34060
9642G9767h137o9685l63982a23247A87411G3364R758a8440k18845A07255A9633
9630A66852c88159a2071l0650I5953c0443j02907j50764C57729b61253d1293r273
9619e0566C0246F863J96874c95759A44718N859b28381J04057J9147j92012J33096
9608a64093l1406M3993A64997H1702J11728f4756q9581G7116k3978b60431a02678
9596b61012L6164B49073b798p3868i614A08980O8050e5214k9165F1455a0882k56094
9584b66976J11109j35929g6468j47752A53428f603k6859A37154C7762a20012A21479
9572a81039c4958B33774i4672j63597A19871a64042B29419c10397R9314c9429
$$ y = [-186651, 110817, -557745, -196327, 142043, -48981, 30177, -115977, -300311, 80872, -334060, 79767, -8137, -77822, -441804, -123247, 187411, 73364, 83122, -18440, -237285, 107255, 19633, 166852, -388159, -12071, -42721, 95953, -30443, -133350, -284114, 357729, -261253, -41293, -50566, 30246, 6863, 203737, -395759, 144718, 150577, -228381, -124324, -105177, -297189, -164093, -195499, -151506, 164997, 81702, 193430, -64756, -154337, 77116, 53138, -260431, -102678, -261012, -224848, 249073, -2798, -76666, -9614, 108980, 177030, -55214, -84379, 61455, -10882, -266976, -155867, -291796, -76468, -224220, 153428, -6603, -33462, 137154, 37762, -120012, 121479, -181039, -34958, 233774, -94672, -258269, 119871, -164042, 229419, -310397, -211083, -39429]
9561A35928a27755A79830l1478m4777m5868O3188d02747D8502K0936a05654k1100
9550a26754j21887A04160c35990a63666g6372o9072j45767f2538j84857Q8212
9540a59183M5689A23183N3782d9156B6453K53a48283f9410k07220k1387i9582
9528d62034f9380B1709f0818r8428l45227A45701n6697c39447l1188B82011d2847
9516g5827C88329j50453A3708c00407F0635f0353G1884a59641e4000j76762j0442
9505b41204J18648A64468b71149L9898A03353L9774a9246C01941c89534J73708
9495b15826j20499A54843c40503C3644b3536j43008p8693H760a5170A07977a99384
9483A47576J1840h3662q3322l0891A662O9372b22713f5510B82302b18295j54494
$$ y = [135928, -127755, 179830, 148352, 103575, 57707, 120895, -402747, 48502, 69438, -105654, -126754, -248641, 104160, -335990, -163666, -76372, -145444, -291211, -62538, -247395, -159183, -113494, 123183, 176965, -49156, 26453, 26706, -148283, -69410, -276630, -298017, -99582, -462034, -69380, 21709, -60818, -159246, -504473, 145701, 89004, -339447, -370635, 282011, -42847, -75827, 388329, 237876, 13708, -300407, 60635, -60353, 71884, -159641, -54000, -230762, -241204, -122556, 164468, -271149, -231251, 103353, 143127, -19246, 301941, -389534, -215826, -336325, 154843, -340503, 33644, -23536, -166544, -245237, 8760, -15170, 107977, -199384, 147576, 159416, -83662, -166984, -197875, 1662, 71034, -222713, -65510, 282302, -218295, -372789]
9472c72789G3411b567k52179B9442K9746i0713A1461f3954b8702D4412J94846
9461B39258G4021J84713a23987o8356C02162c82206J3998B49265a42808K9579
9451a13229o5557H8203d63846g4394j10221q4218N7599p282d019m043B08898b44511
9438B62173b16836a02906j4214a0943G6885K5207b96388g0934k62207a57205b2862
9426d2525j0956l07080g1563B70203J111b401A65002a86203D5489a96669A36635
9414b2107A96843A2796a45466B33344f7604r8546o8953A45328a28305r952A31380
9402b92432C8861a46609D1192k085K392b34601e8642C77350I0833a88725l3520
9391b22245C57123A34932d4145j60727J9854A33712c59731J6210g301B49192d1207
$$ y = [-372789, 73411, -2567, -254746, 29442, 59188, -90713, 11461, -63954, -28702, 44412, 239258, 74021, 258734, -123987, -192343, 302162, -382206, -368208, 249265, -142808, -113229, -178786, 88203, -463846, -74394, -184615, -268833, -211234, -218516, -4019, -8062, 208898, -244511, 262173, -216836, -102906, -117120, -10943, 76885, 102092, -296388, -70934, -333141, -157205, -22862, -42525, -53481, -360561, -71563, 270203, 271314, -2401, 165002, -186203, 45489, -196669, 136635, -22107, 196843, 12796, -145466, 233344, -67604, -166150, -235103, 145328, -128305, -138257, 131380, -292432, 38861, -146609, 41192, 39107, 41499, -234601, -58642, 377350, 90833, -188725, -222245, 357123, 134932, -44145, -204872, -185018, 133712, -359731, -343521, -7301, 249192, -41207]
9379A49204o5227e4276C134b1164r4259B00696B998f2016a3753n6207k13021M4749
9367b38232B28273h0453k33848D6175j4073b47313e8496j08149E7986J9471c42312
9355I7843m3397b15868e7074G9580a29065R224A37809c0847n3912H0074h3031
9343e4640A91028A8982a43789C10042a87321F0536a73054j25755F8748b31435
9332D5151c25382D8653K65844a75412K7039E490b67600l5838g9352j85044a25113
9320c39517B26640B8537b09016C0542K14690I8023b8739n7437j60448j26603J00976
9309b72251d7725l03444B5224L2728e7896E6373b46888J03693F065a50815j6299
9298a67114d7186k98108A3245L1469B165K40364b0517j07498e8569B0536P7660
$$ y = [149204, 83977, -54276, 3134, -21164, -115423, 200696, 2998, -62016, -13753, -69960, -282981, -238232, 228273, -80453, -314301, 46175, 32102, -247313, -58496, -166645, 57986, 77457, -342312, 97843, 54446, -215868, -57074, 79580, -129065, -119841, 137809, -30847, -84759, 80074, -83031, -54640, 191028, 18982, -143789, 310042, -187321, 60536, -173054, -298809, 68748, -231435, 45151, -325382, 48653, 314497, -175412, -148373, 5490, -267600, -303438, -79352, -264396, -125113, -339517, 226640, 28537, -209016, 30542, 245232, 98023, -28739, -86176, -246624, -373227, -272251, -47725, -351169, 25224, 57952, -57896, 56373, -246888, -143195, 6065, -150815, -167114, -47186, -345294, 13245, 44714, 2165, 242529, -20517, -128015, -58569, 20536, 98196]
9287I8196L0137a44141I679b27297a443n2497D02744a37243A06384L234a30067
9275a93353G1057f4657A22671N443h3108E013K739K81655b19804B843J88185K4323
9263B15351D1466g6316A78159d60097e8913j84730m0884d9167B0953a47760M7544
9252a00216j40880A88519K548h3006A30872E4174a83135B3975P7341b04347B4275
9240A78624c24464I6091c10673h7489k30213d5238J9125j02118l566A99317e0753
9228c00695j01744d7036A8293b50247A6384c6677A6599K46019F0170K0516a73960
9216b14123C39605a91171e0283o3474B390a84024B10566A1742a89550B17730O6635
9205B84365a94149f3328j18280j25389E0846a14307M1754A80535b26755a6962
$$ y = [98196, 128333, -144141, 9679, -227297, -1443, -53940, 402744, -137243, 106384, 109618, -130067, -193353, 71057, -64657, 122671, 128114, -83108, 5013, 7752, 289407, -219804, 2843, 191028, 215351, 41466, -76316, 178159, -460097, -58913, -243643, -284527, -49167, 20953, -147760, -100216, -241096, 188519, 191067, -83006, 130872, 54174, -183135, 23975, 101316, -204347, 24275, 178624, -324464, 96091, -310673, -87489, -317702, -45238, -26113, -128231, -131797, 199317, -50753, -300695, -402439, -47036, 18293, -250247, 16384, -36677, 16599, 262618, 60170, 80686, -173960, -214123, 339605, -191171, -50283, -113757, 2390, -184024, 210566, 11742, -189550, 217730, 284365, -194149, -63328, -181608, -306997, 50846, -114307, -72553, 180535, -226755, -16962]
9194a52959n0497k80350D00098d08738b9624G472b97511a16299b1381j60237f1837
9182g8078D924a44319k00689A0177A496a52847j68312a09421j21515B283d3228
9170B13455i0368q7780C6729b54666e4974j06152E0315B53b34090j83354a45552
9158H9055c6090C1084e9608J9945A26855a72389H5352i7701L0741C41754d25725
9146C8674e00975E0255J10220a2861j94706G0972h4677K4695A54240a58635p6272
9135b34907D0534c76688a50469n3193j37885B56b36035O1030j7656p6534A61030
9123c5947j32999A01562L2173D5919b7597I5622A3560h9223a2021n4652A03588
9111c07974a6349n1995E9693J22507J76381a25495j06622r3431A70103b44018
$$ y = [-152959, -203456, -483806, 400098, -408738, -29624, 7472, -297511, -116299, -21381, -181618, -61837, -78078, 4924, -144319, -345008, 10177, 1496, -152847, -321159, -109421, -230936, 2283, -43228, 213455, -90368, -178148, 36729, -254666, -54974, -161126, 50315, 253, -234090, -417444, -145552, 89055, -36090, 31084, -59608, -39663, 126855, -172389, 85352, -97701, -66960, 341754, -425725, 38674, -500975, 50255, 160475, -12861, -207567, 70972, -84677, -59982, 154240, -158635, -234907, 40534, -376688, -150469, -203662, -341547, 256, -236035, -175005, -192661, -269195, 161030, -35947, -168946, 101562, 133735, 45919, -27597, 95622, 13560, -89223, -12021, -66673, 103588, -307974, -16349, -68344, 59693, 182200, 358581, -125495, -232117, -325548, 170103, -244018]
9100a00223j08119R2389f597j69204A4414c5044I1047F815J34265c9621l03049
9089c42670O6575B69008a79575n3202g2523B8901d4503k46223R61A18109d86166
9077b91242j23724B4417b68808A37522o6228i5927q1259l9229E8127k4849R3600
9066A26878a52655C95350A30219P9479a18987r5726l5129C25047f6622a4658m05986
9055d20644e3262O388I3304b67987B86169d87063b03468m3614r6408J27491R4787
9044a21212B25720b44295M5987A88484c3748k80734f0613j10327e6383m05940
9034d62323A16537a01136I9623f0960n0250M8071I7901b25126H6251a2046p120
9023a9166B57516A8833K96616j57662J23464b38609f370A33652n5707i2330E4705
$$ y = [-100223, -208342, -115953, -6597, -175801, 14414, -35044, 91047, 6815, 141080, -39621, -342670, -276095, 269008, -179575, -232777, -72523, 28901, -44503, -290726, -289765, 118109, -486166, -291242, -414966, 24417, -268808, 137522, 71294, -95927, -177186, -216415, 58127, 33278, 126878, -152655, 395350, 130219, 209698, -118987, -214713, -249842, 325047, -66622, -14658, -420644, -53262, -46874, 93304, -267987, 286169, -487063, -203468, -247082, -343490, -215999, -121212, 225720, -244295, -198308, 188484, -33748, -314482, -60613, -170940, -56383, -462323, 116537, -101136, 99623, -60960, -111210, -63139, 97901, -225126, 86251, -12046, -19166, 257516, 18833, 315449, 157787, 281251, -238609, -6370, 133652, 77945, -92330, 54705]
9011A75978f3515O783A30044a34119F0757a29483A83964D6164f9337B33737g6021
8999E9114Q8172L8500a54750k20574G0105d4420j5186K1818j97822C32974a04042
8987a02215A5461a00251d496j8112A05187a5229j03666A10579a63848j2309k82439
8976d58596E7286L1055a56267C5791N6779a25433j63039k98936f9500p2930r3615
8965b36045R0608j0826j92063I4872c7953A30792l919b14461Q7413o934b3228
8953I5064b70307g3149k49889a25322K3573B11187B8983h207k4666p3515B32554
8941b26388r7442d6690k39914I3074J19847A850K0765a64917H2244a69572B9451
8929A18443J09562c33939i423j9087B53323L48017P95819K870307M296394A932069
$$ y = [175978, -63515, -56732, 130044, -134119, 60757, -129483, 183964, 46164, -69337, 233737, -76021, 59114, 147286, 185786, -154750, -375324, 70105, -44420, -59606, -37788, -235610, 332974, -104042, -102215, 15461, -100251, -4496, -22608, 105187, -15229, -118895, 110579, -163848, -176157, -458596, 57286, 88341, -156267, 35791, 92570, -125433, -288472, -587408, -69500, -142430, -236045, -145437, -156263, -348326, 94872, -37953, 130792, 126873, -214461, -127048, -133982, -23228, 95064, -270307, -73149, -323038, -125322, -101749, 211187, 28983, -8207, -32873, -106388, 232554, -226388, -323830, -46690, -286604, 93074, 212921, 1850, 22615, -164917, 82244, -169572, 29451, 118443, 228005, -333939, -9423, -28510, 253323, 601340, 1397159, 4267466, 8563860, 1932069]
8918F86635I9878O0449f088H7670a30209A14526a25401B13853i1165j26099B51982
8906A15708N8094a34814B3870J7804a07112d4556A67151d03070h6914L4308G4854
8894c3854F497N7751d4792A0373b1710C4534R7296m7284d94603D36515b50609
8882A20806j111a8339B5653d2987A70484e4238D9418g37677a58081A37887k6973
8871A10914D8729Q1741P8756H0233d9793A9098d2973m8819H9230a25589J1245
$$ y = [686635, 99878, 160327, -6088, 87670, -130209, 114526, -125401, 213853, -91165, -217264, 251982, 115708, 173802, -134814, 23870, 41674, -107112, -44556, 167151, -403070, -86914, -52606, 74854, -33854, 6497, 64248, -44792, 10373, -21710, 34534, 131830, 84546, -494603, 436515, -250609, 120806, 119695, -18339, 25653, -42987, 170484, -54238, 49418, -737677, -158081, 137887, 110914, 48729, 130470, 209226, 80233, -49793, 19098, -42973, -91792, 89230, -125589, -114344]
$$ [...]
##END NTUPLES=NMR SPECTRUM
##END=
