##TITLE=AC1686_PANAM14367_8637597_SyNThsx66L
##JCAMPDX= 6.0         $$ Bruker NMR JCAMP-DX V2.0
##DATA TYPE= NMR SPECTRUM
##DATA CLASS= NTUPLES
##ORIGIN= BRUKER
##OWNER= Administrator
$$ 1.72 TOPSPIN		Version 2.1
$$ 2014-05-31 02:28:59.199 -0700  Administrator@X
$$ Compression mode = diff/dup
##.OBSERVE FREQUENCY= 400.02188249412
##.OBSERVE NUCLEUS= ^1H
##.ACQUISITION MODE= SIMULTANEOUS (DQD)
##.ACQUISITION SCHEME= undefined
##.AVERAGES= 8
##.DIGITISER RES= 22
##SPECTROMETER/DATA SYSTEM= spect
##.PULSE SEQUENCE= zg30
##.SOLVENT NAME= COFFEE_meoh
##.SHIFT REFERENCE= INTERNAL, COFFEE_meoh, 1, 14.98509
##AUDIT TRAIL= $$ (NUMBER, WHEN, WHO, WHERE, PROCESS, VERSION, WHAT)
$$ ##TITLE= Audit trail, TOPSPIN		Version 2.1
$$ ##JCAMPDX= 5.01
$$ ##ORIGIN= Bruker BioSpin GmbH
$$ ##OWNER= Administrator
$$ $$ E:\/data/COFFEE/nmr/AC1686_PANAM14367_8637597_SyNThsx66L/10/pdata/1/auditp.txt
$$ ##AUDIT TRAIL=  $$ (NUMBER, WHEN, WHO, WHERE, PROCESS, VERSION, WHAT)
(   1,<2014-05-31 02:28:52.074 -0700>,<Administrator>,<X>,<go>,<TOPSPIN 2.1>,
      <created by zg
	started at 2014-05-31 02:27:45.855 -0700,
	POWCHK enabled, PULCHK disabled,
       configuration hash MD5:
       C8 4E 4E 5D D3 5C D8 9E 9F 52 82 E0 59 8A DE 15
       data hash MD5: 64K
       A6 66 BB 7F 24 AF 8E 85 1A CF 28 43 71 FD BF 07>)
(   2,<2014-05-31 02:28:55.152 -0700>,<Administrator>,<X>,<proc1d>,<TOPSPIN 2.1>,
      <Start of raw data processing
       efp LB = 0 FT_mod = 6 PKNL = 1 PHC0 = 0 PHC1 = 0 SI = 32K 
       data hash MD5: 32K
       50 B3 F9 05 63 36 BC 4C B5 EF B5 F3 FE C6 31 91>)
(   3,<2014-05-31 02:28:55.527 -0700>,<Administrator>,<X>,<proc1d>,<TOPSPIN 2.1>,
      <pk PHC0 = 90.46692 PHC1 = 0 
       data hash MD5: 32K
       E7 7D FB 84 02 7D 22 56 C3 77 32 F8 FF B0 C8 60>)
(   4,<2014-05-31 02:28:55.667 -0700>,<Administrator>,<X>,<proc1d>,<TOPSPIN 2.1>,
      <abs ABSG = 1 
       data hash MD5: 32K
       3E 38 7D 4C 66 1C 9A 1C 62 6C 71 60 A6 F9 6A 0F>)
(   5,<2014-05-31 02:28:55.792 -0700>,<Administrator>,<X>,<proc1d>,<TOPSPIN 2.1>,
      <abs ABSG = 2 
       data hash MD5: 32K
       C2 6C 2E 8D 62 D4 CB AA FD 51 41 08 DA 76 29 C9>)
(   6,<2014-05-31 02:28:55.839 -0700>,<Administrator>,<X>,<proc1d>,<TOPSPIN 2.1>,
      <abs ABSG = 3 
       data hash MD5: 32K
       E4 C5 33 8C 55 71 D0 C9 04 01 44 AC 3D 1E 23 A9>)
(   7,<2014-05-31 02:28:55.886 -0700>,<Administrator>,<X>,<proc1d>,<TOPSPIN 2.1>,
      <abs ABSG = 4 
       data hash MD5: 32K
       7E DF 0A 7A 72 3E 48 85 85 90 CF 2C 5E D3 C8 25>)
(   8,<2014-05-31 02:28:55.949 -0700>,<Administrator>,<X>,<proc1d>,<TOPSPIN 2.1>,
      <abs ABSG = 5 
       data hash MD5: 32K
       D6 A1 A4 CC BE 8C 94 65 C3 96 FD BC C0 6B 27 94>)
$$ ##END=
$$ 
$$ $$ hash MD5
$$ $$ 3D 3D DC BB 42 B3 CF 00 D9 D0 91 35 7D CB 72 18
##$RELAX= 
##$RELAX= 
##$RELAX= 
##$RELAX= 
##$RELAX= 
##$RELAX= 
##$RELAX= 
$$ Bruker specific parameters
$$ --------------------------
##$DU= <E:\>
##$EXPNO= 10
##$NAME= <AC1686_PANAM14367_8637597_SyNThsx66L>
$$ [...]
150 150 150 150 150 150 150 150
##$TP07= 0
##$TPNAME0= <>
##$TPNAME1= <>
##$TPNAME2= <>
##$TPNAME3= <>
##$TPNAME4= <>
##$TPNAME5= <>
##$TPNAME6= <>
##$TPNAME7= <>
##$TPOAL= (0..7)
0.5 0.5 0.5 0.5 0.5 0.5 0.5 0.5
##$TPOFFS= (0..7)
0 0 0 0 0 0 0 0
##$TUNHIN= 0
##$TUNHOUT= 0
##$TUNXOUT= 0
##$USERA1= <user>
##$USERA2= <user>
##$USERA3= <user>
##$USERA4= <user>
##$USERA5= <user>
##$V9= 5
##$VALIST= <valist>
##$VCLIST= <CCCCCCCCCCCCCCC>
##$VD= 0
##$VDLIST= <DDDDDDDDDDDDDDD>
##$VPLIST= <PPPPPPPPPPPPPPP>
##$VTLIST= <TTTTTTTTTTTTTTT>
##$WBST= 2048
##$WBSW= 25
##$XGAIN= (0..3)
0 0 0 0
##$XL= 0
##$YL= 0
##$YMAX_a= 592612
##$YMIN_a= -512812
##$ZGOPTNS= <>
##$ZL1= 120
##$ZL2= 120
##$ZL3= 120
##$ZL4= 120
##$ABSF1= 14.98509
##$ABSF2= -5.573092
##$ABSG= 5
##$ABSL= 3
##$ALPHA= 0
##$AQORDER= 0
##$ASSFAC= 0
##$ASSFACI= 0
##$ASSFACX= 0
##$ASSWID= 0
##$AUNMP= <proc_prof1d_extract_pilot.lims>
##$AXLEFT= 0
##$AXNAME= <>
##$AXNUC= <1H>
##$AXRIGHT= 0
##$AXTYPE= 0
##$AXUNIT= <>
##$AZFE= 0.1
##$AZFW= 0.1
##$BCFW= 0
##$BC_mod= 0
##$BYTORDP= 0
##$COROFFS= 0
##$CY= 15
##$DATMOD= 1
##$DC= 0
##$DFILT= <>
##$DTYPP= 0
##$F1P= 0
##$F2P= 0
##$FCOR= 0.5
##$FTSIZE= 32768
##$FT_mod= 6
##$GAMMA= 0
##$GB= 0
##$INTBC= 1
##$INTSCL= 1
##$ISEN= 128
##$LB= 0
##$LEV0= 0
##$LPBIN= 0
##$MAXI= 10000
##$MC2= 0
##$MEAN= 0
##$ME_mod= 0
##$MI= 0
##$NCOEF= 0
##$NC_proc= -8
##$NLEV= 6
##$NOISF1= 0
##$NOISF2= 0
##$NSP= 0
##$NTH_PI= 0
##$NZP= 0
##$OFFSET= 14.98509
##$PC= 1
##$PHC0= 90.46692
##$PHC1= 0
##$PH_mod= 1
##$PKNL= yes
##$PPARMOD= 0
##$PPDIAG= 0
##$PPIPTYP= 0
##$PPMPNUM= 2147483647
##$PPRESOL= 1
##$PSCAL= 4
##$PSIGN= 0
##$PYNMP= <proc.py>
##$REVERSE= no
##$SF= 400.02
##$SI= 32768
##$SIGF1= 0
##$SIGF2= 0
##$SINO= 400
##$SIOLD= 32768
##$SPECTYP= <>
##$SREGLST= <1H.CDCl3>
##$SSB= 0
##$STSI= 32768
##$STSR= 0
##$SW_p= 8223.68421052631
##$SYMM= 0
##$S_DEV= 0
##$TDeff= 65536
##$TDoff= 0
##$TI= <>
##$TILT= no
##$TM1= 0
##$TM2= 0
##$TOPLEV= 0
##$USERP1= <user>
##$USERP2= <user>
##$USERP3= <user>
##$USERP4= <user>
##$USERP5= <user>
##$WDW= 1
##$XDIM= 32768
##$YMAX_p= 464092598
##$YMIN_p= -764501
##$CURPLOT= <Network HP LaserJet P1505>
##$CURPRIN= <$Network HP LaserJet P1505>
##$DFORMAT= <normdp>
##$LAYOUT= <+/1D_H.xwp>
##$LFORMAT= <normlp>
##$PFORMAT= <normpl>
##$SURQMSG= 1
$$ End of Bruker specific parameters
$$ ---------------------------------
##NTUPLES= NMR SPECTRUM
##VAR_NAME=  FREQUENCY,     SPECTRUM/REAL,   SPECTRUM/IMAG
##SYMBOL=    X,             R,               I
##VAR_TYPE=  INDEPENDENT,   DEPENDENT,       DEPENDENT
##VAR_FORM=  AFFN,          ASDF,            ASDF
##VAR_DIM=   32768,         32768,           32768
##UNITS=     HZ,            ARBITRARY UNITS, ARBITRARY UNITS
##FACTOR=    0.250966925370066, 1,           1
##FIRST=     8223.43324360094, -181354,      -47991
##LAST=      0,             -1846,           -217169
##MIN=       0,             -764501,         0
##MAX=       8223.43324360094, 464092598,    0
$$ Real data points
##PAGE= N=1
##DATA TABLE= (X++(R..R)), XYDATA
$$ [...]
23873 -110222 204335 -937 364985 -96952 -314582 -49597 -371494 22068 32089 -4185 27267
23861 -207906 -130631 207047 -43825 68198 -353717 134876 -216130 135074 92407 -32319
23850 164219 -25819 88251 -120325 162108 21221 40064 104069 -251548 -57279 -518253 -42750
23838 183921 88452 154423 184262 221110 332051 -251913 286079 -271365 -81509 43661 186601
23827 186601 134917 -15553 200974 48546 267249 224350 -118200 93511 -40929 13300 -303974
23815 93210 66996 -229854 -383657 -217561 -168271 138956 238694 146593 -480410 -217564
23804 -218025 260253 259418 -128950 -65539 -1710 -78172 71918 -230303 176774 155952 -100628
23792 -258589 248864 -334299 357947 83665 73011 -327828 54106 -129843 274650 213943
23782 213943 -323073 138247 42971 207315 -19851 60406 -476505 -5720 218015 105703
23771 -82923 5886 125808 133693 -105342 87160 -36265 162058 -113078 107747 127429 59321
23759 172576 -206039 -13156 -125173 -120731 -31445 -409704 -106505 -63257 73782 -235532 27667
23747 98516 -134590 35900 -140291 -137912 -20735 138482 -346991 -35722 -162367 439145 149400
23735 45028 -158269 49178 -21759 39495 -268464 -127849 189265 -190408 -222386 87188 -37003
23723 -119004 -22141 -148669 112549 239694 24811 192884 -71839 -129939 17883 -256221
23712 -440109 -193792 -310176 209188 196522 -212286 -235946 61926 -93613 35689 -107859
23701 -58172 359283 -218133 -79762 -255743 -189482 160212 52199 60830 -62691 97347 142375
23690 142375 341291 -83098 353607 72770 64545 -123133 -261761 -193469 -3068 42443 42118
23679 42118 -3939 266624 -33520 -66204 207123 189976 -240733 -226656 109392 -250618 -64890
23667 65509 113486 85717 147220 -170325 -213848 -172983 29793 -114080 272349 150688 -31050
23655 -150665 203619 93390 37649 -68387 -29926 -55519 153209 -192454 -196115 -19924 -159883
23644 -159883 -6095 217600 206916 -136854 35868 146268 160272 -97854 -187181 250562 166796
23633 166796 156118 335759 -287856 -223030 1303 -162015 233876 215683 220476 -102325 115582
23621 -182785 -370875 -11421 -124527 -69489 165755 -267030 -159210 -167495 -90821 -364454
23611 -364454 -229368 -259575 -266219 211995 58782 70140 75938 153348 -354168 -22930 99693
23599 -78445 -177941 97945 -246028 94890 192420 -340809 125229 -55721 -50956 199078 -116911
23587 42249 52934 19693 269978 -125332 128331 -96957 -83239 156876 259529 -38078 -275381
23576 -275381 101540 -130088 34679 -1531 165215 115356 -219228 -89630 272141 -8702 141023
23564 271134 31443 -27107 -42467 55309 29768 -71361 76023 -229003 -11974 -26083 229825
23552 3993 -3999 39125 -24803 29512 -138324 80124 -15945 -248030 -91722 -127012 -115212 75760
23539 58775 105241 336472 206673 258490 -203144 -239623 -123471 29947 -110998 5391 122357
23528 122357 -19069 -8667 -64771 -194520 -162174 -202868 32881 -74986 -119379 168032 119028
23517 119028 -120296 -39958 163545 -167938 -116655 -63540 -197234 -75769 32770 -4163 5626
23505 26219 -230754 219103 -130180 -144451 -50493 242535 102249 -76542 -157878 -115966 215153
23493 -79082 54888 -90691 -48303 189719 172137 -139815 -348596 -82271 -263962 -233929 -151230
23482 -151230 -201461 -181044 -4877 127019 -115781 212977 -87914 468340 -118024 158616
23471 -107098 113123 157627 -61648 200247 -247769 85153 -318033 -177374 -165969 106252
23460 -42248 162182 -79217 485502 88440 -556442 -207597 -108854 -228156 -27517 -214401
23450 -214401 -30465 -475906 140615 96304 200753 -177142 -49046 72983 59067 -72711 -570115
23439 -570115 -446763 333639 -27873 -12331 197433 66732 60158 -196718 153208 66604 -290171
23427 -7823 -224540 -289986 201338 -182603 -79205 -22910 174530 300288 52856 303736 55253
23415 13467 53950 -201765 -219100 -32221 230766 47110 -229209 82885 110531 -84518 146834
23403 26110 -55849 -61618 -246391 -49223 -278125 22319 50484 -64423 -42144 52652 -123308
23391 60876 135453 87701 3741 -19737 -111001 -54791 16790 -5814 -56230 47776 -125900 -59816
23378 -108054 254949 -15234 -109786 74669 -106847 157260 -361351 -88940 275204 -22357
23367 -229414 -218695 221844 -159772 17040 199350 76461 27508 -29390 -16043 121157 219305
23356 219305 110322 172343 -200922 7461 45636 -150008 -41030 202084 97703 -12247 -100514
23345 -100514 -781 23907 -311844 -76244 -115688 -102087 -500015 -203075 -130472 -2309 -2294 -164503
23333 -164503 -83066 19755 -216371 -102938 -126557 81782 147339 -356547 223532 202259 196210
23322 196210 -97105 -136344 -82393 82035 407865 -77836 122032 -16182 -65461 124500 73709
23311 73709 -70070 232274 96194 14122 -111230 404373 -53747 129563 76558 -169578 51754
23299 -48099 74060 -49416 -14601 -107802 31771 23946 -300822 -120853 37763 -124069 41636
23287 -87856 -53559 -15826 25232 -284311 -16891 109452 45615 -269835 -184063 -11703 40388
23275 -267459 -449268 -435174 -17909 -233617 253708 83002 101892 77855 -244543 33705 -118749
23263 31911 -119233 55702 -149494 191014 271562 -117164 -129826 -375086 -212520 -156422
23253 -156422 -62025 -154589 -59306 -168600 -173450 -255973 114258 -189670 -131747 -56570 154947
23241 -56738 -166544 54604 -350897 -70578 71224 74683 -80242 174734 29005 196520 -175009
23229 145019 -215231 116078 -35210 -145185 -51715 -179684 200515 309937 -208298 -5000
23218 2575 37743 87797 105869 -92810 -71217 -209969 -15359 -266370 -225108 62919 85692
23207 85692 -331788 36341 -62050 -146405 70692 224592 -68997 -307458 318420 -34125 -252768
23196 -252768 -315703 424991 -181293 -28306 -234822 -112731 -60724 -99160 -236625 331593
23185 -134970 -538495 124038 -97999 -58508 -179712 -49013 -235441 -15275 23927 -161963
23174 68651 103286 140415 -114866 -160362 134392 -187496 -124578 48513 59360 111257 182952
23163 182952 -141690 -78009 117701 -35485 19650 170043 39360 -174015 28814 293017
23153 293017 -234442 85246 -208071 39919 305069 -243576 42978 -277011 195699 153722
23143 153722 -221345 10383 313678 -118688 -310351 -74244 -60244 -126468 -111232 44705 73246
23132 73246 -336089 230448 66829 -222140 68701 -39764 -129 239605 -197696 133314 66023
23120 14002 -153853 -240152 -140355 -204481 238712 128727 137890 -120360 219242 -200068 72398
23108 89828 -90943 -358614 358088 145586 -10396 189601 123643 234393 -169413 175081
23097 -46625 116675 -16765 158970 289367 133027 486098 101677 280249 -207453 -111154
23087 -111154 -453333 187983 -109728 142324 -183625 -323149 4258 271806 -212261 16420
23076 -231507 -369328 -43074 -384791 -153759 -115278 166843 -154760 -8117 -264363 22284
23065 222473 -10235 -330018 -182315 308051 305068 -386255 -314565 166875 96914 102873 207780
23054 207780 111940 108949 -9712 -283845 209065 256363 171696 -118298 78185 222621 -119537
23042 154323 69036 20500 -120125 167213 249529 383991 93505 -137156 -58410 -105147 -154546
23031 -154546 50542 253480 42590 128573 -247366 -222909 169259 -37846 -31359 83219 -51797
23019 -220024 183736 213789 -622097 -116953 -324904 55779 -260245 12106 -6615 77989 125464
23008 125464 -39970 44207 -10002 87774 262411 33048 -24220 131223 -106029 210532 -152713
22996 8241 -275953 -16435 -49100 327105 -80016 -322272 -158170 394089 257877 -61458 -6828
22984 -107416 21740 12132 -371364 44627 -205732 -1464 -138075 -56328 -204171 -591069 -53434
22972 125069 83629 1740 84331 24522 -59588 -34241 12475 14937 6273 12498 -243951 235608
22959 172810 -131882 -84853 244068 -363921 194868 -131127 -126062 322049 274521 -274678
22948 -6092 187907 -89514 -19506 -40596 -359384 -439485 -45573 95463 -15641 -49607 34563
22936 306346 -210449 5951 262854 -158391 -200281 329761 -155547 -69661 72364 -123105
22925 151213 -381900 -182476 -229394 40136 193444 -98881 125026 59027 -65307 -26720 161733
22913 259345 12254 -32470 -303597 73943 155995 -50112 -96683 492650 81602 1769 -222541
22901 -139831 113472 155324 -26154 8572 -163061 -199987 -103536 166635 -288524 -38037 -469202
22890 -469202 44245 5439 -337396 272109 -89909 -129861 118804 92035 30612 -1758 -55844
22879 -55844 -261543 78245 5107 173337 -25981 -79390 -155927 -35468 75482 -48178 65107
22867 158472 -76144 41947 -246165 -316232 -17328 49800 -301992 -37562 -331301 216279 17824
22855 -114626 147166 -105549 -153726 -141328 -76348 -50068 -8372 127665 -185520 221772 209416
22844 209416 69315 173877 -99243 -29757 -357427 72179 -321846 7665 411059 -28312 -32998
22833 -32998 81127 223301 184568 -39957 179580 -64757 -335012 7269 106998 -46990 -221647
22822 -221647 16007 -83090 288724 -109726 78636 177891 -133425 -159336 19966 -236796 -108239
22810 92369 -44772 -160252 -151229 -8130 -263784 163812 -74208 26759 -237428 -40718 -51234
22799 -51234 -326716 -250172 7861 47741 -255618 -208370 -117210 -65804 -90439 242219 236418
22788 236418 50638 23794 372 11520 -25368 -53324 -255476 -124473 54282 180902 -73016
22776 -422426 -390585 124864 -109116 -413939 -151653 126254 -97054 -28257 19844 101917
22766 101917 -101952 -555005 -304154 -66313 5381 95960 -50651 138525 -66473 116681 -85525
22754 30127 316561 -390011 15911 -286569 -197952 33482 104313 62510 58821 7162 229636
22743 229636 -38910 222033 -183077 -248328 -49319 -71788 -12875 92240 331920 -172393 185860
22731 169735 -294433 150556 -123740 116384 13952 60170 -35886 -187562 -405837 321754
22720 -116554 -41138 -128804 -149983 -2551 365278 165162 -33964 116886 -1572 82389 15675
22708 -69704 -176992 -334093 -269089 107543 62188 -487670 -214606 45372 -282693 -79090
22697 20638 9956 -317446 -108740 -331027 14981 156806 -78468 -274002 -368430 37391 88655
22686 88655 119757 32589 -273958 269043 198627 -71359 -98596 411400 89531 33010 165112
22675 165112 27867 261200 -27089 239474 -124586 -39408 -222585 165440 -202650 -114974
22665 -114974 -42047 61860 54209 -131304 -192046 11454 67603 173959 66609 -59312 -17965
22653 -41398 9872 -69281 -75268 -64268 -264266 -265800 -179698 -108245 113531 -166389 -280073
22642 -280073 -173485 126227 19032 -226579 58767 -80323 -137887 242180 365468 360465 127579
22630 118767 -50202 -72967 139489 -3794 166226 145775 -186119 -213846 -187060 -128425 273747
22618 -223584 -93565 -129942 -210799 -272925 -480652 -117777 229449 19562 215462 -95039 48583
22606 -228467 119976 -181130 368542 159113 86654 25831 262291 242851 -428959 -10288
22595 -215466 -4488 338855 -41402 -243728 66975 140278 -336812 80145 -9160 -177781 -320734
22584 -320734 -196635 -125021 188668 35582 12104 31482 3670 113803 -18288 -51008 292415
22572 -76047 46758 -168199 -10369 -225654 184966 -174048 -60215 -115585 -117510 -67423 131587
22560 -104354 1657 52214 -309350 -38132 10709 188970 -8718 -221520 227206 -139353 -110155
22549 -110155 -103030 -121690 -24988 -276876 18808 -19213 78415 -65837 -224767 132784 -343295
22537 -294244 99171 -232267 -154090 -167849 -158486 -491754 -1833 -133709 103972 -200402 -73268
22525 -80626 172053 -241121 -269920 -73813 -125848 -102594 -60103 -257252 123083 -108266 -391045
22514 -391045 37207 -268041 -62565 -166167 -117815 -14729 -124011 -92938 71032 65176 -54674
22502 -8787 -148371 -44787 131806 -337448 -35187 -72326 -215073 -150699 58198 115571 162430
22491 162430 120518 54416 4689 -226007 124296 -10932 -181048 -99848 97341 -2467 -7046
22480 -7046 28844 215289 25247 21175 -23585 365905 -121153 130366 292142 37803 -117452
22468 91855 -92851 147002 -244776 -27539 -111677 -103608 112817 -349638 66956 240127 58786
22456 -4911 -239798 118353 -131687 -213726 25603 8193 -266908 23588 -88346 -36933 92146
22444 -88604 268666 -52218 101313 -103266 101926 -14021 62232 103975 -327293 -2562 -269412
22433 -269412 -46054 52669 -143601 -241215 -43345 -81178 -79345 10614 -46358 -138372 -273123
22422 -273123 -233890 33529 -63715 -108074 -287308 -5860 -341998 -358841 -62427 -102069 30095
22410 -233003 -271207 -350741 -277839 226573 -231873 -65009 -148195 -38421 -61203 -92896 119820
22398 107447 36759 192047 33725 32905 8791 -6546 203478 117478 -105650 -9691 -150089 -26437
22385 -127245 -137099 40973 -142063 -141404 -79482 -47485 65459 46440 92897 51721 -199963 -84997
22372 139739 182676 -182684 -106746 -220332 -205397 -145993 964 -152515 -16316 166189 334942
22361 334942 -201525 -46340 -74264 -140189 124048 -181834 -10795 50316 -73496 -55493 144920
22349 -117027 -5531 318807 -108043 -250971 141042 -28013 -78825 50731 -83499 53829 119323
22338 119323 37993 105800 393504 -159539 19273 -138182 -79742 -69605 128255 -74854 -88086
22327 -88086 196407 -13103 -108091 436985 129087 308527 -135098 58566 29152 -226599
22316 -275214 -29374 -161970 17731 -258568 75111 -356598 61316 -217001 -2404 -129037 69159
22304 83112 -67105 -154357 -234322 -113611 -58426 -342737 -9651 119864 -176848 -92719 -210239
22293 -210239 -5991 -96890 -3953 242110 -156966 142343 154221 231001 -199888 -119326 243745
22281 -14412 -62563 22422 -53957 210492 -55896 -61027 530060 135491 71576 46101 88827
22270 88827 -332456 385806 70330 -73137 -31415 37046 -33439 -153796 145256 -338673 -33249
22258 98386 160659 -402144 -40036 -92725 -29573 31505 -175977 -71844 194221 317130 222186
22247 222186 85029 142429 11308 -178068 -346604 41510 -36661 -57645 -251265 -55134 382889
22235 -471055 62943 -185680 -22518 -332967 -87600 -79160 -21113 274962 -19 -55645 150659
22223 286801 -157284 -163970 180889 141677 -178417 15244 115609 -80302 -29984 -65842 134644
22211 -13408 -172954 -74362 -452 18889 101176 151251 -33208 -5952 67112 -5235 -351715 -164672
22198 117622 45542 33272 99917 -6064 -219298 -113925 370657 -89068 51096 -133469 -8446
22186 -206283 -314880 -74453 -50517 -224775 -251347 -165389 -210412 320025 -171896 -84607 122851
22174 -16623 -29707 -156144 212303 36696 39125 -275834 107649 -173570 -180852 12428 -83223
22162 -295467 -54681 -380190 121155 -91649 525449 148481 131411 -80278 -290186 -85154
22151 -166415 67240 -83505 -355680 -202107 -67464 -236689 -148889 12251 116365 65948 260103
22140 260103 276604 -110372 -284684 -123251 78163 -237246 -147356 163992 -129125 149522
22129 175837 153335 39885 -84753 2718 -98822 198620 5259 19575 -274189 4497 -333954
22117 -167267 -66066 242380 -10174 119991 -38730 320281 87828 9449 294123 -68669 109073
22105 -100911 -48925 -108697 -90591 -167305 -254391 246827 128687 120340 -4903 43426 -248417
22093 -49223 -140921 -227990 -67228 -78511 108158 14944 -271245 125669 -40491 -159996 248
22081 77787 -189572 -113088 -143868 -68104 117134 -246925 -290470 -238690 -16816 -48781 252804
22069 -46789 -172884 -27110 116116 47951 -151445 -212478 46546 -127377 161429 94572 183980
22058 183980 -347301 200036 -9287 -75133 -78259 -193373 -18055 204937 76856 151205 51155
22046 -150211 -207806 213046 -136194 271459 -155306 -174438 -239563 9500 15037 -239394 156285
22034 -66517 48557 204005 -101583 56240 -334282 108044 -96858 -376350 215351 -282316
22023 -97249 105291 -98254 180068 -238282 -144218 117325 11158 110323 -281368 -27715 64074
22011 292818 3745 -65439 -337230 -84634 -125498 -46485 94726 -11274 -65817 40336 -20938
21999 -175296 -106506 -58042 149341 -188662 59704 -340217 125722 -217684 25232 -169719
21988 28098 -75622 -345056 -100087 -141644 -43711 -370838 -205430 -98030 77093 -71392 -234681
21977 -234681 -176470 21016 -230144 -140991 198260 13629 213619 73581 19659 -77503 334785
21965 -245787 -215226 -135712 224745 42320 -159125 103414 103280 -45948 22674 66830 148565
21954 148565 167889 -450576 68692 94054 198360 189379 -46990 10715 -126914 -214564 -162836
21943 -162836 -184625 -44564 116335 88089 -2135 -53716 113394 -295844 -181780 105671 -129541
21931 158120 85012 -90142 257309 91209 -102792 64649 -211386 -257026 77546 -103934 161633
21919 -115016 -354041 250625 -219693 -300501 -88297 -583922 196951 104606 257284 -310334
21908 -101629 -15000 -14887 -205662 -30650 -61014 -138046 213487 -140628 196186 -257622 192957
21896 -165583 -91189 171416 -326815 -176126 -125368 143954 -45554 161053 -214676 -234405
21886 -234405 -282730 -76785 -142343 166858 94400 -24724 67053 -84630 -51856 -101627 -41215
21874 -308908 120074 16072 51361 234870 -11333 72814 -25256 -466350 181788 115713 11344
21862 -201053 27166 -169203 -59524 248159 -196316 -33640 -627 -99313 -265717 95889 -133594
21850 -282853 -177278 148901 80141 -165392 -168549 -90636 -212622 26231 -109090 110308
21839 186704 -66688 -198213 -79483 -24152 -48450 -2678 -1723 -211979 -133596 -269252 -90724
21827 104941 -87167 -18825 240423 -187146 -68415 -234691 -53522 -122595 -186818 -224650 39714
21815 84041 -125224 50207 12957 -237281 -209747 -328500 63031 -270551 -17752 -240581 -130216
21804 -130216 142173 -66438 -102480 181673 -406 -313232 -5808 -133537 151706 107561 -36417
21792 -99350 -88756 176829 141401 131375 224968 -80237 90469 -38455 -388705 48000 -255900
21780 231550 317227 -159343 -220721 -33325 273848 2418 -268509 14830 41071 -105213 -112233
21769 -112233 217900 107600 -156964 24546 22900 95101 207110 -193244 -100033 179346
21758 -125283 -46474 36177 -377001 205813 -100768 206199 -171006 -102042 -3086 18917 -21156
21746 103583 -223723 127105 331212 -259672 177852 -62234 -46241 -233140 -263139 158690
21735 -110712 84713 -69574 91764 -112514 58576 118867 119458 138972 1093 -221117 187541
21723 -139482 -24382 134133 89561 -233480 -30757 -115997 -115260 -57813 -131823 -88339 -125528
21712 -125528 333230 -217502 -135337 -311372 12214 -200316 -53837 194008 116452 -142878
21701 -74717 -75079 -15998 -36312 -130536 216417 183699 229354 134333 77644 -118756 -525465
21690 -525465 100433 -206379 175228 -16192 14486 -84895 125067 62993 90712 211757
21680 211757 -244732 114668 137009 -211831 -175071 366555 -228076 24761 -56593 -279102
21670 -279102 -103117 -165053 -99346 -174278 -68193 78305 21560 31541 9924 -237430 -54738
21658 18796 77245 129999 -200807 -140379 194471 -141543 252625 -52039 64606 -38567 25695
21646 -350897 -33928 -105706 -151749 -227630 140510 -132761 9006 64419 -293194 -356211 -71898
21634 -130378 117673 -191738 -94203 -222411 -74675 -140719 -88170 -75567 -61752 -277923 -223360
21623 -223360 -31111 460336 223320 -214770 -95698 93972 -385221 -293397 -14676 132429
21612 -167730 318063 144816 -46721 164929 -24149 -228155 112151 -203336 -293820 -15208
21601 36991 389045 -140207 91582 -364560 -218191 -118412 -167243 -329241 121717 105957
21591 105957 -196363 155468 -147182 14828 -89479 -222911 39833 321665 -371538 7641
21580 87963 -215023 -51850 -111214 149356 299122 -95097 -166142 10506 -82366 -89485 -41029
21568 -71078 -316982 -71302 308140 155030 -219303 123087 -19222 140140 242900 42074
21557 -440278 276464 -179511 163297 132656 -202384 -405388 -94606 59510 -291483 23177
21546 112635 -208187 -103349 -155297 -318761 -88634 77459 -119581 43568 -125454 -40751
21535 -228239 -346869 -167484 86410 202849 163091 -377196 -22262 -72902 185782 97287
21525 97287 8875 222049 -133246 -207601 -260478 -6551 188364 235815 -274481 -129330 -118478
21514 -118478 225756 241645 -84960 15934 -93992 -68916 40748 27373 -150447 106410 -124331
21502 40048 281431 -8261 83148 -263838 149940 98974 211554 118331 76292 92177 -425964
21490 -28121 -124397 -75516 -27961 68669 -44687 -388381 80910 -138796 152027 184840 -250247
21478 -124016 17157 193575 283531 70356 12211 174019 -430571 -64716 15130 -48149 342870
21466 -127330 107237 -221196 -52650 -126179 -93827 -17788 41086 -345554 -128808 -22125 47914
21454 48347 307402 78526 -3274 -153432 -189948 -162912 -122575 129369 -180767 245357 -332947
21442 102476 216854 106403 264597 262072 250913 -30946 134573 -128510 304597 -72162
21431 224707 143139 -31651 -86461 94795 -188635 -19974 120128 -336080 154341 51965 96237
21420 96237 -101754 297028 23348 -69863 253218 -10909 -311429 201842 27249 -229494
21409 428 -214163 16287 96800 -79682 196427 -549268 -67297 309203 26901 412130 216170
21398 216170 132875 3379 -289052 5139 76844 -197291 66794 213489 356 -188203 190929
21386 -209453 17289 70944 -220908 -9503 -221652 -200583 8776 33101 -154696 46959 -223754
21374 136144 -59092 -250075 -411017 161975 -266076 -190727 100944 -62998 202325 -246966
21363 -66584 -189158 -154096 -216049 -198402 -487421 -234197 11790 32883 -338353 104154 51490
21351 -209700 -32668 283142 -103489 118088 229889 -29817 -158970 -205799 187771 -54311
21340 219133 53437 65699 -93017 153811 -224689 -406561 -69749 -42315 -131148 -334648 116349
21328 -122378 -207943 154300 248335 -79272 40850 -72548 -440053 -336406 -265487 72055 -77294
21316 -110801 -244270 -146580 -116196 -261092 283975 121654 -18519 24048 -188173 82090
21305 -122791 -313221 51625 -394224 213911 -103567 66483 -164565 101698 40929 69459
21295 69459 21838 131480 -47975 -101055 -184826 143732 99250 174988 -161954 -133805 -193725
21284 -193725 86911 -59953 -133804 -46930 -23370 9059 -100893 -26421 -86939 106368 -150698
21272 17143 105046 197157 126342 28135 625 15017 -49337 17186 -204948 -320594 -102917
21260 24087 -4178 129339 115073 150364 -219171 11921 -32756 124859 121477 69457 95603
21249 95603 -191375 38726 -121084 138399 171151 -68309 -243366 54941 -113227 -107653 -53944
21238 -53944 -214448 -351026 -320797 216640 87986 110524 -104997 66289 -112306 -224532
21228 -224532 -107097 16677 85764 -327431 -134469 -25579 171122 -189216 138497 113102
21218 113102 -63290 -197796 106235 48935 45555 -174626 -104528 294934 -85947 41686 -133354
21206 -141272 -101309 56392 -217093 57014 -82092 148688 43349 -258235 -51383 8454 39568
21195 39568 -343302 -195464 -90963 161955 53127 -186710 -226121 169309 91465 -132840
21184 55329 -30531 -326429 296521 -36028 241653 141097 -19265 215536 16976 -55674 -213683
21173 -213683 46333 1718 -76202 -178745 -361668 -391258 74034 23800 -48737 -15404 329884
21161 -49731 17896 32805 -77958 -102683 -228307 -95296 28643 -289544 228729 111420 311039
21150 311039 -46992 387217 125582 -391902 194027 -356347 -138778 -59495 -285185 -168360
21140 -168360 -136692 134468 -247512 -279607 11471 -356540 -132618 -46176 -329394 330862
21129 -233725 -6615 57184 63905 -99331 -291243 -377487 -333102 -247907 -247634 -97313 -89526 -37060
21116 -103140 -118828 -259071 -27558 -81026 -179253 239773 -204241 -253227 61016 438326 80448
21104 301490 -271770 -82728 26781 48478 -89501 -40674 18664 -229712 72475 -378653 92269
21092 -91885 109262 184002 -80098 -54760 -34350 148772 157689 -171211 -114618 -49598 334062
21080 -167214 114614 -75759 -42418 -25140 -141047 -281322 -7483 10121 64595 -137339 -52479
21068 52929 167891 -146587 -137501 -137333 -291690 91981 55974 -60278 212584 107579 -31979
21056 129067 -158127 -93993 156641 -178126 -117311 181165 137752 -283277 -96513 73202
21045 -154425 193291 101769 266546 -12322 267498 20558 -113705 -11991 190028 54438
21034 273700 -157191 -152729 -77388 -394450 -269621 -236821 -360413 -10719 226215 -183854
21023 90914 -194849 -150294 -233615 70507 19368 170616 174627 -100927 116913 -139076 -145962
21012 -145962 -145336 215095 334706 103535 340502 -237031 -165679 -249001 99953 -74887 46744
21000 -90223 -186150 39053 -263791 394495 168132 -32699 -188496 -363883 90334 163495 -159768
20988 -170770 -61945 -207870 -38297 -97883 601129 -179256 -233174 -462022 6245 44528 -353638
20976 11527 43399 -321383 -187371 74218 -32809 18665 -220553 533975 -8438 142893 -161241
20964 -401828 -255342 -189070 -200028 -39785 -106184 -98557 281783 -227722 10742 -71400 -240351
20953 -240351 23420 -30686 195177 -120805 29123 185172 -527606 -201448 217292 -11032
20942 76292 43736 103743 411254 -111255 61950 261428 -332080 88281 -142878 63379 134545
20931 134545 -303780 -98828 -49937 -278046 296513 -99953 -225062 -65553 58887 -129320
20920 -86798 98787 -193580 -282251 -69064 -66453 138610 198250 84018 101390 1473 -317931
20908 -38873 -167099 106271 -241297 -244752 -54146 40434 -118813 -252622 286402 -63643 8198
20896 -32681 267669 -136252 110695 144613 -152883 -17013 203998 118917 -752 -463218 -239419
20885 -239419 -254540 176829 94361 -10718 354407 -39595 -198406 -415903 46543 -324938
20874 39050 93680 -69943 114651 -352439 -29772 37957 241353 -364872 -157995 -126471 94950
20862 -163902 110515 -42399 -54941 -108923 229092 -59664 -273405 -23560 132628 -32049 36552
20850 243029 -301922 70088 75413 43178 -38035 -355231 -60399 92592 -76459 51974 167588
20839 167588 -221942 168977 -190621 12460 -89220 -115069 -360480 -137170 218780 -222303
20828 19897 -162631 123431 -239220 -44329 -56925 -54963 59827 46271 -88565 171142 -193269
20816 8860 -4305 120228 -40132 -200361 76381 -271584 224394 -114464 62519 -243462 -104725
20804 -127059 -131461 165783 235050 -200851 -168701 -419773 88836 -79335 -11472 -6556 124926
20792 -21706 -678 201603 -292533 48920 -364780 61824 -12032 -200645 -164186 -328595 28581
20780 11417 -23010 -29140 106557 24685 72638 42499 -220875 -99072 -110814 -157073 -100269
20769 -100269 2714 303652 -35438 -69258 -570481 115953 -74793 -261981 -244043 -114980 146129
20757 -292683 168020 -216654 -53384 26571 68609 36770 -84506 -81718 286622 -77798 181248
20745 -212769 10019 86326 -256335 -157288 -220674 22208 233868 -154581 204115 -78474 -116374
20734 -116374 -49462 -162078 -17911 -253374 -148834 -60546 171245 -53165 -49866 -6888 177472
20722 -314508 15137 -54169 -108904 -143958 -144717 -166415 -49154 -2872 76143 -20096 -239259 -157835
20710 -157835 241423 -320958 -21122 112832 -367985 -301978 -191173 19414 25681 17375 -32284
20698 -117803 135306 -177079 -155038 37269 182981 135936 -59053 -202476 -517182 -117541
20687 23184 130479 -51370 121959 177910 -396561 107221 32352 315334 -77353 202812
20676 -218396 -129536 -34949 -20364 47739 -43792 -26197 -262902 3581 -208205 60388 -220474
20664 -166227 132463 -26182 83516 -141504 84284 180490 96037 79962 89675 -70460 129621
20652 -46463 29254 -259470 -83979 15129 123029 194964 74479 -361260 28850 -170441 -44251
20640 285813 -95575 193622 16337 255034 -371539 -4946 -115612 36455 137236 -220639
20629 -118284 -117292 46538 -190064 65718 52546 -37663 -62843 -161207 -161981 450778 218862 183288
20617 183288 45169 21541 -97545 287800 -203863 42161 63552 71461 236286 -214916 -152785
20606 -152785 -83974 -235271 -123241 -15890 -39691 -151595 -127627 -57968 -90162 -129076 234262
20594 -202253 -565817 329897 -155496 -104693 -163934 117697 136018 238613 179509 -68920
20583 267510 -117793 -21501 105034 24819 424657 215885 -21890 279762 84669 -96700
20572 -93776 243216 150787 -67505 -11738 149173 -254036 -244135 126559 -63496 -82495 162005
20560 -177946 178522 -33442 116852 -259887 13153 -24386 106515 243878 50323 -60201
20549 191181 -5955 -15776 -411153 -84997 1437 -58495 -282432 281329 -176743 -55629 23716
20537 89050 113764 -16498 310569 100949 55721 -227369 -372794 147916 -245428 -281479
20527 -281479 63811 -194528 -11693 162590 259528 4044 90919 -126558 68649 70265 55013
20516 55013 57588 -24302 68898 -221994 -213252 -318468 -98277 -39087 -188888 195210 -5842
20504 15896 -39492 -49074 -41032 52074 -291833 -63379 -151187 -149135 -138475 80132 -24468 -31079
20492 -31079 24312 -133666 -336780 -219343 18424 -115767 48339 -72886 -153765 30417 -141288
20480 -74636 6158 -208329 -6938 40203 -69864 68250 -514214 -183585 -231608 133612 -38570
20468 4218 -47654 -72318 -255928 -75643 159004 -54970 -61423 342485 70540 187168 -86787
20456 96015 132295 320179 -20950 -214702 -24247 -9201 -258894 -96998 26592 -17907 6306
20444 72029 -254681 -126860 -34300 27972 -166817 -186520 -81647 123074 104324 -120941 204892
20432 -23909 131789 -111596 183143 -7222 -46753 195969 -138665 -221871 -124886 -593372 -228743
20420 -89516 77457 -181621 -304332 223623 -35238 8894 225495 148636 -178471 -92965 106770
20408 -289924 -14400 -85568 -39047 107926 -195487 -82223 11090 171470 59888 -245216 -224117
20397 -224117 47713 -157140 -98267 -266127 -263438 -137069 -64499 43242 -40526 -58114 43094
20385 -111633 -163582 80207 -68657 126926 25650 -1790 -60282 239612 -169210 -93863 90398
20373 165462 249119 -172175 -159996 -5094 -237540 -325119 -125059 76091 -151650 -262506 -61242
20361 -79941 -375865 6348 -376683 21412 -302409 163244 34176 -72855 72649 -28733 -81559
20350 -81559 -158010 -74611 -4711 -49588 97973 -17340 -68857 56013 -111916 -211540 50471 34519
20338 34519 241170 46792 73231 -184553 20057 -180326 -279615 -108136 91723 -49397 63797
20326 -172453 7511 22986 78115 236239 -237461 -892 -88483 182163 -11844 -157838 267145
20314 -297867 -146621 191262 -183586 115154 -283445 -250202 -92071 110925 -7914 184925
20303 475546 -65433 58554 -103971 -330269 71432 31898 -223299 46935 -377143 -115860
20292 -110679 -97635 -190000 22139 -161380 -18080 195670 -17188 173164 37553 -134953 -262237
20281 -262237 -140704 201640 -407836 -286778 89160 -118611 -201644 -76257 -24417 -136571
20271 -136571 -16260 94452 -282717 379510 -298 -195497 112026 72488 -116822 -8042 -207879
20260 -207879 -335597 51461 -202328 -34619 187217 15016 108794 95958 -15676 -98436 -121667
20249 -121667 271665 -249183 -104135 73253 -19706 74449 -135269 91351 201028 76885
20238 -199434 -131297 -366725 -241997 130857 -94615 -206074 -210728 -112417 -172363 -271021 3426
20226 -74786 87486 -166472 226370 -190706 -142506 -123837 -144828 -225824 -123495 -206788 -221741
20215 -221741 -156477 -362777 -344938 -49115 -337742 -312477 -4080 88568 -26904 -97423 -311372
20204 -311372 217534 -91217 -242895 -285817 66257 -128937 -564660 -81341 251404 -261874
20193 -109482 -302477 -151038 156026 41581 116350 163469 -19398 -143328 -274493 124304
20182 150667 -432993 -62046 -129256 -135793 -73780 94333 -134101 181800 -101242 343562 -152887
20170 53548 106066 190288 -98735 -21510 56396 227651 -117870 -378010 -387328 108938 90158
20159 90158 -155741 -28965 -101404 69671 35668 24646 -313869 217594 66203 378382 -1722
20147 78690 -39753 -237379 -291032 -62015 -38033 259475 124085 212863 -17880 269885 -218784
20135 68762 204024 -157759 223713 -132917 -137621 44171 17999 104062 49027 -105023 -102499
20124 -102499 73682 -31001 -14989 -200609 -174544 -306357 358417 4007 -51173 -200502 -2508
20112 -20550 -18060 42422 3634 182374 40181 106440 55402 -35040 362681 -232273 -465774
20101 -465774 -77101 -58947 40374 -51711 323474 -73475 -176818 -133296 -344228 205926 184979
20090 184979 61905 208321 -231918 -158043 -344500 224266 21310 -158175 2106 -157547
20079 -129573 70395 -178860 -223271 -179123 -174358 15944 -66960 -60343 43277 6183 -94891 -61420
20067 -61420 82896 76658 16041 19864 -48503 -22566 -513214 -218043 -381668 17276 28375
20056 28375 252414 -171392 -86510 -74157 37180 -156529 -269627 153812 107428 2106 -230838
20044 60134 -34951 -315898 85712 34888 148291 -25240 -156200 152011 -195626 -34515 -109720
20033 -109720 -47593 -246080 14250 43542 115847 263128 30150 -89338 -84696 -319837 38256
20021 -197501 -257278 -199245 -33243 207885 -53488 262873 44937 -202609 140946 363028
20011 363028 103237 -10148 13338 -241104 -206878 115991 -126508 120690 -107776 -67065
20001 -67065 -75694 40545 -133711 -42014 245185 87312 248015 -94558 18666 -31922 248856
19989 26109 -170890 -35782 -237353 121690 -215871 -320650 -245330 -500212 -256743 -64522
19978 53627 -162865 11208 -347277 -270620 -129090 -126480 -212256 -263688 -176589 -139002 30385
19966 -98401 -198031 121711 -227834 -127971 -213815 -189457 57059 117488 -42005 266774 -66144
19954 -281992 134282 -53056 -41402 7197 166497 -92357 5968 209463 24254 -187844 -31554
19942 -290020 252796 153403 166095 212824 -61801 -149311 -149211 -95288 -215919 149254 -31718
19930 -37644 -356149 -285450 -62221 -236533 -13839 61860 -13802 -290727 -124522 -96964 156732
19918 -83719 -297541 -150831 84638 282910 -340917 -175776 -83310 -139569 -230886 12084 36225
19907 36225 -16225 52259 -95809 222524 8270 176405 -182753 130027 -257323 -125183 -288904
19896 -288904 -47897 139371 49220 -3611 -81588 93901 135457 199248 134313 -102423 -106329
19885 -106329 -158434 36248 -199670 217566 -225725 31299 -2633 -140298 92124 64151 -20648
19873 -270319 -15157 61646 -170337 -178236 -107905 -242823 56459 -172474 -330100 -428737 -340776
19862 -340776 187092 -81889 46433 35841 -59178 -235857 -183725 112547 -249213 -34692 -99233
19851 -99233 -255706 -4162 -177012 -99182 -77625 -384361 179696 -66060 -132858 68258 40990
19840 40990 74644 -272773 -157625 113111 -37341 81563 -11797 143299 176001 249806 -125944
19828 -109031 -134652 73185 -269663 -50034 -94473 279034 143361 -111051 34710 49513 -557053
19816 -140824 -129151 -112778 -71923 -400170 -186174 212338 -22646 -193902 -308140 -199742
19806 -199742 -246417 -58114 58869 79356 216886 -187002 -339987 194380 79559 149945 111493
19795 111493 -322042 5543 -39554 -91771 -424588 70214 41014 -85611 -271636 -307474 222018
19783 42699 305378 -174029 101162 -136089 40904 60251 43181 117527 -476863 -193450
19772 19406 27965 9245 175255 -146016 -116963 -137414 -293427 69883 -21013 -180952 179954
19760 -96766 143836 -73352 -372993 -80738 79654 176690 -211405 -183476 -202548 -38506 -6341
19748 -192914 -29929 74442 -181284 -296214 23867 -35916 104145 123893 67544 -226612 -317420
19737 -317420 -6706 342853 -173417 -56118 -184 147062 120907 -47598 -1787 297171 -190086
19725 275833 168715 -10991 -91414 -5771 -312394 107327 -190932 136592 102815 19925 96285
19714 96285 -99871 132100 -131990 279878 50888 322226 98554 42717 259718 -268301
19703 -192763 150123 -16529 -197155 -255790 -235664 222043 -490580 64678 84868 131481 163207
19692 163207 19071 -124118 -81168 26691 -175766 44979 -3246 -218645 -64712 192023 83903
19680 81098 118623 37511 -264837 343088 -143476 -83531 -182668 21463 -112969 -157101 40841
19668 -49729 -176411 -334250 -143930 -304536 37253 186433 -329785 -202667 -385902 -343872
19658 -343872 -167187 317831 -239409 13748 66105 41544 104902 339661 -411091 12091
19647 -202000 -175759 -60366 104977 -32691 -31695 -189043 -52523 -78868 146041 -93652 -138784
19636 -138784 -397700 46813 -158868 52556 149581 160324 -238972 -280295 -118094 -103766 -134471
19625 -134471 -69141 -59332 -48080 -9752 -113459 232354 -559140 -210829 31861 -5675 16341
19613 -58134 140614 75157 -37279 -154791 -288360 -47416 -94658 1415 152821 -243234 27706
19601 49779 233247 55772 89664 -293034 -120544 -30751 1707 -142622 -323698 3959 258001
19590 258001 -72790 61114 367674 92647 -365397 -251433 -158430 100045 -228636 -136260
19580 -136260 245256 -156152 -217107 -210363 101344 -227786 -97811 -27636 250424 -189866
19569 -146484 -242428 150154 -33275 -1605 6331 144526 84190 267280 105122 -247626 -282391
19558 -282391 -150770 -388935 -46402 135812 40809 -221133 -155037 -397636 23828 -88651
19547 22063 121745 -138949 20909 -400470 120105 -8514 44668 -266055 -45384 -167848 -203870
19536 -203870 -94907 -313107 2415 -23861 -165008 1725 50297 -156973 43703 115323 -204588
19524 -112419 -16362 27392 117977 -394271 -26546 109752 -43007 -135054 -96920 121808 71054
19513 71054 135586 87870 -66828 185675 121342 -143074 60409 -142652 -228385 -110536 -358448
19502 -358448 -32344 -80061 178401 -194799 -193087 -120264 -15632 142046 -57874 14636 -167070
19490 -188062 24399 -6525 -15584 -318847 130755 -5305 -587547 19608 -165286 -10825 -109819
19479 -109819 -306986 18933 5959 293013 88273 74980 -114917 -30534 87532 -4590 -42632
19468 -42632 -37408 -21624 -144485 -380311 -32010 -170733 -87112 -163816 98454 -212213 -149889
19457 -149889 -215545 171328 -342277 -141017 -166900 -182563 -84390 -133223 131092 -39084 -109038
19446 -109038 -56969 129999 -222385 -113427 -174800 53743 -64472 23638 -75888 -303696 -45623
19434 -194500 -325521 37484 103776 317085 -156236 186568 -8759 -109064 -15356 144730
19423 -85820 58640 -112984 -35723 67129 -248934 -162399 11380 -104155 -54100 -3600 7729
19411 -64900 219292 -203081 -53934 -279771 -56868 -127564 -169874 -1250 -211763 59032 -281543
19399 66113 74711 -29357 -165116 -49513 -131241 -283963 -61152 113275 -82947 74013 97433
19388 97433 -74563 -203856 -72478 -40839 277561 -194071 -115268 -360873 -46940 273682 -286799
19376 -85048 -182807 -61987 118151 25615 -243509 -377055 104950 -36523 -394991 -395059 -4469
19364 -38537 -244165 5413 -394343 138839 256088 -3280 -295106 -133720 -126872 -264653 -36364
19352 136988 -124605 -262123 -127584 120879 -116469 -163846 136926 177325 98591 -187282
19341 157503 -79670 109905 11200 -144164 -89381 56111 -353986 -39340 248679 -31634 -76269
19330 -76269 21559 133032 -28933 -64069 -475533 -139417 316541 -51462 58886 218618 40137
19318 33821 -290951 -111935 172032 156215 -123948 -109747 -36753 -219230 -89589 293009
19307 -81443 -149068 -120077 -166590 -131149 23029 -129496 -472934 29862 -55067 -104416 303258
19295 -113244 -126630 -231776 -72063 14458 42827 -99827 -108476 -116106 -93037 123954 252027
19284 252027 -96397 -359508 86568 -236437 43304 95821 91261 56952 135314 -363969 219047
19272 -27726 -57460 -53726 -279105 -80762 -63419 -43665 -187202 -283883 -382085 -25290 60371
19260 -47928 190761 -481519 -202006 -70916 -171273 18265 148592 -493534 -1548 38205 -20065
19248 146386 10707 -287669 -190038 -242964 18660 72805 -71082 -4508 31045 -166287 -43110
19236 -379834 -245139 -19481 -129626 176229 82375 77876 106864 -111571 117442 138860 -167841
19224 132652 -214973 -182274 -246230 -290771 -303114 240008 -297870 47132 193127 -25676 -23288
19213 -23288 -318319 165235 258706 -126736 2022 -32144 6570 -76155 23087 -350989 200243
19201 -9633 -111915 -299134 299347 -47476 -103708 -336559 1698 -388728 -179372 -123666 -386608
19190 -386608 -70107 280705 182846 -182336 -134954 -103768 -65406 -307548 -19654 -228015 77017
19178 -312999 -32922 -45052 -66885 262671 26858 35039 -311763 -151130 -326950 -398863 -217812
19167 -217812 153214 14643 -212347 -96269 -396785 302383 -173608 -84029 -182703 -173692 -16571
19155 -296038 208925 -461675 -55757 -260141 -304088 100314 69251 -34039 9780 99206 -320915
19143 -103196 123504 240064 13486 -171643 -545424 33785 -88975 74553 -29425 337120
19132 -238592 -135057 -184527 -23954 -61675 -363816 -48474 -24947 -84430 152230 -38752 -171459
19121 -171459 4302 -146714 -508 330129 -283848 -105423 -124435 -153390 -19731 -133619 320998
19109 -146482 169941 82202 -91473 -160301 -335141 159735 -394832 -325885 8616 -142680 -58079
19097 -292328 -22797 222663 -104061 -228410 -309787 130904 21635 64754 -182332 -84010
19086 244268 289786 -140949 -177375 105158 -1612 -155880 254681 46762 -31251 -133949 -87529
19075 -87529 -241818 -3716 125449 92386 212655 123139 189749 20887 -2093 109303 201835
19064 201835 -35237 203165 51511 167086 211018 49003 217813 -60990 -174116 -218706 -20271
19052 -182605 82193 -83471 -52111 225939 135795 265812 95521 -191187 73107 6678 -216591
19040 -46116 -113667 277428 -45505 188366 -27446 127422 -14542 286821 74141 219802 294683
19029 294683 -167713 -16768 114775 -130344 -68785 -69690 -275680 46080 283498 173429 -17155
19017 176285 -150408 -32392 -280570 -252313 73717 177049 32186 -439173 -69102 -179298
19007 -179298 26283 126391 289381 218593 11698 102122 -135052 38767 -115464 -208950 -349608
18996 -349608 -169718 -54998 21861 -179819 -96841 -40089 -204420 161388 140662 177718 4908
18984 -252130 414571 79409 189514 -36150 -91372 63845 21701 -300150 -364982 4015 -129086
18972 -34915 49191 151413 -348587 -128980 34566 122315 18557 -239932 -392866 -149392
18961 121948 298435 -168617 48807 -46032 -316026 -285582 322569 -28994 15967 273715
18951 273715 -256882 28358 -129122 -100222 128695 -148226 -27479 -332048 53260 -57419
18940 -89299 248940 118601 -59414 -177423 -227225 -441465 44038 145564 -9629 135064 61884
18928 -344084 -361081 -169362 -39904 254796 84857 60809 -279267 -126172 -169387 -325488
18918 -325488 -298085 74127 -41534 118662 17714 81090 -299252 -140020 -135081 -33442 -250783
18907 -250783 -101566 62750 187418 -242986 234141 -96166 -74464 -75651 -87799 -419235 -63878
18895 128709 -124099 171022 442464 258582 -154541 -249796 -51096 -133516 323179 -193933
18884 -127585 -225849 -120322 -211321 -12349 -113661 -261152 -203188 -91170 -219627 -186021 29138
18872 -85860 358450 -22146 -439688 139451 119851 80873 11736 -211740 -191823 -355522 177008
18860 167522 22900 -222648 129920 214327 4989 -221211 -44587 68460 249905 208871 -191400
18848 3850 -90771 -60840 -19883 -85888 -388595 -133939 210766 -41819 -247473 441624 112342
18836 2436 -78435 108034 233591 -121639 -133928 217394 -107604 -101647 -357493 10581 -223561
18824 -1014 -264988 -173112 -30855 -156039 150216 14884 192693 38837 -146429 -3609 405640
18812 375685 164789 -20307 8564 215467 -1128 336302 16454 -188644 -40945 33317 36005
18801 36005 32644 -186274 -251334 44533 -285739 147373 138462 67763 58717 229320 47381
18789 -3310 -156942 135192 72620 -96647 -75860 -26215 228050 33049 249307 71750 303592
18778 303592 145427 -219521 12216 -33656 178249 -178648 168085 -102791 -187184 -188351
18768 -188351 -289454 178051 -95511 110912 -82967 -196102 38228 253437 -10879 163863
18757 -89371 -13985 66903 190458 -76742 51914 -189607 254146 -191508 138902 12460 295679
18746 295679 -286223 -2181 -183008 -105510 70371 -59946 -263924 39172 -154228 -145355 -342638
18735 -342638 -208339 360570 -112350 76463 -19442 -46081 252257 -71612 172753 -25597
18724 53383 -273821 150050 -415957 -223473 -302178 -115660 7047 -26328 -128287 75494 -5088
18712 -35438 -311292 104709 -304574 -229473 145544 -172082 65706 -311655 -430920 172401
18701 -325716 -179979 -230999 59557 -105784 -59324 -184942 16549 -21212 -270385 -3544 21481
18689 -365869 12903 229125 60441 -180608 62637 -161720 -100750 -223591 -274547 145814
18678 20979 6865 7422 -155908 31350 -358390 -89355 -165211 58508 129994 -28679 -332688 -100978
18665 -251074 66366 -326549 -119932 -35088 257142 17145 97628 -15011 -73789 124942 241547
18654 241547 153781 -57606 -315864 11497 135339 -42319 187118 7331 -55236 -115276 -215016
18643 -215016 -196482 263464 -212294 -37192 -274552 170142 -220198 58540 -186421 -497568
18633 -497568 254880 -132572 76159 -150349 -160858 27953 -17981 201350 -185604 -88033
18622 -128410 -6316 -239165 43245 87672 -7906 189062 -87051 -248137 49633 -103130 -87148
18611 -87148 -50941 -158205 -182656 170797 -245722 29807 -173321 106629 134635 132910 -450745
18599 -199294 -34866 -180393 254031 20842 38059 94071 -14812 -214555 296058 -113856
18588 35466 -155700 271200 -187600 81933 133420 396013 -356641 -95729 121783 -127076
18577 -50941 -113044 157274 320941 247229 261978 -246699 67150 279305 -303121 -205943 177585
18565 84900 -76118 -119007 -212471 -21347 121684 209403 -179996 -158418 -229369 -49123 -70250
18554 -70250 52964 38801 -167503 -223342 -188106 -32636 45512 124886 -68464 -171431 147878
18542 -80023 -10026 36502 -54993 -19303 -293318 310539 -160556 -144327 7943 -5411 -242559
18531 -242559 -61917 -146919 -200350 -285617 -219764 -107481 -210634 -59553 25791 -55389 -7078
18519 -7872 -110733 50648 137448 41142 106087 -55473 -114964 -171239 93674 -101528 127559
18507 149169 -127645 152183 57291 -75342 166686 -92346 -335443 -261854 -243716 11702 -4386
18495 167205 -200233 -27508 -107530 -261490 211062 12742 43229 394509 -116500 -76354
18485 -76354 78204 -28838 231807 -153858 -68096 65826 -172467 189251 116735 -193410 -164341
18474 -164341 -272654 -84835 159284 -107464 -389446 49949 154307 -103338 -114600 2105
18463 -258823 334235 171669 -793 -336848 130195 -9595 122472 -37080 -86448 -123725 -240247
18452 -240247 -38516 -149729 -291114 75401 49323 -62462 -184670 280002 -157023 146659
18441 232002 -43780 -190894 -174594 150690 322331 -140010 160037 -65753 -82797 -82639 -244994
18430 -244994 19248 23699 407975 -274757 -178595 260687 -88459 -16582 -226927 146920 -78127
18418 484872 45360 -190046 10931 -462925 -135493 27564 -167101 226899 227433 -141971 237817
18406 -88764 -379444 -49824 177073 147570 -74230 -148024 -227121 210367 -66219 176711 -107093
18394 -108246 6942 -62445 134804 -42673 80091 -117459 -256406 98423 -253616 -375865 -54576
18382 14004 254240 -268976 -35941 -264542 -268262 -139524 -254261 -63333 -65196 128942 108208
18371 108208 46815 52760 22849 137489 47703 192584 -92785 85844 -116254 -279048 274656
18359 -31727 -100043 -71582 -59297 -27505 42623 -247376 47355 -449489 87711 -75865 75055
18347 -192336 -383518 107044 -129373 96113 -167167 -85785 -48956 117156 -130770 -146989
18337 -146989 217666 -22256 -78747 -262479 -150923 -100501 241090 -129542 5051 -12757 140284
18325 -128249 -270647 -195602 104292 224969 -261836 81905 -158945 -4594 151186 -72295
18314 177969 -44589 219078 154587 119210 -125912 -65075 -22762 -180200 -30149 62992 9559
18302 -150178 84455 -67123 120640 52760 -163386 284730 -85246 64025 180211 -91278 57291
18290 -210545 -188732 -172409 -170341 136831 -11747 98910 116620 40478 319410 41589 -76403
18278 17054 -97422 -87476 425289 3981 -292864 -7297 -169704 -118303 -148697 289092 41495
18266 -364704 99330 62615 -227556 -195935 88411 -134431 378774 -85996 -154270 -55615 -241820
18255 -241820 -276990 -53982 92821 43685 -33269 404171 -197692 161607 -43281 156571 -4658
18243 79474 50809 -67679 -149368 -345349 -41591 17385 -210242 -170586 88983 -207357 -275077
18232 -275077 -289803 -56654 -58801 268081 149228 -157360 -101011 -85571 -263698 -322296 72731
18220 -306883 27114 470932 -223353 -183811 140674 -216409 292956 124817 -102108 -106893
18210 -106893 16629 132703 -11385 -278524 -417226 119368 -54974 84461 -446967 -76911
18199 -47733 -208889 -116134 147851 -273633 -61416 -50216 -33125 -65442 290966 -35381 135084
18187 57462 10350 348590 116342 114195 40426 -133422 -51326 21337 -107702 -208320 -86406
18175 128334 -56159 143132 -138586 -307890 200742 -83260 -175737 333568 -2041 -75417 -364226
18164 -364226 -19508 165915 13057 -107866 -23381 -93956 -213895 -150940 13936 -223149 52929
18152 87189 110476 63555 260316 170692 29765 -25520 -204997 -356377 -233499 186734 -276936
18140 -145072 -18053 -82676 -42131 -179776 -195417 -104030 -92866 135573 -200477 -38393 -150211
18129 -150211 -343752 -106445 -140298 113613 193483 -271541 35024 14436 -212639 -308846
18119 -308846 -121362 211978 4318 -43295 105260 -108604 -197202 60381 -101742 -134120 -27136
18107 201033 78280 40344 101394 -278436 -111845 179667 -80673 -174212 -97202 -144018 -136892
18096 -136892 -375720 -24951 202860 -232688 -158567 92205 223892 348019 264289 -283532
18085 19488 -142028 -233461 -74649 201323 93864 -192804 -253540 67694 88116 12556 -72080
18073 -53410 -12151 219028 12276 142012 -192881 153643 97343 46896 42163 286714 -269269
18061 184071 -368994 -31865 -55576 63884 -136068 -73342 -178633 299196 417188 -17079
18050 31274 -296894 171365 -4180 53437 53910 135033 112617 -278039 150487 -127505 116650
18038 111881 17504 117021 -243429 -225285 -76725 147863 -117417 202292 92862 -226721
18027 294633 -38743 -117472 115713 122417 -34443 -35299 -242550 -55841 106560 109213 39402 18968
18014 68365 198967 -119665 -168769 -45136 -234584 -185441 -152623 -122211 235470 -252329 -1451
18002 -160093 129776 -139305 200687 -273241 38095 355733 131915 81469 155144 -134534
17991 441929 205845 -96590 39676 157153 434726 47049 -197900 -155850 -298453 125601
17980 -76517 -205357 217515 -18383 7568 388026 231024 -14603 -61288 -493119 -129812 -146214
17969 -146214 107300 -96304 113000 -268214 -105663 23965 -48081 212176 -21948 -401480
17959 -401480 -471629 21488 -226752 87888 214956 287548 -295552 271408 -131087 -274441
17949 -274441 -400889 94261 -18000 -31136 244327 181721 -314987 -57074 220455 -40016 291388
17937 -231620 274890 -56996 -122102 142976 -308292 -175397 -34089 -125645 -88468 54266 110501
17926 110501 436612 -11513 60068 37258 59751 36808 -16326 -1607 246959 157129 -163728
17914 227747 165066 41497 -199924 -229929 314765 -120088 -324119 -73307 294469 -70604
17903 -112229 -14812 -96831 172612 -124753 -405401 -29579 -68486 -73597 -177568 110021 33832
17891 -102923 -67719 49967 1479 107766 175213 5196 -15288 109201 -71745 -23101 74116
17879 240470 68814 27218 -135155 48541 -96420 -146489 -167843 -13309 -36705 -21189 -395378
17868 -395378 -20287 -27392 23801 -115306 -147887 -368413 -74499 78343 -211685 -324820 3306
17856 27396 -44651 -160584 18167 -363100 -189178 114990 -236338 52540 -80232 44431 64567
17845 64567 248461 443742 -81844 -150418 -175407 167556 -30735 239790 96817 -37465 -110502
17834 -110502 -52004 -42874 249964 151501 51333 -134133 -26565 5623 157407 -197993 -58981
17822 108119 -12212 310730 151697 316537 12682 -100248 11299 24185 149629 25113
17811 4072 288768 39661 187641 -227404 -101094 -147432 -125257 84887 17930 -166184 -363311
17800 -363311 -166423 354859 196261 -91363 -37840 157214 12892 80376 44451 49154 -307281
17788 -221228 35190 340637 186875 -158429 -44535 216210 -152923 58902 -4175 221586
17777 -39113 -195429 221213 59934 205489 32439 -155063 14812 -45434 -259588 -352 113190
17765 -6176 138172 -165377 -48001 134955 -154322 -155084 -62126 52176 13684 40182 126092
17754 126092 -146755 -4843 -229439 333441 -198368 255856 109924 -277856 71221 229992
17744 229992 -151209 -120543 75540 -169767 262682 198168 -139513 243870 21022 151720
17734 151720 97197 336575 116192 -152112 -129752 157867 64397 -6008 128501 19631 -13718
17722 -254737 -256374 257574 -196834 151602 171454 52953 132446 127514 208560 -474874 111743
17710 85710 81530 -166553 -99802 298468 104832 10287 98807 58172 -95504 -256460 1941
17698 -27171 176399 37627 204805 347126 78691 -176551 -87897 -14269 -25690 245963 -4496
17686 -249182 -107708 -512059 1159 98153 279480 110902 -14498 -8470 122505 -16601 46805
17674 230835 62773 341023 -194313 -216673 59065 167063 -66266 324866 184689 193151 -161794
17662 260522 -288831 49290 -12759 146065 202434 110066 -53280 -78480 -156432 2262 172736
17651 172736 139865 280275 223170 418038 -40705 -204306 174061 194960 211445 102325
17640 133505 104772 -154698 95039 -200646 113245 205327 -59093 191694 77948 -21673 -905
17628 -260071 20021 -371069 116713 93220 -196681 50375 -153927 45433 33343 398650
17618 398650 11372 105188 -22689 -168128 164655 -75292 205726 -102407 -17059 139052
17607 -21830 -14405 301003 191293 -187200 -160272 -78242 74997 -147427 50130 169312 127203
17596 127203 63057 326906 188025 -173655 29462 -30553 221600 68478 138329 16592 -117769
17584 320320 251180 -268480 -13539 -120391 -83904 -21437 62894 32185 7717 27340 33147
17573 33147 917 -188312 324701 239682 156896 346262 -189383 194289 -51416 122415 101767
17562 101767 26544 44553 103698 210013 -21643 90476 147638 280611 -150284 -21596 97515
17550 22732 159835 63208 -203681 134939 -57646 292563 284712 37027 89958 252734 -137570
17538 154133 86795 172760 21380 371298 169425 79501 221705 109067 403619 34122
17527 221427 -257611 -65669 108869 -111106 156220 -43413 247346 -255571 256654 145333
17517 145333 -1114 269175 34594 213275 48215 -309822 79710 -23896 -61566 507928 133228
17505 171580 -110156 72494 126912 73012 58955 18726 401593 4404 162107 247525 298858
17494 298858 145611 -142022 -192099 370185 319185 100715 -43724 58122 92619 -248235
17483 -18969 78423 222924 -26734 96246 154057 -52124 168504 -14803 81823 232772 186738
17472 186738 297266 96076 188812 386298 84584 -154754 409862 -51522 -234011 147800
17461 128638 -170629 -23289 106601 110903 -55054 331866 55239 221794 188953 376751 150347
17449 64982 442788 257420 354649 143242 261631 512276 248016 170342 130641 -50098
17438 -74907 368102 285072 87297 79344 494751 228007 28507 41045 598985 191015 245630
17427 245630 302712 179562 302840 53576 443586 219786 137229 559816 123280 -112955
17416 412554 483491 362423 221192 -48259 160538 153007 297401 157907 322321 320093 109847
17404 -90283 120115 230993 224836 -122686 272392 97054 490961 16873 139391 23637 268738
17393 268738 291942 229096 -106324 183970 181678 403369 -46567 205664 13967 162274 185530
17382 185530 219176 -33311 147899 331726 101119 -17792 318450 253442 -101052 267423
17371 -220929 136639 60043 -98141 236669 -32417 187696 87604 112201 -34279 339642 153891
17359 -99857 -43923 303014 -82096 120950 119967 214103 543282 34033 59706 8579 -23661 174435
17346 -212492 322773 162162 93167 138960 68281 12259 160619 231552 135975 484315 -196013
17334 -89919 305828 202985 337350 -165513 272224 -341195 4417 339194 148482 141778
17324 141778 -156431 153668 -68026 -145529 252795 73160 186045 -183050 -91805 -6144 -2835
17312 246393 -113739 224951 254926 204858 115260 111103 -25492 375624 338457 232123 65377
17300 255004 79856 72148 258196 63965 251926 199869 348113 187222 260132 572583 19486
17288 337931 -157683 47632 315083 -83943 169160 231601 138252 89778 159951 103615 -1154
17276 273260 235905 111867 -186170 215131 -222520 229777 269172 66771 247746 -37366
17265 291104 -68970 -64942 -198727 137235 186299 -106246 209158 -54904 128089 165013 271869
17254 271869 12654 425733 270923 504067 25607 -103883 168592 359406 -44382 191891
17243 121712 37688 481634 44796 460706 140423 156765 388372 76216 127534 128613 198673
17232 198673 146393 171599 95002 179451 -118717 106321 180876 292093 176853 181226 -102918
17220 355547 211988 434477 145630 254802 39140 237285 146236 433798 438570 52947
17209 123262 592016 53980 414212 99707 201688 152754 259521 164610 365190 135015
17198 220991 296967 37967 20816 112073 407142 311650 408383 178645 296757 525576 -40206
17186 485541 -27886 201057 436607 260455 385747 97823 -125646 -15589 214476 106595
17175 76862 296706 109127 501969 384556 121736 360851 229771 475427 151416 370876
17165 370876 327491 351990 235867 -74183 321935 241610 418125 366330 382022 -35282 293315
17153 98525 327984 116212 384428 126943 74484 350309 329635 266027 187861 354322
17143 354322 195829 58462 173748 108806 95341 115028 450855 424285 398591 430011 570345
17132 570345 343000 377998 296661 42101 623899 147965 191708 351697 171727 319392
17122 319392 431164 170070 191106 586990 257536 214127 462229 619906 338391 220122
17112 220122 388280 504175 464117 542168 365640 426734 293271 550179 333373 492031
17102 492031 617178 451000 119559 151118 348177 213952 616283 469647 569016 645531
17092 645531 682736 511257 456866 314616 250163 339792 337083 318150 448041 583701 510661
17081 510661 399379 619525 448782 468511 458693 553683 408348 292988 291495 551841 536382
17070 536382 599581 374102 553939 490979 382446 494397 242703 423861 481891 506814
17060 506814 599455 559160 115952 560161 172946 702939 146686 498983 578714 672515
17050 672515 393734 384136 366788 531561 646757 348506 408349 492882 398939 473839 253581
17039 253581 497438 390240 416033 321013 702306 750625 446155 380422 611623 737355
17029 737355 503558 767382 462739 525690 208720 630843 536333 336904 472593 655774
17019 655774 432157 696469 775185 810507 503078 866577 824497 660659 738814 510755
17009 510755 696790 626911 715204 485929 431645 707855 630537 386493 829647 750413
16999 750413 873599 710221 706203 634794 634955 769483 732468 883935 474294 827044 894987
16988 894987 842913 769973 955499 706751 966689 761168 1018160 865151 987616 744444
16978 744444 1032669 1019424 1018061 799421 644962 874028 1193547 970888 540990 1029638
16968 1029638 642725 1143967 806553 905481 564088 1055846 867079 637405 938340 1139262
16958 1139262 765708 1153086 876485 1212309 931410 1106039 1134818 981595 885652 1151368
16948 1151368 1072604 1033355 1473961 1017899 829699 883833 1325635 817984 1285646 1246041
16938 1246041 1169800 1047799 932185 1148008 907169 1102653 973832 890376 1144812 999350
16928 999350 1026994 1154493 1438607 1494297 1519872 1509038 1312662 1418045 1435152 1439972 1223847
16917 1223847 1143186 1199560 1401951 1172690 1415219 1449868 1276467 1559937 1284163 1445833
16907 1445833 1419926 1652951 1478228 1509368 1204411 1709418 1347061 1809478 1768111 1776342
16897 1776342 1671923 1463177 1682653 1888533 1665547 1529490 1951371 1917686 1947766 1482736
16887 1482736 2249201 2027756 1927482 1651002 2068209 1897711 1936231 2009089 2183625 1967666
16877 1967666 1971900 2194810 2255956 2156019 1923754 2470571 2554372 2371631 2310146 2319108 2641089
16866 2641089 2276124 2761046 2554315 2694157 2280433 2501126 2409826 2705088 2485028 2736393
16856 2736393 2635695 2862778 2573015 2937672 3035461 3299696 2725872 3067026 2927731 2691794
16846 2691794 3168483 3298134 3149204 3368246 3455342 3330037 3216199 3131223 3561409 3687280
16836 3687280 3509797 3714330 3759008 3903861 3808664 4043655 4253801 3919372 4239961 3975259
16826 3975259 4261091 4225636 4117344 4301593 4642356 4868215 4649556 4792815 4826949 4939483
16816 4939483 5143657 5336583 5358251 5447202 5245356 5538961 5700409 5617988 6050627 6320054
16806 6320054 6501649 6389308 6143044 6711159 7017884 6958303 7106042 7055940 7641048 7635479
16796 7635479 7995423 7981443 8281131 8221507 8848047 9052052 9059755 9110020 9122567 9892564
16786 9892564 9652545 10126922 10387121 10812542 10958207 11063956 11750283 12277524 12500666
16777 12500666 12989560 13044960 13842126 13613434 14171334 14983713 15217242 16245599 16389531
16768 16389531 17021181 17727833 18469675 18518322 19425502 20317211 21137546 21731680 22973264
16759 22973264 23417083 24725529 25490366 26303523 27879864 29147166 30355289 31684475
16751 31684475 33113810 34354075 36239711 38056123 40021680 41589031 43867968 46263337
16743 46263337 48238251 51003535 53865405 56689668 59780989 63445566 66790148 70700842
16735 70700842 74872970 79659260 84043686 89438907 94659160 100396296 106491221 112534611
16727 112534611 118943805 125804235 132479511 139601996 146058820 152668770 159426539 165062837
16719 165062837 170186693 174639058 177714748 180242014 181063265 181285637 180250554 177507746
16711 177507746 174439437 169877291 164285542 158813952 152165732 145699607 138653068 131507464
16703 131507464 124856922 118136005 111346206 105266058 99044379 93279050 87699221 82684388
16695 82684388 77707990 73267700 68874919 65082435 61933209 58155642 54659461 51941859
16687 51941859 49285006 46219691 44029712 41433415 39856304 37714006 36079349 34051461
16679 34051461 32582497 31001573 29837810 28307075 27313767 26034700 25110538 23960859
16671 23960859 22863253 22190388 21238167 20432883 19490675 18720298 17916144 17431880 16697450
16662 16697450 15937227 15747201 15374951 14573219 14074965 13655820 13084953 12948278 12326693
16653 12326693 11932065 11247061 11372785 11048916 10905172 10329311 9851145 9748246 9570766
16644 9570766 8940691 8851961 8458685 8389105 8179310 7497271 7978076 7635755 7636881 7540015
16634 7540015 7080455 6678926 6469961 6336954 6501766 6485946 5970838 6169986 5945282 5658246
16624 5658246 5790367 5587253 5348494 5172301 4872637 5120373 5002857 4559653 4419841
16615 4419841 4372133 4320018 4431067 4167703 4390740 4169522 4248843 3829451 3852967 3871764
16605 3871764 3788213 3863498 3726160 3563627 3369244 3115934 3155342 3256456 3657975 3240156
16595 3240156 3370782 3003414 3181678 3007159 2686539 2902785 2365257 2495584 2701616
16586 2701616 2654932 2799506 2681353 2368207 2643625 2397586 2386638 2139698 2553671 2249488
16576 2249488 2297476 2131570 1995391 1965313 1894712 1969332 2262341 2076436 2341351 1971674
16566 1971674 1881867 2065714 2067334 2020149 1714581 1739569 1765408 1810065 1579764 1737411 1489920
16555 1489920 1725778 1460415 1769609 1474581 1221969 1467427 1596282 1763178 1410506
16546 1410506 1389132 1283036 998312 1133223 1271255 1033627 1242990 1349417 1427511 1187098
16536 1187098 1000105 1288235 1158741 1454021 1084426 1132674 953945 915424 1095218 1246295
16526 1246295 1081356 1287760 1065874 1172694 965256 1017649 1041051 962285 971807 842213
16516 842213 1070815 827835 1094013 846686 1101308 1013703 558315 866145 799779 898268
16506 898268 750397 918054 859116 691986 1222790 789827 966435 837753 846465 668550
16496 668550 1031131 826136 654098 753296 1141571 869743 544022 548959 795247 934947
16486 934947 779509 810052 466052 842024 689370 575199 520285 565951 643383 818565
16476 818565 836196 544755 713446 385561 538895 588129 834666 620261 385670 646535
16466 646535 806904 432036 425315 473688 652693 556175 508127 477144 449095 526231 560175
16455 560175 699406 473055 523821 529582 490415 575217 634482 187242 411428 358479 530128
16444 530128 461340 667828 507398 665891 448144 476996 355627 327878 344192 367315
16434 367315 417745 642234 451256 495385 586574 580657 164601 383273 371610 487451 270689
16423 270689 484029 566117 511375 131489 121897 360599 504280 425497 296915 411825
16413 411825 410139 539983 554113 491404 458826 339409 501051 406728 565611 287210 336423
16402 336423 350503 362979 169804 201653 433977 280268 169084 427849 411305 90843
16391 78201 476911 106918 159783 525494 312359 137548 394190 108477 301318 240885
16381 240885 340757 346918 257490 9938 178007 97771 -1179 175466 407605 236614 68512
16369 170602 397010 128666 166684 109013 525913 88842 -7721 314109 295978 143805 457624
16358 457624 295447 45194 -13322 308220 241306 435554 214231 308615 -187613 162352
16347 111344 216342 -60567 156182 415484 198623 260845 367753 -236268 43931 166543
16337 166543 199884 260364 465699 367345 159669 387690 161344 320896 100611 239130
16327 239130 -40284 77179 113374 -26810 216122 355931 65581 345691 379503 178593 181263
16316 181263 107359 49598 -76188 195485 117813 -171329 -151519 -243076 262117 153570 -100074
16304 274617 252640 186906 263829 180678 137631 327025 112131 364272 211176 208265 265511
16293 265511 -40914 421503 56127 -183058 266753 446356 -50780 184038 295755 139060
16282 351922 -319650 67735 -5155 109346 453145 -171405 399912 84200 -82822 213532
16271 443600 22697 232031 -198838 249006 144055 487306 -96675 -1584 75939 183730
16261 183730 144646 276220 -33699 487917 55692 82200 28322 -26068 -97020 194773 114155
16250 114155 85116 245412 -137418 41537 384683 111607 228136 61217 71287 -143449
16239 -93927 23586 78584 84969 11364 292560 -199581 -26746 376373 3077 56758 -66655
16227 -66030 53277 -2841 94338 -4017 179156 188609 179203 200036 36991 202852 106307 248892
16215 248892 442638 153768 250196 -43541 60463 511705 327078 51138 22243 -136727
16204 -15317 29310 345491 -4587 179606 -205337 -42665 295640 -70332 180435 341669 -287115
16192 -7087 45333 -14095 157904 160553 -108668 -121096 18917 216125 77203 72156 5203 80189
16180 80189 -49443 71830 311066 -68100 64941 -43631 57860 -6465 -172998 -47116 93554
16168 -87640 -29809 -104639 -66063 -263709 96617 -80871 128132 9672 -115246 -84790 -185006
16157 -185006 136424 -17237 -21507 -270546 225137 -219801 -32607 -264471 98492 -142560
16146 41517 -131882 208722 171640 292631 283706 -28747 -28851 -199321 -48916 -43574 95038 -245858
16133 -73112 192598 -105982 360836 -3263 205293 70641 -178896 -243095 136424 76649 34807
16121 219532 -6304 -60875 13361 14662 53843 -201467 156793 -146308 -153488 -99587 75367
16109 -298591 41928 190164 68351 76989 -445214 -226832 113313 141773 95889 -44723 123560
16097 134055 220286 16205 29171 -328264 210162 -218183 -82197 107706 266498 -250381
16086 -87092 -42470 -16111 -157243 104752 -147448 -81735 -524530 -23342 441143 -38903 -140058
16075 -140058 252878 -115677 -28658 -109350 -240135 121830 145051 33789 44879 -107553
16064 168906 -64484 -325308 379917 -66278 -53030 196943 -3155 -214040 -144562 47265 57032
16053 57032 -172653 -68475 173639 65512 -32480 -100995 -216228 -141035 71894 163594 119387
16042 119387 -2895 -35039 89934 175716 33496 479771 -56308 -226919 -86567 -53058 119765
16030 39305 124360 -127861 -104140 -40090 -235176 63796 -22065 -135107 69705 -248982 163853
16018 -123839 393249 185955 38902 24298 -21501 132789 -20975 209250 -55185 -240128
16008 -240128 63702 -183959 58030 -51881 161846 -16994 -28112 401564 -475696 -133226
15997 -56415 -20757 271254 -151986 245708 208114 -131587 -90562 232130 -185700 183692
15986 210845 70799 135134 339165 384964 242357 229885 537303 157599 -201463 32639
15975 -304548 337116 56155 -16910 -1173 177650 -100208 55131 -150858 -178277 -213695 -56948
15963 287418 -41430 193813 -103072 281572 -302741 117330 110478 -85342 -18028 -255165
15953 -255165 -165828 -1679 -69599 -150927 63687 356310 252013 14638 116865 158811 -13179
15941 -21240 29046 -306151 -309954 316230 -163409 -45122 -80948 -118861 -44471 -69395 151788
15929 39715 371586 -30985 -119290 -309683 -82799 -109706 -162214 -88188 -128410 71671 -325310
15917 -126637 -320992 -48499 -1476 214992 -283157 163244 -52408 250352 -139546 34372
15906 267066 831 -92765 -292896 -102982 109922 -30440 135898 185958 16968 -73871 195827
15894 74352 -211678 -486688 -233207 16686 356438 -186194 73875 347192 -116946 138568
15883 -186818 178573 30667 -79116 53394 -72126 -80557 167114 277437 -290291 -349983 192088
15871 -59274 -73770 123042 -142430 -218579 -3044 -127128 -209583 -210389 -331104 -250443 -53432
15859 -172271 -101771 -48641 -103758 152326 184516 295452 225162 -92957 -139668 154155 116760
15848 116760 101845 103970 72765 -84163 -72917 -204463 -58864 83021 -114915 326810 -176931
15836 -151441 111874 -378827 28392 118252 81397 -170041 -397141 -100175 -35197 -103845
15826 -103845 168253 -133472 -225063 -217922 -221382 -307736 96039 86311 -100687 -82688 -56172
15815 -56172 -393929 104276 163187 -133264 -289539 180092 -7972 36545 240485 -72517 70568
15803 472058 88700 -26708 -5146 -18398 -258764 313176 8467 -22211 -8014 383 66326 -53786
15790 69145 -107099 88887 -11649 -69709 -75298 -28960 71528 -65976 117525 -10754 160546
15778 -129609 258862 -218670 46269 -207475 -156760 154350 3703 173944 -24960 65804 151199
15767 151199 -60683 -48385 -75083 87404 -336500 -143135 -261685 -121021 -110499 102825
15756 39921 376559 -57980 155681 -73854 -49935 75491 39932 -130654 -341544 9948 102829
15745 102829 237646 -92320 168699 286093 -60140 -177833 -117472 62268 -109268 -105886 -1589
15733 -72134 63585 -100045 -283053 -252238 135883 -373193 -235113 52795 -163024 -2488 82008
15721 -64392 64265 -71408 -487179 -143122 90335 -384540 31363 -297710 35815 -115704 19413
15709 -578205 17211 -91597 218718 -95022 -294742 190360 -154273 85811 161267 103802 230832
15698 230832 16946 -61861 -44350 112965 -23827 -223723 61840 399452 63388 -142815 341183
15686 -109471 -198796 242031 -79087 102560 -126374 -9457 110829 142792 -10955 -123375 90781
15674 112952 -206283 234588 -119455 45542 -313199 -214667 -7075 -187711 8410 -348351 311900
15662 -98353 189735 13699 -363485 -74528 -270232 199962 116488 70247 45626 128493 111223
15651 111223 -11314 -325256 35435 -30375 6198 96670 293379 69213 457878 -188200 -71768
15639 -297144 -484411 209744 -42655 -108050 -2082 -70117 -65690 136697 -123730 202546 45019
15627 -178105 115863 -12045 191452 292937 -241881 -33081 -179447 -31362 47948 310889
15617 310889 -203769 98567 -68086 -115127 156687 -337094 -19736 122463 -232626 -26868
15606 -302761 276845 -72863 52852 -163106 -270417 -20470 81676 -23334 -317191 -255227 -48771
15594 151371 122011 -205699 83979 -37898 -35132 89721 60741 167304 -210144 253294 -43122
15582 265891 494075 26048 -64939 -376405 -109643 115308 -139879 80572 -341211 88120
15571 47819 -7724 -93681 -126345 -255078 27555 -276000 243992 66307 27196 -156086 40127
15559 117928 209161 122296 101969 -25981 115206 -7316 130281 -140191 89888 154223 -180835
15547 51085 164337 -71464 -164210 -20493 71264 8924 201349 250855 -309102 324328 419728
15536 419728 438683 -191341 18528 -218002 -81931 -361345 -248698 -391684 -218503 -187422
15526 -187422 -128551 139588 -134952 -190191 101542 -239523 88130 -175361 -25326 66260
15515 -94514 -80645 -188289 -106976 377049 221760 -63876 101153 -195274 121631 -50477
15504 -312590 181719 182411 59246 -101211 -61779 -314062 -80364 338515 -176273 -317004 115554
15492 33492 238265 -124840 -108350 109684 -465237 -312808 164568 60584 191657 -231770
15481 -104298 -146070 -114645 9624 239069 90750 61885 77189 101142 122956 -306243 -48104
15469 14115 18604 -30939 94465 260129 -27400 -91242 -98071 -379537 225484 178553 76934
15457 4180 -28386 -1781 39447 -153633 -174419 -141204 145636 138248 -105491 87694 -218383
15445 -172659 -144291 -11022 128202 25176 -143050 -41648 -155863 93506 18792 -37391 60318
15433 -213298 119219 143086 509334 174910 -244864 -58506 -38480 330665 -389668 294497
15422 -61954 -63249 -170666 1288 -8897 -9669 -165579 -100731 23668 -186398 142217 183933 99664
15410 99664 -76934 72578 -230939 -342070 -159948 193989 -59871 -33597 83989 -226200 -166495
15399 -166495 -322831 -216545 -70376 -191742 160992 103049 156004 -218223 370687 -45411
15388 -12637 257077 50160 -35861 98741 109160 -78277 -101156 144783 17827 127261 61973
15376 118548 -127362 13862 -222260 98717 -30572 297789 167306 -152839 -198870 56945
15365 93467 -111790 104516 67457 -65315 -106136 -33633 -40142 274115 70572 20886 223325
15354 223325 -301206 305725 -288987 78228 73865 -203925 -101280 72889 -356261 194150
15343 -85391 143680 -32265 10352 -62323 124228 334487 -102861 172063 159183 373136
15333 373136 -13037 165049 -250502 122566 -66517 -116449 -44174 -46807 173771 303507 243622
15322 243622 -31309 -113615 369282 -356789 -34526 -132905 194527 -39534 205653 -82101 125949
15310 395070 -310565 -261225 -129960 3978 -100967 -116251 209810 -118527 -142130 168269
15299 57271 -82747 190974 379488 -59157 -306241 222703 149707 -220613 -5887 -151632 160516
15287 -66911 -180843 36828 115988 346341 -61594 59961 111951 -8234 19958 163466 -6803
15275 18839 269090 -174860 263048 -295206 235603 154662 -53424 25389 174867 -106680
15264 122482 59730 -316342 110854 36134 23483 109672 -19227 119327 -75704 -77091 -392117
15253 -392117 310656 -16192 292620 427082 407315 980888 753399 879745 930035 604747
15243 604747 5675 290326 193551 -105966 91490 -97885 363433 143389 359356 -86357 271614
15231 -68090 -6380 45350 217413 -2655 -261865 16768 119196 -20773 30077 219923 306925
15220 306925 145649 9002 179723 189867 -92760 -235850 16916 -3914 99296 26240 129691
15209 129691 -58571 29096 188611 123280 46773 196303 -279744 318321 -322717 247911
15198 73446 2742 -12440 80203 295418 112595 172533 -54609 -156950 228800 -305287 -2159
15186 48119 15350 -188951 83895 92304 184796 197911 269936 262908 -155994 139155 -6000 -135413
15174 -135413 -80328 199870 180652 -19241 38205 74220 114855 102736 -23579 234688 144550
15163 144550 120594 151741 226372 144480 105597 1314 -241785 -345325 61806 188229 -156211
15151 143967 -34459 144871 304896 -23759 93966 137519 30936 125504 179015 -74040 207816
15139 380974 228006 347985 92292 152425 -111959 -48817 322865 -135894 191397 207068
15129 207068 -178568 -20424 244147 213776 200069 152401 66873 61562 202080 -87145 -28108
15117 140916 -10020 178217 186165 295736 191945 198094 35697 392571 -8856 14888 457187
15106 457187 229417 256215 233500 -326551 -194288 66852 159884 408364 -66088 64206 -228198
15094 -4264 97097 -75829 487847 396910 152201 216875 6189 448048 420541 392510 288838
15083 288838 -264397 -73519 151466 70620 229386 98809 426457 32638 255339 41363
15072 151190 -152610 62250 166414 3448 -37189 158136 112414 48330 -20966 399659 186808
15060 426617 152851 253340 -180700 112690 40803 232468 183307 146365 267008 -14275
15049 303959 144703 362946 190804 13397 455202 139593 178580 477419 43766 -194500
15038 190327 78430 -21625 614314 150579 381792 -93580 24749 7698 364402 357309 278091
15027 278091 -25099 202264 -8100 108721 253996 237461 233051 -140922 225563 2085 392784
15016 392784 7258 152992 144868 116386 -132661 -95989 66851 29151 195437 198387 250700
15005 250700 132231 277505 -28273 263924 -31754 241246 229681 238499 434731 -256403
14994 140981 237885 219109 59827 198496 226116 284741 -13985 341158 193624 418272 589184
14983 589184 200823 182800 264275 397689 142004 340355 366676 365609 -30151 17442 593154
14972 593154 110788 411287 403668 100410 193628 249787 435530 121760 470547 96567
14961 72266 226586 276655 71543 42617 46790 147694 371352 181857 487798 462262 158208
14949 421823 313801 344877 138322 266073 226197 413213 254613 176349 205895 359133
14939 359133 146542 199804 386228 357691 177721 297109 69568 293812 313570 -311641
14928 463005 -72839 138958 227323 98745 328790 142750 377279 348715 365316 303891 375604
14917 375604 306885 343289 343185 96074 590111 336128 300139 98060 235111 246416 273773
14906 273773 379417 342814 691509 323527 443165 150033 130971 182957 543428 548430
14896 548430 287042 433916 202986 456232 417467 382702 254053 275586 126531 96240
14886 96240 404888 284906 157612 155902 307489 24368 216563 -131848 226511 454442
14876 454442 340232 458496 212996 143716 468500 419025 288052 224400 496337 148601
14865 149683 267970 238148 231302 599505 399714 246870 150341 506650 663142 529225
14855 529225 516674 296711 47351 112998 247920 442244 524906 171058 403069 179524
14844 289468 172334 495711 433402 329262 431384 516682 417320 448248 602091 131558
14833 521562 693796 520241 616377 484951 640895 588679 464577 628082 399637 618043
14823 618043 255624 364593 529193 563489 129231 240555 52011 279191 389005 280815
14813 280815 412327 398164 178301 15277 606059 409949 216484 765663 386517 529199
14803 529199 395135 616233 438011 746366 262726 297724 457897 437406 488116 162626
14792 117875 394777 440025 586953 467179 440131 476782 512615 500258 848398 601797
14782 601797 555605 411360 480204 514765 456066 488525 337760 21992 134969 469898 608957
14771 608957 511413 754195 638654 441760 686927 505482 419284 525852 343730 364145
14761 364145 599233 692477 453173 448662 659258 750492 365437 413331 248895 782603
14751 782603 354930 514376 440307 931859 553653 1058158 542290 829764 376077 679099
14741 679099 543467 523693 491647 527335 719167 764890 645294 578764 884859 800018 670311
14730 670311 731788 384185 232403 589359 852749 459359 743038 559783 702835 482019
14720 482019 528000 572899 508328 573792 657517 905729 699334 702994 527156 593123 833071
14709 833071 692446 671272 742790 909456 877919 905960 684001 666356 845572 841237 556379
14698 556379 801045 855391 751564 779786 1071936 701564 981448 918645 812618 882915
14688 882915 622494 801660 769237 764176 921469 684706 857416 677752 473187 771349
14678 771349 645401 1201196 1043931 870367 1328393 1068041 1018687 927038 863584 733671
14668 733671 736001 1151354 1086432 1133365 964115 581775 1025818 1312293 1213573 672248
14658 672248 1187517 1195650 1124653 1127912 833281 1191308 816734 916801 1030405 967865 1007264
14647 1007264 1082835 1208726 1052722 1205262 1164807 966413 904601 1246867 1002941 908261
14637 908261 1170953 1362438 1211216 863400 1070869 1134491 932990 955900 1072111 1469843
14627 1469843 1107243 1204101 1426626 1383458 1086475 886964 1442460 1332939 1373481 1380211
14617 1380211 1569076 1495098 1009641 1457073 1214830 1343056 1398511 1711139 1316505 1180206
14607 1180206 1242819 1178836 1510545 1338395 1358920 1398732 1225834 1598257 1678844 1309420
14597 1309420 1153235 1484022 1443443 1666309 1752981 1628993 1839169 1747340 1766737 1808444
14587 1808444 1659006 1429353 1595891 1360093 1492942 1703256 1698795 1586486 1551375 1663130
14577 1663130 2021949 1971563 2037979 1747034 1879947 2033725 1771257 2055506 1871402 2167140
14567 2167140 2023654 2155418 2073780 2394184 2258576 1939237 2626942 2102036 2154922 2636147
14557 2636147 2866312 2599397 3147811 3117251 3475684 3515387 3886165 5058857 6964432
14548 6964432 10610940 19550416 38629659 40383319 20565743 10180880 4594673 2968210
14540 2968210 2266379 1970463 1796828 1685203 1601738 1567205 1777222 1941423 1809168 1778564
14530 1778564 1693593 2065574 1968010 2230018 2180841 2009869 2151750 1982362 2326060 2168883
14520 2168883 2382026 1715124 2247718 2030690 2533402 2012396 2414988 2454431 2047540 2314337
14510 2314337 2320804 2707348 2510513 2479488 2565738 2825012 2545543 2740365 2871672 3001826
14500 3001826 2798607 2656470 2785925 2880816 3081001 2893746 2623244 3219111 2682509 3001110
14490 3001110 2880131 3085784 3182134 2983343 3334709 3718360 3188002 3407612 3067401 3252266
14480 3252266 3446745 3238873 3291052 3471529 3615339 3519345 3625864 3644673 3706377 4099855
14470 4099855 3976977 4100722 3873788 4089885 3972128 4208852 4009067 3950267 4446819 4231336
14460 4231336 4155889 4154096 4332597 4558220 4729511 4241265 4634217 4517184 4539430 4730043
14450 4730043 4480142 4534371 4831443 4750638 4843441 5286761 5313757 4981693 5181083 5330444
14440 5330444 5519070 5554446 5514509 5514243 5343620 5792239 5829267 5624009 6061144 6085470 6017966
14429 6017966 6154644 6247125 6404685 6730166 6347967 6424743 6647685 7061142 6970887 7099050
14419 7099050 7069086 7209909 7187156 7416698 7650492 7813492 8109617 7745131 7793162 8168771
14409 8168771 8069607 8485422 8569339 8479872 8660650 8460568 8830403 8862867 9155913 9043750
14399 9043750 9066419 9424205 9675947 9716586 10006827 10091973 10470686 10427061 10582322 10767301
14389 10767301 10632758 11050547 11439738 11397024 11827663 11907275 12566228 12604044 12204571 12837120
14379 12837120 13215508 13459606 13429362 13989498 14267697 14359070 14737671 14935044 15565533 15654237
14369 15654237 15907167 16076949 16294537 16830906 17541181 17853169 18135223 18326247 18896424
14360 18896424 19170470 19813349 20104285 20551014 21046119 21450773 22106241 22172874 22944419
14351 22944419 23674855 24337621 24776984 25508016 25895029 26641013 27501791 28357003 29002839
14342 29002839 29587964 30685618 31189572 32074415 32913528 34264424 35046635 36003174 37434424
14333 37434424 38352589 39285675 40897718 42026648 43308196 44843951 46372743 48059650
14325 48059650 49571566 51454793 52853777 54824033 56895146 58818597 60896618 63398200
14317 63398200 65954182 68163247 71033231 74016461 76878476 79966544 83570697 86974014
14309 86974014 90924915 94954147 99506614 103794309 108540062 113523444 119317247 125029636
14301 125029636 131287530 137671842 144773716 151969377 160001569 168359437 177121655 186369581
14293 186369581 196573857 207180044 218122525 230244777 242951977 256444948 270277083
14286 270277083 284704048 300184251 315826707 331991969 348498691 365093415 381361476
14279 381361476 396958051 412483751 426998567 439827679 451477074 460706120 464092598
14272 464092598 463673860 462136479 458986902 456142685 450783908 444495833 439420169 428630934
14264 428630934 414866057 400070591 384566833 369239230 352991447 336318328 319752462
14257 319752462 303775075 288137784 273767757 259667998 245727187 232740346 220649033
14250 220649033 208653494 197866086 187469031 177784385 168767212 160399370 152341967
14243 152341967 144829137 138094880 131129033 124748052 119180582 114040625 109085281 103743203
14235 103743203 99235947 94452908 90909688 87218231 83763273 80499164 77066298 73918333
14227 73918333 71139385 68615004 65976097 63574944 61246668 58791088 56966667 54756913
14219 54756913 52842307 51350311 49639031 47755683 46528041 45156725 43624509 42398479
14211 42398479 41340707 39723660 38711549 37448993 36949851 35683622 34337993 33570929
14203 33570929 32746426 31567410 31148545 30768515 29702033 28597297 27812634 27265698 26643125
14194 26643125 26036454 25265658 24569442 23788534 23257912 22783811 22556274 21830915 21585496
14185 21585496 20846030 20201802 20030896 19451458 19201146 18649495 18259624 17758235 17533485
14176 17533485 17344938 17135154 16349767 15904030 15937591 15468170 14824458 14980728 14737721
14167 14737721 14072676 14349686 13674649 13894841 13387883 12667415 12662603 12780117 12569524 12269787
14157 12269787 11880563 11819001 11605991 11384332 11154323 11103312 10941465 10483778 10324118 10317560
14147 10317560 10294279 9835897 10005113 9410610 9465652 9262748 9239767 8963656 8799301 8941104
14137 8941104 8874532 8422471 8470129 8032404 8171613 7811351 7850744 7844238 7557290 7732817
14127 7732817 7191988 7179302 7434628 6714829 6937523 6917978 6804856 6773082 6490568 6747092
14117 6747092 6558584 6501525 6228648 6427047 6102356 5982541 5657277 5964509 5566136 5840850
14107 5840850 5641571 5798875 5749857 5590088 5376017 5690735 4942095 5149094 5172068 5246614
14097 5246614 5141516 4723752 4957674 5110530 4828358 4720559 4601965 4265659 4633507
14088 4633507 4785464 4523417 4376246 4527195 4758447 4518052 4269243 4495549 3995502
14079 3995502 4404166 4385971 4204589 4114968 3929266 3932310 4049949 3750680 3780182 3614136
14069 3614136 3685363 3609826 3263209 3614049 3340526 3436109 3506603 3356989 3204575 3470784
14059 3470784 3535907 3344060 3560023 3343321 3492575 3456134 3317026 3002490 2986808 2979176
14049 2979176 2862828 2973972 3286927 3068191 2965893 2843359 3064966 2836508 2999244
14040 2999244 2984584 2509535 2564405 2735822 2458042 2617909 2328373 2838216 2637694 2676120
14030 2676120 2806677 2799516 2523300 2412310 2650133 2442803 2416090 2343721 2646577 2478000
14020 2478000 1966016 2580860 2263417 2189343 2456405 2172669 2125031 2269144 2106611 1824548
14010 1824548 2248920 1838010 1861344 2152741 2049418 1689655 1601079 1577474 1766305 1984906
14000 1984906 1783049 1699263 1982712 1960961 1882603 1811311 1935005 1770280 1841115 1724235
13990 1724235 2392801 3071899 5853475 12633762 31568983 41475074 24046533 13556711
13982 13556711 8303200 5359982 4077763 3641972 3595849 2879544 2485956 2944269 2225549
13973 2225549 2561937 2136662 2029258 2066449 1794376 1942819 1927529 1818545 2040396 1962808
13963 1962808 2015904 2085869 1745539 1487861 1737858 1777436 2140400 1587735 1580560 1539070
13953 1539070 1599277 1528188 1506805 1349869 1320994 1574197 1292580 1702589 1560468 1325411
13943 1325411 1535916 1612371 1631175 1788155 1207720 1281771 1064219 1706608 1346352 1400293
13933 1400293 1137052 1320539 1473429 1279467 1228343 1323137 1548938 1467827 1466318 1788323
13923 1788323 1329833 1486427 1701206 1654594 1365464 1365541 1153011 1245865 1052711 1335399
13913 1335399 1237649 1332575 970293 1082637 1111549 1157149 1268317 1227493 1393181 1009939
13903 1009939 1315371 1091875 1132144 756661 1430987 1080193 1115469 1106923 1372431 1235505
13893 1235505 1143278 1166074 920775 1267409 934928 1326814 1130888 973549 1131633 1147734
13883 1147734 984994 822540 1097858 831254 1001978 1007098 938233 900652 1334612 1282520
13873 1282520 1011917 1046218 997006 935197 1124066 755279 752408 939267 831383 1067435
13863 1067435 943201 742362 807433 993051 1140555 1013297 1274674 628244 871548 823499
13853 823499 555878 875654 716796 883866 816013 1148078 852584 777492 662586 1030589
13843 1030589 484438 872932 1104163 650613 881536 841612 981727 992448 940285 875624
13833 875624 936617 551596 759611 465671 703431 1051034 684419 612049 1038655 757062
13823 757062 635449 636505 624740 593773 770796 854269 807405 845480 441580 945803 810196
13812 810196 785555 654866 344466 721517 891788 795556 638704 711491 665773 1045341
13802 1045341 821272 797319 902068 376498 440789 875764 559236 708593 577497 604098
13792 604098 619308 748104 509864 580588 807066 524574 677864 768062 560444 659884
13782 659884 760137 664360 740261 543954 514936 281170 448301 352386 765679 563953
13772 563953 742851 764710 384105 500504 447593 853557 966355 600852 500116 746425
13762 746425 549697 491814 957784 748846 538659 655426 509295 335504 81441 486933
13752 486933 339574 870655 303242 385508 472163 351739 644172 482084 394715 635810
13742 635810 727127 296378 856864 453013 687750 482476 821691 650132 377600 234017
13732 234017 473323 237590 411234 690594 175599 285586 742550 495621 382667 264814
13722 264814 418824 265968 250051 228417 408180 415225 278789 517657 368450 550137
13712 550137 621187 375043 365449 62296 587823 804259 319869 482495 339906 337482 636533
13701 636533 487411 370264 406290 662893 396095 611487 414350 170124 452435 226108
13690 272309 570556 355885 133556 330764 523557 374119 648052 617811 365870 282557
13680 282557 628437 386462 359148 424971 527964 335948 617879 312532 231691 340102
13670 340102 143288 399535 422264 153224 445994 124641 432917 390839 160870 530299
13660 530299 525167 265176 172301 369238 246649 53476 486043 215730 530514 356488
13650 356488 281721 499736 387489 266046 322570 211529 244232 375931 22998 579355
13640 579355 127330 339493 86123 230230 652457 673515 154035 334234 538813 184156
13629 423497 320908 505497 253794 361659 319438 445720 529772 242304 490249 282709
13619 282709 -35288 209667 19059 469904 271297 374842 298594 508583 317116 234135
13609 234135 287170 227133 673191 -21745 301151 531382 229210 376476 320858 338398
13599 338398 499840 142967 240698 245072 506673 488977 95682 505650 207761 693313
13589 693313 122984 342352 18515 195237 363830 353106 467415 270529 475881 434862
13579 434862 265641 569721 219502 374786 643747 171434 376566 119656 596702 321499
13569 321499 247255 336153 177649 -49965 303620 335771 192365 -8449 175950 251958 -70998
13557 116838 477077 106537 228295 500914 162926 100567 44133 -7702 90624 -96403 206255
13545 461859 331858 408870 549667 54226 225155 449627 355215 -101478 426460 247050
13535 247050 -2432 179159 279654 336989 104526 230452 282381 31499 124056 245036 341726
13524 341726 322735 -50403 299865 -218273 73283 -28613 -127977 363186 220554 191408 360569
13513 360569 301878 169758 621774 300391 588842 448343 125813 451243 -13731 369559
13502 335275 -267109 152899 211418 407499 318723 -177379 171659 -73415 39051 273390
13492 273390 342571 110415 137993 118883 512352 409824 -95724 183335 93705 201220
13482 201220 65334 152997 382747 208999 421525 261574 -107041 72457 204728 274408
13472 274408 559313 305404 18412 117876 156170 249231 -110981 435823 72004 134417 358442
13461 358442 100510 106884 346465 383813 327151 261853 238615 414067 342508 155955 360404
13450 360404 86169 -143991 287752 515536 258889 231416 290602 153524 42144 7091 223177
13439 223177 306669 426946 181284 195651 118009 44535 256246 62133 307021 138314
13428 126066 416944 221438 53213 185829 170351 198489 35432 30175 -103612 98210 200880
13417 200880 103399 672034 218458 -95954 146266 -47343 213285 168489 365617 103644
13406 119513 234227 -54365 232840 -35065 -30267 -4071 186714 116981 170547 121433 447232
13395 447232 -67380 226342 193976 190885 244774 106467 161916 -74076 20718 500430 -119980
13383 29431 53806 89527 38862 113686 -32832 123532 215229 72170 -40896 52472 579455
13372 579455 349542 125258 -177531 254721 319563 383558 -143316 166155 -118277 81427
13361 434069 123015 255119 104509 -54541 296807 -36220 286813 98466 228447 -168634
13350 136615 238053 41223 207386 77002 179561 261659 140819 174305 28550 -55088 196862
13338 522273 64105 243372 213150 136495 318043 -344620 -80000 126780 267520 272361 250829
13327 250829 -107298 -151734 -82668 -195524 212074 220132 118267 223574 358832 287369
13317 287369 277021 85875 331093 144080 -54793 -52432 73012 -81227 87946 48222 194131
13306 194131 -244334 106442 375599 195758 87272 82650 -110086 202788 331512 115452
13295 -26982 -38091 17326 200192 173200 483522 91182 56204 -143268 155209 360104 103483
13283 195803 -51708 -166185 50135 -73728 -74851 -117572 -298273 167933 150391 46804 -68882
13271 206142 -196364 -138265 31382 207585 235313 87849 146216 -47729 130585 140694 254876
13260 254876 -54905 56798 332410 439705 92706 105686 393160 1798 321870 -24853 80300
13248 35693 374764 222737 210999 164149 255395 -252724 56797 168839 272212 71316 340585
13237 340585 5885 157891 11214 45653 98147 233385 129419 -59646 24153 -108817 340573
13225 163078 237251 17762 190081 161876 -88804 -30867 167446 284741 207748 -33426 102732
13213 -41508 27573 -108586 173877 397025 -248404 -74467 -55113 -17997 174608 -160559
13202 320197 -165429 -105922 -49363 -25924 201046 123087 455278 11338 145762 207842 241818
13191 241818 119683 242221 -24602 106975 47216 -43734 286495 -168051 26962 -117009
13180 242543 85816 -153635 -18813 -42052 -83972 -97476 -2225 149559 -2184 -449333 505607
13168 -231950 -24760 281367 -147784 -90500 -146974 48980 29910 252180 430736 -41988 -222176
13157 -222176 44191 98356 79702 -237359 325 -245033 -240 -34105 103040 223248 206099
13146 206099 -29456 85951 184663 84468 158469 346953 -40119 -238658 -132803 70189 260203
13135 260203 -59533 72800 16797 5787 143655 111711 163561 -144840 231190 -35251 319139
13123 80310 -157280 -83307 100497 97048 126135 13502 -193423 241848 -174400 186048 -48810
13111 -193832 188316 -68882 -250168 117472 -114383 19865 385218 -463012 -56495 169223
13100 -236556 245139 12122 233868 -44736 17004 150743 -106042 -51779 94643 151758 199081
13089 199081 -91344 -41327 120276 -143336 216766 71826 -172123 59798 185385 -246493
13078 84316 -192920 -372864 106753 250174 59821 -103936 284590 103011 45218 164371
13068 164371 173026 97162 -35285 71980 238010 -18999 9991 388502 110869 254985 -222297
13056 364089 117907 -29447 73667 269710 324504 -88016 -740 193812 -151859 127265 -175220
13044 40841 384542 195547 -25230 146299 -46849 -12300 169826 309343 -51054 -195885
13034 -195885 111732 137022 110528 178740 356486 185061 -23407 57038 -50289 255205 -12763
13022 122362 159083 52133 458891 -419609 -117750 224110 396376 231646 -87322 25695
13011 193341 179164 220272 -79658 373688 -67249 -8309 -274 181565 -38804 114250 -338446
12999 88639 85880 35192 297394 39272 203256 -69689 57341 -26355 94663 -147394 251177
12987 66079 -351711 173392 -381758 -194532 36344 101270 224831 -76482 20840 -18254 2783
12975 173938 -100018 50671 187493 -4530 -189439 -30238 -273584 317368 -7141 -1565 116134
12963 21203 -95460 55146 -271941 -204102 72387 125497 -163663 155224 -7667 -75802 292844
12951 50428 -116728 41013 107855 259385 -103411 -73965 270313 74828 18302 112109 -193897
12939 -3340 86092 20706 -79368 141656 296607 -346080 227016 262290 129293 -187854 -49542
12927 -39205 20194 38301 130401 -62468 117138 149761 155049 -227370 -118222 105883 75549
12916 75549 -158145 -33078 -50028 -51830 271318 -24852 253488 -253756 32975 25753 21749
12905 21749 89732 137277 280800 325718 -11244 -40770 76838 -113584 3491 -33103 159458
12893 36932 77435 302005 243076 -106522 -169431 192852 -243653 162958 -92902 141043
12882 -179561 127832 -151349 -379294 143089 50593 1038 80392 154213 -10305 108081 390248
12871 390248 146371 10941 -7183 214170 423723 -345814 23157 -157243 179326 -4194 313315
12859 115989 -56292 -130688 23606 -72367 -9793 147315 83079 -63233 -39794 48835 -123042
12847 441427 90504 -258596 -64272 159633 -155674 20613 155942 85619 89169 -132543 -100195
12836 -100195 260266 -52592 -20886 130358 -165465 -129457 -186435 -199291 -219670 -10418 107650
12824 -8591 50631 -38502 171209 93747 122323 459139 -96215 -183167 4487 -280165 106481
12812 135916 -77442 -324059 -136007 -218410 -184021 4946 -179112 -79332 -229119 30132 8734
12800 97732 93140 -27808 193717 195901 -153298 -69610 -164815 -109678 -153550 140172 -172818
12788 -94269 -62847 -8910 152860 -216306 -99633 -15743 -51592 229238 -23595 164744 -264414
12776 -100541 359381 -117840 -129830 183813 50710 516919 -80801 142865 41395 161181
12766 161181 28304 -41656 -111884 4698 114388 374082 96492 -153271 30354 -33878 151556
12754 -277790 -83087 -372751 44470 -406408 82646 178371 -172601 -212604 190639 325056
12744 325056 -51926 -1661 287379 -63280 -106152 10553 -29667 156876 -274960 9536 -242126
12732 262332 172225 302657 -148524 13728 203825 270884 -49677 113425 129128 48021 -230417
12720 -70104 -170718 32486 17670 -104019 -435324 230102 -21861 414417 99971 288274
12710 288274 379976 204689 105687 405157 171940 89209 -4279 440409 110111 317802
12700 317802 123250 260145 -129664 -67771 176522 -226284 18972 214117 48010 125292
12690 125292 -58090 169226 134179 255079 -137122 134155 68720 -156382 96781 -38971
12679 234150 249240 254400 97765 151463 65862 64487 642044 148511 40661 -224972 327024
12667 -43368 -198931 -84312 11401 95849 -8270 -74439 55552 136520 -42123 -37947 -207504 384116
12654 -149589 -97897 270695 32029 -12358 1897 178312 -192639 175707 155189 226184 -294064
12642 221328 59714 -130845 -129652 295446 -20231 -35375 176853 -362145 321749 270255 199824
12631 199824 346996 481661 -176653 340950 485543 -107672 451925 191878 -127194 136265
12620 259745 -129164 144082 -11427 214757 268504 279390 49625 87029 221474 201572 -153805
12608 -56175 102699 21881 139655 -9887 167900 -141415 108961 -122095 165058 -86705
12597 103212 -42886 -107913 140059 -26152 -38541 405461 -30947 -115500 146242 165327 94182
12586 94182 96885 108691 -15161 244796 -31670 310582 -289828 -141981 65633 -129010 -134095
12575 -134095 -256935 -6353 -189600 8166 215755 47103 -317101 -12226 -134264 -163655 -67041
12563 -44972 -21412 -35464 -458000 210090 -16427 -30959 359513 -217582 -97654 -342904 167203
12551 -206830 -238069 -78455 -423170 -7578 63469 -351204 -86623 113924 -28626 -90271 -224900
12540 -224900 75579 -98186 -2217 239729 -91696 -78301 11633 -189369 123952 130802 -123314
12528 -11208 -86470 -103570 -125770 163693 153517 119877 20284 -160066 186480 181215 100790
12517 100790 56725 66974 -222286 338709 146203 201332 477336 -205894 418350 350157
12507 350157 -204557 330838 143324 -189584 -164542 137533 17907 -62076 40175 48572 300687
12496 300687 -139206 23054 215687 -242178 -268487 -168004 94829 234172 103691 234965
12486 234965 273762 -78169 -194958 -165667 169848 -98074 344903 -76869 -18214 -11249 -42462
12475 -42462 -197991 -321430 67293 -114127 -67016 -70415 -204291 -64319 -122217 -215564 -43579
12463 -190568 37251 23266 168771 74981 111643 -91947 -206411 -295384 -153690 241191 -56955
12451 -107759 -206938 181221 201513 -69085 -252316 121093 11064 -93004 -80066 69883 130204
12440 130204 114340 323742 83989 -70193 96990 222184 33811 95915 -311944 86375 183028
12429 183028 88380 173255 37975 190207 123949 32532 -27182 -194757 -195079 62811 251524
12418 251524 -40733 189774 88656 149564 9745 -102778 -254105 -107826 146912 -52187 -34461
12407 -34461 44498 -38832 -458818 39309 -45790 -245082 -150408 86353 -325600 321500 -47925
12395 -275592 110362 -70448 -180043 76487 -109784 -369446 269634 -201089 153426 334631
12385 334631 -194239 42088 -96168 129622 -3052 -110628 -58560 -152875 -269041 114743 369084
12374 369084 -143254 193660 89465 312189 -333955 -114510 308473 172935 -195182 -185251
12364 -185251 105193 124531 -80966 227209 247916 18268 -217528 -227336 21929 -186459 -278604
12353 -278604 189830 83041 -207844 170799 336489 129430 555363 -148081 82042 -17174
12342 137018 -124466 121392 72444 365713 117176 -196957 -27324 339526 -54192 -73160
12332 -73160 -162090 5373 169927 -58606 224550 -280243 80078 202728 -315172 75955 283493
12321 283493 75402 -110791 70024 -409934 245632 178373 70161 114154 39414 -27266 467
12309 -296647 224480 -98493 -236785 138134 295095 -228794 -295770 -69438 198632 182321
12299 182321 110961 146545 51583 -5166 -204140 109149 44987 -245497 -341294 -34107 371870
12287 -138921 30290 -80506 241195 107910 -13578 -192570 -35290 367078 -103793 -203734
12277 -203734 355831 -24465 6418 203178 194110 62729 65616 -145458 83552 151279 96941
12266 96941 339464 -29904 253074 207600 -34206 347843 48897 -47639 43889 253520 -271056
12254 -272434 -67531 273480 -76492 309420 21873 182732 316795 -48538 -57965 -55272 212321
12242 92674 163439 -322933 -26966 -47231 66435 451253 133170 -58074 -68636 124275 -75386
12230 -72562 284592 -226577 -81752 70050 192351 -10275 -55532 -229135 -44683 -4952 199064
12218 155236 26537 315846 -638 191246 196422 104302 99245 -35041 164884 84202 -198453
12206 -25359 550861 336762 53216 341986 86085 69675 58205 -46800 346274 -207075 286248
12194 298822 375614 126785 289089 407609 197767 240508 58965 -150487 170435 90270
12184 90270 -20993 147181 132636 4499 257732 -291994 21589 -148057 61550 179675 347899
12173 347899 -50285 127155 114419 408015 127670 -32443 303185 84417 295436 181725
12163 181725 243158 42897 -241642 -177885 163582 79283 12485 207460 15862 -77720 -240552
12152 -240552 -400432 -90406 424060 152973 357284 -119017 75331 -156707 192878 333236
12142 333236 448580 174782 244720 -269568 -298774 238966 133174 -174217 61483 119218
12132 119218 84097 196117 -72128 -85988 254243 -22002 53697 -75039 3348 -78704 20507
12120 -181298 -26412 43083 23276 -387773 215979 317368 -104592 266828 265598 -68407 102541
12108 132205 166064 -121122 24712 11799 267864 203013 -433650 404175 13943 38099 -24622
12096 38541 52399 -14147 451110 -197656 -71136 -199169 -277913 -172935 5996 168026 83582
12084 -78076 -109208 -194386 236776 107586 129729 420260 589972 1534455 1255710 668204
12074 668204 282039 300044 -107952 130109 55633 101722 -1671 -512894 -52921 -280388 149114
12062 110926 -101360 -90751 -122578 204747 14461 213004 -132101 -14553 68066 -122694
12051 173157 -328443 -141357 557146 -20453 48765 39738 183722 -281813 54920 215360
12041 215360 72021 205148 -399057 11523 -25884 -66873 192789 -27223 -69130 -216443 -166339
12030 -166339 -39664 117539 -344472 -264608 -66660 -179987 28795 300375 -177473 -130133
12020 -130133 195773 405558 278335 -145360 25820 183887 246083 -175722 118048 -52517
12009 -166133 320650 -202272 -749184 37452 171330 -300021 82528 10234 -96566 85746
11998 50614 74834 146839 63298 -33134 50205 -375592 -191007 -280845 -154739 -12242 99396
11986 -204074 -248635 -61395 -415201 315959 222451 49747 107101 26382 -21438 -136555 -65625
11974 -406968 69983 -88921 1596 19554 143401 -38169 129897 70128 -75535 5403 92766
11963 92766 -142903 -211002 -90623 -262678 -159306 -346807 293953 -105416 7047 -36850 24664
11951 36720 -108042 -69222 74374 -120454 448161 196748 -237823 113271 -214405 49217
11940 -161151 145447 -151268 -49743 -222767 30234 26927 168331 -80278 238654 184820 -145570
11928 -163435 -15640 -117216 303346 223490 -205948 365648 103058 11710 -72912 1261 98840
11917 98840 8064 -229177 61762 92652 -68165 381488 187945 12515 181447 -9396 61529
11905 -84814 -147832 -216274 12105 -358441 -245600 -31847 207789 -316801 84279 -227132 158703
11893 -15483 -141056 -196531 -497376 -88533 21252 -23554 12502 -200185 -96707 -227723 32722
11881 -58090 62714 168441 -132933 -68964 38538 -33820 914 44514 -164224 13057 357961
11870 357961 284700 55747 250123 -240034 -12641 -3563 47502 40640 -241989 140296 -50590
11858 -54713 -187590 -206325 -101369 -24523 69117 231226 -69577 -35831 -3974 -133845 -310150
11847 -310150 -31635 -80771 -50150 52762 -58581 88724 -184178 -145897 -218875 -91301 -94058
11836 -94058 -207122 -12766 -29813 -210088 -246878 -269922 41955 -25485 -242318 -174058 21103
11824 -71869 -243441 125808 23158 -60414 277681 -177908 52507 -258676 -204265 -171277 -39572
11812 -292922 -273574 356450 -34472 199853 -226325 -62752 -263134 278401 112100 -102754
11801 56675 107988 -18485 452 -99846 -4632 -42670 193104 -238067 46957 -206302 35132 257032
11789 257032 -95248 289237 -224311 172582 -33582 225996 53276 172978 -102182 62108
11778 -35029 -145134 -217289 -124049 -125859 274867 -97560 28381 32789 -101425 -173518 187089
11766 91110 123910 -113930 -90248 -82272 86034 -229964 -216493 255998 351253 -41924 -254987
11755 -254987 -112904 3644 -4470 105663 -11787 111663 243521 -178727 55905 -229861 210486
11743 247491 -139060 -44675 -18309 -143679 2633 297466 -236159 -75337 210367 -351279
11732 144712 242521 -97279 -324553 53963 -59143 -60928 147074 231873 -188630 51903 195737
11721 195737 109381 134662 -250067 81236 451876 112306 57084 -58801 162631 240082 -85064
11709 -339226 328912 281394 216356 258643 392591 -65031 177190 300470 24360 139701
11699 139701 78262 161454 -213952 1664 -98046 -22288 69193 -165387 151007 329097 178922
11688 178922 194809 266515 300046 398211 11661 -117574 129486 485294 -76169 222765 23578
11676 49559 13840 -103644 337755 48842 1802 203740 9959 10477 190076 -520329 -14068
11664 246060 -146448 -69107 -31375 181733 65160 -100547 -116521 330243 236554 -204081
11653 224717 316581 -88623 79594 294203 -53350 17855 -50395 103446 -121543 -33344 -139325
11642 -139325 -252267 110804 267041 -70951 -122928 115631 23181 252025 -62491 53906
11631 72000 -102379 6236 -126048 199583 -83095 -214103 99770 75598 -15166 37544 107365
11620 107365 -125776 97904 19130 -234358 399662 -210406 -252628 -261639 9032 118847 202001
11609 202001 314765 -310505 242555 186082 -8304 -130466 141718 -146294 17090 41251
11599 41251 -40775 -34602 -107380 188947 164849 356283 -358775 226098 -191327 52954 115425
11588 115425 -280152 -18933 137239 144948 14501 -90159 392309 337286 241968 88597 -42910
11576 -230840 50891 -6664 291071 11629 276627 107950 -223612 12622 -130004 119638
11565 -216427 12301 136054 308751 246834 -55793 273864 348239 -55728 171932 -43591 74833
11553 433189 412503 228709 16367 239565 305900 6693 90741 104316 6812 270174 -111290
11541 40395 20764 329177 -45152 227826 -116592 -12981 -67378 36924 -60250 -78112 183432
11529 -29089 88369 372041 242617 -234893 213748 131487 -79119 43656 -21312 60476 -225986
11517 -89623 28721 26514 202247 92133 49674 78435 176419 182792 146352 229369 251398 124841
11504 234121 135232 65299 315514 301085 -208555 -173372 40678 323265 5051 680 88599
11493 88599 43962 68653 217073 171875 -23466 375825 205812 115838 -127294 163419 346793
11482 346793 158025 53646 49618 -107600 224171 138402 167974 140323 313766 353399 273488
11471 273488 58616 225375 -160635 95102 70912 122051 82121 -113627 -53285 -1787 -240302
11460 -240302 -191551 -272481 155424 -141580 243518 32141 62780 2192 84990 65350 -34898
11448 -83348 13598 -50474 -236584 222978 -158960 245950 369861 -35385 -511958 -144777
11437 135071 45622 4970 305417 124121 -237717 -92630 187328 38222 52818 115148 28185
11425 -151458 -200754 -28538 243088 277303 66098 -24093 152237 128603 -229144 -132021 -109133
11414 -109133 -128504 104216 109423 -142484 -57800 -116594 225101 236315 -63754 -131682 259897
11402 332204 153726 -20555 -25875 -246526 -94879 96422 214197 -289470 145053 -123305
11391 238621 -12126 28766 186650 -108767 -127072 71609 2202 265678 87908 138911 -90555
11379 -206345 126556 -250950 365993 330483 -45697 46395 -270389 129996 -192946 -76996
11368 -102402 -78551 -101405 170501 -42068 -152490 69993 122916 -43394 22045 -81618 29090
11356 -100248 239663 -84426 -209035 -7520 93823 -194358 129286 87937 63942 -42065 408349
11344 -202826 -127437 -258101 293281 319781 4606 -124117 -14212 -83547 -345408 66508 -361203
11332 88379 -139149 -153430 92606 -269089 -261517 -65304 274279 -12971 -28672 -212502 -153319
11321 -153319 -289744 -257560 -217650 143433 4822 -244819 -62188 -113578 384407 -19387 236655
11309 -156682 139110 339744 -182480 -101545 -21861 -338838 214645 -55068 59072 122000
11299 122000 -156521 -188120 -96862 -127078 -178091 37011 -68998 -40757 150465 24428 169072
11288 169072 -135201 30156 131293 134172 -433 192864 111553 -105797 -123972 52882 422078
11277 422078 20439 111381 -171868 127750 121105 17476 -23642 -37625 -90078 2228 256053
11266 256053 47180 -230715 -239290 1665 -256260 -4254 -174503 -107944 -30644 -141460 -188208
11255 -188208 -34883 -27347 -145107 -395574 251608 -253514 -96728 -39828 -148762 -232550 -160655
11244 -160655 -37328 -266159 23852 -152131 260686 -9931 59336 -61800 -178298 135914 58871
11232 102439 412310 199002 -20633 -59509 -188574 70991 -197127 -83389 165015 -318236
11221 97191 -398916 -18886 -324246 17426 -7243 44532 28786 -240901 -311084 -351174 299759
11209 -225910 -63823 101973 -176425 -122022 -77238 -486633 -117795 -400799 135039 -120981
11198 -272192 33063 -217703 97130 41555 -221142 -10302 -218422 -176950 -228824 -45672 -37780
11187 -37780 251817 -8818 -65715 68959 242903 -17880 -144311 33543 -140785 -19838 -158377
11176 -158377 201825 -381353 -213921 376595 -112344 173466 -74157 259259 -26835 -172225
11166 -172225 -91031 19492 -9702 29963 208523 -122909 -270088 90570 165666 -128184 14456
11154 -226441 -82101 -278425 135531 -222832 -59452 -223596 22927 76563 -294846 -452726
11144 -452726 -248812 -52999 212478 -266405 125063 250998 350022 -1117 486631 -90934
11133 -71663 210221 19480 75563 -147059 44760 293907 -68718 87667 -74450 -154532 -15311
11121 153227 -116481 -290547 19925 19534 -101222 289097 12215 56493 62891 73276 133871
11110 133871 -424150 -96650 -11892 -7813 466060 -14611 -3195 240347 277009 -130314 229286
11098 388210 -47319 287986 69947 -19633 106639 231047 144383 281379 191129 117842 -16606
11086 24284 285989 210029 349450 43840 179780 238555 370622 368377 381382 202864 232990
11075 232990 159156 265558 191829 53274 582730 -135586 -2769 566350 482238 140229 580245
11064 580245 402573 134237 373927 170033 630763 355796 605871 514600 575210 788263
11054 788263 792028 624885 398311 151307 511229 557767 894677 988546 431587 785616
11044 785616 820776 527642 788837 573166 359275 564735 495595 602370 530605 685920
11034 685920 734272 678164 700707 439660 408426 437689 550404 605816 411231 693771 817235
11023 817235 884736 1051709 566758 461592 445486 462610 959658 622910 557170 382192
11013 382192 734139 411515 434917 938208 491056 555114 116175 438827 603338 702332
11003 702332 650689 197904 499931 511623 939172 781148 840816 565620 759756 437102
10993 437102 436415 852479 623471 752899 550691 766098 644697 755477 701694 867252
10983 867252 871401 840903 1379604 1169731 1356196 1345471 1200927 1516215 1618513 2360101
10973 2360101 2233785 2314157 2523660 2577257 2397415 2070390 2124195 1783955 1780195 1548046
10963 1548046 1431045 1640951 1355507 1741195 1798345 1814644 1654433 1638430 1705726 1808993
10953 1808993 1532211 1250157 1543174 994814 574664 887087 527720 550628 421078 583001
10943 583001 492432 372371 195487 173329 356679 320604 -24265 164883 69776 31594 -167217
10931 -52798 270675 240156 365854 235987 -172885 232306 237199 205992 -54447 84336 -159638
10919 -112826 -198412 -187095 -95625 -204635 286391 57710 353304 -24017 51360 -19883 -196044
10908 -196044 141161 57545 12677 -84056 57508 173523 131923 51284 -36891 -259859 -118676
10896 26594 901 51777 -20636 -458548 150218 -65540 37837 50524 -132161 -205420 207375
10884 -154499 159237 -141073 127976 127781 197039 108987 132017 -37211 -88882 82166 -331618
10872 -234375 17299 -65455 -96241 -4444 -295068 -215612 -71461 -206380 -13839 -312476 -55815
10860 -83306 -225051 -86576 263536 171110 -208286 120221 5507 247638 63386 334874 173252
10849 173252 -368015 -155095 -279247 -254641 252501 14388 -311244 109635 137206 -116796
10838 -69907 -121169 5436 -87954 206372 275724 94895 -207200 181241 132961 -75326 237431
10826 -84948 64413 22185 66377 -111751 88999 89318 158991 90583 335991 -248983 -185798
10815 -185798 -125956 -233802 243947 127324 -82080 -124047 -102062 -36318 -97147 -4282 -152342
10804 -152342 54874 129440 -134905 135600 70143 85804 -197663 -249789 74509 -206484 -231511
10793 -231511 -195590 -66362 149124 -139233 117027 1514 -94453 -75363 208631 -118902 102966
10781 8438 36789 -60122 -219668 -374324 168733 294142 -84783 -23425 -304146 -96130 125754
10769 17401 -25531 26092 -92056 -18116 253130 -90806 -136690 -69712 51898 276972 -318023
10757 84311 206882 3248 -24528 -82067 209149 -48747 -155045 -22278 178137 -167525 -171221
10746 -171221 231521 -363511 -168613 -30997 41723 -176819 -335410 -7826 -93182 -157536 -197205
10735 -197205 -54027 133879 87293 -42635 -215724 205129 -110722 124775 14202 38475
10725 38475 155926 -364366 -590525 -62553 -274692 183592 -72225 203717 -106393 -229314
10715 -229314 81146 166935 50118 -180507 303420 324574 2866 -242637 -271055 -97916 -236691
10704 -236691 7668 -95264 -129047 -151108 110615 248399 -32487 -54781 23000 212812 -252870
10692 -114314 -181103 -497873 -234767 -104734 -8978 -67823 -103715 -524028 -218944 31767 -76443
10680 -196692 16959 20439 56305 -291512 14584 -1346 44341 26815 -14982 103238 -307580
10668 82388 20105 -110749 2682 38122 54633 -369470 -217655 -238741 316599 140010 238891
10657 238891 -161338 -137438 -96531 -197270 -88093 -205534 -49262 -46460 44621 148668 137023
10646 137023 -147310 306819 133634 -110153 -394055 34188 27507 -139803 -234896 119379
10635 -147272 -206603 -175981 -97859 -94179 157672 276843 -158220 -140971 84368 63525 -266185
10623 167295 63818 -174469 11209 280141 148042 20809 -15680 120042 -102103 179936
10612 235613 -50993 -181171 -230218 -56350 -235665 -132274 46922 -300974 -99949 -6948 -48211
10601 -48211 -35890 39345 -41477 144487 -183361 126317 -42517 89737 349933 -17588 16221
10589 -105199 -114453 85743 56417 -14467 68434 -151967 -273421 29479 -113467 55507 -44239
10577 -130576 -20795 -30966 -119838 26644 -39867 66662 149897 291878 -300071 -101586 190410
10565 128396 -11650 83856 -211174 -100653 -165257 30520 54908 227964 -209350 -140793 -89085
10554 -89085 -237521 -31000 245323 117583 -294402 3089 -1407 76299 -495754 -15486 22551
10542 -104314 78047 -231470 90190 -17785 247710 142089 -56090 -91486 -331191 138045
10531 21458 -424279 205386 -179065 -136238 6600 -8403 -84557 -131962 130734 -240405 39509
10519 121171 354315 -81092 8742 -478837 -399669 -230562 46560 -113368 -98773 -55418 -68451
10508 -68451 26977 61175 20453 -5564 -159488 -163612 32822 -8730 -104546 -108794 278762 -305776
10495 -84905 -156878 127295 -46557 -134248 -103204 51704 41508 25255 -28289 -51895 261901
10483 182142 226987 343121 296547 584420 405116 338581 192972 78673 -95603 -97342 234782
10471 392223 -102340 272148 105163 -206441 185821 -120211 -83316 -413740 -32704 6391
10460 137041 233705 -102739 175211 -233070 86011 -72588 219733 -93692 -303280 -89050
10449 -5576 -251542 -215031 -107365 180649 79015 151210 -162734 19816 -212693 14024 -195128
10437 -105949 -19567 -314082 438762 144235 293594 283535 -239462 -2452 233637 -185806
10426 43813 173918 -86222 49898 -186680 119860 -294161 98595 197024 -35563 -9575 -249684
10415 -249684 59607 240349 -190394 -26655 212347 -478566 9847 -110015 -284798 -26153
10404 -104488 95734 9833 65725 -12736 -45342 154704 201969 251340 -140847 225083 -120052
10392 267179 172175 -18846 -22060 -174168 -160117 91845 -165116 7238 273957 49124 184250
10381 184250 51636 -23002 221488 -336443 232335 6656 381597 269332 495181 4735 27216
10370 27216 339341 408981 393541 286311 305709 600685 242200 146086 83679 146148 308987
10359 308987 -134280 4872 422113 -17592 115933 193855 111480 69566 507174 537015 148015
10347 417538 312016 144526 236279 418572 443771 295056 251877 68984 265048 227549
10337 227549 304508 297540 377576 -79779 212666 -25054 458254 -55403 290385 32241 65599
10326 65599 63939 421209 320554 -12012 4122 270173 -106648 213756 108204 334509 462676
10315 462676 272045 -50387 328661 184138 17468 71550 182877 -50011 157876 105194
10305 105194 355434 -28434 -75717 -110143 129310 -119136 -38438 -286540 -113496 -102398
10295 -102398 -165643 -109834 -181944 -52769 -36024 156255 235136 -158765 -7946 -94449 -69899
10284 -69899 166121 119115 30402 -261681 -223056 170885 -164851 -1313 -242840 -381047 -123356
10272 -188306 -68803 -397479 20786 51108 56064 -314338 -117947 219903 -66897 27110 149013
10261 149013 -74877 433581 320594 232172 305308 245167 232206 172755 180919 66015 -123003
10249 -116884 180636 108252 -304626 5376 227414 121796 36964 -2099 107762 -174882 43380
10237 85954 5343 -37861 -58974 111608 -94302 -349852 154685 -209126 -92598 -133142 301928
10225 -389158 1753 -109716 106105 -332767 -319707 -174463 -332849 -140705 162880 -139997
10214 47839 71134 -10777 -330875 -36547 17101 296702 -317265 -92381 115362 -426307 131930
10202 -151996 -100802 -263757 -136643 302763 209353 330390 -291228 -27139 89554 82142 62220
10191 62220 -116878 -320252 214037 -9541 60537 -1925 -70370 -276975 159681 91087 210273
10180 210273 -243350 -136411 -414670 61163 -137494 -59352 -96331 66780 -118929 -43642
10169 5718 -76740 -77764 -229120 303304 -22415 -149802 -187776 -114834 -118528 -76945 -212047
10158 -212047 -218779 -301743 -18733 -148682 -60189 -431975 -305577 -118921 -34257 -266934 -136628
10147 -136628 -194887 -235211 11836 -163319 79573 4830 41823 -105937 -120314 167421 -130330
10135 49139 -342486 -512931 -622095 238165 35975 -222310 -236837 165729 -122548 -254149
10125 -254149 -128707 -526681 -265217 -321124 -99800 -301571 -282888 109003 -84201 -168014
10115 -168014 54471 22549 17367 -50518 -302210 240760 -41493 42377 -304005 50976 -80335
10103 -33087 -75336 112834 -70791 68973 -153680 -299517 -312003 -5788 3969 -144564 111732
10091 107748 15914 -105485 -76888 217734 -186814 144278 -153558 85055 3389 68160 -211448
10079 -363641 148446 173918 -30380 -229250 -238345 347047 366892 344642 247745 -198282 28082
10067 -67537 180324 -166980 -128416 -115316 -15959 340793 55102 -11165 70106 106781 193828
10056 193828 -13477 63546 -121768 36753 -5215 -40082 -74919 352500 -203841 330127 -63427
10044 -81073 -348222 -26275 -151078 89410 -55513 -17059 119588 -285298 8792 184071 19006
10032 -389404 73438 -37083 -2513 -38874 -333373 -70821 8234 11599 -200954 71863 -217721
10020 -157340 -126524 -347677 -265138 -192378 -14036 -206028 267495 -77186 -78000 82292 164291
10009 164291 -18796 -320927 -313762 -404703 -77366 -197532 79979 -360278 -244716 -191529 -312872
9998 -312872 -54497 481688 -161540 -160650 -260698 34421 -205360 -186074 -85798 -167091 -88296
9987 -88296 13149 -53709 20164 44662 706 -124187 -332608 25097 -82772 -214590 -257402 25880
9974 -46401 -61005 -252658 -72808 130238 190660 -83113 190809 144797 19365 -21480 -283477
9963 -283477 83385 -92220 94710 198030 23644 70633 -329535 -393129 -106003 -331016 -163657
9951 -89954 -187931 -185884 -329180 220535 -104463 -434 70414 -375501 -386017 459904 -323092
9939 -6568 140796 -136848 45639 -62912 -240183 -75940 32549 -223915 -121686 -95025 -61026
9928 -61026 -307092 -274737 104571 402512 -170261 138766 -210120 20845 149423 150042 -32962
9916 -90072 90158 -332208 34889 -19520 -57400 -240852 279780 -22735 -174600 -173222 -125127
9905 -125127 -139665 116772 76556 24781 -128446 -411881 -273340 -200156 -159270 -282782 174438
9893 135121 -108980 -4736 135165 113263 141922 -299901 224386 105028 -72338 -148025 95931
9881 -112552 151230 -56789 -87609 -32208 256157 -21549 1379 -388151 -154513 165322 388167
9870 388167 -183909 -155700 -158770 147036 -213441 -67893 -316186 53467 206686 55445 -130579
9858 -116871 -119802 2086 116545 -283106 127536 127676 -17048 -80977 187815 -7327 118316 -96227
9845 189232 110262 -85445 -7597 -184197 118998 -252897 34722 65677 63783 -239625 -207335
9834 -207335 -92868 -178369 -6848 52427 137770 -75990 -114776 106881 -200650 166624 171486
9823 171486 -131167 97884 58109 -289667 11517 -217181 33564 -81529 -35710 -68774 99197
9811 -174349 -106281 142386 -383985 98980 -336632 132015 -15285 -127017 -71958 235586
9800 -189325 -38801 -30245 -147941 -131266 44309 -292187 -426942 -239161 -169080 259686 22511
9788 -47398 -27345 -187518 345766 88277 -119562 -184792 -225086 27082 218542 -133160 74842
9776 -350819 -219677 23361 -290686 60329 32653 -403100 120490 -68446 121104 -301544
9765 -135306 -271951 -202046 -57223 -188170 -426352 -253564 -276559 -194124 161680 -369349
9754 -94649 -427994 137601 188849 -591295 -264815 -331236 47781 -87317 -97447 -53337 -145098
9743 -145098 50786 -296875 -182735 -275102 20715 152606 -159388 -73222 -121378 70065 -163454
9731 261369 83663 -121340 -138970 -211535 16408 -104215 224833 30537 -41002 -5395 -591313
9720 -591313 -65889 207209 -218296 -31444 -394074 -406150 -191 -92728 -71801 -167042 -336812
9709 -336812 158336 -121732 -31028 -386783 -97930 -45888 31183 134980 -128068 -192895 -341459
9698 -341459 106495 212293 207795 149416 -194599 386756 168487 -116151 51904 -143775
9687 -114680 237727 -175517 50607 -229772 120843 55317 -10508 96773 -288018 -84325 -220959
9676 -220959 22536 144887 19386 -194512 101226 213154 -287686 -213807 302701 -199681
9665 203380 303361 -130631 137058 54843 -136049 -200317 151228 -114081 -80979 -335110
9655 -335110 73790 -267839 -113307 -13443 -195051 -170366 -164712 30236 -266926 13717 -48948
9643 -211635 -100271 -58120 -224782 -225205 6032 -68473 -394129 -14841 22982 -109861 -293244
9632 -293244 -93825 70143 -97471 -352672 -139769 5379 245124 -103748 -165737 37868 -86670
9620 -127257 159510 -374046 -193079 -132226 -215778 -104071 73818 163621 -467398 -261665
9610 -261665 193119 79625 -106906 -202054 119818 -249196 -299107 -55227 6343 182529 -82754
9598 -135308 224337 -125792 -75834 45892 -112402 -223218 -216186 65617 -133697 -222267 -472386
9587 -472386 -126521 -73292 -242949 82009 -230692 -235361 104722 -117380 122195 -278155
9576 -305305 -83983 -35755 -21914 2227 246777 -193583 -263269 77752 264192 -324248 232123
9564 -148032 153373 -223395 -38946 -165241 -274575 4302 342453 -138105 87690 264891
9554 264891 -275350 -123584 -72119 -126717 18068 -497871 -43727 14484 54339 18017 -121128
9542 -40205 3571 288631 -85086 126005 110015 -209764 -60632 -129240 -209492 30236 35580 44250
9530 44250 31012 37440 -71024 -116425 -153168 120533 -189155 99027 93174 -540995 -101840
9518 -39383 -579264 -269159 -127307 -194566 38874 -64734 139773 128467 -198189 -227719 -259337
9507 -259337 -34021 89882 38623 -89477 -76245 -29373 186087 4785 105532 194625 -487159
9495 -215591 92522 101201 -22444 -275828 -38467 221117 76082 -58920 -5062 -330572 56827
9483 -29259 -50048 -217768 -487778 -300869 -354166 79039 115454 -218821 -120084 76757 -56115
9471 -95350 -294407 57825 -24526 137688 -160064 -55562 -63229 -146185 255131 -244329 -124410
9460 -124410 -19045 -70388 -305812 -51856 127282 -75029 -38686 -259774 42721 121632 -227922
9448 -171615 -74781 -185485 -265483 62451 191877 110586 -313467 108861 69008 -50044 189252
9436 58844 -307064 -289861 -281753 -131779 92887 -47855 140731 -220861 270351 100814 -292729
9424 -103501 -148730 54835 -92696 -1807 60280 -271712 265989 -101510 44237 -168934 42909
9412 114875 85266 80816 119039 -165675 -87879 33114 -137660 162051 -172588 46922 -20703
9400 109662 139870 -144660 -71598 -106944 -303355 -44732 10395 58121 177910 132555 -68094
9388 -38540 -253448 -122887 -92235 45494 -45110 -321399 45060 38972 80867 26466 143358
9377 143358 168563 7152 -233535 151046 -64458 -51915 -22432 -108422 -6783 154921 16210
9365 -224256 109260 -68369 -39951 -138122 -62407 -240632 238027 111676 102239 -331008 -144037
9353 -151202 -76770 -222372 -36448 94101 -165960 -363110 -264738 -26452 125044 -99386 -40372
9341 -84939 34985 -99115 172754 -49430 141942 -286222 106530 -38722 -118492 -112303 -99342
9330 -99342 14908 59674 313538 -5843 -73490 -32628 -4285 -12492 -270084 156086 -16292 -186955
9318 -186955 52636 -121485 128392 -243731 -285546 40322 -198896 -90336 -495655 209190
9307 -29889 128218 -146238 -46966 266568 51759 -44085 227345 -426716 224470 -29939 -37018
9296 -37018 -39343 329185 -179216 -190000 -443365 129688 -116367 -64006 27001 38552 -193109
9284 -151370 -159338 222653 179175 -91706 -56310 -176111 -16092 -57261 376977 -225515 308179
9272 -44172 -183408 -342443 102087 -315695 200999 -7000 -175894 -392085 82414 -226589
9261 353438 -146694 -49328 52288 -205308 -354595 1556 -147357 -200020 314573 50489 -77115
9249 -32495 -152235 -49071 178949 -264348 -173218 14041 -96648 -90546 212589 88759 -2490
9237 -324992 -150552 -137258 -44920 -242835 -68771 -163362 48001 -111132 -330178 -65028 147346
9225 -44644 -6625 289299 117931 -204844 -134679 -298729 10263 -40617 3681 -112649 91599
9213 24962 -11449 272587 -214340 -114817 112902 -145304 -194047 -148627 -169109 52802 -218696
9201 -189310 240683 187929 75048 219093 -134319 -192710 -5328 -10861 -153706 -230690 -86511
9189 -77530 214237 73091 10274 31 -389541 4088 -172160 -90446 -251775 -96010 255945 -294997
9176 -212559 -90619 -139892 180684 -496575 -35253 114787 155608 -287224 -36768 -212679 54922
9164 -194268 -34529 -27234 -231683 119783 -81313 627 -69364 142784 -134211 8565 -169145
9152 -139822 4994 -193 -85196 -134520 -132405 239538 -89560 -96591 -289374 -62982 -144938 -354972
9140 -354972 220056 -94101 -53981 -2039 -151893 285258 -170719 74762 -147523 -112014 -27775
9128 -134107 -4906 47824 -74069 -160098 20801 -28479 -182986 -112493 -196550 -71578 100936
9116 16759 -80253 7802 287988 -307818 -119964 -162643 49818 188792 35816 3468 37844
9105 37844 -144249 162166 93706 -265446 -29066 -243416 -380845 76261 -89382 -178610 11934
9093 -142133 -14573 -119559 218418 -42228 -428496 -84875 -334522 -126752 -264538 -576234
9083 -576234 -138291 -346604 -181681 -127311 -2605 13105 -140990 -376345 -104858 175046
9072 -347160 -66850 32136 88141 -76538 165900 -167551 -88346 -176097 33878 16431 -386274
9060 265390 315936 -90657 5991 88214 -181547 -152936 -120196 -209607 589396 -203799 -379533
9049 -379533 -24084 141313 -187830 -149296 -81081 -281097 -172574 -323454 -80638 74072 -75397
9037 198811 -472972 -1888 127996 -269135 207091 -126810 -35400 77511 -182722 -79605 35050
9025 -69375 -423508 -135195 -89216 68173 -227825 -128939 85535 -279593 -129985 39202 199153
9014 199153 111787 -27651 -265558 210221 61746 14619 -309411 35010 20064 -65085 -51060
9003 -51060 -199727 -307693 76053 23849 101778 101855 95938 -142669 -19730 -142975 50417 118743
8991 118743 -155909 83757 3574 26610 -191539 -38416 43934 -189285 -78780 -307452 -11615
8979 -63625 -105608 -147675 -210979 105022 -42087 183476 -131641 -275301 -46595 -259113 -229230
8968 -229230 165323 -113404 -108668 -90733 -185402 -7937 79331 -156372 7986 -138465 265686
8956 -214948 -69455 -95196 -23353 -425783 -123084 -88676 -132390 28000 47817 -447553 78783
8944 299199 687 -16785 67824 26797 -253857 22956 -4612 74862 48818 63173 401414 223336
8932 223336 317282 146328 88110 -18378 55010 -24501 -9621 340658 525528 1439635 5296281
8921 5296281 6957656 2221169 1133047 429166 -52220 -62848 -125649 -78187 52922 -110931
8910 -138297 79006 165261 -1637 -30294 -155249 64690 111316 -389432 154529 139594 -119644
8898 292825 -179081 -2232 -413226 -154228 63599 299144 133993 111743 -163633 -116435 162273
8886 -354994 10660 73439 301715 -94167 -172213 -40556 -142554 -73343 244971 66765 -176728
8874 154412 -104138 167528 -314356 -124490 -440458 -15882 240276 216610 126480 127304 157950
8863 157950 34301 -159072 69561 -192642 -96971 173346 52646 -128888 -172211 146210 260326
8852 260326 -278373 -133846 -91307 26825 295790 27655 24986 -273415 264690 -181273 -27732
8840 33954 137837 122198 7075 47443 -212677 -150312 32236 -184668 -364924 -500487 -483325
8829 -483325 36490 -51250 -333684 266903 -225906 -292293 -151174 -158584 -208441 189225 -96396
8817 -209150 -361375 -186707 122020 -41774 -208352 30496 -81950 132696 -164662 64499
8806 -275311 2701 63915 18424 217221 -79613 -193338 90303 31436 -171696 -50745 -213934
8795 -213934 -11085 -234207 431718 224278 55826 -364186 194737 -88440 -226919 -104914
8784 -67477 -109957 -140066 61470 -7891 140894 -69800 -76510 -246585 243815 41895 -269479
8772 -128138 25947 18752 -122591 -123962 -56750 66487 -112090 45702 132776 -127878 -19282
8760 -495727 93352 -181019 -204973 132934 -103055 -6551 -24197 -12454 -107514 -217651 424065
8748 -236391 -109278 -165219 386 -39270 -17826 -331778 -92744 -258691 -239091 169519 189757
8737 189757 -144569 -157775 -307239 155011 -56592 -119214 -154251 137593 97949 366629 396582
8726 396582 258915 -493021 60892 227715 -285328 -37989 -111459 -309577 3746 61465 114299
8715 114299 109849 -301547 -96726 -555030 -211274 84680 298654 66906 139266 421554 -304251
8703 86922 -71971 44554 -140323 10791 81672 -319515 -159941 42938 250470 -7555 79884
8691 -299979 121594 -99309 -33784 320919 394685 367159 218873 -195459 -145087 81836 165045
8680 165045 -82504 42218 222999 -19286 -219756 197894 -76976 -436429 -456359 -38944 -58362
8669 -58362 -193670 187107 -91629 171028 -121279 50449 120514 -135026 -198536 31427 81123
8658 81123 -175890 -119399 -102371 324531 -4006 -224231 -64374 -100189 -152471 -93713 -219488
8647 -219488 308651 73728 -16656 -11140 137604 118138 -172993 -136772 145992 -53708 -127861
8636 -127861 -256418 141786 -320354 -297842 -33339 -112338 111537 57736 -60217 -267574 -267745
8625 -267745 -124887 -139717 72375 -158880 41068 -255203 -304795 -128811 -61893 363437 100104
8613 -91203 78857 43550 -294022 255835 -129951 10206 -286982 164735 296988 -259477
8602 -333996 45455 31863 142438 -78528 -54924 529 -318453 -277461 -106275 -111152 65802 135599
8590 135599 11630 -567250 100633 48904 259474 -342750 171894 134295 13699 -68353 28409
8578 126802 -238081 66804 -69264 -190139 -41075 -120632 72423 36461 -211436 -2754 -151341
8567 -151341 -62049 -320678 9933 425504 -271412 400153 -220029 -107073 -71961 51015 -905
8555 -84060 31010 -128872 73815 -132818 -160001 65912 135293 -87939 17071 -37416 25338
8543 244847 -930 83472 -14136 -25416 -41728 32972 -190681 67841 -265002 -372529 -20176
8531 105470 -252159 143055 -127353 -275042 259340 -208926 254087 141073 -158630 -226867
8521 -226867 83921 100940 -125270 13496 -55728 13969 297651 155154 -330847 -191590 102645
8509 -48845 -279487 207676 19310 -198944 -245024 -176937 78130 -227258 118733 -182141 328582
8497 162952 -209307 111654 -30576 102407 166413 -155687 162924 -109386 484746 -353880
8486 -81493 -7992 129464 170769 98253 140899 -215590 175204 -85727 185400 226697 -14229
8474 269276 236940 -105759 -41277 7204 -103466 -103533 -135128 64441 -75918 -2242 237930 -51032
8461 -62368 -146061 -399856 -212455 8930 -110641 -65398 380610 -193370 -125694 -197507 -59299
8449 71880 -59373 -110628 -502680 -256805 -228873 -74188 -133966 7329 -69244 20766 254589
8438 254589 -258633 -205664 -364799 199315 95358 -168169 -129638 298663 -259711 -215898
8428 -215898 -129315 -138952 -116947 -81999 130624 134505 -65499 64350 -33552 -89630 18821 151100
8416 151100 -122482 -95564 -128124 41984 53605 -22003 173286 -38416 -192805 -158830 -137412
8405 -137412 -32105 58944 -108824 61152 -154855 -27395 -328268 -164293 28873 -98086 -37325
8393 -108235 -6948 66342 -31517 -362914 -189745 19433 -132946 180048 -292095 35498 -356313
8381 335451 -230675 503848 80685 -136861 236565 -376107 -49116 325378 -146951 -248664
8371 -248664 -346240 102106 -279806 -218741 -134598 60070 -30974 423501 -396869 160718 -164914
8359 123036 186265 60699 -114297 -478748 -48053 -96596 181748 -256947 -148691 -5290 -21027
8348 -21027 24963 137265 154979 174049 358706 -162790 134086 -413954 127989 55985 39900
8337 39900 -148398 98733 -78711 114420 -184748 -22104 -106394 -77273 74153 -317649 -572848
8326 -572848 -492507 -103639 174711 143454 171921 127042 229854 233515 -64849 -6917 144663
8314 -369513 32915 110362 -155178 -75118 202924 124277 25761 -174111 -76706 -56867 -48683
8303 -48683 119349 -28812 -47608 169803 140858 -40681 18938 -156929 -32614 12223 -120871
8291 -83531 -154975 -140931 215214 134145 -249384 -119798 -337693 179002 109002 -202285 244778
8279 -281980 -139699 -145737 184780 -174848 100439 -3151 -38541 -51487 2600 149864 276028
8268 276028 -111793 -31758 -118035 -104050 -110421 -86405 -404887 49704 -193244 441652 -148486
8256 -72630 -195477 -139303 142250 76462 6430 -159458 45254 318176 -170692 -198591 -324346
8245 -324346 157567 22202 76970 -271949 126872 144727 -16582 196435 90122 -128848 200774
8233 199378 -237217 -269228 -344692 -118563 67664 -51445 -85176 -233457 114590 -150700 98384
8221 -197813 -37316 99155 -133035 34659 131184 -74846 -14432 3490 -146485 18282 -15032
8209 185089 -122359 122857 59170 -64736 -25446 -116674 329305 -244177 -150058 -113735 187554
8197 -153776 -209720 116989 46589 -148497 -73719 -130269 -159555 -158807 -163699 24002 129349 -37362
8184 -160260 13223 -88357 278132 186462 35106 50191 -74569 -143913 -129829 -183339 -8548 -85932
8172 -85932 -96015 -544735 203010 263076 -86154 -306956 133190 173945 -39193 -206036 273680
8160 79156 -135462 326406 98957 -45005 -109256 -3026 -5600 -243769 -105114 -214511 90675
8148 -16960 35864 92420 -64536 -234333 -135385 224126 -155627 -16837 67985 140163 -222356
8136 -403260 -189427 -375584 13276 -224930 66068 -241809 -259369 132743 65173 -295020
8125 -28531 -244288 231614 180019 36826 55785 -138797 -419622 -472421 225898 8065 83700
8114 83700 124242 122969 -120078 -436597 -77677 85532 -179543 -125561 96816 67654 -192569
8102 -195104 -15287 69819 -186969 -69192 -91416 24999 5307 43692 -172380 23370 -77379
8090 -80617 -222854 -38245 -271748 304649 255111 5402 -53004 -189887 30564 -129793 -41996
8078 156136 -24459 -265223 -131363 27412 -258998 -209151 18460 -132514 339289 -58633 -116276
8067 -116276 -17694 -109826 -74655 164410 -104462 17824 -261709 61657 -277503 85525 -18655
8055 143456 -161849 53175 -147598 -32169 163346 69046 7252 -328450 197720 56444 109364
8044 109364 13527 129381 -7623 58533 -68270 -3690 -52372 108308 -151041 156078 94704
8033 94704 -84341 -43858 13540 -291152 -221565 -29884 -19916 -90586 -194903 -210528 14213 -170070
8020 -154084 -172197 -313555 48927 -164220 -84032 -69569 56508 -162290 -37734 172281 -9681
8008 -15997 147478 -169315 12780 -258301 66242 -233573 -42767 -366929 -93663 -102884 -150005
7997 -150005 216327 -168646 -59829 1131 194812 74096 252064 -306573 -299697 61752 203955
7986 203955 -33530 110013 -243507 -171542 59861 77880 211206 -43546 -35133 207102 -41108
7974 -91020 -142587 114357 16726 32286 -24082 352640 -371830 -59728 -96892 -126693 110358
7962 -45930 -158225 -116313 -77889 -110890 24976 116821 -4163 190736 102726 -181094 -111113
7951 -111113 -284563 -59222 348336 113528 131605 -253712 -260993 -43828 81079 35233 -181148
7939 -705 149911 -207587 -36069 -163360 18613 -174170 149811 -211870 -108188 237095 228320
7928 228320 -384242 -65494 307394 26744 163341 48231 -333626 -165632 37937 206680
7918 206680 -81464 188478 123827 227022 133769 -347918 407510 -255389 -169798 -254651 91557
7906 -154679 -96274 -51004 107811 -276135 -209697 -95874 80166 57428 -63349 -254388 -51277
7894 -70388 -159779 -342774 -140017 126160 -284418 93446 -56359 97729 6523 -7418 -218935
7883 -218935 -249267 -83972 -71305 65483 -159334 107896 -52377 79492 -256556 -206854 -485559
7872 -485559 -119810 -36375 -185250 148987 105320 208826 -1861 230034 -275729 -86146 -195401
7861 -195401 30022 220115 -120987 38252 81821 41234 300881 -166930 159718 -202955
7850 -85301 -370007 181997 -80514 -133878 -423780 -204584 3806 60041 -223535 -80919 128770
7838 -299070 -201702 168322 91367 163536 116095 -177532 -206288 -67867 278121 -232679 -92802
7826 -295193 57862 -64694 168443 -87824 -101846 33980 273169 -229558 -80817 -279288 84179
7814 289071 88997 -155978 -24016 226838 235431 43136 219346 -307631 63094 88988 -239586
7802 -105233 14214 19415 126733 -109885 -194417 -101267 -11488 -149026 -60625 -236091 94995
7790 168139 -40678 400684 82979 178918 88199 135759 -263937 206198 10342 -186809 222979
7778 -428399 -162664 278426 -289952 -146182 82396 22523 4406 32556 -186602 -145583 -8617
7766 522640 123983 91369 -230791 -5527 85287 124320 -48072 -109793 58270 117481 135713
7755 135713 312603 -320880 -28176 -220656 -209500 -166274 51323 -66848 -129030 -251229 -163101
7744 -163101 261866 126459 -144550 -80241 15602 -185751 -258244 -263923 154586 -161767 47949
7732 56783 103749 -70499 -149468 -17506 12070 31452 -135143 192523 95215 16647 -67179
7720 -13200 181874 -2285 45355 244641 -23441 -70234 21290 -31307 -166945 -110486 170882
7708 13942 38181 -180078 -90119 -69915 -114059 -221637 -192368 428666 -69345 103694 33280
7696 -20714 45997 -161960 452394 29237 -248369 -14574 154441 80531 -327926 -142910 -175597
7685 -175597 -344403 69111 309612 158050 -150363 128314 54291 -22701 313589 -246328
7674 128274 -214108 29460 -156734 -264556 -218935 -378862 -81294 39028 -413354 68561 53185
7663 53185 106807 -135426 141729 75775 -74108 -61680 194167 -362400 39156 32906 66091
7652 66091 -64734 -237861 -278933 161768 -311262 301750 218392 96737 -116793 -65746 -245304
7641 -245304 -283266 290211 -77499 180805 -432261 -24631 -120549 -21832 -9277 -183373 -94431
7630 -94431 276 -3872 153392 -43234 -93804 -113840 -53264 104788 -16441 202209 89133 -85366
7617 -69114 118258 -207257 273563 -81889 284339 -117140 -58449 69792 54069 78555 14287
7605 -190834 -56994 58548 -179942 -56348 97089 -202515 59755 -61072 90673 -292595 -449796
7594 -449796 -145171 -221515 -259670 -219507 228690 70932 -187135 -63550 -168988 30048 -292614
7582 -7437 -255945 10592 34918 -314504 -19513 -199421 50027 111049 -98713 -235210 47278
7570 -307084 -48800 -205229 70090 -169962 19012 -61938 -7085 -110338 180904 -53774 35693
7558 -84059 63020 -266458 -349076 43363 81570 -148884 -106366 126227 -44992 -28853 -203571
7547 -203571 -126788 -130052 -171885 -34508 -76317 78383 225084 -65802 -161168 -218201 161702
7535 -149800 17906 -173165 31769 3872 -172269 2751 -90657 22779 -80880 -129385 -131654 159586
7522 -129453 185791 -149011 -365158 -161264 -203866 110752 -8896 -142554 62867 -52291 -23132
7510 190845 149051 158211 -156794 242328 -440489 128883 58923 93333 177526 -30632 -69068
7499 -69068 32083 22043 109889 47421 -144240 -224415 -41347 94340 35073 -39114 106216
7487 -100139 -288719 -132990 -126598 208707 -134584 -243132 6247 152801 -171970 195861
7476 -94307 -261925 134379 -221319 150905 163961 266610 120235 25131 -24676 147930
7465 22497 106627 -30169 -87126 -21299 -321864 44161 84615 -458466 81522 189357 -130384
7453 -15613 -102634 -223025 637 -126337 -307851 374516 -388023 130200 327167 -2445 -165406
7442 -165406 -253453 -48206 124298 73339 -36012 121660 -103605 49692 56572 -222898 -61836
7430 -14076 15324 -92002 95004 -147610 -21659 -67520 -28148 -148712 95357 -66276 227430
7418 1923 113985 -229552 -206526 50698 5438 217788 49262 -60150 92868 -127652 -105550
7407 -105550 -314243 59634 -92865 -34267 132876 -83647 31572 201191 -153635 -161423 104313
7395 -22047 50036 -246364 194852 132852 -217239 244304 83356 307436 44610 166656 -240437
7383 -185977 -149071 -295866 -71826 99426 -289532 -142145 118248 296984 -9386 -313609 19623
7371 -79901 -54733 73725 140599 -221047 -202547 -273809 64905 76324 159533 295330 234363
7360 234363 -152380 -169274 -273401 12753 241160 -185767 -141048 65722 153370 -78094 5911
7348 26725 -97104 -303863 -90725 30838 238109 -215796 41154 -206589 128444 208126 178613
7337 178613 -14307 -169369 90789 333551 -213725 -120104 89844 54486 -135741 -348435 -143381
7325 -87522 186452 149664 -30208 370035 -97028 -156621 75644 -108300 69650 -46147 1521
7313 -116997 -48490 -226658 29933 99227 -139676 129818 24 -23953 -148708 -213994 2808 109465
7301 109465 328848 -78382 -196917 52209 110006 9216 -124605 -38186 108763 -103451 247444
7289 -50855 -43908 10650 -184466 228653 111222 -288700 -210362 -494070 149761 -8377 202456
7277 -337660 -75118 55657 -70558 -63916 -239259 -153149 229811 28270 -61197 -171926 45115
7265 79543 -38146 78587 94110 -390199 2620 33677 -130706 102853 237577 121648 113372
7254 113372 121425 58979 221218 -103783 140461 -257256 -11915 -212391 155355 186269 -419879
7242 -36409 -284673 2189 -222838 -225426 -253829 -94252 -38811 -154196 484069 -169970 -109766
7231 -109766 -144344 -124114 71635 -120511 -14867 176678 -411069 -358684 -157407 -273849 12474
7219 -233477 -320843 -102910 21060 45698 -306431 -115358 242362 -347389 -223013 -33572
7208 84872 213124 17374 -280613 -6052 121626 -258192 30314 -237020 157228 -91410 -11915
7196 -46635 -95340 254385 134302 -352561 55341 -292110 73279 58374 -144579 -174878 -49981
7184 22914 -38265 245228 353574 -176641 131042 140570 86259 -207485 -217574 101608 -329059
7172 -110533 -156753 -48777 -311503 54956 285300 -15318 284417 -141947 47856 -61624 231106
7160 144817 -22988 256956 103508 70451 111110 69385 -267188 -299050 13135 -121087 -131380
7149 -131380 -69711 -80456 56125 143284 132656 170551 155477 -3943 41585 -132341 -146144 681
7136 27351 18240 -7107 232550 304095 -170157 -186774 44473 -114346 -229878 448053 -214940
7124 249459 -256466 255843 -90064 38410 88172 -201034 -327965 266694 26874 -104747
7113 189547 438823 -149987 -68626 -119001 -196248 -35612 165161 -226503 336087 159311
7102 -30608 -54304 -41846 87791 171118 182501 -198397 78965 79923 40353 119809 75946 -116763
7089 49808 126449 -29118 -139250 199695 -210809 29126 -51316 211143 -204110 -394399 -204209
7078 -204209 89838 -171552 318737 -202506 188734 -492902 100216 -216709 27225 20084
7068 20084 -201248 -198859 91649 17213 164022 -472 -88396 -47144 264670 -105283 -198582 117620
7055 -334151 -330892 50609 -91307 103758 -75817 -106954 -136122 315336 -381920 -157988 -263728
7044 -263728 -335 31507 -27943 56972 62243 263295 -118426 -228828 -80079 -82664 -203016 -88825
7031 -40837 -208459 -155617 118179 -163886 -277587 -233090 -215514 -92830 75196 -45777 266677
7019 42087 -198828 -108118 180925 328296 163947 -39513 -9624 27298 -65544 214274 -42536
7007 -78579 -30034 -76799 13897 91609 77585 121881 -170355 -61301 87042 122753 146932 84528
6995 84528 -252934 -265140 114910 106531 -332772 -133360 73719 176892 -41600 -469006 -40469
6983 97504 -70015 -110883 12848 -23915 184334 -129184 2551 -110593 -184519 -180907 -89361 -449724
6971 -449724 173986 -85582 -190749 146067 -2661 -208382 -314727 -116523 -56739 63084 -138464
6959 -299357 -177463 56824 -111119 -21951 65488 -152287 344454 146344 8919 -268779 -419782
6948 -419782 -60599 85461 -120183 151300 38990 132635 -172596 414099 166275 -250261
6937 -449689 38164 34842 -121223 -61153 -174587 -62369 -14750 -160285 -225502 -111874 -98758
6926 -98758 -217507 -171920 -33592 -263477 -139334 14291 -4124 -114545 298405 103825 65187
6915 65187 -114065 -34145 20459 -184946 17001 -95558 -120886 9622 -102741 32129 26733 -79478
6902 64943 300488 1780 -102887 326977 179866 78622 -143267 416935 23183 -242674 94484
6890 165571 -214953 -131795 66981 -27497 -66176 -135249 -177945 -109742 155538 -238664 46297
6878 207557 57243 -52018 257848 47496 56195 3170 112727 -71690 -335126 179053 160294
6867 160294 136363 50882 -122321 81913 -126038 89310 59283 175340 126141 97734 21020
6855 67594 63915 -100563 235698 218370 -244180 182208 -107900 -104840 135051 76570 -260807
6843 120657 150994 -17153 328107 -42147 119356 -54869 -26303 3692 -7096 87747 -11275 116274
6830 36627 -47561 -319134 -80167 -240909 -118860 -33221 -144034 128992 333723 -214353
6819 -8993 212181 -88184 77073 32691 159302 -41317 -98197 -241730 -21695 86203 180482
6808 180482 132074 -55069 -43859 42619 12101 -48524 -9733 -181175 -123239 -250366 65592
6796 153796 88290 -229297 17545 -77508 129966 -7803 -94185 -220489 41513 -36928 -339313
6785 -339313 -41075 -131579 -286361 341667 -211873 192354 15291 -31345 20360 -466606 -181217
6773 -27958 -154445 -139552 -116356 231 310916 -230066 -91568 -81095 180377 -504141 -300928
6762 -300928 -297317 -42500 101097 -72331 43951 -261922 -63484 98543 -35573 -47222 -90005
6751 -90005 136710 -159489 171125 141030 88533 -100384 314872 -77112 -108185 -158859 70022
6739 -368957 315179 11315 -58283 -183891 316692 8908 -342221 -49940 -53528 -16678 -199365
6728 -199365 11889 78425 -303387 -29914 171938 154923 -136529 69517 -79179 109258 -302294
6716 234190 -245149 -5371 -240430 -86859 11055 9064 -249256 -303463 -29016 -54147 -47142 -45431
6704 -45431 -9508 23391 59172 -129044 -35562 63557 37640 -212908 -230512 158132 -184368
6692 -161849 -178217 151269 -216952 95329 311726 18509 65041 19489 51304 -547780 75569
6680 -61369 -18354 359168 -134621 194540 -95558 -159269 -119952 -107707 371643 50308 43693
6669 43693 -121726 -137783 461622 -48858 382997 -180649 -20616 -232274 72706 55064 -252633
6657 96434 138881 38825 -10458 171314 33534 -141841 -259983 57660 269106 60241 -131775
6645 -70420 225732 -28372 -88342 -340384 136276 -167926 -101113 61887 117436 -91120 159624
6633 51174 -269095 -36613 -16584 142639 -113300 182479 249289 -103087 143273 -23044 -75187
6622 -75187 66339 -116658 -173315 61514 -125055 169484 -206223 -172947 -128946 -67700 -139875
6611 -139875 175576 73591 -256398 -18596 -161565 -136795 -213205 -212254 -226291 110028 -181332
6599 -183167 -7679 134636 -27147 9004 60283 290869 44782 27476 -105839 -143005 -257618
6588 -257618 -256180 -78582 320545 136742 -14253 -239921 -69366 -55697 277973 -242349 247079
6576 -207651 -246756 -111719 76512 73167 269062 -30892 14276 235380 -174954 -96672 -19734
6564 119792 -175844 125702 -203280 -86265 -219799 235644 -12716 131661 17732 -158696
6553 -49564 245709 73760 102289 48507 -1710 -11037 -346664 -194865 -45999 276834 15295
6541 4498 -66185 -191619 -82928 -423827 45767 303636 26825 98422 352261 88200 140933
6530 140933 -225663 214471 -153663 -152058 -161024 -100388 -129761 42200 364639 86912 -426373
6518 52640 86017 -250143 -92299 -70302 259626 5104 17718 26037 116840 -215089 -157666 21369
6505 -109019 -5007 -56704 246939 -60405 221969 171868 15127 -169899 -83158 9797 18908 -12664
6492 188180 67949 82934 1453 -101382 -16063 -22427 162663 69087 119242 298354 -98231
6480 -241976 252084 188723 -386954 412100 -121807 269189 82182 6548 121103 -32903 -219725
6469 -219725 184500 202377 140015 -20299 -218467 -160013 -13215 26283 -8986 -161362 228444
6457 -165103 417525 96425 152685 235395 -187486 516201 -13151 -71194 114633 1937 124210
6446 124210 -134516 -163750 563363 -120318 60499 -30511 -86996 -183784 -8444 -47322 337852
6434 -47249 98420 -98614 -146461 40077 -388658 207228 -29174 139325 -120074 31629 -83399
6422 -113525 42651 115409 -303101 397001 132585 66831 18765 -79088 -248116 -31571 -5028
6410 150989 -501690 5470 94618 -11035 106874 -197703 -46174 -29694 340188 16502 82405
6399 82405 -119029 35819 -57872 48879 -145871 -1201 180790 -69849 191534 127573 -145310
6387 -283231 189882 -202337 83862 -131620 236147 -115230 -46616 -57823 310779 145997
6376 10391 264358 69849 -510 130148 -136241 68299 -398600 138196 133501 59562 -15765
6364 -30832 -70543 222252 -245511 -124993 5315 -482758 -60737 -79097 -93607 96098 -95578
6352 -187149 29178 281580 61181 253868 33546 -144749 6405 222324 -223629 76782 114953
6341 114953 -187605 100114 -11216 147676 30694 252001 -270604 -404550 -645 92204 56600
6330 56600 68993 294022 -22557 156996 181647 70674 166053 46824 -92141 -40595 -124886
6319 -124886 -436777 79607 -197110 -47880 -18711 82183 77724 -87106 261649 -408789 1983
6307 -125662 -113198 -155001 -369119 -115848 30854 -278411 -173867 298471 -63052 -81291 56235
6295 -78010 317378 -196678 37666 -266573 147451 -148777 -88239 171827 42356 59621 -162483
6283 35136 -111636 -213274 98670 -183555 -78557 42975 -13158 -135226 272870 -63846 -31712
6271 -69137 83018 39637 -115537 171692 270456 95863 156291 33385 -244121 5877 -81084
6259 -25081 73019 -214787 -203172 -97160 111739 254198 176063 -136518 -188085 153094 -100771
6247 249368 -69224 58673 -143361 -62524 20123 -34015 50579 -223437 357958 -48684 -128528
6236 -128528 124603 28118 -1667 80940 -93547 -63500 18777 85982 -127415 39299 107687
6225 107687 1578 -23058 -101016 -94502 -63827 107695 -16789 -231285 -82287 -135902 -64016 -258114
6213 -258114 144238 -29163 -194883 -12925 -228655 -162157 -244383 -49332 -47024 69459 -193704
6201 149612 -125921 25975 -19839 355684 179445 3532 -429701 6502 -100104 -313047 26022
6189 -98183 -75626 15658 56904 58169 253200 -357820 178871 100411 306581 160684 146650
6178 146650 -109188 136797 129437 -40454 455642 238841 -98376 -66337 71956 -188990 166711
6166 36597 86724 112568 151928 85646 -81251 198035 -64126 8821 -140959 149302 -256448
6154 -258631 -71668 159896 -144667 -224854 116175 154045 -120030 213376 -164349 -381822
6144 -381822 -81011 -27401 -165984 -250194 112935 44469 111636 192149 53702 84469 145147
6133 145147 -270171 4696 92415 -96476 -10770 -197732 -70922 141830 -90569 140278 22796
6121 -171390 235879 -210676 -85733 20418 -62773 -329214 -78236 -168631 -69064 -284404 -262275
6110 -262275 -122663 -141677 -70572 155018 75473 -28509 -46328 -188975 -95072 218064 -278906
6098 120254 -202868 291043 -219041 140247 -259874 261615 -114782 -122679 54378 385567
6088 385567 60999 -96578 214281 216945 63728 -79043 -217619 -48724 15403 -27956 202854
6076 34109 60912 -392807 399466 -67371 29397 272179 221351 154814 -202714 -87698 -92790
6065 -92790 137612 -83297 -212902 278026 -359770 215628 62764 -39999 -221604 -37541 -109969
6054 -109969 138678 -404566 -50682 82994 -54308 16287 -124469 -141482 174591 269638 28422
6042 -36841 -296278 -109417 2739 134458 -201495 314224 5545 69557 -143392 -152417 -103436
6031 -103436 -47394 -148571 71585 -75927 -23124 241209 29974 -122701 38354 -61689 53196
6019 -10132 -39265 -96958 -216813 30057 17012 3519 -107189 157202 -187016 86345 -268176
6007 -237031 10769 8540 -104390 54737 -24835 -6258 304494 -347192 50651 -180845 84383
5995 -156791 -158159 50752 -225168 -75957 187533 29908 -229202 144431 27899 -190416 161492
5983 26554 3517 196891 418447 -142619 237737 -117473 -251145 83613 109395 -33577 -105056
5972 -105056 -215785 54944 117575 155872 113253 99479 134679 -5088 13998 -135309 74155
5960 257735 -108019 -69918 -350968 23005 -127053 65128 285311 133100 19849 -104847
5949 -270917 84263 470673 177490 199919 -31247 -160969 -251198 69765 -5694 28834 59838
5938 59838 -25704 2055 355880 148458 -96697 -81689 30822 -25392 -68236 -169210 -36310
5926 135132 -81831 696 202767 -29481 1558 118406 -248278 75039 108386 -407653 320413
5914 134666 -189118 22766 -179699 52550 -82643 486605 -342153 -8011 25872 296044 407817
5903 407817 -44934 98456 -33305 120467 -145944 -130450 -50161 -26137 -59753 -56777 33474
5891 2776 236434 -93828 44251 -82241 -27352 -6009 -110742 66236 -145707 -92182 35818 166841
5879 166841 -235760 342302 313693 -132226 17518 36316 -12607 -52477 142689 -23014 51516
5867 -134166 -46565 -102141 -9576 -24352 118011 -368011 247105 423705 22948 128577 49470
5855 -80819 21062 4603 21152 432181 13427 -99930 -83535 219345 -86484 -41487 -7129 -124321
5843 -124321 29438 -184126 12530 -241647 -3092 2737 19340 -205868 -105594 185064 -58175
5831 -62 -81738 -96819 510097 -43879 -163360 289758 44965 -24802 -211907 -13791 228923
5819 232632 -68064 -155709 82607 -71681 -212666 47228 -121395 207514 133494 -7134 65883
5807 121946 -29536 -30576 -267573 144705 318626 143745 -20467 9608 -458311 -170903 -77661
5795 -187303 39151 -258941 104473 305363 -106783 82067 -26573 42 63922 320940 -175061
5783 -127038 134983 -200125 -240268 -39553 264903 414087 69218 -42929 30283 -180962 29656
5771 -48214 138632 -395609 -79812 -30945 334228 191246 -61075 -26844 402563 -79362 -21856
5759 -335743 -276858 -161982 -79957 60633 -102542 -119971 -66722 21816 41830 216657 52153
5747 -198715 -185688 -267165 33055 -157759 -198962 -77351 78710 398744 -8619 7249 17402 -27253
5734 -99535 -39306 15339 17536 245848 -6310 -195163 -6416 582542 246939 -229236 68159
5722 209433 238583 -38431 -15021 -40637 -138375 126791 202198 51598 -189580 240287 -326049
5710 144610 2643 140795 -68359 158920 82661 5495 118069 -39299 51143 30105 106335
5699 106335 -161806 419828 -304930 49218 -242447 -85200 -353188 212307 53712 -156011
5688 -111512 -39667 161194 -288742 -198021 -250510 -162286 -172368 -35839 -169532 136480 -212507
5676 320654 241675 59112 -13951 -398978 225564 -67573 47379 -185633 310712 -196036 152096
5664 -188068 10906 486512 -32668 -13589 -5270 330335 145818 -141611 -29363 -321730 91400
5652 197602 -61298 -175128 -139947 -187073 -459215 9149 -133027 -88287 71171 17072 -2230
5640 57929 127662 82174 70255 130801 6690 86451 100737 -127113 -131402 -121190 345661 -65190
5627 31192 -208511 84138 251708 -216884 57785 -91414 203824 20164 -151864 -15536 -65670
5616 -65670 -192418 178162 -265484 -123450 100406 -177941 35478 168583 -76717 227407
5605 -283918 25117 -142415 -371810 153799 83155 81850 -188775 14263 -281139 -16064 -123983
5594 -123983 185205 324298 -17105 -44790 44883 184039 -156026 -84699 92996 -103312 -211294
5583 -211294 -148817 40864 -210738 -157834 -47066 -149879 101215 147770 240170 111836 57575
5572 57575 136425 295200 96241 -454102 -271667 95890 305100 -18760 31830 -231286 -238521
5561 -238521 -220242 -388735 41725 -39222 -123421 -141202 15776 -39037 -99766 -401383 115076
5549 -249764 156022 -17437 295148 187948 133102 66342 38268 76249 22404 11013 -120030
5537 125021 -178835 165410 345951 -18097 426048 -304007 94689 60883 135945 -160725
5526 -140067 223186 -60069 -146611 -153862 -21543 -81352 -36068 -90604 38535 -183464 146397
5514 -156755 -66306 -52503 437533 -15512 -296063 78013 -31994 117582 132839 363400 1545
5502 33313 -359132 80955 -83258 180863 7148 169022 88049 -236889 -8491 88968 243783
5491 243783 -114547 318593 22818 -226200 18904 -176220 159786 99096 -324934 27567
5480 -184381 76816 57225 -34556 274976 -198205 206300 71065 -54467 -230228 9650 38193
5469 38193 -177806 54962 -43792 -29701 -187851 181932 -48122 58772 -58726 203424 -119629
5457 -150984 285971 46614 -119124 69642 -153730 -187008 -31894 250966 85809 84157 61284
5446 61284 177548 66833 2680 77331 59200 -318460 156241 -238062 131669 -136643 112500
5434 -117424 -77507 -237843 19205 214439 291097 41854 -270518 -381837 -70326 -138274 -93167
5423 -93167 118055 -184046 60492 89879 -253867 -43298 390059 24162 36561 -475205 146246
5411 -123680 -116226 19465 -44704 154160 178123 -52273 76475 104678 -64220 253209 -47485
5399 272960 86473 -312635 170708 -381826 -369109 -178981 -146737 -50166 226936 -48667 16297
5387 65485 87591 -16289 125554 51884 -196735 206483 137527 21978 129507 23406 217348
5376 217348 -75137 249032 50530 121539 16888 -43346 44304 -31364 110343 159756 -154343
5364 -51466 90985 115626 113181 153316 177070 -83156 -122896 11874 -188104 -477374 281498
5352 145939 -170487 79950 316335 -259984 12077 -275629 -227608 214088 50498 6967 -159394
5340 -143130 380167 -100046 -132474 -217748 40659 -160449 81173 67185 163270 -338003 -231094
5329 -231094 144841 -309723 -21892 -24356 -26439 160213 -68665 343045 4182 75465 -40272
5317 -150868 53962 -60547 -9638 -64306 20208 156647 -149871 56464 13806 177347 65093
5305 -48396 111093 73102 -17723 -43764 114170 118374 327264 154565 -151891 -13105 244716
5293 190421 -170836 -192856 -87506 -231438 -422611 46092 -102701 129268 -174897 -223631
5283 -223631 83316 464043 -106483 -120740 -67370 233074 -45335 -62868 43547 -300399 -76490
5271 -324381 517581 -77668 222012 87769 145020 76292 167912 -103494 139318 -129197 333048
5259 -186057 204428 501109 -126451 41758 -108220 -173550 -134816 119650 51935 182895
5249 182895 -151490 -94190 -2033 -150082 235035 -213798 151800 189526 -7987 124564 -21468
5237 -28788 -289669 -379310 59289 53321 193188 -181874 -129936 267312 91677 62078 144854
5226 144854 351104 -161018 -73614 43919 -7391 -170340 -88433 203442 -172503 -138389 213964
5214 -20372 104467 93383 -257 -28852 21764 -58815 -18974 185804 -97999 33589 39430 -103262
5201 29118 138476 -107065 -79214 223646 -479736 62961 -257089 -329613 -153552 -30650 -154112
5190 -154112 -75834 151592 -89833 -200434 -136317 137043 19762 -5237 217063 384259 -264886
5178 -165851 -169717 308058 11097 115089 -26825 185218 136317 19508 -19184 -153017 -36517
5166 31697 -243981 213578 50599 -102799 -63975 75521 -134800 185170 238639 133789 408576
5155 408576 153401 -107285 -427930 85965 -43401 -210388 290724 -156705 36701 -15045
5144 -56286 -97159 159151 -179412 -93635 364994 9036 119397 -50846 143108 -136362 -201339
5133 -201339 -215343 182017 324026 146598 401839 -124997 -62675 37298 355052 14121
5122 223401 8322 155351 -258248 -116970 -258658 -20702 158558 163183 -178902 74082 135476
5111 135476 -44035 53045 44573 -172726 65969 114949 11107 -96989 211815 143453 169213
5100 169213 41106 87351 228985 100332 63103 -356385 -117602 -66798 -205902 103524
5089 -5921 -196948 -90572 -364096 -192519 -98817 -4856 -78823 -86013 -43048 176680 219136 -43382
5076 45725 -42728 -174682 -60072 -332938 -168458 197229 32945 -258027 196177 22225 -14844
5064 235664 18777 -36991 -43438 -1206 -120707 175611 179153 -54119 80117 -63465 -356269 208016
5051 18035 123412 209745 -21958 -242523 -55659 74101 61413 -305664 125757 96286 -185270
5039 -89844 113562 -165745 -134292 134291 -26959 99188 -24402 -185962 -143301 175850 -905
5027 29714 10787 -260226 134396 158380 133994 106409 -76888 -167482 266710 -180156 -130645
5016 -130645 -499283 -113532 87353 -260068 -153372 352053 36706 239212 -132819 319367
5005 -58925 36174 -51592 34092 260623 94668 -227241 -94524 100132 198486 -120141 137370
4993 -301 -16446 -238108 -59109 -44214 -78979 108287 -28866 189648 -256543 135411 -366142
4981 77553 249301 -202152 -394342 -2453 -541716 -56215 287402 -29540 195212 66696 124525
4970 124525 -136981 -35628 -1234 169442 55918 235109 -173034 -203738 -39763 -201333 75854
4958 -206585 112123 -95150 -80264 -310539 57070 -284478 36866 52333 73594 -157662 -104764
4947 -104764 72843 -3147 167832 -291142 5765 -238483 -62634 49889 -257034 -151259 63655
4935 82623 103996 -220781 181025 23428 -67440 -61544 430453 257338 -84721 201519 -88610
4923 46551 -101074 -218171 248100 1325 -128969 2681 -79533 -38745 125011 -25694 356930
4911 156411 13658 27268 -86253 357151 110077 24695 40189 -95305 -175828 167757 -136326
4899 154019 327630 206799 155147 41423 73064 -125447 -67635 -153281 -44824 -262691 -133634
4888 -133634 -111185 -57307 547 128165 27516 53647 155908 291444 -51921 88572 49810
4877 49810 278941 -92289 204832 65420 328448 59080 -66071 55646 -361384 56749 38441
4866 38441 -186243 117307 20148 -125455 216428 -431268 17944 -185323 40509 -119514
4855 -128961 -23223 16638 200416 -244280 225784 -159062 -411884 -17229 147915 -138107
4844 129416 137656 -106833 -40414 34588 -120127 266524 191948 -289734 76703 -28455 248278
4832 -23481 -80814 -97823 123842 67183 -121422 -122166 -396292 -16733 194091 -85560 -21683
4820 -185278 37578 -75918 281228 337815 -122493 -136704 -318831 -64450 -52317 61080 -486538
4808 199608 50230 175808 170340 -29465 70450 -11065 326724 -25360 -558802 -392733 -138905
4796 -46119 -158067 196739 86356 20292 169327 135792 198572 -49479 -129656 10190 50587
4785 50587 -31800 -48361 -82737 122951 -261559 -37132 47872 -67368 26896 -47800 -170913
4774 -170913 -191195 -60525 38036 78143 -17954 351643 -9919 -267949 126987 -23114 290330
4762 -138178 204568 -253129 -61872 -116566 24864 -147010 -130328 -11100 -24566 -62728 12581
4750 204448 283475 391995 69539 233866 22297 117433 -40545 353349 135115 70555 140882
4739 140882 136324 131397 -96872 -52973 49519 163696 102268 -4373 -47597 -196230 -74010 123889
4726 -38387 -14279 21756 470539 -117994 230575 329362 94785 36116 -192911 -61174 132567
4714 141719 6912 -201196 -494222 104573 -117613 -108046 -226374 74583 -187741 31419 107226
4703 107226 -117032 -11132 -82763 -76071 270381 -13747 130794 -164959 -334279 -233611 76525
4691 -136597 120321 -174284 188574 130635 34797 -100747 199335 1891 329608 39314 102314
4680 102314 -178728 258126 -24828 163258 175561 -160695 22390 -107440 -118734 69372 91262
4669 91262 -2198 19508 240201 42800 -251312 -58553 152081 -160546 26218 102129 -131572
4657 -290152 -141213 -393483 232356 -181199 26590 -288101 -15296 60659 351765 231636
4647 231636 -349550 -89306 -122610 110284 41193 268035 -32359 -25769 131384 -158042 -107229
4636 -107229 -366277 -32497 26678 326903 15950 254244 -130386 264830 -126104 124210
4625 97302 -162767 11595 -77600 -342078 -386988 -409285 -286326 -59308 29362 -267506 60449
4613 -294635 -35811 78491 -114405 -179222 192377 61232 -66378 306228 137264 -126766 -83850
4602 -83850 107235 129807 -23372 104976 -184471 15700 233488 20444 -309946 -332959 12822
4590 173294 -49012 299248 102760 156841 -215620 -164939 -60835 -160962 162586 -87033 265115
4578 192955 89413 -217248 1733 78990 354705 47486 -7656 114226 -149174 227398 83390
4566 -204535 -172372 -26681 -70774 -297432 65422 85170 86624 -153289 311524 38682 -238607
4554 115155 -195039 143275 35098 22293 3038 134923 52363 10536 173989 -110605 -13093
4542 66178 116137 -21914 162686 168485 -60998 2451 -177440 74377 67335 96809 62916 277814
4530 277814 33826 104621 293537 268241 11281 -30725 -106450 -26859 -220234 -284207 3374
4518 160467 -204664 47577 -76586 -127303 -4067 155414 -114745 -359707 191218 -258163 162066
$$ [...]
##END NTUPLES=NMR SPECTRUM
##END=
