##TITLE=AC1687_PANAM14368_8637553_FEcPcazRuK
##JCAMPDX= 6.0         $$ Bruker NMR JCAMP-DX V2.0
##DATA TYPE= NMR SPECTRUM
##DATA CLASS= NTUPLES
##ORIGIN= BRUKER
##OWNER= Administrator
$$ 1.72 TOPSPIN		Version 2.1
$$ 2014-05-30 20:16:43.453 -0700  Administrator@X
$$ Compression mode = diff/dup
##.OBSERVE FREQUENCY= 400.02188249412
##.OBSERVE NUCLEUS= ^1H
##.ACQUISITION MODE= SIMULTANEOUS (DQD)
##.ACQUISITION SCHEME= undefined
##.AVERAGES= 8
##.DIGITISER RES= 22
##SPECTROMETER/DATA SYSTEM= spect
##.PULSE SEQUENCE= zg30
##.SOLVENT NAME= COFFEE_meoh
##.SHIFT REFERENCE= INTERNAL, COFFEE_meoh, 1, 14.98509
##AUDIT TRAIL= $$ (NUMBER, WHEN, WHO, WHERE, PROCESS, VERSION, WHAT)
$$ ##TITLE= Audit trail, TOPSPIN		Version 2.1
$$ ##JCAMPDX= 5.01
$$ ##ORIGIN= Bruker BioSpin GmbH
$$ ##OWNER= Administrator
$$ $$ E:\/data/COFFEE/nmr/AC1687_PANAM14368_8637553_FEcPcazRuK/20/pdata/1/auditp.txt
$$ ##AUDIT TRAIL=  $$ (NUMBER, WHEN, WHO, WHERE, PROCESS, VERSION, WHAT)
(   1,<2014-05-30 20:16:36.437 -0700>,<Administrator>,<X>,<go>,<TOPSPIN 2.1>,
      <created by zg
	started at 2014-05-30 20:15:29.812 -0700,
	POWCHK enabled, PULCHK disabled,
       configuration hash MD5:
       C8 4E 4E 5D D3 5C D8 9E 9F 52 82 E0 59 8A DE 15
       data hash MD5: 64K
       3D DA 2E 48 C1 48 C3 FA 86 B5 E8 1A 52 BC B0 98>)
(   2,<2014-05-30 20:16:39.421 -0700>,<Administrator>,<X>,<proc1d>,<TOPSPIN 2.1>,
      <Start of raw data processing
       efp LB = 0 FT_mod = 6 PKNL = 1 PHC0 = 0 PHC1 = 0 SI = 32K 
       data hash MD5: 32K
       88 21 D4 85 FA B8 C3 69 FA B2 FE 86 61 D2 87 6B>)
(   3,<2014-05-30 20:16:39.781 -0700>,<Administrator>,<X>,<proc1d>,<TOPSPIN 2.1>,
      <pk PHC0 = 92.08191 PHC1 = 0 
       data hash MD5: 32K
       45 50 9D FC 2C 09 8D 6B 53 CD 46 B2 11 DB 2E C4>)
(   4,<2014-05-30 20:16:39.921 -0700>,<Administrator>,<X>,<proc1d>,<TOPSPIN 2.1>,
      <abs ABSG = 1 
       data hash MD5: 32K
       B3 6F B4 39 C3 6A 5A 3C EE E0 8A C5 54 24 CD 1C>)
(   5,<2014-05-30 20:16:40.046 -0700>,<Administrator>,<X>,<proc1d>,<TOPSPIN 2.1>,
      <abs ABSG = 2 
       data hash MD5: 32K
       F2 00 E1 DB 34 22 D2 E6 4F 19 C8 7A 16 FB 0D 02>)
(   6,<2014-05-30 20:16:40.093 -0700>,<Administrator>,<X>,<proc1d>,<TOPSPIN 2.1>,
      <abs ABSG = 3 
       data hash MD5: 32K
       AC 92 82 4D 2D CF ED ED 39 1C F3 1B E0 B5 A4 78>)
(   7,<2014-05-30 20:16:40.156 -0700>,<Administrator>,<X>,<proc1d>,<TOPSPIN 2.1>,
      <abs ABSG = 4 
       data hash MD5: 32K
       0B B8 DF EE 70 BC 02 4D 6B 6E 6C 6B B4 05 DA 36>)
(   8,<2014-05-30 20:16:40.218 -0700>,<Administrator>,<X>,<proc1d>,<TOPSPIN 2.1>,
      <abs ABSG = 5 
       data hash MD5: 32K
       EB 38 1E F3 5B B6 44 71 64 D3 3E 30 8D 42 30 B8>)
$$ ##END=
$$ 
$$ $$ hash MD5
$$ $$ 59 87 17 C1 69 42 B7 A2 A1 EA 2C 7E 52 9D D3 2B
##$RELAX= 
##$RELAX= 
##$RELAX= 
##$RELAX= 
##$RELAX= 
##$RELAX= 
##$RELAX= 
$$ Bruker specific parameters
$$ --------------------------
##$DU= <E:\>
##$EXPNO= 20
##$NAME= <AC1687_PANAM14368_8637553_FEcPcazRuK>
$$ [...]
##$TP= (0..7)
150 150 150 150 150 150 150 150
##$TP07= 0
##$TPNAME0= <>
##$TPNAME1= <>
##$TPNAME2= <>
##$TPNAME3= <>
##$TPNAME4= <>
##$TPNAME5= <>
##$TPNAME6= <>
##$TPNAME7= <>
##$TPOAL= (0..7)
0.5 0.5 0.5 0.5 0.5 0.5 0.5 0.5
##$TPOFFS= (0..7)
0 0 0 0 0 0 0 0
##$TUNHIN= 0
##$TUNHOUT= 0
##$TUNXOUT= 0
##$USERA1= <user>
##$USERA2= <user>
##$USERA3= <user>
##$USERA4= <user>
##$USERA5= <user>
##$V9= 5
##$VALIST= <valist>
##$VCLIST= <CCCCCCCCCCCCCCC>
##$VD= 0
##$VDLIST= <DDDDDDDDDDDDDDD>
##$VPLIST= <PPPPPPPPPPPPPPP>
##$VTLIST= <TTTTTTTTTTTTTTT>
##$WBST= 2048
##$WBSW= 25
##$XGAIN= (0..3)
0 0 0 0
##$XL= 0
##$YL= 0
##$YMAX_a= 599504
##$YMIN_a= -514679
##$ZGOPTNS= <>
##$ZL1= 120
##$ZL2= 120
##$ZL3= 120
##$ZL4= 120
##$ABSF1= 14.98509
##$ABSF2= -5.573092
##$ABSG= 5
##$ABSL= 3
##$ALPHA= 0
##$AQORDER= 0
##$ASSFAC= 0
##$ASSFACI= 0
##$ASSFACX= 0
##$ASSWID= 0
##$AUNMP= <proc_prof1d_extract_pilot.lims>
##$AXLEFT= 0
##$AXNAME= <>
##$AXNUC= <1H>
##$AXRIGHT= 0
##$AXTYPE= 0
##$AXUNIT= <>
##$AZFE= 0.1
##$AZFW= 0.1
##$BCFW= 0
##$BC_mod= 0
##$BYTORDP= 0
##$COROFFS= 0
##$CY= 15
##$DATMOD= 1
##$DC= 0
##$DFILT= <>
##$DTYPP= 0
##$F1P= 0
##$F2P= 0
##$FCOR= 0.5
##$FTSIZE= 32768
##$FT_mod= 6
##$GAMMA= 0
##$GB= 0
##$INTBC= 1
##$INTSCL= 1
##$ISEN= 128
##$LB= 0
##$LEV0= 0
##$LPBIN= 0
##$MAXI= 10000
##$MC2= 0
##$MEAN= 0
##$ME_mod= 0
##$MI= 0
##$NCOEF= 0
##$NC_proc= -8
##$NLEV= 6
##$NOISF1= 0
##$NOISF2= 0
##$NSP= 0
##$NTH_PI= 0
##$NZP= 0
##$OFFSET= 14.98509
##$PC= 1
##$PHC0= 92.08191
##$PHC1= 0
##$PH_mod= 1
##$PKNL= yes
##$PPARMOD= 0
##$PPDIAG= 0
##$PPIPTYP= 0
##$PPMPNUM= 2147483647
##$PPRESOL= 1
##$PSCAL= 4
##$PSIGN= 0
##$PYNMP= <proc.py>
##$REVERSE= no
##$SF= 400.02
##$SI= 32768
##$SIGF1= 0
##$SIGF2= 0
##$SINO= 400
##$SIOLD= 32768
##$SPECTYP= <>
##$SREGLST= <1H.CDCl3>
##$SSB= 0
##$STSI= 32768
##$STSR= 0
##$SW_p= 8223.68421052631
##$SYMM= 0
##$S_DEV= 0
##$TDeff= 65536
##$TDoff= 0
##$TI= <>
##$TILT= no
##$TM1= 0
##$TM2= 0
##$TOPLEV= 0
##$USERP1= <user>
##$USERP2= <user>
##$USERP3= <user>
##$USERP4= <user>
##$USERP5= <user>
##$WDW= 1
##$XDIM= 32768
##$YMAX_p= 462207824
##$YMIN_p= -811537
##$CURPLOT= <Network HP LaserJet P1505>
##$CURPRIN= <$Network HP LaserJet P1505>
##$DFORMAT= <normdp>
##$LAYOUT= <+/1D_H.xwp>
##$LFORMAT= <normlp>
##$PFORMAT= <normpl>
##$SURQMSG= 1
$$ End of Bruker specific parameters
$$ ---------------------------------
##NTUPLES= NMR SPECTRUM
##VAR_NAME=  FREQUENCY,     SPECTRUM/REAL,   SPECTRUM/IMAG
##SYMBOL=    X,             R,               I
##VAR_TYPE=  INDEPENDENT,   DEPENDENT,       DEPENDENT
##VAR_FORM=  AFFN,          ASDF,            ASDF
##VAR_DIM=   32768,         32768,           32768
##UNITS=     HZ,            ARBITRARY UNITS, ARBITRARY UNITS
##FACTOR=    0.250966925370066, 1,           1
##FIRST=     8223.43324360094, 85785,        19985
##LAST=      0,             -107585,         81707
##MIN=       0,             -811537,         0
##MAX=       8223.43324360094, 462207824,    0
$$ Real data points
##PAGE= N=1
##DATA TABLE= (X++(R..R)), XYDATA
$$ [...]
19553D7393K2843M590i0788a4421A10280a33018a0364C17853p4157a98130A02952
19541a27217D14376a44636k98654f0555j61825j44513C27568e1845k6888m05987
19531d84720b7265A10001Q9228d6072k18102h9750H2288f8387c0430f094r9599
19520a05693c9308k24944e2509l66386b7993o5453q2202k12234a69011B14952
19509b13356R4550A60600b8870j58347L3821A51908h0591K0550A86465b51594
19498C3994J9106d7656j30282C6885a32857j77867J919a04041l9819c525j53737
19487a57262k17848C19399c21066A73813a02639k12035a29739C14560A7950a24790
19476e9241b7201j26823l15646a96398D2414i1390B4290b36604D48241A65886
$$ y = [47393, 70236, 74826, -90788, -14421, 110280, -133018, -10364, 317853, 243696, -198130, 102952, -127217, 414376, -144636, -443290, -60555, -222380, -366893, 327568, -51845, -78733, -484720, -27265, 110001, 199229, -46072, -264174, -89750, 82288, -68387, -30430, -6094, -105693, -39308, -264252, -52509, -418895, -27993, -93446, -175648, -387882, -169011, 214952, -213356, -118806, 160600, -28870, -187217, -153396, 151908, -80591, -60041, 186465, -251594, 33994, 53100, -47656, -177938, 36885, -132857, -310724, -308805, -104041, -143860, -3525, -157262, -375110, 319399, -321066, 173813, -102639, -314674, -129739, 314560, 17950, -124790, -59241, -27201, -154024, -469670, -196398, 42414, -91390, 24290, -236604, 448241, 165886]
19465C23436j6243D0507b18472h3352A10653A4060R9475b31097B12658m9675c11682
19453a95885i3099F5794j5014D861J43409F4373b31167B41155a40894A95497f8281
19441f7985A48850a95383q3004A94086a21833A33822P0913a6121I6252b66689
19430E1801I828d15430c8611B45842q3265b22938A57969a87220F4553c8350p7720
19419a16070F8518a64931P5473k15940A23669e63096B0491J18046b99867J39451
19409a60416q0338L2500Q3692B4700M2684c61700b6577o5558M5572j56773A3335
19397E263f5065D8457b88136A39372g3695B64820J2804g9395B23565d29291B25230
19385A31865e8670k8979o4088j48985j71174B6045c5138H2540A1774f6139F1986
$$ y = [323436, 307193, 40507, -218472, -83352, 110653, 14060, 113535, -231097, 212658, 162983, -311682, -195885, -93099, 65794, 50780, 4861, 148270, 64373, -231167, 241155, -140894, 195497, -68281, -67985, 148850, -195383, -278387, 194086, -121833, 133822, 204735, -16121, 96252, -266689, 51801, 9828, -415430, -38611, 245842, 162577, -222938, 157969, -187220, 64553, -38350, -116070, 68518, -164931, -89458, -305398, 123669, -563096, 20491, 138537, -299867, -160416, -240754, -208254, -124562, 24700, 67384, -361700, -26577, -92135, -46563, -203336, 13335, 5263, -65065, 48457, -288136, 139372, -73695, 264820, 277624, -79395, 223565, -429291, 225230, 131865, -58670, -87649, -151737, -300722, -471896, 26045, -35138, 82540, 11774, -66139, 61986]
19373C21154b6446A91503e9433B92050b5657k95278c1469B4734a79060k80382
19363d59442J84853A11899a90551A44423c4086A21207K97603A04984A6115i6841
19352a61140j91630C7640A6674a49001d6145F2114D12b31072B586c21593a41053
19340A33691a59582g759l31164B65190a58224A38797a43584B2084O3987b09041
19329h4629k90492J37654G0992J09464i2763I3520a61697A82535b98899c8742
19318a83140A71738a04758k7519b9113j09163E6655M9700b17521A22898b32954
19307c53796A0569a02673e1023D6518k1005a55129b3756A04863L0815k7507i9528
19295b06825E4058k0734J45913h1769k60295a19360b1804n9451k34844f0924o4439
$$ y = [321154, -26446, 191503, -59433, 292050, -25657, -320935, -31469, 24734, -179060, -459442, -274589, 111899, -190551, 144423, -34086, 121207, 418810, 104984, 16115, -96841, -161140, -352770, 37640, 16674, -149001, -46145, 62114, 412, -231072, 2586, -321593, -141053, 133691, -159582, -7759, -338923, 265190, -158224, 138797, -143584, 22084, 86071, -209041, -84629, -375121, -237467, 70992, 180456, -92763, 93520, -161697, 182535, -298899, -38742, -183140, 171738, -104758, -132277, -29113, -138276, 56655, 106355, -217521, 122898, -232954, -353796, 10569, -102673, -51023, 46518, 25513, -155129, -23756, 104863, 135678, 108171, -99528, -206825, 54058, 33324, 179237, -81769, -342064, -119360, -21804, -81255, -316099, -60924, -125363]
19284a25363m9851h0748C3892a73664j54808a62703a7611A2424J59993h2950B48894
19272A8767N5681e34434A12763m4499R2329P1002F9252a05142k12452C1108d79057
19260g3265k76717i0437A35451F1879C456a83276A30841P1234D9498J00259m6269
19249A03488c09635O9287a18095o5276j9059d1694q9688j21659c9379C251c5998
19237B50521j8924a98121H714K31314e6431B49220b93826A97366d07058a8386
19226B47139h0719J3462A98557a32330K7611B10885K2913O4319A35422h0719q4164
19215a64883C05868C5897b3160j47949b7547j53508O1831M7198l66694d2408n3234
19204i5642l8384G3157f6167b9489k09812A09760c43859A20d1773m6662l95624
$$ y = [-125363, -175214, -80748, 33892, -173664, -328472, -162703, -17611, 12424, 172417, -82950, 248894, 18767, 74448, -534434, 112763, 68264, 160593, 231595, 69252, -105142, -317594, 31108, -479057, -73265, -349982, -90437, 135451, 61879, 3456, -183276, 130841, 202075, 49498, 149757, 103488, -309635, -240348, -118095, -183371, -202430, -41694, -131382, -253041, -39379, 3251, -35998, 250521, 231597, -198121, 8714, 240028, -56431, 249220, -293826, 197366, -407058, -18386, 247139, -80719, -67257, 198557, -132330, -104719, 210885, 233798, 298117, 135422, -80719, -164883, 305868, 35897, -23160, -171109, -27547, -181055, -119224, -72026, -438720, -42408, -95642, -134026, 73157, -66167, -29489, -239301, 109760, -343859, 120, -41773, -88435, -484059]
19193d84059B20241E8691b65747A64034a37630D2693e3058r3987A04345O4733
19183A69078a10630N5075l79680A02832g2180E5528c68472a29836B54050d30079
19172A32432b8277l3135m8841A0680b44471f9216j0833A66685a17600J4293B27142
19160a81788f1876C4253d05552Q1886L696a22439A19858l9565d13132b2467H2793
19148c3927A23311a38504E9925j7991a65311b843j43563O9822C05946F4431j6549
19137D7882a01020B28393j10833J0807a69710A54285b16333K8733B2965a9921
19126F5521J20679c87412J88981N794c0960H3486P0885a97021j10947D10851a95356
19114g3395C5791a94218A89468g1941k82536J21837E8292L8897b28610b3850r6673
$$ y = [-484059, 220241, 58691, -265747, 164034, -137630, 42693, -53058, -147045, 104345, 169078, -110630, -55555, -435235, 102832, -72180, 55528, -368472, -129836, 254050, -430079, 132432, -28277, -61412, -110253, 10680, -244471, -69216, -80049, 166685, -117600, -103307, 227142, -181788, -61876, 34253, -405552, -323666, -319970, -122439, 119858, 80293, -413132, -22467, 82793, -33927, 123311, -138504, 59925, 41934, -165311, -2843, -146406, -76584, 305946, 64431, 47882, -101020, 228393, 117560, 128367, -169710, 154285, -216333, -187600, 22965, -19921, 65521, 186200, -387412, -198431, -192637, -30960, 83486, 154371, -197021, -307968, 410851, -195356, -73395, 35791, -194218, 189468, -71941, -354477, -232640, 58292, 97189, -228610, -23850, -120523]
19103a20523A39270L748J3381a76890g57j1285B86931a57244A3089i2738B9756
19091g1773r5196M6720j41461A94554g0351p0192B4014L03884C0191a78862H5495
19079c53446h3986k18557D31K1653i424j595o144A04911C4120b61775G2166e5861
19066A78904q6413J1024k9662a03871A30875C9745a02410A67216b38633B61422
19055f0553b8848j39211k9489B66451o9266C1945h7159k81583A43207L615a13286
19043b7939n00949H9619b01147A61481a13799A05556f9210I8059C0025N3686J67149
19032B50860A213R1649J77491h5529l8666A64971g7918a5250B32916G5303K03772
19021B79075c93749a8483B44406J2204k4949i9640c9208A23101a49727E3834a6472
$$ y = [-120523, 139270, 143018, 156399, -176890, -757, -12042, 286931, -157244, 13089, -92738, 29756, -71773, -166969, -120249, -261710, 194554, -70351, -140543, 24014, 327898, 30191, -178862, 85495, -353446, -83986, -302543, 431, 22084, -9424, -11019, -17163, 104911, 34120, -261775, 72166, -55861, 178904, 92491, 103515, 73853, -103871, 130875, 39745, -102410, 167216, -238633, 261422, -60553, -28848, -168059, -197548, 266451, 197185, 31945, -87159, -368742, 143207, 146822, -113286, -27939, -528888, 89619, -201147, 161481, -113799, 105556, -69210, 98059, 30025, 83711, 250860, 1213, 92862, 270353, -85529, -124195, 164971, -77918, -15250, 232916, 75303, 279075, -393749, -18483, 244406, 256610, 231661, -99640, -39208, 123101, -149727, 53834, -16472]
19009b70505L8424K4034M8212b9799l91269b06493B071e16247a65713A06017b46963
18997c1718k21112A36288d1859J8184k06074k3180B38188G0230K4856J98044D5882
18985A54373p6464i7353B44737A15077P3284a70763C82458b26208F4967e6593
18974D2005L0353a22291D76052i5511j50748k91691i5436K4159C64486E9657K59071
18963C18728g0694J4643j10514f267o9942l5116j19273A94401H6080L9136J29640
18952B54856F1135g4335A02009C6873D253h5402J9576m08134B35195b799k48513
18941b51312a7002B17375b80568A76620h436C51047e789j77169C21566i7605A65116
18929d51491G2726J50262K2789a21277L4848j03749P9994L0446k50481a31157
$$ y = [-270505, -232081, -208047, -159835, -29799, -421068, -206493, 2071, -516247, -165713, 106017, -246963, -31718, -252830, 136288, -41859, -23675, -229749, -252929, 238188, 70230, 95086, 293130, 45882, 154373, 77909, -97353, 244737, 115077, 188361, -170763, 382458, -226208, 64967, -56593, 42005, 72358, -122291, 476052, -95511, -246259, -537950, -95436, -71277, 364486, 59657, 318728, -70694, -56051, -166565, -6267, -76209, -111325, -230598, 194401, 86080, 125216, 254856, 61135, -74335, 102009, 36873, 4253, -85402, -65826, -473960, 235195, -2799, -251312, -17002, 217375, -280568, 176620, -8436, 351047, -5789, -182958, 321566, -97605, 165116, -451491, 72726, 222988, 245777, -121277, -86429, -190178, -110184, -79738, -330219, -131157]
18918c0357j18843N0837c2028n8418L987H3884b84851J02543H5524d3559A02612
18906D23475E039f2653F5115i1964b393I017N4463b0433D83726c38129n520a8879
18893a61541l21319f3239A03385i5544c2917m34749b6859D40378E9469a62976
18882A56648c43973b3232C9732d13482J32054D9671c43184F7006A1532N9624b34794
18870A64198a32276A52270a37925m9229E5721a2587G7877K60801a33463M1704
18860i1759A6420a66689F3328d0938C7554a83243A23539b13169Q3990J0047A29753
18848h155E7816c69955a27175A8281b341k54733q2759n1377J91626j25867C8406
18836a06203j07312A14876a39621A75074a28581C061b3247g552j19310N3137L5814
$$ y = [-30357, -149200, -98363, -32028, -90446, -86459, 83884, -284851, -182308, 85524, -43559, 102612, 423475, 5039, -62653, 65115, -91964, -2393, 9017, 63480, -20433, 483726, -338129, -343649, -18879, -161541, -482860, -63239, 103385, -95544, -32917, -467666, -26859, 440378, 59469, -162976, 156648, -343973, -23232, 39732, -413482, -281428, 49671, -343184, 67006, 11532, 71156, -234794, 164198, -132276, 152270, -137925, -187154, 55721, -12587, 77877, 338678, -133463, -91759, 16420, -166689, 63328, -40938, 37554, -183243, 123539, -213169, -129179, -119132, 129753, -8155, 57816, -369955, -127175, 18281, -2341, -257074, -339833, -391210, -199584, -325451, 38406, -106203, -213515, 114876, -139621, 175074, -128581, 3061, -23247, -7552, -126862, -73725, -37911]
18825c7911k62452D9206A3471c7439I4922J80938B5714J64661l0760E8337c63069
18813A06760i3340C58423p7926l0350a04831F63741j89092i3150G266a54329A90392
18801A37184c9457n957A09964K5606c06965G5296a46214B23939a48321O3757F010
18789b640j28327a3107j89416d5004q5625L3142l9560D02N3464c38428g0107A77412
18776A68536F7006c43034b695q8990H7148a36314o6200b2342j54292b4633l5098
18765e9731r412q1692A10222J97782J06441E3940h849B9316b78200b422n24962
18754e27384H7799c38496A03472a8229B46152F5308N3429f4650G1997J56718a78066
18742d4018D4454J22656b40522O7155A43974l8085q146a1294F6045a98835d4921
$$ y = [-37911, -300363, 49206, 13471, -37439, 94922, 275860, 25714, 190375, 159615, 58337, -363069, 106760, -93340, 358423, 280497, 250147, -104831, 663741, 474649, -93150, 7266, -154329, 190392, 137184, -39457, -45414, 109964, 135570, -306965, 75296, -146214, 223939, -148321, -84564, 6010, -2640, -130967, -13107, -202523, -45004, -130629, -97487, -137047, 402, 53866, -338428, -70107, 177412, 168536, 67006, -343034, -2695, -91685, 87148, -136314, -202514, -22342, -176634, -24633, -59731, -69143, -150835, 110222, 308004, 414445, 53940, -8849, 29316, -278200, -2422, -527384, 87799, -338496, 103472, -18229, 246152, 65308, 118737, -64650, 71997, 228715, -178066, -44018, 44454, 167110, -240522, -173367, 143974, 105889, 97743, -11294, 66045, -198835, -44921]
18730a10270N1073j69154j1529D7316K85152d6758A2420a55470a7980A55317h7707
18718C9086g2506D6845b95101b5616j36486k2211j35278A25827N9699i4693A39121
18706A13950I541J6140Q3602Q8822m9681N1656e1819o2965l05884e2609G8489
18694b05794Q7684C2849M8374b15035b8338I099f1384n49j48525b0780E5966o025
18682D9941g7425j39824b7719n3382b5714j53468H3823L9876d6205k32161A44730
18670a43150B92669g9255G4455b97838J42984j80285J57738n528o5800B06584
18659c10815a11164G9757e39006K64971J06088O9318B7791a25175k96135a48128
18648e9367J7382j74432g969B0542h8026k6622C2960N2746a03046C12352A04446
$$ y = [-110270, -59197, -228351, -239880, 47316, 332468, -46758, 12420, -155470, -17980, 155317, -87707, 39086, -72506, 46845, -295101, -25616, -162102, -184313, -319591, 125827, 185526, -94693, 139121, 113950, 9541, 25681, 109283, 198105, 148424, 200080, -51819, -114784, -420668, -52609, 78489, -205794, -118110, 32849, 81223, -215035, -28338, 9099, -61384, -61933, -210458, -20780, 55966, 49941, -77425, -217249, -27719, -81101, -25714, -179182, 83823, 123699, -46205, -278366, 144730, -143150, 292669, -79255, 74455, -297838, -154854, -335139, -177401, -182929, -248729, 206584, -310815, -111164, 79757, -539006, -274035, -167947, -98629, 27791, -125175, -421310, -148128, -59367, -41985, -216417, -7969, 20542, -88026, -114648, 32960, 85706, -103046, 312352, 104446]
18636a15217r8847K4686A8187L0267a899C6148n38d04449a98855i4430b0759A11149
18623b1291r2493j25914a08263D1447b72308a4398j87106p2579a03057B7986a08941
18611b65111I6989K58974a89698D2622P275c9860k87495c7924k14875D082a76462
18599d9120m2644j8957l5319n0337A37341a21273G4067g2106b1150q19N849l9943
18587e6063H1672k1387e2079b3937D14344A81673h3086q240B18d8067b0387j58518
18575a78905a6516A26845l723a96386a8334j30536c2429B73974L0042A4272a36760
18563d17642a52789H8165c07753e2967k13168A1065e9418n9617j39928J27564
18553a31399e0014a3459j59938a0594l280r6442L9181j53703A98199p0626b8447
$$ y = [-115217, -214064, -189378, 18187, 48454, -1899, 36148, 35610, -404449, -198855, -94430, -20759, 111149, -21291, -113784, -239698, -108263, 41447, -272308, -14398, -201504, -274083, -103057, 27986, -108941, -265111, 96989, 355963, -189698, 42622, 49897, -39860, -327355, -37924, -252799, 4082, -176462, -49120, -91764, -110721, -146040, -196377, 137341, -121273, 74067, -72106, -21150, -21969, -16120, -56063, 81672, 60285, -52079, -23937, 414344, 181673, -83086, -91326, 218, -48067, -20387, -178905, -16516, 126845, 123122, -196386, -18334, -148870, -32429, 273974, 304016, 14272, -136760, -417642, -152789, 88165, -307753, -52967, -266135, 11065, -59418, -119035, -258963, -131399, -50014, -13459, -173397, -10594, -13874, -110316, -71135, -224838, 198199, 127573, -28447]
18541a61944k58107B9253A2787b75810g0580C6421M8569Q5004B9633J70885c8912
18529a25903E8775J3297K0770J41176g2362G5001R903Q7163b4076B88302b69824
18517c37078l2810J08939J04648b9281p8571A09577M7026m3772K00237D6309g8095
18505C13512a32068k49543a501j75828A03680b8096A03766g659o3238J5826m5820
18494a00891d4939j31927C4679e1077A38426a22063m5448h1657J7322B04523G3600
18482A0907L9868c6782d175j14957B87465b50214d8616k45043j03615a8465D9827
18470c9321a6417l18244C7871b27466i4475D02858a69845k6263F2032a16154m2276
18459a58430N5594b4153A06239e46337b37268N0154a3846n8243B08641g2401G4991
$$ y = [-161944, -420051, 29253, 12787, -275810, -70580, 36421, 84990, 169994, 29633, 200518, -38912, -125903, 58775, 72072, 92842, 234018, -72362, 75001, 84904, 172067, -24076, 288302, -269824, -337078, -369888, -260949, -156301, -29281, -107852, 109577, 156603, 112831, 313068, 46309, -78095, 313512, -132068, -381611, -1501, -177329, 103680, -28096, 103766, -7659, -70897, -55071, -100891, -44939, -176866, 34679, -51077, 138426, -122063, -167511, -81657, -64335, 204523, 73600, 10907, 50775, -36782, -4175, -119132, 287465, -250214, -48616, -293659, -397274, -18465, 49827, -39321, -16417, -334661, 37871, -227466, -94475, 402858, -169845, -196108, 62032, -116154, -158430, -102836, -24153, 106239, -546337, -237268, -187114, -13846, -72089, 208641, -72401, 74991]
18447f31696A78723c90532c2321j14776k6612N1031A49751d00416B31426b8772
18436a38125n3498A8723a98406I7964M3799a68341k8110h770I7626a20008q009
18425a28017A701c58126a34300M1681C24526J1910I2783N6242L8909C5582c56259
18413D261K78965b16110I4936B6109A0316J23343a19323k32551g3169A04978H099
18401A47413o7669c991k3475B8076K9506b55102J7177h52F382b74012J33443A51288
18388c74099E44J80854b02012H0249L04674A29033d3308J4060p86C43700i6397
18376b02313N1372A60391L2690g0624c2263l15027D01512C4630e82j61287e7193
18364a82221H1771L1408a01498j1045B06497p4133k0920a41609j04642R7361f4670
$$ y = [-631696, 178723, -390532, -32321, -147097, -173709, -122678, 149751, -400416, 231426, -28772, -138125, -191623, 18723, -198406, 97964, 141763, -168341, -196451, -8770, 97626, -120008, -128017, 1701, -358126, -134300, -92619, 324526, 336436, 92783, 149025, 187934, 35582, -356259, 4261, 283226, -216110, 94936, 26109, 10316, 133659, -119323, -351874, -73169, 104978, 8099, 147413, 79744, -3991, -27466, 28076, 57582, -255102, -237925, -852, 6382, -274012, -140569, 151288, -374099, 544, 181398, -202012, 80249, 384923, 129033, -43308, -29248, -30034, 343700, -96397, -202313, -150941, 160391, 193081, -70624, -32263, -347290, 401512, 34630, -582, -161869, -57193, -182221, 81771, 113179, -101498, -112543, 206497, 132364, 111444, -141609, -246251, -148890, -64670]
18352d1377l1475B7750a45204O4527J2610C6581c8566k7759b8924j31175j77499
18341c37598d5986A21467a50584j31814O1917K1709O3084q7715A10631C8738g4207
18329a44684b3680l62430h4386k55878i7974c4813A0925b47714d9819C09123D5732
18317b31400a08129J1669j20876A76055a49580k4512g9291k9693b5619k04532
18307b30151k58987b8629l38164C3251k477J426L31809a22661E5873b438D205
18295B43193J53054g8948L8970R370l9261q1390B5126c27096A28728K16037G9581
18283A66422b67905C15L90343A63650p8385b38025A04001J20879a77001n0394
18273b27395d8788A74392a16954E5721b41543E1119a80544c7867j25949j2152
$$ y = [-41377, -72852, 27750, -145204, -80677, -68067, 36581, -38566, -66325, -28924, -160099, -337598, -45986, 121467, -150584, -282398, -220481, -198772, -135688, -223403, 110631, 38738, -74207, -144684, -23680, -386110, -84386, -340264, -97974, -34813, 10925, -247714, -49819, 309123, 45732, -231400, -108129, -96460, -217336, 176055, -149580, -174092, -79291, -108984, -25619, -230151, -489138, -28629, -366793, 33251, 30774, 32200, 364009, -122661, 55873, -2438, 4205, 243193, 396247, -78948, -39978, -30608, -69869, -151259, 25126, -327096, 128728, 344765, 79581, 166422, -267905, 315, 390658, 163650, 85265, -238025, 104001, 224880, -177001, -227395, -48788, 174392, -116954, 55721, -241543, 51119, -180544, -37867, -163816, -175968]
18263a75968a2293A47283a63128B6301b01506D01689j78315E4913a58166q4646
18253b42812a01897f798k13769a8078k3232j58494B05701c11438e7074g080A16977
18241A90652k5346a52458D32232B7276O0557b26745p1755N3905J2455j06168h9224
18229i3608F8712k6324K5285j8984c6256C3365a8482j82133C60746b7206I9032
18217i4180A05102a5598C34868B4900c60827M5000A6470h0443P754k13274i191
18205a74393A23856d9517j47882H6478B9073c91266C74609A1409R701b75432r4353
18194c69785A84348a11074j18632d0543A1795a69448M2197A30113f7698j66551
18184b34249J13334a770k72307J1860I1642J41272d66I1390n563a00545o4838
$$ y = [-175968, -12293, 147283, -163128, 26301, -201506, 401689, 223374, 54913, -158166, -242812, -101897, -6798, -220567, -18078, -41310, -199804, 205701, -311438, -57074, -7080, 116977, 190652, 165306, -152458, 432232, 27276, 87833, -226745, -298500, -244595, -232140, -338308, -89224, -93608, 68712, 42388, 67673, 48689, -36256, 33365, -18482, -200615, 360746, -27206, 99032, -94180, 105102, -15598, 334868, 24900, -360827, -315827, 16470, -80443, -72689, -285963, -9191, -174393, 123856, -49517, -197399, 86478, 29073, -391266, 374609, 11409, 21110, -275432, -369785, 184348, -111074, -229706, -40543, 11795, -169448, -127251, 130113, -67698, -234249, -120915, -1770, -274077, -262217, 91642, 232914, -466, 91390, 85827, -100545, -165383]
18173a65383A67437a82372j7423o149j05481a02970i058k00140j7111L6416e211
18161b44396a15300n0530F6231Q7631b8095J019j13923B07439a13654E4739a80456
18149A95189f0555k30814L2795g7710j895A76664b0425E7436a94740e8991a7952
18137b80616B2481d9485B44077R3930b7079j60185m0827R0157A94458d1394l10674
18126c52068a28186A25804f1414j22142A72292l8544J1490a81122g6578C8432
18115D55589a90360H0592d4813k34037d3594j3134j1327b8273F8547L85969a6443
18103G2523J43637c8015k7692j16394I420b69253c379B18379a1706j87400B69482
18091a06719M7832J8691B92805C3381h6576A12255G193e1723G909J90308l219
$$ y = [-165383, 167437, -182372, -199795, -205944, -311425, -102970, -9058, -209198, -226309, -189893, -5211, -244396, -115300, -165830, 66231, 153862, -28095, -27076, -140999, 207439, -113654, 54739, -180456, 195189, -60555, -291369, -258574, -77710, -79605, 176664, -20425, 57436, -194740, -58991, -17952, -280616, 22481, -49485, 244077, 338007, -27079, -187264, -228091, -137934, 194458, -41394, -352068, -128186, 125804, -61414, -183556, 172292, 133748, 145238, -181122, -76578, 38432, 455589, -190360, 80592, -44813, -278850, -43594, -56728, -68055, -28273, 68547, 454516, -16443, 72523, 216160, -38015, -65707, -182101, 9420, -269253, -3379, 218379, -11706, -199106, 269482, -106719, -58887, -40196, 292805, 33381, -86576, 112255, 7193, -51723, 7909, 198217, 194998]
18080A94998b1083j8074k29398j16954A02703a33281k33546a9822E9372c56769
18069b40141a15251B12589b67032J14428B12769J3412g3161B46454l7553g0294
18058b50884k2956D4021b48712b3261o4706j69726N1435B70908h1615A24027n884
18047A18143A7423O5091b48584a8581E3668b36882M4430A48416p192a68090J8773
18036a49317N6024j86561f2386j59420F6153O4206c0091A40824C5251J13113c0502
18024A89305a28034B47722a22851c4829m179p4059D30809b77225f8074j20602
18014a88676f7545H8597B4097a9222j6080G7173J89606a29350e0319G1344h7925
18002a05094B4646a51846E7761e8199b2848C17742G6211b8410j39930o7612A00827
$$ y = [194998, -21083, -39157, -268555, -385509, 102703, -133281, -366827, -19822, 59372, -356769, -240141, -115251, 212589, -267032, -152604, 212769, 226181, -73161, 246454, 208901, -70294, -250884, -273840, 44021, -248712, -23261, -87967, -257693, -206258, 270908, -81615, 124027, 118143, 17423, 82514, -248584, -18581, 53668, -236882, -192452, 148416, 141224, -168090, -149317, -93293, -279854, -62386, -221806, 66153, 130359, -30091, 140824, 35251, 148364, -30502, 189305, -128034, 247722, -122851, -34829, -39008, -113067, 430809, -277225, -68074, -188676, -67545, 88597, 24097, -19222, -35302, 77173, 266779, -129350, -50319, 71344, -87925, -105094, 24646, -151846, 57761, -58199, -22848, 317742, 76211, -28410, -168340, -235952, 100827]
17990a76915l6373e8194A5783M4318d21999A42612D077Q488K3471a4182B07545
17978C27656g6869j30836B41710h7186B86799G2801O4085g2605D11705a14145
17967F9086J14933a73835K2592k0124N0350M5308B05687b10226H9361d4286F6547
17955A64406D1106b1479j05214a2676k1452B28625a20254D17696A3661a0697j1730
17944b2427B83905e7161k1333R53J0514B45051I318c76184a23141B2475a62905
17932F282c30494C9543d9399q0240L0289F1060a07199L4089k62991L1279A0334
17920A79197p1657K84847H1800A4278J48212J385E7542n043g6329m0574a6701
17908B180h8703o081F4559c03601O8101i6010p0169C29655A29790e28976E1481
$$ y = [-176915, -213288, -58194, 15783, 60101, -421999, 142612, 4077, 12565, 36036, -14182, 207545, 327656, -76869, -207705, 241710, -87186, 286799, 72801, 136886, -72605, 411705, -114145, 69086, 184019, -173835, -151243, -171367, -121017, -75709, 205687, -210226, 89361, -44286, 66547, 164406, 41106, -21479, -126693, -12676, -34128, 228625, -120254, 417696, 13661, -10697, -22427, 283905, -57161, -78494, -77541, -67027, 245051, 9318, -376184, -123141, 22475, -162905, 6282, -330494, 39543, -49399, -129639, -99350, 61060, -107199, -73110, -336101, -304822, 10334, 179197, 107540, 392387, 81800, 14278, 162490, 163875, 57542, 52499, -76329, -116903, -16701, 2180, -88703, -94784, 64559, -303601, -235500, -96010, -166179, 329655, 129790, -528976, 51481]
17896C8291A5331N3508b05458B36274I9866L9901b3502B15175d4352k54996B35200
17884D5109J08866J25237b70640b8842o2529H5722a97191K9579k4055p8839o5686
17873c36192A18893h2329I2328h4564K4158j51376j22504C09178A00882J17844
17863B18726a06903C67169g6945a967l44857a05553j3371B06767I3268b4151A01356
17851e349A32447a00272I7952b13664E4426f1228D54214G9744a90440e3139A74084
17839b0650m8855q8147B29587J58048B897b26285m14642D4853b883A89281g1720
17827g1345R876k0119D0009f0678B511N4323a86602e6383m0313A39449J6967f2543
17814a69819k41823A5878K95861H3801K10371a68379O5146C00138b90335d4036
$$ y = [38291, 15331, 68839, -205458, 236274, 99866, 139767, -23502, 215175, -44352, -299348, 235200, 45109, 153975, 279212, -270640, -28842, -91371, 85722, -197191, -167612, -191667, -270506, -336192, 118893, -82329, 92328, -84564, -60406, -211782, -334286, 309178, 100882, 218726, -106903, 367169, -76945, -1967, -346824, -105553, -118924, 206767, 93268, -24151, 101356, -5349, 132447, -100272, 97952, -213664, 54426, -61228, 454214, 79744, -190440, -53139, 174084, -20650, -69505, -157652, 229587, 387635, 2897, -226285, -640927, 44853, -2883, 189281, -71720, -71345, -61469, -81588, 40009, -60678, 2511, 56834, -186602, -56383, -96696, 139449, 156416, -62543, -169819, -411642, 15878, 311739, 83801, 294172, -168379, -103233, 300138, -290335, -44036]
17803A11430a4187C6649j0977J5055e2430B52459a73844f0266k2255D9521J28633
17792A78154i5117L0239E2798p112J69075r9858P886L03563r1372e4352q6218
17781a40570d179j68433m0125A33303D5644i5959F216K0484b96490B62662I2619
17769a01837b3189B20076b45431A44481f3449C17385j43002h0201j55463J13224
17759a22440n7335C6920A4703J74431H3754b40193B354J64433a11705G9808L4132
17748A13940m4971E008L4062d5804k27928A56189a25512L5667L0886A99712K46628
17737D46340d2414q2947A2982b82685G9887c7709j96201h0967j01428R0082j50162
17726b42475A8699c566m8803m00922F5429J67260N0703A39901k3805J85779F7175
$$ y = [111430, -14187, 36649, 25672, 40727, -52430, 252459, -173844, -60266, -82521, 49521, 178154, -95117, -64878, 52798, 45686, 214761, 114903, 122789, 426352, 334980, -54352, -140570, -4179, -172612, -212737, 133303, 45644, -95959, 6216, 26700, -296490, 262662, 92619, -101837, -23189, 220076, -245431, 144481, -63449, 317385, 174383, -80201, -235664, -122440, -179775, 36920, 14703, 189134, 83754, -240193, 2354, 166787, -111705, 79808, 113940, 68969, 5008, 39070, -45804, -273732, 156189, -125512, -89845, -58959, 199712, 446340, -42414, -125361, 12982, -282685, 79887, -37709, -233910, -80967, -182395, -92313, -242475, 18699, -3566, -52369, -453291, 65429, 232689, 283392, 139901, 116096, 301875, 67175]
17714D57046b07271C1555d2542A09817a46105E0045d3461j40768N1263K0357A18363
17702a7947C79647e4034I6108D7977a08545B98637l9588H478J17235a06451b4679
17690a40196B2989i0999k8231A69505G7388J57797a35089B903J6081e7616l18498
17679c76114E1300J18873b38365Q2412j50653a42635F2695i8024B93992A2448
17668i5722A52401o4497b21617B73530n4287g3372B2841c71732a15291j0514j1947
17657a37752j63861B5854h6378c3641j34737B04286a8334G6628l7698g7459r7938
17646a75397D5519a27020f2795A99373i5682j80271a10114k1697f0850d666j39409
17635a44075F6561L1498L4497b07485A60994j3335P5838r5389a65966C83505A19477
$$ y = [457046, -207271, 31555, -42542, 109817, -146105, 50045, -43461, -184229, -132966, -112609, 118363, -17947, 379647, -54034, 96108, 47977, -108545, 298637, 259049, 8478, 125713, -106451, -24679, -140196, 22989, -90999, -119230, 169505, 77388, 235185, -135089, 2903, 18984, -57616, -376114, 51300, 170173, -238365, -155953, -306606, -142635, 62695, -98024, 293992, 12448, -95722, 152401, 87904, -221617, 273530, 219243, -73372, 22841, -371732, -115291, -125805, -137752, -301613, 25854, -86378, -33641, -168378, 204286, -18334, 76628, 38930, -77459, -175397, 45519, -127020, -62795, 199373, -95682, -275953, -110114, -131811, -60850, -4666, -144075, 66561, 98059, 132556, -207485, 160994, 147659, 223497, 128108, -165966, 383505, 119477]
17623b8911A10303i7240l4714A58859b55147J07675c7828a318A21682D7885Q3850
17612A31735Q5336J11283a19718A83452n816a06573M2130C17405h514l48751E03756
17600a33317L7541B17033J1364a46572q1252a09536G0519N2271L8725h9777C40722
17588a10511A46551o5761J57505C940K72143D876b46084E2151k3044L53909a64237
17576G7909J40197B8161j940b26555A53612b5357A48034a9647F3442J88130Q0885
17565C32457j29471a55155d2515A22317B707b53835C19863D2645K74635k5038
17555B92242j6980F6026a29837c8810m1097B44170C3784E883K78902M4921j31665
17544A98041i3784A3950J44537p5157b16367m0853o0280f100C13533A11848Q168
$$ y = [-28911, 110303, -97240, -131954, 158859, -255147, -147472, -37828, -1318, 121682, 47885, 131735, 217071, 328354, -119718, 183452, 177636, -106573, -64443, 317405, -8514, -357265, 503756, -133317, -95776, 217033, 228397, -146572, -227824, -109536, 70519, 122790, 161515, -89777, 340722, -110511, 146551, 80790, 238295, 3940, 276083, 4876, -246084, 52151, 29107, 383016, -164237, 77909, 218106, 28161, 26221, -226555, 153612, -25357, 148034, -19647, 63442, 251572, 332457, 202986, -155155, -42515, 122317, 2707, -253835, 319863, 42645, 317280, 292242, 275262, 66026, -129837, -38810, -79907, 244170, 33784, 5883, 284785, 329706, 198041, -93784, 13950, 158487, 83330, -216367, -257220, -317500, -6100, 313533, 111848, 120016]
17533A20016E2285H90M4469b5416D4351e4739j4405I5959d5922b0556A88019K3966
17521B11985m1565P741d6266p3971a2354k49513F4005a06403M5294I968b39071
17509A75338E08f0508A54884P9351b30268A26925Q2667h9041B00751O363K41524
17498D48638a08300G5677a50259A21856l0347K6756J35554E8205J37056G574M61073
17487D68647A26733K23177r5599j5804E7978c15568C66364j08394d2911E4593
17476B56359O987j7992n2732J40579A14288J18611I7428P3271m0692l2334a37611
17464C23736m3806f9934C7582L2836J735e895B06715d1041A88162P4606B7511
17452B17022J50448P7899A05129L31416G4325J08222K72437A80742C231J06449
$$ y = [120016, 52285, 890, 45359, -25416, 44351, -54739, -69144, 95959, -45922, -20556, 188019, 211985, 170420, 178161, -46266, -120237, -12354, -261867, 64005, -106403, -61109, 9968, -239071, 175338, 508, -60508, 154884, 234235, -230268, 126925, 209592, -89041, 200751, 207114, 448638, -108300, 75677, -150259, 121856, 91509, 118265, 253819, 58205, 195261, 7574, 468647, 126733, 349910, 254311, 238507, 57978, -315568, 366364, 257970, -42911, 54593, 256359, 263346, 245354, 192622, 333201, 114288, 232899, 97428, 170699, 130007, 97673, -137611, 323736, 279930, -69934, 37582, 70418, 72153, -5895, 206715, -41041, 188162, 262768, 27511, 217022, 367470, 445369, 105129, 436545, 74325, 182547, 454984, 180742, 3231, 109680]
17442A09680d2260A35231J40688N0862j42517F9295L56234D5437K52474K59719
17432E57630b31544a6850p8239D1081L54296A08156M64724A79740Q8286K9788
17422B97814K2779A43721K26052l4961m4350J68758A86618K29289p6210r6994
17412B42703m9805D0269J08995E7347L23577c07336a068A42061G0053J68207q7022
17401A51238l8255c3923A99849n3590F7361b80773d4675B37602l1760B0963K30501
17390B51464g1155B09633k6659J64589I7188a05013F2548J07363D6015g9144G6183
17378B0468J83789n9898K2261Q6923h7817q9673A00055a46714H1879a24245L3705
17367i0540A73757J07103r9022J4463J04242J3155n0403J25906A87118a7874C7609
$$ y = [109680, -42260, 135231, 275919, 326781, 184264, 69295, 425529, 45437, 297911, 557630, -231544, -16850, -95089, 41081, 395377, 108156, 572880, 179740, 268026, 297814, 320593, 143721, 369773, 334812, 290462, 459220, 186618, 415907, 339697, 242703, 192898, 40269, 149264, 57347, 380924, -307336, -1068, 142061, 70053, 238260, 151238, 112983, -33923, 199849, 146259, 67361, -280773, -44675, 237602, 205842, 20963, 251464, -71155, 209633, 182974, 347563, 97188, -105013, 62548, 169911, 46015, -79144, 76183, 20468, 204257, 144359, 166620, 253543, -87817, -177490, 100055, -146714, 81879, -124245, -90540, 173757, 280860, 181838, 196301, 300543, 313698, 263295, 389201, 187118, -17874, 37609]
17355A03444N9210I28L27822j03411m1197d4437o537A26524J98304r2511K9383
17344B61700r3578d284A53571a39554e9945B28812E2192a77518B10164L09796
17334E19960B0377J25669p1092N781g3991A93046m5070K87879E2726J75491b16042
17322A33384R3275p8132o0607J26363J50163l6787A19098D4026R9575D7414K92672
17311C40086G5720J15398K38858i6141C43853B5084J68373J64546a33588C03981
17300C38217p0368C8015N3810f5676E03135k35266c1347G073K72414r4021J35656
17289C21122D0282a4900C27074A43905J22684a1486I0208K27186j27668N4423
17279B44149a20650C89253I2984g9031D50833A04250J76559K923A6231h3171B31875
$$ y = [103444, 162654, 928, 328750, 225339, 184142, -44437, -50974, 126524, 324828, 232317, 261700, 168122, -4284, 153571, -139554, -59945, 228812, 52192, -177518, 210164, 519960, 20377, 146046, 74954, 80735, -73991, 193046, 147976, 435855, 52726, 228217, -216042, 133384, 226659, 148527, 87920, 214283, 364446, 327659, 119098, 44026, 143601, 47414, 340086, 75720, 191118, 429976, -96141, 343853, 25084, 193457, 358003, -133588, 303981, 338217, 267849, 38015, 91825, -65676, 503135, 267869, -31347, 7073, 279487, 185466, 321122, 40282, -14900, 327074, 143905, 266589, -11486, 90208, 317394, 189726, 244149, -120650, 389253, 92984, -79031, 450833, 104250, 280809, 283732, 16231, -83171, 231875]
17267e1653B87521o1387I5964K50298j46471o9176l3304J59334F7597b64934A64468
17255E5856a36542B74377j17464K0489a5469A53404E5019K94937A13395a47326
17244A23330K30738A36031O6085q3158c1181B55349A20940a69364l2168B34551
17233E58786j58838j26147n6149N8581P1397j5601I7986m2652K50659H3534M1676
17222A25210c28471A19571M3796Q5296k6993p5077K25535m8957p2428M2063K9478
17211C22284L9779I7177L88789D4917L32394j80060i6879D74568k36000l7903
17201B00665r1045K89995Q1166c2810A53090Q3095K6477l6790q0528L15114j30674
17190C29784q2975O9588j34419a62444A07746M29585B52581o9920j7209M00868
$$ y = [-51653, 287521, 226134, 95964, 346262, 199791, 130615, 97311, 256645, 67597, -264934, 164468, 55856, -136542, 274377, 156913, 177402, -15469, 153404, 55019, 349956, 113395, -147326, 123330, 354068, 136031, 202116, 118958, -31181, 255349, 120940, -169364, -201532, 234551, 558786, 399948, 273801, 217652, 276233, 347630, 332029, 97986, 55334, 305993, 83534, 125210, -328471, 119571, 163367, 248663, 221670, 146593, 372128, 323171, 250743, 292806, 322284, 362063, 97177, 485966, 44917, 377311, 197251, -96879, 474568, 238568, 200665, 109620, 399615, 480781, -32810, 153090, 236185, 262662, 225872, 145344, 460458, 329784, 246809, 316397, 181978, -162444, 107746, 537331, 252581, 182661, 165452, 566320]
17180E66320e3375D20509A56271K53160N6384B25020B2302r551K38211r2617E8793
17168B33673m810A08058m7686J8087e8463B88836A23732N5932L76329k38103j41849
17157A76041m0783M00296k0300j41563F474J77223L7384J73224J51318p8013A66595
17145B70215Q8199n0998m3106J16587A89927J23212H4517O878J32242J3450J96006
17134D33093j14592A24116J82089K61615A96954R8021O984L9552o7401K02518
17124D76628k4969J6714j96073M7749o5746K23531j45636j57068J07518M1321
17114C23969Q0433n6857J00775j15853D6271N11730H0087N64975j06054B21578
17103E17499k35369J81112B6751L22684J80717k48677K17461k0058J59712k77886
$$ y = [566320, -53375, 420509, 156271, 409431, 465815, 225020, 22302, 12751, 250962, 158345, 58793, 233673, 228863, 108058, 60372, 78459, -58463, 288836, 123732, 179664, 555993, 317890, 176041, 135258, 535554, 515254, 373691, 6474, 183697, 221081, 394305, 545623, 467610, 166595, 270215, 358414, 307416, 264310, 380897, 189927, 313139, 84517, 91395, 223637, 237087, 433093, 318501, 124116, 306205, 567820, 196954, 294975, 301959, 341511, 274110, 476628, 451659, 468373, 272300, 320049, 254303, 477834, 332198, 175130, 282648, 323969, 404402, 347545, 448320, 332467, 46271, 558001, 80087, 645062, 539008, 221578, 517499, 282130, 463242, 26751, 349435, 530152, 281475, 498936, 478878, 638590, 360704]
17093C60704K39846B45137q8429N95015l63971A89798M40194o9938j28252p2891
17083C58911B0573K05926J29089q5408K12942K48826C17743L20970k47177J52932
17073E44468j33516L08039l38007J49203k13p1786A47190J84705p8313K68854
17063E22436k09503A12796J27725L28508r7530n8260j01361J16228K08161k26672
17053D09595J71749j04121P9210m2102o1358j65954J4468K87180j80699l5912
17043C72056K58724M5123k49163M59879D01272j26576N1092Q7515J95540k19273
17033C89570L29469j96328K87387l56799J05619K62750C03486L62422k71097J65638
17023E60449k06716K77482j57053J84070j46989L53506k78405e215A051916D17681
$$ y = [360704, 600550, 245137, 156708, 751723, 387752, 189798, 629992, 560054, 431802, 358911, 20573, 226499, 355588, 270180, 483122, 731948, 317743, 638713, 391536, 544468, 410952, 718991, 380984, 530187, 529974, 458188, 147190, 331895, 253582, 522436, 312933, 112796, 240521, 569029, 471499, 413239, 311878, 428106, 636267, 409595, 581344, 477223, 556433, 514331, 452973, 287019, 301487, 588667, 407968, 372056, 630780, 675903, 426740, 886619, 401272, 274696, 325788, 413303, 608843, 389570, 719039, 522711, 810098, 453299, 558918, 821668, 303486, 665908, 394811, 560449, 353733, 631215, 474162, 658232, 511243, 864749, 586344, -5215, 1051916, 417681]
17012F93902N3416n6090j28840K17073o7620j45380J63898j51863K00045C19733
17001A085306l71916L16870l65090K37038Q18L18920n24177n1270J73437Q7017
16991I06953j06779K44691k35277P0811m34458N71472k60371N7063Q956j65302
16981F57759J30370J49976K38482l24323Q711J65676n03838L33381J29733j89880
16971G96047J90203k94862N4633L23727K57936k51976O5011k65236K11467k68689
16961H18261J14405Q0974m3199Q9185J77768j67192k20360K01857j50505K6403
16951I27597J3988L36817K4358l82294J54832j8701j24740J59860q5439L52393
16941A358671l98140K50709l57722K16438Q8624j23242K89114j13673k2989m7852
$$ y = [693902, 747318, 691228, 562388, 779461, 711841, 566461, 730359, 578496, 778541, 319733, 1085306, 713390, 1030260, 665170, 902208, 903026, 1221946, 697769, 646499, 819936, 906953, 800174, 1044865, 809588, 880399, 445941, 1017413, 757042, 814105, 823061, 657759, 788129, 938105, 1176587, 852264, 860975, 1026651, 522813, 856194, 985927, 796047, 986250, 691388, 746021, 1069748, 1327684, 1075708, 1140719, 875483, 1086950, 818261, 932666, 1013640, 970441, 1059626, 1237394, 1070202, 849842, 1051699, 901194, 927597, 941585, 1278402, 1302760, 920466, 1075298, 1056597, 931857, 1091717, 1006278, 1358671, 960531, 1211240, 853518, 1069956, 1158580, 1035338, 1324452, 1210779, 1187790, 1139938]
16931A139938J39178j10452R8383k38327M8408K09465p281j98417N2725J45679
16921A279299j06645O3260l6733L23641k08454L25497j27485l85810L56263m32044
16911A050789M30659J83496m86866k20813N62854r1677K48885j40028q0268J69948
16901A626979K3710j86354m7310K96437N7373l375j47273R8934J53727K1512M4601
16890A938961k27092N3553K32654R3673Q8785j91431j94425L08658l32512L38974
16880B109798R9838l44358P5640j90621M67477m184J19675p5614o1283j47357
16870B049011P1704J27157r4999K79786k00622L18668p4763J99622J1422k76876
16860B410110O6409J88939K01498j24984j12689K00558o3206J11637P277j59129
$$ y = [1139938, 1279116, 1168664, 1267047, 1028720, 1077128, 1286593, 1279312, 1080895, 1133620, 1279299, 1172654, 1235914, 1199181, 1522822, 1314368, 1639865, 1512380, 1126570, 1482833, 1050789, 1481448, 1664944, 1178078, 957265, 1520119, 1428442, 1677327, 1537299, 1457031, 1626979, 1650689, 1464335, 1417025, 1713462, 1770835, 1767460, 1620187, 1719121, 1872848, 1894360, 1938961, 1711869, 1765422, 1998076, 2091749, 2180534, 1989103, 1794678, 2103336, 1770824, 2109798, 2209636, 1865278, 1940918, 1750297, 2217774, 2213590, 2333265, 2257651, 2196368, 2049011, 2120715, 2247872, 2152873, 2432659, 2232037, 2550705, 2475942, 2675564, 2686986, 2410110, 2476519, 2665458, 2866956, 2741972, 2629283, 2829841, 2766635, 2878272, 2885549, 2726420]
16850B726420P9435L5286p5514N30480k4423k52647K35990j76035J84332J56606
16840C419930K05399j6660k9601P9375K91919P6382l89736L21586L01597j41059
16830D119132r9342J62556k73193L31660K82167L3485L38701m21144J7302L73859
16820D865183J07802L52154m33603L58919j88914K15783L80468j86792L53566
16811E824566J27257j44680O16725r0523j62158K45994J51667P4200m4390J35506
16801F734164O17475j80811L37483L41442k1672N99929k08020n5561L87904J78762
16791H731095N25048L92819m8048J95202K10891M17078L49754j22521M27353L28772
16781A1407443O65179M5920J20705L89609O00097M27306K72167N58970N73310
$$ y = [2726420, 2805855, 2841141, 2765627, 3296107, 3271684, 3019037, 3255027, 3078992, 3263324, 3419930, 3625329, 3608669, 3579068, 3658443, 3950362, 4026744, 3637008, 3958594, 4260191, 4119132, 4019790, 4182346, 3909153, 4240813, 4522980, 4556465, 4895166, 4474022, 4491324, 4865183, 4972985, 5325139, 4891536, 5250455, 5061541, 5277324, 5657792, 5471000, 5824566, 5951823, 5807143, 6423868, 6333345, 6171187, 6417181, 6568848, 6643048, 6598658, 6734164, 7351639, 7170828, 7508311, 7849753, 7828081, 8428010, 8219990, 8164429, 8552333, 8731095, 9256143, 9648962, 9600914, 9796116, 10007007, 10424085, 10773839, 10651318, 11078671, 11407443, 12072622, 12118542, 12239247, 12628856, 13228953, 13656259, 13928426, 14487396, 15060706]
16772A5060706J52073J012409J85121J116793L12078M31874O37524O43992R53689
16763B0506259O33864Q32796O49090R20866Q36788J117011R28451J124488J000251
16754B8549864J459585J428363J283142J364835J806504J697408J776288J631600
16746D0997589K186746K088336K691556K172497K673503L017151L079132L514441
16738F2420951L243981M118331L936474M517950M789971N213741N022720N966348
16730I9230467N735428O379275O556451O738391O934402P063296P414813O857858
16722A52910381O631809O161620N547061N003679L411987L328754J092328O96133
16714A84783752j054222k271396l228562m387638n027956o333693o381424o964307
$$ y = [15060706, 15212779, 16225188, 16410309, 17527102, 17839180, 18271054, 18908578, 19552570, 20506259, 21140123, 21972919, 22622009, 23542875, 24379663, 25496674, 26425125, 27549613, 28549864, 30009449, 31437812, 32720954, 34085789, 35892293, 37589701, 39365989, 40997589, 43184335, 45272671, 47964227, 50136724, 52810227, 55827378, 58906510, 62420951, 65664932, 69783263, 73719737, 78237687, 83027658, 88241399, 93264119, 99230467, 104965895, 111345170, 117901621, 124640012, 131574414, 138637710, 146052523, 152910381, 159542190, 165703810, 171250871, 176254550, 179666537, 182995291, 184087619, 184783752, 183729530, 181458134, 178229572, 173841934, 168813978, 162480285, 156098861, 149134554]
16706A49134554p080205p401551p010267o982983p075471o275395o630029o142502
16698I4536151n260033n442814m567367m934956l911078m333999l772138l450957
16690E8862809l292150l245148k367289l422680j882132k155457k308693j992148
16682C8197112k078165j073489k220310j119643j888171j208385j331399j301353
16674B5976197j120987p46745j123629r83577o79015q59238j207169p90483j29798
16665A8335556r15111q07322o91497m11349m82239n40608o46046l70169j09703
16656A3361512r12378N3977o48887k65540n37037l11411l65403l63563l13125
16647I698145k80804j6517n41598j51169j77751p8706n70913j7768l63973o6173
$$ y = [149134554, 142054349, 134652798, 127642531, 120659548, 113584077, 107308682, 100678653, 94536151, 89276118, 83833304, 79265937, 74330981, 70419903, 66085904, 62313766, 58862809, 55570659, 52325511, 49958222, 46535542, 44653410, 42497953, 40189260, 38197112, 36118947, 35045458, 32825148, 31705505, 29817334, 28608949, 27277550, 25976197, 24855210, 24108465, 22984836, 22001259, 21322244, 20463006, 19255837, 18465354, 18335556, 17420445, 16613123, 15921626, 15510277, 15028038, 14487430, 13841384, 13471215, 13361512, 12449134, 12503111, 11854224, 11588684, 11051647, 10740236, 10374833, 10011270, 9698145, 9417341, 9400824, 8859226, 8708057, 8530306, 8451600, 7880687, 7862919, 7498946, 7432773]
16637G432773m5003n29160J48927r3069l6544n30381N0622r698k98416k93280
16627E796771K4331m71689j55274J69763R8434n04174n1259j45981L12951n99882
16617D473991J18638j40371K07897l16288K277k22672k66440K61308o4736k42493
16607C811111M5227q2411J5739l81566L01531j77780q6608k92142O417O0471j50105
16596C069884K68374k96449k31344K02807l96801K24055j93722K4134j68199K20709
16586B723448k9705l27762q2010j1320k8914L1360R2226J12259P4276l30743L03731
16575B526846l94494j740M6658J9945k22570r073J95699m17341L94443n49677
16565A588696L78428L4763l44308K39313l88080K0276K37934k25026M5121m8804
$$ y = [7432773, 7387770, 6858610, 7007537, 6914468, 6877924, 6347543, 6398165, 6388467, 6090051, 5796771, 5821102, 5349413, 5194139, 5363902, 5462336, 4958162, 4906903, 4760922, 5073873, 4473991, 4592629, 4452258, 4660155, 4343867, 4346144, 4123472, 3857032, 4118340, 4053604, 3811111, 3856338, 3773927, 3789666, 3408100, 3709631, 3531851, 3445243, 3153101, 3159518, 3219989, 3069884, 3338258, 3041809, 2810465, 3013272, 2616471, 2840526, 2646804, 2670938, 2502739, 2723448, 2693743, 2365981, 2283971, 2272651, 2243737, 2275097, 2367323, 2479582, 2553858, 2223115, 2526846, 2132352, 2130612, 2177270, 2197215, 1974645, 1965572, 2161271, 1743930, 2138373, 1588696, 1967124, 2001887, 1657579, 1896892, 1508812, 1529088, 1767022, 1541996, 1587117, 1538313]
16555A538313K14978j01465r3186p9400N5926n62565O86624J20782j98644l82619
16545A198744K35843P7655l12488L00599k02922j5751J02330n7029P0362M1824
16535A439167j62575r914l33110L22326J70273n01592L47488l39843O26574p46418
16525H12376Q3765Q4674p7820K04147l54697N2322k88078K72809M5650P6022P732
16514I18902J50799m0258K5802j6328j59248j72766R3140n0995J36840P597J47963
16503A041448k58374J52300p7508r1843J68942M2450J11278m50870j22919L24128
16493H39032j72329J14269N0669O8072k23091P4913j58959l4002j780K90719l39581
16482E07932K33347p6301j37706K59132j54434m1939k55416N92686l93612O4572
$$ y = [1538313, 1753291, 1651826, 1558640, 1479240, 1535166, 972601, 1659225, 1780007, 1581363, 1198744, 1434587, 1512242, 1199754, 1500353, 1297431, 1281680, 1384010, 1326981, 1397343, 1439167, 1276592, 1266678, 933568, 1255894, 1426167, 924575, 1272063, 932220, 1558794, 812376, 896141, 980815, 902995, 1107142, 752445, 804767, 516689, 789498, 835148, 911170, 918902, 1069701, 1029443, 1055245, 1038917, 879669, 706903, 800043, 749048, 885888, 893485, 1041448, 783074, 935374, 857866, 766023, 934965, 977415, 1088693, 637823, 514904, 839032, 666703, 780972, 831641, 899713, 676622, 751535, 592576, 558574, 556794, 847513, 507932, 741279, 664978, 527272, 786404, 631970, 590031, 334615, 927301, 533689, 598261]
16472E98261m1999k76207N69647l03991P933Q2170l7578k6614k9540r888j98420
16461C33774K42709j94032O4457R0322K10418B12450J28860J93936J11881o7288
16451E79839J7255k81320J19726j09788M11472j17669j18828m2946k0156J12486
16441E50071Q4918Q4925k79873m4980K30441j36929J9439B27486J13755j02569
16431B38672J81996j13987K00404K25921j85020r0413j93583o4753L23034j5815
16421E06456k03356k8576b3368G48163k97344k23403J05676E7451K94608p8818
16411B73241J360K99540k2685k15346R9882A82781J43850N5938n1016O4300J51487
16400E47340k24369J1739m5758o665G6603B3554a68660C6184L05550K84110B55732
$$ y = [598261, 556262, 280055, 849702, 545711, 553644, 635814, 598236, 571622, 542082, 532194, 333774, 576483, 382451, 446908, 537230, 747648, 212450, 341310, 535246, 647127, 579839, 597094, 315774, 435500, 325712, 737184, 619515, 500687, 457741, 437585, 550071, 634989, 719914, 440041, 395061, 625502, 488573, 508012, 227486, 341241, 238672, 420668, 306681, 507085, 733006, 547986, 457573, 263990, 199237, 522271, 506456, 303100, 274524, -23368, 748163, 450819, 227416, 333092, 57451, 352059, 273241, 274601, 574141, 551456, 336110, 435992, 182781, 326631, 382569, 331553, 395853, 547340, 322971, 334710, 288952, 282287, 76603, 23554, -168660, 36184, 341734, 625844, 255732]
16388A86042J21549J59941h348B23314n4197J68236A00069M7786J40655F5908
16377C28910j24288M9489J96254I9507K23100H8990K25745o4977K6817m1495q7523
16366A47557e6166D53261A42209R8959j2814a71703q407E92985A56288M07098
16356E63386B38763j9834H6770J17552N5118m3728p2303K32400G3178J18078r4995
16345I6261N3793K06301j43997a6438A87113J08154L23458A48515K83988A21871
16334I6132N5936c64496B11304P5388j16633a13325j473F2265J50272k7023j1276
16323A74238O6136j00251J68621D3832J2779c4307C18031A07565K51049p9156
16313B79458g9041C9430L7816J5241C4864K38513L7850d3754A01761J2615M37822
$$ y = [186042, 307591, 467532, -8348, 223314, 169117, 337353, 100069, 147855, 288510, 65908, 328910, 204622, 254111, 450365, 99507, 322607, 88990, 314735, 249758, 276575, 235080, 147557, -56166, 453261, 142209, 241168, 228354, -171703, -180110, 592985, 156288, 563386, 238763, 218929, 86770, 204322, 259440, 215712, 143409, 375809, 73178, 191256, 96261, 150054, 356355, 212358, -16438, 187113, 295267, 618725, 148515, 432503, 121871, 96132, 152068, -364496, 211304, 286692, 170059, -113325, -114798, 62265, 212537, 185514, 174238, 240374, 140123, 308744, 43832, 56611, -34307, 318031, 107565, 358614, 279458, -79041, 39430, 77246, 92487, 34864, 273377, 311227, -43754, 101761, 114376, 552198]
16302E52198f0344k8040A95736C4945R1880b60985H6781J09872n6921J62845i492
16290b1889C35647A44802a64063P7736L0191C23458d8332H3853J06257K8320k6629
16279A91801d0510J8128C49663h3654r0248A16962D2391F600g7283A66087B4088
16267b130A78528E4221a3986j22930e9657K5629D07424H0907J79184a20029j4186
16256a34215D22515p4949a6816F2585K12733f975B5719b06320A81961a37433A11391
16244f5161j08977e1323q6818d1640A67821a39442M7074d5073F7381a4704o8161
16233h2865C54958n3099A05413a37889A65791L10706A14126L8538k0401P9641
16223B11904E2059b63590D837K38775d6009j7423A31191f5833I4546a2214M288
$$ y = [552198, -60344, -88384, 195736, 34945, 126825, -260985, 86781, 196653, 139732, 302577, -9492, -21889, 335647, 144802, -164063, -86327, -56136, 323458, -48332, 83853, 190110, 218430, 191801, -40510, -22382, 349663, -83654, -173902, 116962, 42391, 6600, -77283, 166087, 24088, -2130, 178528, 54221, -13986, -136916, -59657, -34028, 407424, 80907, 260091, -120029, -134215, 422515, 347566, -16816, 62585, 275318, -6975, 25719, -206320, 181961, -137433, 111391, -65161, -174138, -51323, -138141, -41640, 167821, -139442, -92368, -45073, 67381, -14704, -82865, 354958, 301859, 105413, -137889, 165791, 476497, 114126, 152664, 132263, 211904, 52059, -263590, 4837, 243612, -46009, -63432, 131191, -65833, 94546, -12214, -7926]
16212g926D08696a67363O4680O744A82683m9865E1080f3779B82283j40860d1688
16200A33429J59508b66187C21805a91173H1947d9633B38096m8469a67131A31691
16189a83811D44383e9559j09515B0015J02260K14943G98a18379E2772a9128q2139
16178a01267C60913A72147c5694A0475d97795a2472l51139a34120H6691C0144
16167I8095b8678B1854J68463P110a73674N0512d4280A46356o7517C2630h6098
16155b36862C44912q0635H6095P4812a7744l73349E8772e8209o6347C13305q0594
16144B32711r0801h8183B45381A17366b25834d5477A63392b23916c4317q87a6024
16132G8383L5333d4239k43360A84026C2054O9781L01600r7972F261O0102K0008
$$ y = [-7926, 408696, -167363, -102683, -95939, 182683, 132818, 51080, -63779, 282283, 141423, -41688, 133429, 292937, -266187, 321805, -191173, 81947, -49633, 238096, 189627, -167131, 131691, -183811, 444383, -59559, -169074, 20015, 122275, 337218, 798, -118379, 52772, -19128, -101267, 360913, 172147, -35694, 10475, -497795, -12472, -363611, -134120, 86691, 30144, 98095, -28678, 21854, 190317, 197427, -173674, -123162, -44280, 146356, 78839, 32630, -86098, -236862, 344912, 264277, 86095, 160907, -17744, -391093, 58772, -58209, -124556, 313305, 232711, 141910, -88183, 245381, 117366, -225834, -45477, 163392, -223916, -34317, -35204, -16024, 78383, 113716, -44239, -287599, 184026, 32054, 101835, 403435, 305463, 6261, 66363, 86371]
16121H6371J34274b34879A86925h5341a9360A02906C7167c82665Q7040a02186
16110a442m06294A4348n586c3824A46155O9019a42329B77627D9004H51K86997
16099B87848M4534A12227A6429h0770c0603G9842h1486r3785F1219A4118a570
16087e340j26048E1932c4973j07203C03178a65114j2091A36620b084k52173J2730
16076b41527B2457K89504A42606a48146j9128g7146K4883A52946o3270a48929
16065b70743Q2360a0839j51817A28300d0452B14554i9680d3319q8748k2271j1644
16054a65982O4989G3233g8287A07569o333K23089a85752a4140j57850P2587k11636
16043c11039a26889k94860d6262R179A98134r7512c16941D1531c5226J1633k59168
$$ y = [86371, 220645, -234879, 186925, -85341, -19360, 102906, 37167, -382665, -295625, -102186, -1442, -407736, 14348, 8762, -33824, 146155, 215174, -142329, 277627, 49004, 851, 287848, 332382, 112227, 16429, -80770, -30603, 79842, -81486, -175271, 61219, 14118, -1570, -5340, -131388, 51932, -34973, -142176, 303178, -165114, -177205, 136620, -2084, -254257, -241527, 22457, 311961, 142606, -148146, -167274, -77146, -52263, 152946, 89676, -148929, -270743, -188383, -10839, -162656, 128300, -40452, 214554, -99680, -43319, -132067, -154338, -165982, -100993, 73233, -78287, 107569, 101236, 324325, -185752, -14140, -171990, -99403, -311039, -126889, -421749, -46262, -37083, 198134, 100622, -316941, 41531, -35226, -23593, -282761]
16032b82761e1677j85889a04455d9955A39669b43738C0460J45091a89042E5350
16021b23294a10589L5496A46540a70595A15655K40270B5968K3206b37713m2382
16011b80095J35995l4870j31643a52917m9881G4241N0924C5834a91347R2931l7125
16000a35541D73806H8180L9645J72659a18830j32005A03346C3906b73337J00594
15990a72743M4718B57914a2681B47229e3752q7530B22876L46129H4166L20139
15980D04305E4593L16040p7237A02595a57431f8895A97926h787k90796H4230b6245
15968A0026M5157a4742j38040i582C16205d37482A16180a78882A12983E3575J28483
15957A82058a89633d2144j37469P1863d7027B72045A0958J04300J3463R3323b52728
$$ y = [-282761, -51677, -237566, -104455, -49955, 139669, -243738, 30460, 175551, -189042, 55350, -223294, -110589, -75093, 146540, -170595, 115655, 355925, 25968, 49174, -237713, -280095, -144100, -178970, -310613, -152917, -202798, 74241, 125165, 35834, -191347, -98416, -135541, 473806, 88180, 127825, 300484, -118830, -250835, 103346, 33906, -273337, -172743, -128025, 257914, -12681, 247229, -53752, -141282, 222876, 569005, 84166, 404305, 54593, 370633, 293396, 102595, -157431, -68895, 197926, -8787, -299583, 84230, -26245, 10026, 55183, -14742, -152782, -9582, 316205, -437482, 116180, -178882, 112983, 53575, 182058, -189633, -42144, -179613, -107750, -47027, 272045, 10958, 115258, 128721, 222044, -252728]
15945I9072g599A03952f5339H2519a9389j0658k8321C34819D6037J45173i770
15933E1100h5100j52252d3806r252j15039m5304i216p1648j56893A61510a41777
15921a2896E0872b29034f3813j00092G1941b2029j30339D48d02227C8145R6731
15910A34876e8407H6058o332a15188e6689j60229A75779e0837H9550J09242L4561
15899B33353G1622Q1326a96829i5276r588E3636g8305g994A76956q3532C6387
15887c40449i2916H5361b63159L0141A558J0496Q2869J32748a05983B43674a41185
15875g2231j24791O4511j3616a9532j74056b5598j06494o08L4167A2294O6722
15864G9016g8162I9441b12053P284m203E1485a43993D40174a20502A07892J9558
$$ y = [99072, -7599, 103952, -65339, 82519, -19389, -30047, -58368, 334819, 46037, 191210, -9770, 51100, -85100, -237352, -43806, -53058, -168097, -213401, -9216, -80864, -237757, 161510, -141777, -12896, 50872, -229034, -63813, -163905, 71941, -22029, -152368, 448, -402227, 38145, 134876, -58407, 86058, 79726, -115188, -56689, -216918, 175779, -50837, 89550, 198792, 233353, 71622, 152948, -196829, -95276, -104864, 53636, -78305, -7994, 176956, 93424, 36387, -340449, -92916, 85361, -263159, -233018, 1558, 12054, 94923, 227671, -105983, 243674, -141185, -72231, -197022, -132511, -146127, -19532, -193588, -25598, -132092, -132700, -98533, 12294, 79016, -78162, 99441, -212053, -204769, -208972, 51485, -143993, 440174, -120502, 107892, 127450]
15853A27450P0198p9439B4708a72609D635R0607L1582a18658o0298A72493a56313
15841G1395k5712i7473p2465A30992K64994a99033f755j31906q0151B49926c01884
15829a37591B11804k2700b26309i1692K0111m9215A3620c13488A28160d26886
15818C5478b86273A16141a51224J4125k7865C7268c1544j2483j27840a7817o9493
15807h7310A45016J5259h5253I4812j0879A1428O1649B8424a8330j30912F8832
15795B47582a40228e7530r4107C05178c45490J51805G4079P8878j3527b42339
15784c13770J6118a41027P044B08467b14494L9127E0057g4912j81204a5149j67283
15773a82432H6039a04741K5309k33402C98146h17A93874R2328A9178c0336F0104
$$ y = [127450, 197648, 118209, 24708, -172609, 4635, 95242, 126824, -118658, -178956, 172493, -156313, 71395, 45683, -97473, -169938, 130992, 395986, -199033, -6755, -138661, -218812, 249926, -301884, -137591, 211804, 189104, -226309, -91692, -71581, -120796, 13620, -313488, 128160, -426886, 35478, -286273, 116141, -151224, -137099, -164964, 37268, -31544, -44027, -171867, -17817, -87310, 145016, 160275, -85253, 94812, 83933, 11428, 73077, 28424, -18330, -149242, 68832, 247582, -140228, -57530, -151637, 305178, -345490, -193685, 74079, 152957, 139430, -242339, -313770, -297652, -141027, -133983, 208467, -214494, -175367, 50057, -74912, -256116, -15149, -182432, 86039, -104741, -79432, -312834, 398146, -817, 193874, 286202, 19178, -30336, 60104]
15761H023K69455A07829D3019j5709K0009M5428a73862a0138B0672r553a1985
15749f114p6529F9791J77233C0966J84248F8904c3516A9123K06660a6599D0011
15737a01805A24984D600a49816A3117a57784B5674a47959c4991E4262j0269g5772
15725B59060f364m1376j20769m1665A679K3105b95139a2515M088k43015l2145
15714b83587I974a82020k08875A58717i033B2977i696A36939R6945A10060f3931
15702A59363a56676C6146b53575C6916i6198M6041A05561J08997k4686E9526B6040
15690D61916A35478a36583f3973B53088d2026A40724c82133a16747C23525a07077
15679b01181A12649a54342A1437J98406C3706b82228i1348A51933g320k05008
$$ y = [8023, 277478, 107829, 43019, 27310, 47319, 92747, -173862, -10138, 20672, 11119, -11985, -6114, -82643, 69791, 247024, 30966, 215214, 68904, -33516, 19123, 225783, -16599, 40011, -101805, 124984, 4600, -149816, 13117, -157784, 25674, -147959, -34991, 54262, 43993, -75772, 259060, -6364, -47740, -168509, -210174, 1679, 24784, -295139, -12515, -8427, -251442, -283587, 9974, -182020, -390895, 158717, -9033, 22977, -9696, 136939, 233884, 110060, -63931, 159363, -156676, 36146, -253575, 36916, -96198, -50157, 105561, 214558, 189872, 59526, 26040, 461916, 135478, -136583, -63973, 253088, -42026, 140724, -382133, -116747, 323525, -107077, -201181, 112649, -154342, 11437, 209843, 33706, -282228, -91348, 151933, -7320, -212328]
15669b12328A97190N7091a69166O6357c25m4608m82255b02002A2121J82689a8676
15657a38208r5995J07494B29082J300a27466A86711C4831c57448a40497j01783
15647b42280A13384B144a707A91306M6343G9282a37968N8645A18899A2652a28603
15635b93802C7510a42496A51646b86158h3721B32378c62888J42843j97296H5184
15624A0295a66718A32575c82302i3284H8238J79915G3308a61081C00521a07058
15613C48268l9321a03682A8043b24547O3513k48648A92194C0471a32768q7581
15603b20349G2781a1689j57938A17393f6504B20809i3308C0245J43727O1831a8739
15591b80054A91805b08679e6762n9239j68248A10629D8332J27540G6927N3542
$$ y = [-212328, 197190, 254281, -169166, -102809, -325, -44933, -527188, -202002, 12121, 194810, -18676, -138208, -234203, -126709, 229082, 230382, -127466, 186711, 34831, -357448, -140497, -242280, 113384, 2144, -1707, 191306, 237649, 79282, -137968, -79323, 118899, 12652, -128603, -293802, 37510, -142496, 151646, -286158, -83721, 232378, -362888, -220045, -417341, 85184, 10295, -166718, 132575, -382302, -93284, 88238, 268153, 73308, -161081, 300521, -107058, 348268, 308947, -103682, 18043, -224547, -161034, -409682, 192194, 30471, -132768, -220349, 72781, -11689, -169627, 117393, -66504, 220809, -93308, 30245, 173972, 235803, -18739, -280054, 191805, -208679, -56762, -116001, -284249, 110629, 48332, 175872, 76927, 130469]
15581A30469a54200M8790B07479q3213k2935a7399A33279a71161A7571b8085B5262
15569B04290e3379k29210B56708h3012k32643I261a24911A9936R6862C4374b3066
15557g5075r975H1798L18455o3723A06954J46136C5363c1491a4750F6205J30194
15546A96399a1047k26684B78934a36959H3782a41773A20032L63129c2931a0051
15535C6144b61094f3336A6672b68238a28619b7608A04563Q0413f4788K7551A55429
15523A7821a27041l7348c2935o3660B20923r9049J31428b48527A22399n1884M40211
15512E10726b46943A15368n1962N3652C023g5259p6985j07712B76486b04242M5427
15501a58815l6934B95090j12141a07540I8260l7579i6172J0227b5877j88943Q4373
$$ y = [130469, -154200, -105410, 207479, 124266, 101331, -17399, 133279, -171161, 17571, -28085, 25262, 204290, -53379, -282589, 256708, -83012, -315655, 9261, -124911, 19936, 116798, 34374, -23066, -75075, -85050, 81798, 400253, 336530, 106954, 253090, 35363, -31491, -14750, 66205, 196399, -11047, -237731, 278934, -136959, 83782, -141773, 120032, 483161, -32931, -10051, 36144, -261094, -63336, 16672, -268238, -128619, -27608, 104563, 184976, -64788, -37237, 155429, 17821, -127041, -164389, -32935, -96595, 220923, 121874, 253302, -248527, 122399, 70515, 510726, -246943, 115368, 63406, 117058, 3023, -75259, -152244, -259956, 276486, -204242, -158815, -195749, 295090, 182949, -107540, 98260, 60681, -96172, -85945, -25877, -214820, -130447]
15490a30447m5820p8974j32617f3219L536a5877B16146B6693K17533A9479J72514
15479A91993b470l74931a54920a6434H3283J30206c5199g109A75089Q1062m2376
15468B13775k6209b89341e5692E4550a91156A30494n0883A7222M9438g8544r482
15457h8026o089A00600e2758B62320k1795b1602A0231b32939I5000a40433c4593
15445c76252e9340a7077j437A25543C2250d32712A3450J87242f3836k43528a41986
15433e407o5283A54345o3567a17888H7797J03866E956J84281L4552h909r5377
15422a04286B81223b4851k10684a05459F3407d2984A75790P021q0483J27494f3490
15410E0100d0143j21239C18494M1258A53194a1549o2416j0502r8352m877h6649
$$ y = [-130447, -176267, -255241, -387858, -63219, -59683, -15877, 216146, 26693, 244226, 19479, 191993, -2470, -377401, -154920, -16434, 83283, 213489, -35199, -7109, 175089, 256151, 213775, 187566, -289341, -55692, 54550, -191156, 130494, 79611, 17222, 66660, -78544, -88026, -94115, 100600, -52758, 262320, 240525, -21602, 10231, -232939, 95000, -140433, -34593, -376252, -59340, -17077, -18514, 125543, 32250, -432712, 13450, 200692, -63836, -307364, -141986, -5407, -70690, 154345, 90778, -117888, 87797, 191663, 5956, 190237, 224789, -8909, -104286, 281223, -24851, -235535, -105459, 63407, -42984, 175790, 182811, 102328, 229822, -63490, 50100, -40143, -161382, 318494, 359752, 153194, -11549, -73965, -84467, -182819, -187696, -86649]
15398b4308E4423c34221D0797R7760c8418F2937c9385a3206j76156G5751L6799
15387A12550C0828g2608o6724D3565c51007e3778D6546Q5399b60459h1559A4007
15375B96513a27625i971C20340E0318F708a5868q6865K0484a1697B5162P2956
15364I8118O0029A2354N6315l0283c70324e7966A29199J78351g7524k28598L2715
15353b73407J19043A26701Q0008b4550A93790J68083i4875A0433f9373A13518
15342A56102d35265H824L9996Q4886j4453Q7347H3588i3522r9123B20352b09293
15330a16875B43447C5306b40921g7924j91205B12337a02844L9839B78460i4011
15319A04011O6791a32366k5512A58842C2836b44022b5002k05163B39777b80550
$$ y = [-24308, 54423, -334221, 40797, 138557, -38418, 62937, -39385, -13206, -189362, 75751, 112550, 30828, -72608, -139332, 43565, -351007, -53778, 46546, 131945, -260459, -81559, 14007, 296513, -127625, -9971, 320340, 50318, 6708, -15868, -102733, -82249, -11697, 25162, 98118, 158147, 12354, 68669, 38386, -370324, -57966, 129199, 307550, -77524, -306122, -273407, -154364, 126701, 206709, -24550, 193790, 361873, -94875, 10433, -69373, 113518, 156102, -435265, 8824, 48820, 133706, 119253, 206600, 83588, -93522, -192645, 220352, -209293, -116875, 243447, 35306, -240921, -77924, -269129, 212337, -102844, -63005, 278460, -94011, 104011, 170802, -132366, -157878, 158842, 32836, -244022, -25002, -230165, 239777, -280550]
15308A12170c05326d3176a336j77237E666a22774J5388B91765b6816j21525q618
15297a56959k04140c8787P243B19069m6178O3916j8544C6145a69235m4250F9116
15285A70783e8757C38059l2896a58362g4845j01819G8835F720b20133L617C55688
15273b22337A92091a53103a0776k16336C90163a14216P464A82671q3144J18744
15263B18271E217N8913J2765Q8507d7059B65095K61603a0794C31014K2343A06824
15251G2049b58855A86510R016J056939p7502k38780K33132n35469A44318Q7177
15241B31495L6048b26346g8818B71156F0466c3675l6514E2333m894h695B25428
15229a29025l2070b3887A44680N4467c48106e6254B80448b30104C13691G5649
$$ y = [112170, -305326, -43176, -1336, -178573, 5666, -122774, -107386, 291765, -26816, -148341, -156959, -361099, -38787, -31544, 219069, 172891, 236807, 218263, 36145, -169235, -213485, 69116, 170783, -58757, 338059, 305163, -158362, -74845, -176664, 78835, 6720, -220133, -216516, 355688, -222337, 192091, -153103, -10776, -227112, 390163, -114216, -106752, 182671, 99527, 218271, 5217, 64130, 76895, 165402, -47059, 265095, 526698, -10794, 331014, 353357, 106824, 72049, -258855, 186510, 195526, 1252465, 1174963, 936183, 1169315, 633846, 144318, 231495, 267543, -226346, -78818, 271156, 60466, -33675, -70189, 52333, 47439, -8695, 225428, -129025, -161095, -23887, 144680, 199147, -348106, -56254, 280448, -230104, 313691, 75649]
15218a49150j58506D74015A72513C4306a89998H2009J3734J9704L2579a49234
15207g335A6935J50068A9597K34683B3021f1974A84678N9175r4657C5822a11424
15195d2579A76300F7036B1357d0789N7j151k5379A69509k6181J86559D3251K68025
15183C11276c44745G2200J41299J12028d4660p9745o8279A50202O2631a73189
15172A64800d181o544j74494A981a2020A29702B9356J77840a15411A66611d4174
15160a0796C34406j24624b3995B82251F1788a90342C18552i8800k6715B22967
15149i6525b8287B06703L6414L901O1235a74808B58429J27551A14858l2677P9899
15138A62080K4547Q2939A34067r468c42039A43168M11772E0955b9453j84995H7146
$$ y = [-149150, -307656, 474015, 172513, 34306, -189998, 82009, 95743, 115447, 148026, -149234, -7335, 16935, 167003, 19597, 254280, 23021, -61974, 184678, 243853, 149196, 35822, -111424, -42579, 176300, 67036, 21357, -40789, -40732, -41883, -67262, 169509, 143328, 329887, 43251, 311276, -344745, 72200, 213499, 325527, -44660, -124405, -192684, 150202, 212833, -173189, 164800, -4181, -10725, -185219, 1981, -12020, 129702, 29356, 207196, -115411, 166611, -44174, -10796, 334406, 209782, -23995, 282251, 61788, -190342, 318552, -98800, -125515, 222967, -96525, -28287, 206703, 243117, 247018, 308253, -174808, 258429, 385980, 114858, 82181, 162080, 186627, 269566, 134067, 124599, -342039, 143168, 554940, 50955, -29453, -214448, 87146]
15126a01904k59688I9054k360m0885P5340P7713q6033j916J90273k5423A11544
15114A15084P5140j8298m0582J12955o2144q9681J6666J66332f8884A72333p569
15103A64764d3803C28610C8046J53461B290M72030a11650A1226L00609p3983e5589
15091c7144C19651o9422f0512D192N9918N4083f8341A43055C7864E45R4078L00204
15079C94827A20449h4836H1635h1742F9323Q7008L13377c9226B80568o903k3673
15068B49992m7875P7904q760i335E8909M35746j96932A04343e9690A86984J485
15057A88469k3722L40669B50045B2379J6413K89800a53188I0033J35779a11675
15046D3889L92430j85073j23496k5554P5069a15014A90514D6893K52696D0030
$$ y = [-101904, -361592, 99054, 96694, 55809, 131149, 208862, 122829, 120913, 311186, 285763, 111544, 115084, 190224, 171926, 131344, 244299, 182155, 92474, 109140, 275472, -68884, 172333, 164764, -43803, 328610, 38046, 191507, 2290, 474320, -111650, 11226, 311835, 237852, -55589, -37144, 319651, 250229, -60512, 4192, 64110, 118193, -68341, 143055, 37864, 545, 94623, 394827, 120449, -84836, 81635, -81742, 69323, 156331, 469708, -39226, 280568, 273665, 249992, 202117, 280021, 271261, -9335, 58909, 494655, 297723, 104343, -59690, 186984, 188469, 164747, 505416, 250045, 22379, 38792, 328592, -153188, 90033, 225812, -111675, 43889, 436319, 251246, 127750, 102196, 177265, -115014, 190514, 46893, 299589, 40030]
15035B08965K5675r9102J06417K7399q0310F7175J04675K5217J411k9558L877
15024A72797k4201K59544A83264E8254Q3811b2242A41617j9106N7245L5764K09265
15013D24785K5100j12800A4942K94729A24932J78933a66584F89765I6021J07956
15003B03977l4118b2179A99457K70965A32076K7386f7767A52079K3137J81929
14993C57145o5143e38j7786J542A95432G8754L89035A81026J46402A03536J35144
14982B38680L4312n7413H9304Q4095K9002a07152B96462L15131l02819n9339K97150
14971E46585B35751q2079J48616q5868L27076a39403A73062B3355L51944F7773
14960D65867n6920N0820A61150J62590l6K59508j66349j74527J7609m1140P9552
$$ y = [208965, 234640, 135538, 241955, 269354, 189044, 67175, 171850, 197067, 198478, 168920, 172797, 148596, 408140, 183264, 58254, 142065, -22242, 141617, 122511, 179756, 215520, 424785, 449885, 337085, 14942, 309671, 124932, 303865, -166584, 689765, 96021, 203977, 169859, -22179, 199457, 470422, 132076, 159462, -67767, 152079, 175216, 357145, 292002, -538, -18324, -16782, 195432, 78754, 467789, 181026, 327428, 103536, 238680, 272992, 215579, 89304, 173399, 202401, -107152, 296462, 611593, 308774, 249435, 546585, 235751, 153672, 302288, 216420, 543496, -139403, 173062, 23355, 375299, 67773, 465867, 408947, 459767, 161150, 323740, 323704, 583212, 416863, 242336, 259945, 218805, 298357]
14949B98357A43196m3097K58363j38271q1983M57452B13627C076N12678q4295
14939D31459K3876j97925j02283J09620f4588A83191D3223K84268a16792A67404
14928c4507B89963n0135l9151E1704M1047L63880B05732L28303e5673C62384j07335
14917B55049j9189A07288N02717k24833q9587A31604R1990N174J66252j92477
14907B02543q1553J31925K70563A02220R2713J44347L8357l4789B5315L82068
14897D07383A56422M5642L542J03892j30174O01960B73606J84630K18047k16432
14887D59851j86152Q936j12740p0501O1941J17561K77695k34496J7263p0451K39894
14876E08801q1957j46360J56213l5118Q9564j32490k4682N378p8775J14959j27746
$$ y = [298357, 143196, 100099, 358462, 220191, 138208, 595660, 213627, 3076, 515754, 431459, 455335, 257410, 155127, 264747, -64588, 183191, 43223, 327491, -116792, 167404, -34507, 289963, 239828, 200677, 51704, 92751, 456631, 205732, 534035, -55673, 362384, 255049, 235860, 107288, 610005, 385172, 295585, 131604, 223594, 228768, 395020, 202543, 120990, 252915, 523478, 102220, 194933, 339280, 377637, 342848, 25315, 407383, 156422, 202064, 205606, 309498, 179324, 781284, 273606, 458236, 676283, 459851, 273699, 282635, 169895, 99394, 161335, 278896, 556591, 322095, 339358, 268907, 508801, 426844, 280484, 436697, 401579, 491143, 358653, 333971, 339349, 260574, 375533, 247787]
14865B47787J58866N7367n8142K47987n8040k09738L67071j84780B25564K62701
14855D88265I1990M14302j06519j02046K15346l8592j09831Q2457J19962o1936
14845E05133J17280L8307G8671R7014J84365K47016L8956j77380j94173J72209
14835D46678J4922o3522J13940p5882q7514J05484L62842A59801J24622K29467
14825E13890k0145K0676J47832B98458J67197r4280J72822B08040o7064j2173
14815A28803L91237L33458j91473j44929k26626F8674J44818M7148M4300J94339
14805D99279K0755j44645A71164J63658J84263j93669p6417N1641L14039A89390
14794B5629N75467B39917L15072j34014J43948p6617J5226J49373B71302O7674
$$ y = [247787, 406653, 464020, 405878, 653865, 595825, 386087, 753158, 568378, 225564, 488265, 91990, 506292, 399773, 297727, 513073, 474481, 364650, 447107, 567069, 505133, 622413, 660720, 78671, 175685, 360050, 607066, 646022, 468642, 274469, 446678, 461600, 398078, 512018, 436136, 348622, 454106, 816948, 159801, 284423, 513890, 493745, 514421, 662253, 298458, 465655, 371375, 544197, 208040, 140976, 128803, 520040, 853498, 662025, 517096, 290470, 68674, 213492, 260640, 304940, 499279, 520034, 375389, 171164, 334822, 519085, 325416, 248999, 300640, 614679, 189390, 25629, 601096, 239917, 554989, 420975, 564923, 488306, 503532, 652905, 271302, 338976]
14784C38976L83178k3888j2022k24290M5930M51506l47593p576J6814N4578j82897
14773D92716K72643l36818p134p1590L1401L07342j76340J08223k05002m5147
14763C70294L15424k10261R5111p6691M2039K69606j86926k55400L29889J01908
14753G94993k56140J92453J23457m00843K01004k16556K43118J11948k10785J07606
14743F90255k88204K45469m481o4606L09989l44140K94668K54306m50951m6949
14733E95356K47502k52399J82015m4970q0519j33189R2458R6110L31209k22111
14723H11462l9992l01629L71105O7030J4630k34430Q2570n8623j67841m5170N15996
14712A015108l67519J45889l30047M9883P4691J92183O3571m0729L0173k266O0448
$$ y = [338976, 722154, 698266, 686244, 461954, 507884, 959390, 611797, 604221, 621035, 675613, 492716, 765359, 428541, 421407, 349817, 381218, 688560, 512220, 620443, 415441, 370294, 685718, 475457, 570568, 493877, 535916, 805522, 618596, 363196, 693085, 794993, 538853, 731306, 854763, 453920, 654924, 438368, 681486, 793434, 582649, 690255, 402051, 647520, 643039, 578433, 888422, 544282, 838950, 1093256, 642305, 595356, 842858, 590459, 772474, 727504, 646985, 513796, 606254, 702364, 1033573, 811462, 771470, 469841, 840946, 907976, 922606, 688176, 770746, 712123, 544282, 499112, 1015108, 647589, 793478, 463431, 513314, 588005, 780188, 843759, 803030, 833203, 830937, 891385]
14701H91385j86286L27602k44593k52821L58634k62631K80278q8162L00262k40387
14691H83281k68068P182M42527k36021J0381j01290K43449m63746K03119M1609
14681G62423o8658M43518J03189m41589L30720l35187J00647J441K0751L38941
14671A256196k45684k07581K21100j72443j9154K52651k55902L44686O802l1447
14661A149224j89358J52122k61416M286q1409p1610q8669L14479L191l80774M01156
14650I51222K68336P640m5626Q7130k87102j23797O48487l19735O7231k69584
14640I84202K29808K52833n01206J01751K196L81789m51737L32041j39103j50191
14630A042383j6152J80887j12289L1466K32816k15791K20000o2829J40579l58326
$$ y = [891385, 705099, 1032701, 788108, 535287, 893921, 631290, 911568, 823406, 1123668, 883281, 615213, 622395, 1064922, 828901, 839282, 737992, 981441, 517695, 720814, 762423, 693765, 1137283, 1240472, 798883, 1129603, 794416, 895063, 896504, 917255, 1256196, 1010512, 802931, 1024031, 851588, 832434, 1085085, 829183, 1173869, 1180671, 1149224, 959866, 1111988, 850572, 854858, 773449, 701839, 613170, 927649, 930840, 550066, 951222, 1219558, 1227198, 1181572, 1268702, 981600, 857803, 1506290, 1186555, 1253786, 984202, 1214010, 1466843, 965637, 1067388, 1069584, 1451373, 999636, 1331677, 1192574, 1042383, 1026231, 1207118, 1094829, 1126295, 1359111, 1143320, 1363320, 1300491, 1441070, 1082744]
14620A082744K42319L0549l50948J07283J04387M85426l12444M9886J41302l85931
14610A194573l4042N18960k89610j45914M10121k97702O4415O39J84758J78461
14600A784659j65065k40889J50995J91646j14222m2075P7209j01001J10372L41105
14590A992734m32925m3937J75580J22831q9836J67393k86862J24506l6239j75559
14580A517686L97740m86279M44106j7896l02195M93729j57204M9858k69824L94922
14570B064643o6775j4614J9148J95612j77068J59902k7768J28011R6754l4959
14560B342886l099N69444j28148j99093L13827j23373M08770J79294M40986M46220
14550D247714Q37879K170096M164879Q800996J7139178M794416A9570668H200048
$$ y = [1082744, 1325063, 1355612, 1004664, 1111947, 1216334, 1701760, 1389316, 1439202, 1580504, 1194573, 1160531, 1679491, 1389881, 1243967, 1654088, 1356386, 1420801, 1421440, 1606198, 1784659, 1619594, 1378705, 1529700, 1721346, 1607124, 1565049, 1642258, 1541257, 1651629, 1992734, 1559809, 1515872, 1691452, 1814283, 1724447, 1891840, 1604978, 1729484, 1693245, 1517686, 1915426, 1429147, 1873253, 1855357, 1553162, 2046891, 1889687, 1939545, 1669721, 2064643, 1997868, 1983254, 2002402, 2198014, 2020946, 2180848, 2153080, 2281091, 2377845, 2342886, 2339787, 2909231, 2781083, 2581990, 2895817, 2772444, 3181214, 3360508, 3801494, 4247714, 5085593, 7255689, 11420568, 20221564, 37360742, 42155158, 19570668, 8200048]
14541D244085j961319K0906j97846j97159k5410j57878J75756l844J65656M0210
14531B103157j51682L4803k51823Q39032q43499N11956Q493O2268k15462L11859
14521B409102M5970k36216J66638l65014N5406L05936j96117L54443j39551n0219
14511B350378L13775o7479R4410j2705Q2633k56783k54927K80075M46525k07056
14501B768846L63694n88072J08193j40163N49202n9998k055J90522j62149K11079
14491C239099P594j78192L13981l63971M46775j74193L42158P7992j91223m45746
14481C074274L91453K38322k76391R2944O7590m68902O33960J20558N4286k38005
14471C690089K34812K4575q6622j57545K76693r6076R2242O3634j12550q0371
$$ y = [4244085, 2282766, 2303672, 2105826, 1908667, 1883257, 1725379, 1901135, 1897291, 2062947, 2103157, 1951475, 1986278, 1734455, 2573487, 1729988, 2241944, 2250437, 2312705, 2097243, 2409102, 2455072, 2218856, 2385494, 2020480, 2075886, 2381822, 2185705, 2540148, 2400597, 2350378, 2664153, 2596674, 2691084, 2678379, 2761012, 2504229, 2249302, 2529377, 2975902, 2768846, 3132540, 2544468, 2652661, 2512498, 3061700, 3001702, 2999647, 3190169, 3028020, 3239099, 3246693, 3068501, 3382482, 3018511, 3465286, 3291093, 3633251, 3711243, 3520020, 3074274, 3465727, 3704049, 3427658, 3520602, 3588192, 3119290, 3753250, 3873808, 3928094, 3690089, 3924901, 3949476, 3862854, 3705309, 3982002, 3885926, 3978168, 4041802, 3929252, 3848881]
14461C848881L98332N8725l11489N22497P326o4706M45526m84779r0172N77957
14451D908098O0750m6804m59323M98903J80775j95050O1334J99565p7468m7846
14441E082934J84249K25085R4936j99136L82419p4941J721K62187r3607J36336
14431F002183k5347K06256o2351R9036Q6229K06538K45746j83554J52704m8212
14421F679228L79766k04988O6820M6379p3369M06882Q5267M90199j78698N5222
14411G752708K40410j97697M78139L25969k15681K02551k5470O26292m49587K57165
14401H994799M03677J14603j8539K74641m5983J92048Q1436K84202L27244J24064
14391A0732192K72354K76962j28837L88521K29220j21645P55138k0627K11561
$$ y = [3848881, 4247213, 4305938, 3994449, 4516946, 4524272, 4459566, 4905092, 4420313, 4330141, 4908098, 4968848, 4922044, 4462721, 4961624, 5142399, 4947349, 5008683, 5208248, 5130780, 5082934, 5267183, 5492268, 5587204, 5388068, 5770487, 5695546, 5697267, 5959454, 5865847, 6002183, 5976836, 6183092, 6120741, 6219777, 6306006, 6512544, 6758290, 6574736, 6727440, 6679228, 7058994, 6854006, 6920826, 6967205, 6893836, 7300718, 7385985, 7876184, 7697486, 7752708, 7993118, 7795421, 8273560, 8599529, 8383848, 8586399, 8560929, 9187221, 8737634, 8994799, 9398476, 9513079, 9494540, 9769181, 9723198, 9915246, 9996682, 10280884, 10608128, 10732192, 11004546, 11281508, 11152671, 11541192, 11770412, 11648767, 12403905, 12383278, 12594839]
14382A2594839j13534N30592K68268J6882K01833K45554M61248N5908M71459M49678
14372A5182727j43539P02085L88302j4905K24116P58514j90770P41250M96151
14363A8143931L19151M49509J62922M42294P31150P0452P51239L76763N46995
14354B1994406N86163K94379R03923O61087L9740P43676N19441R63461O58636
14345B7364912K62137J056253N31362J056235Q01897J307645N27006R31880Q85116
14336C4724443J198578J095310J157070J196773J124278J031530J880953J133100
14328D4542035J276806J446922J545131J363658K099384J825517J453216K081048
14320E7633717K005869K261112K164434K290527K760082K412933K959712K864299
$$ y = [12594839, 12481305, 13011897, 13280165, 13297047, 13498880, 13744434, 14205682, 14261590, 14733049, 15182727, 15039188, 15741273, 16129575, 16114670, 16338786, 17097300, 16906530, 17647780, 18143931, 18463082, 18912591, 19075513, 19517807, 20248957, 20319409, 21070648, 21447411, 21994406, 22580569, 22874948, 23778871, 24439958, 24479698, 25223374, 25742815, 26706276, 27364912, 27627049, 28683302, 29214664, 30270899, 31072796, 32380441, 32907447, 33839327, 34724443, 35923021, 37018331, 38175401, 39372174, 40496452, 41527982, 43408935, 44542035, 45818841, 47265763, 48810894, 50174552, 52273936, 54099453, 55552669, 57633717, 59639586, 61900698, 64065132, 66355659, 69115741, 71528674, 74488386, 77352685]
14312G7352685K900625L509694L690074L365473M134792M284819M230503M641858
14304A08110523N162106M983177N562343O158558O153225P041039P054183P647755
14296A57872909Q111634Q828663R414111R707293J0527244J0828085J1827152
14289B27117091J2502173J3052561J3956767J4480105J4780568J5819521J5990421
14282C27699207J6229323J6511469J6595751J6332248J5674335J4705355J3940084
14275D37687772J1725414R580655L071280J42703j90379n14140J40887l371283
14267D58272909n241157p546967j1355302j3402118j4391017j5041235j4747676
14260C76547437j6818906j7244806j6545539j5999062j6452631j4405615j4300625
$$ y = [77352685, 80253310, 83763004, 87453078, 90818551, 94953343, 99238162, 103468665, 108110523, 113272629, 118255806, 123818149, 129976707, 136129932, 143170971, 150225154, 157872909, 165984543, 174813206, 184227317, 193934610, 204461854, 215289939, 227117091, 239619264, 252671825, 266628592, 281108697, 295889265, 311708786, 327699207, 343928530, 360439999, 377035750, 393367998, 409042333, 423747688, 437687772, 449413186, 458993841, 462065121, 462207824, 462017445, 461503305, 461644192, 458272909, 453031752, 445484785, 434129483, 420727365, 406336348, 391295113, 376547437, 359728531, 342483725, 325938186, 309939124, 293486493, 279080878, 264780253]
14253B64780253j3918611j3783143j2278984j2085012j1081855j0544318r716065
14246A81372265r624781q289995q071288p483852p491155p182027o137074n899087
14238A21193006n364237m906782n350984m754690l990488m131708l853091l318791
14230H5522235m143392k849672l182996k759541l098749k359345k991918k386559
14222F1750063k158126j889793k092402k013369k051579j596872j219370j820236
14214D6908316j332819j028135j946814j155230j396324q75580j204164r08949
14206C7060301r78977j174471j364886n11350r78920p74402o59223p16080j160975
14197B8741017n24064q39440j143111j15511n20126j077539m75446p34874l10639
$$ y = [264780253, 250861642, 237078499, 224799515, 212714503, 201632648, 191088330, 181372265, 171747484, 163457489, 155386201, 147902349, 140411194, 133229167, 127092093, 121193006, 115828769, 110921987, 105571003, 100816313, 96825825, 92694117, 88841026, 85522235, 81378843, 78529171, 75346175, 72586634, 69487885, 67128540, 64136622, 61750063, 59591937, 57702144, 55609742, 53596373, 51544794, 49947922, 48728552, 46908316, 45575497, 44547362, 42600548, 41445318, 40048994, 39173414, 37969250, 37060301, 36081324, 34906853, 33541967, 33030617, 32051697, 31277295, 30618072, 29901992, 28741017, 28216953, 27377513, 26234402, 26118891, 25598765, 24521226, 24045780, 23310906, 23000267]
14188B3000267m18094r39787l37954l37154o06275o46870o1236o63666l57325
14179A8631906o72500k25577j79980m05544k16855k64715o03962p18679L27772
14170A5671866o09480N4735n39295m00195r4489j17127k82169j85065k94326m25779
14160A2778676J87909n17072n40453L28237n80842K06729q67166J08117j29533
14151A0974602K3001r0123n57448l03084p7061O3121l84895j53623J62396n81259
14141I075627J34511j32730k68752J66255K4640k49354k93137P4987n50997L84748
14131H365798k91167k74269L6963k13099q8075k39645j73757L34727o72001j6188
14121F769287J15301q9787j3531k25614P2007k84104L96213n84589J57395n93023
$$ y = [23000267, 22582173, 21642386, 21304432, 20967278, 20361003, 19714133, 19652897, 18989231, 18631906, 17959406, 17733829, 17553849, 17148305, 16931450, 16666735, 16062773, 15344094, 15671866, 15062386, 15117121, 14577826, 14177631, 14083142, 13966015, 13683846, 13498781, 13204455, 12778676, 12966585, 12449513, 11909060, 12237297, 11656455, 11863184, 10996018, 11104135, 10974602, 10997603, 10907480, 10350032, 10046948, 9969887, 10033008, 9648113, 9494490, 9656886, 9075627, 9210138, 9077408, 8808656, 8974911, 8999551, 8750197, 8457060, 8532047, 7981050, 8365798, 8074631, 7800362, 7837325, 7624226, 7536151, 7296506, 7122749, 7457476, 6785475, 6769287, 6884588, 6794801, 6781270, 6555656, 6627663, 6343559, 6739772, 6155183, 6312578, 5719555]
14111E719555Q04283m99300j9090m5167l32557l2382j1487k82444P7930j3128
14101E366213K9210j55115Q8454q7513j75057j7616l00896K8681n6031P8638N2021
14090D850989j74839K55459o86928K58173K4575O3902m9464j71546j50513M4685
14080D264493K23175n75051K41520N0017n2999Q9750l04971M1068K64633l17960
14070C923675m67009J31341N05033o67102R6036N2351j41249J08142O6858j6899
14060C591177j02085r9490J38116M9640J49922m17700J02470k15568K3536j41918
14050C078100J6608P8815j44664O3377j58809Q9508k2395j36121O513o7536J87395
14039B990791j19645l88066r5076K48787l7824K67083J67824m00284o2858L8694
$$ y = [5719555, 6523838, 6024538, 6005448, 5960281, 5627724, 5595342, 5583855, 5301411, 5379341, 5366213, 5395423, 5240308, 5328762, 5241249, 5066192, 5048576, 4747680, 4776361, 4720330, 4798968, 4850989, 4676150, 4931609, 4244681, 4502854, 4527429, 4591331, 4541867, 4370321, 4219808, 4264493, 4487668, 3912617, 4154137, 4204154, 4151155, 4240905, 3935934, 3977002, 4241635, 3923675, 3456666, 3588007, 4093040, 3425938, 3521974, 3574325, 3433076, 3541218, 3608076, 3591177, 3489092, 3389602, 3527718, 3577358, 3727280, 3309580, 3412050, 3196482, 3220018, 3078100, 3094708, 3173523, 3028859, 3092236, 2933427, 3022935, 3000540, 2864419, 2870932, 2803396, 2990791, 2871146, 2483080, 2388004, 2636791, 2598967, 2866050, 3033874, 2633590, 2570732, 2609426]
14029B609426J0575p3829J4692k44454J91435j23340O7441J28855p3958j70463
14019B336380O4139j12981J53503l82110J38000m06183L81668q0358p6840M94565
14009B509783m09816j11434O7921k18641J3856J410K62311k4638o44184K08016
13999A654584J95529M0081r8774j23729L9028K29147N1033K5005r2091N56520
13989B476333R68371L433000O713206J7173836J2801122j9536104j1663839n153451
13981G212474k045207j035507m72367p89454j92778o9388l7867l82710K53583
13972B440779k99867J8777M511l22233K39898N2882j13734j16595K1120o3686
13962A861852J1891R549M6191k26985P3381K2072j96042J02694q9324N8867K23414
$$ y = [2609426, 2620001, 2546172, 2560864, 2316410, 2507845, 2384505, 2451946, 2580801, 2506843, 2336380, 2400519, 2287538, 2441041, 2058931, 2196931, 1790748, 2172416, 2092058, 2015218, 2509783, 2099967, 1988533, 2056454, 1837813, 1851669, 1853079, 2115390, 2090752, 1446568, 1654584, 1850113, 1890194, 1791420, 1667691, 1706719, 1935866, 1986899, 2011904, 1919813, 2476333, 3444704, 6877704, 13590910, 30764746, 43565868, 24029764, 12365925, 7212474, 5167267, 4131760, 3659393, 2869939, 2677161, 2607773, 2569906, 2187196, 2440779, 2140912, 2159689, 2164200, 1841967, 2081865, 2134747, 2021013, 1904418, 1925538, 1861852, 1873743, 1883292, 1929483, 1702498, 1775879, 1797951, 1601909, 1704603, 1615279, 1674146, 1897560]
13951A897560l42241j00692J16518L39632k21721o947J88234n86134N40252j13369
13941A711092p1199L8590k56609j0105K54460l40524L0532J6524O1200k47651
13931A186310N29607m17925J4906J46436r0667q265k5202L05884m19156K31131
13921A453059J79168k52428p971J07316j37926J22209k02702j52680Q8059L7277
13911A233381j5332K31752R4024l17969J12942k35796l73054O84253k98224O970
13901A122947J51104l31659K71204j02614j80806J84332l9764L8924J50816k90311
13891I74173r5181J24301j7920p1818K72852m05557J91295k16156K16414o2649
13881I09754J79846j59996j3875j36365M89144l27667j8824l1566m1661K65615
$$ y = [1897560, 1555319, 1454627, 1571145, 1910777, 1689056, 1682109, 1870343, 1284209, 1824461, 1711092, 1639893, 1678483, 1421874, 1411769, 1666229, 1325705, 1356237, 1372761, 1433961, 1186310, 1715917, 1297992, 1312898, 1459334, 1368667, 1360402, 1335200, 1641084, 1221928, 1453059, 1632227, 1379799, 1371828, 1479144, 1341218, 1463427, 1260725, 1108045, 1196104, 1233381, 1218049, 1449801, 1543825, 1225856, 1338798, 1103002, 729948, 1414201, 1115977, 1122947, 1274051, 942392, 1213596, 1110982, 930176, 1114508, 1074744, 1113668, 1264484, 974173, 878992, 1003293, 985373, 913555, 1186407, 780850, 972145, 755989, 972403, 909754, 1089600, 929604, 915729, 779364, 1268508, 940841, 922017, 890451, 848790, 1114405]
13871A114405k75621J73956j94092L1081k648Q2871Q7484p8169J9464j38892L1164
13860H51003O7237j02566O4271m1367J4215J86690l65484K05694J56875J15404
13850A151972l10733J68572l11117N30742p1111k23961o332N5292p2044l58207
13840E53073K48531J66061J2221l29121M01701l58111L24494j23078l82106K34783
13830G48448J01133j33102N82949n29708J21019k56723Q35K34859k84602J90290
13820G75398k47566J4111L00579j3961p7980P3159l57216P2410J26853r9303k9045
13809E37439K79209C98812L23620k94717L61590R4086k933K61k75668M85817j45651
13798I45217N1697m90694p6974L23920j54226J35186J1851l4949k92012L74632
$$ y = [1114405, 838784, 1012740, 818648, 849729, 847081, 929952, 1017436, 939267, 958731, 819839, 851003, 918240, 815674, 879945, 838578, 852793, 1039483, 673999, 879693, 1036568, 1151972, 841239, 1009811, 698694, 1229436, 1158325, 934364, 928032, 983324, 911280, 553073, 801604, 967665, 979886, 650765, 1052466, 694355, 1018849, 895771, 513665, 748448, 849581, 716479, 1299428, 769720, 890739, 634016, 634851, 869710, 585108, 775398, 527832, 541943, 842522, 828561, 750581, 823740, 466524, 538934, 665787, 566484, 537439, 816648, 398812, 722432, 427715, 789305, 883391, 880458, 880719, 605051, 1090868, 945217, 996914, 506220, 429246, 753166, 598940, 734126, 745977, 711028, 419016, 793648]
13788G93648j36956P5349C29529N01226k06623K87335C54656L24691n5937J353
13778F24763N7853M03463m02672K32221l47124j17061K61119m9964A14888N20796
13768F35684K07774j73956j51217j59732J61595l97J52140k53953K28932o1706
13758E85164k00101L57568R746k20833j3663J22157J38973n9535J23551N620j16715
13747G31932m5394B62466M35401k65201K45503j68913j20430A01436M04013j64580
13737C40869J25539m4404K26850k61428p3249K19987J81544B40208L00725j31722
13727D09211L32139k78531j57745K62971j94701M7376J5822K5665j14416L73762
13717G21553B79731L86011r9515K08263l65828K29335j38344j02686N4166J3018
$$ y = [793648, 656692, 732041, 329529, 830755, 624132, 911467, 354656, 679347, 623410, 624763, 682616, 1086079, 683407, 915628, 568504, 451443, 712562, 662598, 114888, 635684, 843458, 669502, 518285, 358553, 520148, 519751, 671891, 417938, 646870, 585164, 385063, 742631, 752377, 531544, 517881, 640038, 779011, 719476, 843027, 848647, 731932, 686538, 262466, 697867, 432666, 678169, 509256, 388826, 101436, 505449, 340869, 466408, 422004, 648854, 387426, 314177, 534164, 715708, 240208, 540933, 409211, 741350, 462819, 305074, 568045, 373344, 420720, 436542, 462207, 347791, 721553, 279731, 665742, 566227, 774490, 408662, 637997, 499653, 396967, 451133, 464151]
13707D64151J03229j15524M579L52109l84514J79988k74789j07178N19494B95582
13696D66062n9096J76702j51299q5758K90589j95852j41874i9013C14801d6165
13685D09805J28551P6005B73701J92226I6296M88444j29020R6574A15824P4327
13675A90151M0134J51905J69807k63104L72096l20510K7498P6827j72383J04098
13665C76519J06493m0652K17136C25202L59983j92613q8965j40470j16631M72913
13655F19419j98725Q5711j56156J00727l8465E8856J99824J60998n7652P4254
13645D36280j30291o2790F6320J44722J41651O2477j36405o6633J85839J59745
13635E57716p2907R6183k46469A14221L94710G1099K10051J78188J01126I4127
$$ y = [464151, 567380, 451856, 456435, 808544, 424030, 604018, 329229, 222051, 741545, 295582, 466062, 406966, 583668, 432369, 346611, 637200, 441348, 299474, -99013, 314801, -46165, 409805, 538356, 614361, 273701, 465927, 96296, 584740, 455720, 552294, 115824, 190151, 230285, 382190, 551997, 288893, 660989, 340479, 367977, 444804, 272421, 376519, 483012, 442360, 659496, 325202, 685185, 492572, 403607, 263137, 146506, 619419, 420694, 506405, 350249, 450976, 412511, 58856, 258680, 419678, 362026, 436280, 305989, 243199, 66320, 211042, 352693, 415170, 278765, 212132, 397971, 557716, 484809, 580992, 334523, 114221, 508931, 71099, 281150, 459338, 560464, 94127]
13624C19503A47302L97782n0940A90985Q0560L23844k65103e3694A89733J41847
13614C31580M0488G5M98116j31982j20595K36163j65890E4722M45135F4341R7788
13603A62129k6748L03119m4693j42134F9360M83220k19600J22783l1258o7696
13593C56809D3293K75524j03026E3846K12347D2546K78098j11699M09319B48861
13582A56059J53067J7548A11491K34308l130j57341a41298B05691Q2327A43922
13571A83152K06797K19730K6629B24139F3965O5577J84266J58278N8465k16661
13561C13890J27062j36735m2348J46033b29663B45945A19798B8601K37625J80996
13551D47222M0014A81976J46251j34432L07492B5983p287i3385B46779i0930C50397
$$ y = [319503, 147302, 545084, 494144, 190985, 271545, 595389, 330286, -53694, 189733, 331580, 372068, 75, 498191, 366209, 245614, 481777, 315887, 54722, 499857, 64341, 162129, 135381, 438500, 393807, 251673, 69360, 552580, 332980, 455763, 424505, 356809, 43293, 318817, 215791, 53846, 266193, 42546, 320644, 208945, 618264, 248861, 156059, 309126, 326674, 111491, 345799, 342669, 185328, -141298, 205691, 288018, 143922, 183152, 389949, 609679, 636308, 224139, 63965, 129542, 313808, 472086, 530551, 313890, 440952, 304217, 261869, 407902, -229663, 245945, 119798, 28601, 266226, 447222, 487236, 181976, 328227, 193795, 501287, 25983, 18696, -93385, 246779, -90930, 350397]
13539B32045k7014J75223M4012g1428D32976A16767J39453J38828j78583G4686
13528A13128J63751I9211g2274D32732B15599Q323a56909C41618c71487C80299
13517A39302l8029B4251M13861B6667M24019j81245l2765J16148j44151m3186
13507A65487P8901F5364K85518q3160H4660L58009c389B11976m574n5217a34751
13495C7219K12785a83730d064B51869F7635J37942E8983a9293E22130o986A53221
13483A85359K02367A23826J41862J75454j59067a0757G6943A0108c1377B57187
13472C01459i5854C36021a12331F8941J81259j2057c04029c4146h869m9540B94545
13460C50983d2444C01515N9498j75812G0735C3180J07623K0495L2908O0569F961
$$ y = [232045, 205031, 380254, 424266, -71428, 432976, 116767, 256220, 395048, 216465, 74686, 113128, 276879, 99211, -72274, 432732, 215599, 223922, -156909, 341618, -371487, 380299, 139302, 101273, 24251, 438112, 26667, 450686, 269441, 236676, 352824, 208673, 165487, 244388, 65364, 350882, 267722, 84660, 442669, -3389, 211976, 207402, 152185, -134751, 37219, 250004, -183730, -4064, 251869, 67635, 205577, 58983, -19293, 522130, 515144, 153221, 185359, 387726, 123826, 265688, 441142, 282075, -10757, 76943, 10108, -31377, 257187, 301459, -95854, 336021, -112331, 68941, 250200, 238143, -304029, -34146, -8869, -58409, 294545, 350983, -42444, 301515, 361013, 185201, 70735, 33180, 140803, 161298, 194206, 254775, 6961]
13448A47159c6533E0524J04582J57142H9550A5623J95989J56973n5361J30392
13438D43616H8265a48488p4279b2498B2826Q8217J62049i153B0658K32310m9453
13427B03515G3246P3284d6317C18721a98360R7546B74558H1913l0346a0407F7948
13415C65130A21429j2188m5161a51135A34880K07145G3152P1527J79180K97a61879
13403A65165K19438j80154K5486g4157B59023A14047h1303A36380a82937A71286
13392A83977J72028G5018R9530M4899J08857n4966A16091a6344A39808b1451O564
13381a4887A32616R0215I1198k8024J3590C0773P8748J20178j3989a02089B40873
13369A05323L9426K54812n0234N7771j72780Q0891A43107L14214D9025a4207C87340
$$ y = [147159, -36533, 50524, 155106, 312248, 89550, 15623, 211612, 368585, 313224, 443616, 88265, -148488, -222767, -22498, 22826, 111043, 273092, -9153, 20658, 252968, 203515, 73246, 146530, -46317, 318721, -198360, -100814, 274558, 81913, 51567, -10407, 67948, 365130, 121429, 109241, 64080, -151135, 134880, 342025, 73152, 144679, 323859, 324156, -161879, 165165, 384603, 204449, 229935, -74157, 259023, 114047, -81303, 136380, -182937, 171286, 183977, 356005, 75018, 174548, 219447, 328304, 273338, 116091, -16344, 139808, -21451, -14887, 132616, 222831, 91198, 63174, 76764, 30773, 109521, 229699, 215710, -102089, 240873, 105323, 144749, 399561, 349327, 407098, 234318, 315209, 143107, 457321, 49025, -14207, 387340]
13357B68187a42582a2273A00581J61082j23390b7028C23197j37837J9918j7291
13347A87987J68331J74779A17171O8109M20856A53686K07112Q3513j00262j25494
13337B18555j0916r4098l546P200K6629J94808A43957N4662O5052b31043B85552
13325B44462a19492B79438I0956c00269g4154A88947P8565a04411B24141A11987
13314E16905a80944B75742J03892b9248m5677G571J38220J37641I959J54112p7698
13303H6373N7164h8612C07209H5650J17415I2938K37653a5847n4012j11162D96972
13291B4603K3071K17370i2276E7128J65606k0986L16898k53862a7336B9145K75779
13280C04924o9091G0038a6698A50805e6703C20328A18681J63995g721A34008g8172
$$ y = [268187, -142582, -12273, 100581, 261663, 138273, -27028, 323197, 185360, 205278, 187987, 356318, 531097, 117171, 185280, 606136, 153686, 360798, 444311, 344049, 218555, 207639, 113541, 109995, 117195, 143824, 338632, 143957, 198619, 263671, -231043, 285552, 244462, -119492, 279438, 90956, -300269, -74154, 188947, 267512, -104411, 224141, 111987, 516905, -180944, 275742, 379634, -29248, -74925, 7571, 145791, 283432, 9959, 164071, 86373, 143537, -88612, 307209, 85650, 203065, 92938, 330591, -15847, -69859, -181021, 496972, 24603, 47674, 265044, -92276, 57128, 222734, 201748, 518646, 264784, -17336, 29145, 304924, 235833, 70038, -16698, 150805, -56703, 320328, 118681, 282676, -7721, 134008, -78172]
13268a04647E34461E7839A0520b28311P4588k63119b4396I1886K1040N0414c6367
13256A825L7986p032c15787B64228f8165B29698p2888b28471B17441K1543j8853
13245B20131k9461E6770P6972M8302j6302J31314b62346e0449j44920A04984C675
13233g4574q3477c7558l25894B6173b43010C26525b05970i6598H0612J1477d9744
13221C9800L14219M3044d40288d0103B28401C5789R7827J9779a09584D11266j33536
13210B77730E2043J7756j5273a50884f6876E0233K58704J07342j23502q1345A1828
13198D17147A7898e4873H0433K20371a21828K8145B1443a75231A68164l0560b1267
13186b65717A49424J02031b38737H5931O5942b7850p293C26316D6559R6977M8300
$$ y = [-104647, 534461, 57839, 10520, -228311, -153723, -416842, -24396, 91886, 112926, 163340, -36367, 1825, 39811, 32779, -315787, 264228, -68165, 229698, 156810, -228471, 217441, 238984, 220131, 190670, 56770, 133742, 182044, 165742, 297056, -262346, -50449, -195369, 104984, 3675, -74574, -158051, -37558, -363452, 26173, -243010, 326525, -205970, -96598, 80612, 92089, -49744, 39800, 354019, 397063, -440288, -40103, 228401, 35789, 133616, 153395, -109584, 411266, 277730, 52043, 69799, 54526, -150884, -66876, 50233, 308937, 416279, 292777, 211432, 11828, 417147, 17898, -54873, 80433, 300804, -121828, -93683, 21443, -175231, 168164, 137604, -21267, -265717, 149424, 251455, -238737, 85931, 151873, -27850, -35143, 326316, 46559, 143536, 191836]
13175A91836K24146I9952J0674g0891C14741j04343m7923J84330a0629I6138a57778
13163A52917c6165j65424j5604F9707a42396k6454j12966A83555c2323C6962N414
13152D2376a207B49416a96937B53382b76308C66345a47705B9647a12075l2665
13142a44740n872D2088M23370E0911h4245A33392e1618n2714j74448O7312O8206
13131a43262j19814J16394K9997A58881o4939J5002b4777e709A0833J75117l436
13120A82514D9432c1190B74050A36067f2322n6741B19702j7323a03396n9620B09358
13108a03709K5222B11436A0659L6298a6437B50045a96550C07334A38675O6483
13098B05158D4813N4058K9481n4464P5987a27999I0137a05414E2455K37339a38336
$$ y = [191836, 415982, 99952, 110626, -70891, 314741, 210398, 162475, 346805, -10629, 96138, -157778, 152917, -36165, -201589, -217193, 69707, -142396, -168850, -281816, 183555, -32323, 36962, 42376, -1207, 249416, -196937, 253382, -276308, 366345, -147705, 29647, -112075, -144740, -150612, 42088, 465458, 50911, -84245, 133392, -51618, -104332, -278780, -211468, -143262, -263076, -146682, -116685, 158881, 93942, 108944, -24777, -5709, 10833, 185950, 182514, 49432, -31190, 274050, 136067, -62322, -119063, 219702, 202379, -103396, -163016, 209358, -103709, -78487, 211436, 10659, 46957, -16437, 250045, -196550, 307334, 138675, 205158, 44813, 98871, 128352, 73888, 149875, -127999, 90137, -105414, 52455, 289794, -138336]
13086B21755C8663J76565b16061Q9327J122A50246J36344j38356o9514L97686
13076D76406G3845M6191a08168B998J76818J1724k9333C0887g094r5960C5321
13064B77457M4067j00532b43209F9157K26755H7472K08925a5844k97003H0513
13053b15702a01832M1108j39221J0828B8113J69716I6377r582A1897E041L64403
13042C69444J72517C5149J48471G8771R1189K4711i013C45697A56702F653K6568
13031C3221R8969R8276A9844J3835K45281j28658E4604f7069B03842a51512F1141
13019B23730g7552B55763q7135E7641J80958b77294A48360o8842B8902L033b15883
13007D856a05957C4545P7993D7521J87095a24875A74218l6816J15737d5991p8500
$$ y = [221755, 38663, 215228, -216061, -126734, -125612, 150246, 286590, 148234, 78720, 476406, 73845, 120036, -108168, 2998, 179816, 191540, 162207, 30887, -7094, -103054, 35321, 277457, 321524, 220992, -243209, 69157, 295912, 87472, 296397, -15844, -312847, 80513, -215702, -101832, -60724, -199945, -189117, 28113, 197829, 96377, 86795, 11897, 5041, 369444, 541961, 35149, 183620, 78771, 169960, 194671, -9013, 345697, 156702, 6653, 33221, 132190, 230466, 19844, 33679, 278960, 150302, 54604, -67069, 203842, -151512, 61141, 223730, -77552, 255763, 168628, 57641, 238599, -277294, 148360, 79518, 28902, 31935, -215883, 4856, -105957, 34545, 112538, 47521, 234616, -124875, 174218, 137402, 253139, -45991, -124491]
12996a24491m5508G4791a68530d2301j43158b1990B8117J51065N5217C3873f3576
12984D7976P3948R9507a33633D6847b59847J17255E2758j3558P9530Q422b3530
12972A48986p0095G389a16497j01928k6957B32914K0903e3756C8407J48901o8192
12961A19116c8628G3095l1317a6083A03831B2322Q3526a07584B5256i3975j2131
12950a06106j76213B78778d2929l41518a40919A0201b6979B00722d24394I7073
12939A88070P2922d2591I1994b88558E1131b9244j009j0693A16203O1729i9469
12927C5160J73675e6975n0549A14636i4033B64740j28107B1727i1282A70830i945
12915A88600o5716O1416K2602h7594B98331f3532B67141D7536K1240i8739j33676
$$ y = [-124491, -169999, 74791, -168530, -42301, -185459, -21990, 28117, 179182, 234399, 33873, -63576, 47976, 121924, 221431, -133633, 46847, -259847, -142592, 52758, 39200, 118730, 127152, -23530, 148986, 78891, 7389, -116497, -218425, -245382, 232914, 253817, -53756, 38407, 187308, 119116, -38628, 73095, 41778, -16083, 103831, 22322, 105848, -107584, 25256, -93975, -106106, -282319, 278778, -42929, -384447, -140919, 10201, -26979, 200722, -424394, 97073, 188070, 260992, -42591, 91994, -288558, 51131, -29244, -30253, -40946, 116203, 177932, -99469, 35160, 208835, -56975, -107524, 114636, -94033, 264740, 136633, 21727, -91282, 170830, -9945, 188600, 122884, 184300, 206902, -87594, 298331, -63532, 267141, 47536, 68776, -98739, -232415]
12904b32415A92417b4952A31414J6997i7593A0495J55383K70868A88648N6639
12894B45287a7634B70334A5020c0991A00862C7519K37889n2122p3597F3421b28191
12882b1768G4810d09384A02627a67904D0813a00223E57079A41662R8390G8841
12871i7303o5135B79630e7902j13033l1721a7084C3311f9368a7132k22547O4338
12860a75341h7304o968A8395N5914E767i034A7430Q8422d0511N388l80189a90615
12847e2102I7646l4003J73581a80305B41696l7123p2934a20016J4587j9343b7588
12835G6606J48118b75438G001a49702E4595a94110A8441K10226a83204g9372J4656
12824f4716l3186B46394b24029B15372e8817F1744a79849G2937a09738I2475M9050
$$ y = [-232415, 192417, -24952, 131414, 148411, -97593, 10495, 165878, 436746, 188648, 245287, -17634, 270334, 15020, -30991, 100862, 37519, 275408, 223286, 149689, 63421, -228191, -21768, 74810, -409384, 102627, -167904, 40813, -100223, 557079, 141662, 240052, 78841, -97303, -162438, 279630, -57902, -170935, -202656, -17084, 33311, -69368, -17132, -239679, -175341, -87304, -94272, 18395, 74309, 5767, -9034, 17430, 105852, -40511, -35123, -415312, -190615, -52102, 97646, 63643, 237224, -180305, 241696, 204573, 131639, -120016, -105429, -124772, -27588, 76606, 224724, -275438, 7001, -149702, 54595, -194110, 18441, 228667, -183204, -79372, -64716, -97902, 246394, -224029, 215372, -58817, 61744, -179849, 72937, -109738, 92475, 141525]
12813A41525a9001B35590b35828B53028f1828J3298I2811L7182j3584L05967b06352
12801F5720M4757L7185m0909J9815L7484c9158D7056K85166c38774a30595G0703
12789a23353J5251A17745Q9664E5635a3060l63984J14721D5628a83142F5022K27170
12778B92192a90687j73613a3739m9955m3315b0005p0493l2385C3789P1184D4477
12766D31982a51946A1728K8812b93767A03050J10547c56002B61598p8558H5133
12755D29128C709O6724f5595F4576J0580g0577K2268C9695f8294F7935e376j11277
12743a16653A24247i1904d028k9829D6525b2767A27728c678A96014c13755c212
12731C62489A47099m3091b0575i836k6693A88083E2589b14751K3890j22216A124
$$ y = [141525, -19001, 235590, -235828, 253028, -61828, -48530, 92811, 129993, 116409, 422376, -206352, 65720, 110477, 147662, 106753, 126568, 164052, -39158, 47056, 332222, -338774, -130595, 70703, -123353, -108102, 117745, 207409, 55635, -13060, -377044, -262323, 45628, -183142, 65022, 292192, -190687, -364300, -13739, -63694, -107009, -20005, -90498, -122883, 33789, 104973, 44477, 431982, -151946, 11728, 40540, -293767, 103050, 213597, -356002, 261598, 183040, 85133, 429128, 3709, 70433, -65595, 64576, 75156, -70577, -48309, 39695, -68294, 67935, -5376, -116653, 124247, -91904, -4028, -33857, 46525, -22767, 127728, -3678, 196014, -313755, -3212, 362489, 147099, 104008, -20575, -9836, -36529, 188083, 52589, -214751, -190861, -313077, 1124]
12719c17602J33329J7365K5115e5201k63167E39231A77189o1403L40303e229A44518
12707C48151F6763J21031r1472J09014F0103a59695j37723C7688d4330B27692
12696a61621A00214B4331d13437A08429b0158o2547A70047a42562B81420i5311
12685A76606d7354E7614a15897a0863B87459g7037b6164A15889F229i1565m7128
12674a38693D2646J15666p79K3756q834h3015I2226N9333a79451D7466O4743j8044
12662I4165L05558j36823f742D40912J25156d6256r8948A49831c2156G4099K5082
12651I9181C5451M8036b76287C91107A60170g4940c1745B0778K23680b52287Q4556
12640a67731d9482E8489J04206i0448H2486a74230B71573n3892a33899e154I5776
$$ y = [-317602, -184273, -166908, -141793, -55201, -318368, 539231, 177189, 115786, 456089, -5229, 144518, 348151, 66763, 187794, 96322, 205336, 60103, -159695, -297418, 37688, -44330, 227692, -161621, 100214, 24331, -413437, 108429, -20158, -82705, 170047, -142562, 281420, -95311, 176606, -47354, 57614, -115897, -10863, 287459, -77037, -26164, 115889, 6229, -91565, -138693, 42646, 158312, 157533, 181289, 172455, -83015, 92226, 151559, -179451, 47466, 112209, 94165, 399723, 262900, -6742, 440912, 566068, -46256, -145204, 149831, -32156, 74099, 99181, 35451, 83487, -276287, 391107, 160170, -74940, -31745, 20778, 244458, -252287, -167731, -49482, 58489, 162695, -90448, 82486, -174230, 271573, 217681, -133899, -5154, 95776]
12628I7134K04169j19794G1664K3893J07953D8579a80892A69818j0704a09372
12617b25855A05149c07813c1911D38623H8370a98667A9891L17397b0028K300F2305
12605E24677A67601a57116C1148A3334J06426a41716f584j33521G1997K4730Q880
12594A05607a11772b389A35766M00069A26554K3831g2369I4878L08757D0417K00782
12583B41199b77261A75746J89228d7820E2106K05713J06258c30403C70272a42714
12572A66699R0057b43081A70861G0097A3586J2401b56068A13140a8929O366l6647
12561d9210C10121g9085D7220j2057K9142b16633C0096c54322h3540M026A82507
12549e9561A97025a21875l9053B50216e3234B87409j39170a55292E278a01873
$$ y = [97134, 301303, 181509, 71664, 95557, 203510, 48579, -180892, 169818, 159114, -109372, -225855, 105149, -307813, -31911, 438623, 88370, -198667, 19891, 337288, -20028, -17728, 62305, 524677, 167601, -157116, 31148, 13334, 119760, -141716, -6584, -140105, 71997, 96727, 105607, -111772, -2389, 135766, 535835, 126554, 150385, -72369, 94878, 403635, 40417, 241199, -277261, 175746, 364974, -47820, 52106, 257819, 364077, -330403, 370272, -142714, 166699, 256756, -243081, 170861, 70097, 13586, 25987, -256068, 113140, -18929, -12563, -49210, 310121, -79085, 47220, 35163, 64305, -216633, 30096, -354322, -83540, -79514, 182507, -59561, 197025, -121875, -160928, 250216, -53234, 287409, 148239, -155292, 5278, -101873]
12538i2149d5808A7098O7131a00649G7653a3668A51164B4062b56954D6354j8151
12527B8203R4143a65665F33M07213A67923d7562D1593G281e933j58382h1707B24065
12514d3449o6070M0915c1255M214k99168a54153H3865J06174A6855M7465i4389
12502A15754J15947d5999k07985A38381m3029a74820O5492B19401c2614a4456
12491A57555d70482b00614F4676b49239l6015d8967A64408a16814G823K33642
12481B41465A12750d4559n1520a2631A57800E528b66847j55622a74880q2500A79323
12469f9735A63530m6126d1428p5699H0934a50660A01055J10473J71880a70357
12458B42527i5834G3773g3754k539B8617K8938N30102a74491B35990F1264O6056
$$ y = [-92149, -45808, 17098, 84229, -100649, 77653, -13668, 151164, 24062, -256954, 46354, 28203, 122346, -165665, 633, 407846, 167923, -47562, 41593, 7281, -5933, -164315, -81707, 224065, -43449, -109519, -68604, -31255, -27041, -326209, -154153, 83865, 190039, 16855, 64320, -94389, 115754, 231701, -45999, -253984, 138381, 95352, -174820, -109328, 219401, -32614, -14456, 157555, -470482, -200614, 64676, -249239, -285254, -48967, 164408, -116814, 7823, 241465, 112750, -44559, -96079, -12631, 157800, 5528, -266847, -422469, -174880, -257380, 179323, -69735, 163530, 117404, -41428, -117127, 80934, -150660, 101055, 211528, 383408, -170357, 242527, -95834, 73773, -73754, -76293, 28617, 57555, 587657, -174491, 235990, 61264, 127320]
12447A27320J07644E891b30910k88793a23906o9017f3479r1946C0831N1478c68992
12435c7513A4185a33880h371A05641A1604a5474I5553m5037O5321c8628H1506
12423a42180l8426d4766B87816a0622j11857A65707b94608N5320B2776b15682
12412f0108N597G7681g1310j309A27569b11947A99256h3453K9520A329c597A3216
12399C47738A26618d0501A60383N6044a15520m6337n1317k26685K19256n0310
12389b70913A09771d11166A10085a20135k20811O0288B52216a49482A63691c9585
12378A2718O5290K9903a69537A02274K32926j11217a66839k64295a93279A5366
12367A54203f3679j99982f8447q7915A48960K0158P5114D960M1413a45588B27094
$$ y = [127320, 234964, 5891, -230910, -519703, -123906, -192923, -63479, -155425, 30831, 82309, -368992, -37513, 14185, -133880, -8371, 105641, 11604, -15474, 95553, 50516, 115837, -38628, 81506, -142180, -180606, -44766, 287816, -10622, -122479, 165707, -294608, -239288, 22776, -215682, -60108, -54511, 77681, -71310, -72619, 127569, -211947, 199256, -83453, -53933, 1329, -3597, 13216, 347738, 126618, -40501, 160383, 216427, -115520, -161857, -213174, -439859, -220603, -270913, 109771, -411166, 110085, -120135, -340946, -280658, 252216, -149482, 163691, -39585, 12718, 78008, 107911, -169537, 102274, 335200, 223983, -166839, -431134, -193279, 15366, 154203, -63679, -263661, -68447, -156362, 148960, 169118, 244232, 4960, 46373, -145588, 227094]
12355i1682I3980a60680B51606g7544n5084H9486e4528n1486J0817H4043J22964
12344B07007A4082L9594g3187A6720f3372G6794G606b16730B18477H7422b40677
12332A02286a42888G3827J57259F30a34096O6927j79621A09395J15602a50110
12321a55000O5888A73389a06763j35924J18438A57038b1049A58462f5681j45453
12311b11134B0882b23357a7630j37031G4184q535P6861c00113J47595B26149a00306
12299a39515A67600n819b50225A62611i8250K6280j05108A60185c22904A8752
12288D33529B16708o1197M4679a68495C1091P8850L3063J29137a1486C1123J31396
12277A62519k1521g3268C27923p6166L2916p6919G7873N3938a37251C33796j49239
$$ y = [-91682, 93980, -160680, 251606, -77544, -132628, 89486, -54528, -106014, -95197, 84043, 207007, 14082, 53676, -73187, 16720, -63372, 76794, 7606, -216730, 218477, 87422, -240677, 102286, -142888, 73827, 231086, 630, -134096, -67169, -246790, 109395, 224997, -150110, -155000, -89112, 173389, -106763, -242687, -124249, 157038, -21049, 158462, -65681, -211134, 20882, -223357, -17630, -154661, 74184, 65649, 142510, -300113, -152518, 226149, -100306, -139515, 167600, 161781, -250225, 162611, -98250, -71970, -177078, 160185, -322904, 18752, 433529, 216708, 155511, 200190, -168495, 31091, 109941, 143004, 272141, -11486, 31123, 162519, 140998, -73268, 327923, 251757, 284673, 207754, 77873, 131811, -137251, 333796, 184557]
12266A84557Q4453C1280b2432B63427H7619O3714c14460A58292m7984L4553f5315
12254A24502a16825F1478J94384F0951K7437K03064j00348k3341a78787Q0239
12244i8548C39300A45650K42751A83898b89496A36411b7930j95357B77827G6926
12233c1060C79107d2325B2540L3226J12612C9454j1327d7668B48577G8815K47347
12222C26162J37218p9550j11159A9914J84128N76911A87743O6095a39634f8959
12211I617g8670B70586A649M31948A72613o2378E1340M9209K88041e4382n7488
12200a11870B97578A21386J9114C6164L51006a3411j43802O478B08464p5798K04446
12189C37112A64487J49511B4831a78873B27001J880a02880F9230P1329a86436
$$ y = [184557, 269010, 31280, -22432, 263427, 87619, 151333, -314460, 158292, 110308, 144861, -65315, 124502, -116825, 61478, 255862, 60951, 88388, 291452, 191104, 167763, -178787, -98548, 339300, 145650, 388401, 183898, -289496, 136411, -27930, -223287, 277827, 76926, -31060, 379107, -42325, 22540, 55766, 168378, 39454, 28127, -47668, 248577, 78815, 326162, 463380, 383830, 272671, 19914, 204042, 780953, 187743, 253838, -139634, -68959, 9617, -78670, 270586, 1649, 433597, 172613, 110235, 51340, 100549, 388590, -54382, -111870, 297578, 121386, 140500, 36164, 387170, -13411, -157213, -150735, 208464, 132666, 337112, 164487, 313998, 24831, -178873, 227001, 228881, -102880, 69230, 140559, -186436]
12178A45640l36L7599b1768F28Q648L10535b4141B75145B7043J35439a470m0052
12166d1522D1978J20296H0122e1929B52130J12824b37196G1405J49219I3548N1206
12155A44754c3624A87751J91654j15711J3094E8191F26d086j23993L8872A51262
12143D1231K19824M3918H1944c00222B02984q1898b7260n2420F1589f0615j784
12132f2399A08370d53473E37287a85226I2044a23021A06559b20660g2790E910
12121B007b45284c9199C67510B6682c6047b148k8401k54186d7829j1848j51797
12110b11474B89443E9052J39659a71808K9529B16165O6310H9248J4526D0496L73142
12099D13638a81840N8614j06272h2577r9281M1512f2270I4364O9326F3818N0526
$$ y = [145640, 145304, 182903, -21768, 628, 9276, 319811, -24141, 275145, 27043, 162482, -1470, -41522, 41978, 162274, 80122, -51929, 252130, 364954, -237196, 71405, 220624, 93548, 144754, -33624, 187751, 379405, 263694, 276788, 58191, 626, -4086, -128079, -89207, 151262, 41231, 261055, 304973, 81944, -300222, 202984, 121086, -27260, -79680, 61589, -60615, -62399, 108370, -453473, 537287, -185226, 92044, -123021, 106559, -220660, -72790, 5910, 2007, -245284, -39199, 367510, 26682, -36047, -2148, -30549, -284735, -47829, -59677, -211474, 289443, 59052, 198711, -171808, -142279, 216165, 282475, 89248, 103774, 40496, 413638, -181840, -123226, -229498, -82577, -181858, -140346, -62270, 94364, 163690, 63818, 114344]
12088A14344b09207M5957n7580F7418j6087J65005b46918I3505A8349A851P82650
12077G84501L37601J341411I81189k81779l17728c41736a35839C21537e0898K0771
12067c0127C53158B4580L4259c3760e918A51964a88233C5956a5162A78749N6557
12056B35306a08445C16607c55571q7784G2048c546q1334E2346b8299j3474D69888
12044C6038a76553A72668e7636J8951F396a44951o7198M051o5991a16844j16110
12033b32954B2327P1360b71654G4849e9732k9609j04627j1178A45860a1435p7716
12022h9151r555b0620D2693J1718c07031G0454g3498f409j21164L3191j6470F7799
12009F5147R0293E036a91753B05634I2349c3182C76327D6233b09533A3112a6157
$$ y = [114344, -209207, -163250, -220830, 67418, 51331, 216336, -246918, 93505, 18349, 1851, 784501, 1122102, 2463513, 981189, 699410, 381682, -341736, -135839, 321537, -50898, -30127, 353158, 24580, 58839, -33760, -5918, 151964, -188233, 35956, -15162, 178749, 235306, -108445, 316607, -355571, -443355, 72048, -3546, -84880, 52346, -28299, -41773, 469888, 36038, -176553, 172668, -57636, -38685, 6396, -144951, -212149, -208098, -274089, -116844, -232954, 22327, 93687, -271654, 74849, -59732, -89341, -193968, -205146, 145860, -11435, -89151, -98706, -20620, 42693, 54411, -307031, 70454, -73498, -6409, -127573, -94382, -110852, 67799, 65147, 155440, 5036, -191753, 205634, 92349, -33182, 376327, 46233, -209533, 13112, -16157]
11997c6305B43032b29681A24237a79457A58552C8229a93812C89688f1169C94080
11986a15018k1428L8048p8886M6922l34054A69088a58335b8442n7319j75707A06855
11974a40438A26087Q097m2450a02522A88200F5590P3684c01449a27798J0609L423
11963a13766B24387a12072k747A68638b65017A70603B5175f2855B6144K51037
11953B77181A10392R1503q6746m8462Q7000a00060L0035B93031a26557Q664a0469
11941H8380a23352j0474F1169J60585B0319a27725B41072E842a64022A06061J08151
11930B14212c9046B85a93681G2d71698C5105c06862A3423J53077L9577G6671c02727
11917a76099B6217R6952e2360l8941j20294F2408L5995b83024B4366c0100o0107
$$ y = [-36305, 243032, -229681, 124237, -179457, 158552, 38229, -193812, 389688, -61169, 394080, -115018, -136446, -98398, -177284, -130362, -464416, 169088, -158335, -28442, -85761, -261468, 106855, -140438, 126087, 134184, 91734, -102522, 188200, 65590, 139274, -301449, -127798, -117189, -113766, 224387, -112072, -114819, 168638, -265017, 170603, 25175, -62855, 26144, 277181, 110392, 201895, 115149, 66687, 153687, -100060, -70025, 293031, -126557, -117893, -10469, 88380, -123352, -133826, 61169, 221754, 20319, -127725, 241072, 5842, -164022, 106061, 214212, -39046, 285, -193681, 72, -471698, 35105, -306862, 13423, 166500, 206077, 76671, -302727, -176099, 26217, 123169, -52360, -91301, -211595, 62408, 98403, -283024, 24366, -30100, -90207]
11906i0207k1632k0837j68960f907A49225g9410l06207a78429j40173a36273B27906
11894c3556j78143A67890c16593B26830b12957D5040b831C45017H892J6161j0317
11883A4736b17341j10442B04584d26908E5176M3754P6240g460A31076N0689B1501
11871c9612B76115F7513g3370B29409a21123k0387b8431A85253a0395I0881b64398
11859a69755d8280A53952g4358j4580k43703A08260a45400A23140e2828F3275
11848e4640j13247P3030B06305a12516G6000q334b04109e6761j39482C08600A2656
11836d82j50152J4263B06249h3396l31379G7244J14023a3488l52004J35281a4017
11824A92335P9849b66024K4139I5984i6501A71471c8765f7l1934q1919L0054L449
$$ y = [-90207, -111839, -132676, -301636, -6907, 149225, -79410, -385617, -178429, -318602, -136273, 227906, -33556, -211699, 167890, -316593, 226830, -212957, 45040, -2831, 345017, 8892, 25053, 14736, -217341, -327783, 204584, -426908, 55176, 98930, 175170, -7460, 131076, 181765, 21501, -39612, 276115, 67513, -73370, 229409, -121123, -141510, -28431, 185253, -10395, 90881, -264398, -169755, -48280, 153952, -74358, -88938, -332641, 108260, -145400, 123140, -52828, 63275, -54640, -167887, -94857, 206305, -112516, 76000, 67666, -204109, -56761, -196243, 308600, 12656, -482, -150634, -136371, 206249, -83396, -414775, 77244, 191267, -13488, -365492, -230211, -14017, 192335, 272184, -266024, -241885, 95984, -96501, 171471, -38765, -67, -32001, -113920, -83866, -80417]
11812h0417A83487d7361A11802E4252K05928b5420A03481a56127a8313A29394
11801g2958b1054G8227J60980a43920b0709m40709C1212J90340f5486h247B9746
11789E4050e4524D81283b7004A78333a43358j09224c8256B00581a15543M2549
11779g2994n8440k11368B22106h6077b5789R547k56865E6581B5902a08658j8390
11768a27048C5625b42508E4840j8623a152C97584a39085A60214a77752A4200i7437
11756a49026O3379G7125c59793I0654f4581H1367a33372q5153B43477B5956H65
11744G8528f2171j11734Q2052c1002p100D4696a11111o9325C478R1520N7674h5162
11731A37092g8107c1513m3082H7704a98239f2845p3423O5431H6995n840J11674
$$ y = [-80417, 183487, -47361, 111802, 54252, 260180, -25420, 103481, -156127, -18313, 129394, -72958, -21054, 78227, 239207, -143920, -20709, -461418, 31212, 221552, -65486, -8247, 29746, 54050, -54524, 481283, -27004, 178333, -143358, -252582, -38256, 200581, -115543, -72994, -131434, -342802, 222106, -86077, -25789, -16242, -273107, 56581, 25902, -108658, -127048, 35625, -242508, 54840, 36217, -1152, 397584, -139085, 160214, -177752, 14200, -97437, -149026, -85647, 77125, -359793, 90654, -64581, 81367, -133372, -218525, 243477, 25956, 865, 78528, -62171, -173905, -91853, -31002, -38102, 44696, -111111, -180436, 3478, 94998, 152672, -85162, 137092, -78107, -31513, -74595, 87704, -198239, -62845, -136268, -70837, 86995, 81155, 192829]
11720A92829a61125I1067a93831f8383b7038D04775l1270b3793G5265d4222o9484
11709a13706C32475I0437C6058c8386j55877C6629A5107b0346O48A45488K64424
11698D09912b41359d9238G0450r699J78039B3308b4377B37585G8491a64385A15157
11686g6362A55865o687R4146a49438f2655O020H4609R0574L1087D1203L634b79591
11673C7636L0837a15677D1461N1389a24674A80561a63285E2351K43925m4658g8722
11661C4227J39494i6859j64474E7034a0294C0834M09579f5301k38543B06132c37744
11649b73921D12466D9591a02687A00182J69658a77587k31862c1878B5402J34572
11639A59974K295b36101A48084M7136l5634m1439A3088K23835i9005D30941D1324
$$ y = [192829, -161125, 91067, -193831, -68383, -27038, 404775, 373505, -23793, 75265, -44222, -113706, 332475, 90437, 36058, -38386, -194263, 36629, 15107, -20346, -19698, 145488, 409912, -241359, -49238, 70450, 60751, 238790, 23308, -24377, 237585, 78491, -164385, 115157, -76362, 155865, 149178, 243324, -149438, -62655, -56635, 84609, 175183, 206270, 41203, 44837, -279591, 37636, 68473, -115677, 41461, 92850, -124674, 180561, -163285, 52351, 296276, 251618, -78722, 34227, 173721, -96859, -261333, 57034, -10294, 30834, 440413, -65301, -303844, 206132, -337744, -273921, 412466, 49591, -102687, 100182, 269840, -177587, -409449, -31878, 25402, 159974, 162269, -236101, 148084, 195220, 159586, 118147, 13088, 236923, -99005, 430941, 41324]
11627a21733k537N4560B30566c32106F4273P0567a49217g78k47956A41076c94065
11615A69530b0890k45698B43564L8344l8507J52214A35916E4411j5956A8020J36135
11604A54155J64362a09411B24065q6008F0716a80924L7466B03135L043a72593
11593D3625R1245B0638e6792e744C7813a2275A83530c444B16446b2200j6470j99403
11581b38073C7222b0900E4203a16160B18458d39868A36558r652R6352h6704K5295
11570f1409m8780D6193G523J80571a76369B02220A0652M84397D1801K4274J4604
11559H0679R9676Q9326c48509G0519R7756p6085b4198o7262A67582p6285d5996
11547B21219a8279O39B845K93713b0037E8418L84616a06714C60378j37568c2642
$$ y = [-121733, -124270, -69710, 230566, -332106, 64273, 134840, -149217, -778, -248734, 141076, -394065, 169530, -20890, -266588, 243564, 281908, 243401, 395615, 135916, 54411, 38455, 18020, 154155, 318517, -109411, 224065, 138057, 60716, -180924, -143458, 203135, 206178, -172593, 43625, 134870, 20638, -56792, -5744, 37813, -12275, 183530, -3444, 216446, -22200, -38670, -238073, 37222, -20900, 54203, -116160, 218458, -439868, 136558, 126906, 223258, -86704, -61409, -110189, 46193, 7523, 188094, -176369, 202220, 10652, 495049, 41801, 66075, 80679, 180355, 269681, -348509, 70519, 168275, 92190, -24198, -91460, 167582, 91297, -45996, 221219, -18279, -17640, 2845, 296558, -20037, 58418, 443034, -106714, 360378, 222810, -32642]
11535E4733a18878A02727J43154C9815e4970C67041l6398a9404B85716j08412
11525A77304l2207E1522L0136j2884K36950c1623A22266J58905j16646E5779Q6335
11514A42114b01201F319J09862c1202I137p41O6028J42834b5537C16262A38419
11502B43528L5621N6867k8261j50907d4322j23802B77980d1533B76259f4668A06818
11490b0466A63493o4419L92096d6307A32429K93077A57417p3012l1084M1502E092
11478C60280A20413p190i5363K2635A60758J35062b70622c5632m0236m9634C8405
11466C80607A49501Q844j2834F2023J99867j27341b4213A44424f0358k22845J39877
11455a43326o6460H7390A1798a5448I1501k9242R8309g2196C49529j06528n0536
$$ y = [54733, -118878, 102727, 245881, 39815, -54970, 367041, 330643, -19404, 285716, 177304, 145097, 51522, 81658, 68774, 305724, -31623, 122266, 281171, 164525, 55779, 142114, -201201, 6319, 116181, -31202, 9137, 8396, 74424, 217258, -25537, 316262, 138419, 243528, 279149, 336016, 307755, 156848, -44322, -168124, 277980, -41533, 276259, -64668, 106818, -20466, 163493, 99074, 491170, -46307, 132429, 425506, 157417, 84405, 53321, 94823, 5092, 360280, 120413, 113223, -95363, -72728, 160758, 295820, -270622, -35632, -75868, -125502, 38405, 380607, 149501, 158345, 145511, 62023, 261890, 134549, -24213, 144424, -60358, -283203, -143326, -209786, 87390, 11798, -15448, 91501, 62259, 160568, -72196, 349529, 243001, 192465]
11444A92465a90600f1243A45961i7388B46700B3721Q55b95770J24910A38774B0678
11432A61410A6935a00416B44981j05825J52412D744g5335B65377j21203a77919
11421B4356O104Q0671a94594e7499A90789b02338l8703C9676b54678j9347B19890
11409B61156h7923I7264J2110c163p7266D33701B2016J82816a11876B823J74711
11398A77534p9460O9426p9016M62525d9839j55768A36637o5619c1750j12753G3117
11386a03948A11445O6355a71461l1958i3084k24800c8810j77819G8594C3222j489
11375C1733a36198B2676J46130a06803A34891F5650p553N1061O4328B9496J09731
11364A39227a45729j37497a17337I9594h4992n1140m4961C0520Q7634a9221j61519
$$ y = [192465, -190600, -61243, 145961, -97388, 246700, 23721, 24576, -295770, -170860, 138774, 20678, 161410, 16935, -100416, 244981, 139156, 291568, 4744, -75335, 265377, 144174, -177919, 24356, 30460, 111131, -194594, -57499, 190789, -202338, -241041, 39676, -254678, -274025, 219890, 261156, -87923, 97264, 109374, -3163, -80429, 433701, 22016, 204832, -111876, 2823, 177534, 98074, 167500, 88484, 551009, -49839, -205607, 136637, 71018, -31750, -144503, 73117, -103948, 111445, 177800, -171461, -203419, -93084, -317884, -38810, -216629, 78594, 33222, 31733, -136198, 22676, 168806, -106803, 134891, 65650, 58097, 109158, 173486, 29496, 139227, -145729, -283226, -117337, 99594, -84992, -136132, -181093, 30520, 118154, -19221, -180740]
11353a80740c4415o0824j84167N3014B30408a5705B0525K68096j25106F7778J96343
11342B64121h6097B80851D4420J51040F2104b29390B54721a98011R5450q2719
11332a85280G4149a97367p3307C958h1826A76355c56691H3357A1371M16225a68881
11320b91069a9475A35860J26465i6661b9084c535k5687k83612f6433q3912f4194
11308B77d45395B40353a74620N571A07403a36213k19372C5394c78882c7052C2582
11296B26915a03862E1688J3317Q9202O2680F4670a38893I285e8777p2993B26216
11284C4372K90375j28922h9514B9085a40430E5439a08470A69972p8160m0706J10327
11273A61433k5857D2861h6189l06203F9865a09649B75178b60782G1824c72926
$$ y = [-180740, -34415, -95239, -279406, -226392, 230408, -15705, 20525, 288621, 163515, 67778, 264121, -86097, 280851, 44420, 195460, 62104, -229390, 254721, -198011, -102561, -185280, 74149, -197367, -270674, 3958, -81826, 176355, -356691, 83357, 11371, 427596, -168881, -291069, -19475, 135860, 262325, -96661, -29084, -3535, -29222, -312834, -66433, -150345, -64194, 277, -445395, 240353, -174620, -169049, 107403, -136213, -355585, 35394, -378882, -37052, 32582, 226915, -103862, 51688, 65005, 154207, 216887, 64670, -138893, 9285, -58777, -131770, 226216, 34372, 324747, 195825, -89514, 29085, -140430, 55439, -108470, 169972, 91812, 51106, 161433, 135576, 42861, -86189, -392392, 69865, -109649, 275178, -260782, 71824, -372926]
11262B41761A0025J80367a79690I9910Q7386H8932c47738b2041j31522f1389O648
11251e4741P13l9050D5418J60849a9515j85233a00379D345N0870a92571P7146
11240a15425j21142I3180R6708r0312C5362c55463J67904k47158K14474q3313
11230c03556C71703a09530q6165a1909l76187H5779b93936B2042h2226A62109
11219e2301j11290c3484n4171k0113A4706g4042j58807j96107B85671e8473k14544
11208b73017e5816R696k46123a7302L484B2462b09500I6869a22589k23731B9248
11196a50241A27482a09475H7690a73643L8041G0869M6892P2080b56898k35601
11186d92499J26333a4449l4190A47682b82533J40714A45892b05499o2690b7171
$$ y = [241761, 10025, 190392, -179690, 99910, 187296, 88932, -347738, -22041, -153563, -61389, -54741, -54028, -93078, 45418, 206267, -19515, -204748, -100379, 4345, 55215, -192571, -115425, -236567, 93180, 189888, 99576, 35362, -355463, -187559, -434717, -220243, -303556, 371703, -109530, -195695, -11909, -388096, 85779, -293936, 22042, -82226, 162109, -52301, -163591, -33484, -87655, -107768, 14706, -74042, -232849, -428956, 285671, -58473, -273017, -55816, -46120, -292243, -17302, -13818, 22462, -209500, 96869, -122589, -346320, 29248, -150241, 127482, -109475, 87690, -173643, -135602, 70869, 117761, 189841, -256898, -492499, -366166, -14449, -48639, 147682, -282533, -141819, 145892, -205499, -268189, -27171]
11175b30983f6507k56545B04722l0504b08274b0502l12540a04264A68625C6577
11164b11218A0289J57168R1251h206H1771h3093H827M8963k3010c763q7857A02053
11151B1382K65244A11140a18578i281l97884C34116i7032C4782L7687j9133c12913
11139b57317L2126R3916B709K92111a90953B66251G1210G674b0382F09736a02323
11127B7105i995k14304G6654a8940j10713A23382l533D1190e2810j0124l44463
11116d07397N1850A43607J83194l9094a09484B49841j07147J40325J9274A14700
11105h1714A05325j1403R8922a25008K32B04242L6825B1257N3374e7887B56685
11093C9761e1569A78221G5425K06092A05354L0250K60307A44167a06485k15201
$$ y = [-230983, -66507, -323052, 204722, 174218, -208274, -20502, -333042, -104264, 168625, 36577, -211218, 10289, 167457, 258708, -8206, 81771, -83093, 8827, 57790, 34780, -3763, -91620, 102053, 21382, 286626, 111140, -118578, -9281, -407165, 334116, -97032, 34782, 72469, 53336, -312913, -257317, -225191, -131275, 2709, 294820, -190953, 266251, 71210, 7674, -20382, 609736, -102323, 27105, -9995, -224299, 76654, -18940, -129653, 123382, 119849, 41190, -52810, -62934, -407397, -355547, 143607, 326801, 287707, -109484, 249841, 142694, 283019, 302293, 114700, -81714, 105325, 93922, 192844, -125008, -124776, 204242, 241067, 21257, 74631, -57887, 256685, 39761, -51569, 178221, 75425, 281517, 105354, 135604, 395911, 144167, -106485, -321686]
11083c21686G7256L24061A24483P719K34790j22580E9081M99850k69073K82415
11073E72273j33173j10377A11524a39429B10569H9771K02050q5015d0655E33824
11062D25913J1018j06074A25997M16862j21274A85933L07983Q7181k52663L32596
11052F61030J84811J53092m78146K11181Q4648k55124Q2005J46898k86316m7325
11042D56754J9035L65288p1159k21421Q3041o8885K33520k84779m815j43108L15067
11031F78538j70083J80702j09897J53420j25886o4108J02749j4948j03868M12994
11021I39613k30976k30932n8134J35454r8531Q2729J1717J064L8945M9253o5379
11010E74823j02469r8599L11828M6575l53482L15726l20376J30255J23622J17371
$$ y = [-321686, 77256, 401317, 124483, 132202, 366992, 244412, 59081, 558931, 289858, 572273, 439100, 328723, 111524, -139429, 210569, 89771, 291821, 206806, -40655, 533824, 425913, 436931, 330857, 125997, 542859, 421585, 185933, 493916, 581097, 328434, 661030, 845841, 998933, 520787, 731968, 816616, 561492, 643497, 790395, 504079, 456754, 475789, 841077, 769918, 548497, 631538, 562653, 796173, 511394, 506579, 363471, 678538, 508455, 689157, 579260, 732680, 606794, 542686, 645435, 630487, 526619, 939613, 708637, 477705, 419571, 555025, 456494, 539223, 550940, 552004, 590949, 640202, 574823, 472354, 373755, 685583, 732158, 378676, 694402, 374026, 504281, 627903, 745274]
11000G45274j55188j865J47765N8376C94204K39674q8136k4226J21910L40429
10990I83855j47557l11276L58648m9295R2071r8404P275J43350J28445J56063
10980A263175m11054K41398K40448M07882k1734J76190K29075K46849j80364j73997
10970B017868J75736J23276j69593j50260r8418k72153r4628p3108j85315N3963
10960A327368L20917J50211K28923j28238r7998N328Q2195l97943j01001p4879
10950A314883k30814k02815C60564o404o7055O084D8798N01095a55108N601f5829
10938A8149L63410I6033b6846B17499E9613K18487A8956J16388f0712J4891B6173
10926B85601k6118D4091J48420A1990J07890g6479A02852J88207r8998H5005a12301
$$ y = [745274, 590086, 588221, 735986, 794362, 394204, 633878, 545742, 521516, 643426, 983855, 836298, 525022, 883670, 834375, 926446, 828042, 835317, 978667, 1107112, 1263175, 852121, 1093519, 1333967, 1741849, 1720115, 1896305, 2125380, 2372229, 2191865, 2017868, 2193604, 2316880, 2147287, 1997027, 1898609, 1626456, 1531828, 1458720, 1273405, 1327368, 1648285, 1798496, 2027419, 1899181, 1801183, 1806511, 1888706, 1490763, 1389762, 1314883, 1084069, 881254, 360564, 354160, 287105, 293189, 48798, 549893, -155108, -149507, -65829, 18149, 381559, 96033, -26846, 217499, 59613, 278100, 18956, 135344, -60712, -45821, 26173, 285601, 259483, 44091, 192511, 11990, 119880, -76479, 102852, 291059, 192061, 85005, -112301]
10914b1662B64644R662L7102a29473j24622C18142j28715G3302a39442A95192
10903A7723J50574h1470A10378L2557b86167C7303J0438K31574d9122A22682a60784
10891a19318l4505k995d7767j1292A58884C0304a15118n3654j18494O1350d8987
10879A13429j5735J51538a68798C56048J3631I8462b17528k500A40870N7418a28095
10867c4242B2496K471e4767B49270N7912j20085C2245f2278A34192a34074e8165
10855a22362r2050d0253j04148K7119J4520l4992d3117B50211e5702C150c07608
10843c1266A3251b16107B9660J94421c1488n2759j68952E3179a06022H5398o293
10832G9105a92874H1095b03503j34486J9222A42423b20103f9416j75427f6043
$$ y = [-21662, 264644, 274306, 311408, -129473, -254095, 318142, 189427, 73302, -139442, 195192, 17723, 168297, -81470, 110378, 142935, -286167, 37303, 47741, 279315, -49122, 122682, -160784, -119318, -153823, -156818, -47767, -59059, 158884, 30304, -115118, -168772, -287266, -225916, -48987, 113429, 97694, 249232, -168798, 356048, 369679, 98462, -217528, -220028, 140870, 198288, -128095, -34242, 22496, 24967, -54767, 249270, 307182, 187097, 32245, -62278, 134192, -134074, -58165, -122362, -214412, -40253, -144401, -117282, -102762, -137754, -43117, 250211, -55702, 3150, -307608, -31266, 13251, -216107, 29660, 224081, -31488, -84247, -253199, 53179, -106022, 85398, 79105, -192874, 81095, -203503, -337989, -318767, 142423, -220103, -69416, -244843, -66043]
10821I4400K74189A6790L84888b59329B9781J13430n2398h4146l8193C3190a39009
10809a32520M5224D8869J06997d76476a9524j41284A37216J7755a92802k94483
10799d87285a23134Q523A5677J7946a36966a5035G8916b0457E7004h8305l77163
10788d65468D03647b70563J08889f340G9148D986a51872G0295f0010j50610A52907
10776F5472k0336O8763a44146B93356n9308i0725B05527c1618q0301B42263b85568
10764A76651g6726k0983H8380a29587k37077A8116e5532j99973C10232a38847
10753a9580B97557b22676O9998j10001d3327j76458B87453b3882m2035k59025
10743c24942A2138d61980a63626B07296k7348a03275A85563a45263j8060j00866
$$ y = [94400, 368589, 16790, 401678, -259329, 29781, 143211, 90813, -84146, -122339, 33190, -139009, -132520, -87296, 48869, 155866, -476476, -19524, -160808, 137216, 154971, -192802, -487285, -123134, -114611, 15677, 33623, -136966, -15035, 78916, -20457, 57004, -88305, -465468, 403647, -270563, -161674, -6340, 79148, 4986, -151872, 70295, -60010, -210620, 152907, 65472, 45136, 113899, -144146, 293356, 234048, -90725, 205527, -31618, -111919, 242263, -285568, 176651, -76726, -97709, 88380, -129587, -366664, 18116, -55532, -255505, 310232, -138847, -19580, 297557, -222676, -152678, -262679, -43327, -219785, 287453, -23882, -65917, -324942, 12138, -461980, -163626, 207296, 179948, -103275, 185563, -145263, -163323, -264189]
10733b64189A11201b40104O4038j99361a4170j90082C09809G0984a58868A13967
10722b60206d0699D8657J8957I986c38001i9320A12672b04380B90135c748n2594
10711e6342l0278C7745M5896c150o5030j13180F2717K6593D2705M7488b3721k511
10699b6232B91297I8692a94727A20343b22786N8382d1725D8040L0805j6906K12059
10688B73998a26412A78207c63844A01160b0529m7665B39241k5591e51698h9939
10677A30066b20428H6605a31821j07227j446e6511j09864H6161e01416a80987
10666a02209M4152j94923o6092A8857a59044A17898a41477B40921A9499i4979
10655B5110J01559a85694B13753F3028N6030c92017F3041g9621C21930A2477e2478
$$ y = [-264189, 111201, -240104, -176066, -375427, -14170, -204252, 309809, 70984, -158868, 113967, -260206, -40699, 48657, 67614, 9986, -338001, -99320, 112672, -204380, 290135, -3748, -56342, -86620, 37745, 83641, -3150, -68180, -181360, 62717, 89310, 42705, 90193, -23721, -26232, 291297, 98692, -194727, 120343, -222786, -164404, -41725, 48040, 78845, 61939, 273998, -126412, 178207, -363844, 101160, -20529, -68194, 239241, 213650, -551698, -89939, 130066, -220428, 86605, -131821, -239048, -240494, -56511, -166375, 86161, -501416, -180987, -102209, -58057, -252980, -319072, 18857, -159044, 117898, -141477, 240921, 19499, -94979, 25110, 126669, -185694, 213753, 63028, 119058, -392017, 63041, -79621, 321930, 12477, -52478]
10643a02110j05429K0182a1219A16196D636J8788i3511H2766L7677a75286e0727
10631e534m4452A36569d33619A33742j1730A0682K80694c2486A6032a63381k87287
10620d50668a45914j84196A19350a67272C3566i019A62285J35826A01717b5781
10609a74238A96559M7641M3947b596I2307c01160G9224A8531J08728a53622l5464
10598a89086O2352F7516b9085A77205Q6037E4023J06335p8946c6896m03715J81433
10587b59178A10698a34630j20808O2038m3691A10167a0080k9044n3014A76578
10576b94329j1286I245n24h9099n9770j6634G6767g0184l8454A08548L70120a29460
10563c17311A09964Q4678d29981B35536c78441j803J42570A82006a45664N4188
$$ y = [-102110, -207539, -187357, -11219, 116196, 4636, 23424, -93511, 82766, 120443, -175286, -50727, -5534, -49986, 136569, -433619, 133742, 122012, 10682, 291376, -32486, 16032, -163381, -450668, -145914, -330110, 119350, -167272, 33566, -9019, 162285, 298111, 101717, -25781, -174238, 196559, 244200, 288147, -2596, 92307, -301160, 79224, 18531, 127259, -153622, -189086, -126734, 67516, -29085, 177205, 263242, 54023, 160358, 81412, -36896, -440611, -259178, 110698, -134630, -255438, -193400, -237091, 110167, -10080, -39124, -92138, 176578, -294329, -305615, 9245, 8721, -89099, -148869, -165503, 76767, -70184, -108638, 108548, 478668, -129460, -317311, 109964, 194642, -429981, 235536, -378441, -380244, -237674, 182006, -145664, -91476]
10553i1476A8556h0945a9756j25792C02441A31787o0658c01990H5080P7450a63167
10541A5413K00071i6370A94428d6072D0912d88839H4314h91j46166k02177a0807
10529a96193I4648a78895p4183H0468M156i5803b0362O780A86246P7946q9492
10518A74700D2555c3228l52970c2034A7921a51000e4045a0624A94066a99475a3327
10506a4286I9240b97041A52047K3201c7244A52357j1557k4555d02173J38350f265
10494b9065D30J059a27277a0162B27117E4398e763I9021A47b47310h461B01020
10481C01301J65455j29353J02002N6490j88285b8124A56694J90408G9055K72382
10471C51437A69877a01262H63d26177A72868J19242B5024K13661A8790a51786
$$ y = [-91476, 18556, -80945, -19756, -145548, 302441, 131787, 71129, -301990, 85080, 162530, -163167, 15413, 215484, -96370, 194428, -46072, 40912, -488839, 84314, -891, -147057, -349234, -10807, -196193, 94648, -178895, -253078, 80468, 84624, -95803, -20362, -13582, 186246, 264192, 174700, 42555, -33228, -386198, -32034, 17921, -151000, -54045, -10624, 194066, -199475, -13327, -14286, 99240, -297041, 152047, 175248, -37244, 152357, 140800, 116245, -402173, -263823, -6265, -29065, 430, 1489, -127277, -10162, 227117, 54398, -5763, 99021, 147, -247310, -8461, 201020, 301301, 466756, 337403, 439405, 495895, 307610, -28124, 156694, 347102, 79055, 351437, 169877, -101262, 863, -426177, 172868, 292110, 25024, 238685, 18790, -151786]
10460c10796l6612a02318A90917q7690b58656N0054A03912f2555G7994O5604j868
10449A41730L5115a61097A22195a8465j47428C59471a72845A45913b35059e6525
10438H4986g8630A5500N03R4871i3947d0479I8288b85676D8765a79531g1482p3197
10426a44679A18499K7175a885l7100n4632p8774N9896c5476o141l2952D20635
10414D2922J78390n5689n0243D7264c2432n7482l43421a482j8608q4274j45136
10403b49500h6582j78567g634C4628b38159j29228c3580A26632P8555o3628l3086
10392A08473J4817C0475D660c2891B9345K27170F749h3165E9321d9935A05968
10380a8638l938j75586B77648b29905i9195C65383O4416B00368K51793j91379
$$ y = [-310796, -347408, -102318, 190917, 103227, -258656, -208602, 103912, -62555, 77994, 143598, 141730, 176845, -161097, 122195, -18465, -165893, 359471, -172845, 145913, -235059, -56525, 84986, -78630, 15500, 16003, 110874, -93947, -40479, 98288, -285676, 48765, -179531, -71482, -144679, 118499, 145674, -1885, -38985, -93617, -172391, -112495, -35476, -41617, -74569, 420635, 42922, 221312, 165623, 115380, 47264, -32432, -89914, -433335, -1482, -20090, -104364, -249500, -86582, -265149, -7634, 34628, -238159, -367387, -33580, 126632, 205187, 141559, 108473, 123290, 30475, 4660, -32891, 29345, 256515, 6749, -83165, 59321, -49935, 105968, -18638, -22576, -198162, 277648, -229905, -99195, 365383, 429799, 200368, 452161, 260782]
10370B60782a7493F1370L19502C4411M25687K67126A95576l3385D3631J76957
10360B20588A04640a78227A38353r074N0238N0214J2718k76O8087K37667L2933
10349E80860L1898C03084k6251A32840E9228L03374K18460B79588o4312D5232
10338F2473K5587j4801j0223A3100e7188j98664B97632A12708a44401A72066K5383
10327A97449c65084a30803D74671B6436f2234B19524Q0942k9867j0556a92408
10316F1279k274K21825A29507m8042A4947J91544c80829A678a50319L4827B14300
10304b4983q7500F7289j7426c7334j78392h2906G6893R1159E8266a27921H5848
10292C13167b49974A1327b23236A980b78772J5254j000i2559F3474b70732C05742
$$ y = [260782, -17493, 61370, 380872, 34411, 460098, 727224, 195576, 162191, 43631, 220588, 104640, -178227, 138353, 129279, 179517, 229731, 242449, 242173, 310260, 547927, 580860, 612758, 303084, 276833, 132840, 59228, 362602, 581062, 279588, 215276, 45232, 62473, 88060, 73259, 63036, 13100, -57188, -255852, 297632, 112708, -144401, 172066, 197449, -365084, -130803, 474671, 26436, -62234, 219524, 300466, 270599, 260043, -192408, 61279, 59005, 280830, 129507, 81465, 14947, 206491, -380829, 1678, -150319, -115492, 214300, -24983, -112483, 67289, 49863, -37334, -215726, -82906, 76893, 168052, 58266, -127921, 85848, 313167, -249974, 11327, -223236, 1980, -278772, -263518, -264518, -92559, 63474, -270732, 305742]
10280b37255J01510G2359N11158e456q7580c3567B4126g3810b1675B29243b89232
10268g0225D01144J47502F4979K72611A00329D6691b2517C84181j68690J53839
10258C69330I096M26862j20331n8622f635E9079a49446A97596n3155H984K0900
10247B9884f8161A07929f2267p6169A61375g507A59122a42429A89949c46125F0490
10235c08326O0705A04986i1131m452r7825a3246B0519e56725a71880r2878i8729
10223B68477a92497E39202a83857d4637B54228E2428i104n8647K7545e440G1605
10211a42447e9931A82171b15557B02205d10689G2432K655d409l7302k57773B1473
10199A16327c9809n4521j7380c3792j15058k80123A12451a49210q6421A08755
$$ y = [-237255, -135745, 72359, 583517, -5456, -93036, -33567, 24126, -73810, -21675, 229243, -289232, -70225, 401144, 548646, 64979, 337590, 100329, 46691, -22517, 384181, 215491, 369330, 9096, 435958, 315627, 257005, -6635, 59079, -149446, 197596, 144441, 8984, 29884, -68161, 107929, -62267, -138436, 161375, -7507, 159122, -142429, 189949, -346125, 60490, -308326, -247621, 104986, -91131, -95583, -193408, -13246, 20519, -556725, -171880, -264758, -98729, 268477, -192497, 539202, -183857, -44637, 254228, 52428, -9104, -67751, -40206, -5440, 71605, -142447, -59931, 182171, -215557, 202205, -410689, 72432, 75087, -4409, -41711, -299484, 21473, 116327, -39809, -94330, -111710, -33792, -148850, -428973, 112451, -149210, -235631, 108755]
10188E5798a00261A0332J13548b41861J09039b179B44915c3252p4938D15950i9514
10176A05613a21997O28l9233n3645A50552B7690c5454j14553n1281A34106g4052
10164c03303d0770p9033a3244A23121n1440b8877G0119g026l54135A7758P1205
10153H8963D3411c08072J2976g4601H5731c4229B32651a96318C18079a09938j32026
10142b41964P4338O7586B9535Q3002l6188j2161b13270j74102G6027d07973e1633
10130b42567R6929m0969L900r6907L9607D7181J5089B0795d85452H3428b17505
10118a58200B150c0562I601b25291a12320m3646a8691C770M0997J93811a817j57186
10106a59003j89996a51951G2540K4028a15545K1177F2428a87131A18015e7403
$$ y = [55798, -100261, 10332, 123880, -241861, -132822, -2179, 244915, -33252, -108190, 415950, -99514, 105613, -121997, -121369, -160602, -214247, 150552, 27690, -35454, -150007, -201288, 134106, -74052, -303303, -40770, -119803, -13244, 123121, 71681, -28877, 70119, -7026, -361161, 17758, 88963, 43411, -308072, -295096, -74601, 85731, -34229, 232651, -196318, 318079, -109938, -241964, -167626, -100040, 29535, 112537, 76349, 64188, -213270, -387372, 76027, -407973, -51633, -242567, -145638, -186607, -182707, -279614, -240007, 47181, 62270, 20795, -485452, 83428, -217505, -158200, 2150, -30562, 9601, -225291, -112320, -155966, -18691, 3770, 44767, 238578, -1817, -159003, -348999, -151951, 72540, 96568, -115545, -94368, 62428, -187131, 118015, -57403]
10095a04977b8397A256a2112k08237M3273n0199P2953A53606a52426A01869a814
10083c4376G4124l905c73414i8270j92334A28515a278k04887B8J08712a31919
10071b72557A40917C5415a74608k2496A4342Q7550k2830f2641j10337e0965r6466
10060a47431j20410J3288A37463G024b27949J11471A57522e64534B04476c11372
10049b4385R64B33235G0711K4255b84730A02107M448g3210B95915f0401b7543
10037i8660b2839A49078d7611m09774f4842j96582q617D0847d2103j61478A25467
10025b53467E8221J47575b12338A41428c17354e2490j45184P1353c3754F7868
10014a07524j19928M9912L6623j6794A57277a71281L9018N8313j51197A61112
$$ y = [-104977, -28397, 1256, -12112, -220349, -177076, -227275, -154322, 153606, -152426, 101869, -1814, -34376, 74124, 70219, -373414, -98270, -290604, 128515, -1278, -206165, 28, 108740, -131919, -272557, 140917, 35415, -174608, -197104, 14342, 101892, 79062, -62641, -172978, -50965, -147431, -267841, -254553, 137463, 7024, -227949, -116478, 157522, -564534, 204476, -311372, -24385, -23421, 233235, 70711, 94966, -284730, 102107, 106555, -73210, 295915, -60401, -27543, -98660, -22839, 149078, -47611, -457385, -64842, -261424, -270041, 40847, -42103, -203581, 125467, -253467, 58221, 205796, -212338, 141428, -317354, -52490, -197674, -126321, -33754, 67868, -107524, -227452, -177540, -140917, -157711, 157277, -171281, -132263, -73950, -225147, 161112]
10003E843J46037a22565B16864C051d5508a7339C09227d3820k61677m3081a23940
9991a13671B48208b85114j7230B71671a36525j33854j17195D5525L6683b84390
9980c1939j60568j57535I8251P1476b54596i2137K6899c725A2633K10307a48439
9968h6225j59307J05641L8386B56180A19532a04653k27105A27076a49478m6987
9958a96465b7389B11236e3557l36671b5661m2498J7017B61966e9726j5444m23089
9947d98259a24849h602j02406L8412n2606N9367m2483M2324m10724P6533A10848
9935G2441c7675l0197l5075p4644j81591E1133b87840Q8559B1437O9629a6977
9923a73713M9714j38806F5555a65960e3452A86711c93220B84375a4078j36225
$$ y = [5843, 151880, -122565, 216864, 3051, -45508, -17339, 309227, -43820, -305497, -348578, -123940, -113671, 248208, -285114, -302344, 271671, -136525, -270379, -387574, 45525, 82208, -284390, -31939, -192507, -350042, 98251, 169727, -254596, -92137, -65238, -3725, 12633, 222940, -148439, -86225, -245532, -139891, -101505, 256180, 119532, -104653, -331758, 127076, -149478, -196465, -27389, 211236, -53557, -390228, -25661, -68159, -51142, 261966, -59726, -75170, -498259, -124849, -8602, -111008, -72596, -125202, -65835, -108318, -65994, -476718, -400185, 110848, 72441, -37675, -67872, -102947, -177591, -359182, 51133, -287840, -199281, 21437, 91066, -16977, -173713, -123999, -262805, 65555, -165960, -53452, 186711, -393220, 284375, -14078, -150303]
9913a50303j24546d3559E8168M0545e0168A80238c46303E8991Q3702h4598A03922
9901a96437A03666J1546H164a34042M6703J7246k08054Q4718o6590J5020K5185
9890b19814J590P6213k20563j09158K17920A79789e8036r699B14489p0682K3722
9879A67529g5421j25350l8771k75869G5931h8391j35100g2907I2628a8005j82020
9868b00025M9383p4064f5222I2622a20727n4977A48833c1838J781B0346J32595
9857A52941n9472B2321i1963r7010c1147a5145A46641a49638B1985J98531b27061
9845A09365a21274N8252A13433J59103q7508g4275k01195Q8504A5712K01150a66500
9833A76010c1960l2104A99366d96810c3126E9000J16331C2345L1017a07470j05892
$$ y = [-150303, -274849, -43559, 58168, 98713, -50168, 180238, -346303, 58991, 142693, -84598, 103922, -196437, 103666, 115212, 8164, -134042, -87339, -70093, -278147, -193429, -260019, -244999, -219814, -218224, -142011, -362574, -471732, -253812, 179789, -58036, -67735, 214489, 143807, 167529, -75421, -200771, -239542, -515411, 75931, -88391, -223491, -72907, 92628, -18005, -200025, -150642, -224706, -65222, 92622, -120727, -175704, 148833, -31838, -30057, 20346, 152941, 93469, 22321, -91963, -188973, -31147, -15145, 146641, -149638, 21985, 220516, -227061, 109365, -121274, -63022, 113433, 272536, 185028, -74275, -275470, -186966, 15712, 216862, -166500, 176010, -31960, -64064, 199366, -496810, -33126, 59000, 175331, 32345, 63362, -107470, -213362]
9822b13362c0654a0124j14737A08856a07757L0166A05665c36124h877j1899B3366
9810A02735k8503a9915j25528K7312J8863H6111d1506j55665a055n4738B57457
9798a80986F1202L33875a6973j86686B7482c6724f166o2249j97701h3228k36873
9787c20101A17009b48616g4780H4953a25633c8426r4445L8816B24628h164j45984
9776a54148E1893b30794E6094M51303b8577j32645j11311B63812C0927a32082
9765G5935J44944d11179H5621b0438n04175B29399f2798q0409C41786a02478A05179
9753b9962m49020e8142E7135a83484D422b32965j82048a68190K914G4072h6349
9741a43510j94488c3137k50949N2478h870p286j42366K3947j44235Q9276h003
$$ y = [-213362, -30654, -10124, -124861, 108856, -107757, -77591, 105665, -336124, -8877, -20776, 23366, 102735, 74232, -19915, -145443, -118131, -99268, 86111, -41506, -197171, -1055, -55793, 257457, -180986, 61202, 395077, -16973, -203659, 27482, -36724, -6166, -68415, -266116, -83228, -320101, 117009, -248616, -74780, 84953, -125633, -38426, -132871, -94055, 224628, -8164, -154148, 51893, -230794, 56094, 507397, -28577, -161222, -272533, 263812, 30927, -132082, 75935, 220879, -411179, 85621, -20438, -524613, 229399, -62798, -143207, 341786, -102478, 105179, -29962, -478982, -58142, 57135, -183484, 4422, -232965, -415013, -168190, -165276, 74072, -86349, -143510, -337998, -33137, -284086, -231608, -8870, -16156, -158522, -134575, -278810, -189534, -8003]
9729a56141A66662c59263a16599j23575r1857H9355L2121i7491k24412a32861
9718G0101a09206k48450A55286J1793j6612i0375d2323j22290a254k14718A14363
9706G7880a5916r3341A6725b7450C7796a55194l3932i4124m8555H021P0842A1528
9693a91072G7244K5747b45282K2462K7555E5494N2842d8989j15925B5009c1950
9681h8913j06581h304A40166F9395L6723O493K13153E4165b23118A42575b95659
9669A7977K82713a29031A12419b38959O1390j0073n4681i2667k30338E4787b88082
9657d6386L844B34852G7769b47908J11191j23966m279C29770h4887o8237F0291
9645A48378a69522O2480E4331a14678o0305O5849k94772a66085p4682a9582n3635
$$ y = [-156141, 166662, -359263, -116599, -240174, -332031, 89355, 121476, -97491, -321903, -132861, 70101, -109206, -357656, 155286, 167079, 150467, -90375, -42323, -164613, -1254, -215972, 114363, 77880, -15916, -109257, 16725, -27450, 37796, -155194, -189126, -94124, -142679, 8021, 78863, 11528, -191072, 77244, 102991, -245282, -222820, -195265, 55494, 108336, -48989, -164914, 25009, -31950, -88913, -195494, -8304, 140166, 69395, 106118, 112611, 325764, 54165, -223118, 142575, -295659, 17977, 300690, -129031, 112419, -238959, -177569, -187642, -242323, -92667, -323005, 54787, -288082, -46386, -42542, 234852, 77769, -247908, -136717, -260683, -264962, 329770, -84887, -153124, 60291, 148378, -169522, -107042, 54331, -114678, -174983, -109134, -403906, -166085, -240767, -19582, -73217]
9634g3217A60215b21431B84622a86474q1616a16660J014P529a2939j03160m3220
9623a59319M9540r5065m1529j46333J65590M616j41426a30424d7772m7181k25232
9612c20185K9478m3807d4842G2467K29068b11247D4643b9034l60579a59473D183
9600D9910i4183m7823j16765B42045b26488J06547m6945A54851i4299K1129o8986
9589a42156G3101d37322F7286a03051M2616A18703a26540J2405O675j14041P9607
9578a41894j15804N6374L1119C76807A20758b11757n685O7819j14175g0388K9686
9567d0702k819j25959A14099m0401c08393B39117a19182B7609P4025h6012K4723
9556f1289j86723O8458f5116b0608j49946B53710d2681B35304h939j41514f0570
$$ y = [-73217, 160215, -221431, 284622, -186474, -268090, -116660, -115646, -108117, -12939, -116099, -159319, -109779, -204844, -246373, -392706, -227116, -222500, -363926, -130424, -47772, -94953, -320185, -290707, -334514, -44842, 72467, 301535, -211247, 44643, -29034, -389613, -159473, 4183, 49910, -94183, -142006, -258771, 242045, -226488, -119941, -166886, 154851, -94299, -73170, -142156, 73101, -437322, 67286, -103051, -60435, 118703, -126540, -114135, -107460, -221501, -141894, -257698, -201324, -170205, 376807, 120758, -211757, -217442, -149623, -263798, -70388, -40702, -43521, -169480, 114099, 73698, -308393, 239117, -119182, 27609, 101634, -86012, -61289, -248012, -179554, -65116, -20608, -170554, 253710, -42681, 235304, -8939, -150453, -60570]
9544b79048d3905j51206d3221k91344c1699l98877b07197Q486o8446F8750b83660
9532a7538A57714I632K10271a31107K1341A25208J4801e9175j28529a9450A56529
9520a29375M1243I6010a69216I2654e5148A24037F748K53074b87153P7323g7527
9508F1594Q066b50967a03517b7043C077P2527i782H6400l9917d3339p5920j929
9496a21188I7564a24330I0628D817b13140d6809k47422i1637k05333P7828c4066
9484A8485J3870e9991D22163G9419Q7960a59494N2866A40158a46772K4225n8632
9473a81179A33895c35487C45953C2360b62428j08671G8991k6105b08408e3212
9462h6669r9571F3916Q2923g2123D5528a67996F4230a9932p2008j43142G3171
$$ y = [-279048, -43905, -195111, -43221, -334565, -31699, -430576, -207197, -198711, -267157, 68750, -283660, -17538, 157714, 9632, 219903, -131107, -109766, 125208, 140009, -59175, -187704, -19450, 156529, -129375, -88132, 96010, -169216, 92654, -55148, 124037, 6748, 259822, -287153, -209830, -77527, 61594, 69660, -250967, -103517, -27043, 3077, 75604, -9782, 86400, 46483, -43339, -119259, -121188, 97564, -124330, 90628, 4817, -213140, -46809, -294231, -91637, -296970, -219142, -34066, 18485, 32355, -59991, 422163, 79419, 167379, -159494, -106628, 140158, -146772, -122547, -181179, 133895, -335487, 345953, 32360, -262428, -371099, 78991, 52886, -208408, -53212, -86669, -186240, 63916, 146839, -72123, 45528, -167996, 64230, -19932, -91940, -235082, 73171]
9450c03104H5309K73894c67168B02396a99495O4055N3351b9822l68050B51315
9439A04523P8002G5604a58877q4787j05060A12240b12489g2260d472D6893e7307
9427b07780B20978L2981e1438j4667j75724N1215n7940a1489G3161j7405J01408
9416A57164a72605H4542c12601D0990K33745c3263l2480A83799c4074p0362H1238
9404e1685r6805A87926e1577J9031k34370g766l44391A81215b45814d5384j9502
9393f4886I3731m6474b16350J7403N0875j01156k58844B9553a06521G7334e6193
9381a99831J8523A37591d9947A33046b01780e2287A15573K45139b19292K1877
9371a97415B7219b43909A2533l405J48974c27389B38005A1936R1806j6285J0836
$$ y = [-303104, 85309, 359203, -367168, 202396, -199495, -135440, -82089, -29822, -397872, 251315, 104523, 182525, 75604, -158877, -243664, -348724, 112240, -212489, -72260, -4472, 46893, -57307, -207780, 220978, 253959, -51438, -66105, -241829, -190614, -248554, -11489, 73161, 55756, 157164, -172605, 84542, -312601, 40990, 274735, -33263, -65743, 183799, -34074, -104436, 81238, -51685, -148490, 187926, -51577, -32546, -266916, -7766, -352157, 181215, -245814, -45384, -64886, 93731, 47257, -216350, -198947, -148072, -249228, -508072, 29553, -106521, 77334, -56193, -199831, -181308, 137591, -49947, 133046, -201780, -52287, 115573, 360712, -219292, -197415, 27219, -243909, 12533, 9128, 158102, -327389, 238005, 11936, 103742, 87457, 98293]
9360I8293a72675A16822b21813G6308f1193k5396l25446B69026a15436B27536
9349A4755J12248a58081f3825G343a85982m4114m4711j13731B38235g4612A12552
9337G8150B5697b20658A94493b32786b1013B13224o8231a38188j80300a16418
9326c1115H782f5039G5130a12538L7712H7643b13611g5618a666j59760O5158d1358
9313b00962i3190j72302D1167e3604I6527A9244a4282R82j64636m0379j21900
9302c40215J40469n3445N2846J647L0392A87521d2621p4251E4271b28443A04307
9290A876c7357A91277D3306O8609g1437b7147C8620a34852O3187n29779B1477
9278c38050C768K50138A04774B0574K40487j16564c2476I844f57511a38735A29912
$$ y = [98293, -172675, 116822, -221813, 76308, -61193, -86589, -412035, 269026, -115436, 227536, 14755, 127003, -158081, -63825, 7343, -185982, -230096, -274807, -388538, 238235, -74612, 112552, 78150, 25697, -220658, 194493, -232786, -21013, 213224, 144993, -138188, -318488, -116418, -31115, 8782, -65039, 75130, -112538, -74826, 87643, -213611, -75618, -1666, -161426, -96268, -41358, -200962, -93190, -265492, 41167, -53604, 96527, 19244, -14282, -13300, -177936, -218315, -340215, -199746, -253191, -200345, -198698, -168306, 187521, -42621, -116872, 54271, -228443, 104307, 1876, -37357, 191277, 43306, 111915, -71437, -27147, 38620, -134852, -71665, -601444, 21477, -338050, 3768, 253906, 104774, 20574, 261061, 144497, -32476, 9844, -657511, -138735, 129912]
9266H8172B9348a03044J0590H1930i1119K2770G0486b58426C91528a20219b3552
9254b56710J09488j534j1589d5350j02954B91414a03767B36167a3174E8808K14231
9243B73039b61964q8633b8296l7940k67060E0079a81640M3261m3930b9992C63276
9231D9265k405a12496b2148o5028C35477a71705m9674c3040k29903R9989A15442
9219e5862K4115A1426O7278N637J01277d26058A73698b52427e5161l31482h6146
9207a62910a6308r4168k5610k65233c9373A13846b28337Q6214L7674H8282d31416
9195c8631A36195a57190B6518a21307p7099g7044C00244j29590c90517J81822
9185b08695L5208N4253C9617O6126N0986K15932A9994a01927b7952k96244A17359
$$ y = [88172, 29348, -103044, -92454, 81930, -91119, -68349, 70486, -258426, 391528, -120219, -23552, -256710, -147222, -148756, -160345, -45350, -148304, 291414, -103767, 236167, -13174, 58808, 273039, -261964, -350597, -28296, -66236, -333296, 50079, -181640, -138379, -182309, -29992, 363276, 49265, 46860, -112496, -22148, -87176, 335477, -171705, -221379, -33040, -262943, -162954, 115442, -55862, -31747, 11426, 78704, 84341, 185618, -426058, 173698, -252427, -55161, -386643, -86146, -162910, -16308, -110476, -136086, -401319, -39373, 113846, -228337, -142123, -104449, 88282, -431416, -38631, 136195, -157190, 26518, -121307, -198406, -77044, 300244, 170654, -390517, -208695, -173487, -119234, 39617, 105743, 156729, 372661, 19994, -101927, -27952, -324196, 117359]
9173a45632F2705L7442J31580a93930Q5135F8225Q784l184Q2639m0152b79663
9161D8806b17318Q5874j54665h2921I3956C9878g8506E0191f7891k1733j73023
9150b62647A21231a58456f7361B57444r3011d1899m3748E3376J390a9285D8799
9138C60842b1032G474a75475B31501L9077e38252C90507e5412E7215J74709E5878
9126a51291M6111n8272b5959h514j18507K6500o0204d9443b1786k97751B06293
9114f2164A7371a47473C298L6611J51605a10536A25388b73412f8602r670k3047
9103a01319M2900A00493c07804B7332a20723H4399H764K58292D9848b63667d2835
9091i5318A54454c17562a54138j6058D1126M6976i3850A38529c56403a21938f929
$$ y = [-145632, 62705, 100147, 231727, -193930, -108795, 68225, 77009, 73825, 156464, 116312, -279663, 48806, -217318, -131444, -286109, -82921, 93956, 39878, -78506, 50191, -67891, -89624, -262647, 121231, -158456, -67361, 257444, 164433, -41899, -85647, 53376, 54766, -19285, 48799, 360842, -21032, 7474, -175475, 231501, 270578, -538252, 390507, -55412, 57215, 231924, 55878, -151291, -105180, -163452, -25959, -8514, -127021, -100521, -160725, -49443, -21786, -319537, 206293, -62164, 17371, -147473, 3298, 39909, 191514, -110536, 125388, -273412, -68602, -78272, -101319, -58419, 100493, -307804, 27332, -120723, 84399, 8764, 267056, 49848, -263667, -42835, -95318, 154454, -317562, -154138, -170196, 41126, 88102, -93850, 138529, -356403, -121938, -6929]
9079B11875a21112l93877b5795A72983l4963a4341l3974B71323a90084d1859m4220
9068h6079a1503B45951c89410a50792a1708k09312l851F7044a28530o244A20057
9056b3932k9391k69788j41458c5376k24930a29736o9319k4578l6168a16177a9259
9044A58012B978K21341d39307a31337e0754D3349J02847b79482a17745l02438
9034d20183B5954N5887B6866f3424m1831c4702l7500A69248b65278B28311c94773
9022a7579A82681A0491c37064i2497H0812J30671B2937a01236B71925a21138n8498
9011a79636B33544b05577I8489a069A05836b82311k8980J7259J41772I8066p745
9000I0321a52429A04668Q1211a7564p8829M3066J772A23602K2466n8051c33959
$$ y = [211875, -121112, -514989, -25795, 172983, 138020, -14341, -48315, 271323, -190084, -41859, -86079, -11503, 245951, -389410, -150792, -11708, -221020, -224871, 67044, -128530, -134774, 120057, -23932, -53323, -323111, -464569, -35376, -260306, -129736, -199055, -223633, -259801, -116177, -19259, 158012, 2978, 224319, -439307, -131337, -50754, 43349, 146196, -279482, -117745, -420183, 25954, 81841, 26866, -63424, -105255, -34702, -72202, 169248, -265278, 228311, -394773, -17579, 182681, 10491, -337064, -92497, 80812, 211483, 22937, -101236, 271925, -121138, -179636, 233544, -205577, 98489, -1069, 105836, -282311, -311291, -294032, -152260, 98066, 90321, -152429, 104668, 185879, -17564, -96393, -53327, -51555, 123602, 146068, 88017, -333959]
8988b47669L9828B32540a07583B32935a62312B26275K24199a09314k55251h3113
8977g0467A22654C6705c48096J16328K2822b367n682p0752j78170B25996K99738
8966E25734a28640A10180a00985j61025A31671k052e0089H5075e5056l272r594
8955f7922j69377l1473g6784F9584h2176c0341j18399k24681f2087b7035a0925
8943B53780a47306j58414A07686O5435N3803l8269a70992f6787d727A14735a62151
8931e00168E2106a52554A14151d1085G2452f5641F51240A60846J575305L267463
8921E003614K542691B094942G18143j95751g1156H2819d13m9172A32580a69358
8910a71365g8940N796D00928C3526J94863A12951o346A6941a03164m0010J4447
$$ y = [-247669, -207841, 232540, -107583, 232935, -162312, 226275, 450474, -109314, -364565, -83113, -70467, 122654, 36705, -348096, -231768, -208946, -2367, -8049, -78801, -256971, 225996, 525734, -128640, 110180, -100985, -262010, 131671, 129619, -50089, 85075, -55056, -58328, -67922, -237299, -268772, -76784, 69584, -82176, -30341, -148740, -373421, -62087, -27035, -10925, 253780, -147306, -305720, 107686, 173121, 226924, 188655, -170992, -66787, -4727, 114735, -162151, -500168, 52106, -152554, 114151, -41085, 72452, -65641, 651240, 160846, 1736151, 5003614, 7546305, 2094942, 718143, 522392, -71156, 82819, -413, -49585, 132580, -169358, -171365, -78940, -73144, 400928, 33526, 228389, 112951, 106605, 16941, -103164, -143174, -128727]
8899a28727j67246a12466a2888j2480l74546c781G2275j8786L078N8743e8694
8887a06730j22216c7692o7475l10699c4617H5553c12341C1224b61531d5026n9675
8876a04701l14385a77447A05345O7825d81048J55095c2975A82225a49194N6169
8866i3025a1537j53555h0233A40525b79933M5928Q1299e9573N444j72074h1675
8854D9837a30876B4372b05384A23828K65777f4676k2455L1951E276f9088K1899
$$ y = [-128727, -295973, -112466, -12888, -25368, -399914, -3781, 72275, 53489, 56567, 115310, -58694, -106730, -228946, -37692, -105167, -415866, -34617, 85553, -312341, 31224, -261531, -45026, -104701, -419086, -177447, 105345, 173170, -481048, -325953, -32975, 182225, -149194, -93025, -11537, -165092, -80233, 140525, -279933, -234005, -152706, -59573, -54129, -226203, -81675, 49837, -130876, 24372, -205384, 123828, 389605, -64676, -87131, -55180, 5276, -69088, -47189]
$$ [...]
##END NTUPLES=NMR SPECTRUM
##END=
