##TITLE=AC1687_PANAM14368_8637553_FEcPcazRuK
##JCAMPDX= 6.0         $$ Bruker NMR JCAMP-DX V2.0
##DATA TYPE= NMR SPECTRUM
##DATA CLASS= NTUPLES
##ORIGIN= BRUKER
##OWNER= Administrator
$$ 1.72 TOPSPIN		Version 2.1
$$ 2014-05-30 20:29:44.079 -0700  Administrator@X
$$ Compression mode = diff/dup
##.OBSERVE FREQUENCY= 400.02188249412
##.OBSERVE NUCLEUS= ^1H
##.ACQUISITION MODE= SIMULTANEOUS (DQD)
##.ACQUISITION SCHEME= undefined
##.AVERAGES= 64
##.DIGITISER RES= 22
##SPECTROMETER/DATA SYSTEM= spect
##.PULSE SEQUENCE= noesygpps1d.comp
##.SOLVENT NAME= COFFEE_meoh
##.SHIFT REFERENCE= INTERNAL, COFFEE_meoh, 1, 14.96101
##AUDIT TRAIL= $$ (NUMBER, WHEN, WHO, WHERE, PROCESS, VERSION, WHAT)
$$ ##TITLE= Audit trail, TOPSPIN		Version 2.1
$$ ##JCAMPDX= 5.01
$$ ##ORIGIN= Bruker BioSpin GmbH
$$ ##OWNER= Administrator
$$ $$ E:\/data/COFFEE/nmr/AC1687_PANAM14368_8637553_FEcPcazRuK/22/pdata/1/auditp.txt
$$ ##AUDIT TRAIL=  $$ (NUMBER, WHEN, WHO, WHERE, PROCESS, VERSION, WHAT)
(   1,<2014-05-30 20:29:38.861 -0700>,<Administrator>,<X>,<go>,<TOPSPIN 2.1>,
      <created by zg
	started at 2014-05-30 20:18:08.625 -0700,
	POWCHK enabled, PULCHK disabled,
       configuration hash MD5:
       C8 4E 4E 5D D3 5C D8 9E 9F 52 82 E0 59 8A DE 15
       data hash MD5: 64K
       18 1E B3 B5 01 F5 27 4E CD A4 BB 5B 75 50 E1 F1>)
(   2,<2014-05-30 20:29:41.845 -0700>,<Administrator>,<X>,<proc1d>,<TOPSPIN 2.1>,
      <Start of raw data processing
       efp LB = 0.3 FT_mod = 6 PKNL = 1 PHC0 = 0 PHC1 = 0 SI = 128K 
       data hash MD5: 128K
       08 87 25 38 81 7A 15 2A 2F 9C 4A 59 67 8E 2B EE>)
(   3,<2014-05-30 20:29:42.986 -0700>,<Administrator>,<X>,<proc1d>,<TOPSPIN 2.1>,
      <pk PHC0 = -85.24841 PHC1 = 0 
       data hash MD5: 128K
       0C 45 61 8F F8 96 5A DE DE 8F F1 F1 F9 47 67 05>)
(   4,<2014-05-30 20:29:43.439 -0700>,<Administrator>,<X>,<proc1d>,<TOPSPIN 2.1>,
      <abs ABSG = 1 
       data hash MD5: 128K
       0A 28 98 36 60 25 FC 39 8D CC 3C EA 19 4C E1 89>)
(   5,<2014-05-30 20:29:43.564 -0700>,<Administrator>,<X>,<proc1d>,<TOPSPIN 2.1>,
      <abs ABSG = 2 
       data hash MD5: 128K
       D1 8B 9F 11 C0 BE C5 96 53 9E CC 85 57 7D 02 EC>)
(   6,<2014-05-30 20:29:43.658 -0700>,<Administrator>,<X>,<proc1d>,<TOPSPIN 2.1>,
      <abs ABSG = 3 
       data hash MD5: 128K
       A0 50 01 01 DE 63 06 24 34 92 3E 05 E3 DA BB FB>)
(   7,<2014-05-30 20:29:43.736 -0700>,<Administrator>,<X>,<proc1d>,<TOPSPIN 2.1>,
      <abs ABSG = 4 
       data hash MD5: 128K
       2B 17 03 A1 A7 3C 39 7D 9F 18 75 9B EF 63 B5 0E>)
(   8,<2014-05-30 20:29:43.814 -0700>,<Administrator>,<X>,<proc1d>,<TOPSPIN 2.1>,
      <abs ABSG = 5 
       data hash MD5: 128K
       C6 CD 28 EC 27 89 5A BA 44 E2 BC 96 CA 46 53 07>)
$$ ##END=
$$ 
$$ $$ hash MD5
$$ $$ 6E 3E 41 C4 D1 16 20 0E D7 63 CA 41 AB 30 D0 89
##$RELAX= 
##$RELAX= 
##$RELAX= 
##$RELAX= 
##$RELAX= 
##$RELAX= 
##$RELAX= 
##$RELAX= 
$$ Bruker specific parameters
$$ --------------------------
##$DU= <E:\>
##$EXPNO= 22
$$ [...]
##$TP07= 0
##$TPNAME0= <>
##$TPNAME1= <>
##$TPNAME2= <>
##$TPNAME3= <>
##$TPNAME4= <>
##$TPNAME5= <>
##$TPNAME6= <>
##$TPNAME7= <>
##$TPOAL= (0..7)
0.5 0.5 0.5 0.5 0.5 0.5 0.5 0.5
##$TPOFFS= (0..7)
0 0 0 0 0 0 0 0
##$TUNHIN= 0
##$TUNHOUT= 0
##$TUNXOUT= 0
##$USERA1= <user>
##$USERA2= <user>
##$USERA3= <user>
##$USERA4= <user>
##$USERA5= <user>
##$V9= 5
##$VALIST= <valist>
##$VCLIST= <CCCCCCCCCCCCCCC>
##$VD= 0
##$VDLIST= <DDDDDDDDDDDDDDD>
##$VPLIST= <PPPPPPPPPPPPPPP>
##$VTLIST= <TTTTTTTTTTTTTTT>
##$WBST= 2048
##$WBSW= 25
##$XGAIN= (0..3)
0 0 0 0
##$XL= 0
##$YL= 0
##$YMAX_a= 5674986
##$YMIN_a= -12018138
##$ZGOPTNS= <>
##$ZL1= 120
##$ZL2= 120
##$ZL3= 120
##$ZL4= 120
##$ABSF1= 14.96101
##$ABSF2= -5.597172
##$ABSG= 5
##$ABSL= 3
##$ALPHA= 0
##$AQORDER= 0
##$ASSFAC= 0
##$ASSFACI= 0
##$ASSFACX= 0
##$ASSWID= 0
##$AUNMP= <proc_prof1d_extract.lims>
##$AXLEFT= 0
##$AXNAME= <>
##$AXNUC= <1H>
##$AXRIGHT= 0
##$AXTYPE= 0
##$AXUNIT= <>
##$AZFE= 0.1
##$AZFW= 0.1
##$BCFW= 0
##$BC_mod= 0
##$BYTORDP= 0
##$COROFFS= 0
##$CY= 15
##$DATMOD= 1
##$DC= 0
##$DFILT= <>
##$DTYPP= 0
##$F1P= 0
##$F2P= 0
##$FCOR= 0.5
##$FTSIZE= 131072
##$FT_mod= 6
##$GAMMA= 0
##$GB= 0
##$INTBC= 1
##$INTSCL= 1
##$ISEN= 128
##$LB= 0.3
##$LEV0= 0
##$LPBIN= 0
##$MAXI= 10000
##$MC2= 0
##$MEAN= 0
##$ME_mod= 0
##$MI= 0
##$NCOEF= 0
##$NC_proc= -2
##$NLEV= 6
##$NOISF1= 0
##$NOISF2= 0
##$NSP= 0
##$NTH_PI= 0
##$NZP= 0
##$OFFSET= 14.96101
##$PC= 1
##$PHC0= -85.24841
##$PHC1= 0
##$PH_mod= 1
##$PKNL= yes
##$PPARMOD= 0
##$PPDIAG= 0
##$PPIPTYP= 0
##$PPMPNUM= 2147483647
##$PPRESOL= 1
##$PSCAL= 4
##$PSIGN= 0
##$PYNMP= <proc.py>
##$REVERSE= no
##$SF= 400.020009633793
##$SI= 131072
##$SIGF1= 0
##$SIGF2= 0
##$SINO= 400
##$SIOLD= 131072
##$SPECTYP= <>
##$SREGLST= <1H.CDCl3>
##$SSB= 0
##$STSI= 131072
##$STSR= 0
##$SW_p= 8223.68421052631
##$SYMM= 0
##$S_DEV= 0
##$TDeff= 65536
##$TDoff= 0
##$TI= <>
##$TILT= no
##$TM1= 0
##$TM2= 0
##$TOPLEV= 0
##$USERP1= <user>
##$USERP2= <user>
##$USERP3= <user>
##$USERP4= <user>
##$USERP5= <user>
##$WDW= 1
##$XDIM= 131072
##$YMAX_p= 362727567
##$YMIN_p= -13292
##$CURPLOT= <Network HP LaserJet P1505>
##$CURPRIN= <$Network HP LaserJet P1505>
##$DFORMAT= <normdp>
##$LAYOUT= <+/1D_H.xwp>
##$LFORMAT= <normlp>
##$PFORMAT= <normpl>
##$SURQMSG= 1
$$ End of Bruker specific parameters
$$ ---------------------------------
##NTUPLES= NMR SPECTRUM
##VAR_NAME=  FREQUENCY,     SPECTRUM/REAL,   SPECTRUM/IMAG
##SYMBOL=    X,             R,               I
##VAR_TYPE=  INDEPENDENT,   DEPENDENT,       DEPENDENT
##VAR_FORM=  AFFN,          ASDF,            ASDF
##VAR_DIM=   131072,        131072,          131072
##UNITS=     HZ,            ARBITRARY UNITS, ARBITRARY UNITS
##FACTOR=    0.0627417313425164, 1,          1
##FIRST=     8223.62146879497, -1298,        -54324
##LAST=      0,             -413,            -54743
##MIN=       0,             -13292,          0
##MAX=       8223.62146879497, 362727567,    0
$$ Real data points
##PAGE= N=1
##DATA TABLE= (X++(R..R)), XYDATA
$$ [...]
67838 67285 66801 66652 66911 67173 67062 67083 68309 70927 73654 75027 74961 74651 75224 76895 79203 81540 83427
67821 83427 84619 85125 85121 84839 84551 84495 84753 85233 85773 86175 86222 85889 85434 85025 84362 82995 80995 78910 77088
67802 77088 75495 74278 73966 74779 76127 77137 77480 77413 77241 77016 76603 75830 74690 73496 72687 72339 72061
67785 72061 71430 70348 68957 67519 66501 66394 67237 68590 70151 72022 74073 75479 75426 74226 73224 73529
67769 73529 75020 76701 77802 78386 78928 79520 79697 79103 78059 77299 77315 78229 80008 82269 84013 84278 83258
67752 83258 82297 82519 83893 85754 87678 89433 90601 90817 90218 89316 88540 88055 87738 87103 85665 83661 82015
67735 82015 81238 80694 79440 77401 75234 73271 71272 69143 67326 66369 66413 67122 67893 68218 68114 68045 68151
67718 68151 67820 66460 64467 62894 62218 61969 61591 61135 60948 61134 61581 62162 62692 62892 62642 62167 61837 61856
67700 61856 62167 62512 62569 62194 61582 61097 60971 61262 61977 62977 63861 64255 64290 64514 65226 66116 66717 67043 67532
67681 67532 68397 69187 69164 68127 66747 65926 65884 66064 65916 65460 65018 64771 64883 65769 67773 70624 73506 75711
67663 75711 77069 77860 78561 79554 80759 81528 81207 79818 78033 76520 75527 74987 74729 74552 74400 74484 75005 75684
67645 75684 75853 75121 73826 72740 72390 72700 73140 73239 72994 72772 72765 72739 72492 72333 72795 73927 75220 76264 77150
67626 77150 78128 79198 80182 81012 81739 82371 82879 83284 83661 84008 84146 83795 82867 81714 80930 80821 81208 81857
67608 81857 82804 84073 85364 86387 87322 88428 89295 89034 87366 85017 82897 81332 80327 80028 80368 80596
67592 80596 79821 78045 76189 74952 74127 73214 72239 71521 70843 69497 67305 65083 63796 63485 63438 63238 63188
67575 63188 63697 64698 65839 66869 67644 68023 68035 67973 68041 68099 67921 67596 67476 67853 68785 70035 71037 71250 70791
67556 70791 70403 70526 70736 70461 69877 69551 69408 68821 67675 66698 66512 66901 67284 67528 67963 68826 69871 70427
67538 70427 69885 68375 66943 66682 67630 68832 69531 69824 70087 70249 69906 68795 66875 64304 61619 59601
67522 59601 58623 58367 58409 58788 59644 60616 61066 60824 60316 60029 60217 61029 62464 64096 65237 65538 65196 64471
67504 64471 63292 61598 59875 58937 59124 59952 60717 61254 61825 62395 62504 62056 61789 62458 63733 64517 64377 64032
67486 64032 64219 64654 64641 64250 64217 64791 65348 65300 64891 64789 65207 65753 65966 65754 65309 64820 64345 63849 63304 62748
67466 62748 62292 62087 62220 62599 62964 63133 63277 63826 65008 66566 68039 69190 70032 70487 70349 69696 69184 69699
67448 69699 71641 74515 77215 78686 78482 76933 74936 73513 73273 74041 75006 75471 75536 75929 77091 78596
67432 78596 79613 79769 79314 78560 77564 76462 75646 75292 74996 74287 73338 72684 72301 71573 70381 69552 69762 70472
67414 70472 70606 70011 69465 69330 69086 68404 67806 67796 68046 68127 68479 69736 71441 72402 72346 72242 72735 73171 72729
67395 72729 71815 71560 72247 73026 73101 72588 72052 71708 71303 70509 69173 67387 65587 64498 64688 66020 67641
67378 67641 68682 69045 69385 70239 71290 71705 71166 70268 69805 69958 70417 71040 71973 73154 74113 74500 74531 74676
67360 74676 74998 75091 74683 74121 74118 75056 76622 78110 78984 79153 78822 78247 77633 77105 76610 75928 74947 73967 73579
67341 73579 74141 75443 76936 78164 78895 79027 78642 78136 77985 78271 78652 78943 79476 80683 82534 84657 86813
67324 86813 88851 90292 90490 89420 87897 86713 85761 84360 82333 80398 79398 79395 79687 79626 79277 79245 79947
67307 79947 81149 82212 82658 82434 81796 81159 81002 81661 83070 84826 86573 88238 89877 91356 92274 92229 91314
67290 91314 90337 90237 91069 91917 92124 92242 93168 94585 95122 94094 92322 91010 90560 90794 91547 92473 92911 92611
67272 92611 92178 92203 92380 92102 91483 91077 90975 90950 91205 92127 93433 94424 94998 95632 96369 96729 96660 96613 96502 95567
67252 95567 93703 92037 91573 91947 92217 92315 92923 94200 95421 95904 95714 95420 95513 96081 96800 97211 97176 96999 97040
67233 97040 97396 98094 99261 100779 102016 102317 101760 101127 101097 101722 102645 103550 104285 104740 104815 104478 103804 102895 101816
67214 101816 100673 99754 99427 99822 100719 101808 102911 103857 104474 104928 105767 107164 108368 108435 107481 106616 106625 107281
67196 107281 108073 108935 109945 110856 111471 112142 113406 115253 117093 118363 118907 118890 118585 118184 117664 116967 116370
67179 116370 116451 117458 118909 120004 120358 120242 120244 120766 121677 122359 122328 121893 121903 122761 123973 124822 125186 125473 126072
67160 126072 127096 128436 129739 130527 130589 130238 130057 130487 131661 133386 135171 136562 137548 138427 139231 139657 139755
67143 139755 140216 141681 144000 146455 148472 149916 150965 151958 153127 154268 154939 155136 155456 156370 157634 158646
67127 158646 159063 158851 158112 157194 156639 156708 157221 158084 159546 161582 163557 164982 166208 167823 169657 170954
67111 170954 171319 170991 170396 169955 170095 170941 172136 173418 175110 177481 179951 181642 182577 183556 184857 185786
67095 185786 185730 185053 184739 185544 187581 190329 192881 194556 195367 195754 196031 196409 197208 198461 199543 199934 200198
67078 200198 201355 203300 204813 205373 205921 207317 208914 209484 208994 208620 209289 210970 213271 215991 218969 221883
67062 221883 224393 226285 227502 228247 229034 230344 232195 234217 236060 237595 238846 240001 241330 242846 244073
67047 244073 244511 244419 244793 246410 249066 251931 254458 256667 258656 260248 261345 262295 263547 265033 266308
67032 266308 267296 268436 269914 271264 272084 272783 274114 276210 278641 281277 284408 287966 291289 293919 296066
67017 296066 298005 299558 300648 301950 304292 307579 310903 313706 316307 319183 322282 325335 328447 331898
67003 331898 335557 338905 341633 343893 345955 347964 350085 352561 355477 358745 362466 366909 371823 376162
66989 376162 379022 380736 382537 385224 388690 392650 397145 402134 407216 412110 416960 421877 426624 431069
66975 431069 435538 440381 445576 451047 456874 462790 468081 472558 477143 482787 489171 495266 500873 506709
66961 506709 513055 519318 525101 530904 537401 544592 552079 559696 567502 575422 583213 590733 598158 605995
66947 605995 614717 624173 633549 642355 651256 661382 672917 684902 696431 707461 718505 730193
66935 730193 743162 757600 772673 787137 800890 815242 831182 848008 864233 879398 894307
66924 894307 909771 925884 942519 959947 978586 998361 1018551 1038377 1057829 1077725 1098778
66913 1098778 1120734 1142824 1164997 1188167 1213098 1239543 1266668 1293946 1321387 1349331 1378256
66902 1378256 1408453 1439570 1470891 1502295 1534552 1568336 1603369 1638946 1674824 1711125 1747677
66891 1747677 1784094 1820342 1856741 1893559 1931038 1969582 2009300 2049471 2089123 2128182 2167430
66880 2167430 2207253 2247077 2286293 2325096 2363862 2402127 2438861 2473736 2507520 2540986 2573829
66869 2573829 2604972 2633744 2660376 2685369 2708723 2729939 2748482 2764073 2776745 2786922 2795322
66858 2795322 2802468 2808206 2811819 2812578 2810109 2804392 2795695 2784381 2770527 2753872 2734429 2712963 2690432
66845 2690432 2667016 2642112 2615176 2586084 2554784 2521365 2486638 2451864 2417465 2382468 2345678
66834 2345678 2307014 2267314 2227295 2187215 2147199 2107265 2067129 2026485 1985508 1944752 1904677
66823 1904677 1865575 1827790 1791515 1756360 1721479 1686277 1650829 1615645 1581171 1547432 1513969
66812 1513969 1480235 1446277 1412941 1381178 1351161 1322301 1294043 1266442 1239931 1214705 1190352
66801 1190352 1166058 1141258 1116140 1091386 1067412 1044108 1021330 999271 978082 957523 937358
66790 937358 917879 899629 882710 866685 851056 835497 819735 803658 787576 772027 757220
66779 757220 742923 728976 715587 702948 690835 678837 666842 655044 643549 632246 621194
66768 621194 610859 601667 593333 584921 575670 565563 554987 544136 533130 522522 513226 505779 499829
66755 499829 494366 488381 481455 473991 466824 460382 454377 448471 442859 437707 432417 426240 419522 413509
66741 413509 408776 404581 399979 394825 389435 383962 378531 373319 368116 362450 356520 351317 347293 343632
66727 343632 339467 335107 331253 327611 323269 318089 312766 307705 302788 298129 294116 290627 287024 283090
66713 283090 279274 275940 273009 270497 268678 267465 266183 264277 261834 259212 256552 253882 251268 248643
66699 248643 245781 242690 239741 237218 234965 232694 230407 228301 226298 223898 220579 216456 212437 209515
66685 209515 207789 206462 204849 203002 201152 199155 196949 195068 193916 192853 190810 187723 184614 182221
66671 182221 180356 178699 177457 176836 176502 176006 175415 175124 175253 175456 175228 174281 172781 171190 169749 168248
66655 168248 166582 165202 164537 164198 163480 162519 162161 162520 162500 161090 158537 155802 153438 151430 149713 148302
66639 148302 147142 146174 145349 144410 143004 141261 139881 139375 139540 139890 140155 140045 139090 137223 135174 133705
66623 133705 132707 131596 130345 129458 129025 128460 127337 125927 124702 123775 123114 122933 123412 124155 124355 123586 122176
66606 122176 120708 119339 117843 116151 114544 113256 112246 111510 111332 111916 112918 113697 113953 113858 113638 113320
66590 113320 112820 111966 110551 108754 107417 107358 108322 109100 108946 108406 108468 109243 109951 109950 109346 108591 107924 107410 107269
66571 107269 107823 108979 110003 110140 109457 108690 108158 107318 105736 103964 102886 102570 102512 102715 103580 104779 105242
66554 105242 104558 103475 102640 101714 100306 98922 98179 97605 96152 93652 91031 89261 88723 89375 90797 92036
66538 92036 92134 91002 89433 88248 87761 87923 88408 88535 87690 86068 84613 84072 84390 85118 86048 87182 88328
66521 88328 88971 88581 87043 84884 82973 81832 81319 81114 81265 81904 82652 82892 82598 82290 82067 81337 79848
66504 79848 78417 78053 78678 79263 79099 78333 77335 76148 74788 73628 73089 73147 73383 73443 73272 73025 72889 72901 72811
66485 72811 72288 71404 70739 70770 71293 71764 72098 72724 73819 74925 75487 75454 75086 74485 73656 72911 72802 73593 74976
66466 74976 76328 77182 77471 77404 77098 76405 75286 74258 74073 74722 75225 74718 73508 72661 72779 73601 74572 75320
66448 75320 75644 75538 75281 75124 74931 74528 74319 75037 76799 78872 80488 81408 81591 80911 79579 78408 78126
66431 78126 78612 79164 79430 79703 80304 81025 81352 81170 81001 81393 82080 82029 80505 77894 75257 73302 72113 71666
66413 71666 72017 72924 73776 74075 73731 72813 71324 69330 67094 65050 63770 63722 64641 65378 65002 63995 63697
66396 63697 64519 65389 65228 64253 63463 63473 64294 65684 67119 67828 67513 66862 66862 67716 68817 69588 69962 70156 70391
66377 70391 70763 71074 70867 69903 68558 67525 67211 67543 68228 69011 69787 70649 71752 73061 74387 75646 76790
66360 76790 77486 77305 76369 75349 74563 73521 71734 69584 67974 67372 67589 68300 69321 70480 71525 72204
66344 72204 72346 72009 71547 71241 70750 69395 67213 65304 64739 65407 66279 66585 66413 66376 66945 67950 68590 68163
66326 68163 66859 65488 64454 63570 62905 62948 63655 64192 64187 64375 65259 65925 65184 63331 61698 60864 60485 60625
66308 60625 61949 64397 66784 68075 68333 68146 67816 67444 67193 67093 66946 66646 66277 65827 65207 64574 64214 64121
66290 64121 64146 64509 65581 67142 68445 69077 69250 69213 69016 68916 69264 69752 69478 68114 66456 65395 64837 64094
66272 64094 62958 61907 61532 62104 63464 65003 65934 65877 65070 63924 62697 61776 61765 62807 64040 64306 63473
66255 63473 62700 63200 64955 66823 67862 68264 68804 69576 69718 68546 66542 64850 64118 64223 64854 65781 66632
66238 66632 67016 66947 66743 66496 66073 65615 65474 65573 65405 64867 64612 65220 66433 67511 68066 68280 68482 68770 68972
66219 68972 68866 68543 68504 69173 70337 71346 71820 71852 71568 70970 70274 69903 69984 70189 70217 70132 70108 70220 70570 71249
66199 71249 72032 72499 72617 72857 73544 74380 74741 74226 72925 71469 70752 71176 72151 72817 73172 73837 74730 74859
66181 74859 73755 72263 71424 71236 71110 70969 71166 71681 72127 72374 72580 72791 72990 73373 74018 74388 73699 71858
66163 71858 69681 68191 67913 68702 69938 70919 71378 71594 71929 72398 72835 73164 73268 72895 72046 71188 70750 70693
66145 70693 70918 71699 73170 74650 75176 74664 73943 73622 73502 73196 72732 72305 71907 71537 71450 71847 72492 72959 73145
66126 73145 73310 73628 73907 73826 73350 72876 72905 73578 74523 75198 75405 75459 75854 76750 77750 78238 78029 77584 77480 77759
66106 77759 78037 78149 78303 78584 78720 78553 78351 78392 78527 78490 78419 78739 79634 80933 82402 83853 85015 85625 85721
66087 85721 85695 86041 87071 88696 90366 91438 91825 92141 92885 93622 93367 91824 89909 88904 89277 90476 91726
66070 91726 92729 93579 94183 94126 93240 92045 91341 91399 91817 92176 92445 92665 92631 92197 91648 91420 91552 91656 91393
66051 91393 90821 90308 90222 90661 91416 92240 93123 94133 95063 95500 95331 94848 94300 93655 92979 92705 93231 94511 96194
66032 96194 97974 99591 100825 101763 102803 104082 105140 105485 105266 105038 105015 104927 104506 103781 102978 102443 102542 103324
66014 103324 104344 105137 105766 106638 107862 109167 110431 111943 114041 116711 119582 122241 124591 126998 129933
65999 129933 133334 136547 139124 141433 144148 147344 150469 153068 155069 156401 156895 156662 156175 155795 155454
65984 155454 154907 153995 152518 150172 146876 143060 139371 136139 133229 130368 127469 124643 122025 119701 117796
65969 117796 116468 115717 115309 114996 114702 114349 113650 112411 110976 109956 109533 109401 109460 110038 111227 112499 113308
65952 113308 113694 113949 114138 114366 115097 116671 118771 120850 122804 124720 126293 127166 127655 128370 129192 129379 128834
65935 128834 128545 129456 131419 133589 135430 136988 138460 139900 141294 142741 144521 146952 150054 153415 156546
65920 156546 159327 161970 164696 167649 170956 174544 178113 181595 185449 189992 194597 198140 200251 201548
65906 201548 202602 203236 203081 202235 201101 199932 198801 197716 196540 195032 193129 190938 188436 185554 182584
65891 182584 180004 177691 174838 170940 166426 161960 157613 153187 148968 145490 142679 139871 136757 133862
65877 133862 131806 130386 128676 126061 123065 120982 120584 121269 121678 121081 119819 118431 116907 115086 113322
65862 113322 112190 111686 111248 110532 109750 109178 108730 108193 107610 107237 107271 107749 108561 109405 109812 109439 108387 107201
65844 107201 106530 106797 108049 109964 111952 113421 114129 114356 114643 115294 116177 117036 117943 119360 121784 125353
65828 125353 129766 134480 139004 143118 146926 150720 154735 158972 163203 167209 170995 174636 177839 179828
65814 179828 179971 178493 176372 174494 173107 171978 170720 168918 166296 162953 159159 154880 149871 144371
65800 144371 139252 135256 132478 130809 130339 130892 131660 131919 131826 131938 132242 132342 132370 132967 134380 136229 138217
65783 138217 140469 143085 145940 149019 152403 155868 159078 162322 166422 171602 176950 181230 183799 184572
65769 184572 183718 181752 179423 176982 173855 169468 164137 158763 153942 149715 146062 143158 141209 140272 140256
65754 140256 140957 142178 143912 146294 149375 153187 157935 163697 169815 175174 179438 183559 188535 193964
65740 193964 198435 201268 203227 205294 207121 207086 203851 197680 190145 182675 175578 168463 161210 154187 147748
65725 147748 141982 136924 132558 128588 124651 120849 117600 114840 111936 108649 105690 103903 103282 103183 103188 103270
65709 103270 103322 103043 102272 101127 99818 98591 97768 97606 98128 99146 100321 101151 101181 100497 99813 99842 100717 102177
65691 102177 104098 106619 109807 113332 116378 117943 117612 116112 114780 114366 114771 115951 118316 121844 125512
65676 125512 128362 130757 133925 138545 144448 151374 159151 167190 174701 181653 188918 197163 206048 214638
65662 214638 222139 228008 231965 234415 236556 239507 243229 246541 248342 248728 248885 249880 251643 253193 253763
65647 253763 253464 252852 252202 251455 250565 249489 247953 245558 242052 237329 231292 224018 215874 207197 198039
65632 198039 188572 179488 171488 164445 157624 150737 144307 138905 134453 130423 126408 122369 118606 115520
65618 115520 113148 110944 108394 105764 103796 102702 101957 101178 100646 100737 101320 101988 102481 102635 102363 102004 102177
65601 102177 102970 103675 103750 103606 103924 104637 105224 105697 106505 107591 108387 108834 109581 110907 112195 112950 113692 115213
65583 115213 117406 119592 121783 124786 128994 133880 138981 144704 151586 159154 166239 172310 177934 183867
65569 183867 190262 196903 203658 210230 215784 219419 220997 221116 220211 218037 214199 208913 202943 196918 190913
65554 190913 184672 178034 171126 164308 157991 152406 147470 142954 138831 135409 132999 131550 130711 130219 130041
65539 130041 130156 130442 130897 131785 133327 135336 137372 139175 140702 141717 141667 140219 137808 135443 133843 132823
65523 132823 131628 129837 127822 126217 125105 124047 122854 121917 121544 121372 120795 119788 118865 118366 118181 118083
65507 118083 117889 117326 116243 115043 114475 114764 115280 115261 114623 113929 113840 114669 116228 118003 119682 121474 123592
65490 123592 125567 126664 127118 128316 131402 136075 141074 145422 148857 151454 153281 154298 154366 153528 152343
65475 152343 151490 150900 149801 147885 145759 143881 141726 138671 135133 132050 129639 127444 125278 123224 120962
65460 120962 118081 115092 113246 113147 114171 115321 115992 115886 115000 113972 113713 114319 114924 114941 114879 115530 116881
65443 116881 118319 119575 120894 122449 124049 125448 126684 127992 129456 130721 131206 130802 130247 130546 132038
65428 132038 134283 136693 138832 140215 140473 139857 139037 138200 136824 134593 132079 130191 129291 129148 129401 129726
65412 129726 129822 129582 129130 128495 127473 126044 124672 123959 124186 125324 127216 129524 131778 133770 135769 138135
65396 138135 140881 143775 146628 149237 151236 152284 152368 151750 150747 149631 148543 147388 145954 144245 142525
65381 142525 141038 139913 139337 139487 140226 141177 142157 143183 144077 144611 145114 146314 148336 150466 152259 154178
65365 154178 156715 159566 162371 165637 170002 175009 179626 183838 188729 194893 201684 208274 214651 221175
65351 221175 227784 234147 240141 245669 250239 253151 254118 253501 252002 250121 247773 244466 240063 235249 230848
65336 230848 226720 221929 216175 210506 206164 203137 200331 196953 193204 189703 186746 184225 181949 179791
65322 179791 177614 175246 172587 169818 167431 165816 164699 163182 160602 157244 154019 151532 149714 148217
65308 148217 146827 145404 143839 142268 141118 140702 140917 141550 142697 144573 146960 149252 151148 153051 155556
65293 155556 158750 162244 165740 169241 172660 175600 177723 179220 180683 182518 184626 186650 188366 189761
65279 189761 190871 191668 192106 192152 191785 191051 190128 189195 188143 186523 183954 180502 176535 172317 168012 164031
65263 164031 160944 158878 157258 155450 153444 151707 150506 149716 149162 148777 148390 147656 146349 144650 143120
65248 143120 142359 142480 142763 142164 140484 138790 138201 138501 138563 138052 137837 138520 139373 139294 138264 137187 136598 136278
65230 136278 136093 136483 137851 139773 141119 140985 139524 137916 137369 138016 138914 139161 138774 138289 137899 137401 136803
65213 136803 136442 136506 136818 137168 137517 137835 138047 138218 138506 138834 138864 138415 137687 136997 136532 136423 136798 137596 138549
65194 138549 139537 140742 142312 144059 145724 147368 149215 151193 152939 154226 155181 156073 157140 158676 160973
65179 160973 163910 166765 168732 169652 170059 170525 171186 171902 172578 173144 173479 173716 174484 176455 179616 183317 187156
65162 187156 191476 196811 203172 210196 217742 225989 235014 244660 254847 265759 277706 290984 305841
65149 305841 322312 340118 359093 379751 403043 429365 458132 488531 520341 553631 587910
65138 587910 622036 654901 685783 714089 739289 761320 780619 797485 811630 822531 829784 832777
65126 832777 830397 821746 807183 788288 766763 743657 719381 693741 665795 634435 599697 563266
65114 563266 527310 493011 460421 429328 399813 372182 346849 324188 304202 286483 270781
65103 270781 257301 246032 236168 226839 218215 211148 205812 201432 197371 193662 190287 186842 183378 180842
65089 180842 180003 180390 180793 180486 179509 178218 177136 176888 177624 178628 178986 178481 177433 176030 174414 173186
65073 173186 173012 173716 174437 174733 174882 174987 174527 173152 171379 170051 169394 169021 168610 168230 168129 168493 169322 170300
65055 170300 170873 170691 170004 169501 169757 170788 172009 172602 172124 170911 169775 169182 168805 167974 166454 164657 163178
65038 163178 162252 161587 160569 158692 155931 152836 150170 148359 147185 146013 144376 142417 140745 139850 139672
65023 139672 139731 139612 139253 138870 138714 138889 139317 139852 140433 141069 141720 142353 143139 144367 145994 147516 148538 149366
65005 149366 150725 152877 155289 157210 158362 159009 159583 160391 161549 163024 164676 166307 167669 168619 169382
64990 169382 170581 172701 175489 178085 179924 181347 183183 185725 188291 189856 190115 189820 189967 190678 191064
64975 191064 190226 188140 185390 182298 178734 174738 170840 167596 165083 163076 161456 160125 158698 156701
64961 156701 154169 151748 149995 148755 147465 145976 144768 144247 144113 143692 142767 141828 141509 142024 143131 144332
64945 144332 144977 144515 142963 141099 139983 140224 141660 143506 144767 144827 143935 143023 142792 143130 143581 144117 145067
64928 145067 146422 147702 148523 148934 149066 148885 148476 148211 148320 148503 148324 147913 147913 148679 149841 150820 151554 152416
64910 152416 153578 154814 156076 157906 160932 165113 169808 174566 179504 184841 190408 195770 200607 204817
64896 204817 208495 211915 215327 218611 221404 223641 225621 227331 228204 227938 227155 226668 226314 225132 222679
64881 222679 219603 216819 214559 212433 210076 207500 205002 202831 200924 199032 197210 195975 195708 196123 196635
64866 196635 197037 197357 197238 196104 193979 191563 189370 187216 184660 181502 177806 173942 170686 168626 167283
64851 167283 165457 162807 160425 159342 159079 158424 157206 156388 156486 156765 156264 155038 154008 153936 154818 156078 157006
64834 157006 157117 156378 155315 154809 155520 157255 158974 159709 159595 159775 161198 163791 166903 170201 173788 177702
64818 177702 181755 185824 189981 194375 199222 204805 211115 217578 223542 229158 235349 242694 250537 257490
64804 257490 262724 266554 269675 271997 272420 269911 264724 258287 251825 245396 238519 231328 224556 218491
64790 218491 212675 206831 201486 197277 194052 191206 188618 186675 185536 184995 185169 186604 189367 192524 195071
64775 195071 197142 199830 203885 209030 214555 220146 225968 232257 239008 245906 252425 258094 262773 266610
64761 266610 269814 272690 275779 279489 283444 286563 288053 288113 287416 286194 284157 281159 277571 273974 270686
64746 270686 267567 264181 260200 255712 250959 245790 239845 233450 227759 223487 219900 215742 210978 206839
64732 206839 204164 202495 201033 199797 199374 199923 200874 201441 201191 200324 199542 199420 199799 200068 200151 200787 202564
64715 202564 205096 207541 209642 211772 214104 216227 217598 218017 217563 216335 214406 211915 209047 205961 202786
64700 202786 199676 196840 194489 192711 191467 190770 190743 191327 192008 192118 191476 190603 190246 190820 192252 194155 196145
64683 196145 198140 200349 202857 205382 207764 210540 214606 220273 227106 234687 243032 252075 261199 269526
64669 269526 276399 281423 284498 286019 286605 286343 284603 280862 275314 268502 260906 253243 246517 241103 236214
64654 236214 230975 225774 221795 219400 217796 216322 215324 215542 217220 220094 223842 228275 233375 239323 246236
64639 246236 253850 261849 270552 280802 292899 305946 318541 329870 339884 348655 355943 361332 364545
64626 364545 365511 364281 360955 355767 349248 342179 335158 328207 320998 313547 306519 300733 296487 293394
64612 293394 290756 288055 285263 282808 281179 280415 279984 279160 277462 274774 271242 267146 262784 258333 253864
64597 253864 249532 245705 242684 240259 237712 234499 230870 227536 224745 222067 219388 217669 218071 220404
64583 220404 223121 225041 226465 228262 230438 232213 233160 233632 234172 235015 236112 237135 237519 236894 235468 233572
64567 233572 230926 226905 221563 215897 210985 207268 204657 202733 200713 197843 194232 190855 188411 186649
64553 186649 185120 184025 183712 183773 183417 182604 182066 182177 182499 182623 182829 183544 184558 185199 185103 184539 184116 184393
64535 184393 185538 187061 188025 187819 186726 185552 184809 184519 184650 185259 186192 187041 187658 188404 189662 191308 192931
64518 192931 194395 195931 197768 200018 202867 206524 210824 215160 219037 222623 226647 231732 237867 244493
64504 244493 251063 257511 264105 270905 277534 283632 289290 294788 300018 304410 307402 308720 308273 306090
64490 306090 302369 297318 290987 283560 275759 268526 262190 256377 250895 246257 243031 241033 239495 237807
64476 237807 235800 233549 231245 229088 227036 224821 222428 220321 218917 218057 217360 216863 216936 217663 218687 219617
64460 219617 220305 220813 221372 222230 223292 224097 224452 224830 225733 226969 228084 229238 230948 233066 234830 236044
64444 236044 237403 239401 241705 244020 246872 250907 255939 261408 267432 274695 283443 293318 304198 316565
64430 316565 330898 347270 365733 386687 410576 437588 467924 502099 540717 584170 632792
64419 632792 687081 747406 813601 885055 960892 1039527 1118114 1193150 1262011 1323773 1378363
64408 1378363 1425280 1463291 1490965 1507013 1510321 1500332 1477691 1444324 1402724 1355011 1302309 1244619
64396 1244619 1181338 1112345 1038851 963197 887958 815314 746895 683639 625878 573937 528552
64385 528552 490104 457580 429117 403826 382355 365300 351824 340363 330051 320750 312245 304318
64373 304318 297301 291639 286922 282143 276940 271814 267027 262105 256840 252072 248881 247294 246322 245148
64359 245148 243895 243245 243627 244897 246652 248699 251190 254366 258286 262831 267832 273143 278774 285033 292275
64344 292275 300290 308078 314460 318818 321159 321821 321423 320745 320156 319291 317764 316102 315441 316291 318135 320317
64328 320317 322856 326134 330228 334830 339559 344075 347910 350395 350835 348857 344718 339185 332995 326465
64314 326465 319699 312882 306153 299501 293135 287612 283133 278930 274015 268457 263295 259171 255682 252221
64300 252221 248818 245836 243329 241052 238868 236925 235664 235722 237464 240486 243901 247257 250866 255214 260473
64285 260473 266636 273619 281018 288232 295060 301806 308612 315126 321056 326517 331544 335801 339248 342578
64271 342578 346377 350080 352369 352551 351077 348790 346121 343058 339510 335535 331419 327596 324396 321871
64257 321871 319963 318700 318033 317509 316283 313607 309377 304223 298913 293533 287423 280173 272522 265822 260678
64242 260678 256563 252797 249293 246150 243087 239776 236477 233935 232773 233096 234417 235809 236497 236576 236868
64227 236868 237822 238879 239241 238909 238589 238777 239336 239804 239795 239200 238225 237167 236038 234601 232872 231259 230013
64210 230013 228930 227837 227019 226846 227324 228352 230003 232184 234387 236262 238117 240382 242886 245205 247417
64195 247417 249899 252680 255764 259921 266295 275043 285066 295289 305586 316268 327265 338209 348795
64182 348795 358507 366335 371315 373361 373185 371307 367387 360666 351039 339601 328099 317832 309114 301668
64168 301668 295248 289740 284957 280724 277105 274247 272015 270037 268145 266621 265973 266568 268353 270703 272613
64153 272613 273312 272802 271743 270862 270535 270755 271227 271524 271416 271080 270902 271094 271563 272040 272242 272093 271905 272114
64135 272114 272695 273071 272826 272166 271365 270174 268314 266348 265424 266112 267977 270277 272567 274604 276311 278116
64119 278116 280885 285187 290868 297524 305012 313189 321498 329328 336770 344576 353238 362290 370688 377761
64105 377761 383582 388415 392146 394579 396157 397840 400108 402550 404763 407235 410799 415465 420373 424767
64091 424767 428425 431163 432572 432445 430930 428083 423729 417983 411435 404524 397107 388962 380333 371651
64077 371651 363092 354818 347285 340793 334981 329326 323974 319510 315936 312531 308893 305539 303164 301749
64063 301749 300752 299847 299039 298292 297536 297003 297086 297887 299233 301214 304189 308086 312156 315778 319226 323211
64047 323211 327903 332920 338198 344301 351697 360166 369177 378534 388372 398667 409002 418721 427204 434152
64033 434152 439782 444609 448869 452148 453648 452777 449600 445032 440547 437308 435287 433496 431317 429338
64019 429338 428559 428904 428796 426280 420515 412374 403792 396398 390488 385229 379790 374122 368719 363998 360034
64004 360034 356566 353058 349139 345303 342860 342761 344603 347055 349099 350647 352284 354797 358702 363714 368810
63989 368810 373205 377180 381544 386545 391830 397358 403650 411035 419206 427712 436425 445354 454429 463765
63975 463765 473755 484631 496233 508558 522244 538133 556425 576639 598352 621621 646602 673139
63963 673139 701108 731067 764141 801043 841461 884786 931379 982775 1040692 1106271 1180465
63952 1180465 1264755 1361061 1471107 1596172 1737432 1896308 2074392 2272851 2491568 2728767
63942 2728767 2981761 3248186 3526165 3813186 4105348 4397956 4686371 4965747 5230352
63933 5230352 5473710 5689412 5871723 6016048 6119512 6180895 6199576 6174798 6106325 5995367
63923 5995367 5844239 5655663 5433361 5183133 4912378 4628299 4336973 4043766 3753576
63914 3753576 3470386 3197306 2937260 2692983 2466234 2257696 2067817 1897066 1745139
63905 1745139 1610651 1492023 1388137 1297858 1219540 1151467 1092368 1041118 996354 956765 921472
63894 921472 889827 861171 834972 810831 788112 765950 743839 721924 700565 680047 660872
63883 660872 643743 628879 615763 603993 593987 586489 581664 579083 578379 579544 582709 587854 594656
63870 594656 602567 611245 620888 631774 643521 655399 667400 680304 694391 708750 722262 734653
63858 734653 746068 756171 764274 770012 773341 774240 772887 769767 765099 758513 749820 739675 728840
63845 728840 717124 703812 688878 672995 656432 638769 619757 599723 578987 557567 535741
63834 535741 514351 494219 475616 458502 442845 428448 414817 401548 388709 376605 365361
63823 365361 354914 345256 336481 328675 321893 316150 311261 306810 302442 298190 294403 291301 288698 286249
63809 286249 283905 282022 280936 280509 280187 279431 277991 275896 273421 271048 269159 267641 266024 264078 262064
63794 262064 260284 258613 256668 254268 251562 248768 245980 243178 240363 237732 235675 234475 233979 233752 233491
63779 233491 233137 232655 232019 231414 231092 230952 230630 230056 229566 229341 229141 228800 228511 228380 228053 227133 225681 224023
63761 224023 222332 220727 219506 218919 218850 218984 219112 219097 218833 218476 218444 218921 219633 220336 221173 222265 223369 224378
63743 224378 225725 227706 229760 231118 231978 233308 235473 237784 239571 241082 243017 245599 248451 251115
63729 251115 253430 255612 258197 261735 266313 271418 276400 281011 285444 289932 294465 298856 302905 306394
63715 306394 308974 310315 310494 310094 309653 309058 307774 305663 303244 301072 299228 297590 296277 295579 295718 296838
63699 296838 298971 301776 304576 306903 308835 310581 312067 313219 314319 315690 317166 318325 319117 319950 321171
63684 321171 322724 324248 325314 325637 325246 324399 323283 322009 320949 320646 321143 321763 321905 321752 321841 322285 322931
63667 322931 323987 325804 328069 329812 330310 329590 327974 325532 322211 318228 314142 310549 307659 305094 302241
63652 302241 298953 295746 293136 291005 288854 286486 284070 281743 279546 277715 276617 276327 276560 277113 278135
63637 278135 279810 281936 283979 285690 287641 290864 295674 301048 305610 309224 313059 318100 324270 331177
63623 331177 338852 347262 355859 364379 373639 384726 397691 411746 426514 442430 460053 479581
63611 479581 500920 523658 547107 570901 595426 621077 647299 672883 696903 718688 737150
63600 737150 751130 760464 765950 768215 767350 763686 758088 751238 743322 734645 725829 717032 707533 696459
63586 696459 683441 668288 650684 630750 609620 588903 569607 551823 535260 519819 505684
63575 505684 493112 482243 473212 466349 462004 459983 459516 460115 462149 466142 471772 478131 484730 491606
63561 491606 498631 505518 512555 520564 529889 540045 550653 562241 575831 592076 610957 632001
63549 632001 654704 679020 705405 734046 764252 795099 826367 857845 887620 912015 927815
63538 927815 934236 932710 925552 915158 903556 891801 879889 867638 855398 843611 832051 819886
63526 819886 806240 790408 771817 750142 725473 698268 669295 639662 610548 582761 556690
63515 556690 532621 510814 491313 474021 458898 445673 433584 421954 411027 401608 393933 387500
63503 387500 381977 377443 373631 369771 365494 361239 357537 354559 352517 351674 351616 351321 350463 349915 350509 351946
63487 351946 353448 354781 356058 357155 357995 358968 360479 362517 365086 368497 372675 376714 379767 381924 383664
63472 383664 384933 385373 384979 383892 382007 379468 377049 375337 373910 372090 370101 368706 368107 368027 368586 370137
63456 370137 372415 374764 377131 380048 383706 387867 392657 398593 405783 413851 422708 432638 443515 454674
63442 454674 465780 477153 489074 501415 514181 527750 542236 557252 572686 589283 607984
63431 607984 628881 650986 672680 692223 708291 720535 729612 736548 742281 747838 754562 763726 776017
63418 776017 791510 810070 831541 855542 881184 907092 931854 954415 973909 989157 998731 1001901
63406 1001901 999337 992672 983484 972836 961419 949642 937644 925472 913074 899825 884370 865458
63394 865458 842895 817308 789250 759147 728046 697722 669703 644472 621626 600545 580937
63383 580937 563096 547699 535119 525076 517246 511914 509475 509511 511058 513788 518207 524581 532417 541254
63369 541254 551249 562535 574636 587044 599951 613825 628622 644021 660263 678156 698240 720390
63357 720390 744295 769868 796976 825029 853069 880155 905470 928128 947056 961261 970249 974200
63345 974200 973774 969804 963165 954738 945233 935000 923989 911862 898164 882602 865317 846743 827058
63332 827058 805957 783192 759212 735085 711932 690638 671816 655573 641389 628697 617648
63321 617648 608932 602858 599026 596862 595770 594483 590911 583325 571551 556631 539569 520997 501932
63308 501932 484066 468845 456477 446133 436985 428833 421887 416286 411957 408779 406699 405608 405098
63295 405098 404394 402740 400013 396823 393747 390474 385998 379765 372356 364927 358267 352579 347798 343647
63281 343647 339621 335444 331495 328365 325997 323802 321613 320008 319469 319747 320284 320854 321469 322037 322416 322543
63265 322543 322301 321629 321024 321488 323553 326605 329618 332322 335223 338695 342599 346791 351503 357026 363253
63250 363253 369692 375937 382127 388913 396861 405888 415532 425683 436729 448972 462404 477157 493575
63237 493575 511635 530858 551241 573587 598296 624313 650083 675340 701193 728528 756966
63226 756966 785454 813263 840291 866861 893468 920448 947743 975056 1002192 1029113 1055836
63215 1055836 1082362 1108400 1132921 1154308 1171313 1183601 1191137 1193506 1190263 1181533 1167733 1149093
63203 1149093 1126072 1099877 1071910 1042943 1013493 984671 957768 933137 910297 889121 870197
63192 870197 854064 840912 830978 824337 820173 817246 815372 815732 819419 826392 836090 848239 862571
63179 862571 878475 895481 913555 932397 951047 968830 986232 1004083 1022079 1038847 1053442
63168 1053442 1066058 1077061 1085856 1091193 1092427 1089973 1084332 1074988 1060787 1041438 1018134 992463
63156 992463 965193 936503 906868 876940 846817 816245 785572 755813 727697 701374 677239
63145 677239 656273 639115 625204 613188 601948 591106 581034 572595 566504 562581 559830 557445
63133 557445 555539 554771 555515 557494 560088 562959 566535 571755 579086 587917 597212 606413 615293 623337 630089
63118 630089 635932 641627 647007 650894 652442 651888 649959 647381 645076 643834 643364 642410 640241 637361 634450
63103 634450 631438 628102 624794 621938 619404 616933 614655 612645 610534 608126 605879 604215 602876 601550
63089 601550 600614 600541 601073 601733 602803 604973 608253 611933 615509 619013 622614 626511 631106 636663 642814
63074 642814 648976 655246 662408 671071 681227 692615 705033 718277 732199 746997 763235 781488
63062 781488 802012 824669 849104 875219 903573 935023 969861 1007661 1048184 1091918 1139382
63051 1139382 1190300 1243975 1300085 1358595 1419132 1481002 1543772 1607408 1671915 1737114 1802572
63040 1802572 1867509 1931033 1992840 2053482 2113627 2173244 2231717 2288296 2341964 2391155 2434130
63029 2434130 2469484 2495986 2512325 2517492 2511137 2493089 2462858 2420225 2366111 2302371 2230967 2153944
63017 2153944 2073979 1994131 1916809 1843329 1774448 1710965 1653812 1603900 1561801 1527386 1500013
63006 1500013 1479368 1465805 1459543 1459918 1465964 1477311 1493869 1514943 1539429 1566718 1596685 1628774
62994 1628774 1661814 1694831 1727537 1759966 1792079 1823689 1854302 1883027 1908981 1931650 1950490
62983 1950490 1964455 1972459 1974027 1968898 1956234 1934997 1904968 1866804 1821341 1769649 1713491 1654674
62971 1654674 1593845 1530882 1466621 1403262 1342764 1285673 1231751 1180944 1133308 1088776 1047426
62960 1047426 1009345 973867 939717 906432 875026 846658 821173 797495 774880 753162 732171
62949 732171 711717 692076 673940 657779 643455 630330 617614 604881 592421 580872 570420
62938 570420 560762 551872 544179 537717 531764 525809 520339 516131 513187 510981 509383 508630 508584 508699 508689 508693
62922 508693 508736 508497 507672 506225 504293 502174 500302 498854 497392 495267 492369 489163 485995 482775 479403
62907 479403 476115 473195 470567 467892 464978 461905 458763 455418 451695 447820 444495 442302 441107 440352
62893 440352 439866 439991 440801 441712 442165 442258 442298 442087 441243 440074 439478 439966 441212 442653 444053 445384 446571
62876 446571 447634 448801 450209 451603 452466 452411 451441 449967 448565 447463 446246 444339 441821 439486 438015
62861 438015 437424 437463 438118 439363 440790 441982 443135 444777 446842 448513 449115 448801 448189 447746 447787 448654 450395
62844 450395 452377 453677 453882 453274 452301 451202 450104 449104 448144 447100 446107 445479 445254 445131 445046 445478 446940
62827 446940 449367 452201 454915 457298 459499 461977 465145 468794 472141 474785 477349 480793 485309 490333
62813 490333 495489 500916 506715 512652 518609 524829 531470 538269 544955 551733 559085 567260 576224 585993
62799 585993 596739 608588 621523 635544 650756 667240 684926 703805 724374 747720 774931
62788 774931 806385 841857 881395 925759 975785 1031681 1093334 1161050 1235347 1315984 1401717
62777 1401717 1491153 1583431 1677910 1773558 1868927 1962423 2052299 2136581 2213239 2280296 2335608
62766 2335608 2376841 2402102 2410637 2402757 2379138 2340456 2287679 2222430 2146875 2063263 1973585 1879612
62754 1879612 1783131 1686093 1590502 1498143 1410352 1327894 1250912 1179050 1111870 1049308 991734
62743 991734 939513 892507 850028 811258 775762 743643 715216 690524 669227 650918 635358
62732 635358 622234 610883 600579 591142 583018 576574 571479 566991 562793 559310 557128 556295 556447 557514
62718 557514 559989 564350 570558 578428 588248 600559 615356 632004 650156 670324 693326 719483
62706 719483 748664 780903 816635 856498 901096 950689 1004768 1062106 1121649 1183390 1248130
62695 1248130 1316357 1387477 1459985 1532161 1602601 1670222 1733797 1791592 1841685 1882573 1913086
62684 1913086 1931740 1936854 1927680 1904991 1870227 1824545 1769150 1706016 1637477 1565292 1490653 1414912
62672 1414912 1339643 1266120 1195303 1128156 1065349 1006756 951950 901158 855044 813529 775610
62661 775610 740513 708423 679822 654626 632240 612032 593570 576801 562069 549535 538495
62650 538495 527727 516651 505773 495988 487922 481852 477556 474083 470331 466113 462159 458952 456238
62637 456238 453814 452017 450988 450146 448926 447514 446355 445386 444302 443175 442277 441559 440796 440076 439767 440140
62621 440140 441242 442901 444750 446623 449030 452686 457442 462396 467359 473367 481187 490092 498945 507780
62607 507780 517349 527670 538280 549711 563437 580133 599071 619588 642290 668278 697834 730386
62595 730386 765406 802907 843279 886868 933423 981658 1029629 1075803 1119517 1160220 1196577
62584 1196577 1226772 1249555 1264677 1272223 1271854 1262940 1245408 1220274 1189202 1153647 1114568 1072836
62572 1072836 1029474 985315 940827 896638 853972 814060 777285 743310 711971 683478 657745
62561 657745 634179 612442 592963 576246 562007 549483 538428 529278 522267 516777 511760 506571
62549 506571 501228 496123 491696 488264 485857 484168 482859 481922 481617 482031 482845 483543 483763 483476 483042 483072 483993
62532 483993 485732 488070 491269 495909 501958 508531 514950 521654 529673 539614 551716 566553 584833
62519 584833 606497 630766 657222 686270 718381 753452 791165 831444 874151 918625 963871
62508 963871 1009004 1053342 1096277 1137184 1175261 1209408 1238483 1261767 1278977 1290003 1295071 1295154
62496 1295154 1291634 1285513 1277492 1268934 1262055 1258741 1259719 1265213 1275879 1292502 1315172 1343348 1376620
62483 1376620 1414912 1457892 1504453 1552890 1601625 1649875 1697294 1742395 1781412 1809656 1824572
62472 1824572 1827082 1819572 1803078 1776758 1739440 1690896 1632012 1564681 1491669 1415952 1339802 1264498
62460 1264498 1190756 1119219 1050739 986443 927428 874234 826802 785075 749324 719728 695945
62449 695945 677277 662845 651462 641886 633633 627126 622707 619989 618559 618748 620990 624769 628880 632652
62435 632652 636339 640324 644331 647416 648557 647429 644741 641483 637736 632757 626355 619379 612356 604498
62421 604498 594888 584051 573463 563905 555186 547071 539515 532226 524967 518162 512340 507131 501714 496152
62407 496152 491322 487541 484238 481046 478237 475906 473720 471799 470965 471617 473092 474561 475970 477702 479875
62392 479875 482447 485518 489024 492458 495318 497656 499945 502588 505669 508982 512240 515548 519573 524866
62378 524866 531129 537632 544285 551634 559822 568314 576892 586192 596890 608952 622112 636607 652947
62365 652947 671312 691582 713735 737944 764527 793998 826840 863024 902076 943762 988268
62354 988268 1035399 1083992 1132422 1179367 1223678 1263837 1298072 1325107 1344601 1356869 1362263 1360810
62342 1360810 1352451 1337714 1317961 1294654 1268451 1239292 1207234 1172875 1137132 1101160 1066352
62331 1066352 1033708 1003076 973600 945091 918336 893910 871358 849887 829248 809517 790507
62320 790507 771875 753437 735016 716367 697636 679497 662455 646313 630752 616104 603112
62309 603112 592131 582947 575160 568420 562463 557222 552789 549218 546644 545648 546952 550416 554943 559717
62295 559717 565007 571187 577614 583337 588558 594366 600946 606978 611164 613769 616288 619944 624822 630200
62281 630200 635314 639860 643968 647836 651501 655067 659044 664221 671065 679302 688116 696720 704884 713071
62267 713071 722098 732594 744762 758609 774260 791982 812066 834838 860718 890072 922992 959256
62255 959256 998518 1040536 1085200 1132192 1180464 1228141 1273106 1313631 1348356 1375931 1395260
62244 1395260 1406133 1409259 1405512 1395396 1379206 1357243 1329680 1296610 1258503 1216336 1171135 1123780
62232 1123780 1075458 1027875 982576 940256 901008 864948 832253 802899 776823 754179 734991
62221 734991 718718 704643 692597 682753 674694 667319 659956 653099 647677 643928 641425 639981 639870 641114
62207 641114 643121 645376 648115 651842 656404 661082 665623 670604 676634 683667 691313 699330 707360 714610
62193 714610 720398 724894 728906 733044 737506 742443 748012 754121 760580 767460 774854 782344 789252 795434
62179 795434 801338 807290 813233 819242 825754 833142 841510 851011 861895 874212 887983 903832 922901
62166 922901 945855 972336 1001527 1032846 1065889 1100083 1134573 1168125 1199078 1225826 1247397
62155 1247397 1263294 1272997 1276407 1274628 1269235 1260471 1247070 1228278 1205151 1179305 1151302 1121121
62143 1121121 1089470 1057614 1026274 995667 966487 939997 917087 897794 881676 868159 856595
62132 856595 846492 837706 830052 822915 815627 808116 800846 794302 788807 784554 781379 778734 776271 774296
62118 774296 773302 773376 774416 776478 779333 781987 783292 782862 780845 777125 771511 764657 757948 752290 747511
62103 747511 743089 738842 734741 730539 725922 720833 715476 710201 705515 701982 699946 699355 699790 700701 701868
62088 701868 703742 707036 711769 717068 722227 727618 734143 742117 751175 761007 771586 782855 794811
62075 794811 807790 822093 837361 852887 868542 884842 902053 919816 937730 955741 973805
62064 973805 991804 1010063 1029428 1050370 1072286 1093939 1114248 1132301 1146905 1156690 1160825 1159449
62052 1159449 1153394 1143574 1130548 1114489 1095396 1073301 1048293 1020452 989936 957143 922727 887457
62040 887457 852065 817209 783500 751504 721592 693739 667610 643038 620313 599789 581383
62029 581383 564868 550480 538666 529112 520710 512771 505708 500132 495743 491623 487213 482464 477352
62016 477352 471912 466613 462121 458616 455672 452788 449754 446651 443814 441723 440628 440342 440594 441353 442686
62001 442686 444636 447505 451824 457607 463947 469751 474580 478444 481278 483201 484846 486691 488274 488709
61987 488709 487721 485486 481744 475989 468517 460465 452635 444941 437107 429264 421709 414628 408240 402744
61973 402744 398031 393883 390446 387969 386059 383843 381036 378298 376377 375397 375112 375279 375503 375237 374288 373057
61957 373057 372076 371583 371590 371966 372322 372276 372055 372507 374298 377349 381152 385334 389862 395071 401623 410080 420291
61940 420291 431414 442575 453327 463629 473837 484620 496254 507906 518173 526546 533892 541277
61928 541277 548760 555607 561223 565473 568374 569870 569852 568209 564980 560580 555744 551125 546969 543176 539608
61913 539608 536513 534780 535549 539211 544935 551498 558398 565846 573997 582734 591943 601316 610023 617316
61899 617316 623390 628929 633846 637375 639466 641105 642898 644329 644954 645512 647100 649821 652998 656270 659677
61884 659677 662916 665319 666523 666496 664795 660387 652529 641585 628786 615302 601669 588025 574654
61871 574654 562133 550987 541463 533676 527621 522836 518431 513985 510261 508519 509184 511589 514875 518642
61857 518642 522815 527579 533501 541144 550439 560888 572380 585211 599300 614038 628969 643906
61845 643906 658298 671381 683180 694478 705312 714324 720214 723160 724202 723847 722066 719148 715664
61832 715664 711779 707365 702709 698551 695522 694070 694753 697937 703138 709210 715384 721755 728636 735722
61818 735722 742103 746944 749933 751051 750077 746623 740785 733497 725896 718473 711135 703926 697111 690601
61804 690601 683942 676931 669689 661910 652679 641448 628776 615793 603311 591697 581177 571811 563448
61791 563448 555986 549494 543915 538956 534427 530341 526637 523229 520408 518608 517653 516845 516029 515863 516728
61776 516728 518092 519446 521121 523538 526250 528566 530783 534005 538887 545160 552340 560366 569567 580317
61762 580317 592688 606247 620398 635004 650341 666278 682040 697021 711210 724363 735368
61751 735368 743001 746887 747161 743690 736316 725567 712460 697783 682074 665982 650033 634277 618702
61738 618702 603795 590180 577912 566633 556202 546772 538524 531731 526704 523187 520234 517170 514283
61725 514283 512033 510194 508458 507307 507321 508044 508559 508877 509685 510842 511296 510559 509260 508029 506771 505330
61709 505330 504000 502975 501930 500484 498590 496220 493189 489496 485403 481085 476640 472468 469018 466067
61695 466067 462829 458924 454680 450391 445947 441358 436991 433005 429143 425349 422015 419287 416689 413829
61681 413829 411047 408967 407746 407055 406417 405292 403300 400784 398794 398039 398073 397905 397241 396677 396781 397429 398172
61664 398172 398986 400438 403108 406933 411238 415398 419295 423062 426736 430442 434644 439701 445163 449942
61650 449942 453278 455244 456338 456947 457275 457416 457347 457029 456607 456368 456548 457327 458837 460898 462938 464573 466129
61633 466129 468161 470638 473069 475310 477569 479647 480795 480444 478513 474886 469294 462059 454366 447319
61619 447319 440994 434805 428531 422663 417844 414181 411058 407599 403521 399478 396296 393921 391507 388477
61605 388477 384995 381394 377781 374388 371712 369851 368134 365786 362697 359295 356000 353130 350971 349518
61591 349518 348314 346894 345255 343695 342378 341262 340193 338887 337105 335165 333929 333891 334464 334611 334072
61576 334072 333458 333216 333056 332634 332319 332792 333994 335029 335284 335358 336461 338980 342071 344744 346925 349160
61560 349160 351701 354416 357394 360956 364967 368631 371212 372712 373668 374581 375658 376846 377858 378340 378259
61545 378259 378108 378606 380137 382443 384733 386145 386249 385209 383560 381983 381202 381652 382955 384038 384129 383408
61529 383408 382394 381060 379168 377172 375972 375675 375291 373937 371858 369993 368883 368339 367885 367274 366637 366238
61513 366238 366076 365852 365510 365567 366584 368463 370709 373230 376379 380244 384458 388716 392993 397234 401327
61498 401327 405458 410029 415224 421068 427787 435428 443195 449966 455591 460926 466371 471180 474486 476281
61484 476281 477045 477246 477679 479444 482818 486672 489739 492030 494406 497254 500313 503347 506049 507492 506712
61469 506712 504080 501391 500196 500373 500506 499383 496908 493752 490368 486567 482059 477172 472654 468833 465413
61454 465413 462210 459544 457711 456558 455848 455553 455455 454999 454065 453419 453854 455173 456619 457977 459637 461654
61438 461654 463415 464269 464108 463310 462397 461651 460806 459321 457200 455252 454186 453826 453688 453941 455178 457515
61422 457515 460532 463905 467394 470374 472200 473088 473931 475224 476787 478478 480299 481647 481418 479361 476625
61407 476625 474489 473128 472106 471378 471103 470945 470401 469584 468914 468231 467015 465466 464476 464344 464336 463943 463823 464796
61389 464796 466401 467312 467072 466621 467049 468571 470938 474121 478008 481970 485479 488987 493526 499440 506119
61374 506119 513016 520225 527780 534995 541070 546001 550309 554021 556487 557237 556546 555042 553136 551095 549321
61359 549321 548157 547482 546772 545621 543986 541935 539512 537010 535120 534382 534490 534484 533724 532419 531118 530025
61343 530025 528942 527543 525463 522522 519206 516622 515474 515201 514595 513136 511291 509678 508581 508211 508716
61328 508716 509649 510049 509462 508537 508281 508989 510193 511455 512850 514789 517605 521312 525721 530764 536633 543453
61312 543453 550933 558668 566685 575403 585084 595704 607302 619983 633469 647028 659928 671641
61300 671641 681640 689536 695460 699794 702414 702737 700609 696580 691146 684393 676619 668546 660469 651847
61286 651847 642307 632525 623569 615779 608857 602602 596924 591526 586270 581646 578335 576521 576110 577227
61272 577227 579751 582635 584534 585160 585351 585810 586474 587191 588235 589807 591570 593203 595148 598434 603771
61257 603771 610922 618772 625854 631015 633963 635331 636119 636838 637157 636514 635187 634419 635175 636982 638556 639397
61241 639397 639977 640330 639428 636589 632772 629643 627683 625944 623451 620204 616897 614354 613267 613939 616107
61226 616107 619281 623269 628099 633612 639498 645675 652233 659001 665486 671256 676185 680375 684040 687399
61212 687399 690525 693439 696356 699505 702626 705064 706621 707810 709031 710103 711079 712910 716573 722000
61198 722000 728527 735987 744533 753736 762854 771872 781342 791204 800606 808875 815792 820785 822868 821857
61184 821857 818885 815221 811099 806087 800074 793311 785795 777200 767385 756708 745829 735295 725204
61171 725204 715195 704872 694263 683774 673743 664120 654478 644239 633202 622086 612225 604289
61159 604289 597526 590661 583330 576216 570115 565481 562561 561202 560622 560118 560034 561273 563804 566374 567847
61144 567847 568085 567277 565169 561472 556588 551483 547063 543848 541977 541310 541673 543002 545098 547447 549776
61129 549776 552542 556361 561169 566682 573454 582427 593358 604759 615791 627270 640348 655057 670861
61116 670861 687852 706430 726169 745832 764475 782053 799052 815937 832829 849338 864747
61105 864747 878493 890373 900290 908164 914150 918437 920663 920094 916589 910855 903436 894042 882338 868853
61091 868853 854649 840488 826787 813892 801824 790108 778454 767352 757520 749091 741902 736263
61079 736263 732761 731414 731619 732980 735768 740502 747388 756083 765846 776073 786879 798934 812527
61066 812527 827155 842271 858047 875026 893461 913470 935372 959275 984638 1010897 1038316
61055 1038316 1067597 1098773 1131016 1163412 1195424 1226812 1257730 1288711 1319920 1350420 1378810
61044 1378810 1404549 1428121 1449969 1469926 1487712 1503302 1516609 1527333 1535367 1541019 1544752 1547028
61032 1547028 1548337 1549023 1549203 1549256 1550231 1553204 1558412 1565553 1574637 1585767 1598443 1612242 1628268 1648847
61018 1648847 1675702 1709551 1751653 1804369 1869736 1948936 2044038 2159112 2298757 2466848 2667873
61007 2667873 2908299 3195413 3536239 3939191 4414837 4971925 5613331 6339110 7153214
60998 7153214 8063872 9077901 10199052 11428606 12750199 14095975 15329506 16285958
60990 16285958 16856603 17049493 16973905 16770953 16557191 16411455 16373500 16420857 16445688 16282135
60980 16282135 15788812 14925939 13765644 12438279 11069408 9749756 8535010 7452642
60972 7452642 6507232 5689048 4985046 4384372 3876650 3449830 3091701 2791892 2541304
60963 2541304 2330961 2152544 1999458 1866769 1750776 1649008 1559779 1481140 1410788 1347213
60953 1347213 1290146 1239469 1194411 1154101 1118059 1085655 1055816 1027712 1001049 975245 949250
60942 949250 922782 896907 872662 849856 828009 807608 789402 773007 757330 741995 727427
60931 727427 713831 701074 689328 678856 669341 660330 652163 645478 639900 634256 628132 622280 617359
60918 617359 613176 609304 605604 601919 598068 594406 591623 589799 588365 587199 586904 587676 588669 588942 588404
60903 588404 587374 585905 584106 582547 581628 580813 579095 576048 571978 567200 561612 555063 547770 540262 532965
60888 532965 525943 519187 513126 508445 505102 501897 497586 492246 486935 482157 477421 472267 466922 461756
60874 461756 456843 452363 448792 446378 444874 444052 443957 444513 445511 447172 450010 453785 457324 459821 461728
60859 461728 463912 466613 469754 473572 478155 482813 486716 489860 492682 495057 496507 497299 498462 500551
60845 500551 503000 504922 506050 506659 506935 506721 505695 503563 500162 495596 490301 484877 479720 474758 469647
60830 469647 464268 458912 453862 449045 444307 439781 435646 431770 428010 424641 421876 419176 415734 411608
60816 411608 407593 404006 400431 396808 393719 391253 388581 385272 382169 380124 378572 376308 373237 370383
60802 370383 368406 366932 365401 363841 362710 362470 363328 365009 366744 367823 368193 368403 369123 370842 373660
60787 373660 377056 380137 382501 384591 386907 389260 391158 392549 393627 394239 394177 393926 394410 395830 397172
60772 397172 397075 395052 391888 388977 387194 386275 385385 384273 383494 383429 383582 383142 381840 379891 377562 375250
60756 375250 373578 372918 373016 373450 374110 374857 375193 374877 374523 374880 375765 376368 376472 376630 377135 377481 377037 375788
60738 375788 374169 372489 370679 368522 366069 363821 362304 361429 360609 359665 359135 359443 360215 360850 361299 361820
60722 361820 362392 363015 364143 366103 368326 369949 371089 372786 375592 378853 381507 383102 383888 384312 384648
60707 384648 384977 385480 386698 389110 392259 394749 395538 394925 393865 392828 391832 391078 390692 390145 388761 386711
60691 386711 384756 383169 381674 380272 379286 378621 377867 377256 377600 379067 380734 381644 381659 381119 380391 380043 380717
60674 380717 382348 384065 385324 386660 388862 391729 394148 395145 394538 392801 390684 388791 387218 385656 383982
60659 383982 382557 381741 381323 380731 379705 378558 377801 377747 378481 380009 382185 384468 386041 386535 386604 387424 389468
60642 389468 392005 393917 394656 394248 392877 390881 388858 387257 385933 384393 382378 380067 378027 377106 377872
60627 377872 379763 381273 381477 380992 380908 381308 381532 381457 381643 382417 383634 385261 387322 389296 390397 390574 390517
60610 390517 390637 390758 390963 391923 394017 396683 399040 400770 402087 403208 404105 404624 404676 404409 404172 404141 404130 403994
60592 403994 403985 404373 405027 405775 406874 408581 410516 412056 413123 413988 414610 414905 415459 417099 419775 422624 425128
60575 425128 427501 430001 432670 435740 439481 443646 447852 452531 458620 466197 474284 482114 489667 496801
60561 496801 502841 507419 510842 513265 514267 513652 511917 509544 506614 503486 501117 500181 500484 501728 504128
60546 504128 507883 512658 518173 524679 532381 540929 550011 559943 571156 583571 596863 610840 625147
60533 625147 639198 652906 666907 681454 695520 707544 716602 722328 724240 721958 715891 707097 696620
60520 696620 685391 674420 664403 655230 646468 638287 631451 626380 622647 619605 617365 616959 619382 624418
60506 624418 630662 636962 643631 651857 662265 674757 689570 707467 728654 752348 777788 804945
60494 804945 833841 863795 893760 922788 949849 973868 994472 1012104 1026967 1038541 1046674 1052409
60482 1052409 1056952 1060226 1061122 1058704 1052414 1041438 1024759 1001919 973339 940029 903380 864971
60470 864971 826125 787726 750695 716248 685341 658132 634351 613782 595992 579990 564777
60459 564777 550156 536678 524958 515243 507305 500456 493999 487914 482777 478762 475166 471215 466870
60446 466870 462567 458662 455494 453432 452384 451660 450761 449942 449640 449796 450079 450251 449945 448655 446424 444035
60430 444035 442092 440461 439018 438242 438495 439331 440108 440734 441210 441177 440654 440552 441594 443224 444419 445075 445758
60413 445758 446666 447756 449427 451984 454768 456825 458219 459732 461566 463405 465503 468521 472250 475585
60399 475585 477922 479743 481748 484260 487488 491433 495375 498331 500274 502199 504841 508072 511626 515531
60385 515531 519586 523196 526138 528872 531767 534522 536633 537973 538704 539107 539689 540982 542977 545062 546676
60370 546676 547791 548785 550203 552492 555441 557976 559131 559225 559554 560945 563304 566462 570581 575545 580819
60355 580819 586328 592747 600487 608971 617384 625631 633968 642071 649073 654357 657916 660055 661045 660938 659391
60340 659391 655845 650180 643167 636026 629477 623368 617166 610687 604325 598662 593989 590189 586926 583750
60326 583750 580171 576038 571956 568942 567414 566778 566210 565540 565192 565688 567549 571230 576634 582957 589509
60311 589509 596456 604339 613162 622493 632121 641982 651652 660561 668604 675913 682186 686893 690049 692026
60297 692026 692591 690904 686620 680314 672581 663353 652424 640209 627692 615942 605838 597832 591614
60284 591614 586308 581283 576709 573169 570801 568888 566257 562220 557249 552540 548756 545375 541466 536775
60270 536775 531779 527008 522763 519181 516072 512901 509413 506095 503570 501788 500293 498953 497794 496491
60256 496491 494795 493344 493181 494395 495922 496759 496760 496245 495569 495217 495683 496995 498710 500399 501749 502295 501800
60239 501800 500886 500671 501610 503220 504932 506644 508395 510130 511942 513957 515925 517511 519086 521577 525382
60224 525382 530013 534966 540333 546381 553153 560720 569294 578765 588558 598189 607640 617105 626735 636633
60210 636633 646672 656364 665383 674111 683067 691911 699828 706886 714085 721869 729519 736394 742892 749562
60196 749562 755936 760907 763880 765079 765027 764204 762942 761243 758834 755574 751589 746954 741607 735692 729565
60181 729565 723365 716972 710526 704492 699101 694219 689897 686505 684096 682104 679892 677198 673956 670256
60167 670256 666604 663617 661169 658439 655007 651329 647800 644018 639482 634549 630179 626983 624893 623536
60153 623536 622627 622199 622560 623824 625497 626943 628244 630035 632433 634744 636454 637921 639808 642350 645422
60138 645422 648873 652577 656591 661347 667131 673261 678522 682641 686639 691434 696829 702189 707338 712274
60124 712274 716759 720788 724908 729457 734001 738062 742003 746608 752195 758638 765850 773753 782095 790688
60110 790688 799389 807478 813636 817166 818863 820110 821467 822642 823431 823998 824405 824424 823771 822233 819823 817087
60094 817087 814893 813549 812451 810912 808900 806575 803575 799304 793597 786585 778326 769144 760000 751811
60080 751811 744501 737208 729358 721127 713063 705703 699427 694194 689407 684327 678606 672296 665595 658793
60066 658793 652203 645903 639797 634103 629348 625605 622170 618411 614543 611084 607877 604204 599750 595078
60052 595078 591194 588906 588447 589477 591532 594444 598119 602023 605508 608716 612526 617343 622531 627330
60038 627330 631646 635571 638794 641059 642654 643909 644683 644823 644558 643904 642272 639343 635826 632647 629829
60023 629829 626844 623625 620432 617035 612862 607789 602104 595851 588906 581561 574429 567871 562019 557104
60009 557104 553152 549617 545943 542311 539231 536654 534229 532216 531269 531266 531159 530202 528764 527786 527913 529280
59993 529280 531636 534484 537441 540632 544439 548860 553398 557669 561843 566434 571762 577540 582838 586611
59979 586611 588529 589151 589151 588596 587200 584903 581884 578317 574546 571208 568687 566545 563926 560492 556689
59964 556689 553259 550792 549650 549917 551339 553444 555670 557465 558559 559242 560089 561354 562924 564777 566930
59949 566930 568942 570201 570831 571606 572736 573583 573936 574603 576167 577963 579016 579288 579327 579321 579351 579950 581531 583742
59931 583742 586166 589222 593561 599049 605171 611954 619639 627820 635820 643584 651327 658667 665004 670418
59917 670418 675296 679465 682685 685654 689458 694134 698785 702901 706583 709627 711482 712121 711977 710991 708661
59902 708661 705053 700837 696255 690956 684948 678885 673362 668729 665516 664139 664134 664686 665943 668879 673720
59887 673720 679498 685387 691565 698429 705818 713327 720745 727984 735244 743323 752972 763815 774578 784452
59873 784452 793368 800970 806434 809621 811411 812521 812817 812111 810726 808788 805821 801563 796472 790998 785127
59858 785127 779115 773875 770017 767103 764452 762075 760285 758945 757748 756778 756210 755807 755255 754721 754635 755172
59842 755172 756179 757235 757495 756034 752870 749296 746780 745823 746084 747102 748373 749242 749296 748703 747826 746801
59826 746801 745910 745925 747499 750347 753580 756739 760064 763773 767609 771190 774504 777867 781508 785311 788936
59811 788936 792084 794518 795830 795378 792783 788432 783273 778036 772790 767246 761322 755406 750106 745602
59797 745602 741178 735714 728883 721544 714689 708337 701922 695382 689255 683850 678942 674288 669916 665903
59783 665903 662302 659234 656684 654327 652003 650216 649663 650379 651816 653591 655711 658247 661403 665711 671485
59768 671485 678131 684546 690140 695076 699779 704771 710624 717352 724122 730331 736625 743949 751885 759091
59754 759091 765329 771886 779819 788732 797535 805441 812010 817052 820814 823642 825352 825589 824729 823589 822280
59739 822280 820319 817828 815519 813420 810782 807476 804343 801858 799626 797522 796100 795429 794769 794032 794343
59724 794343 796393 799283 801760 803615 805113 806037 806290 806611 807677 809178 810590 812206 814478 817018 819221
59709 819221 821416 824490 828841 834526 841954 851467 862528 874180 886191 899088 913254 928538 944432
59696 944432 960041 974292 986827 998413 1009947 1021350 1031881 1041018 1048497 1054035 1057727 1060287
59684 1060287 1062152 1062795 1061643 1059208 1056398 1053003 1047846 1040407 1031421 1021888 1012256 1002721 993635 985316
59670 985316 977846 971253 965666 961311 958543 957791 959237 962663 967809 974694 983390 993659 1005029 1017015
59656 1017015 1029218 1041504 1054153 1067389 1080592 1092527 1102495 1110638 1116839 1120049 1119210 1114238 1105525
59643 1105525 1093050 1076731 1057273 1035985 1013918 991684 969817 948718 928416 908915 890635
59632 890635 874141 859581 846747 835464 825510 816295 806970 796818 785453 772879 759470 745677
59620 745677 731757 718057 705373 694400 684872 675960 667463 659774 652685 645483 638498 633306 630730
59607 630730 629697 628786 627859 627380 627182 626995 627271 628339 629463 629938 630436 631987 634123 635387 635429 635262 635589
59590 635589 636128 636648 637458 638615 639520 639552 638386 635664 631174 625536 619990 615252 611078 606991 602903 598899
59574 598899 594931 590903 586782 582655 578820 575603 572818 569856 566725 564485 564025 564805 565507 565575 565332 564924
59558 564924 564120 563078 562410 562409 562903 563894 565655 568137 570949 574078 578081 583419 590024 597549 605627 613904
59542 613904 622264 631095 640956 651947 663743 676274 690108 706054 724239 743141 759471 769764
59530 769764 772842 770585 766065 761294 756947 753309 750554 748442 746591 744952 743459 741567 738773 735314
59516 735314 731670 727623 722449 715862 708157 699645 690571 681429 672735 664655 657294 651055 646159 642101
59502 642101 638235 634628 631833 630095 629381 629755 631098 632838 634651 637050 640593 644963 649616 654847 661257
59487 661257 668522 675734 682685 689777 696815 703071 708537 714048 719963 725606 730207 733574 735700 736491
59473 736491 736168 735339 734441 733523 732574 731495 729849 727284 724223 721519 719351 717107 714462 712052 710952
59458 710952 711827 714564 718384 722382 726319 730678 735701 740747 745050 748667 752065 755214 757717 759441
59444 759441 760227 759370 756225 751150 745025 738046 729812 720480 711063 702528 695173 688878 683469 678956 675712
59429 675712 674150 673952 674194 674581 675927 678913 683260 688698 695741 704696 714947 726250 739595 755527
59415 755527 772697 789567 806540 824756 843827 862726 881794 901223 918028 927454 927925 922453
59403 922453 914928 907324 900903 897445 897984 902174 909884 921461 935102 945861 949178 944588 934888 922823
59389 922823 909822 896833 884610 873421 863465 855316 849236 844561 840431 836641 833272 830110 827063
59376 827063 824521 822694 821118 819311 817422 815874 814925 814855 815823 817229 818070 818309 819083 821197 824306 827946
59360 827946 832311 837429 842564 847244 852134 858249 865989 875511 887205 901109 916497 932783 950309
59347 950309 969667 990740 1012853 1035314 1057442 1078685 1099023 1118616 1136811 1152296 1164496
59336 1164496 1173874 1180602 1184052 1184047 1181432 1176758 1169564 1159666 1147975 1135121 1120368 1103000 1083853
59323 1083853 1064345 1044755 1024644 1004294 984502 965359 946357 927425 908893 890804 873209
59312 873209 856888 842760 830684 819612 808848 798511 788997 780681 774015 769267 766200 764404 763731
59299 763731 764063 765022 766326 767944 769340 768943 765157 757790 748052 737330 726412 715731 705868 697650
59285 697650 691769 688196 686111 684787 684460 685836 688937 693254 698927 706724 716656 727671 739059 751131
59271 751131 764045 777044 789484 801651 813810 825295 835320 843912 851293 857060 860854 863193
59259 863193 864822 865742 865607 864527 862765 860179 856726 853039 849795 846929 844110 841510 839507 838144 837500
59244 837500 838084 840179 843242 846554 850011 853695 857199 860016 862127 863572 863891 862561 859594 855218 849466
59229 849466 842513 834813 826427 816859 806099 795132 784837 775084 765553 756706 749101 742319 735421
59216 735421 728117 720909 714425 709099 705046 701859 699022 696766 695787 695922 696156 696362 697836 701442 706343
59201 706343 711359 716468 722054 727844 733726 740611 749227 758844 768411 778102 788570 799482 810117
59188 810117 820722 831862 842979 852987 861884 870381 878223 884144 887337 887892 886011 881861 875981
59175 875981 868877 860494 850878 840939 831641 822925 814325 806008 798156 790055 781098 772147 764545 758182
59161 758182 751895 745385 739357 734002 728762 723513 718672 714155 709392 704314 699261 694071 688396 682729
59147 682729 677983 674168 670623 667281 664460 661562 657335 651508 645087 639052 633810 629665 626590 623716
59133 623716 620351 617366 616172 616431 616383 615572 615647 618069 622516 628127 634866 642853 651475 660067 668767 678006
59117 678006 687789 698024 708966 720730 732741 744058 753971 762264 769330 776042 782883 789118 793388
59104 793388 795188 795254 794605 793833 793259 793010 792728 791753 789709 786627 782751 778698 775394 773139 771011 767914
59088 767914 763995 760245 757099 754321 751950 750283 749001 747265 744699 741473 737588 732949 727979 723267
59074 723267 718728 713971 709261 705167 701513 697740 694139 691550 689899 688192 686031 683975 682248 680163
59060 680163 677107 673206 668719 663632 658039 652315 646817 641962 638411 636394 635029 633204 631010 629475
59046 629475 629028 629135 629272 629361 629366 629383 629976 631534 633518 635197 636754 638651 640404 641282 641885 643563 646479
59029 646479 649693 653072 657602 663663 670429 677219 684231 691793 700062 709523 720492 732029 742556
59016 742556 751543 759279 765164 767906 767578 765782 763421 759942 755220 750550 747066 744617 742904 742395 743349
59001 743349 745147 747303 750109 753630 757167 760263 763168 765708 766884 766352 765327 765261 766374 767932 769129
58986 769129 769326 768401 767301 767335 768620 770282 772399 776390 782946 790922 799022 807448 817128 828421 841337
58971 841337 855972 871780 887224 900995 913002 923721 933330 941935 949716 956287 960752 962845 963126
58958 963126 961702 957830 951278 942950 933526 922585 909765 895743 881319 866500 851289 836416
58946 836416 822439 808989 795719 783221 772198 762438 753451 745475 739085 734320 730849 728483 726980
58933 726980 725865 724910 724261 723759 722807 721239 719649 718589 718121 718286 719030 719470 718357 715707 713005 711489
58917 711489 711263 712362 715318 720036 725306 730097 734341 738015 740815 743428 747741 754795 763622 773007
58903 773007 783238 795089 808220 821847 836119 851515 867494 882909 897423 911528 925616
58892 925616 939794 954292 969276 984644 1000568 1017827 1037040 1057884 1079374 1100372 1119568
58881 1119568 1135809 1149008 1160212 1170377 1179531 1187225 1193016 1196373 1196961 1195235 1191922 1186889 1179543
58868 1179543 1170284 1160295 1149804 1138018 1124994 1111964 1099354 1086098 1071543 1056482 1041558 1026217
58856 1026217 1010048 993697 977601 961275 944724 929052 914736 900807 886737 873522 861714
58845 861714 849992 837082 823682 810992 798672 785866 773088 761405 750607 739757 728809
58834 728809 718301 708235 698591 690233 683914 679028 674544 670566 667853 666529 666360 667600 670434 674202
58820 674202 678173 682407 687072 691756 696256 701043 706100 710428 713638 716719 720204 722986 724254 725180
58806 725180 727103 729286 730115 729437 727978 725467 721211 715849 710803 706496 702581 699288 697026 695349 693799
58791 693799 693184 694590 697763 701903 707337 714873 724109 733924 744196 755655 768523 782583 797920
58778 797920 814236 830032 843883 855977 867096 876719 883462 886706 886448 882255 873811 861949 847877
58765 847877 832067 815052 798287 782796 767938 753059 739296 728019 718486 708972 699432 691064
58753 691064 683937 677133 670690 665373 660874 656216 651654 648355 646484 645443 645716 648559 653924 660404
58739 660404 667156 674314 681665 688490 694635 700378 705517 709901 714403 719939 726012 731601 736741 741668
58725 741668 745332 746760 747235 749035 752431 755925 759001 762550 766893 771542 776761 783304 790653 797420
58711 797420 803294 808705 812884 814356 813150 810397 805884 798256 787590 775488 762495 747668 730836
58698 730836 713042 694512 674563 654004 635307 619695 606017 593154 581500 571379 562038 553203
58686 553203 545858 540443 535761 530665 525609 521704 519341 518390 518612 519271 519378 518868 518734 519779 522164 526110
58670 526110 531828 538611 545254 551584 558555 566758 575949 585886 596360 606447 614961 621550 626115 627487
58656 627487 624236 616755 607044 596463 585072 573047 561155 549794 538993 529326 521491 515094 509212
58643 509212 503955 500074 497385 495115 493440 493060 493555 493833 493853 494264 494751 494561 494195 494617 495252 494775 493489
58626 493489 492779 492611 491841 490688 490521 491303 491665 491442 491744 492595 493021 493494 495697 499651 503605 507019 511054
58609 511054 515856 519971 522978 526136 529912 533342 536398 540410 545440 549728 552479 554835 557371 559039
58595 559039 559409 559653 560468 561276 562208 564630 568903 573893 579384 586665 596033 606107 616397 628043 641140
58580 641140 653806 664935 675485 686049 695674 704194 713261 723692 734046 743164 751972 761591 771809
58567 771809 782767 796020 812522 831375 851756 874218 899037 925145 951682 978561 1004531
58556 1004531 1026765 1043529 1055439 1063276 1066706 1066006 1062791 1058023 1051440 1043676 1036465 1029731 1021013
58543 1021013 1008981 995096 980664 964821 946683 926937 905837 882205 855959 829317 804053
58532 804053 779894 756925 736838 720185 704992 689901 676304 665644 657037 649406 643506 639838
58520 639838 636805 632898 628658 624766 620499 615848 612747 612130 611959 610187 607573 605664 604246 602834 602441
58505 602441 603640 604830 604566 603722 603479 603223 602400 602280 603727 605267 605505 605598 607302 610465 614407 619750
58489 619750 626847 634384 641575 649839 660469 672686 685694 700313 716671 732814 747810 763700
58477 763700 782071 801128 818461 834087 848130 858163 862004 860984 857457 851135 840880 828228
58465 828228 815937 804670 794016 785234 780024 777929 777642 779557 784527 791572 799311 808222 819106
58452 819106 830839 841809 851916 860928 866773 867810 864963 859322 849838 835863 819836 804727 790757
58439 790757 777223 765367 756607 749945 743974 739552 737818 737608 737644 739087 743114 748115 752278 756718
58425 756718 763004 769828 775321 780452 786695 792356 794648 793591 790726 785986 779027 771521 764767 757123
58411 757123 747139 736964 729194 722667 715116 707658 702684 699427 695718 692189 690641 690074 688466 686819
58397 686819 687413 689671 691609 693645 697071 700646 702706 704766 708916 713609 716196 717693 720668 724379
58383 724379 726512 727921 731020 735248 738771 742829 749624 757571 763619 768622 775498 783627 790248 796028
58369 796028 803995 814058 823659 832808 843472 855114 865808 876724 890498 906194 920703 933888
58357 933888 947449 960142 969366 976055 982693 987896 988569 986076 984562 984359 982903 980999 982057 985940
58343 985940 989596 993090 999047 1006900 1013761 1020376 1030120 1042674 1054756 1066442 1080523 1096221 1109947
58330 1109947 1121886 1135433 1150479 1163565 1174220 1184629 1193568 1197541 1197724 1198902 1201638 1202383 1201247
58317 1201247 1202478 1206999 1211562 1215652 1222179 1230891 1238207 1244208 1252829 1264535 1275729 1285837 1297967
58304 1297967 1312095 1324820 1336396 1350731 1367828 1383471 1396969 1411841 1428364 1443041 1456070
58293 1456070 1471605 1489956 1507209 1523159 1541684 1562749 1582267 1600480 1622003 1646815 1669901
58282 1669901 1690742 1714316 1741644 1768398 1794100 1823454 1857180 1890801 1923986 1961658 2004190
58271 2004190 2046099 2086170 2129287 2176557 2223485 2269651 2320005 2374663 2427838 2478895 2533844
58260 2533844 2593804 2652842 2709432 2768783 2831519 2891596 2948109 3007393 3070797 3132523 3192375
58249 3192375 3258058 3331658 3406662 3481623 3563546 3654311 3747512 3842541 3947588 4064501 4185171
58238 4185171 4307350 4439132 4583211 4732272 4885064 5050919 5232819 5422443 5617889
58229 5617889 5829307 6060826 6304556 6559176 6836198 7140739 7464972 7808181 8183752
58220 8183752 8598434 9045151 9524623 10052765 10638222 11275567 11970010 12744674 13613815
58211 13613815 14575324 15641226 16848550 18229130 19800109 21599789 23703360 26190969
58203 26190969 29136666 32645307 36860270 41912719 47902497 54951777 63236857 72946485
58195 72946485 84254362 97342292 112368998 129369138 148249718 168927826 191391235
58188 191391235 215579495 241299017 268219869 295551809 321281687 341831977 353125413
58181 353125413 352619975 340586848 319575936 292858476 263315603 233208191 204237155
58174 204237155 177485541 153431916 132182609 113695882 97821914 84296619 72822858
58167 72822858 63143128 55014475 48178506 42404689 37526648 33406041 29898719 26883481
58159 26883481 24287110 22051604 20104263 18381408 16851925 15494302 14274699 13166436
58151 13166436 12166181 11271197 10461495 9720510 9051570 8457129 7921467 7429447 6983430
58142 6983430 6586453 6226418 5891588 5585019 5309533 5054135 4808898 4578575 4368585
58133 4368585 4171620 3980559 3800984 3638667 3487473 3341264 3205310 3084421 2971627
58124 2971627 2859897 2753827 2658866 2569832 2480810 2396070 2320643 2249861 2178403 2110323 2050228
58113 2050228 1993548 1935259 1879625 1831831 1788092 1743081 1699219 1659861 1621149 1579250 1538134
58102 1538134 1501766 1466029 1426587 1387455 1353568 1322068 1289135 1258440 1234479 1214030 1192333
58091 1192333 1171519 1155034 1139755 1121559 1102987 1087752 1073190 1055620 1037744 1023350 1009883
58080 1009883 993417 975871 960274 944059 924112 903526 886363 870502 852495 834709 820756
58069 820756 808420 793986 779206 767246 756095 742703 729410 719576 710963 700119 689273 682084
58057 682084 676312 667547 656748 647476 638992 628686 618201 610600 604348 596375 588239 583071 579208
58044 579208 573093 565844 560846 557287 552081 545928 541553 538032 532488 525438 519148 512847 504793 496840
58030 496840 491692 487831 482228 475728 470606 465280 456966 447338 440093 434863 428903 422812 419171 417309
58016 417309 414680 411787 410568 409645 406358 401917 399416 398305 395933 392956 391983 392248 390885 388360 387500
58001 387500 388147 387768 386453 386490 387819 388592 389344 391859 394737 394831 392509 391047 391363 391702 391782 392829 394034
57984 394034 393261 390966 389485 389001 387987 386871 387345 388907 389996 391656 396011 401959 406471 409413 413031
57969 413031 417420 420667 422839 425656 428602 429380 427802 425463 422159 416504 409477 403383 397835 390690
57955 390690 382371 375263 369380 362785 355835 350786 347436 343379 338531 335305 334240 333422 332368 332578 334067
57940 334067 335131 335832 338127 342304 346744 351269 357158 363860 369291 373510 378501 384182 388192 389804
57926 389804 390424 390073 387036 381456 375758 371020 366173 361083 357002 353644 349236 343869 339500 336311 332449
57911 332449 327764 324350 322884 321836 320871 321589 324140 326329 326921 326809 326305 324371 321256 318806 317414
57896 317414 315537 312879 311084 310620 309972 308664 308273 309717 312282 315793 320834 326319 329829 331080 332184
57881 332184 333969 334992 334755 334706 335284 335076 333760 332840 332572 331226 328442 326338 326101 326300 325643 324734 324078
57864 324078 323141 322375 323374 325911 327624 327709 328102 329917 331670 332351 333311 335509 337657 338783 340070 342444
57848 342444 344651 345427 345396 345335 344735 343537 343044 343552 343230 341002 338532 337743 338263 338872 339588 340733 341692 342192
57830 342192 343280 345611 348228 350259 352282 354879 357370 359098 360435 361497 361434 359968 358045 356181 353805
57815 353805 350967 348768 347253 344760 340274 334542 328073 320198 311054 302323 294911 287954 281156 275808
57801 275808 272263 268776 264382 260749 259467 259556 259410 259338 260333 262038 263777 266150 269813 273912 277281 279984
57785 279984 282396 284104 285067 286418 288801 291283 293156 295263 298266 301250 303461 305813 309040 311885
57771 311885 312871 312579 312398 312222 311065 308981 306679 304132 301071 298118 296085 294802 293745 293074 293083 293531
57755 293531 294421 296427 299635 302912 305432 307705 310240 312395 313498 313949 314317 314507 314618 315301 316466 316982
57739 316982 316438 315741 315208 313808 311241 308936 307767 306601 304493 302556 302053 302223 301742 300949 300862 301186 301064
57722 301064 300837 301372 302434 303195 303593 303975 304197 304186 304487 305282 305906 306222 307219 309244 311112 312103 313309 315648
57704 315648 318068 319252 319688 320395 320951 320533 319763 319747 320225 320361 320433 321093 321737 321265 319722 317684 314818 310568
57686 310568 305618 301246 297769 294902 293052 293079 295421 300420 308723 320366 334369 350285 369219 392380
57672 392380 419692 450724 485693 524464 566044 610361 658993 712305 766505 814556 848893
57661 848893 862874 852441 819128 770393 714879 657859 602084 550613 506012 467996 434751
57650 434751 406135 383395 366311 352967 342073 333505 326813 321097 316195 312348 308947 305179 301480
57637 301480 298775 296753 294436 291943 289999 288184 285405 281795 278519 275947 273520 271074 268855 266565
57623 266565 263809 261121 259142 257221 254223 250331 246736 244030 242152 241299 241494 241859 241695 241623 242305 242844
57607 242844 242042 240464 239578 239502 239308 238909 238900 239018 238501 237466 236375 234760 232249 230172 230201 231823 233028
57590 233028 233155 233217 233799 234572 235628 237385 239290 240339 240765 241576 242658 242968 242346 241459 240239 238051 235135
57573 235135 232239 229089 224979 220537 217126 214696 212059 209022 206424 204238 201519 198248 195464 193601
57559 193601 192340 191973 193175 195454 197441 198655 199514 199995 199978 200485 202599 205418 207036 207409 208233 210115
57543 210115 211897 212725 212821 212222 210830 209714 210268 211936 212712 211995 211009 210391 209518 208352 207745 207648 207126 206456
57525 206456 206985 208552 209282 208453 207468 207442 207972 208863 210891 213994 216755 218531 220298 222638 224746 226192
57509 226192 227746 229616 230793 231107 232122 234897 238422 241259 243237 244638 245253 245194 245228 245483 245177 244278
57493 244278 243921 244506 245020 245015 245580 247399 249435 250489 250646 250348 249541 248600 248494 249032 248523 246231 243658 242288
57475 242288 241590 240416 238940 237871 236986 235816 234791 234413 234149 233254 231934 230826 230087 229695 229788 230067 229876
57458 229876 229399 229699 231067 232590 233823 235462 237726 239671 240923 242504 244930 247020 247768 248003 248982
57443 248982 250663 252606 255298 259163 263340 266793 269787 273071 276474 279449 282178 285046 287825 290377
57429 290377 293312 296994 300699 303697 306268 308805 310899 312249 313462 314942 316049 316407 317040 318946 321474
57414 321474 323320 324411 325617 327256 329065 331134 333822 337091 340612 344118 347139 349103 350189 351288
57400 351288 352691 353775 354404 355451 357370 359581 361927 365319 370097 375177 379874 385121 391688 398527
57386 398527 404304 409381 414796 420353 425225 429625 434394 439583 444716 449798 454901 459485 463315 467308
57372 467308 472325 477822 482846 487575 492735 498269 503850 509930 516978 524303 530877 536833 543045 549768
57358 549768 556736 564004 571643 579225 586621 594698 604246 614849 625694 636792 648458 660441 672524
57345 672524 685111 698234 710917 722579 734106 746373 758815 770795 783342 797952 814461
57334 814461 831740 850016 871082 896608 927349 963205 1002544 1041956 1078108 1109649 1136458
57323 1136458 1157971 1173727 1184928 1193899 1202177 1210200 1218329 1226905 1235662 1244257 1252953 1261825 1269929
57310 1269929 1276365 1281600 1286734 1292224 1298387 1306226 1316426 1328286 1340924 1354701 1370112 1386179
57298 1386179 1401466 1415923 1430192 1443890 1456292 1468058 1480593 1494100 1507815 1521600 1535776
57287 1535776 1549970 1563805 1578180 1594211 1611377 1628365 1645130 1662393 1679672 1695814 1711117
57276 1711117 1726995 1743720 1760419 1777088 1794672 1813174 1831567 1849717 1868663 1888886 1909898
57265 1909898 1931620 1954531 1978379 2002286 2026172 2050569 2075082 2098657 2121409 2144444 2167728
57254 2167728 2189794 2209813 2228488 2246752 2265091 2284250 2304975 2326757 2348301 2369525 2391686
57243 2391686 2415362 2439859 2464869 2491067 2518559 2546135 2572643 2597898 2621781 2643624 2663027
57232 2663027 2680408 2696445 2711798 2727400 2744060 2761645 2779560 2797895 2817096 2836749 2855988
57221 2855988 2875047 2895204 2917222 2940888 2965871 2991866 3018140 3044178 3070466 3097363 3123691
57210 3123691 3147895 3170044 3191036 3210401 3226907 3240942 3254019 3266043 3275409 3282093 3288310 3295558
57198 3295558 3303129 3310236 3317623 3326185 3335713 3345996 3357736 3371507 3386953 3403607 3421396 3440005
57186 3440005 3458994 3478814 3500352 3523245 3546033 3568119 3590027 3611576 3631563 3649634 3666783
57175 3666783 3683531 3699220 3713497 3726880 3739454 3750614 3760456 3769772 3778300 3784739 3788873 3791896
57163 3791896 3794283 3795190 3794364 3792583 3789653 3784076 3775422 3764946 3753074 3738426 3720322 3700111 3678792
57150 3678792 3655305 3628555 3599423 3569466 3539234 3509181 3480666 3454751 3431355 3410725 3394329
57139 3394329 3383192 3376716 3374132 3375648 3381164 3389410 3399398 3411175 3424152 3436334 3446356 3454751 3462216
57126 3462216 3468352 3473312 3479102 3488118 3501921 3522315 3551707 3591200 3640127 3698492 3767906 3849102
57114 3849102 3940882 4042959 4157558 4286774 4430889 4591227 4772381 4979643 5216711 5488357
57104 5488357 5803511 6173984 6613144 7139031 7777321 8559361 9519850 10698591 12140585
57095 12140585 13889379 15980661 18443198 21300615 24565561 28231807 32272026 36634243
57087 36634243 41229791 45928069 50579574 55059233 59297351 63280065 67026119 70545770
57079 70545770 73784233 76579009 78681716 79853191 79966073 79036522 77178088 74537939
57071 74537939 71264425 67500375 63376027 58999011 54456130 49828679 45206080 40686285
57063 40686285 36365740 32327467 28632233 25314314 22382464 19825071 17616658 15723285
57055 15723285 14106770 12728672 11553738 10550954 9691464 8945845 8284847 7684399 7130656
57046 7130656 6619955 6153568 5732106 5353737 5015532 4714647 4448076 4212375 4004326
57037 4004326 3821354 3660834 3519497 3394280 3283487 3186470 3102415 3030364 2970174 2922339
57027 2922339 2886628 2861748 2846016 2836346 2825554 2802436 2757020 2686486 2595752 2493017 2385518
57016 2385518 2278422 2175381 2078810 1989870 1908590 1834147 1765492 1702194 1644510 1592426 1545112
57005 1545112 1501712 1462052 1425935 1392321 1360012 1328815 1299283 1271587 1245302 1220014 1195528
56994 1195528 1171812 1149393 1129454 1112859 1099305 1088049 1079015 1072466 1067990 1064653 1062007 1060234
56982 1060234 1059412 1059039 1057853 1053593 1043567 1026482 1003632 977782 951211 925235 900777 878347
56970 878347 857841 839342 823821 812222 804247 798957 796192 796424 799488 804513 810976 818866 827961
56957 827961 837849 848453 859389 868561 872313 867458 853077 830618 802849 772537 741516 710890
56945 710890 682017 656590 635379 617773 603289 592711 586858 585090 586208 590233 598004 609421
56933 609421 623344 638989 656294 674997 694195 712292 726298 731773 725229 706841 679962 648210
56921 648210 614054 579603 546861 516754 489100 463828 441344 421675 404401 389453 376894
56910 376894 365861 354989 344170 334739 327567 321919 316543 311020 305633 300761 296830 294308 293405 294092
56896 294092 296359 300017 304478 309347 314995 321890 329686 337786 346496 356771 369065 383182 398690
56883 398690 414285 427222 434822 436579 433728 427159 417218 405291 393801 384177 376256 369966 366201
56870 366201 365588 367854 373067 382354 396531 414869 435879 458702 483307 510102 539813 573034
56858 573034 609103 645420 677768 701063 710686 704734 685557 658356 627978 597438 568900 544409
56846 544409 525185 511370 503128 501287 506552 518851 537817 563276 594970 632397 675106 722677
56834 722677 774525 830221 889326 949360 1003681 1042780 1058693 1048446 1014213 961801 898992
56823 898992 833445 770677 713829 664901 625139 594410 571609 556223 548629 548790 555853 569316
56811 569316 589409 615907 647639 683641 723702 766978 810544 849469 877682 889150 880172 851787
56799 851787 809421 759573 707105 655363 607148 564435 527815 497145 472477 454026 441672
56788 441672 434872 432806 434632 440055 449532 463247 480084 498414 517684 537962 557695 572958
56776 572958 579401 574561 558593 533884 504100 472554 440964 410084 381011 354817 331270 309330
56764 309330 288949 271200 256613 244643 234744 226629 219479 212366 205632 200358 196287 191889 186799
56751 186799 182567 180417 179711 179220 178517 177502 175916 174029 172588 171485 169685 166983 164517 163023 161893
56736 161893 160548 159388 158737 158161 157558 157589 158339 158833 158665 158811 160057 161861 163511 165092 166588 167422 167839
56719 167839 169325 172535 176016 178084 178887 179510 180182 180559 180879 181623 182709 183947 185605 187688 189427 190263
56703 190263 190593 190941 191257 191619 192568 194067 195183 195496 195732 196347 196743 196703 197271 199218 201810 204070 206134
56686 206134 208321 210106 211120 212141 213924 215999 217630 219025 220570 221904 222751 223641 224778 225269 224540
56671 224540 223419 222749 222067 220780 219473 218757 218026 216719 215739 216121 217268 217969 218288 218870 219223 218320 216393
56654 216393 214644 213592 212933 212563 212546 212581 212607 213311 214989 216598 217040 216613 216105 215358 214033 212926 213039 213972
56636 213972 214587 214705 214815 214698 213775 212359 211274 210597 209822 208812 207588 205808 203533 201748 200982 200198
56620 200198 198291 195891 194335 193586 192678 191593 191182 191615 192289 192937 193595 193852 193338 192508 191909 191240 190162
56603 190162 189300 189269 189493 189278 189257 190325 191940 193018 193854 195482 197682 199272 200054 200844 201828 202447 202713
56586 202713 203164 203645 203425 202519 201719 201505 201885 202978 204696 206276 207169 207979 209556 211765 214132 216900
56570 216900 220257 223364 225521 227632 231114 236080 241887 248647 256668 265166 273274 281688 291680 302995
56556 302995 314175 324217 332244 336444 335486 330641 324603 318560 312150 305701 300297 295788 290886 285361
56542 285361 280323 276202 272243 268202 264907 262849 261567 260551 259546 258041 255707 253143 251013 248880
56528 248880 246210 243887 243094 243247 242826 241809 241366 241554 241375 240923 241272 242127 241666 239146 235856 233108 230884
56511 230884 228792 226855 224982 223021 221534 221263 221722 221608 220618 219540 218654 217443 215856 214525 213746 213423
56495 213423 213797 214910 215728 215178 213732 212620 212001 211419 211362 212522 214012 214264 213365 212689 212605 212487 212548 213530
56477 213530 214802 214901 213841 212926 212549 212223 212456 214209 216622 217685 217242 217059 217823 218408 218251 218087 218071 217487
56459 217487 216673 216947 218236 218964 218744 219035 220704 222990 225214 227441 229154 229464 228997 229457 231015 232262
56443 232262 232954 234434 236973 239092 239960 240143 239645 237725 235102 233674 233453 232373 229900 228080 228140 228739
56427 228739 228694 228809 229693 230222 229668 229214 229922 231082 231806 232400 233124 233461 233589 234586 236278 236992 236356 236075
56409 236075 236993 237768 237653 238072 239942 241746 241923 241195 240922 241032 241108 241624 242622 242930 242201 242023 243542 245674
56391 245674 246987 247621 248033 247691 246504 245843 246582 247673 247956 247804 247772 247327 246255 245607 245944 246263 245948 246038
56373 246038 247295 248774 249665 250785 252815 254739 255469 255492 255643 255802 255943 256804 258413 259669 260391 261852
56357 261852 264296 266099 266553 267166 268911 270560 271237 272136 273982 275210 274680 273908 274498 275521 275649 275800
56341 275800 277247 279010 279631 279974 281815 284992 288260 291691 296005 300650 304595 308017 311388 314130 315997
56326 315997 318462 322859 328207 332624 335715 338028 339477 340007 340504 341398 341612 340353 338613 337546 336922
56311 336922 336538 337282 339254 340725 340759 341064 343509 347604 352179 357532 363965 370193 375351 380759 387541
56296 387541 394278 399200 402929 406870 410719 413821 417275 422304 428134 433726 439955 447857 456448 464552
56282 464552 472995 482614 492031 499955 507873 517664 528218 537254 545025 553472 563128 573606 585705
56269 585705 600197 615797 631122 647423 666756 688769 712104 737620 767277 800973 837417
56258 837417 877254 922544 974065 1031694 1096472 1169634 1250535 1338025 1432839 1536162 1646978
56247 1646978 1763407 1885457 2013777 2146804 2281730 2417030 2551266 2680593 2800351
56238 2800351 2908236 3003327 3083108 3144205 3184975 3204771 3201995 3175842 3128932 3065405 2987347
56227 2987347 2895694 2793274 2683879 2569355 2450533 2329998 2211076 2095007 1981867 1873131
56217 1873131 1770518 1673444 1580509 1492440 1410802 1335155 1264329 1199090 1140507 1087063 1036539
56206 1036539 989415 947240 909114 873105 839791 810918 785848 762742 741955 724720 709811
56195 709811 695188 681676 671260 662967 654313 645672 639204 634465 629139 623312 618995 616080 612786
56182 612786 609404 607713 607227 605874 603803 602775 602438 601001 598882 597921 597764 596855 596097 597543 600358 602199
56166 602199 603681 607266 612555 617084 621079 626951 634710 642347 650234 660617 673215 685873 699141
56153 699141 715670 735398 755933 777426 802479 831555 863089 897893 938753 985802 1036884
56142 1036884 1092313 1154560 1223348 1295701 1370743 1449832 1532050 1614098 1694222 1771579 1842373
56131 1842373 1901945 1950627 1992669 2029821 2061075 2087866 2113331 2136240 2151530 2157236 2155440 2146391
56119 2146391 2127727 2100068 2067302 2030351 1986079 1933045 1872816 1805240 1728519 1644982 1561021
56108 1561021 1480276 1402234 1328116 1262053 1205426 1155871 1112904 1078676 1052216 1029042 1007792
56097 1007792 991419 980647 972168 964493 959593 957502 955319 952883 953417 957219 960690 962856 966756 973235
56083 973235 979590 985512 993922 1004729 1014286 1022237 1032236 1044714 1056019 1065979 1078912 1095459 1110891
56070 1110891 1123467 1137014 1153168 1168587 1182166 1197442 1215362 1232112 1246643 1262848 1281705
56059 1281705 1298835 1312535 1326585 1342408 1356217 1366794 1378272 1392260 1405016 1415402 1427656
56048 1427656 1443274 1458277 1471584 1487737 1508107 1527927 1545457 1565450 1590048 1615055 1638943
56037 1638943 1666593 1700175 1735303 1770172 1809349 1854342 1899699 1942717 1987625 2035970 2082589
56026 2082589 2125474 2169641 2216679 2260846 2300402 2342262 2390269 2439549 2487645 2540040 2599036
56015 2599036 2658532 2715904 2777629 2847066 2918409 2989043 3065629 3151185 3238666 3324521 3415812
56004 3415812 3516437 3619516 3721460 3830142 3950669 4076612 4204052 4340320 4489735
55995 4489735 4645073 4802698 4971405 5156443 5350062 5548186 5760609 5993943 6240985
55986 6240985 6498239 6776661 7083078 7409196 7751850 8125189 8539179 8985963 9462241
55977 9462241 9984337 10565324 11199246 11885345 12645376 13498894 14445783 15493591 16677603
55968 16677603 18033497 19578335 21343624 23401111 25833981 28716251 32148888 36280418
55960 36280418 41257326 47187925 54189928 62436947 72122395 83417550 96491150 111494007
55952 111494007 128457969 147274423 167847313 190204136 214387429 240326835 267836361
55945 267836361 296344868 324057436 347308715 361376559 362727567 350920084 328547328
55938 328547328 299568434 267674203 235641113 205332689 177782196 153329068 131919378
55931 131919378 113384123 97506629 83997985 72549051 62897005 54801288 48003048
55924 48003048 42262699 37407095 33300806 29803486 26791892 24191975 21950753 19998914
55916 19998914 18270383 16733326 15370894 14151715 13045746 12048180 11160380 10364018
55908 10364018 9637164 8978319 8391396 7862639 7374160 6925618 6521936 6153426 5807746
55899 5807746 5488416 5202464 4941764 4694531 4463653 4256176 4065648 3881966 3708543
55890 3708543 3553291 3411894 3275705 3147352 3033386 2929575 2828028 2731265 2645472 2566994
55880 2566994 2488486 2411376 2339895 2269954 2196173 2123043 2057241 1995535 1931725 1868743 1812278
55869 1812278 1758960 1702468 1645407 1593890 1546032 1496920 1449488 1409395 1373985 1337024 1299847
55858 1299847 1267574 1238680 1208393 1178370 1153283 1131563 1108736 1086185 1067580 1050315 1029290
55847 1029290 1005757 984025 962935 938826 913421 890598 868744 844294 819553 799161 781937
55836 781937 763817 745626 730569 717224 702449 688109 677707 669351 659060 647889 638953 630744
55824 630744 620390 610117 603355 597678 588774 578215 570072 562973 553019 541745 533669 528377 522300
55811 522300 516007 512549 510694 506989 502662 501640 503539 505204 507262 512455 519336 524278 528042 533808
55797 533808 540327 543535 543437 542975 541549 536136 527535 519203 511045 500453 488321 477917 468949 458801
55783 458801 448547 441570 437086 431031 422696 414722 407238 397897 387304 378811 373134 368217 363965 362064
55769 362064 361719 360472 358640 358257 358541 357122 354618 353117 351421 346908 340855 336612 333665 328894 322593
55754 322593 317673 313937 308923 303622 301409 301642 300198 296240 292765 290425 286544 280626 275325 271360
55740 271360 266654 261110 257237 255362 252976 249439 246704 244893 241828 237504 234473 233152 231152 227810
55726 227810 224998 222910 219449 214472 210367 207771 204850 201392 199372 198777 197075 193649 190828 189732
55712 189732 188960 188036 188256 189439 189632 188718 188588 189242 188553 186457 185418 186088 186375 185503 185046 185110 183477 179651
55694 179651 176092 174324 173277 172425 172955 174763 175695 174949 174087 173815 172904 171141 170112 170249 170198 169851 170773
55677 170773 172930 174280 174340 174908 176513 177436 177014 176539 176100 173914 169828 166190 164226 162758 161409 161727
55661 161727 164030 166363 167852 170038 173719 177494 180548 183909 187793 190671 192166 193971 196742 198834
55647 198834 199246 199030 198724 197163 193873 189922 185525 179676 173011 167914 164758 161256 156706 153624 153586
55632 153586 154545 154049 152450 151170 150366 149962 150692 152461 153796 154163 154713 155709 155696 154305 153285 153493 153410
55615 153410 151942 150164 148924 147255 144639 142447 141545 140764 139191 137768 137224 136660 135600 135259 136310
55600 136310 137479 137753 137859 138278 137913 136118 133959 132138 129788 126636 124210 123413 122846 121027 118454 116236
55584 116236 114516 113405 113632 115122 116753 118413 121308 125441 129067 131568 134491 138699 143021 146894
55570 146894 151746 158291 164934 170389 175386 180217 183141 183117 181778 180712 178947 175111 170102 165508 161179
55555 161179 156395 151787 148199 145021 141407 137778 134670 131536 128013 124827 122216 119265 116015 114280
55541 114280 114917 116227 116544 116346 116325 115512 113223 110861 109793 109165 107734 106157 105521 105259 104436 103584 103386
55524 103386 103015 101631 100055 99203 98375 96843 95523 95233 94878 93324 91498 90693 90268 89139 88074 88283
55508 88283 88972 88555 87307 86694 86897 86987 86827 86960 87320 87661 88474 90000 91181 91023 90073 89252 88374 87204
55490 87204 86696 87616 89118 90221 91467 93604 95930 97627 99406 102044 104562 105705 106108 107062 108216
55475 108216 108423 107903 107685 107734 107368 106731 106171 105048 102791 100238 98320 96387 93535 90569 88885 88309
55459 88309 87794 87371 87606 88000 87736 87279 87529 88137 88282 88291 88796 89136 88391 87241 87048 87803 88604 89432 90710
55440 90710 91858 92009 91506 91106 90461 89026 87638 87409 87782 87480 86688 86543 87103 87604 88095 89040 89876 89696
55422 89696 88879 88412 88159 87428 86627 86660 87295 87745 88251 89430 90723 91176 91136 91475 91863 91561 91199 91834 92839
55403 92839 92693 91418 90309 89742 89138 88691 89129 90061 90440 90384 90730 91123 90459 89005 88159 88204 88124 87529 86983
55384 86983 86467 85351 83935 83357 83790 84225 84111 83862 83834 84118 85175 87278 89493 90605 90784 91017 91287
55367 91287 90822 89817 89267 89353 89507 89806 90688 91548 91214 89721 88128 86882 85804 85318 85998 87136 87424
55350 87424 86867 86462 86326 85863 85475 86204 87730 88547 88196 87628 87341 86846 86073 85708 85950 86373 87002 88087
55332 88087 88938 88564 87380 86727 86785 86569 85873 85492 85488 84906 83385 81602 80084 79003 78986 80497 82542 83646
55314 83646 84003 84940 86427 87051 86499 86062 86407 86670 86172 85366 84708 84126 83836 84175 84559 84140 83544 84165 85721
55295 85721 86413 85706 84964 85016 85108 84796 84879 85736 86517 86768 87185 88036 88401 87815 87182 87301 87805 88303 89185 90579
55275 90579 91739 92164 92260 92383 92423 92643 93641 95008 95358 94134 92197 90334 88577 87265 87170 88100 88818 88862
55257 88862 88992 89444 89378 88612 88211 88654 88950 88383 87614 87291 87019 86512 86336 86580 86249 84929 83747 83679 84144
55238 84144 84302 84590 85904 88105 90304 91818 92264 91589 90631 90606 91499 91994 91461 90746 90454 89892 88506 86980
55220 86980 85967 84980 83560 82413 82264 82597 82572 82344 82487 82919 83288 83699 84249 84565 84515 84635 85230 85855 86248
55201 86248 86876 88027 89235 90156 91000 91630 91348 90235 89500 89809 90364 90372 90295 90840 91759 92510 93049 93194 92334
55182 92334 90601 89243 88960 88946 88450 88085 88567 89333 89587 89677 90236 90871 90978 91019 91717 92725 93305 93701 94614
55163 94614 95853 96652 96847 96716 96153 95015 93819 93172 92941 92835 93222 94442 95878 96697 97033 97443 97658
55146 97658 96884 95106 93198 91974 91759 92539 93848 94870 95332 95895 97076 98260 98423 97371 95669 93904
55130 93904 92620 92425 93354 94526 95022 94727 93918 92668 91209 90263 90321 91074 91973 92762 93109 92592 91587 91280
55112 91280 92094 92963 92863 92181 91775 91578 91116 90699 91003 92004 93196 94426 95748 97000 98184 99684 101442
55095 101442 102619 102773 102625 102908 103276 103185 103018 103347 103836 103918 103885 104300 104930 105250 105431 105830 106106 105879 105693
55076 105693 106286 107410 108348 109026 109636 109787 109161 108439 108415 108702 108480 107997 108109 108723 108988 108671 108119 107228 105737
55057 105737 104290 103802 103891 103301 101921 101013 101340 102331 103361 104538 105743 106034 104777 102696 101169 100816
55041 100816 101167 101380 100972 100024 98900 97786 96663 95723 95404 95736 96133 96230 96450 97217 98103 98385 98085 97789
55023 97789 97738 97739 97709 97689 97632 97687 98351 99739 101094 101707 101954 102708 103996 104981 105164 104904 104784 104985 105272 105230 104594
55002 104594 103584 102704 102108 101620 101451 102196 103803 105357 106314 107160 108369 109577 110395 111107 111814 111760 110529
54985 110529 109131 108847 109600 110427 110957 111410 111672 111543 111481 112105 113219 114190 114855 115234 114883 113535 111951 111197
54967 111197 111466 112418 114050 116192 117819 118057 117430 116976 116629 115723 114597 114248 114640 114768 114345 114071 114231
54950 114231 114254 113798 113138 112400 111384 110274 109637 109648 110097 111008 112434 113818 114501 114704 115129 115831 116420 117086
54932 117086 118371 120212 122286 124986 128849 133213 136822 139677 143014 147339 151866 156041 160404 165602
54918 165602 171584 178029 184543 190207 193907 195364 195004 192846 188535 182521 176079 169935 163967 158373
54904 158373 153960 150900 148272 145310 142216 139427 136980 134937 133536 132522 131194 129489 128295 128324 129445
54889 129445 131352 134022 137145 139913 141900 143600 145735 148549 151958 155795 159726 163558 167754 172975
54875 172975 178976 184669 189348 193110 195904 197085 196252 193793 190233 185640 180044 173875 167587 161306
54861 161306 155107 149292 144216 140074 136893 134450 132334 130392 128874 127683 125979 123183 120001 117689
54847 117689 116599 116266 116424 116907 116949 115861 114316 113744 114402 115128 114991 114069 112593 110622 108752 107890 107980
54830 107980 107992 107496 107191 107567 108143 108393 108491 108684 108835 108949 109359 110107 110886 111696 112696 113423 113253 112757 113310
54811 113310 115023 116320 116056 114926 114201 114168 114441 114877 115454 116015 116657 117644 118567 118493 117398 116516 116736 117556
54793 117556 118192 118806 119954 121579 123205 124503 125144 124819 123896 123395 123818 124639 125368 126293 127733 129317 130605
54776 130605 131749 133059 134559 136402 139083 142824 147352 152531 158479 164843 170834 176328 182036 188249
54762 188249 194325 199729 204549 208514 210618 210288 208009 204261 198904 192170 185181 178798 172930 167572
54748 167572 163343 160180 156727 152073 147199 143639 141554 140116 138914 137883 136639 135098 134159 134670 136176
54733 136176 137641 138886 140354 142057 143763 145722 148214 150837 153240 156103 160385 165970 171946 177794
54719 177794 183301 187723 190189 190736 190018 188199 185059 180944 176640 172381 167830 162950 158151 153644 149376
54704 149376 145500 142277 139622 137290 135318 133777 132397 130995 129909 129397 128994 128164 127138 126404 125746
54689 125746 124663 123397 122636 122371 121937 121130 120486 120475 121021 121768 122227 121831 120425 118653 117329 116629 116333
54672 116333 116485 117164 117898 118051 117647 117169 116759 116217 115542 114785 113660 112022 110555 110206 111022 112164 112987
54655 112987 113446 113554 113166 112389 111664 111319 111367 111665 112010 112242 112533 113231 114125 114360 113561 112556 112416 113235 114426
54636 114426 115665 116809 117476 117565 117768 118602 119293 118674 116940 115472 115012 115064 115076 115139 115370 115562 115741 116234 116913
54617 116913 117123 116703 116407 116940 118095 119170 119736 119701 119085 118142 117474 117638 118647 119951 120865 121080 120852 120643
54599 120643 120558 120324 119909 119721 119975 120239 120001 119321 118561 117850 117253 117131 117793 119027 120382 121647 122665 123101
54581 123101 122895 122603 122738 123065 122994 122336 121259 119943 118849 118736 119749 120958 121564 122060 123352 125235 126730
54564 126730 127603 128409 129179 129233 128347 127147 126148 125235 124309 123690 123644 124040 124591 125001 124959 124578 124634 125696 127148
54545 127148 127868 127739 127671 128263 129313 130621 132193 133514 133636 132399 130811 129838 129487 129315 129086 128595 127549
54528 127549 126094 124884 124237 123785 123266 123070 123502 124118 124386 124648 125702 127585 129390 130330 130580 130837 131342
54511 131342 131628 131225 130360 129698 129534 129541 129358 128991 128501 127755 126802 126067 125738 125361 124541 123720 123666 124376 125049 125021
54491 125021 124306 123344 122720 122937 123966 125082 125547 125406 125292 125727 126923 128876 131156 132913 133686 133985 134531
54474 134531 135300 135868 136336 137138 138201 139070 139715 140509 141503 142414 143228 144122 144902 145192 145143 145299 145862 146579 147265
54455 147265 147776 147723 146849 145629 144797 144468 144271 144143 144226 144225 143632 142512 141354 140372 139592 139318 139678 139920 139102
54436 139102 137352 135693 134823 134873 135947 137845 139543 140098 139950 140146 140576 140307 139539 139660 141127 142778 143663
54419 143663 144164 144772 145089 144751 144253 144069 143852 143208 142464 142010 141647 141140 140748 140693 140801 141095 142005 143530 144981
54400 144981 145981 146936 148083 148959 149352 149861 150798 151395 150878 149733 149041 149080 149309 149317 149087 148625 147954 147289 146867
54381 146867 146827 147351 148431 149362 149232 148244 147790 148810 150756 152620 154173 155619 156826 157600 158225 159092 160284
54364 160284 161964 164523 167760 170623 172438 173809 175582 177510 178740 179024 178612 177381 175117 172449 170488
54349 170488 169503 168625 166983 164617 162230 160423 159210 157984 156063 153479 151021 149314 148172 147121 146202
54334 146202 145815 146031 146430 146505 146028 145264 144929 145623 147143 148676 149740 150408 150582 149785 148049 146358 145686
54317 145686 146001 146521 146523 145659 144050 142414 141547 141374 141087 140470 140336 141132 141941 141528 139815 137687 135888 134725
54299 134725 134348 134616 135035 135377 135953 136896 137755 138327 139245 141015 143052 144451 145237 146057 147071 147929 148544
54282 148544 149082 149433 149420 149321 149523 149862 149892 149560 149086 148504 147938 147934 148841 150094 150867 151197 151861 153291 155207
54263 155207 157106 158600 159505 160098 160940 161949 162154 161043 159685 159665 161225 163235 164681 165384 165534 165404
54247 165404 165432 165764 165855 165182 164075 163099 162018 160378 158789 158396 159106 159545 158987 158202 158059 158359 158532 158531 158410
54228 158410 157753 156250 154335 152660 151300 150001 148892 148416 148721 149525 150441 151105 151183 150638 149926 149648 149977
54211 149977 150626 151335 152145 153131 154098 154770 155205 155716 156279 156386 155766 154995 154936 155715 156721 157442 157697 157209 155780
54192 155780 154061 153201 153426 153737 153413 152960 153044 153371 153421 153519 154322 155737 157237 158735 160337 161677 162440 163100
54174 163100 164237 165461 166009 165997 166027 165866 164742 162824 161103 159720 157703 154672 151728 150115 149892 150325
54158 150325 150812 150964 150534 149808 149530 149960 150466 150379 149806 149264 149015 149111 149670 150685 151851 152888 153764 154385
54140 154385 154390 153504 151875 149891 147942 146505 146110 146928 148514 150095 151070 151306 151214 151513 152637 154296 155779
54123 155779 156600 156669 156070 155078 154283 154220 154872 155914 157355 159475 162156 164739 166648 167819 168531 169162 170172
54106 170172 171863 174018 175971 177153 177485 177348 177305 177658 178098 178045 177512 177207 177444 177516 176676 175295 174359 174194
54088 174194 174403 174814 175631 176765 177785 178453 178665 178017 176261 174136 172887 172940 173723 174735 175945 177138
54072 177138 177846 178124 178586 179461 180367 181167 182174 183248 183610 182969 182078 181710 181787 181959 182330 183031 183608 183491
54054 183491 182722 181805 181100 180736 180768 181122 181713 182897 185385 189404 194212 198762 202589 205925 209336 213368
54038 213368 218168 223245 228024 232663 237819 243542 249090 254046 258866 263870 268379 271487 273209 274282
54024 274282 275163 275861 276526 277576 279168 280860 281861 281518 279770 277275 274884 272846 270681 267868 264298
54009 264298 259993 254874 249121 243430 238562 234767 231817 229341 226946 224279 221252 218153 215422 213392
53995 213392 212162 211457 210690 209487 208137 207201 206724 206178 205133 203528 201456 199192 197409 196685 196794 197043
53979 197043 197283 197896 198788 199287 199293 199677 201160 203508 206222 209262 212581 215627 218012 220206 222968 226483
53963 226483 230568 235249 240414 245121 248003 248476 247191 245324 243622 242064 240178 237686 234879 232340
53949 232340 230500 229716 230376 232309 234327 235285 235652 237104 240337 244298 247958 251772 256577 261953 266648
53934 266648 270151 272930 275426 277685 279778 281897 284112 286558 289637 293490 297485 300833 303563 306385
53920 306385 309765 313630 317819 322319 327133 332329 338108 344465 350919 356953 362479 367544 371798 374707
53906 374707 376213 376817 377066 377128 376656 375000 371943 368353 365557 363775 361792 358535 354305 349930 345489
53891 345489 340649 335601 330627 325186 318538 311096 304112 298058 292319 286499 281001 276084 271325 266481
53877 266481 262113 258754 255966 252714 248465 243544 238720 234719 231925 230210 229053 227944 226607 224963
53863 224963 223082 221175 219342 217359 214952 212297 209952 208346 207626 207886 209090 210638 211405 210532 208091
53848 208091 204941 202092 200215 199434 199361 199344 198832 197688 196378 195848 196815 198923 200847 201569 201329 201048 201145
53831 201145 201442 202009 203284 205180 206717 207008 206325 205773 206030 206772 207356 207778 208681 210463 212596 214047 214344
53814 214344 214067 214256 215492 217574 219877 221929 223829 226225 229744 234378 239551 244747 249765 254400 258383
53799 258383 261859 265470 269570 273668 277087 279925 282928 286461 290062 293071 295360 297266 299006 300372
53785 300372 301114 301487 302067 302801 302585 300320 296241 291604 287093 282230 276542 270521 265065 260541 256862
53770 256862 253882 251257 248431 245330 242580 240446 238081 234583 230449 227104 225137 223738 221827 219094
53756 219094 216005 213426 212228 212612 213664 214014 213048 211178 209100 207331 206351 206525 207616 208801 209387 209315
53740 209315 208984 208830 209045 209422 209538 209323 209256 209674 210132 209914 209036 208232 208024 208338 208998 210077 211665 213726
53722 213726 216251 219136 221877 223820 224880 225705 227027 229065 231504 233768 235343 236182 236789 237588 238341
53707 238341 238525 238207 238084 238659 239868 241532 243698 246364 249233 252041 254966 258576 263383 269355 275705
53692 275705 281355 285797 289357 292397 294575 295300 294593 293027 291003 288691 286554 285243 284874 284954 285134 285552
53676 285552 286310 287091 287489 287318 286445 284764 282574 280690 279838 280044 280742 281375 281779 282114 282465 282549 281966 280815
53658 280815 279769 279341 279379 279608 280302 281850 283852 285263 285462 284716 283566 282268 280972 279973 279544 279753 280519
53641 280519 281693 283114 284726 286559 288411 289845 290795 291949 294077 297171 300649 304163 307674 311006
53627 311006 314005 317053 320716 324793 328332 330686 332110 333310 334933 337483 341077 345114 348709 351649
53613 351649 354507 357690 360904 363685 366048 368399 371179 374680 378848 383130 386914 390163 393284 396329
53599 396329 398769 400189 400790 401123 401615 402418 403324 403822 403599 402976 402467 401931 400627 398186 395146 392440 390639
53582 390639 389591 388498 386527 383740 381196 379714 378813 377404 375231 372904 370884 369214 367938 366830
53568 366830 364990 361921 358900 358006 359542 361658 362752 362975 362986 362654 361826 361151 361127 361210 360849 360655 361491 362956
53550 362956 363861 363848 363601 363721 364248 365150 366497 368233 370321 372974 376234 379603 382594 385450 388812 392982
53534 392982 398039 404259 411626 419155 425579 430766 435924 442340 450443 460067 471006 483035 495756
53521 495756 508709 521580 534342 547274 560693 574569 588599 602856 618063 634960 653612
53510 653612 673603 694650 716622 739191 761874 784404 806796 829085 851165 872776 893550
53499 893550 913272 932232 951003 969716 987828 1004824 1020877 1036592 1052379 1068305 1084317
53488 1084317 1100388 1116609 1133209 1150162 1166754 1182022 1195789 1208871 1222130 1235880 1250238
53477 1250238 1265332 1280707 1295143 1307515 1317380 1324511 1328586 1329872 1329512 1328427 1326363 1322560 1316748
53464 1316748 1308903 1298740 1286359 1272950 1259908 1247553 1235481 1223735 1212569 1201341 1188795
53453 1188795 1174568 1159496 1144282 1128703 1112353 1095404 1078346 1061544 1045281 1029757 1014901
53442 1014901 1000643 987442 976038 966581 958561 951706 946378 942806 940428 938323 936059 933939 932690
53429 932690 933035 935301 939252 944440 950664 957886 965847 974165 982834 992304 1003065 1015421 1029593 1045674
53415 1045674 1063488 1082763 1103397 1125246 1147811 1170643 1194052 1218942 1245872 1274593 1304533
53404 1304533 1335314 1366780 1398984 1432347 1467530 1504964 1544636 1586337 1629865 1674998 1721515
53393 1721515 1769289 1818118 1867520 1916908 1965960 2014573 2062601 2109903 2156494 2202278 2246662
53382 2246662 2288853 2328491 2365674 2400430 2432536 2461760 2487834 2510180 2528140 2541601 2551062
53371 2551062 2556967 2559257 2557582 2551646 2541202 2525954 2505627 2480114 2449707 2415337 2378342 2339665
53359 2339665 2299408 2257466 2214368 2171044 2127967 2085042 2042323 2000288 1959359 1919689 1881573
53348 1881573 1845573 1811918 1779970 1748564 1716836 1684778 1653048 1622186 1591943 1561652 1531357
53337 1531357 1502181 1475245 1450652 1427967 1407214 1388592 1371561 1355175 1339365 1325064 1312778
53326 1312778 1301715 1290538 1278419 1265115 1250640 1235282 1219612 1204132 1189119 1174879 1161829
53315 1161829 1150126 1139538 1129783 1120779 1112586 1105442 1099868 1096330 1094779 1094813 1096137 1098468 1101248 1104221
53301 1104221 1108198 1114453 1123291 1133958 1145927 1159361 1174087 1189229 1204439 1220634 1238820 1258824
53289 1258824 1279869 1301672 1324171 1346655 1368069 1387901 1406045 1422080 1435569 1446922 1457110
53278 1457110 1466435 1474175 1479447 1481795 1480953 1476832 1469977 1461442 1451833 1440812 1427800 1412780 1396153
53265 1396153 1378147 1358773 1338213 1316902 1295208 1273245 1250998 1228441 1205548 1182248 1158455
53254 1158455 1134105 1109264 1084320 1060062 1037299 1016205 996090 976035 955707 935379 915210
53243 915210 894962 874585 854621 835631 817509 799883 783014 767662 754033 741346 728596
53232 728596 715333 701693 688256 676048 666063 658314 651692 645047 638051 630743 622786 613746 603764
53219 603764 593283 582227 570069 556662 542447 527833 512958 498256 484631 472674 462028
53208 462028 451980 442404 433714 425968 418577 411010 403349 395905 388611 381207 373777 366613 359533 351925
53194 351925 343663 335559 328523 322562 316994 311424 306019 300922 295918 290796 285697 280994 277059 274134
53180 274134 272161 270639 268945 266858 264641 262676 261212 260334 259804 258989 257455 255641 254529 254494 254903 254997
53164 254997 254680 254283 254004 253879 253939 253982 253535 252435 251229 250561 250349 249958 249095 248126 247481 247167 246960 246741 246443
53145 246443 245862 244797 243329 241800 240476 239427 238826 239148 240737 243158 245334 246576 247176 247803 248594 249239
53129 249239 249702 250379 251547 253126 254962 256982 259069 261192 263596 266405 269080 270821 271602 272224 273182
53114 273182 274128 274703 275257 276197 277087 277061 275955 274505 273428 272670 271581 269576 266649 263387 260440 257954
53098 257954 255630 253350 251422 250149 249446 249018 248578 247806 246493 244935 243757 243058 242128 240366 238103 236121
53082 236121 234742 233890 233686 234279 235179 235478 234898 234160 234124 234866 235760 236165 235865 235034 234011 233052 232148 231074
53064 231074 229664 228073 226824 226506 227261 228513 229366 229392 228939 228660 228831 229145 229029 228191 227016 226354 226688
53047 226688 227569 228175 228291 228280 228156 227378 225798 224170 223300 223122 223054 222866 222687 222488 222175 222031 222542 223754
53029 223754 225138 226112 226469 226442 226549 227248 228444 229494 229911 229871 229821 229919 230168 230723 231590 232257 232165 231404 230480
53010 230480 229516 228262 226794 225634 225070 224877 224842 225111 225813 226722 227541 228266 229045 229782 230133 229844 229086 228464
52992 228464 228651 229874 231757 233721 235462 237017 238535 240132 241802 243354 244610 245768 247260 249111
52978 249111 250821 252173 253721 255941 258190 259150 258276 256295 254304 252889 252158 252051 252362 252783 253213 253861
52962 253861 254911 256193 257254 257638 257159 256033 254692 253413 252236 251271 250691 250231 249173 247285 245380
52947 245380 244397 244174 243769 242794 241740 241071 240738 240628 240780 240967 240729 240088 239636 239698 239935 239958 239787 239458 238797
52928 238797 237935 237525 237941 238739 239307 239680 240256 241100 242008 242888 243577 243651 242998 242332 242440 243053 243144 242312 241269
52909 241269 240806 240878 240936 240659 240043 239112 237934 236750 235809 235201 235042 235641 237186 239238 240849 241352 241049 240939
52891 240939 241738 243177 244380 244853 244887 244917 244810 244118 242932 242055 242239 243560 245634 248065 250389 251959 252444
52874 252444 252437 253127 255153 258070 261077 263959 267070 270570 274069 277014 279130 280475 281223 281505 281346 280749
52858 280749 279824 278736 277388 275384 272546 269348 266443 263799 260710 256737 252263 247951 244096 240746
52844 240746 238086 236276 235064 233934 232566 230935 229180 227662 226979 227433 228513 229281 229347 229158 229291 229788
52828 229788 230311 230651 230882 231117 231262 230977 229857 227823 225414 223559 222921 223414 224333 224915 224874 224537 224510 225147
52810 225147 226279 227437 228220 228400 227875 226705 225166 223558 221924 220110 218146 216425 215410 215145 215125 214728
52794 214728 213836 212967 212690 213014 213544 214144 215082 216383 217397 217304 215898 213745 211765 210844 211531 213662 216253
52777 216253 218123 218722 218279 217216 215661 213596 211282 209343 208308 208044 207865 207368 207014 207555 208949 210382
52761 210382 211423 212547 214185 215807 216527 216330 216091 216463 217234 217798 217919 217943 218478 219827 221635 223233 224458
52744 224458 225831 227694 229532 230571 230731 230534 230346 230257 230524 231476 232968 234413 235365 235682 235201 233875 232282
52727 232282 231404 231638 232402 232856 232742 232342 231985 231747 231494 231074 230543 230122 229819 229338 228590 228029 228099 228579 228900
52708 228900 228869 228558 227728 226127 224292 223281 223480 224256 224906 225285 225382 224963 224011 223026 222555 222744 223553 224967
52690 224967 226777 228552 230029 231243 232181 232711 232977 233369 233990 234588 235139 235906 236757 237061 236582 235944 235855 236328
52672 236328 237021 237808 238594 239035 238923 238526 238116 237531 236637 235850 235738 236395 237670 239704 242656 246024 248768
52655 248768 250250 250781 251294 252569 254611 256621 257733 257876 257621 257215 256294 254760 253314 252651 252550 252217
52639 252217 251184 249491 247418 245563 244775 245313 246299 246596 246131 245872 246635 248425 250756 253065 254921 256316
52623 256316 257704 259361 260851 261577 261646 261573 261319 260314 258475 256521 255145 254438 254303 254822 255888 256936
52607 256936 257447 257539 257808 258722 260266 261960 263131 263372 262870 262185 261753 261750 262263 263184 263992 264114 263623 263177 263142
52588 263142 263228 263142 263177 263776 264875 266077 267251 268548 269915 271061 271947 272966 274445 276145 277410 277728
52572 277728 277011 275491 273549 271715 270595 270474 270981 271286 270731 269254 267187 264890 262691 260980 260047 259802
52556 259802 259846 259862 259835 259851 259864 259783 259687 259774 260078 260410 260674 261141 262098 263284 263989 263911 263638 263956 264907 265892 266553
52535 266553 267050 267486 267650 267555 267743 268695 270253 271925 273505 275081 276573 277640 278018 277765 277225 276869 277017
52518 277017 277574 278105 278317 278364 278704 279814 281986 285063 288333 291085 293425 296086 299224 301886 303036 302714
52502 302714 301718 300481 298819 296603 294070 291469 288843 286195 283566 280949 278458 276522 275596 275631 276068
52487 276068 276345 276198 275573 274573 273495 272656 272165 272064 272588 273914 275607 276674 276463 275410 274717 275181 276444
52470 276444 277517 278031 278717 280431 283054 285800 288353 291019 293776 296051 297681 299245 300913 301721 300733
52455 300733 298374 295749 293067 289679 285554 281740 279195 277839 276927 275825 274279 272418 270652 269249
52441 269249 268010 266659 265384 264516 263833 262821 261597 260952 261344 262404 263532 264467 265182 265737 266391 267365
52425 267365 268377 268965 269330 270251 271937 273645 274822 275983 277933 280555 283015 284939 286832 289327 292497
52410 292497 295970 299464 303040 306930 311213 315774 320666 326270 332756 339437 345002 348397 349166 347092
52396 347092 342239 335573 328862 323393 319065 315158 311623 309127 308057 308072 308613 309334 309942 310059 309533 308692
52380 308692 308096 308187 309268 311569 315006 318890 322247 324669 326726 329335 332863 337036 341556 346327 351040
52365 351040 355075 358066 360140 361360 361369 360088 358385 357430 357536 358131 358697 359177 359518 359526 359307 359367 360069 361352
52347 361352 363044 365065 367301 369684 372450 375911 379952 384252 388981 394666 401261 408035 414641 421742
52333 421742 430183 440067 450994 462775 475358 488433 501695 515418 530377 547207 566039 586604
52321 586604 608435 631040 654067 677232 700010 721657 741784 760783 779579 799028 819490
52310 819490 840679 861821 882180 901515 919884 937198 953439 969189 985256 1001565 1017005
52299 1017005 1030662 1042564 1052883 1061074 1066431 1068998 1069293 1067474 1063446 1057517 1050220 1041670 1031790
52286 1031790 1021141 1010828 1001463 992824 984675 977345 971290 966617 963379 961908 962447 964729 968359 973448
52272 973448 980391 989075 998824 1009270 1020881 1034271 1049253 1064963 1080814 1096856 1113148 1129312
52260 1129312 1145003 1160478 1176243 1192342 1208342 1223804 1238279 1250997 1261226 1269098 1275665 1281845
52248 1281845 1287501 1291546 1292685 1290117 1283990 1275337 1265243 1253935 1240947 1226141 1210191 1194016
52236 1194016 1178208 1163048 1148513 1134090 1119143 1103817 1089132 1075901 1063991 1052890 1042505
52225 1042505 1032988 1024279 1016370 1009678 1004595 1000881 997908 995326 993136 991374 990216 990142 991441 993681
52211 993681 996127 998688 1001970 1006435 1011878 1017768 1023706 1029459 1034891 1040077 1045338 1050989 1057002 1062905
52197 1062905 1068115 1072573 1076968 1082082 1087930 1093861 1099537 1105225 1110948 1115883 1119077 1120381 1120197 1118571
52183 1118571 1115066 1109510 1102416 1094589 1086597 1078599 1070537 1062434 1054524 1047028 1039945 1033395 1028027 1024551
52169 1024551 1022738 1021445 1019877 1018374 1017684 1018013 1019089 1020629 1022344 1024034 1026098 1029366 1033877 1038360
52155 1038360 1041511 1043272 1044295 1044717 1044304 1043313 1042367 1041732 1041509 1042114 1043687 1045389 1046316 1046979 1048878 1052666
52139 1052666 1057683 1063183 1068957 1074736 1080131 1085524 1092064 1100404 1110256 1121474 1134679 1150441 1168627
52126 1168627 1188984 1211569 1236096 1261627 1287507 1314030 1341623 1369952 1398405 1426907 1455521
52115 1455521 1483575 1509880 1533703 1555124 1574627 1592630 1609197 1623846 1635890 1645234 1652482 1658126
52103 1658126 1662097 1664456 1665891 1666949 1667168 1665591 1661866 1656205 1648569 1638575 1626136 1611560 1595006
52090 1595006 1576451 1556266 1535346 1514526 1494248 1474898 1456974 1440711 1425880 1412344 1400628
52079 1400628 1391636 1385808 1382763 1381807 1382626 1385378 1390254 1397162 1405876 1416239 1428117 1441368 1456027
52066 1456027 1472232 1489676 1507398 1524626 1541685 1559441 1577807 1595460 1611254 1625309 1638314
52055 1638314 1650246 1660284 1667683 1672228 1674012 1673231 1670101 1664562 1656120 1644340 1629516 1612453 1593564
52042 1593564 1572469 1548748 1522917 1496409 1470511 1445458 1420763 1396353 1372986 1351307 1330988
52031 1330988 1311364 1292718 1276184 1262282 1250188 1238639 1226887 1214590 1201552 1188160 1175512
52020 1175512 1164371 1154285 1144266 1134014 1123883 1113956 1103930 1093836 1084108 1074800 1065308 1054994
52008 1054994 1043694 1031458 1018217 1003842 988273 971542 953948 936169 918774 901605 884103
51997 884103 866363 849429 834249 820691 807866 795151 782542 770107 757507 744240 730215
51986 730215 715859 701627 687487 673054 658188 643242 628678 614662 601189 588354 576273
51975 576273 564974 554611 545597 538236 532385 527852 524908 523975 524894 527013 529974 533949 539007 544701
51961 544701 550385 555538 559599 561963 562367 560994 558027 553493 547770 541900 537017 533663 531841 531492 532643
51946 532643 535373 540005 547092 556896 569113 583430 600126 619584 641346 664211 687281 710408
51934 710408 733546 756132 777299 796141 811424 821365 824169 818829 805372 784723 758660 729566
51922 729566 699603 669926 640862 612772 586463 562777 542093 524320 509159 496296 485517
51911 485517 476699 469554 463538 458303 454273 452372 452996 455423 458381 460954 462861 464180 465085 465643 465559
51896 465559 464194 461027 456014 449385 441375 432411 423326 414954 407600 401239 396085 392504 390386 389138
51882 389138 388428 388559 389966 392724 396755 402088 408570 415625 422635 429411 435917 441721 446133 448917 450522
51867 450522 451540 452130 452040 450997 449054 446744 444921 444170 444240 444264 443768 443324 443895 445562 447244 447812 447210
51850 447210 446228 445388 444408 442668 439734 435308 429144 421390 412896 404836 398053 392785 388787 385487 382309
51835 382309 379182 376607 374937 373807 372727 372040 372634 374565 376554 377212 376420 375178 374344 373859 373131 371789
51819 371789 369969 368002 366032 364078 362449 361786 362440 363901 365193 365804 365995 366242 366737 367431 368227 369027
51803 369027 369833 370820 371990 372802 372636 371722 371190 371910 373595 375195 375863 375403 374105 372401 370449 367989
51787 367989 364899 361864 359929 359292 359155 359020 359387 360714 362422 363691 364758 366561 369394 372752 376392
51772 376392 380680 385779 391242 396596 401847 407214 412789 418555 424253 429143 432348 433641 433501 432309
51758 432309 429892 426037 421002 415256 409014 402292 395202 387962 380812 374111 368317 363687 360104 357281
51744 357281 354989 353070 351482 350429 350245 351077 352880 355741 359824 364867 370049 374637 378610 382450 386487
51729 386487 390645 394587 397857 399994 400856 400884 400932 401790 403806 406692 409552 411271 411234 409723 407490 405027
51713 405027 402395 399701 397396 395879 394974 394058 392766 391353 390281 389643 389303 389535 391045 394092 397827
51698 397827 400869 402446 402690 401960 400337 397907 395073 392353 390042 388259 387044 386151 384919 382723 379566
51683 379566 376043 372708 369691 366881 364199 361597 359040 356691 355019 354504 355287 357212 360077 363687 367785
51668 367785 372279 377522 383988 391507 399236 406616 413976 421679 428939 434080 435935 434507 430374 424186
51654 424186 416951 410045 404417 400187 397361 396384 397408 399417 400828 400831 399593 397303 393745 388879 383316
51639 383316 377997 373784 371354 370953 371981 373129 373243 372038 370015 367875 365960 364056 361785 359292 357265
51624 357265 355999 354824 352985 350787 349090 347832 345968 343023 339782 337074 334640 331822 328719 325966
51610 325966 323798 322021 320696 320165 320464 321310 322607 324472 326756 329028 331205 333832 337579 342585 348403
51595 348403 354470 360640 367252 374513 381687 387209 389901 389898 388177 385495 382227 378944 376416 374946 374265
51580 374265 374229 375191 377522 381273 386574 393930 403704 415548 428725 442756 457301 471604 484733
51567 484733 496588 508238 520902 534690 548569 561441 573068 584089 595463 607963 621887
51556 621887 636989 652672 668267 683034 695751 704511 707402 703728 694591 682076 667726 651805
51544 651805 633955 614408 594355 575155 557465 541312 526843 514561 504764 497113 491064 486414
51532 486414 483015 480070 476311 471021 464562 457627 450325 442336 433763 425338 417725 410889 404293 397517
51518 397517 390594 383900 377931 373107 369539 366865 364375 361487 358208 355125 352859 351455 350321 348793
51504 348793 346781 344825 343470 342700 342129 341729 342082 343737 346430 349198 351232 352465 353354 354398 355851
51489 355851 357619 359317 360639 361772 363173 364818 365964 365840 364355 361988 359301 356756 354652 352853
51475 352853 350854 348452 346053 343952 341694 338717 335314 332249 329573 326625 323220 320000 317422 315169
51461 315169 313009 311501 311293 312143 313213 314050 314803 315715 316929 318682 321210 324467 328258 332671 338111
51446 338111 344927 353142 362454 372349 382348 392388 402844 413919 425016 434852 442196 446524 448185
51433 448185 448124 447370 446580 445894 444940 442755 438072 430341 420590 410729 401823 393517 385294 377483 370631 364572
51417 364572 358917 353999 350551 348665 347846 347876 348817 350199 351082 351112 350863 350934 351284 351689 352191 352756 353049 353006
51399 353006 353262 354563 356916 359633 362065 364122 366333 369631 374797 381822 390000 398842 408705 420260
51385 420260 433623 448350 464173 481388 500606 522359 546861 573788 602215 631024 659464
51374 659464 687241 714054 739115 761043 778106 788680 791758 787209 775640 758144 736112 710948
51362 710948 683594 654451 624006 593434 564187 536944 511378 487083 464402 444075 426372
51351 426372 411041 397966 387319 378910 371867 365395 359660 355466 353027 351415 349368 346418 343064
51338 343064 340078 337891 336518 335780 335547 335840 336656 337601 337886 336973 335148 333198 331544 330000 328337 326618
51322 326618 324814 322652 320274 318622 318513 319415 319867 319215 318316 318261 319016 319877 320713 322001 323754 325274 326121
51305 326121 326624 327127 327292 326629 325370 324295 323951 324372 325361 326506 327065 326411 324655 322539 320695 319335
51289 319335 318577 318627 319590 321466 324281 327804 331191 333516 334872 336416 339058 342558 346173 349657 353127
51274 353127 356340 358722 360087 360904 361835 363160 364632 365716 366116 366142 366358 366878 367361 367682 368063 368343 367795
51257 367795 366105 363920 361887 359754 357185 354886 353853 353697 352815 350355 347081 344091 341535 338989 336374
51242 336374 334036 332410 331897 332560 333633 333952 333322 332957 334047 336272 338266 339209 339435 339669 340236 340950 341382
51225 341382 341211 340558 339876 339347 338650 337573 336545 336206 336686 337687 339072 340860 342784 344395 345587 346688
51209 346688 347974 349471 351151 352942 354562 355824 357124 359196 362227 365622 368754 371514 373919 375635
51195 375635 376308 376063 375294 374109 372431 370519 368961 368069 367581 367096 366544 366115 365924 365894 365878 365715 365252 364448
51177 364448 363474 362620 362072 361838 361835 362000 362335 362894 363686 364578 365331 365799 366053 366248 366451 366726 367279 368342 369922
51158 369922 371779 373586 374920 375293 374592 373440 372692 372452 372110 371456 371132 371480 371598 370344 368022 366156
51142 366156 365635 365947 366356 366910 367824 368669 368898 368794 369251 370763 373126 375923 378785 381288 383095 384274
51126 384274 385195 386135 387251 388769 390782 392917 394593 395660 396477 397363 398265 399039 399737 400495 401302 401970 402229
51109 402229 401972 401556 401752 403089 405283 407579 409595 411535 413704 416200 419067 422264 425406 427952 429776
51094 429776 431161 432126 432289 431656 431021 431096 431538 431427 430527 429614 429505 430183 431019 431573 432010 432778 433987 435217
51076 435217 436076 436831 438103 439856 441168 441327 440793 440657 441460 443149 445888 450119 455746 462043 468740 476632
51060 476632 486622 498527 511320 524287 537393 550539 562974 573674 582073 588282 592814 596294
51048 596294 599425 602862 606798 610640 613386 614594 614804 614782 614482 613023 609596 604089 597043 589494 582779
51033 582779 577764 573959 569805 564086 556721 548241 539201 530401 522871 517050 512519 509078 507398 507871
51019 507871 509514 511135 513194 517297 523973 532104 540549 549147 557920 566548 575023 583674 591959 598409
51005 598409 602550 605889 610014 614573 618152 620382 621895 622753 622427 621240 620460 620699 621315 621685 622179 623516
50989 623516 626083 630288 636764 645610 656045 667432 680215 695268 712672 731686 751746 772897
50977 772897 795221 818257 841187 863541 885759 909136 935184 964991 999127 1037868 1081209
50966 1081209 1128790 1180239 1235640 1295312 1359123 1426412 1496571 1569207 1643626 1718595 1792745
50955 1792745 1864729 1932918 1995584 2051794 2101658 2145276 2181880 2210526 2231345 2245498 2254067
50944 2254067 2257512 2256220 2251132 2243651 2235044 2225889 2215938 2204546 2191355 2176470 2160000 2141745 2121460
50931 2121460 2099055 2074280 2046554 2015447 1981087 1943726 1903160 1858981 1811211 1760360 1707005
50920 1707005 1651708 1595124 1537791 1480030 1422523 1366795 1314499 1266241 1221579 1180141 1142146
50909 1142146 1107768 1076642 1048265 1022400 998748 976664 955637 935870 918041 902503 888898
50898 888898 876522 864975 854558 846005 839693 835149 831515 828420 826111 824800 824315 824434 825084 826080
50884 826080 827156 828451 830533 833630 837355 841577 847009 854297 862942 871958 881400 892304 905039 918665
50870 918665 932386 946844 963287 981956 1002121 1023482 1046778 1072994 1102667 1136127 1173724
50859 1173724 1215419 1260724 1309715 1363874 1425304 1495052 1572666 1657525 1750155 1851933 1963784
50848 1963784 2085514 2216226 2354924 2500590 2652091 2808411 2968870 3132658 3297843
50839 3297843 3461015 3618138 3765773 3901325 4022350 4126146 4210316 4273522 4315557 4337090
50829 4337090 4339703 4325917 4298600 4260345 4213793 4162508 4110826 4062409 4019128 3981434 3949299
50818 3949299 3922236 3898644 3875746 3850429 3820005 3782200 3734863 3676009 3604277 3519273 3421532
50807 3421532 3312126 3192349 3063732 2928293 2788606 2647503 2507647 2371238 2239953
50798 2239953 2115126 1998034 1889917 1791537 1702860 1623513 1553595 1493692 1443848 1402799 1368512
50787 1368512 1339385 1314862 1295099 1280207 1269573 1261631 1254485 1247052 1239585 1232869 1227076 1221641 1216003
50774 1216003 1209989 1203465 1196106 1187659 1178175 1167761 1156325 1143764 1130324 1116564 1102959 1089625
50762 1089625 1076428 1063327 1050535 1038420 1027319 1017555 1009487 1003334 998931 995898 994181 994204 996401
50749 996401 1000822 1007460 1016743 1029445 1046113 1066796 1091230 1119178 1150709 1186355 1226845 1272468
50737 1272468 1322757 1377042 1435197 1497630 1564644 1636098 1711602 1790672 1872647 1956685 2041949
50726 2041949 2127617 2212721 2296089 2376459 2452557 2523232 2587684 2645308 2694955 2734498 2761568
50715 2761568 2774825 2774352 2761002 2735935 2700888 2658418 2611611 2563650 2517550 2475757 2439674 2409750
50703 2409750 2386064 2368447 2355948 2346715 2338781 2330656 2320816 2306989 2286535 2257542 2219268 2171705
50691 2171705 2115233 2050781 1979858 1904164 1825411 1745669 1667516 1593319 1524316 1460664 1402470
50680 1402470 1350463 1305484 1267646 1236396 1211296 1192259 1178944 1170503 1166301 1166526 1171500 1180512
50668 1180512 1191853 1204157 1217261 1231563 1246909 1262379 1277062 1290750 1303919 1317166 1330713
50657 1330713 1344482 1358666 1374030 1391367 1410644 1431030 1451848 1473288 1496029 1520434 1546456
50646 1546456 1574185 1604133 1636788 1672057 1709349 1748168 1788414 1830007 1872468 1915167 1957891
50635 1957891 2000702 2043118 2083865 2121754 2156545 2188537 2217594 2243019 2264370 2281968 2296633
50624 2296633 2309168 2319815 2327567 2329983 2324468 2310309 2289463 2265358 2241192 2219215 2200812 2186602
50612 2186602 2176542 2170280 2167393 2167222 2168695 2170463 2171099 2169098 2162970 2151503 2133787 2108960 2076227
50599 2076227 2035294 1986634 1931326 1870897 1807238 1742168 1676825 1611790 1547930 1486576 1428613
50588 1428613 1373911 1322109 1273637 1229439 1189890 1154540 1122810 1094436 1069222 1046826 1027017
50577 1027017 1009971 996151 985859 978843 974304 971490 970373 971528 975229 980980 988090 996421 1006234
50564 1006234 1017590 1030297 1044322 1059851 1076997 1095709 1115844 1137024 1158567 1179921 1201182
50553 1201182 1222917 1245533 1269049 1293329 1318247 1343669 1369580 1396167 1423525 1451485 1480085
50542 1480085 1510124 1542816 1578915 1618569 1661958 1709616 1762067 1819652 1882875 1952392 2028234
50531 2028234 2109248 2193643 2280154 2368688 2460073 2555273 2654575 2757253 2861956 2967425 3072701
50520 3072701 3176606 3277233 3372069 3458573 3534661 3598880 3650223 3687704 3710088 3716208 3705603
50509 3705603 3678768 3636828 3581256 3513945 3437269 3353868 3266502 3178212 3092389 3012406 2941102
50498 2941102 2880585 2832285 2796989 2774881 2765659 2768556 2782144 2804195 2831849 2861884 2890730 2914456
50486 2914456 2929116 2931330 2918496 2888536 2839898 2772335 2687803 2590262 2484288 2373728 2261469
50475 2261469 2149938 2041363 1937586 1839955 1749390 1666338 1590677 1521958 1459676 1403094 1351051
50464 1351051 1302602 1257967 1218288 1184248 1155499 1131660 1113103 1100063 1091545 1085946 1082534 1081605
50452 1081605 1083414 1087844 1095072 1105629 1119491 1135837 1154050 1174317 1196910 1221455 1247399 1274661
50440 1274661 1303126 1331653 1358082 1380136 1396184 1405597 1409068 1408490 1405956 1402702 1399179 1395933 1393800
50427 1393800 1393225 1394054 1396323 1400792 1408223 1418382 1430307 1443624 1459133 1477912 1500205 1525538 1553728
50414 1553728 1585381 1621293 1661737 1706406 1754854 1806656 1861157 1917297 1973748 2029275 2082943
50403 2082943 2134022 2181690 2224869 2262433 2293471 2317228 2332976 2340266 2339159 2329714 2311210 2282504
50391 2282504 2243494 2195738 2141291 2081473 2017441 1951510 1886914 1826171 1770355 1720088 1676518
50380 1676518 1640997 1614213 1595932 1585264 1581037 1582213 1588164 1598229 1610926 1623967 1635146 1642823
50368 1642823 1645457 1641358 1629429 1609919 1583969 1552563 1516198 1475528 1431996 1387795 1345173 1305543
50356 1305543 1269087 1235254 1203604 1173992 1146143 1119674 1094643 1071429 1049710 1028076 1005198
50345 1005198 981193 957398 935051 914563 895892 879133 864752 853478 845870 841768 840294 840596
50333 840596 842337 845313 849010 852957 857214 862076 867526 873401 879836 887053 894868 902910 911188 919947
50319 919947 929089 938249 947313 956358 965188 973487 981289 988680 995236 1000558 1005374 1011256 1019017 1028203
50305 1028203 1038407 1050222 1064359 1080602 1098331 1117616 1139128 1163323 1190271 1220046 1252768
50294 1252768 1288423 1327012 1368601 1412987 1459639 1507837 1555477 1596785 1622510 1624758 1602461
50283 1602461 1561564 1510160 1454540 1399346 1348766 1305625 1270117 1240845 1216881 1197899 1182981
50272 1182981 1170680 1160288 1151991 1145611 1140200 1135151 1130945 1128357 1127516 1128121 1129989 1132933 1136541 1140632
50258 1140632 1145733 1152660 1161737 1172626 1184679 1197141 1209252 1220531 1230894 1240332 1248717 1256176
50246 1256176 1263234 1270043 1275663 1278684 1278532 1275605 1270214 1262125 1251440 1239325 1227319 1216172 1205747
50233 1205747 1195785 1186294 1177308 1168730 1160391 1151779 1141558 1127784 1109083 1085658 1059064 1031130
50221 1031130 1003250 976442 951527 928875 908200 889063 871716 857099 845749 836868 828823 820584
50209 820584 812426 805243 799518 795125 791753 789105 786765 784334 781775 779339 776923 773779 769158 763207
50195 763207 756914 751143 745926 740721 735115 729131 723054 717198 711733 706523 701202 695595 690015 684889
50181 684889 680182 675485 670637 665884 661334 656683 651704 646686 642029 637682 633418 629550 626904 625956
50167 625956 626261 626907 627363 627822 628807 630579 632981 635850 639431 644137 649923 656273 662970 670563 679842
50152 679842 691127 704361 719548 736652 755242 774751 794969 815883 837226 858781 881017
50141 881017 904754 930023 955836 981241 1006091 1030647 1055009 1079234 1103448 1127509 1151001
50130 1151001 1173829 1196209 1217569 1235919 1249003 1255786 1256345 1250742 1238915 1221632 1200661 1177653
50118 1177653 1153256 1127585 1101117 1074836 1049784 1026816 1006628 989635 975698 964107 953980
50107 953980 944781 936427 928923 921933 914946 907792 900830 894500 888868 883602 878184 872135 865432 858911
50093 858911 853832 850716 848944 847862 847831 849603 852914 856502 859593 862686 866556 871062 875344 878871 881851
50078 881851 884772 887879 891103 894289 897441 900760 904353 907870 910692 912587 913983 915316 916220 915703 913187
50063 913187 909169 904672 900171 895300 889692 883786 878543 874413 870972 867701 864790 862841 861923 861372 860641
50048 860641 860066 860583 862850 866829 872208 878938 887166 896690 906853 917193 928017 939923 952791
50035 952791 965629 977534 988460 998869 1009105 1019471 1030538 1042768 1055919 1069294 1082536
50024 1082536 1095703 1108589 1120543 1131210 1141023 1150625 1160064 1168914 1177033 1184743 1192115 1198259 1201639
50011 1201639 1201261 1197548 1191902 1185361 1177787 1168302 1156138 1140805 1121851 1099111 1073306 1046036 1018992
49998 1018992 993327 969710 948549 929937 913566 898881 885297 872351 859954 848536 838592
49987 838592 829875 821223 811410 800026 787441 774145 760370 746300 732367 719159 707038 695904
49975 695904 685447 675677 667046 659892 653947 648709 644193 640842 638575 636382 633243 629230 625338 622374
49961 622374 620346 618925 618031 617697 617668 617583 617608 618483 620726 624043 627932 632611 638782 646355 653984 660180
49945 660180 664493 667280 668851 669453 669722 670309 671016 670945 669572 667176 664104 660257 655458 649774 643186 635464
49929 635464 626722 617701 609215 601657 595261 590302 586600 583354 580094 577548 576902 578230 580186 581330
49915 581330 581422 581339 582084 584004 586779 590010 593798 598641 604726 611571 618570 625669 633239 641416 649881
49900 649881 658203 666096 673332 679667 684939 689109 692208 694256 695103 694334 691525 686790 680793 674066 666567
49885 666567 658167 649222 640270 631459 622786 614713 607905 602269 596868 590926 584600 578601 573530 569716
49871 569716 567273 565930 565053 564171 563467 563617 565285 568765 573842 579838 585993 592088 598576 606007 614447
49856 614447 623563 633036 642650 652138 661251 669967 678324 686000 692196 696135 697713 697605 696656 695159 692770
49841 692770 689162 684544 679344 673545 666706 658704 650134 641854 634434 628183 623359 619991 617679 615948
49827 615948 614745 614291 614537 615114 615843 617004 618968 621802 625338 629411 633891 638664 643733 649197 654965
49812 654965 660570 665445 669358 672488 675115 677373 679290 680920 682307 683284 683392 682117 679415 675950 672700
49797 672700 670232 668424 666774 664721 661617 656769 649926 641662 633038 624879 617523 611128 605828 601604
49783 601604 598328 596109 595284 595878 597293 598711 599678 600185 600477 601005 602339 604748 607963 611669 616119 621800
49767 621800 628427 634751 639651 643152 646097 649001 651598 653422 654422 654894 655064 654962 654483 653300 650829
49752 650829 646635 641068 635232 630131 625885 621948 617991 614319 611471 609666 608698 608181 607777 607375 607159
49737 607159 607409 608184 609336 610831 612884 615736 619504 624224 629726 635338 640109 643603 646293 649052 652613
49722 652613 657626 664716 673911 684295 694733 704795 714545 723757 731949 738971 744765 748557 749146 746250
49708 746250 740880 734116 726202 717331 708673 701854 697621 695618 695346 696737 699719 703658 707422 709771
49694 709771 709693 706737 701375 695039 689612 686576 686427 688709 692615 697609 703606 710793 719426 729636 741285
49679 741285 754100 768097 783660 800986 819791 839960 862058 886230 910333 929969 941103
49668 941103 942743 937156 927984 918362 910170 904236 900966 900794 904017 910305 918675 927784 935747 939720
49654 939720 936679 925383 907344 885543 862508 839839 818781 800280 784553 771298 760424 752144
49642 752144 746348 742352 739348 736908 735051 733998 733726 733542 732275 729225 724841 720233 716115 712282 707886
49627 707886 702026 694496 686265 678868 672947 667749 662433 657382 653629 651442 650255 649772 650207 651473 652937
49612 652937 654213 655526 657113 658813 660479 662313 664551 667213 670274 673696 677122 679963 681949 683345
49598 683345 684576 685919 687534 689354 690996 692180 693205 694503 695751 696154 695750 695670 696750 698503 699905
49583 699905 700643 701084 701459 701724 702039 702784 704082 705697 707433 709399 711878 715049 718801 722796 726925 731695
49567 731695 737812 745282 753254 760997 768616 776497 784373 791408 797016 801170 803990 805408 805300 803666
49553 803666 800651 796599 792086 787677 783630 779980 776917 774826 773882 773792 774161 775048 776915 779948 783594
49538 783594 787042 790116 793384 797390 802101 807263 812965 819560 827353 836676 847936 861155 875673
49525 875673 890824 906768 924230 943565 964454 986129 1007084 1024702 1036248 1040849 1040081 1036465
49513 1036465 1031773 1026825 1022140 1018286 1015938 1015836 1018216 1022038 1025230 1026034 1023770 1018178 1008749 995225
49499 995225 978351 959590 940325 921595 904187 888494 874457 861921 850845 841098 832531 825506
49487 825506 820749 818327 817281 816645 816340 816642 817435 818599 820499 823283 826115 827954 828840 829637 830713 831709
49471 831709 832460 833315 834519 836016 837923 840581 844075 848235 853068 858574 864176 869074 873205 877153 880962
49456 880962 883829 885184 885404 885015 883798 881221 877412 873233 869540 866639 864316 862178 860059 858241 857174
49441 857174 857005 857541 858632 860337 862852 866522 871825 878883 887089 895651 904485 914169 925153 937575
49427 937575 951753 968068 986206 1005142 1024055 1042646 1060548 1077331 1093390 1109609 1125195
49416 1125195 1136604 1139865 1134067 1121921 1107235 1092654 1079681 1069569 1063363 1061370 1063157 1068077
49404 1068077 1075636 1085423 1096872 1109267 1122085 1135266 1148901 1162586 1175490 1187205 1198109 1208520
49392 1208520 1217872 1225327 1230922 1235397 1238929 1240776 1240392 1238187 1234748 1229797 1222526 1212824 1201770 1190908
49378 1190908 1181314 1173232 1166309 1160151 1154814 1150821 1148590 1147961 1148449 1149927 1152808 1157526 1163988 1171478
49364 1171478 1178939 1185341 1190103 1193299 1195380 1196562 1196561 1195004 1191953 1187998 1183948 1180428 1177479 1174439 1170493
49349 1170493 1165667 1161049 1157759 1155897 1154905 1154677 1155623 1157539 1159149 1159157 1157333 1154158 1149919 1144661 1138770
49334 1138770 1132866 1127195 1121636 1116456 1112574 1110939 1111954 1115649 1122073 1131286 1143186 1157525 1173911
49321 1173911 1191570 1209068 1224322 1234997 1239187 1236212 1226994 1213653 1198524 1183329 1168764 1154460
49309 1154460 1139500 1123448 1107052 1091687 1078170 1066378 1055979 1047075 1040025 1035107 1032562 1032462
49297 1032462 1034286 1036998 1039937 1043222 1046858 1049857 1050934 1049914 1047753 1045138 1041674 1036635 1029972 1022275
49283 1022275 1014196 1006279 998977 992396 986182 980058 974356 969697 966335 964205 963488 964550 967145 970181
49269 970181 972593 974276 975891 977962 980284 982069 982448 981060 978468 975943 974583 974722 976386 980072 986570
49254 986570 995960 1007287 1019489 1032339 1046152 1060728 1074862 1086835 1095143 1098915 1098033 1093113 1085227
49241 1085227 1075443 1064615 1053610 1043518 1035234 1028722 1023048 1017526 1012678 1009646 1008734 1009196 1010560 1013419
49227 1013419 1018377 1024850 1031670 1038486 1045699 1053256 1060547 1067590 1075285 1084088 1093278 1102031 1110525 1119371
49213 1119371 1128502 1137249 1145144 1152127 1158337 1164287 1170936 1179028 1188589 1199469 1212019 1226619 1242831
49200 1242831 1259680 1276540 1293202 1309399 1325094 1341002 1357872 1375093 1390860 1404062 1415411
49189 1415411 1426384 1437588 1448553 1458751 1468313 1477869 1488014 1499049 1511175 1524853 1540807 1559592
49177 1559592 1581329 1605935 1633218 1662610 1693325 1725321 1759730 1797701 1838885 1881427 1922969
49166 1922969 1960979 1992542 2015129 2028063 2032863 2032096 2028383 2024144 2021102 2019503 2018428 2017215 2016113
49153 2016113 2015489 2015191 2015105 2015735 2017806 2021692 2027555 2035579 2045700 2057505 2070716 2085409 2101528 2118601
49139 2118601 2136166 2154075 2172195 2190297 2208528 2227503 2247609 2268552 2289800 2311065 2332184
49128 2332184 2353034 2373784 2394773 2416001 2437396 2459705 2484357 2511985 2541910 2573584 2607869
49117 2607869 2646279 2689707 2738690 2794359 2858204 2931141 3013551 3106080 3209961 3326991 3459817
49106 3459817 3611425 3782511 3968071 4156470 4332882 4486286 4616355 4734072 4851765
49097 4851765 4967772 5060122 5098673 5067038 4974429 4847234 4709780 4571472 4428122 4272063
49087 4272063 4101237 3921622 3743632 3576875 3427267 3297115 3186252 3092876 3014422 2948593
49077 2948593 2893720 2848268 2810483 2778663 2751365 2727222 2705064 2684449 2665600 2648640 2633271
49066 2633271 2619371 2607234 2596773 2587024 2577057 2567152 2558475 2551633 2545988 2540414 2534388 2528290 2522899
49053 2522899 2518720 2515688 2513416 2511690 2510578 2510061 2509801 2509468 2509212 2509607 2511059 2513290 2515262 2515625 2513425
49038 2513425 2508668 2502352 2495946 2490678 2487072 2484925 2483817 2483738 2485133 2488153 2491996 2495281 2497082 2497386 2496605
49023 2496605 2494987 2492638 2489801 2486876 2484257 2482236 2480950 2480353 2480335 2480951 2482388 2484701 2487745 2491420 2495814
49008 2495814 2500992 2506725 2512516 2517864 2522525 2526576 2530284 2533824 2537071 2539677 2541343 2541997 2541802 2540994 2539647
48993 2539647 2537574 2534598 2530920 2527023 2523132 2519063 2514678 2510106 2505248 2499464 2492327 2484472 2477186 2471119
48979 2471119 2465862 2460710 2455349 2449686 2443567 2436993 2430272 2423694 2417254 2410873 2404622 2398493 2392240 2385802
48965 2385802 2379739 2374911 2371723 2370023 2369788 2371552 2375931 2382892 2391825 2402316 2414505 2428548 2444095
48952 2444095 2460623 2478070 2496610 2515960 2535520 2555341 2576252 2598605 2621451 2643555 2664914
48941 2664914 2686700 2709947 2734936 2761718 2790500 2821402 2854412 2889751 2927827 2968636 3011650
48930 3011650 3056440 3103022 3151402 3201203 3252078 3304234 3358189 3414187 3472038 3531363 3591712
48919 3591712 3652493 3713069 3773022 3832250 3890790 3948463 4004660 4058525 4109484 4157587 4203298
48908 4203298 4247049 4289014 4329112 4366980 4402117 4434367 4464190 4492179 4518444 4542737 4565091
48897 4565091 4585827 4604908 4621707 4635602 4646513 4654673 4660153 4662827 4662641 4659762 4654561 4647467 4638706
48884 4638706 4628122 4615348 4600130 4582292 4561515 4537542 4510643 4481509 4450465 4417063 4380679
48873 4380679 4341333 4299661 4256159 4210781 4163313 4113962 4063414 4012402 3961464 3911074 3861756
48862 3861756 3813805 3767040 3721162 3676362 3633331 3592705 3554762 3519496 3486516 3454983 3424401
48851 3424401 3395642 3370410 3349324 3331209 3314781 3300274 3288662 3279982 3273475 3268967 3267000 3267694
48839 3267694 3270578 3275554 3283036 3292887 3304141 3316127 3329130 3343576 3359284 3375906 3393528 3412238
48827 3412238 3431512 3450468 3468563 3485800 3502564 3519378 3536512 3553632 3570166 3586158 3602393
48816 3602393 3619511 3637308 3655045 3672144 3688478 3704339 3720283 3736747 3753743 3771107 3788929
48805 3788929 3807351 3826150 3845074 3864439 3884762 3905803 3926755 3947481 3968793 3991254 4014354
48794 4014354 4037105 4058769 4078677 4096064 4110592 4122541 4132128 4139157 4143671 4146332 4147672 4147405 4144902
48781 4144902 4139895 4132313 4121907 4108485 4092098 4072511 4048962 4020958 3989017 3954174 3917090 3878012
48769 3878012 3837167 3794707 3750584 3705062 3659091 3613658 3568923 3524413 3479918 3435787 3392513
48758 3392513 3350328 3309146 3268692 3228937 3190582 3154843 3122463 3093182 3066261 3041169 3017631
48747 3017631 2995541 2975171 2957100 2941597 2928447 2917590 2909400 2904018 2900946 2899704 2900337 2902771 2906157
$$ [...]
##END NTUPLES=NMR SPECTRUM
##END=
