##TITLE=AC1687_PANAM14368_8637553_FEcPcazRuK
##JCAMPDX= 6.0         $$ Bruker NMR JCAMP-DX V2.0
##DATA TYPE= NMR SPECTRUM
##DATA CLASS= NTUPLES
##ORIGIN= BRUKER
##OWNER= Administrator
$$ 1.72 TOPSPIN		Version 2.1
$$ 2014-05-31 01:15:36.818 -0700  Administrator@X
$$ Compression mode = diff/dup
##.OBSERVE FREQUENCY= 400.02188249412
##.OBSERVE NUCLEUS= ^1H
##.ACQUISITION MODE= SIMULTANEOUS (DQD)
##.ACQUISITION SCHEME= undefined
##.AVERAGES= 8
##.DIGITISER RES= 22
##SPECTROMETER/DATA SYSTEM= spect
##.PULSE SEQUENCE= zg30
##.SOLVENT NAME= COFFEE_meoh
##.SHIFT REFERENCE= INTERNAL, COFFEE_meoh, 1, 14.98509
##AUDIT TRAIL= $$ (NUMBER, WHEN, WHO, WHERE, PROCESS, VERSION, WHAT)
$$ ##TITLE= Audit trail, TOPSPIN		Version 2.1
$$ ##JCAMPDX= 5.01
$$ ##ORIGIN= Bruker BioSpin GmbH
$$ ##OWNER= Administrator
$$ $$ E:\/data/COFFEE/nmr/AC1687_PANAM14368_8637553_FEcPcazRuK/10/pdata/1/auditp.txt
$$ ##AUDIT TRAIL=  $$ (NUMBER, WHEN, WHO, WHERE, PROCESS, VERSION, WHAT)
(   1,<2014-05-31 01:15:29.725 -0700>,<Administrator>,<X>,<go>,<TOPSPIN 2.1>,
      <created by zg
	started at 2014-05-31 01:14:23.537 -0700,
	POWCHK enabled, PULCHK disabled,
       configuration hash MD5:
       C8 4E 4E 5D D3 5C D8 9E 9F 52 82 E0 59 8A DE 15
       data hash MD5: 64K
       0A 06 40 A2 35 F0 8A 83 E1 06 CF 8F 72 CC D7 71>)
(   2,<2014-05-31 01:15:32.787 -0700>,<Administrator>,<X>,<proc1d>,<TOPSPIN 2.1>,
      <Start of raw data processing
       efp LB = 0 FT_mod = 6 PKNL = 1 PHC0 = 0 PHC1 = 0 SI = 32K 
       data hash MD5: 32K
       9F C5 E9 D0 DC C7 C0 AA F0 23 79 F7 75 32 C4 8D>)
(   3,<2014-05-31 01:15:33.084 -0700>,<Administrator>,<X>,<proc1d>,<TOPSPIN 2.1>,
      <pk PHC0 = 90.89539 PHC1 = 0 
       data hash MD5: 32K
       51 48 B1 38 5E FD F1 32 F0 C9 AE 63 4B 71 BE 73>)
(   4,<2014-05-31 01:15:33.318 -0700>,<Administrator>,<X>,<proc1d>,<TOPSPIN 2.1>,
      <abs ABSG = 1 
       data hash MD5: 32K
       39 AA 91 41 84 4D 3C 08 CF 5F 8D 07 F8 83 A3 F6>)
(   5,<2014-05-31 01:15:33.381 -0700>,<Administrator>,<X>,<proc1d>,<TOPSPIN 2.1>,
      <abs ABSG = 2 
       data hash MD5: 32K
       2A 40 4C C4 E8 83 F2 56 0E 20 EC 2F 39 2B 66 4E>)
(   6,<2014-05-31 01:15:33.475 -0700>,<Administrator>,<X>,<proc1d>,<TOPSPIN 2.1>,
      <abs ABSG = 3 
       data hash MD5: 32K
       53 B5 A4 49 1E 1C 83 FE 67 32 44 32 DE 30 62 B1>)
(   7,<2014-05-31 01:15:33.521 -0700>,<Administrator>,<X>,<proc1d>,<TOPSPIN 2.1>,
      <abs ABSG = 4 
       data hash MD5: 32K
       9A 8A FD C0 3E C9 34 35 09 5F 2F E0 E9 59 44 15>)
(   8,<2014-05-31 01:15:33.568 -0700>,<Administrator>,<X>,<proc1d>,<TOPSPIN 2.1>,
      <abs ABSG = 5 
       data hash MD5: 32K
       C4 EB D9 B1 41 17 B8 E7 58 01 1E 9A A0 B2 24 6A>)
$$ ##END=
$$ 
$$ $$ hash MD5
$$ $$ A2 A5 BA 35 D1 4D 1E 63 B0 EB 74 C7 5D D4 A0 6A
##$RELAX= 
##$RELAX= 
##$RELAX= 
##$RELAX= 
##$RELAX= 
##$RELAX= 
##$RELAX= 
$$ Bruker specific parameters
$$ --------------------------
##$DU= <E:\>
##$EXPNO= 10
##$NAME= <AC1687_PANAM14368_8637553_FEcPcazRuK>
$$ [...]
150 150 150 150 150 150 150 150
##$TP07= 0
##$TPNAME0= <>
##$TPNAME1= <>
##$TPNAME2= <>
##$TPNAME3= <>
##$TPNAME4= <>
##$TPNAME5= <>
##$TPNAME6= <>
##$TPNAME7= <>
##$TPOAL= (0..7)
0.5 0.5 0.5 0.5 0.5 0.5 0.5 0.5
##$TPOFFS= (0..7)
0 0 0 0 0 0 0 0
##$TUNHIN= 0
##$TUNHOUT= 0
##$TUNXOUT= 0
##$USERA1= <user>
##$USERA2= <user>
##$USERA3= <user>
##$USERA4= <user>
##$USERA5= <user>
##$V9= 5
##$VALIST= <valist>
##$VCLIST= <CCCCCCCCCCCCCCC>
##$VD= 0
##$VDLIST= <DDDDDDDDDDDDDDD>
##$VPLIST= <PPPPPPPPPPPPPPP>
##$VTLIST= <TTTTTTTTTTTTTTT>
##$WBST= 2048
##$WBSW= 25
##$XGAIN= (0..3)
0 0 0 0
##$XL= 0
##$YL= 0
##$YMAX_a= 599582
##$YMIN_a= -517879
##$ZGOPTNS= <>
##$ZL1= 120
##$ZL2= 120
##$ZL3= 120
##$ZL4= 120
##$ABSF1= 14.98509
##$ABSF2= -5.573092
##$ABSG= 5
##$ABSL= 3
##$ALPHA= 0
##$AQORDER= 0
##$ASSFAC= 0
##$ASSFACI= 0
##$ASSFACX= 0
##$ASSWID= 0
##$AUNMP= <proc_prof1d_extract_pilot.lims>
##$AXLEFT= 0
##$AXNAME= <>
##$AXNUC= <1H>
##$AXRIGHT= 0
##$AXTYPE= 0
##$AXUNIT= <>
##$AZFE= 0.1
##$AZFW= 0.1
##$BCFW= 0
##$BC_mod= 0
##$BYTORDP= 0
##$COROFFS= 0
##$CY= 15
##$DATMOD= 1
##$DC= 0
##$DFILT= <>
##$DTYPP= 0
##$F1P= 0
##$F2P= 0
##$FCOR= 0.5
##$FTSIZE= 32768
##$FT_mod= 6
##$GAMMA= 0
##$GB= 0
##$INTBC= 1
##$INTSCL= 1
##$ISEN= 128
##$LB= 0
##$LEV0= 0
##$LPBIN= 0
##$MAXI= 10000
##$MC2= 0
##$MEAN= 0
##$ME_mod= 0
##$MI= 0
##$NCOEF= 0
##$NC_proc= -8
##$NLEV= 6
##$NOISF1= 0
##$NOISF2= 0
##$NSP= 0
##$NTH_PI= 0
##$NZP= 0
##$OFFSET= 14.98509
##$PC= 1
##$PHC0= 90.89539
##$PHC1= 0
##$PH_mod= 1
##$PKNL= yes
##$PPARMOD= 0
##$PPDIAG= 0
##$PPIPTYP= 0
##$PPMPNUM= 2147483647
##$PPRESOL= 1
##$PSCAL= 4
##$PSIGN= 0
##$PYNMP= <proc.py>
##$REVERSE= no
##$SF= 400.02
##$SI= 32768
##$SIGF1= 0
##$SIGF2= 0
##$SINO= 400
##$SIOLD= 32768
##$SPECTYP= <>
##$SREGLST= <1H.CDCl3>
##$SSB= 0
##$STSI= 32768
##$STSR= 0
##$SW_p= 8223.68421052631
##$SYMM= 0
##$S_DEV= 0
##$TDeff= 65536
##$TDoff= 0
##$TI= <>
##$TILT= no
##$TM1= 0
##$TM2= 0
##$TOPLEV= 0
##$USERP1= <user>
##$USERP2= <user>
##$USERP3= <user>
##$USERP4= <user>
##$USERP5= <user>
##$WDW= 1
##$XDIM= 32768
##$YMAX_p= 466330474
##$YMIN_p= -641959
##$CURPLOT= <Network HP LaserJet P1505>
##$CURPRIN= <$Network HP LaserJet P1505>
##$DFORMAT= <normdp>
##$LAYOUT= <+/1D_H.xwp>
##$LFORMAT= <normlp>
##$PFORMAT= <normpl>
##$SURQMSG= 1
$$ End of Bruker specific parameters
$$ ---------------------------------
##NTUPLES= NMR SPECTRUM
##VAR_NAME=  FREQUENCY,     SPECTRUM/REAL,   SPECTRUM/IMAG
##SYMBOL=    X,             R,               I
##VAR_TYPE=  INDEPENDENT,   DEPENDENT,       DEPENDENT
##VAR_FORM=  AFFN,          ASDF,            ASDF
##VAR_DIM=   32768,         32768,           32768
##UNITS=     HZ,            ARBITRARY UNITS, ARBITRARY UNITS
##FACTOR=    0.250966925370066, 1,           1
##FIRST=     8223.43324360094, -55026,       -21301
##LAST=      0,             123458,          -44761
##MIN=       0,             -641959,         0
##MAX=       8223.43324360094, 466330474,    0
$$ Real data points
##PAGE= N=1
##DATA TABLE= (X++(R..R)), XYDATA
$$ [...]
19553a97125L8593A1049L70184A39708b04760i1838M2648l4370c2234j3898o9922
19542a16054o2030A46469c28163B14416m4281b53204a5848C5830a43339p6011
19532b19350N9357k8431Q2123G39O1530i4685j78065a22044A33864b4354k5035
19521d9389C3312a58070a9891p9501B31552b9263l8136J8833r0824j44733E9576
19509a14121j24572B36826H8636K0456b0327B05341g7742j97248e4828k60968
19499c15796i2660B41257F965a07582C35873r1196a93413I0037N1307b33317i66
19487e4765B86204j14292k0086J06708j01386b60837a9497j43491b3394A60481
19476a14681j96436A41511e4631K5709j60037L8930A92671f2942j42822l08676
$$ plain form
19553 -197125 -158532 11049 381233 139708 -204760 -91838 -49190 -83560 -32234 -46132 -116054
19542 -116054 -178084 146469 -328163 214416 170135 -253204 -15848 35830 -143339 -219350
19532 -219350 -159993 -188424 -106301 739 62269 -94685 -272750 -122044 133864 -24354 -49389
19521 -49389 33312 -158070 -19891 -99392 231552 -29263 -67399 -48566 -139390 -284123 59576
19509 -114121 -238693 236826 88636 109092 -20327 205341 -77742 -274990 -54828 -315796
19499 -315796 -92660 241257 6965 -107582 335873 244677 -193413 90037 141344 -233317 -966
19487 -54765 286204 171912 151826 258534 157148 -260837 -19497 -162988 -23394 160481
19476 -114681 -311117 141511 -54631 -28922 -188959 -150029 192671 -62942 -205764 -514440
19466e14440a61287B7015a82912C41538A49583b40241k91546E2041a34036M9999
19456h4037K8633F1125d72121J75904A03659a76281h7484o8332e4699A67057K8210
19445A95267f1795r9926a5835A56517c3318a1853j40496A06680c08714d4093A89253
19433a75114B15023b47365B6111J98431c8800j78202m4832h4568k513m5092M1814
19422i0359j34126A12421D3659J2431c65577J21178B72095f8771n0107A0197K41852
19411B52049h8563B40065a25374H4718L1312j7268a79374b1454k2381A75187D9119
19399a82627D9128d90954B71830b8547D1227g3031m333I5096g4612A26258a07988
19387a162q3790A27740J1884g9980E5822b51867M7369B24055f1091l11454h3825
$$ plain form
19466 -514440 -161287 27015 -182912 341538 149583 -240241 -531787 52041 -134036 -84037
19456 -84037 -55404 61125 -472121 -296217 103659 -176281 -87484 -155816 -54699 167057 195267
19445 195267 -61795 -161721 -15835 156517 -33318 -11853 -152349 106680 -308714 -44093 189253
19433 -175114 215023 -247365 26111 224542 -38800 -217002 -261834 -84568 -87081 -132173 -90359
19422 -90359 -224485 112421 43659 56090 -365577 -244399 272095 -68771 -118878 10197 252049
19411 252049 -88563 240065 -125374 84718 116030 98762 -179374 -21454 -43835 175187 49119
19399 -182627 49128 -490954 271830 -28547 41227 -73031 -77364 95096 -74612 126258 -107988
19387 -1162 -84952 127740 139624 -79980 55822 -251867 -204498 224055 -61091 -372545 -83825
19375a87848c0666l5638K469C8081a16631M6357j7009B986L87444b94389B05945
19363b53681P6688k55708a45381p6848a07620C97626a85625A3939a6826p4949
19353i1775j01006N5197j38827K60a08510A05045e3941l1266j34030E6524a44157
19341b7081A48447a62859j57147d4433A12599g1520A90063b04098c1957A08200
19330c33451B19761B2185J12641A0680a37359F0427a18169G9772e2441j20235
19320a72676F1491K49205c15358G9169K1096L927e293k19232A47962d5422A49260
19308a57324k23346E8089a37685H3628L3135b53782H5003a1800m3682j38284P488
19297a86278A02379b65881K3487j63560I7128c03587a11576k15018E21724d40499
$$ plain form
19375 -187848 -30666 -66304 -63835 38081 -116631 -70274 -87283 2986 390430 -294389 205945
19363 -253681 -176993 -432701 -145381 -222229 -107620 397626 -185625 13939 -16826 -91775
19353 -91775 -192781 -137584 -276411 -276151 -108510 105045 -53941 -85207 -219237 56524 -144157
19341 -27081 148447 -162859 -320006 -44433 112599 -71520 190063 -204098 -31957 108200
19330 -333451 219761 22185 134826 10680 -137359 60427 -118169 79772 -52441 -172676
19320 -172676 61491 310696 -315358 79169 100265 104192 -5293 -224525 147962 -45422 149260
19308 -157324 -380670 58089 -137685 83628 116763 -253782 85003 -11800 -55482 -193766 -186278
19297 -186278 102379 -265881 -242394 -405954 97128 -303587 -111576 -326594 521724 -440499
19286A07808J69423r2474p3836F124a92647A71283b81474J28464k03330B98665
19275B05240c28005e7417A22165C3427a02413j51006e7734j16041d6494k14386
19265b60880K3149A69552a24446A00299c6226B51374b81268A24532d11283C78574
19254b08042d2098C7773c25346B97456E7418K2546a06375o5738k0497p1381J06491
19243a57500B1647d8425k26264A25777b76358C30731A31606b60929A74763c71262
19232F1680R2327a83224G1048J48317i4439p3967Q794I6218n115b24048l1401
19221b55449A07648a39821M953a3905A4478K8488j3877b03688j8820K979A71744
19209G2227J88805A15771d9100B69989C6387c607r9916n6198m4262G6205a47056
$$ plain form
19286 107808 277231 184757 110921 6124 -192647 171283 -281474 -153010 -356340 298665
19275 205240 -328005 -57417 122165 33427 -102413 -253419 -57734 -173775 -46494 -260880
19265 -260880 -237731 169552 -124446 100299 -36226 251374 -281268 124532 -411283 378574
19254 -208042 -42098 37773 -325346 297456 57418 79964 -106375 -172113 -192610 -263991 -157500
19243 -157500 21647 -48425 -274689 125777 -276358 330731 131606 -260929 174763 -371262
19232 61680 154007 -183224 71048 219365 -94439 -168406 -159612 96218 91103 -224048 -255449
19221 -255449 107648 -139821 -134868 -13905 14478 42966 29089 -203688 -222508 -219529 171744
19209 72227 261032 115771 -49100 269989 36387 -3607 -103523 -159721 -203983 76205 -147056
19197b51375B3635b03287D4766d7444l42092h6280E4412g7141j26176q2409D7908
19185B7597h2110a2347j89733j26000a24874j23376J07053D90810e7289M113C9192
19173A0260a14263k2213d926j34890L1096d741C60478j25243B0439a1366B72958
19161f7899j48585c6474A38183a06648b982C26252f1874l88825B721Q5133a75296
19149A27090j386h9706m6184J6340b1714A10019k2329a92725i0469A05517a34779
19137A98537B0914J78830b15601p0781J41147E3078a93729L7488A18e675E7080
19125a31065D302d85585C1693d8642D5800P1792b71864a6995r1065k45603B47173
19113c83341J08410A03257a77536d3528k4269a3444A51276b01478c5561A6846
$$ plain form
19197 -251375 23635 -203287 44766 -47444 -389536 -86280 54412 -77141 -203317 -285726 47908
19185 27597 -82110 -12347 -202080 -328080 -124874 -248250 -141197 490810 -57289 -53176 39192
19173 10260 -114263 -136476 -4926 -139816 -108720 -4741 360478 235235 20439 -11366 272958
19161 -67899 -216484 -36474 138183 -106648 -2982 326252 -61874 -450699 2721 87854 -175296
19149 127090 125704 -89706 -135890 -119550 -21714 110019 87690 -192725 -90469 105517 -134779
19137 198537 20914 199744 -215601 -286382 -145235 53078 -193729 -156241 118 -5675 57080
19125 -131065 4302 -485585 31693 -48642 45800 117592 -271864 -16995 -108060 -353663 247173
19113 -383341 -274931 103257 -177536 -43528 -67797 -13444 151276 -201478 -35561 16846
19102A21993a21493E996a65633k1295o2641b3646k96396n3514G6367Q6433c00592
19090a992j28819m9201A30456p015a06489j83907d8019A9659b02362A03682C8098
19078B63985E8704a80346j46388A85355a14430N536b4487j62922A5642d3157A7404
19066B58701a04742F2270J53379p4086a38351B1061r198c71303J03164D1326e7287
19054a09557r1556O3871f6354A3937a02299n1985C0749N0656G639a13940j7276
19043a31216J9656e1883k94664P5906A2565a04592A33537a3560k19752p1578J02594
19032b02296A82783J76261a23206A19096E8088K0798a32111l03489A52009f3336
19021B47700G667J23459L3698a26723B11295B4404a69288B60650r5033a89108
$$ plain form
19102 121993 -121493 5996 -165633 -186928 -249569 -23646 -320042 -373556 76367 162800 -300592
19090 -1992 -130811 -180012 130456 123441 -106489 -290396 -48019 19659 -202362 103682 38098
19078 263985 58704 -180346 -326734 185355 -114430 -108894 -24487 -187409 15642 -43157 17404
19066 258701 -104742 62270 215649 141563 -138351 21061 11863 -371303 -268139 41326 -57287
19054 -109557 -201113 -137242 -66354 13937 -102299 -154284 30749 81405 7639 -113940 -131216
19043 -131216 -111560 -51883 -346547 -270641 12565 -104592 133537 -13560 -233312 -304890 -202296
19032 -202296 182783 359044 -123206 119096 58088 78886 -132111 -435600 152009 -63336
19021 247700 7667 131126 164824 -126723 211295 24404 -169288 260650 165617 -189108
19010I9603f1471A1666a24922A2075O2450i3052j06599D7326J09444a78695E4394
18998B27825b91266Q8812L8395A8567J16964b2847C2504L4496k3080b49410F2836
18986F3943a61892O3341p3606D2471a41920A233a74114A43949a8096f754o3845
18975g0599j18173h2693E4855b7684G2479J14863a04077B57566E5520a03808j58719
18964b62527h5415l88410a20351k8263k9099N1379b0988C66941L9474C7493K54488
18953B91981E9588a20974p0326A37928a53679l8461A38111E1106a17210A93697
18942G5525J06553e7308k03217b0214G0082K59359B1465J39581d1000B5942i3230
18930c33351f6311B51342a11691o9737N7591E1259B3216c3009q5568j34638A35610
$$ plain form
19010 99603 -61471 11666 -124922 12075 74525 -93052 -199651 47326 156770 -178695 54394
18998 227825 -291266 -202454 -164059 18567 135531 -22847 32504 67000 43920 -249410 62836
18986 63943 -161892 -98551 -172157 42471 -141920 1233 -174114 143949 -18096 -6754 -70599
18975 -70599 -188772 -82693 54855 -27684 72479 187342 -104077 257566 55520 -103808 -262527
18964 -262527 -85415 -473825 -120351 -148614 -177713 -126334 -20988 366941 406415 37493 291981
18953 291981 59588 -120974 -191300 137928 -153679 -192140 138111 51106 -117210 193697
18942 75525 182078 -57308 -260525 -20214 70082 329441 21465 161046 -41000 25942 -93230
18930 -333351 -66311 251342 -111691 -181428 -123837 51259 23216 -33009 -118577 -253215 135610
18918B05789d34539P8343a10571A43864a32389G8495a68992g4962j80819c0855
18907b18252E9936Q3704F0725e3773p7956o8623A26717J51512a54944n6198B22403
18895D2989c18312H9486b47050A686d9484n5613C77684a20684A55766a34716a8431
18883C4378K9186K70371i9013A58780D3888d6774k03104L6746e7096B3419N6395
18872G9814M0365g6455b0653k27799N7698I7628b32339h2497j94554a10347M9627
18861f0720B58341j19801a26993E5590M0332h1992m2313A35801f8514A3872a1885
18849B27675j04179c6307A08298a55605A30924b60691K2345G9528a84116i0163
18838b54739K1731h6146k29386e2016A9287J51011a08507c6044C05604A64J21469
$$ plain form
18918 205789 -434539 -356196 -110571 143864 -132389 78495 -168992 -74962 -255781 -30855
18907 -218252 59936 143640 60725 -53773 -131729 -200352 126717 278229 -154944 -211142 222403
18895 42989 -318312 89486 -247050 1686 -49484 -105097 377684 -120684 155766 -134716 -18431
18883 34378 63564 333935 -99013 158780 43888 -46774 -249878 -213132 -57096 23419 79814
18872 79814 120179 -76455 -20653 -248452 -190754 97628 -232339 -82497 -277051 -110347 -60720
18861 -60720 258341 138540 -126993 55590 95922 -81992 -124305 135801 -68514 13872 -11885
18849 227675 123496 -36307 108298 -155605 130924 -260691 -238346 79528 -184116 -90163
18838 -254739 -233008 -86146 -315532 -52016 19287 170298 -108507 -36044 305604 164 121633
18827A21633a30096p8970c3562q4711K1983I5989K44589I0770J0446P3789J09703
18816B84708a68427I0510N5226j9385f2885j23699E39265A97498p2171J0365E8294
18804B75278A05649g3708j98143g8309D3537N9563J2471c70418b0945j14929A99533
18792a57925C2804A5590J61623h254o04729a55133k68058K11512B01293l2044
18782A69249a33748A11684n2939a8520C9931c13022C2733K0137L7736f6891j32428
18771a99319C8372j4908b14443A15398a40543c6503m96496a74904O8049k379o5923
18760a75157K5728A55875e150j41960m7483G5113a33347j24795m0212j31224c7593
18748b45096j50895J40556B52244I5309C5841a58127K6960G4153b39243K5615
$$ plain form
18827 121633 -130096 -209066 -33562 -118273 -96290 95989 340578 90770 101216 175005 284708
18816 284708 -168427 90510 145736 126351 -62885 -186584 539265 197498 125327 135692 58294
18804 275278 105649 -73708 -271851 -78309 43537 103100 115571 -370418 -20945 -135874 199533
18792 -157925 32804 15590 177213 -8254 -612983 -155133 -423191 -211679 201293 169249
18782 169249 -133748 111684 58745 -18520 39931 -313022 32733 52870 90606 -66891 -199319
18771 -199319 38372 23464 -214443 115398 -140543 -36503 -532999 -174904 -106855 -109234 -175157
18760 -175157 -149429 155875 -5150 -147110 -194593 75113 -133347 -258142 -298354 -429578 -37593
18748 -245096 -395991 -255435 252244 95309 35841 -158127 -131167 74153 -239243 -213628
18738b13628l6093O9081j5235k92228B05576k4752F8865a91261f3037F5519j6006
18727D9513J31860a38522A14848e988l17842E0664b07549f1472L0257G4347a97765
18715d05334C91769d00697a77823A76815h8035Q561j52905l7025Q3685b508k51564
18704b54072h753k24878M6828A36431a2402H4862c36331A00835m8448A6885a32787
18692A1742g5216J0779I4507m1510f5047B29853p8539c00399a9081m11736g4386
18680D1703K00466j17803E090K8573i1981j9376n2793n0f9078j99858D4688a3955
18667e1295A11175c59753d8695k97001h1258r6779J7376B8129h8494G0322c12609
18655D4072a57117N3847C3800c33574f2962A40986b3045k07545A6985J12165g6023
$$ plain form
18738 -213628 -249721 -180640 -195875 -488103 205576 180824 68865 -191261 -63037 65519 49513
18727 49513 181373 -138522 114848 -5988 -323830 50664 -207549 -61472 -31215 74347 -197765
18715 -405334 391769 -400697 -177823 176815 -88035 -79474 -232379 -269404 -185719 -2508 -254072
18704 -254072 -8753 -233631 -186803 136431 -12402 84862 -336331 100835 52387 16885 -132787
18692 11742 -75216 -64437 94507 52997 -65047 229853 151314 -300399 -19081 -430817 -74386
18680 41703 242169 124366 5090 33663 -91981 -111357 -164150 -164200 -69078 -268936 44688 -13955
18667 -51295 111175 -359753 -48695 -345696 -81258 -178037 -160661 28129 -88494 70322 -312609
18655 44072 -157117 -103270 33800 -333574 -62962 140986 -23045 -230590 16985 129150 -76023
18643a12612j08608C798c43038A49164a74130H825b09469A2663d24829g416k70459
18632b77875I117J42818o0107b99795J22631C7484J62474b5920j47449A10325
18621D1867c1573k27583i038j73515e9597B82444c60324a65423A55763J148c59982
18609I3275b11994j3955e678j71176f2142l01554B04187a52539m9301G5318q780
18598F6538i7940k01116b2183k60881a33837c3455C35349q9742F2121e6158a4182
18586a98977B51943a18995L7694B88283b56095F6983b3791P837A7021a56806B44449
18574a7309l86746a48373k9144C42158c49061a24946e5000A75071K3557c1854
18563b66104C05J05814Q9758d8162A31712i1399j18578M5671F6003b1059l67035
$$ plain form
18643 -112612 -221220 3798 -343038 149164 -174130 8825 -209469 12663 -424829 -7416 -277875
18632 -277875 9117 151935 91828 -299795 -177164 37484 199958 -25920 -173369 110325
18621 41867 -31573 -259156 -9038 -182553 -59597 282444 -360324 -165423 155763 156911 -359982
18609 93275 -211994 -225949 -5678 -176854 -62142 -363696 204187 -152539 -201840 75318 66538
18598 66538 -97940 -299056 -22183 -283064 -133837 -33455 335349 245607 62121 -56158 -14182
18586 -198977 251943 -118995 -81301 288283 -256095 66983 -23791 -15954 17021 -156806 244449
18574 -17309 -404055 -148373 -177517 342158 -349061 -124946 -55000 175071 198628 -31854
18563 -266104 305 106119 195877 -48162 131712 -91399 -209977 -164306 66003 -21059 -388094
18552c88094a52798A31201f8424A26412m2984b03023r303A62718d99578J73532
18542c26046i6554A85131a42656l10889a9550j0295A96380g3076n9582b2279j58679
18531a80958K0574a7124A8216a16292A02659q262J445j3272f6356j16545O250
18520a76651G194L3580R4374E3546a14374k4191d825o7315b42E1564B0275b6058
18507C6602a81812m4160J8473F0426c67969a33115m033k07742f3004G7910c05535
18495B0174d7009k04232A55908c50994b8447q9217D33382a01800L2496m8195A36576
18483d0175B223K17760r2312J74167A3818b60578J19762A55711b8412A43040B6656
18471D723J1617c9964k17316B1863J7897P474d4598r6594B9302a61347c8771B6883
$$ plain form
18552 -388094 -152798 131201 -68424 126412 83428 -203023 -212326 162718 -499578 -326046
18542 -326046 -96554 185131 -142656 -453545 -19550 -29845 196380 -73076 -132658 -22279 -180958
18531 -180958 -160384 -17124 18216 -116292 102659 94397 95842 82570 -66356 -182901 -176651
18520 -176651 7194 40774 135148 53546 -114374 -138565 -4825 -72140 -242 51564 20275 -26058
18507 36602 -181812 -225972 -207499 60426 -367969 -133115 -137148 -344890 -63004 77910 -305535
18495 20174 -47009 -251241 155908 -350994 -28447 -117664 433382 -101800 -69304 -117499 136576
18483 -40175 2223 219983 127671 301838 13818 -260578 -140816 155711 -28412 143040 26656
18471 4723 16340 -39964 -257280 21863 39760 47234 -44598 -141192 29302 -161347 -38771 26883
18458c53534j29419f8631o9186k0914B02808c50906J64936j9643m3147A2937a83862
18446d12674f2093C683a75990I8038a97592A62461a21564j73036e5420n7128D3795
18434C8832d9963j649r3395B43045a15152j81617A53061D0392a78126a7853n02299
18423e20152b06091l6631J5366a00138G2588b23147j08689a03514r8622j18770
18413c20906a7142j8980B82702c258B72683j01137J97223E8305K37338H0865K0697
18402A01562a13896j3589G992L6217R8953b06589e5100l4058M1920R396n8675
18391i6517A18926b89060R7108A6287a6911j40948A22142a29615A21411J26525
18381B47936B9003b42004A93507O5265a43147H6125d3104H1156a91969O0334n4773
$$ plain form
18458 -353534 -482953 -68631 -137817 -158731 202808 -350906 -185970 -205613 -248760 12937 -183862
18446 -412674 -62093 3683 -175990 98038 -197592 162461 -121564 -294600 -55420 -112548 43795
18434 38832 -49963 -51612 -145007 243045 -115152 -296769 153061 40392 -178126 -17853 -520152
18423 -520152 -206091 -242722 -227356 -100138 72588 -223147 -331836 -103514 -202136 -320906
18413 -320906 -17142 -36122 282702 -3258 272683 171546 368769 58305 295643 80865 101562
18402 101562 -113896 -127485 7992 44209 143162 -206589 -55100 -89158 -47238 -37842 -96517
18391 -96517 118926 -289060 -191952 16287 -16911 -157859 122142 -129615 121411 247936
18381 247936 29003 -242004 193507 258772 -143147 86125 -43104 81156 -191969 -131635 -186408
18370a86408M358A34529a85201A25512a17779A21595B8378d9711j81378F6057
18359a09954A85982a15142j71023E7542J33753a20295b4550j07895o4548P8984
18349a18009A65851f4400K7995l43685a06103m8274K8131C64779b44434A95211
18338b22790A83864B0446L1719j7438a25238l094K7432J9837k8573A19221b00723
18326A69107a87443r6813J33899e2730G2214N7117E2134M0535b58730h0133C87433
18314d03328I4965J52182e6287c580q2051E0437a59324B23966a74216A7226J98682
18303B15908a45809L7893j55431A35140b40384J17172k31897J25363A91860a27719
18292D1590K79600d50586e8995b436j08447j8123j70252h3846g107C18019b70612
$$ plain form
18370 -186408 -182050 134529 -185201 125512 -117779 121595 28378 -49711 -231089 66057
18359 -109954 185982 -115142 -286165 57542 191295 -120295 -24550 -132445 -196993 -118009
18349 -118009 165851 -64400 -36405 -380090 -106103 -154377 -126246 364779 -244434 195211
18338 -222790 183864 20446 52165 34727 -125238 -128332 -100900 -81063 -109636 119221 -200723
18326 169107 -187443 -284256 -150357 -52730 72214 129331 52134 92669 -258730 -80133 387433
18314 -403328 94965 247147 -56287 -3580 -85631 50437 -159324 223966 -174216 17226 215908
18303 215908 -145809 -107916 -263347 135140 -240384 -123212 -355109 -229746 191860 -127719
18292 41590 321190 -450586 -58995 -2436 -110883 -129006 -299258 -83846 -7107 318019 -270612
18280B38966b57173R1534B16279f9281A09169J29445a02630B2425a10989j6452
18270a27441c4739B4770a68273l3153h424A63384D3671a38064C150J2917c7937
18258D9330c14514f265D7875a04493r9322O2628k36698h0707c1357l84244a54639
18246c62209F4386a16695e6333a7946H7936b74106J01877f0421j0530G7467K5212
18235A02679b1257q6496H9986a21889B04886I9557L483j3050d3152n9949a282
18223f7192H7827a23766H2813J22160C5863j1881K14653E5797a85501L277G039
18211C9786b27064M7812b0622l3052q455D8729a23115j12400h4099A2789g8822
18199a6539l82610I3266j994M5791k9631K5937a34120D0693h9088A43745a54583
$$ plain form
18280 238966 -257173 -165639 216279 -69281 109169 238614 -102630 22425 -110989 -127441
18270 -127441 -34739 24770 -168273 -201426 -8424 163384 43671 -138064 3150 16067 -37937
18258 49330 -314514 -6265 47875 -104493 -203815 -141187 -377885 -80707 -31357 -415601 -154639
18246 -362209 64386 -116695 -56333 -17946 87936 -274106 -172229 -60421 -70951 77467 102679
18235 102679 -21257 -107753 89986 -121889 204886 99557 103040 89990 -43152 -103101 -1282
18223 -67192 87827 -123766 82813 204973 35863 23982 238635 55797 -185501 -182224 7039
18211 39786 -227064 -179252 -20622 -53674 -62129 48729 -123115 -235515 -84099 12789 -78822
18199 -16539 -399149 93266 91272 137063 107432 133369 -134120 40693 -89088 143745 -154583
18187B45864b59705I1889a1696B17168b27909f8350k49757R6273O1226O5568A3061
18175a75457N0229G4245a07624A50070p0473b6317p1185J5840O396A6161R7646
18164A13807a32427B38514D4909A3076J2247M5297a12098l08958a20348F8075
18153b64744N448f2764j56270B0332d61410a11861j9380C2697E117P8255b52825
18141c01433J21308A29544J47191e19829B22455d4736A13458i372r6282m1277
18131a46931B05246a8273C56196A54765b05589R8765A4903c78471F9451k5911
18121D3540b54443j00465g6030A2572L9859P298b15246A44370B9266J99357a12461
18109B37715h1327E7411c9240k14215N3774j2326K5563p5652l2736D693a28226
$$ plain form
18187 245864 -259705 91889 -11696 217168 -227909 -68350 -318107 -221834 -160608 -95040 13061
18175 -175457 -125228 74245 -107624 150070 79597 -26317 -97502 -81662 -75266 16161 113807
18164 113807 -132427 238514 44909 13076 25323 70620 -112098 -421056 -120348 68075
18153 -264744 -259296 -62764 -219034 20332 -461410 -111861 -131241 32697 5117 83372 -252825
18141 -301433 -180125 129544 276735 -519829 222455 -44736 113458 -9372 -105654 -146931
18131 -146931 205246 -18273 356196 154765 -205589 -106824 14903 -378471 69451 43540
18121 43540 -254443 -354908 -76030 12572 52431 59729 -215246 144370 29266 228623 -112461
18109 237715 -81327 57411 -39240 -253455 -199681 -212007 -186444 -262096 -294832 4693 -128226
18097C22810b5545C9749L494c29756h8898j04316d9861k56375h636l670B59342
18085b19899d0335j09885d1329A06217a19770J463j961m6361B82382e23338A54791
18073A57538a0831B879f8735E2339J1330B6294a46899A50797b03626R2385k7840
18062a39081C13331j35663K4854H1498P8240a50238b2387A14226a95272L663k5451
18051b17060e3677k8889n3987j79329H855C101b17129I4969a29694G5193F791
18039g4020B14823f7449A18000h5789A17199c08472B9268G298f6778A83798d7482
18027a5397H7218A766J80802m4677d1132G2821a13451F358g5980k34997A36634
18015c02203f6499k17389G2126h8073o4767d538A09812D327M5400b19229A26274
$$ plain form
18097 322810 -25545 39749 43243 -329756 -88898 -193214 -49861 -306236 -8636 -12306 259342
18085 -219899 -40335 -150220 -41329 106217 -119770 -118307 -120268 -166629 282382 -523338 154791
18073 157538 -10831 2879 -68735 52339 63669 26294 -146899 150797 -203626 -111241 -139081
18062 -139081 313331 177668 202522 81498 159738 -150238 -22387 114226 -195272 -191609 -217060
18051 -217060 -53677 -82566 -136553 -315882 8855 3101 -217129 94969 -129694 75193 6791
18039 -74020 214823 -67449 118000 -85789 117199 -308472 29268 7298 -66778 183798 -47482
18027 -15397 87218 1766 182568 137891 -41132 72821 -113451 6358 -75980 -310977 136634
18015 -302203 -66499 -283888 72126 -88073 -152840 -4538 109812 4327 49727 -219229 126274
18003B8811K8666R831j1934J42870D1116L07673g6941c8082J9026A68426h4846
17991A69722g3403k2407I2379a46605F3862J00954c7559a3795B6618L6309J28076
17980A91003J58663a21550A4007K35046a88949q674D2632a68069A51476E2857
17969c07664a48113b1634A89805p9131J520i8750B1373b83240M7097f0505A25129
17957a58372B80724H9062i58H0435L1364d41m7608j58494i2461c7520C36631I5771
17944b84127B32771i3655D4773a46408j1897j71199D0787L8874b37309q5065J20707
17933b01667L5363k54340g9092n7693B22641A04706L89785a84309K723h8068R196
17922g8872m6639l21669C43584a39776A33826i2895C6944J36452J13474a47528
$$ plain form
18003 28811 57477 67308 55374 198244 41116 348789 -76941 -38082 -19056 168426 -84846
17991 169722 -73403 -95810 92379 -146605 63862 164816 -37559 -13795 26618 62927 191003
17980 191003 349666 -121550 14007 249053 -188949 -197623 42632 -168069 151476 52857
17969 -307664 -148113 -21634 189805 110674 112194 -98750 21373 -283240 -236143 -60505 125129
17957 -158372 280724 89062 -958 80435 111799 -441 -48049 -206543 -92461 -37520 336631 95771
17944 -284127 232771 -93655 44773 -146408 -158305 -329504 40787 79661 -237309 -322374 -201667
17933 -201667 -166304 -420644 -79092 -136785 222641 104706 494491 -184309 -181586 -88068 -78872
17922 -78872 -125511 -447180 343584 -139776 133826 -92895 36944 173396 286870 -147528
17911A57015N8440j02563h6142l20863J84565b7650k79775a6580A83417h3702
17900a46078l79038a27758j34966e0707B12025N9552a7736g551q2356H8350J24977
17889B13327D5571B816f2395G4206M27041a17576l3626A01602M2566L36167a09419
17877b06240h0018j11400C62345G4031a95638A40946J37407J4284A03494J23427
17867B26921F3727a33871F8181g1425c4071A61596K02477E0702a29034L2878C53464
17855a12075A52094c891n7213J5517K836C26803D2831J4073J39984a11264k86646
17844c97910a31434j08593B6919b13845M24r038B18418I4062a4383j87757q9730
17833b91870a16745A30983c4306k33668a9170A09585a63898E6658b24037k34001
$$ plain form
17911 157015 215455 112892 -86142 -407005 -222440 -27650 -307425 -16580 183417 -83702
17900 -146078 -525116 -127758 -262724 -50707 212025 271577 -17736 -7551 -89907 88350 213327
17889 213327 45571 2816 -62395 74206 501247 -117576 -151202 101602 144168 480335 -109419
17877 -206240 -80018 -191418 362345 74031 -195638 140946 278353 292637 103494 226921
17867 226921 63727 -133871 68181 -71425 -34071 161596 364073 50702 -129034 -96156 353464
17855 -112075 152094 -3891 -61104 -45587 -42751 326803 42831 56904 196888 -111264 -397910
17844 -397910 -131434 -240027 26919 -213845 -213421 -222459 218418 94062 -14383 -202140 -291870
17833 -291870 -116745 130983 -34306 -267974 -19170 109585 -163898 56658 -224037 -458038
17823d58038c0463k50900b6939k24964h196H531M7147a11688B02362d9667k73644
17812c23311J33595L5512o9735F2877R057b02814k9765A52882c37683A9604g735
17800G3331J73800a334j63641A45176h9715r6310F0424B5989a86244e8935j31951
17789a90886c9565C9871g6164j56297I9771h0316j33488P834a6784j1370D2902
17777a3342A7990O1974B5920a61691c5290l15387A39574K54130H3444a90959h0975
17765a88504e9553B28211l5391b30256B77769n1744b5233B21485b2990A46506
17754e8200B98481A04781J61105a82152B22882a76537f9340C2477a11547B58008
17743C8651J2858R8082B1022b24038k21315b7701A66012f0783r1289o864f5262
$$ plain form
17823 -458038 -30463 -281363 -26939 -251903 -8196 8531 55678 -111688 202362 -49667 -323311
17812 -323311 -189716 -154204 -223939 62877 71934 -202814 -232579 152882 -337683 19604 -7735
17800 73331 247131 -1334 -164975 145176 -89715 -186025 60424 25989 -186244 -58935 -190886
17789 -190886 -39565 39871 -76164 -232461 99771 -80316 -213804 -205970 -16784 -28154 42902
17777 -13342 17990 79964 25920 -161691 -35290 -350677 139574 393704 83444 -190959 -80975
17765 -188504 -59553 228211 192820 -230256 277769 226025 -25233 221485 -22990 146506
17754 -58200 298481 104781 265886 -182152 222882 -176537 -69340 32477 -111547 258008
17743 38651 51509 149591 21022 -224038 -445353 -27701 166012 -60783 -152072 -158936 -65262
17731G9427a77656h3516j62233A98909K2559a27241c210j94717M2612j17468d2763
17719A50103F2143K43664a96372a1753l63940e8465E4454J31205j5638a94992
17708B5433j1460a34825I2806P9015a20894A56960a23036j42031A52497N8879
17698B11376a22008D57917A55662D3675i0870a9890j03261a2846m5643l5276b6740
17686a99049R3141A49328N987e5369q2305G9781P1351B0108J53496N233a00245
17674A61392r663a14616A40861e9399j85810J16041b2386j54204A90007a652j25151
17663a26803B67927c23201A95831b18456P7055C08722b88777i1930B99352a41125
17652c9241A46090j8549J12898a03789A65275J33464c8328n5606E5136R4229I329
$$ plain form
17731 79427 -177656 -83516 -245749 198909 221468 -127241 -3210 -197927 -155315 -272783 -42763
17719 150103 62143 305807 -196372 -11753 -375693 -58465 54454 185659 170021 -194992
17708 25433 13973 -134825 92806 171821 -120894 156960 -123036 -265067 152497 211376
17698 211376 -122008 457917 155662 43675 -90870 -19890 -123151 -12846 -58489 -93765 -26740
17686 -199049 -105908 149328 155315 -55369 -137674 79781 151132 20108 173604 178837 -100245
17674 161392 151729 -114616 140861 -59399 -245209 -129168 -22386 -176590 190007 -1652 -126803
17663 -126803 267927 -323201 195831 -218456 -141401 308722 -288777 -91930 299352 -141125
17652 -39241 146090 127541 240439 -103789 165275 298739 -38328 -93934 55136 149365 9329
17640b25226C8597c83223Q5410A01117D257K51601H336g3053n8508H307J580a6304
17627b8783A10926b3167j5725k9921I2538k7851J23526E5616J93705a4354I212
17615A92742c1276J1420L677I8065a45789p7312B33844f2860k6330b7675b5k28298
17603b28323H2693b7003A12914b6412j96247E5324c6617C09603b14978A82108
17592A9798Q9868B2192a74212A86536D6742J44969M4280f4139B1696a17459o835
17581a24294c0319B38613a06034M4577n3027A11374K3583J74100b16703D39520
17570B6480O7054J5809i2476F6697K14425a68989A3438e9897d591H3937f7531
17558F1791d8754k85201B10560C0972J85499B3741K23345l399b81333G4706K09712
$$ plain form
17640 -225226 38597 -383223 -297813 101117 4257 255858 8336 -73053 -131561 8307 9887 -16304
17627 -28783 110926 -23167 -38892 -68813 92538 64687 188213 55616 249321 -14354 9212
17615 192742 -31276 -19856 -16179 98065 -145789 -223101 233844 -62860 -89190 -27675 -25 -228323
17603 -228323 82693 -27003 112914 -26412 -222659 55324 -36617 309603 -214978 182108
17592 19798 109666 22192 -174212 186536 46742 191711 235991 -64139 21696 -117459 -124294
17581 -124294 -30319 238613 -106034 -61457 -114484 111374 134957 309057 -216703 439520
17570 26480 93534 109343 -92476 66697 281122 -168989 13438 -59897 -4591 83937 -67531
17558 61791 -48754 -333955 210560 30972 216471 23741 247086 243687 -281333 74706 284418
17547B84418j14028d3058r4013L0975H2082J91459r6653b9644G8163a80339Q3168
17536i7171C6307K3137P6342B7226b01940A26644i2193H9249c5839C34564a28175
17524A7325J58115J56677f0830A10889A9908f9743L0938k41713A1243Q7447l250
17513I5440K0956a90070C49880A48961c59094J05721A27375K25012A76055K7413
17503B03468K0132c3553k81492E4070a43949C40370H5870J43865N729K33115c80974
17491a17943H7758a8276j5385B11925p1812F2321j1918d5286A16178P2052G1186
17479A45808m615J37982E9396J34373a14989H2621J45164L7634a18004C67338
17468C60288J8586I9747a0983j28550A69535L6356a36779A85849c953B48843b35839
$$ plain form
17547 284418 170390 -43058 -137071 -106096 82082 273541 176888 -29644 78163 -180339 -97171
17536 -97171 36307 59444 135786 27226 -201940 126644 -92193 89249 -35839 334564 -128175
17524 17325 175440 332117 -60830 110889 19908 -69743 -38805 -280518 11243 98690 95440
17513 95440 116396 -190070 349880 148961 -359094 -253373 127375 352387 176055 203468
17503 203468 223600 -33553 -315045 54070 -143949 340370 85870 229735 235464 468579 -380974
17491 -117943 87758 -18276 -33661 211925 140113 62321 50403 -45286 116178 188230 71186
17479 145808 141193 279175 59396 193769 -114989 82621 227785 265419 -118004 367338
17468 360288 378874 99747 -10983 -139533 169535 205891 -136779 185849 -3953 248843 -235839
17456f2393A25363l2952J94953B6741c0732m7104H4920L31108j52546B3975f238
17444A20557Q7064F393N9591K64159L3497a2137C21911L7248Q8691j63253D996
17432C99287j73796h8619A9721M35011j46496A25615n1292R2247m4804N8017F3593
17420b18187A0004L5363J14167K80086A30718L42992A4959K93067j26536K47062
17410D28552K46424B70631I8798M6752Q7704J46915c38551B21616a49035A99731
17399C15976j158e6864A40252J38448A37241L8090m8810l0348J82628G0295M5880
17388A16175Q8821n5809c4826A00432J82697N0873J80930C1298J47890N9804A18866
17376g6540o9839C94519A93327J07805J56421j52028A35405f0789A50645A4785
$$ plain form
17456 -62393 125363 92411 287364 26741 -30732 -77836 84920 416028 263482 23975 -6238
17444 120557 207621 6393 65984 330143 363640 -12137 321911 359159 447850 284597 4996
17432 399287 225491 -88619 19721 454732 308236 125615 74323 166570 121766 179783 63593
17420 -218187 10004 45367 159534 439620 130718 473710 14959 308026 181490 428552
17410 428552 674976 270631 98798 145550 233254 380169 -338551 221616 -149035 199731
17399 315976 314818 -56864 140252 278700 137241 175331 126521 96173 278801 70295 116175
17388 116175 204996 149187 -34826 100432 283129 334002 514932 31298 179188 238992 118866
17376 -76540 -146379 394519 193327 301132 457553 305525 135405 -60789 150645 14785
17365b27100A19290j0881b14796B26387A6269Q2734M1093G852Q0309d6136A24029
17353c1733A61219N598a17383B20288K06246A96163q1656a2163b023k87753B23648
17341B13088o7888J18339i7464D20946j43905f3835A55523J41342O490r0488J22248
17330C35115A65450p9530J75203G4973m613J06207D9772a84814F735Q9824P7178
17319A73737k4883Q273K87449I1152J88347a41739C2517J39961L33585b70447
17308A92731Q9869o4056B5701J12414l5893B9160a8281j54421A98869K95864B11352
17296A34381M4601d0572B6184K38130f8103B51751j15008J03409d0640C54352
17285a39940A14351K65284C2540J37859J51766R6295I7175i4313H0211a9311B38308
$$ plain form
17365 -227100 119290 108409 -214796 226387 16269 99003 140096 7852 88161 -46136 124029
17353 -31733 161219 166817 -117383 220288 426534 196163 114507 -12163 -2023 -289776 223648
17341 213088 145200 263539 -97464 420946 277041 -63835 155523 296865 303355 212867 335115
17330 335115 165450 85920 261123 74973 70360 176567 49772 -184814 6735 96559 173737
17319 173737 148854 157127 444576 91152 279499 -141739 32517 172478 506063 -270447
17308 192731 282600 218544 25701 138115 102222 29160 -18281 -172702 198869 494733 211352
17296 134381 178982 -40572 26184 264314 -68103 251751 136743 240152 -40640 354352
17285 -139940 114351 379635 32540 170399 322165 418460 97175 -94313 80211 -19311 238308
17273B35348a49563C12730h062C59512A12027D5727J6181b6344E1613J19915a12173
17261C01325j3714f2501B99518j06272K85806B29731b85972A83649K42462A21467
17250B81954i5752E4400L5988J25047n7323J63287r1520J17661G2354b16711A33629
17238A15857J95078j23614e2484C00147H2211J84529r4491J42922R1086o0707
17228C45550d7632G1451J10942e2143B71130m5710a92049B21894K9558Q780o3967
17217A96265K40760B14091a24602C04636l1390J62821h1255C00769J98752A91644
17206D09799A05434L08130A60204P9256A06487k3068n877J64953J25974J4945
17196C83414j36550r2398J27969A18953J71139j09145K04611A65727J50693p9570
$$ plain form
17273 235348 -149563 312730 -8062 359512 112027 45727 61908 -26344 51613 171528 -112173
17261 301325 287611 -62501 299518 193246 479052 229731 -285972 183649 426111 121467
17250 281954 -95752 54400 90388 215435 158112 321399 229879 347540 72354 -216711 133629
17238 115857 310935 187321 -52484 300147 82211 266740 172249 315171 406257 345550
17228 345550 -47632 71451 182393 -52143 271130 225420 -192049 221894 251452 260232 196265
17217 196265 437025 214091 -124602 304636 273246 436067 -81255 300769 499521 191644
17206 409799 105434 413564 160204 239460 106487 83419 77542 242495 368469 383414
17196 383414 246864 154466 282435 118953 290092 180947 385558 165727 316420 236850
17186B36850h4359B39435O5666A26171J92305J34005m7442j55721I1039K4068
17176A15107J14959m2701K62702A12079J89207j15563p4273l7134J46476O493
17166B27285K16142G8434K00644q7851J18728a14842D38666A52168A9132K89829
17156C08961k4549A39566p46A3845M20894j29772J43492r5255O0884j9314A55849
17144b2799D31493A43845J05492j10379J36175I9320J28328Q5517m6066m9476
17134B17623K78917j82243a5871A8430J49625J90411J83143j65426q0375a3571
17123C56812K4338L3500G9332N5355K31913i0999C95464I959M01400n4991j07255
17112B49113R9224J02085n5236P6974j13020M2274K9516J64251A81844J36204
$$ plain form
17186 236850 -84359 239435 305101 126171 318476 452481 405039 249318 91039 115107
17176 115107 230066 187365 450067 112079 301286 185723 111450 74316 220792 227285
17166 227285 443427 78434 279078 191227 309955 -114842 438666 152168 19132 308961
17156 308961 284412 139566 138820 13845 434739 304967 448459 353204 414088 394774 155849
17144 -22799 431493 143845 249337 138958 275133 99320 227648 313165 267099 217623
17134 217623 496540 314297 -15871 18430 168055 358466 541609 376183 295808 -13571
17123 356812 381150 414650 79332 134687 366600 -90999 395464 9959 411359 356368 249113
17112 249113 348337 450422 395186 472160 359140 401414 430930 595181 181844 318048
17102C18048M9603j60327K0100J6078l1077L98562j86102q4813o1150A08278J76735
17091B85013J06326n2963k5970A46035N63290A67582L46322j9751j2345B12935
17080G415L18470k9064Q1803J21576k205K33641A54252M01354k24146O0429R575
17069D01464K42104j29195j16100j7760A12094K98351K31007n0202k77749K87965
17059F01466j37488p5721J5597K74734C20100N04631l88730j86252K72401n3551
17049D68599j4361K62766l36819J9884J85511j60503j49326q1005M96645k04223
17039D87168L00712B85714P160K89138k67926K54744p3960J00963B71918K59509
17029E31427j10448K32130J16040k27208l7055J76226J5881k46543K95909Q6254
$$ plain form
17102 318048 367651 207324 227424 243502 212425 610987 424885 340072 278922 108278 285013
17091 285013 391339 338376 312406 146035 709325 167582 513904 494153 481808 212935
17080 7415 325885 296821 378624 500200 497995 731636 154252 555606 331460 391889 401464
17069 401464 643568 514373 398273 380513 112094 410445 641452 591250 313501 601466
17059 601466 463978 388257 403854 678588 320100 824731 436001 249749 522150 468599
17049 468599 454238 717004 380185 400069 585580 425077 275751 194746 691391 487168
17039 487168 787880 285714 292874 582012 314086 568830 494870 595833 271918 531427
17029 531427 420979 653109 769149 541941 504886 681112 696993 450450 746359 832613
17019H32613l38608J12775B97326J97950K55891l25749j07352J43874Q2390O6222
17009F10552j3167k36466P6193K49489L0985J67965k52163M5926j80875J80898
16999F79337m0575C14317J45946M3236M99387j44630l93975R2566K1176k38500
16989C39523K65281M9303L86388k68833J58432j23061N4296p3073k0270L3612
16979H01598j79515L06533k81672K4442J37830r4156K36095j58583L96171l22736
16969H66007J390P7465L59547l57270j9533k32096J73273p4267L29828l16256
16959H08088O9382k61344K59045l49441J89900J52357K38259n46178L33926J03799
16949I97793k37315P3733J44907J81067j71286J08717n6226l85549P03340l99152
$$ plain form
17019 832613 494005 606780 297326 495276 751167 425418 318066 461940 544330 610552
17009 610552 597385 360919 437112 686601 717586 885551 633388 679314 498439 679337
16999 679337 638762 314317 460263 503499 1002886 858256 464281 556847 578023 339523
16989 339523 604804 654107 1040495 771662 930094 807033 861329 788256 767986 801598
16979 801598 622083 928616 646944 671386 809216 715060 951155 792572 1188743 866007
16969 866007 867397 944862 1304409 947139 927606 695510 868783 794516 1124344 808088
16959 808088 877470 616126 875171 525730 715630 867987 1106246 560068 893994 997793
16949 997793 760478 834211 979118 1160185 988899 1097616 1041390 655841 1359181 960029
16939I60029r2962K45859j62461q7771K81900L78287k38839P1126j57606m93830
16929G03732K56908K50518K71989K46413k14995j84908l79089O95003k32147k68094
16919A145330M8499J27168r1665K05699K08697k12871j04946O8436J72095l1216
16909A535226l54606J64646O1387K0652L46213k98702O1946o89j57905K16400
16899A594568J33723k50190N80475m11725K54506o8091R1965j07040l20921J28692
16889A625962L81220j77039j09816Q2131J13144j62511J69428k59106K69982j33537
16879A799858J56032L5074j22187k3060M67749o11171N62653l09135M14293m69270
16869A900836N25682l65139j06216N09375Q7314k94161K40634N778J63629J77446
$$ plain form
16939 960029 867067 1112926 950465 862694 1144594 1522881 1284042 1355168 1197562 703732
16929 703732 960640 1211158 1483147 1729560 1514565 1329657 950568 1645571 1413424 1145330
16919 1145330 1193829 1320997 1229332 1435031 1643728 1430857 1325911 1394347 1566442 1535226
16909 1535226 1180620 1345266 1406653 1427305 1773518 1474816 1536762 1536073 1378168 1594568
16899 1594568 1728291 1478101 2058576 1646851 1901357 1833266 1925231 1818191 1497270 1625962
16889 1625962 2007182 1830143 1720327 1802458 1915602 1753091 1922519 1663413 1933395 1799858
16879 1799858 1955890 1990964 1868777 1845717 2313466 1702295 2264948 1955813 2370106 1900836
16869 1900836 2426518 2061379 1955163 2464538 2551852 2257691 2498325 2504103 2667732 2845178
16859B845178m67539L86939k67757K49085o0158L34135m75716K32527Q6786J57316
16849C020796J01086q4K29068j92375k05194M22963n5299m1303J9905K60303j57029
16838C402837M53362m70574K26377N4621K08144l50942N21319m26687L00359K71477
16828D190293l20290K80353l927L96813j80480j5347N83803k87014J12937n2668
16818D704473L63536N144j28889K16114L795L68920L80626k78684Q6771M8011
16808E769817L10447j40069N49606k19933J22246M06716J41184O1824L38194j35188
16798G204844P2945K62698J12255K20584M09941M5935J45262K97186L47249K86499
16788I405398M18325k6338K11493N67459j17880N53070M46343J86058j00903P06157
$$ plain form
16859 2845178 2377639 2764578 2496821 2745906 2685748 3019883 2544167 2776694 2863480 3020796
16849 3020796 3121882 3121798 3350866 3158491 2953297 3376260 3320961 3279658 3299563 3559866 3402837
16838 3402837 3856199 3385625 3612002 3666623 3874767 3523825 4045144 3618457 3918816 4190293
16828 4190293 3870003 4150356 4146429 4543242 4362762 4347415 4931218 4644204 4757141 4704473
16818 4704473 5068009 5073153 4944264 5160378 5164173 5533093 5913719 5635035 5721806 5769817
16808 5769817 6080264 5940195 6489801 6269868 6392114 6798830 6940014 7001838 7340032 7204844
16798 7204844 7277789 7540487 7652742 7873326 8283267 8329202 8474464 8771650 9118899 9405398
16788 9405398 9823723 9797385 10008878 10576337 10458457 11011527 11457870 11643928 11543025 12249182
16778A2249182L31936P01402J80317J37500M54918N57893M73318N05939P53866
16769A6346271O10410N71046L39267P03811O74768M13669J372855L64629P24470
16760B2121196J047173J022136R62967J114407R79107J314990J157159J019700
16752C0738835J686342J688848J654496J551261J496647K306846K113087J982428
16744D5218790K766826K445202K635838K965726L482105L258031L698788L488304
16736F9959610M565030M330039M706349N313351N168619O023655N641847O562671
16728A12271171O572231O825914P474147O825704P134420O882206O908758O177399
16720A67071950N643253M740807M060262K679005J460826J76874q01985k221126
$$ plain form
16778 12249182 12581118 13282520 13462837 13600337 14055255 14613148 15086466 15592405 16346271
16769 16346271 16956681 17527727 17866994 18570805 19245573 19659242 21032097 21396726 22121196
16760 22121196 23168369 24190505 25153472 26267879 27246986 28561976 29719135 30738835
16752 30738835 32425177 34114025 35768521 37319782 38816429 41123275 43236362 45218790
16744 45218790 47985616 50430818 53066656 56032382 59514487 62772518 66471306 69959610
16736 69959610 74524640 78854679 83561028 88874379 94042998 100066653 105708500 112271171
16728 112271171 118843402 125669316 133143463 139969167 147103587 153985793 160894551 167071950
16720 167071950 172715203 177456010 181516272 184195277 185656103 185832977 185030992 182809866
16712A82809866l452245m672989n004454o276268o684043o797096p322037p332075
16704A35268659p234001o999985o849994o705261o145511o245282n405097n451853
16696H4231675m828516m444658m556109l514914m155923l417474l459583l052261
16688E2802237l024747k203678k729454k488745j944329j970734j840923j626738
16680C4972889k038742j130021j451242j486786j294648j056904r10324j575685
16672B4028537o82247j270143p19195p28097o54897p92295j073967n32121m50007
16663A7125568p77261m02387o28713p40040l53043m03682n19041l65033m13128
16654A2523240k35911l76892o44838J2419k72345p00529l8616l64494l4791n75570
$$ plain form
16712 182809866 179357621 174684632 169680178 163403910 156719867 149922771 142600734 135268659
16704 135268659 128034658 121034673 114184679 107479418 101333907 95088625 89683528 84231675
16696 84231675 79403159 74958501 70402392 66887478 62731555 59314081 55854498 52802237
16688 52802237 49777490 47573812 44844358 42355613 40411284 38440550 36599627 34972889
16680 34972889 32934147 31804126 30352884 28866098 27571450 26514546 25604222 24028537
16672 24028537 23346290 22076147 21356952 20628855 19973958 19181663 18107696 17575575 17125568
16663 17125568 16348307 15945920 15317207 14577167 14224124 13820442 13301401 12936368 12523240
16654 12523240 12287329 11910437 11265599 11278018 11005673 10305144 10266528 9902034 9867243 9291673
16644I291673k21862k36649k65080n8208m72948j60721k43480j34725n4127m60620
16634F983253j5948m48720j44179J89467m46052J50040k88851l39692L58049j93926
16624E803441m86119K70762m85908K84339n39751N78186p39251J00750k22660
16615D563789K45919k31174m24335J2441m2249L4418j65817K9181j71443k9290
16605C821440m7642k2426m04815J43306k97694M90554k45997k76649J6459j62657
16595C013879r3566M10593l86715k07667L23982J20632k15198n30117M07904r4346
16585B749381L0704m80328L00095l86273O91704l48169k18572j63780j76820J85097
16575B183039J9728m9228J83467j90762M5646j08281j35673j23313J71801O0369
$$ plain form
16644 9291673 9069811 8833162 8568082 8509874 8036926 7876205 7632725 7498000 7443873 6983253
16634 6983253 6967305 6518585 6374406 6563873 6117821 6267861 5979010 5639318 5997367 5803441
16624 5803441 5317322 5588084 5102176 5386515 4846764 5424950 4685699 4786449 4563789
16615 4563789 4809708 4578534 4154199 4166640 4124391 4158809 3992992 4022173 3850730 3821440
16605 3821440 3773798 3751372 3346557 3489863 3192169 3682723 3436726 3160077 3176536 3013879
16595 3013879 2920313 3330906 2944191 2736524 3060506 3181138 2965940 2435823 2843727 2749381
16585 2749381 2780085 2299757 2599852 2213579 2905283 2557114 2338542 2174762 1997942 2183039
16575 2183039 2202767 2153539 2337006 2146244 2191890 2083609 1947936 1824623 1996424 2056793
16565B056793l94947J17347p4911J77889j3010K03626j27488j42380L3724o7294
16555A769349j16848m8309M4289K51273k02778J32422l32386n7448K00351k0278
16545A619637j31489J88285k55544J7451J71884j83662m8702J24506k75983j96562
16535A029821L12638L8145j89728j1593L13571k43167j91004J64196J89720J27912
16525A540511n16286j06023r1575J73612j90839L39382j16016J98732J71936n60283
16515H43151r7216M4719M03158l81255J44815K84446j36283j58758m57771M36413
16505I25419J48256j53734L6945J01395j40518J25780j96184j82184L07337j08732
16495H63780j44333K2753J81671j23599k53185N02014j10351l11049N00311E19786
$$ plain form
16565 2056793 1661846 1779193 1704282 1882171 1869161 2072787 1945299 1802919 1836643 1769349
16555 1769349 1652501 1604192 1648481 1899754 1696976 1829398 1497012 1439564 1639915 1619637
16545 1619637 1488148 1676433 1420889 1438340 1610224 1426562 1377860 1502366 1226383 1029821
16535 1029821 1342459 1380604 1190876 1179283 1492854 1249687 1058683 1222879 1412599 1540511
16525 1540511 1024225 918202 826627 1000239 809400 1148782 1032766 1231498 1403434 843151
16515 843151 745935 790654 1193812 812557 957372 1241818 1105535 946777 489006 925419
16505 925419 1073675 919941 956886 1058281 917763 1043543 847359 665175 972512 863780
16495 863780 719447 742200 923871 800272 547087 1049101 938750 627701 1128012 519786
16484F59203P8837l35223N59672k36684M4764p4491j23329J73757o0662j09576
16474E76268k7569M90338k83844j87667J35288p5896K74825C86270j5915M3889
16464D14244p3338M39432k92205q3911p1431L27475k10860J9138L27183k72696
16454E23031k2350J91236k54382K80639j77397B38762L28078M8937l2618R4056
16444F77215k72852q2666K20866N4264J43019j69793q876B20797L75765l8593
16434E57969k57841J46638B18072J44617K1593F0441J20911n8760c2244E34359
16423C30539A44795J70067J98942A26952K73421k3409A87595J33565J45664m6252
16413D20572o3848q7252L4829a00119E06378B03275M75993B27190Q7733m358A04452
$$ plain form
16484 659203 738040 402817 962489 725805 770569 696078 572749 746506 685844 576268
16474 576268 548699 1039037 755193 567526 702814 626918 901743 386270 370355 414244
16464 414244 340906 780338 488133 404222 332791 660266 449406 468544 795727 523031
16454 523031 500681 691917 437535 718174 540777 238762 566840 615777 583159 677215
16444 677215 404363 321697 542563 596827 739846 570053 561177 220797 596562 557969
16434 557969 300128 446766 218072 362689 384282 60441 181352 122592 -32244 534359
16423 330539 144795 314862 513804 126952 400373 376964 187595 321160 466824 420572
16413 420572 356724 269472 304301 -100119 506378 203275 679268 227190 314923 310565 104452
16401I8528K5114P1865K70536R0004q0385j67741J38772j84416A18278J46581
16391B64859K88071I1227M62854j6877I1672N1615L20382A35390c5292C57023
16380D60820q5279J89977I4606K21150A41263J22901k1230Q9632j60951L997L1303
16369B06915J814K96748k03011J9758j51600j6019l2667m7186M6924K29721O5580
16358D16977K9956A94862J15583a32902D7108M11472E1260L64171A91539J32399
16348C23938a14806A55344R2288d2783G1920K77126E1460E440K73302N2163A36449
16336C8670K66703q9124k632R988L5677m7656J45419N1614a03264C67763f3919
16324A43315L9361a42413I0200c74119A02791L1589n4707J21072J06026q9421
$$ plain form
16401 98528 123642 195507 466043 556047 475662 307921 446693 262277 118278 264859
16391 264859 552930 91227 554081 537204 91672 143287 463669 135390 -35292 357023
16380 460820 375541 565518 94606 315756 141263 264164 242934 332566 171615 175612 206915
16369 206915 208729 505477 302466 322224 170624 154605 121938 74752 121676 351397 416977
16358 416977 446933 194862 310445 -132902 47108 458580 51260 415431 191539 323938
16348 323938 -114806 155344 247632 -42783 71920 349046 51460 5440 278742 330905 136449
16336 38670 305373 216249 213617 223605 259282 211626 357045 408659 -103264 367763 -63919
16324 143315 182676 -142413 90200 -374119 102791 134380 79673 200745 306771 217350
16314B17350j01937a35777C08557a0369C88517A26599n9677J16390p3390C5990
16303f3147B52415C6728P3161C5113a8606F5520L9677J16453e6343D0678K94312
16292C34990d3692n0809A23818C2571K5880b1342A19940D4833d4702A26862b6980
16280C41731c6739D78915A26886L14544B09180i0583R891H0487A4969O5195J48505
16269B28669C7462J43416G0996P9829A4410L9474M4639k8907C3051J39220i4585
16257E2660d634j80349E7966i5052A44465a54728G8748b44839c4199I0999Q4463
16246A75462d0607D9116a15367A17661Q6762i2425A32277c2842C29862A57068
16235a97856A21540J49308h96E984e9492A11037a04601C32032E3316L72252H3871
$$ plain form
16314 217350 115413 -135777 308557 -10369 388517 126599 66922 183312 109922 35990
16303 -63147 252415 36728 109889 35113 -18606 65520 105197 221650 -56343 40678 334990
16292 334990 -43692 -94501 123818 32571 58451 -21342 119940 44833 -44702 126862 -26980
16280 341731 -36739 478915 126886 441430 209180 -90583 -80692 80487 14969 80164 228669
16269 228669 37462 180878 70996 150825 14410 53884 98523 69616 33051 172271 -94585
16257 52660 -4634 -184983 57966 -95052 144465 -154728 78748 -244839 -34199 90999 175462
16246 175462 -40607 49116 -115367 117661 204423 -92425 132277 -32842 329862 157068
16235 -197856 121540 270848 -896 5984 -59492 111037 -104601 332032 53316 425568 83871
16223A73373Q4339j16350h9810A86294h1249r0295I0473a73138C23296j09874
16213B13422f0480A2527h0458B07033k3396o6830J1971a45623B44951C6324J47409
16202A83733J14210a96211g1342j95955f0231j60165H4756L04209a31030l6160
16192a67190a6442C62611b1521A22522L05655j1792I3635b1096p3478C72859J20871
16181D93730a01939c5519A8031Q9764a9087q4507j26206j98378B78906o4723a72529
16169C0978c7738F7075e8241B33472B4838h9636C1401a92500F4590b84872E4731
16157b68383F990a4020F0282J95285b79573A48799B107J0733J76626H3025L28968
16146D11993j19695D5091e7221A47578n1294j1895a76670A03946K0223b76322
$$ plain form
16223 173373 257712 141362 -89810 186294 -81249 -171544 90473 -173138 323296 213422
16213 213422 -60480 12527 -80458 207033 183637 116807 128778 -145623 244951 36324 183733
16202 183733 297943 -196211 -71342 -267297 -60231 -220396 84756 388965 -131030 -167190
16192 -167190 -16442 362611 -21521 122522 428177 416385 93635 -21096 -94574 372859 493730
16181 493730 -101939 -35519 18031 107795 -19087 -103594 -229800 -428178 278906 214183 -172529
16169 30978 -37738 67075 -58241 233472 24838 -89636 31401 -192500 64590 -284872 54731
16157 -268383 6990 -14020 60282 255567 -279573 148799 2107 12840 189466 83025 411993
16146 411993 292298 45091 -57221 147578 96284 84389 -176670 103946 124169 -276322
16135A65338C9032c4573A8489J80259c60246A24184C8492A3556h559A34002b96756
16123C36898L7216A80688a2913C4790c90284m3867d6560f761m3125B70720G3812
16111B80492H1077f8144a7781p4607j96011h9121C8800h6570A67321L1383O6669
16100B65373B0466N4727L3075Q2931a71353I0463d6219j42724k5180A34179j9412
16089A14767e9100j72060i9924A05366B8396c5369G2530B7640b79171g302A27607
16077a05005p282M1427j24834K1594M1515A74615f6923B20878l4621a4586B56012
16065d0367k85845k60784A59208f9285r3716m0044R4477A5024r41J1782b29542
16053c40159C7916a20288B60031f9979B64691b50159A29955E6350a15068M2976
$$ plain form
16135 165338 39032 -34573 18489 198748 -360246 124184 38492 13556 -8559 134002 -296756
16123 336898 374114 180688 -12913 34790 -390284 -434151 -46560 -6761 -49886 270720 73812
16111 280492 81077 -68144 -17781 -92388 -288399 -89121 38800 -86570 167321 198704 265373
16100 265373 20466 75193 108268 191199 -171353 90463 -46219 -188943 -214123 134179 114767
16089 114767 -59100 -231160 -99924 105366 28396 -35369 72530 27640 -279171 -7302 127607
16077 -105005 -112287 -70860 -195694 -174100 -132585 174615 -66923 220878 186257 -14586 256012
16065 -40367 -326212 -586996 159208 -69285 -163001 -203045 -108568 15024 14083 25865 -229542
16053 -340159 37916 -120288 260031 -69979 264691 -250159 129955 56350 -115068 -72092
16043g2092I480M6423b66072A86916B9669c65081a32837E2765f6185l02959J37684
16032b31460B82064a51366A5912b54993H1988K6413P9497b60329J9077B790h9886
16020A3310b09537B73433e4049k50159A39158c5443m9077l05162F0190c6855j47686
16009a84541L9638d5156B20726I5978R3381a15627D50906I3588b2560m4136n6377
15998a23073k02080i0428E65283d62599b07653A76061B0436a56693A0822M9847
15988F0669i5451D9603a51663D79483G6930B2982K69376J0408M3617J63810c2391
15976A31837J58131a70654E2156O9269K9830a87677a7885A41507a21166G3881
15965A53507K52636b06194j19231f95n8109k72595G8925J17168F9507f6108F2751
$$ plain form
16043 -72092 9480 55903 -266072 186916 29669 -365081 -132837 52765 -66185 -369144 -231460
16032 -231460 282064 -151366 15912 -254993 81988 108401 187898 -260329 -241252 2790 -89886
16020 13310 -209537 273433 -54049 -304208 139158 -35443 -84520 -389682 60190 -36855 -184541
16009 -184541 -144903 -45156 220726 95978 189359 -115627 450906 93588 -22560 -66696 -123073
15998 -123073 -325153 -90428 565283 -462599 -207653 176061 20436 -156693 10822 60669
15988 60669 -95451 49603 -151663 479483 76930 22982 292358 302766 346383 510193 -32391
15976 131837 289968 -170654 52156 121425 151255 -187677 -17885 141507 -121166 73881
15965 153507 406143 -206194 -325425 -695 -58804 -331399 78925 196093 69507 -66108 62751
15953d2817G00e2697m0829j2864A35918a61268N6835B8218g5173j4460d1000C2919
15940A67188C7498b06370M9161C20519f7791q9420d3278m63988i2534D3461h0532
15928e5347B16204l9408a15776k4486q7753A58795c32106a09161b1640l01277
15918c22917A42658a40208c4617k9742D3529M0965c8820B6559a25027N452G4120
15906C9789b47937M5167Q6906l57700A36661R3284b86121Q5598C69715a07067
15895A80663b05217Q685G7190a66778c3677r4076C04854H2474b27956A5796d5796
15883g4559l5422B40570f0429a5311B5626a86101A787a41745c6090B61479D1523
15871A16893J1790N02a03432A88166p3716c01916I0040i5902j46775C8212i1590
$$ plain form
15953 -42817 700 -52697 -93526 -106390 135918 -161268 -104433 28218 -75173 -89633 -41000 32919
15940 167188 37498 -206370 -157209 320519 -67791 -157211 -43278 -507266 -92534 43461 -80532
15928 -55347 216204 176796 -115776 -140262 -228015 158795 -332106 -109161 -21640 -322917
15918 -322917 142658 -140208 -34617 -64359 43529 84494 -38820 26559 -125027 -119575 74120
15906 39789 -247937 -202770 -115864 -473564 136661 229945 -286121 -200523 369715 -107067
15895 180663 -205217 -196532 77190 -166778 -33677 -127753 304854 82474 -227956 15796 -45796
15883 -74559 -109981 240570 -60429 -15311 25626 -186101 1787 -141745 -36090 261479 41523
15871 116893 128683 129185 -103432 188166 114450 -301916 90040 -95902 -242677 38212 -91590
15859c59580c130A33965c36437A83940p3727a76772e2879l3984k07883g1277A21128
15847e5859F4589a81194n5399l795A44435J60088A06633e9999E9228J7917K3214
15836A00359e430A48934p1089b09774o1285f4030j30703A08609R2797C2159c43315
15824E8341b68948Q4987b285k2194p2468k36563i5091A89910D8170a88175k29450
15813d17625a60426k05907f7092H8014a05402B98327a07073B1420J1422d11026
15802a70038B48019D9229j3482M9529a84203B78808a04753C7214a81600r368q2031
15791b72999A46001E2337M36680a38959k4090r219f7147E3332i9022B34683b02880
15779i309m67443a04986A6152L3516a83222a7944j31339l85580B14769b21253
$$ plain form
15859 -359580 -3130 133965 -336437 183940 110213 -176772 -52879 -86863 -294746 -71277 121128
15847 -55859 64589 -181194 -236593 -240388 144435 304523 106633 -59999 59228 77145 100359
15836 100359 -5430 148934 77845 -209774 -271059 -64030 -194733 108609 201406 32159 -343315
15824 58341 -268948 -183961 -2285 -24479 -96947 -333510 -95091 189910 48170 -188175 -417625
15813 -417625 -160426 -366333 -67092 88014 -105402 298327 -107073 21420 32842 -411026
15802 -170038 248019 49229 35747 85276 -184203 278808 -104753 37214 -181600 -190968 -272999
15791 -272999 146001 52337 489017 -138959 -163049 -172268 -67147 53332 -99022 234683 -202880
15779 -9309 -476752 -104986 16152 49668 -183222 -17944 -149283 -534863 214769 -221253
15768a62369a1292k10976A33605k2257m9519a63227K9945d4774A23642K14259
15758C37901b63873C51708a51509B1982J44815G2152Q1278J11160i7589j61282
15748b58871I7918a79424n9921p0807B20576b53587C4902M1574k3215K02723P7161
15737C33145e61A892J986c6873l0901j2793F8750L8716e2237J5689d813j46106
15725a50919C7280a4943k3763A8592H693a72032p2359B40791a01338K651L9031
15714e9656K6620A41027a21419j60571J11858f4100o5045A79620c06711E3304
15703A32040c00505a47460A66772b8598r277l7431q6934c9759N837j47700I7094
15691F1120M85441a8425A41380N5699r022g8635A73972b00258A4758e1409r5218
$$ plain form
15768 -162369 -11292 -222268 133605 111348 61829 -163227 -133282 -44774 123642 337901
15758 337901 -263873 351708 -151509 21982 166797 72152 153430 264590 -97589 -258871
15748 -258871 97918 -179424 -239345 -310152 220576 -253587 34902 76476 53261 255984 333145
15737 333145 -561 1892 3878 -36873 -67774 -80567 68750 107466 -52237 -36548 -4813 -150919
15725 -150919 37280 -14943 -38706 18592 8693 -172032 -244391 240791 -101338 -98687 -59656
15714 -59656 -33036 141027 -121419 -281990 -170132 -64100 -129145 179620 -306711 53304
15703 132040 -300505 -147460 166772 -28598 -37875 -75306 -162240 -39759 -33922 -181622 97094
15691 61120 546561 -18425 141380 197079 188057 -78635 173972 -200258 14758 -51409 -146627
15680a46627Q197e1155A26731b28488f9785J3107n0677m5249e8924m9480B48623
15668A58536A2794a8030B69888k6035a56554j3541j26425A82927a51951q5215
15658b37166a00504K6761B10533b45369a01338k9758k0767K8815b1760k82992
15648c04752a30333F8389C2178J14219C5206L44610a32429H599J26611f9071j37636
15637b06707L2328J6348B4021F508B325O0197N48193b19919C03753A19708b59021
15625B02647a31469G4803D822K49424E3600a5423A51252E1695h6195j13156A71146
15613I0765c8704j2242A57752p2994b60480D3487a48428M321A23548a9194k16456
15602b35650a5482j78336a5672n7584B0423L05727b1403C0479I285c21751d4415
$$ plain form
15680 -146627 -138430 -51155 126731 -228488 -69785 -56678 -107355 -152604 -58924 -108404 248623
15668 158536 12794 -18030 269888 243853 -156554 -170095 -296520 182927 -151951 -237166
15658 -237166 -100504 -73743 210533 -245369 -101338 -131096 -151863 -123048 -21760 -304752
15648 -304752 -130333 68389 32178 146397 35206 379816 -132429 8599 135210 -69071 -206707
15637 -206707 -174379 -158031 24021 6508 2325 62522 610715 -219919 303753 119708 -259021
15625 202647 -131469 74803 4822 254246 53600 -15423 151252 51695 -86195 -199351 171146
15613 90765 -38704 -50946 157752 84758 -260480 43487 -148428 -144107 123548 -19194 -235650
15602 -235650 -15482 -193818 -15672 -73256 20423 326150 -21403 30479 9285 -321751 -44415
15590c19945g8016L2789G9256a03213A54863n9797b50452k3193j14847B98345
15579B02719L5037m7674e5165m4933d6612k959j67581A93486i0312l1525A64282
15567A32563J21430P6558D8973c02358A75119J28008H8575Q754J7199F243f6646
15555A54837K2497J61046a35769C7632K52970a59813g1662I0119e8063k64697
15545c22760B80831a42980j58036A62827e9498A5537J44585e253C34306F506f3433
15533h7814C353K1845b38310j90542J83947R4781M7415B05183b9012A08335H830
15521E4091a65711A93270A3713a48285A08306m4459h9179c0583j14918B40837
15510F823a95468P0825b7864B41293a51198l0051B6803L4232b538A37713B8641
$$ plain form
15590 -319945 -78016 -45227 79256 -103213 154863 95066 -250452 -273645 -388492 298345
15579 202719 237756 190082 -55165 -100098 -46612 -49571 -217152 193486 -90312 -121837 164282
15567 132563 253993 330551 48973 -302358 175119 303127 88575 97329 114528 6243 -66646
15555 154837 177334 338380 -135769 37632 290602 -159813 -71662 90119 -58063 -322760
15545 -322760 280831 -142980 -301016 162827 -59498 15537 160122 -5253 334306 6506 -63433
15533 -87814 3353 25198 -238310 -428852 -244905 -150124 -102709 205183 -29012 108335 8830
15521 54091 -165711 193270 13713 -148285 108306 63847 -89179 -30583 -145501 240837
15510 6823 -195468 -124643 -27864 241293 -151198 -181249 26803 61035 -2538 137713 28641
15498c53895A62016f3653q4643p2460L7560j914h5348I4608O5457c74522a58843
15486C29067a17355N4101A11340b14880C57097h2917l7267j18639B04907b89152
15475b04527A31550a01796h76j27207A15788a9745p410k1207A00938p643a1111
15463h4540P045A57738o8176a60274A61618f2378F5790l303K6216N3654a83035
15451e0964F1116g2079m0017b24C4609g5826D2953b59911j03725A64027F89Q3604
15439H4293M04078E4002J12211A3847a17860B50621E2687b37113A7364N3467a37494
15427a25628C35217b4931j26972k3344N2484K3818m9008j44750J35603A66116
15416B18711a43538f6712r7544g1361C0954h9389H2365d4464j72965C8726j0469
$$ plain form
15498 -353895 162016 -63653 -148296 -220756 -183196 -185110 -85348 94608 160065 -374522 -158843
15486 329067 -117355 -63254 111340 -214880 357097 -82917 -120184 -238823 204907 -289152
15475 -204527 131550 -101796 -876 -128083 115788 -19745 -27155 -48362 100938 93295 -11111
15463 -84540 -77495 157738 89562 -160274 161618 -62378 65790 62487 88703 142357 -183035
15451 -50964 61116 -72079 -112096 -224 34609 -75826 42953 -259911 -363636 164027 689 84293
15439 84293 488371 54002 166213 13847 -117860 250621 52687 -237113 17364 70831 -137494
15427 -125628 335217 -24931 -151903 -175247 -122763 -98945 -147953 -292703 -157100 166116
15416 218711 -143538 -66712 -164256 -71361 30954 -89389 82365 -44464 -217429 38726 28257
15405B8257K68235c19197a11772L5220j03840A2743e8711C44062D2129J8793J32742
15394A93664R3593j11635J95059B9985d1783B08808a25367C18015H4902L79146
15384D64048a06002k1339A10472N5392e7848A34578a35943k2698A37526i3448
15373A7883g9858K7190j90879B53616A24822d1142m8008L1454r3800n225B4133
15361a82632M8086A07688e3185C06599J4004j34536i541A23078l9087O7369b87923
15349C2287b17786a00823j01494A92004J07712i655k63942b8494D5949J06039
15339A51988p4041i0140o1A3293O8265e692l03672B60766b13834A72527D2424
15327D1261P4988a09998j70443J06726e0329B72186b42578K4364F6928Q8835E1750
$$ plain form
15405 28257 296492 -319197 -111772 -76552 -180392 12743 -58711 344062 42129 60922 193664
15394 193664 287257 175622 370681 29985 -41783 208808 -125367 318015 84902 464048
15384 464048 -106002 -127341 110472 165864 -57848 134578 -135943 -158641 137526 -93448
15373 17883 -79858 -52668 -243547 253616 124822 -41142 -89150 -57696 -151496 -156721 24133
15361 -182632 -134546 107688 -53185 306599 320603 186067 -9541 123078 83991 151360 -287923
15349 32287 -217786 -100823 -202317 192004 299716 -9655 -273597 -28494 45949 151988
15339 151988 77947 -90140 -90201 13293 81558 -5692 -309364 260766 -213834 172527 42424
15327 41261 116249 -109998 -280441 -173715 -50329 272186 -242578 -218214 66928 155763 51750
15315C30134I3429a06006C866K43480A00665A5324a26731j57118g2386C08335
15304h4595C43714A21850D5895A3887b816n1433l7142j61487e0070D4547f6972
15292a77511m8226a06223b5213B12869L6484A1326b65932A31358a00097d8127
15281B11418G8802a62277C2856n164a61681G8085h1201A4054a70351K5812f7546
15269H0889a71464B16326l9346b11303A3358J26568a33547C923N5142J36150d35967
15257A38601K2484M830b08975B69045r1962J26097f5870C82283O8587L28288J49141
15246I28299j47526N25957C74058j65594O6881c79k14759f1128G1454k4854J62486
15235B09086g2175a1390A4199a08961K631B8717O6076a86907C0063P4434R2433
$$ plain form
15315 330134 93429 -106006 3866 247346 100665 15324 -126731 -283849 -72386 308335
15304 -84595 343714 121850 45895 13887 -2816 -54249 -91391 -252878 -50070 44547 -66972
15292 -177511 -225737 -106223 -25213 212869 249353 11326 -265932 131358 -100097 -48127
15281 211418 78802 -162277 32856 27692 -161681 78085 -81201 14054 -170351 -144539 -67546
15269 80889 -171464 216326 176980 -211303 13358 139926 -133547 3923 59065 195215 -435967
15257 138601 161085 165915 -208975 269045 177083 303180 -65870 382283 450870 779158 928299
15246 928299 780773 1306730 374058 208464 275345 -379 -215138 -61128 71454 46600 209086
15235 209086 -72175 -11390 14199 -108961 -106330 28717 94793 -186907 30063 104497 196930
15224A96930J8919b84805G573J2124R5345J50469h4154m601B56921q8370b0554
15212c6231A07867O6044N9257Q6812I0410g4605G5980B6356O1759i0724d1718
15200b30736j6455d6383A81456c4095G8766J40707R5553a60393A3040R9137P6707
15189A88884J5563a39276H2068N8752G982J91132F8705A0984h3305A27358E7146
15177A01409l0391M8952E1827N1409J1858c6335C05493K47370d0113k9432j22874
15166a92419C32000C6615J14461g9098C12622e7146j22622h8615M3786A93839
15155d3537B69170A23095a49C36751c31781A8045b62726P2189P0023G7536Q5251
15144A62787d4594A17175c11003C2368J32487D3362b15086G8921l3846K6173A1720
$$ plain form
15224 196930 215849 -284805 7573 19697 115042 265511 -84154 -88755 256921 168551 -20554
15212 -36231 107867 173911 233168 319980 90410 -74605 75980 26356 88115 -90724 -41718
15200 -230736 -247191 -46383 181456 -34095 78766 219473 315026 -160393 13040 112177 188884
15189 188884 204447 -139276 82068 140820 7982 199114 68705 10984 -83305 127358 57146
15177 101409 71018 119970 51827 103236 115094 -36335 305493 552863 -40113 -69545 -192419
15166 -192419 332000 36615 151076 -79098 312622 -57146 -179768 -88615 -44829 193839
15155 -43537 269170 123095 -149 336751 -331781 18045 -262726 -190537 -120514 77536 162787
15144 162787 -44594 117175 -311003 32368 164855 43362 -215086 78921 45075 71248 11720
15132f3533A84579p1362l6026C2613J34223l176a52039c9164C18301r6922R032
15121B30411b9385D98125a29022A79434R5047i5171G4262l615L1458j6014B723
15109h8127A4853J64955c4109A37861B5454R3534L0322b79782R8635a1194A21855
15097C68540j14308J16547D8360K66294a17261q6805G6735h2243B25726q853I9753
15085B8018K98616A52960G4836a35879G615L0082J17669J90852E7214J8908R6969
15074A73091i0567D63437j78135j7013O8671b7808G8614k4620J44050J45068I7942
15062B74220D20M65761j98469M845G2386K07006k5955a4714k02001J1978j07157
15051c11894A89562l7220J95952A7290J76824R4783m1832J23605j02490A11195
$$ plain form
15132 -63533 184579 113217 77191 32613 166836 163660 -152039 -39164 318301 221379 230411
15121 230411 -29385 498125 -129022 179434 274481 -95171 74262 70647 102105 86091 2723
15109 -88127 14853 179808 -34109 137861 25454 118988 149310 -279782 -181147 -11194 121855
15097 368540 254232 370779 48360 314654 -117261 -204066 76735 -82243 225726 216873 99753
15085 28018 326634 152960 74836 -135879 7615 37697 155366 346218 57214 76122 173091
15074 173091 -90567 463437 285302 268289 336960 -27808 78614 53994 198044 343112 97942
15062 274220 420 466181 267712 272557 72386 279392 253437 -14714 -216715 -204737 -311894
15051 -311894 189562 152342 348294 17290 194114 288897 247065 370670 268180 111195
15040a56023H9292A4111J51086e6525H8845a13360C73361K1581j70874c1848C03783
15028B21315j04109j8258L26472k07661I5278K72980G5234a1489A76786J15875
15018B92661l7479R6625A66806b84695B90304D2465K76917A07738j5099K16246
15008C08885a7726n518A84997k2708J73705A38696K06004K41850b42426a4195
14997B31330a26570A40740A8204K56851J09949c0281D74804A65980a40829B39892
14986D08097A89754b24314O8441A53382j8392K19005J56781a1720B28553J95806
14976D24359j08169h9710m6839I4243J67751m678P5142f9644A69119R9727a7244
14964B34737D7034K26371r8092m3867i6359E6504M18067r8398A1910K5801J23183
$$ plain form
15040 -156023 89292 14111 165197 -56525 88845 -113360 373361 394942 224068 -31848 303783
15028 221315 117206 98948 425420 217759 95278 368258 75234 -11489 176786 292661
15018 292661 255182 351807 166806 -284695 290304 42465 319382 107738 92639 308885
15008 308885 -17726 -23244 184997 162289 335994 138696 344700 586550 -242426 -14195
14997 231330 -126570 140740 18204 275055 385004 -30281 474804 165980 -140829 239892
14986 408097 189754 -224314 -155873 153382 134990 353995 510776 -11720 228553 424359
14976 424359 316190 -89710 -136549 94243 261994 257316 332458 -69644 169119 268846 -17244
14964 234737 47034 273405 175313 131446 -96359 56504 474571 376173 11910 37711 160894
14953A60894M26077F4943K29402D7612J19678K40918q5472q6486M8992H8953A0255
14941B70302R5968P0932K40394A95214K2697N5079j00440E4402J26193J08359
14931B88954l0131j07662o1327J00698K78987j33805j65865J4159J83377M463
14921C71848F2346L13463J78551I6302J40125J71977p2515A39730N41434A05446
14910A87528L0025M5297k2798N1286J67281A89281K23653G8148L18080a29467
14899A72266H1527m09J59806J81323J06786A30457J38404m4152J35842j04149
14889B56402J51521R7426A02527L83731m1756A36741K75467A06274L12870Q8621
14879E07765j61033A63748J63566K02968b6208B19365o3404L39847j06042j9069
$$ plain form
14953 160894 586971 64943 294345 47612 167290 408208 322736 236250 285242 88953 10255
14941 270302 366270 437202 677596 195214 217911 272990 172550 54402 180595 288954
14931 288954 258823 151161 89834 190532 469519 335714 169849 184008 367385 371848
14921 371848 62346 375809 554360 96302 236427 408404 335889 139730 681164 105446
14910 187528 217553 262850 240052 291338 458619 189281 412934 78148 396228 -129467
14899 172266 81527 81118 240924 422247 529033 130457 268861 224709 360551 256402
14889 256402 407923 505349 102527 486258 444502 136741 412208 106274 419144 507765
14879 507765 346732 163748 327314 530282 -26208 219365 155961 495808 389766 370697
14869C70697j21657L87562C15780J66677j0350k11623N1014C9304K32978r095
14859B63187j05089L3328L30142k9394B36575L8212j13555P6097M1552K69924
14849E48805j08072A43174L43511p2374M9497m5613m6259F4446K67045M22060
14839G53551C18212J18855G6166M81807m8981l2086K6913l275A56148M12436d4196
14827D87821k11029O4875K8806m219J02668j30450o4637N50045l29482j77471
14817C16927J25230Q6397j36580J19050J0423Q2134B42630K44510K59016k94669
14807D51487P5527l2925J44376k21686L86397k45601o0354p7519J24094j83912
14797C59884p9147J44221m5591K53680j38117A80885J04672J37116L65034j81426
$$ plain form
14869 370697 249040 636602 315780 482457 472107 260484 311498 39304 272282 263187
14859 263187 158098 191426 521568 492174 236575 274787 161232 237329 278881 548805
14849 548805 440733 143174 486685 414311 463808 418195 371936 64446 331491 753551
14839 753551 318212 437067 76166 557973 508992 476906 503819 500544 156148 568584 -44196
14827 487821 276792 341667 370473 366254 468922 338472 273835 823880 494398 316927
14817 316927 442157 528554 391974 511024 521447 603581 242630 487140 746156 451487
14807 451487 527014 494089 638465 416779 803176 557575 497221 419702 543796 359884
14797 359884 280737 424958 379367 633047 494930 180885 285557 422673 787707 606281
14787F06281j27016j30980L95589j92660B64592N35839l88834Q9684J2562o3011
14777D50832J03952o0342N1705L8119L3282J22598k40382j3901O79456D61301
14766F10765B80340L11692j48541O5050j74785n5176L84350k40943K47433j79599
14756D89821L62945A62034M22640r2326J36085j06272K4164p6460K60977j59191
14746E71651k22211M49934r9514K796k9473k19313P0283J94128k25128J11272
14736F04425j36153K26401N5978j82486M7077J01300J67328B29132M36171J99996
14726H65299J89787l56127R7495o8571J1331p2398k67562L32809C54188J10256
14716D64444L57637l65584P8852L6189L48049q7654k47203j35628M45185C12915
$$ plain form
14787 606281 479265 348285 743874 551214 264592 800431 411597 501281 513843 450832
14777 450832 554784 494442 546147 584266 617548 740146 499764 485863 1165319 461301
14766 610765 280340 592032 443491 508541 333756 278580 662930 421987 669420 489821
14756 489821 852766 162034 584674 492348 628433 522161 546325 469865 730842 571651
14746 571651 349440 799374 699860 702656 673183 453870 524153 718281 493153 604425
14736 604425 468272 694673 750651 568165 615242 716542 883870 229132 665303 865299
14726 865299 1055086 698959 796454 727883 739214 666816 399254 732063 354188 464444
14716 464444 822081 456497 535349 571538 919587 831933 584730 449102 894287 312915
14705H32427l32523J9938J24182L428M1069j10003K67180n3301J40647m9903l55038
14694E28103K56442K54651j89253o9646j0267l65143K73573j30443K41850k09896
14684E79971J02709N4929l06637M29023J38946l67003o55M97980j62739k53482
14674G13042K9070M5531J1351j40166K55579M1611J96479j47280o7381K9584j32703
14663H34717r2525L27346k95814J41155K33791R3894k95482j94271N14563l18747
14653I48627J75317M7025j23011j14484J44417k15893k2470J99838q8797L32335
14643A282904l73826J14998P4102n1993n7049O4689k86296J96240K91780j38400
14633A117149L4090J7774l2623l7898K79247j71959l5038j15226L45819k78663
$$ plain form
14705 832427 499904 519842 644024 647452 688521 578518 845698 792397 933044 883141 528103
14694 528103 784545 1039196 849943 780297 770030 404887 678460 548017 789867 579971
14684 579971 682680 737609 430972 859995 998941 631938 631283 1129263 966524 713042
14674 713042 742112 787643 798994 658828 914407 956018 1152497 1005217 937836 967420 834717
14663 834717 742192 1069538 773724 914879 1148670 1242564 947082 752811 1267374 948627
14653 948627 1123944 1170969 1047958 933474 1077891 861998 839528 1039366 950569 1282904
14643 1282904 909078 1024076 1098178 1046185 989136 1053825 767529 963769 1255549 1117149
14633 1117149 1151239 1169013 1136390 1098492 1377739 1205780 1170742 1055516 1401335 1122672
14623A122672J40683k25199R4954L50245m36988J27253o5612K63586j72558K37211
14613A436247J8340j90271Q8028j80548k7760J87029K3870J89327j32314j69442
14603A242506J59560J65272j97167J62958n9659J1514m49329L34972J67361q7588
14593A450400J40945P0346j51750m7852J20349j56928K03321j24375L3861j98014
14583A340303J921O43152m08553j3813m0148K05885J27443L4274P3639R5855m25354
14572A634604O1223J47111j61459M27496J4046m80421L73617k62965K13181L0236
14562A996669J19181L20421O2748K15172l02166J65543J41779R5375J75202K67925
14552C257849O0536P41014Q85235J605555M611129Q580068J8515166P417607A9370118
$$ plain form
14623 1122672 1263355 1038156 1133110 1483355 1046367 1173620 1108008 1371594 1199036 1436247
14613 1436247 1454587 1264316 1352344 1171796 1144036 1331065 1354935 1544262 1411948 1242506
14603 1242506 1402066 1567338 1370171 1533129 1473470 1484984 1035655 1370627 1537988 1450400
14593 1450400 1591345 1661691 1509941 1462089 1582438 1425510 1628831 1504456 1538317 1340303
14583 1340303 1342224 1985376 1576823 1563010 1522862 1728747 1856190 1890464 1964103 2059958 1634604
14572 1634604 1695827 1842938 1681479 2108975 2123021 1642600 2016217 1753252 1966433 1996669
14562 1996669 2115850 2436271 2499019 2714191 2412025 2577568 2719347 2814722 2989924 3257849
14552 3257849 3318385 4059399 4944634 6550189 11161318 19741386 38256552 45674159 19370118
14542H427067C942491j683162k80905k32783j4730j35644k1773M71544j16015
14533A929023l52136L23565r7790R2678l8422M28969k61234l2518M4005R098P4677
14522B119915J63381j16864K36288j77836O5819m1209m6253k24972K95032K37685
14512B510986L0406j85421J59115J24125l01871K21112q6985n3800J39836j702
14502B555801K13497j61499Q1086j5476j10609J40250J28669j05397J43417j66126
14492B703613L72532j74841j26011M31976m57j64089M82169m09421o1191O4082
14482C118362J76738M3950k43303J05812M1230K94808j27993J79190k05189K56760
14472C640365N2642J40415M696k31930L67550R8278N1342J12479m60790M22143
$$ plain form
14542 8427067 3942491 2259329 1978424 1745641 1730911 1595267 1573494 2045038 1929023
14533 1929023 1576887 1900452 1802662 1895340 1856918 2285887 2024653 1992135 2036140 2045238 2119915
14522 2119915 2283296 2166432 2402720 2224884 2290703 2249494 2203241 1978269 2273301 2510986
14512 2510986 2541392 2355971 2515086 2639211 2337340 2558452 2471467 2417667 2557503 2555801
14502 2555801 2769298 2607799 2688885 2673409 2562800 2703050 2831719 2726322 2869739 2703613
14492 2703613 3076145 2901304 2775293 3207269 3206812 3042723 3524892 3115471 3054280 3118362
14482 3118362 3295100 3339050 3095747 3201559 3242789 3537597 3409604 3588794 3383605 3640365
14472 3640365 3693007 3833422 3838118 3606188 3973738 4072016 4123358 4235837 3775047 4197190
14462D197190j43248K51404j37857K95783l30975p5195L67651P1584K08533p6430
14452D628440O3909M66565m14963Q4986j13434J86035K4496j34597L55150k97611
14442D848976L94480Q1516J38007k74347j38897M68621Q3523k4966q2238L54153
14432E848828K18890R7935J6821j30571L19476l55750N93854j47267j07460N25042
14422F879798l61222J29961J24934M16807k71205K53504L04291J54018l1821J16321
14412G715386j05059L20833J37193J22334K28261l6347J14378M29608l24103L78528
14402H981012J62049j24180K06149J55431K15541J54729j44994M55582n6875L56401
14392A0360845K43553K14653K58568l84529M62380M54048j48982M04268J39804
$$ plain form
14462 4197190 4053942 4305346 4167489 4463272 4132297 4057102 4424753 4496337 4704870 4628440
14452 4628440 4692349 5158914 4743951 4828937 4715503 4901538 4926034 4791437 5146587 4848976
14442 4848976 5243456 5324972 5462979 5188632 5049735 5518356 5601879 5576913 5494675 5848828
14432 5848828 6067718 6165653 6182474 6051903 6371379 6015629 6609483 6462216 6354756 6879798
14422 6879798 6518576 6648537 6773471 7190278 6919073 7172577 7476868 7630886 7599065 7715386
14412 7715386 7610327 7931160 8068353 8190687 8418948 8382601 8496979 8926587 8602484 8981012
14402 8981012 9143061 9018881 9225030 9380461 9596002 9750731 9605737 10061319 10004444 10360845
14392 10360845 10604398 10819051 11077619 10693090 11155470 11609518 11460536 11864804 12004608
14383A2004608N63506m8727M67509n2371L20130J85115N31219J23879j00522R68692
14373A4963038q1379Q3144J76957N58360K52310K21123K17555K37805P05437J54645
14363A7488995N12511L66258P60129M76336J48119L72137M29104N54624M54713
14354B1562926L51509Q44058L31461M07007Q01595O79963N67534O87982Q12280
14345B7046315O07102M62167P34785J010612P07945J020240O37049J121619J038936
14336C4386770J011335Q27271J166771J217070R65224J354853J292135J596773
14328D3818202J033311J606047J718888J369454J957127J666651J794874K332501
14320E7297055J801912K392503K397072K239894K360258L079071K788824K875096
$$ plain form
14383 12004608 12568114 12519387 12986896 12934525 13254655 13439770 13970989 14094868 13994346 14963038
14373 14963038 14881659 14964803 15141760 15700120 15952430 16173553 16391108 16628913 17334350 17488995
14363 17488995 18001506 18367764 19127893 19604229 19752348 20124485 20553589 21108213 21562926
14354 21562926 21914435 22758493 23089954 23496961 24298556 24978519 25546053 26234035 27046315
14345 27046315 27653417 28115584 28850369 29860981 30568926 31589166 32226215 33347834 34386770
14336 34386770 35398105 36225376 37392147 38609217 39574441 40929294 42221429 43818202
14328 43818202 44851513 46457560 48176448 49545902 51503029 53169680 54964554 57297055
14320 57297055 59098967 61491470 63888542 66128436 68488694 71567765 74356589 77231685
14312G7231685L296893L100576L667724L683641M250184M178570M762453M400614
14304A08572340N508608N299215O320178N531744P182401O729013P725271P842780
14296A60711550R001771Q457010J0083755R986171J0875994J1334058J2105900
14289B32556209J2796052J3148847J3701767J4868427J5222485J5458734J6323613
14282C34076134J6531472J6362740J6223875J6016799J5100077J4402888J2834298
14275D41548283J1376718Q925476M479997n33520j518675j255245j59500o862197
14267D56001337n366423n977979j1682325j3940679j4575469j4878167j6380244
14260C73200051j6896482j6544631j6546325j6030789j6000829j4195931j4059333
$$ plain form
14312 77231685 80528578 83629154 87296878 90980519 95230703 99409273 104171726 108572340
14304 108572340 114080948 119380163 125700341 131232085 138414486 145143499 152868770 160711550
14296 160711550 169713321 178170331 188254086 198240257 209116251 220450309 232556209
14289 232556209 245352261 258501108 272202875 287071302 302293787 317752521 334076134
14282 334076134 350607606 366970346 383194221 399211020 414311097 428713985 441548283
14275 441548283 452925001 461850477 466330474 465796954 464278279 463023034 462863534 456001337
14267 456001337 450634914 444656935 432974610 419033931 404458462 389580295 373200051
14260 373200051 356303569 339758938 323212613 307181824 291180995 276985064 262925731
14253B62925731j3855294j3323353j2190195j1468883j1083535j0487231r811530
14246A80705710r697903q208644p585377p659542p411731o428589o791278n729682
14238A21192964n075024m977225n025674m753119m318273m181111l582538l190901
14230H6089099l675378l558249l280410k818685k857464k278577k839463k120845
14222F2660028k256832k055402j837740k113708j793747j939328j215679j960861
14214D7486731j522225p02836k158293r01617j409376j174046q04735q55999j308104
14205C6649500j024299j300153j024465o29168q13868o66223q63668j233872m98269
14196B8595515p64044q24993k4839j153377n53960o70876l38344r20937k84732
$$ plain form
14253 262925731 249070437 235747084 223556889 212088006 201004471 190517240 180705710
14246 180705710 171007807 162799163 155213786 147554244 140142513 133713924 126922646 121192964
14238 121192964 116117940 111140715 106115041 101361922 97043649 92862538 89280000 86089099
14230 86089099 82413721 78855472 75575062 72756377 69898913 67620336 64780873 62660028
14222 62660028 60403196 58347794 56510054 54396346 52602599 50663271 49447592 47486731
14214 47486731 45964506 45261670 43103377 42201760 40792384 39618338 38813603 37957604 36649500
14205 36649500 35625201 34325048 33300583 32671415 31857547 31191324 30327656 29093784 28595515
14196 28595515 27831471 27006478 26981639 25828262 25274302 24603426 24265082 23344145 23059413
14187B3059413m86376n93654o66149l24613k69409q61424j68071l49664m87830
14178A8852223o58591K5212p24868N3647p79503n84742M09653m75353n14676m18153
14168A5184849m74680K2677n32409L224l15784l30178m59316r0526j88239k82870
14158A2536748k47645j6264j48551j16527n48959J5440k58012k46512k22511K8064
14148A0775271j93304n08898N3462l41431j58491K42006l09390l23214J69249
14139I405260l40045J05186n21391L35824l54554k84252J04505m38924j71849
14130G839760K14741j25743k59102L53312l55400j58096L6612k59730n9361K50110
14120G477103n34236r1019J6978k99222J45532q5448L8924l37490r0291M0563
$$ plain form
14187 23059413 22573037 21979383 21313234 20988621 20719212 19857788 19689717 19340053 18852223
14178 18852223 18193632 18218844 17493976 17547623 16768120 16183378 16593031 16117678 15603002 15184849
14168 15184849 14710169 14732846 14200437 14203661 13887877 13557699 13098383 13007857 12819618 12536748
14158 12536748 12289103 12272839 12124288 12007761 11458802 11474242 11216230 10969718 10747207 10775271
14148 10775271 10581967 10073069 10126531 9785100 9626609 9868615 9559225 9236011 9405260
14139 9405260 9065215 9170401 8649010 8984834 8630280 8346028 8450533 8011609 7839760
14130 7839760 8054501 7928758 7669656 8022968 7667568 7509472 7546084 7286354 7226993 7477103
14120 7477103 6942867 6851848 6868826 6569604 6715136 6629688 6668612 6331122 6240831 6281394
14110F281394N2886K5243n09572N4501n19701M21698Q0223k62200M859J5853k28308
14099E416876M3489n3562L96396q56619J50841N1698j86667L57808n39927r5411
14089D684922K01283m36539M02204j70984K83469j44851k19021P935j66061j49147
14079D293210J33415J82326k97010r6560M7702l23221L07007j95843k45941K47152
14069D052237j78875J33770p4441n19561L52072O4920m10882o2566N48472l49725
14059C555421j498L06456m00927L97500m77440K01625n52940p4364K82790K17775
14049C454398k62772p4543J21931j97642J86738j771k46753K33354r5547l13243
14039B804150M51129m68532J21600J5370k54951R9502M2849N19543l02687j76067
$$ plain form
14110 6281394 6334280 6359523 5849951 5904452 5384751 5806449 5886672 5624472 5629331 5645184 5416876
14099 5416876 5460365 5406803 5803199 4946580 5097421 5149119 4962452 5320260 4780333 4684922
14089 4684922 4886205 4449666 4851870 4680886 4964355 4819504 4600483 4608418 4442357 4293210
14079 4293210 4426625 4608951 4311941 4215381 4263083 3939862 4246869 4051026 3805085 4052237
14069 4052237 3873362 4007132 3932691 3413130 3765202 3830122 3419240 3356674 3905146 3555421
14059 3555421 3553923 3860379 3459452 3856952 3379512 3581137 3028197 2953833 3236623 3454398
14049 3454398 3191626 3117083 3239014 3041372 3228110 3226339 2979586 3212940 3117393 2804150
14039 2804150 3255279 2786747 2908347 2923717 2668766 2768268 2811117 3330660 3027973 2851906
14029B851906r7879j34284Q3167O8597j58348K2668m29520J42207m63931N42958
14019B427541P167k89040M76616j7020k32138j02428p7668P0059N0559l2359o3303
14008B217986j40700l7482k7867r1116K93544M0035m07323J19949K18924k03078
13998A982872r7877j17158K66731j94577l9532J45388n45562O74027p0488J044449
13988C048273L131522P146738J7766665J5801809k3063387j1287802n235519k360851
13980D947448n32158j181305M4010o28229J45332l29646k15412L44153j68208
13971B425985J29861l71791P581k32089O0940L39818n56790M09890l21823m0946
13961A850636J33477r8291l3002Q2693R9406m88071K19910j76941q6889J95411
$$ plain form
14029 2851906 2754027 2619743 2702910 2771507 2613159 2635827 2206307 2348514 1884583 2427541
14019 2427541 2434708 2145668 2622284 2605264 2373126 2270698 2193030 2263089 2313648 2281289 2217986
14008 2217986 2077286 2039804 2011937 1920821 2214365 2254400 1847077 1967026 2185950 1982872
13998 1982872 1884995 1767837 2034568 1839991 1800459 1945847 1400285 2074312 2003824 3048273
13988 3048273 6179795 13326533 31093198 46895007 23831620 12543818 7308299 4947448
13980 4947448 4415290 3233985 3277995 2649766 2795098 2465452 2250040 2594193 2425985
13971 2425985 2555846 2184055 2191636 1959547 2020487 2360305 1803515 2213405 1891582 1850636
13961 1850636 1984113 1885822 1852820 1935513 2034919 1546848 1766758 1589817 1502928 1698339
13951A698339J39235l66773J1963J23889J30487p069J24736k48639m1626K27675
13941A792217l61247M04575l56503P5979K41221k1395k23724K31564p1155o5306
13931A646226k36975K14239k53130j96018N86184j69895k58405K21029j04845
13922A448410O3808K96154k32922j2078P0520m10343j1070r5640M937O4630j0178
13911A176228L33716j2220j29912j97506k83523M98711N7873l02033O0523J13659
13901A315516n2362j23906K6310l25521L72884l8150k02659J45259m7646N5167
13891A124892J27790K14596j50087k02999k1335K44259j62213q1434r9812n2795
13881I40862J0838J89381j55244J15848J7584l39552J13119K10561R4740j87247
$$ plain form
13951 1698339 1837574 1470801 1482764 1606653 1737140 1730071 1854807 1606168 1564542 1792217
13941 1792217 1430970 1835545 1479042 1555021 1796242 1774847 1551123 1782687 1711532 1646226
13931 1646226 1409251 1623490 1370360 1174342 1760526 1590631 1332226 1553255 1448410
13922 1448410 1512218 1808372 1575450 1563372 1633892 1223549 1212479 1116839 1121776 1186406 1176228
13911 1176228 1509944 1497724 1367812 1170306 886783 1385494 1443367 1141334 1201857 1315516
13901 1315516 1263154 1139248 1165558 840037 1212921 1174771 972112 1117371 1069725 1124892
13891 1124892 1252682 1467278 1317191 1114192 1092857 1337116 1174903 1093469 993657 940862
13881 940862 951700 1141081 985837 1101685 1119269 779717 892836 1103397 1198137 1010890
13871A010890O6530O145L65348k66535j31504r985J62809k03426J92705j01775
13861A091202N4806R7731k60864J00205J06809j21430o8951k66688j4794L60359
13851A078385J5071j10811l3295o7969J68429k06404L49319k53438j36512K96533
13841A099308j66436k54218M87149k06343j41643j47587j14757O15237J02553
13832A273263o12596j37182L33401K2368M3120k79659L66198k7377j06769j61355
13822G13412M24396j75390k18593K20824n7105j1410k97706L13365K13777l74842
13812G50728L75002n24589L59122j69740J5427l81050L51365k97902O87199j34710
13802A030852l25342R9942J64157k74756m8685O0817l8620Q3754q3481K87752
$$ plain form
13871 1010890 1077420 1083565 1448913 1182378 1050874 1040889 1203698 1000272 1192977 1091202
13861 1091202 1146008 1243739 982875 1083080 1189889 1068459 999508 732820 718026 1078385
13851 1078385 1093456 982645 949350 881381 1049810 843406 1192725 939287 802775 1099308
13841 1099308 932872 678654 1165803 959460 817817 670230 555473 1170710 1273263
13832 1273263 660667 523485 856886 879254 922374 642715 1008913 981536 874767 713412
13822 713412 1137808 962418 743825 964649 907544 896134 598428 911793 1125570 750728
13812 750728 1125730 601141 960263 790523 805950 424900 776265 478363 1165562 1030852
13802 1030852 705510 805452 969609 694853 646168 706985 668365 752119 668638 956390
13792I56390l76877L95293k69507J0326l53548K81508J87030o4850Q7751k11805
13782F41711n9535k8428J45059j87524O4783r9511k1350r3562L90699p4568k1295
13771F56479O0600A93057L08473K37239R2317l34002j55810L51748r0294j3387
13761E89341J93151B58465L07905J4814Q6666k13194J35936j97493K53043k28404
13751D17738J74213k87505J44210A21289O49758l16231J23579J31878J85702j61923
13741G34052j45692M4638j82102A21434N71056r8606J21967k33093N7087K3900
13731E63745M957j21134J0849J38285p2603K01893j22441B84814L02132l1016
13721E55930N7880B73724J98386Q4738m6738j72334n928K8377O06486B94182M3455
$$ plain form
13792 956390 579513 974806 705299 715625 362077 643585 830615 765765 853516 641711
13782 641711 582176 553748 698807 511283 576066 476555 455205 361643 752342 677774 656479
13771 656479 717079 193057 501530 738769 831086 497084 341274 693022 602728 589341
13761 589341 782492 258465 566370 581184 667850 454656 590592 393099 646142 417738
13751 417738 591951 304446 448656 121289 771047 454816 578395 710273 895975 734052
13741 734052 588360 632998 450896 121434 692490 593884 715851 482758 539845 563745
13731 563745 568702 447568 458417 596702 524099 725992 603551 284814 586946 555930
13721 555930 613810 273724 472110 556848 510110 337776 331848 360225 966711 294182 337637
13710C37637K52428M4283k61243K57226k33261K60153n8793k74746K12963J22386
13700F59033k56806P603R338J62681Q7126B61331J11485A18124N17786R4662q9184
13689F41388k26207A38509O33466A06515O46484j55079j33751A54667K24109K62093
13679F40869k27144j32310L73825k67400J47414K1733B29057o6904O47420l30097
13669D79476A89130M20967A98651L0620K19845J25846j19838G0046L86917j4080
13659D42883k2657k6844M8439J70496J57099A83777L30051q5698j16114J46361
13649D58377P7234j81187K73406j56396A44471J07816J70860j21508i4812E47219
13638C22998j43754J28418k4778L11650A05776L96429B42602N25004k33594r9841
$$ plain form
13710 337637 590065 634348 373105 630331 397070 657223 598430 323684 536647 659033
13700 659033 402227 409830 419168 581849 668975 261331 372816 118124 635910 730572 641388
13689 641388 415181 138509 771975 106515 752999 597920 464169 154667 378776 640869
13679 640869 413725 281415 655240 387840 535254 556987 229057 162153 809573 479476
13669 479476 189130 610097 198651 229271 449116 574962 455124 70046 456963 442883
13659 442883 420226 393382 441821 612317 769416 183777 513828 428130 312016 458377
13649 458377 535611 354424 627830 471434 144471 252287 423147 301639 -94812 547219
13638 322998 179244 307662 282884 594534 105776 502205 242602 767606 534012 434171
13628D34171j15598K21683J50698k68486P1883A51431K25855J88870k57186j6607
13618B92363L2008o2801m2137J8199M2459j36091L79976j37176j37333G4938L24629
13607C99567r5751A42038K26278K28461B45728P1817p9711L93499A19150m0076
13597G9074P6525O2543j3662K71824j98568r17d9845D39944A94306j9323J5568
13586A90551L15794k36214a66958A50788J86944N3099j28116D4299N38853o7178
13576E15974J7948B49804A06477J2225J03004p0109m5897J07156n9883K10062
13566C63035l8922J09104j71963K0731D0578K29181Q9293Q190j58921M67685k64710
13555D11296A13822J78919Q2915q6699G4919J4149R8714N5211f0003B04329E1957
$$ plain form
13628 434171 318573 540256 690954 422468 494351 151431 377286 566156 308970 292363
13618 292363 324371 261570 219433 237632 280091 144000 523976 386800 249467 74938 399567
13607 399567 303816 142038 368316 596777 245728 317545 237834 631333 119150 79074
13597 79074 155599 218142 204480 476304 277736 276819 -49845 439944 194306 174983 190551
13586 190551 506345 270131 -166958 150788 337732 390831 262715 44299 583152 515974
13576 515974 533922 249804 106477 118702 221706 151597 105700 212856 152973 363035
13566 363035 324113 433217 261254 281985 40578 269759 359052 367242 208321 676006 411296
13555 411296 113822 292741 375656 288957 74919 89068 187782 242993 -60003 204329 51957
13543H0769M1295L3535J72635L0026c570C9895J81860R3161j35290O1999J78350
13532D19975A76262J87380P7505j20319J19088F8472J66155K97730B10510J23522
13522C34032J2714j3450A54416a0265C39612H6141J64501q7016K68692B10528
13511D17761A37516J67653p5237j7674j387A0057N63330n406A42805G582K13845
13500B21427l3817J64993A9263K13276E5173J66640P3747K7322K18822b58645
13489B38870L6498C7890K68968a7881B55632H485N5191N6409P0719K23585A01546
13477B35256N7297j38868J65913A28822J65185j34818L40520j84248l0123N5928
13467C41266A57390i2636C21207J1696E6859E180d7678C68151D3600j8865L72013
$$ plain form
13543 80769 122064 155599 328234 358260 -3570 39895 221755 314916 179626 241625 419975
13532 419975 176262 363642 441147 320828 439916 68472 234627 532357 210510 334032
13522 334032 346746 333296 154416 -10265 339612 86141 250642 163626 432318 210528
13511 417761 137516 305169 229932 212258 210871 10057 573387 567981 142805 7582 221427
13500 221427 187610 352603 19263 232539 55173 221813 295560 322882 541704 -258645
13489 238870 275368 37890 306858 -17881 255632 8485 63676 120085 190804 414389 101546
13477 235256 292553 153685 319598 128822 294007 159189 499709 315461 285338 341266
13467 341266 157390 -92636 321207 332903 56859 5180 -47678 368151 43600 24735 396748
13456C96748e2207D25526j2699B912h4836C44451j70907K75133A27659J67860
13446B95519O8172j43830G4822J65198n744A16876e871D67987F1672K33399Q7083
13435C82154j4565G4063N10366a97246A40970B1996J88759O8427e5548A97041
13424C82415j00404J84245a12594E67817k07925A62163a765A84015o921O6453
13414B43547j9185O5265J11794g1338A93852h4335A37552A8591Q3725K17437J73869
13403D93622a45019C98553j40065r9104J86293o5950k2348I2210J51451l7011
13393B06650l6671a3739A02031b9095E1015M63245A26056m118d9196p0263D25840
13381B31719J24750o7655A22721D7876O07985B88689c22248C90509j18971n1770
$$ plain form
13456 396748 -52207 425526 412827 2912 -84836 344451 173544 448677 127659 295519
13446 295519 363691 219861 74822 240020 234276 116876 -5871 467987 61672 295071 382154
13435 382154 367589 74063 584429 -197246 140970 21996 210755 279182 -55548 197041
13424 382415 282011 466256 -112594 567817 359892 162163 -1765 184015 177094 243547
13414 243547 224362 289627 401421 -71338 193852 -84335 137552 18591 102316 319753 493622
13403 493622 -145019 398553 258488 159384 345677 279727 257379 92210 243661 206650
13393 206650 169979 -13739 102031 -29095 51015 514260 126056 121938 -49196 -119459 425840
13381 231719 356469 288814 122721 47876 655861 288689 -322248 390509 271538 219768
13371B19768e8541A19308N08300B8338a89631A3548K02569P4417j45096Q5706
13361B31144J8046n692j9571k9098J73664a86519A24771A7946N3896L00415A60271
13349d0874H151N149L02106c4406D3659L20011A31761J02026M00087A80186L10669
13338D90855E7508R4542Q021G5822K64185I1035K21563q4874O1977J70273A76978
13326d7088A48363L08869B15777F7339L45917q2992a647q577I5473Q7523J18685
13315C01681B4691J62025K45905B05437I2128O818p208J03715l7100G484d9423
13303e9343A20554J33211f2319k02552C04443r333F6941K40026F3703K92638j33191
13292B23150E9770M77336h6643C33829j52418a98511g4792A05999Q289K3077m1947
$$ plain form
13371 219768 -58541 119308 627608 28338 -189631 13548 216117 290534 145438 231144
13361 231144 249190 243498 223927 194829 368493 -186519 124771 17946 71842 372257 160271
13349 -40874 8151 13300 315406 -34406 43659 363670 131761 233787 633874 180186 490855
13338 490855 57508 152050 160071 75822 340007 91035 312598 227724 289701 459974 176978
13326 -47088 148363 457232 215777 67339 413256 330264 -1647 -10224 95473 182996 301681
13315 301681 24691 186716 432621 205437 92128 98946 91738 195453 158353 7484 -49423
13303 -59343 120554 253765 -62319 -264871 304443 295110 66941 306967 63703 356341 223150
13292 223150 59770 537106 -86643 333829 181411 -198511 -74792 105999 114288 137365 95418
13281I5418L73019B21238O3310j06417C9310d6440C53622o154j41967d1501D6554
13269I5329H377K2253N1690a24913N0515B03493I6978i6077C97532F8420K19495
13258B87915a95630F8822e9337B72893G3726N9162k8805O2560o3719a91954j14509
13247c06463J38899F0713N4281J31826e6301C58844c5917A24979k5194i0541E1640
13235A07604n0350a93878A91728c9322B03959o7878a70237d1863m0882r0077B28822
13223D41733G1637K66664l2533p5797a92332B89572k3975I2465K21395L5195A59208
13211a50460e7613a847A48228J51579A41299e294B24099b8536e206D0684a07140
13199a48919A33522N5087h8650A45190J18135e2498A11080m4970M02561j29548
$$ plain form
13281 95418 468437 221238 284548 178131 39310 -46440 353622 347468 205501 -41501 46554
13269 95329 8377 30630 82320 -124913 -74398 203493 96978 -96077 397532 68420 287915
13258 287915 -195630 68822 -59337 272893 73726 132888 104083 166643 102924 -191954 -306463
13247 -306463 -167564 60713 114994 246820 -56301 358844 -35917 124979 99785 -90541 51640
13235 107604 57254 -193878 191728 -39322 203959 136081 -170237 -41863 -82745 -172822 228822
13223 441733 71637 338301 305768 229971 -192332 289572 265597 92465 313860 349055 159208
13211 -150460 -57613 -1847 148228 299807 141299 -5294 224099 -28536 -5206 40684 -107140
13199 -148919 133522 188609 -88650 145190 263325 -52498 111080 66110 468671 339123
13189C39123j55199K48480b75702M9319H2496e0174G3533Q8590L4334a27101l04754
13178d31855h1161j17346h5977A51394J15108H2230a51732j32737A68963p7576
13168I1387f5347j13462e268n4947A97045J71097c78934a37665F764L2818H30
13156b5397A76836J82714h0087B380J27003J41598d1429C82335A42241m2414Q4809
13145A84636o2142J1661J18439q8008a93718O5284O1255J3510k0378B04943r7375
13134A07568G308R8296B0066K45274a30490G3632f5170A39077P5785f7146D71997
13122A37706L4067q0120m5641K10437B7297a88263B99616E8326b0625A60164d3008
13110E0204a9465A07273K22323B2187d1093B793f1021F0379l66J66000q0810k2511
$$ plain form
13189 339123 183924 432404 -275702 -226383 82496 -50174 73533 162123 196457 -127101 -431855
13178 -431855 -81161 -198507 -85977 151394 266502 82230 -151732 -284469 168963 91387
13168 91387 -65347 -178809 -5268 -60215 197045 368142 -378934 -137665 6764 39582 830
13156 -25397 176836 359550 -80087 2380 129383 270981 -41429 382335 142241 99827 184636
13145 184636 122494 134155 252594 164586 -193718 -128434 -67179 -53669 -74047 204943 107568
13134 107568 7308 105604 20066 265340 -130490 73632 -65170 139077 214862 -67146 471997
13122 137706 171773 91653 46012 256449 27297 -188263 299616 58326 -20625 160164 -43008
13110 50204 -19465 107273 329596 22187 -41093 2793 -61021 60379 60013 226013 145203 122692
13098A22692g7449b6256D1105a46999A03331g5765C9875J55832J55740M1678a25710
13086a17387C53889j55999e8211j09007F4371O6664N2936M5068a15454B7901h3430
13074a89138g9353f81A91374n9097O1710a90781A73353i35B61464m4461b36712
13062F4470J32646M7524N3722j24139e352C2708J52415q6375J078q514J8747L8985
13050A49044l5514B5190R2213e5803K0266p7816C9995J82901D4604b3623i601
13038f2625A04905Q4744a65722D17406I4302J01397f4850A07931J2311i3599C26538
13026A26250P3590d8766A96280q6842e1673K3003r6925A12563J12043D8991e6426
13014A47854o433b96567A11526a4674o8621B54120L741A09979J68314A9056O8147
$$ plain form
13098 122692 -77449 -26256 41105 -146999 103331 -75765 39875 195707 351447 393125 -125710
13086 -117387 353889 197890 -58211 -167218 64371 131035 183971 229039 -115454 27901 -83430
13074 -189138 -79353 -681 191374 132277 193987 -190781 173353 -935 261464 217003 -236712
13062 64470 197116 244640 298362 174223 -5352 32708 185123 98748 99826 91312 110059 149044
13050 149044 113530 25190 117403 -55803 -35537 -113353 39995 222896 44604 -23623 -9601
13038 -62625 104905 189649 -165722 417406 94302 195699 -64850 107931 120242 -93599 326538
13026 126250 199840 -48766 196280 109438 -51673 -28670 -125595 112563 224606 48991 -56426
13014 147854 141421 -296567 111526 -14674 -83295 254120 257861 109979 278293 19056 87203
13003H7203b28129h1685K8571a5713k00752L1324A64221n3780m6128J65771E6865
12991d4714B64241b14753K6466g7710I6245a84772B4916b55999D51213B10362
12980C29056C2707K88209d9367B29204A07473a10454k78946A76536J70423j16514
12970B30445K15970A04512M4908J05K43250A3183a45473e3694H1612N83035A87661
12958e5739H4306Q1085E5902c09642a5673A99651i9750D48471H2682f819I5607
12946E4096K21470o9260g7980A18562d0574B28618J61884F0069L47669j50705
12936B57033O4492a46140A50464c18391C24686E8113c10712C12791F8927k1974
12926D6953M9617b6140j2666l45223B1633J5834f4518j62373B86327E721J67627
$$ plain form
13003 87203 -228129 -81685 -53114 -15713 -216465 -185141 164221 110441 64313 230084 56865
12991 -44714 264241 -214753 -188287 -77710 96245 -184772 24916 -255999 451213 210362
12980 329056 32707 320916 -49367 229204 107473 -110454 -389400 176536 346959 230445
12970 230445 446415 104512 149420 149525 392775 13183 -145473 -53694 81612 664647 187661
12958 -55739 84306 165391 55902 -309642 -15673 199651 -99750 448471 82682 -6819 95607
12946 54096 275566 206306 -77980 118562 -40574 228618 390502 60069 407738 257033
12936 257033 321525 -146140 150464 -318391 324686 58113 -310712 312791 68927 46953
12926 46953 96570 -26140 -38806 -384029 21633 37467 -64518 -226891 286327 5721 173348
12915A73348q0267K42203c4143j58645m2571f5859a9637A46706a74444C13391
12904a2641D09191e5101C39306E8322b871j15649E1386B3105d9739A2983J43189
12893A56172H888J41403O8755R0885g2080J7866B71102p4045j0263r2865g5007
12881a20858J9725A22776f3259B7126c2776D4074Q539b31297h5300j70992G5847
12869A8796P0041a5304j1416j88658e4196j27198e4682A01747b11839R5604F1622
12857A95226b67124a2564j24612C2091K08021a25381A95622e5383k0109B18742
12846a53955E0778f8220F2497k2428K44692d6109C07784b04294D0392J79729F50
12834C4052e1896I8597J64680J8505C2837a42461f9599B5214K20591a1885k9025
$$ plain form
12915 173348 93081 335284 -34143 -192788 -235359 -65859 -19637 146706 -174444 313391
12904 -12641 409191 -55101 339306 58322 -2871 -118520 51386 23105 -49739 12983 156172
12893 156172 8888 150291 219046 309931 -72080 -54214 271102 197057 186794 93929 -75007
12881 -120858 -101133 122776 -63259 27126 -32776 44074 52613 -231297 -85300 -256292 75847
12869 18796 88837 -15304 -26720 -215378 -54196 -181394 -54682 101747 -211839 -116235 61622
12857 195226 -267124 -12564 -137176 32091 240112 -125381 195622 -55383 -75492 218742
12846 -153955 50778 -68220 62497 40069 284761 -46109 307784 -204294 40392 220121 650
12834 34052 -51896 98597 263277 281782 32837 -142461 -69599 25214 245805 -11885 -40910
12823d0910q4523p5698j71740B74463a69513f5175n6650G2466b69684a07440C36924
12811b59106A16495m5537j8514d20385f4751j10545A99132n0020P1532L7000c23545
12799b12903d1175H5243d6517j35023d3962p3995C65792b68519J14511C15063
12788d8382j69780G8773a39554A43633E4696h5442j83659D7130g9355r0122B4989
12776B75152A04789B8831K6626J10428i1665a0032l5919A22273l549l2628a50682
12764a86081D7205J87728A7616a09730F8145M79442d9980o0750j47143d4342F7310
12752c41034C69359A24278b5432k56682B48999a50980A00561K41387j37776f4626
12741A69242m7613c5859A52624a83031A06481i3639f351B56403j16408O387o2602
$$ plain form
12823 -40910 -125433 -201131 -372871 274463 -169513 -65175 -121825 72466 -269684 -107440 336924
12811 -259106 116495 70958 52444 -420385 -64751 -175296 199132 149112 220644 257644 -323545
12799 -212903 -41175 85243 -46517 -181540 -43962 -117957 365792 -268519 -154008 315063
12788 -48382 -218162 78773 -139554 143633 54696 -85442 -269101 47130 -79355 -169477 24989
12776 275152 104789 28831 55457 165885 -91665 -10032 -45951 122273 118724 86096 -150682
12764 -186081 47205 234933 17616 -109730 68145 547587 -49980 -110730 -257873 -44342 67310
12752 -341034 369359 124278 -25432 -282114 248999 -150980 100561 341948 204172 -64626
12741 169242 121629 -35859 152624 -183031 106481 -93639 -6351 256403 139995 146382 83780
12730H3780L29455A93936a85574I975g9132A45204b76597b8441A41906A155a40592
12718h7629B25052A6184J20972e4195D18463a68358F7071Q4649J9708M787K17671
12707C93886G7732N49785A46484Q0448O7696a15871K6660C7161a27967A92052
12696I4348A1003P5745a582D02083a86620A22031h0657B04460G64K06643n0014
12685A57393h523j12354B81258j06982D5671J29462K4476C2761a7421B87766I2985
12673I4971R3142H5330J18219a54896q5075A70781e131n041B22485e7781q783
12662f6564j922C5783J86488p2850j720J11307j27265i2779c2975C1807a26396
12650B94796E6387J52794c5478j11751a5929j4278C41183c9790A37872C6732a71034
$$ plain form
12730 83780 413235 193936 -185574 9975 -79132 145204 -276597 -28441 141906 1155 -140592
12718 -87629 225052 16184 137156 -54195 418463 -168358 67071 151720 171428 176215 393886
12707 393886 77732 627517 146484 226932 294628 -115871 -89211 37161 -127967 192052
12696 94348 11003 86748 -1582 402083 -186620 122031 -80657 204460 764 207407 157393
12685 157393 -8523 -120877 281258 174276 45671 175133 199609 32761 -17421 287766 92985
12673 94971 188113 85330 203549 -154896 -239971 170781 -5131 -10172 222485 -57781 -66564
12662 -66564 -68486 35783 222271 149421 147701 259008 131743 -92779 -32975 31807 -126396
12650 294796 56387 209181 -35478 -147229 -15929 -30207 341183 -39790 137872 36732 -171034
12638f4297A27914J40424H0001i037E8744K52626L3883j44208B5346J98568J25979
12627C49893f5333F2156J73524D743c13157B89810J55110D1737A0100g0953K4567
12616d6386j09462D13222C1970b696B40253d6435B85907F9532K77459k4429h7722
12604b56193a223A4999O3757b3822B5959P6532L7160J97286b84869B44751E7265
12592A67267E7266g950B48792a74018b9821j62505I2521c3448E1460c77034a41449
12580a64935d1626K0108j44423B4974J28304d966C00279b11012O2316N1593j65833
12569b62936P6288g337j50269G2147L85939a56354D3962J26828A2486f4899B87648
12557a17385A78685J95430c0185A36565b04013f1071E1192K64506A44302l238
$$ plain form
12638 -64297 127914 268338 80001 -9037 58744 311370 345253 201045 25346 223914 349893
12627 349893 -65333 62156 235680 4743 -313157 289810 444920 41737 10100 -70953 -46386
12616 -46386 -155848 413222 31970 -2696 240253 -46435 285907 69532 346991 322562 -87722
12604 -256193 -1223 14999 78756 -23822 25959 102491 139651 336937 -284869 244751 57265
12592 167267 57266 -7950 248792 -174018 -29821 -192326 92521 -33448 51460 -377034 -141449
12580 -164935 -41626 -21518 -165941 24974 153278 -4966 300279 -211012 -148696 -97103 -262936
12569 -262936 -186648 -7337 -157606 72147 458086 -156354 43962 170790 12486 -64899 287648
12557 -117385 178685 374115 -30185 136565 -204013 -61071 51192 315698 144302 141064
12547A41064i5370c3182B7135a3910j02450M6551j21164R450B21018a41197l2396
12536a73593Q807a7674B06366r0963l1067k5837A1102K74315a22305D05854A04839
12524a44882d6512A4862L9794M759M2822K4777E3820b83562I5350R1921b38367
12512a26154H255b45622J05317a7349j33632A86425K9234A7892i0552A1968L40724
12501C52692B1421a18255n7463O1975B12940c5542n1941C58736a37332B88311
12490b74270A46258C4854J90079B0935L67750A56883N6056n6738L7049C4512N4400
12479H8912A9282L29351A54366G5698J7514Q1211f5837a4761A84278j5959l3230
12468A35089a06023N905l148A66450h2254C4996a03396A2509N3054i5712A41332
$$ plain form
12547 141064 -95370 -33182 27135 -13910 -116360 -69809 -190973 -181523 221018 -141197 -173593
12536 -173593 -164786 -17674 206366 115403 84336 58499 11102 285417 -122305 405854 104839
12524 -144882 -46512 14862 54656 59415 102237 127014 53820 -283562 95350 187271 -238367
12512 -126154 8255 -245622 -140305 -17349 -150981 186425 215659 17892 -90552 11968 352692
12501 352692 21421 -118255 -175718 -113743 212940 -35542 -87483 358736 -137332 288311
12490 -274270 146258 34854 224933 20935 388685 156883 212939 156201 193250 34512 88912
12479 88912 19282 348633 154366 75698 93212 174423 -65837 -14761 184278 168319 135089
12468 135089 -106023 -100118 -103266 166450 -82254 34996 -103396 12509 65563 -95712 141332
12456A38041n8228a85374a6967F6395b04926C06126g0699B17531b76297A07429
12445D2640e3812C8181f2841k9038a5681n9356A50050i0540q3531L3421D468J06464
12433A10932K4734B5616a67608J5105g2576j67299A76385c67846d3949j02539
12423a46488k03443B91224a17693B88615A35063a53035C16342a6132A54996b00838
12412E8234N049L55697a72941C25703i4050A94521e4485K902j69140H1839c13181
12400A59458a93915C0732c38080A24990a08032A93709I2870J0164e62591F1256
12389f2288F3407f1309D70672i519m998D1845A8804d6638e18F6629P797J50604
12377B25030F4605h093C5433J61559g8119A5178a41311o1761c0218C31439j64709
$$ plain form
12456 138041 79813 -185374 -16967 66395 -204926 306126 -70699 217531 -276297 107429
12445 42640 -53812 38181 -62841 -91879 -15681 -75037 150050 -90540 -174071 -140650 4468 110932
12433 110932 135666 25616 -167608 -152503 -72576 -239875 176385 -367846 -43949 -146488
12423 -146488 -349931 291224 -117693 288615 135063 -153035 316342 -16132 154996 -200838
12412 58234 63283 418980 -172941 325703 -94050 194521 -54485 -51583 -220723 81839 -313181
12400 159458 -193915 30732 -338080 124990 -108032 193709 92870 103034 -562591 61256
12389 -62288 63407 -61309 470672 -9519 -14517 41845 18804 -46638 -518 66629 74426 225030
12377 225030 64605 -8093 35433 196992 -78119 15178 -141311 -203072 -30218 331439 166730
12366A66730a70542E3745R4493A7510K78071a37298D20554A3632O5216I72J04067
12355A05039k018e7656A50706o5532d0080B21840r7570B6218a1849j973m3347
12344e7169D223K5946J60591b19800a1940r137j29944A14536f3975b4786j36173
12333a60959e2655A924e439A89020l3513O053k260n7394J87277c24624A79274
12321a24614N7906j21042j463A63990d26206a30120j21l9982B13792a06409d9387
12309a28574B38634b38432f0042q9508B84331a10898k11708A28686f6696k4860
12299i1556D42442c5738b395m5921p7263L9180k50651e934k39896E3449M0094
12288I3543b74740H7047a61714B83479p9197e464k5383r703A71977c705j39434
$$ plain form
12366 166730 -170542 53745 148238 17510 295581 -137298 420554 13632 78848 972 105039
12355 105039 103021 -57656 150706 85174 -40080 221840 124270 26218 -11849 -13822 -57169
12344 -57169 4223 30169 190760 -219800 -11940 -21077 -151021 114536 -63975 -24786 -160959
12333 -160959 -52655 1924 -5439 189020 155507 161560 159300 101906 289183 -324624 179274
12321 -124614 -66708 -187750 -189213 163990 -426206 -130120 -130241 -170223 213792 -106409 -49387
12309 -128574 238634 -238432 -60042 -149550 284331 -110898 -322606 128686 -66696 -91556
12299 -91556 442442 -35738 -2395 -48316 -125579 -86399 -337050 -5934 -245830 53449 93543
12288 93543 -274740 87047 -161714 283479 204282 -5464 -30847 -40550 171977 -3705 -143139
12277a43139M6621C08005k3133p1797J49026r1658n6789C757K37179r8725K90607
12266D32818b12693A69178B848P1190J33185F9339J08397a9459F3237J41948p3258
12255A31927a36567A21642b23578a4118B8662J2934J2192K89008a8607o5030A87479
12243B15851R362R8422H6645K69085J81661G5947K25013b7562A24477a96481A32832
12231B91289H4526B3834K04822C641M20565j56762A07121M5602R3026n146a71245
12219c09383a16772e2301F15471I7206J55007i7776c9524I2911L90247j78565
12209C04593P9707A5517J37817J4470N8667j05389k0587J37788A13626i8663A04386
12197D39558A70811a4761G8322N10626E0379a32257A63730b1270A29360M0885
$$ plain form
12277 -143139 -96518 308005 284872 213075 362101 270443 213654 3757 240936 142211 432818
12266 432818 -212693 169178 2848 74038 207223 69339 177736 -19459 63237 205185 131927
12255 131927 -136567 121642 -223578 -14118 28662 41596 53788 342796 -18607 -83637 187479
12243 215851 225213 323635 86645 355730 537391 75947 300960 -27562 124477 -196481 132832
12231 291289 84526 23834 228656 3641 424206 267444 107121 152723 245749 240603 -171245
12219 -309383 -116772 -52301 615471 97206 252213 -97776 -39524 92911 483158 304593
12209 304593 384300 15517 153334 167804 226471 121082 100495 238283 113626 -98663 104386
12197 439558 170811 -14761 78322 588948 50379 -132257 163730 -21270 129360 170245
12187A70245H3500g8887C27778j59116a35389B44904a81257B29029M39L1418j7059
12176B43827r9798e6887r5266D2632P8647m3999a10167B80680p9958k1016F9733
12164B97116B8709J47731o2688B4673K5455b05643i9211B36759N6938d007q0032
12153h4039A77577a58813E808L87744j13875h4813D8176L13203a72023C18547
12142e8824C18236b25765j29035J53851H3856Q1909a35829D65350B22635H6560
12131C4304a0959F0479i3399j30230a1061B94652a47820A13615a59339F9343a4523
12119i6288A02811d3384C2008a4264C3825J96157I3375K23748j56016f7802j7061
12108h4863C2259e7246l4769A3730L279M5861e9788H2112C5162b44489n200O5462
$$ plain form
12187 170245 83500 -78887 327778 168662 -135389 244904 -181257 229029 229468 260886 243827
12176 243827 144029 -56887 -152153 42632 121279 77280 -110167 280680 200722 179706 69733
12164 297116 28709 176440 113752 24673 50128 -205643 -99211 236759 293697 -4007 -84039
12153 -84039 177577 -158813 5808 393552 279677 -84813 48176 361379 -172023 318547
12142 -58824 318236 -225765 -354800 -200949 83856 165765 -135829 465350 222635 86560
12131 34304 -10959 60479 -93399 -223629 -11061 294652 -147820 113615 -159339 69343 -14523
12119 -96288 102811 -43384 32008 -14264 33825 229982 93375 317123 161107 -67802 -84863
12108 -84863 32259 -57246 -92015 13730 17009 62870 -59788 82112 35162 -244489 -249689 -184227
12096a84227i623B78699A28779e4180D743K75646C3892O2640j3142k8384M7727
12085A02733n0230a78268B10290r7252d2157C0232K78082K82383Q87464P59932
12075B238093A084819E10497A47417B9497A4698c59517i9054j00635A63171O0786
12065B23957f7171B26199F343c4832q3904C5186J40419i7375j38981J03544A9299
12053b72938B96312a22015k8075j34644j09964e1654A24345n2195a79134o9098
12043b48232N1494A72082d0446A39970J28745I5663K30251b35220g5714B7102
12032C17690e3825j69961O8475C2578K39421E5602g8406B22981b46977A89036
12021F8421b81594B12842a51827P3378A52944a27728B04488c7032p9584A19680
$$ plain form
12096 -184227 -9623 278699 128779 -54180 4743 280389 33892 96532 83390 55006 102733
12085 102733 52503 -178268 210290 113038 -42157 30232 308314 590697 1478161 2238093
12075 2238093 1084819 510497 147417 29497 14698 -359517 -99054 -199689 163171 223957
12065 223957 -67171 226199 6343 -34832 -118736 35186 175605 -97375 -236356 -132812 19299
12053 -272938 296312 -122015 -150090 -284734 -394698 -51654 124345 72150 -179134 -248232
12043 -248232 -196738 172082 -40446 139970 268715 95663 325914 -235220 -75714 27102
12032 317690 -53825 -223786 -155311 32578 271999 55602 -78406 222981 -246977 189036
12021 68421 -281594 212842 -151827 -78449 152944 -127728 204488 -37032 -116616 119680
12010A50146J1294a34788j5190j07509i8481C22169I2324a35059q3208a5218k11419
11999b26637b2309B12955j1910c46766P7551C71564a76183j59517a01101D9912
11988C02663a15373I913R1388c76942h8605J6281C7210J06743p0061e0819B8119
11976C59341i8019j14408e3578q0430e8115A11227b8253B833J53189b77306B80770
11964b4544m36077a63908B04653M7350a5180k64115B2066L0261h0711G0337L74504
11953D44841B2469b9552B9006N7851K0203b2496m6043K0575I2411P1691m7038
11942A17064c8536H3595d7147j96220k622a16856B1884a34069B19848J44761E1993
11930b24639F1825a40130j27508A68047e4501k8110L7474a2748H303M39624a75852
$$ plain form
12010 150146 161440 -134788 -149978 -257487 -98481 322169 92324 -135059 -218267 -15218 -226637
11999 -226637 -22309 212955 201045 -346766 -269215 371564 -176183 -335700 -101101 49912
11988 302663 -115373 9913 101301 -376942 -88605 -72324 37210 143953 73892 -50819 28119
11976 359341 -98019 -212427 -53578 -134008 -58115 111227 -28253 2833 156022 -277306 280770
11964 -24544 -460621 -163908 204653 252003 -15180 -279295 22066 52327 -80711 70337 444841
11953 444841 22469 -29552 29006 86857 107060 -22496 -68539 -47964 92411 164102 117064
11942 117064 -38536 83595 -47147 -243367 -245989 -116856 21884 -134069 219848 364609 51993
11930 -224639 61825 -140130 -267638 168047 -54501 -82611 -45137 -12748 8303 447927 -175852
11918b1251j89460B22703i8481n1256k8276B06905b32953I7738A8555i6177A18939
11906I0802a14092I9013b73399J17597d8650n6341B73736C851a37490j22127g7138
11894a09062q8282N4339k14214c0613q2254l6111B90374g4773j46271B3430b48069
11882i5316M6552C06933h0197B93562a58880j62992J37907M4653F9829a04717
11871C01225f2339L297E7556b41730B10319p1359a25381A77932c33712a13735
11860a76491p4456G0990J76444f3503q4966A85516O9680b04447A84054I656J32728
11849A42384O9604m5488c34090K6669c4056A59139B7144D492P8229q872e8100
11837A27489f8974A17134a668A19909d8657j25487b5293j03070c1866B08903h2099
$$ plain form
11918 -21251 -210711 222703 -98481 -149737 -178013 206905 -232953 97738 18555 -96177 118939
11906 90802 -114092 99013 -273399 -155802 -48650 -104991 273736 3851 -137490 -259617 -77138
11894 -109062 -197344 -143005 -357219 -30613 -112867 -148978 290374 -74773 -221044 23430 -248069
11882 -95316 -48764 306933 -80197 293562 -158880 -321872 -183965 -139312 69829 -104717
11871 301225 -62339 -59042 57556 -241730 210319 138960 -125381 177932 -333712 -113735
11860 -176491 -250947 70990 247434 -63503 -148469 185516 255196 -204447 184054 9656 142384
11849 142384 211988 166500 -334090 -307421 -34056 159139 27144 4492 82721 73849 -58100
11837 127489 -68974 117134 -1668 119909 -48657 -174144 -25293 -128363 -31866 208903 -82099
11825b89425C23313a72054j84797B49824e2910j61433D3597J86239b85769f6317
11814b21204r7379a38732j8006C2445b05937i2431A88402B1998b33973A58444
11803a04909A23736b25863A21870B5185c04881F6747A1088q08f1222C95504b59928
11791a7447D05401A5689a59774J0468j2396M5226A24845b12765A53268F280c804
11779A21333a78757m590l5760h8953N673L6354k56690J32310L5669C22458c70671
11767B59020D274e3202B7324N8313K0637M7534K40662A59285J04578a79977G7278
11755i3711j10450h2469B39630J0763K2399D6175R1897D096K83677f3860A42981
11743a48422K3175I5890B6360J32967m0602B0697c1033j16835n645A22558a73404
$$ plain form
11825 -289425 323313 -172054 -356851 249824 -52910 -214343 43597 229836 -285769 -66317
11814 -221204 -318583 -138732 -156738 32445 -205937 -92431 188402 21998 -233973 158444
11803 -104909 123736 -225863 121870 25185 -304881 66747 11088 10280 -61222 395504 -259928
11791 -17447 405401 15689 -159774 -149306 -161702 -116476 124845 -212765 153268 6280 -3804
11779 121333 -178757 -183347 -219107 -88953 -83280 -46926 -303616 -171306 -135637 322458 -370671
11767 259020 4274 -53202 27324 85637 106274 153808 394470 159285 263863 -179977 77278
11755 -93711 -204161 -82469 239630 250393 272792 46175 138072 4096 287773 -63860 142981
11743 -148422 -125247 95890 26360 159327 118725 20697 -31033 -147868 -153513 122558 -173404
11731b6184A8034K54465D0311F510a8742G0288J98223a18478N6475n4542a7735
11719a36672F2336a70718A11750p034e938k2059A06775J8707d9626A59721a9942
11707a6910A31308J28150j1406a1314j7372B91311f9227A60746E0618O3055m2736
11696G0937b4704A33079f0873A57094D7576J97892b4203E8920a46171j88826a68
11684B73030p30M1666a6005j32714E9743a20625L4686J9184j14888d1377b08C45338
11671A65016d4719a3695B1856J75060M6385c6836k87514A36874e0823C3882J76911
11660B10793b326q5906A93729b33267F6451R7982d8937E6692n770c52408b2168
11648b56898I8868e4502B8629f3591A24762b8521C5823Q1517R086P2500b323I0680
$$ plain form
11731 -26184 18034 272499 40311 6510 -18742 70288 268511 -118478 -62003 -116545 -17735
11719 -136672 62336 -170718 111750 104716 -5938 -27997 106775 125482 -49626 159721 -19942
11707 -16910 131308 259458 248052 -11314 -28686 291311 -69227 160746 50618 113673 70937
11696 70937 -24704 133079 -60873 157094 47576 245468 -24203 58920 -146171 -334997 -168
11684 273030 272300 313966 -16005 -148719 59743 -120625 -85939 -66755 -181643 -41377 -208 345338
11671 165016 -44719 -13695 21856 196916 243301 -36836 -324350 136874 -50823 33882 210793
11660 210793 -2326 -88232 193729 -233267 66451 164433 -48937 56692 50922 -352408 -22168
11648 -256898 98868 -54502 28629 -63591 124762 -28521 35823 117340 126426 198926 -2323 90680
11635a3272D3247K27694b28802C92853A60232M6108j9883C3208K56732d0752c837
11623A33170c9030j80969j40353a03941B71998a30047b4837m25998F2707R4275
11613A56982L04164d1389B34174I2907i6184J9135L0556J8733C01461q8286d8077
11601a374C54873a5023E6015K665K61006a67633E3501j8943A3760a7743j20951
11590a38694A6466e9957G2217Q693K67955F4541g2986B27688I8176a39749E9846
11578b97374H3352k7019L41846C3733e6644B56392r3102B5684a0016j17353e9420
11566A28747M3068m1189K81945a492A62046J35893j22781q5561K41155q1633a73691
11554A65911d1648A97790a78631G6487a25723C21475A7077R3004c00577A27885
$$ plain form
11635 -13272 43247 270941 -228802 392853 160232 206340 186457 33208 289940 -40752 -3837
11623 133170 -39030 -219999 -360352 -103941 271998 -130047 -24837 -450835 62707 156982
11613 156982 461146 -41389 234174 92907 -96184 -77049 -46493 -27760 301461 213175 -48077
11601 -1374 354873 -15023 56015 58680 319686 -167633 53501 34558 13760 -17743 -138694
11590 -138694 16466 -59957 72217 80910 348865 64541 -72986 227688 98176 -139749 59846
11578 -297374 83352 56333 398179 33733 -56644 256392 163290 25684 -10016 -127369 -59420
11566 128747 171815 130626 412571 -1492 162046 297939 175158 89597 330752 249119 -173691
11554 165911 -41648 197790 -178631 76487 -125723 321475 17077 110081 -300577 127885
11543a51811I4834a27739B64525a2522B33261J6998A17232J8091P6043a40636
11532I9261L39650a92789g4048B09736a40172C47627j44368J27147g4363c288
11521B44056H355K6783b50481B22240c4558R773D30127B4154F560K10588A1458
11509C77352p9000l8481C2959J58038a8438I2646L82790q848A60144g8577B30436
11497B35503a9059j57743B36563C1871L15310d3106C46402A4372J59216b07047
11486B32676c72300K3302b954C40150D1729J57705J85159e74B3131K01861A6950
11474A73916a95606A58311a4327A86660C2833K3691C072b09123B41019B9668M5392
11463G5060K26098j25968H3814j0168A3010a19909A84531R0901j16855o1181l1778
$$ plain form
11543 -151811 94834 -127739 264525 -12522 233261 250259 117232 135323 211366 -140636
11532 99261 438911 -192789 -74048 209736 -140172 347627 203259 330406 -74363 -3288
11521 244056 8355 35138 -250481 222240 -34558 -24785 430127 24154 6560 217148 11458
11509 377352 298352 259871 32959 190997 -18438 92646 475436 466588 160144 -78577 230436
11497 235503 -19059 -176802 236563 31871 347181 -43106 346402 14372 173588 -207047
11486 232676 -372300 -348998 -2954 340150 41729 199434 384593 -574 23131 224992 16950
11474 173916 -195606 158311 -14327 186660 32833 56524 3072 -209123 241019 29668 75060
11463 75060 301158 175190 83814 73646 13010 -119909 184531 275432 158577 97396 65618
11452F5618J28344a14915B02364G4321K5498M223C8215K93073E1189K51906a71684
11440F9968L2200l1154j4101f8493B65935a5059A13715a15382j39086D5453j2970
11429C2483L0762N4760n6864Q884b42044f6872j17874f4870A65098c4031B2628
11417E5776J55616B5236n58b41984A08736C2034J53842n7632b96264e1736j90216
11406b41952K6432A07597e2773E9803c65421A02884M0904b47460A74202J85598
11396C59800i7601j94873Q4849G6621k6453N3906L00710B4686f5750J865j42172
11385b06057j81949A58745k4980j507b1444J413A38945f595m6164B92457H5792
11373f8765E186J44499d05547b957q3595L2576o3360D6733J23783d2033C1800
$$ plain form
11452 65618 193962 -114915 202364 74321 99819 104042 38215 331288 51189 303095 -171684
11440 69968 102168 71014 56913 -68493 265935 -15059 113715 -115382 -254468 45453 32483
11429 32483 63245 118005 61141 70025 -242044 -66872 -184746 -64870 165098 -34031 22628
11417 55776 211392 25236 24678 -241984 108736 32034 185876 128244 -296264 -51736 -241952
11406 -241952 -215520 107597 -52773 59803 -365421 102884 143788 -247460 174202 359800
11396 359800 -97601 -292474 -207625 76621 50168 104074 404784 24686 -65750 -63885 -206057
11385 -206057 -388006 158745 133765 132258 -21444 -20031 138945 -6595 -52759 292457 85792
11373 -68765 5186 149685 -405547 -2957 -86552 -53976 -117336 46733 170516 -42033 31800
11361e909C05515a85965D2948J37163e84548C74376a94521R6973A35189L2363
11351A67552b63502j53426c1242B1035L84586a62206F5479d7801A89656D1640
11340b26812c0359j36269K914a6094m2550C9436a03291G4844e8332j7314I949
11328B82848i2108L4275l25240a3720j35073A54437J78567A27306k2721b13405
11317D1755K98315a97648N7806D0916d16086d8407p7522J3056d1539n8434p1372
11306a71345D5839J4753A248J62813b2823k6345G6387J4001j013c04794J33068
11295a71726F258J62894C3802c56893E8883R7718a79097B3781h6202m9992H788
11283A35923b59009k8396b7188H4616O2035a97314C143K321K8418a19304K2671
$$ plain form
11361 -5909 305515 -185965 42948 180111 -584548 374376 -194521 -97548 135189 167552
11351 167552 -263502 -416928 -31242 21035 405621 -162206 65479 -47801 189656 41640
11340 -226812 -30359 -166628 -163714 -16094 -58644 39436 -103291 74844 -58332 -75646 9949
11328 282848 -92108 -57833 -383073 -13720 -148793 154437 333004 127306 104585 -213405
11317 41755 340070 -197648 -139842 40916 -416086 -48407 -125929 -112873 -41539 -99973 -171345
11306 -171345 45839 60592 1248 164061 -22823 -49168 76387 90388 89375 -304794 -171726
11295 -171726 6258 169152 33802 -356893 58883 156601 -179097 23781 -86202 -136194 8788
11283 135923 -259009 -287405 -27188 84616 146651 -197314 3143 5464 33882 -119304 -96633
11272i6633b2145G7347c4246A2824J47694b220A80515b78678C09943c86448B15443
11260i8496H9616a38887C5335K22839b05443A11710m6056M341a87015j05926i5970
11248a85512A15502g6312j01596A50260J97656a03376C16543A7776R1822C847
11237I8437h1143G6196a26021q3799l3256O8122D0603i919l53613c9704A89805
11225c3475l29749A06815a78064A23730O9828a28415d0748J5789l23221A00759
11214a27944k17237a10481A44073B305O959a31646A39384a9799H2403a83963f6035
11202B26240a4697A32041g7981A07048m2257J35197a5391H9284N9597c87612c7054
11190C16106H8105c12281H6928Q735K15399a4216q1259k18845F3368e2764j0556
$$ plain form
11272 -96633 -22145 77347 -34246 12824 160518 -2220 180515 -278678 309943 -386448 215443
11260 -98496 89616 -138887 35335 258174 -205443 111710 65654 69995 -187015 -292941 -95970
11248 -185512 115502 -76312 -177908 150260 347916 -103376 316543 17776 109598 3847
11237 98437 -81143 76196 -126021 -209820 -243076 -174954 40603 -9919 -363532 -39704 189805
11225 -33475 -363224 106815 -178064 123730 193558 -128415 -40748 -24959 -348180 100759
11214 -127944 -345181 -110481 144073 2305 9264 -131646 139384 -19799 82403 -183963 -66035
11202 226240 -14697 132041 -77981 107048 64791 199988 -15391 89284 148881 -387612 -37054
11190 316106 88105 -312281 86928 95663 311062 -14216 -95475 -314320 63368 -52764 -63320
11179f3320B61486c21960B82038C6286J07268b60462F8299b93489a05644d9147
11168A41997a15477E0370c50376E9277b93593g3488o6838j5534B7227L2326e0718
11156d36108a34250k22234A01540m9226b04682A79964O9897d40483F6097Q7940
11146A54037a17194m1525j18365O4524N8576B10767h9305A96440J54141a79665
11135G8318K34207G7016i2358b9399J1435l37856f4679K5155A29663c0235k01506
11124b31741A12699g7355m2174L2373A47439k2920h1305j19029A81039m5976N6047
11113A91110j008F24J89439M2832a65122C4255b358j1198A45190f4922C0373e6908
11100a62033J4813B78269l4809c7406j68518g1635A03199l434K82542p0624C1418
$$ plain form
11179 -63320 261486 -321960 282038 36286 143554 -260462 68299 -293489 -105644 -49147
11168 141997 -115477 50370 -350376 59277 -293593 -73488 -140326 -155860 27227 59553 -50718
11156 -436108 -134250 -356484 101540 52314 -204682 179964 249861 -440483 66097 154037
11146 154037 -117194 -158719 -277084 -212560 -153984 210767 -89305 196440 350581 -179665
11135 78318 312525 77016 -92358 -29399 -17964 -355820 -64679 -39524 129663 -30235 -231741
11124 -231741 112699 -77355 -119529 -87156 147439 124519 -81305 -200334 181039 135063 191110
11113 191110 190102 624 190063 232895 -165122 34255 -2358 -13556 145190 -64922 30373 -56908
11100 -162033 -147220 278269 243460 -37406 -205924 -71635 103199 99765 382307 311683 31418
11088c25375B35296A02664a70361A68777K4196b1289l1178C22088A03640L31101
11078D34741A63547i292j53851A37555M2943J50835k7648B3706N6631K19099K9157
11067C28593O5646J8333A06309L31947M16721B91125A33707M07984j48807j5264
11057C77620K89850B47390K27636k2312l529o4366M10264L6217m02414M29821
11047H58707k7359D00873M8937M00184C20739M42538j82287J90180j74675J65069
11037G61564j99603K65253j6778C71812K15117J86144C81063J65224J97482p3262
11027F70507j59212k38207P97453l99361p3604K92252j33372M5915k66202J49737
11017F85906k60500J82506j64331J28731l7959O87K05508j69135J53061C54914
$$ plain form
11088 -325375 235296 102664 -170361 168777 192973 -21289 -52467 322088 103640 434741
11078 434741 163547 -9292 -163143 137555 180498 331333 303685 23706 80337 299436 328593
11067 328593 394239 412572 106309 438256 854977 291125 133707 541691 392884 377620
11057 377620 667470 247390 475026 452714 449185 384819 795083 831300 428886 858707
11047 858707 831348 400873 449810 849994 320739 763277 580990 771170 596495 761564
11037 761564 561961 827214 810436 371812 586929 773073 381063 546287 743769 670507
11027 670507 511295 273088 1070541 671180 597576 889828 756456 802371 536169 685906
11017 685906 425406 607912 443581 572312 534353 535040 740548 571413 724474 354914
11006E46334J89559p9471B89163O35794D12747A46874K73846J40699K63696k89274
10996E35841j53561L38260P6344C79014L67132j6321J95203K505k54818N4806
10986G27521Q6387L38157m39093J07958p7534O19171F73835O34621k5990L87490
10976A669956j87725K03317O65891k26006L14579m77888O32510j30528l50385
10967B113721k87490R9932k35549j27295j97647K54582L534n3033j634L42903
10957A912024K88175n19096J52699o2132j47541j24186n57991k89168J38940j79083
10947F12641o5077j07223m5404j84078p9624k9703J57842a25811I515i4735C14125
10935D7197a10153A74927f6161B52909a69672c6858L94G6130k703b9236A02865
$$ plain form
11006 546334 735893 656422 289163 924957 412747 146874 420720 561419 825115 535841
10996 535841 382280 720540 796884 379014 746146 729825 925028 927533 672715 727521
10986 727521 813908 1152065 712972 820930 743396 1362567 673835 1308456 1282466 1669956
10976 1669956 1482231 1685548 2351439 2125433 2440012 1962124 2594634 2464106 2113721
10967 2113721 1826231 1926163 1690614 1563319 1365672 1620254 1623788 1570755 1569121 1912024
10957 1912024 2200199 1681103 1833802 1771670 1624129 1499943 941952 652784 791724 612641
10947 612641 547564 440341 394937 210859 131235 101532 259374 -125811 9515 -94735 314125
10935 47197 -110153 174927 -66161 252909 -169672 -36858 -36464 76130 73427 -29236 102865
10923b25519L8219N4985D65685A7640O674a6878O249B11265b33964A30903K47571
10912C78474k2393e7245C24648h7000j37216a582p2530a5694A13079a906m6539
10901d8445G8646f6407A85036l0450M9439G7792K15797A10054B8862b07470a03247
10889B11619p8318c15287G501h1753A4640b852j75982G7794J54251h3822C1356
10877I5373J96634A28681k0861a51922c816F2972g6270j78007c2449o6389K2464
10866g6374A36938B578N6277a9848q5375a9428F6750b71546B09862p3695f6511
10854A72124K76604a2099B21794K2171I6263P515c86085A12713d3093H6419L9273
10843A25692c87791a60662G6114f7116j69740F8659a73662d2884q413j45920j52856
$$ plain form
10923 -225519 -187300 -132315 465685 17640 24314 -16878 -10629 211265 -233964 130903 378474
10912 378474 356081 -57245 324648 -87000 -224216 -1582 -74112 -15694 113079 -1906 -48445
10901 -48445 78646 -66407 185036 154586 204025 77792 293589 110054 28862 -207470 -103247
10889 211619 133301 -315287 7501 -81753 14640 -2852 -178834 77794 232045 -83822 31356
10877 95373 292007 128681 107820 -151922 -3816 62972 -76270 -254277 -32449 -98838 -76374
10866 -76374 136938 2578 58855 -19848 -105223 -19428 66750 -271546 209862 136167 -66511
10854 172124 448728 -12099 221794 243965 96263 103778 -386085 112713 -43093 86419 125692
10843 125692 -387791 -160662 76114 -67116 -236856 68659 -173662 -42884 -51297 -197217 -350073
10832c50073b3865k66181J19674D1830i5112F7343a68663J3692b8799C69a29139
10820E9220J39825F7883i4203b4243F350g2521k53384l522A49360Q2835b4600
10808A28972g2192K4258B4904i0957A12087a22613H2870i0173J3194A1479L7639
10797D9118B0022F614c1345k89594c4566j16387f7044A56178e3796j6634P748
10786f2682j1887j51950C7317R8795h2791k3326G627c50653Q5651n8744a59560
10774g1959q7414m4281B14054i977j98705B14254C0336g1779o3182N4906r23B83976
10761a92060D033L52202j04418C8671P5466i5576C1382g7521p4179P5489F5561
10749F3205k1575M3260a66277j57399A70048C1795K41507a21516B51735b96780
$$ plain form
10832 -350073 -23865 -290046 -170372 41830 -95112 67343 -168663 -154971 -28799 369 -129139
10820 59220 199045 67883 -94203 -24243 6350 -72521 -325905 -329427 149360 232195 -24600
10808 128972 -72192 -47934 24904 -90957 112087 -122613 82870 -90173 -76979 11479 49118
10797 49118 20022 6614 -31345 -320939 -34566 -150953 -67044 156178 -53796 -70430 -62682
10786 -62682 -74569 -226519 37317 136112 -82791 -106117 7627 -350653 -265002 -323746 -159560
10774 -71959 -159373 -203654 214054 -9977 -208682 214254 30336 -71779 -134961 -80055 -80978 283976
10761 -192060 4033 356235 251817 38671 114137 -95576 31382 -77521 -151700 -76211 65561
10749 63205 41630 84890 -166277 -323676 170048 31795 273302 -121516 251735 -296780
10738A39674F1534J08920k5616a31363o0359m5929A89648h5505C3362a6868n7947
10727g4815A25564D2121a62314N3101M0247A5152M5002d45753A09555n2750M9469
10716A06274a830p6879a6819q0803r2051F3835K317a57826N3539M5469B116c4151
10703D6466Q4104D0625a51405O4745B84637b58751L9526d3558k84766A47587l5016
10692A12571b46667O4749p035b5374A04292J45904a9464k17852J15954L0882k31294
10681c21774A40222g0676B85417a19860m55979K77896j17446f409r5647G2668
10670c7955J0450j6510H0662b07008f5786E020b08179d3603k83593i6473q7283
10659a83756DJ01190k3854h9529M3569B18141a69676J6798A60323c20454A1001
$$ plain form
10738 139674 61534 170454 144838 -131363 -191722 -237651 189648 -85505 33362 -16868 -74815
10727 -74815 125564 42121 -162314 -109213 -68966 15152 60154 -445753 109555 56805 106274
10716 106274 -1830 -78709 -16819 -97622 -189673 63835 66152 -157826 -104287 -58818 2116 -34151
10703 46466 130570 40625 -151405 -86660 284637 -258751 -219225 -43558 -328324 147587 112571
10692 112571 -246667 -181918 -188953 -25374 104292 250196 -19464 -237316 -121362 -90480 -321774
10681 -321774 140222 -70676 285417 -119860 -575839 -297943 -415389 -6409 -102056 72668
10670 -37955 -27505 -44015 80662 -207008 -65786 5020 -208179 -43603 -327196 -96473 -183756
10659 -183756 4 101194 77340 -89529 -45960 218141 -169676 -152878 160323 -320454 11001
10647b58425a7659k2152o5957l46222A2935J76315M6943a84541A20876b28167
10636A55316b9439k2409o4861A85988B1698K05263a25861A69941b06774A40604
10625c96625A227f4026D22127D753d4999k1665A50983a03705a35k36293a0361
10613a94993B17754c5552j0286E8618A5056J40451a56828A0300J80458b21853
10602C36683a29418D7496e6392E9440Q3871d2688l94642B01577n725a069k365
10591c434r460A39041o8190A1747c9804C2363e2805q0915K3265j84748E6075c97329
10578h0465B5601c59766e7492k27918b4721B4658c46683h7660p1780j511m041
10567a64992d5459k28854J19616B83738a40160k05251c5136j28264d3536I1326
$$ plain form
10647 -258425 -17659 -39811 -105768 -451990 12935 189250 236193 -184541 120876 -228167
10636 155316 -29439 -51848 -116709 185988 21698 226961 -125861 169941 -206774 140604
10625 -396625 1227 -64026 422127 4753 -44999 -66664 150983 -103705 -135 -236428 -10361
10613 -194993 217754 -35552 -45838 58618 15056 155507 -156828 10300 190758 -221853
10602 336683 -129418 47496 -56392 59440 143311 -42688 -437330 201577 195852 -1069 -3434
10591 -3434 -12894 139041 70851 11747 -39804 32363 -52805 -133720 -110455 -295203 56075 -397329
10578 -80465 25601 -359766 -57492 -285410 -24721 24658 -346683 -87660 -159440 -160951 -164992
10567 -164992 -45459 -274313 -154697 283738 -140160 -345411 -35136 -163400 -43536 91326
10556b34714N2130I9130a52655A1348J99961g7216b2343D0505g0743h951p5119
10545h4070j57974A4024J74380a77783C1570b9518B74968f2683p4319A50847i6201
10533A07186a49291A73856a92711R2860m4391A93599h4729m4852b6241j47148
10523a73389Q0861A22565N8886I99R7277C475b07847R1190e5705C37486A14334
10511A71895b53465B5860d7359J8252m55175C9631J73488n3017I345g5425C3592
10499a91153k6066c9279B87677a09123D2206K5375a73345m887d0089B5718f6821
10487h3743k50963A64589a08916B48289m8414K06208K01425j38557N9504k2587
10477E05868C5096J47484i4726A00616R5001m7147A1142a72146n295H8249B5039
$$ plain form
10556 -234714 -182584 99130 -152655 11348 211309 -77216 -22343 40505 -70743 -8951 -84070
10545 -84070 -242044 14024 188404 -177783 31570 -29518 274968 -62683 -137002 150847 -96201
10533 107186 -149291 173856 -192711 -99851 -144242 193599 -84729 -129581 -26241 -173389
10523 -173389 -92528 122565 181451 999 98276 3475 -207847 -116657 -55705 337486 114334
10511 171895 -253465 25860 -47359 -29107 -484282 39631 213119 160102 9345 -75425 33592
10499 -191153 -217219 -39279 287677 -109123 42206 67581 -173345 -178232 -40089 25718 -66821
10487 -83743 -334706 164589 -108916 248289 199875 406083 607508 468951 528455 505868
10477 505868 35096 182580 -94726 100616 195617 148470 11142 -172146 -177441 88249 25039
10465b63514A27667J45427H7318J57502e0498j28154p6658J26483k18508E6135
10454d6284k07342c8810D606J64007a58867j1140G6317e5179A05324q592f5462
10442A17176b42810c3908G8686i5295a9624G6312b4158A27323a70814A06975a9368
10430A86334a74874r1047A59174C0171b20470m5432c9454j12277c9450k53153
10420b92603B40833l6398m7941f736A23959a8358B83993F0494e1566j88729J06768
10409a33527j26110F9910b9344r6307n8778C5876c2370R831A12240M5688b0984
10397A99927m3246c47886a71075d04B70248p3853d7022D86784B9901L4928J4243
10386G9072b3014A36052b70005b4455B30554d4048B99051A34843J3043K47369
$$ plain form
10465 -263514 127667 273094 87318 244820 -50498 -178652 -255310 -128827 -347335 56135
10454 -46284 -253626 -38810 4606 168613 -158867 -170007 76317 -55179 105324 96732 -65462
10442 117176 -242810 -33908 78686 -95295 -19624 76312 -24158 127323 -170814 106975 -19368
10430 186334 -174874 -265921 159174 30171 -220470 -265902 -39454 -151731 -39450 -292603
10420 -292603 240833 204435 156494 -6736 123959 -18358 283993 60494 -51566 -240295 -133527
10409 -133527 -259637 69910 -29344 -125651 -184429 35876 -32370 -22539 112240 157928 -20984
10397 199927 156681 -347886 -171075 -404 270248 196395 -47022 486784 29901 64829 79072
10386 79072 -23014 136052 -270005 -24455 230554 -44048 299051 134843 147886 395255
10376C95255p6341A40953o1991J55453k4238J49835A57099K82648k14216p6740
10366A48791L65523A00069L74385J1039a06699E3250Q2097R9158G8006R8202J3590
10355A89798K68954n7260G3701J61237M76217j30776o0143G0273N05991a45008
10344A47810K49283A91949L41840B44817G4672J84057o7757L8605D8840J53397
10334B02237c3372A7095K15665o6605J76115A39903a55817e6993l0792d0412B32076
10322A88431B422N0242J03910e7710B97664G5696R5069K63826G1865R4376D1543
10310c04548c3953j0930i630k50573H3386b872k3365j19679N2381d4837A4452
10298b54350c9939A18489M3522b4477A48274c12516C7130K1418n923O6891o353
$$ plain form
10376 395255 318914 140953 78962 234415 210177 360012 157099 439747 225531 148791
10366 148791 514314 100069 474454 485493 -106699 53250 135347 234505 78006 176208 189798
10355 189798 458752 401492 73701 234938 711155 580379 520236 70273 576264 -145008
10344 147810 397093 191949 533789 244817 74672 258729 190972 229577 48840 202237
10334 202237 -33372 17095 232760 166155 342270 139903 -155817 -56993 -87785 -40412 232076
10322 188431 2422 52664 156574 -57710 297664 75696 170765 434591 71865 166241 41543
10310 -304548 -33953 -44883 -9630 -260203 83386 -2872 -26237 -145916 -93535 -44837 14452
10298 -254350 -39939 118489 162011 -24477 148274 -312516 37130 58548 52625 119516 113163
10287A13163D1537J23370a77821L3556b0097b641k5926l9653j50338D9593a86016
10275b49738b6185j95615l8251A95678J3721c89745b5423N456j43037B88776j21584
10264A67192p8212O7004A1747L68708K90416B56310K72633B07098J62617f912
10253A2844M9472a77605a7471o0493B40300k6155d39198d4367a0005l93499C22999
10241C80492A76757e2634A58333b73326A42697l5951b12166I1579c9705k83140
10231c22845a0931k13352I8285a71610h4032j62433J02699J0088c0340A57971
10220a10271c4138j14637G6499K58432a77635f2717j2336L954F4603J20209L4594
10209B19406F6718g1274j53158K6083a7913O560k5021j00802k4185F7539a41699
$$ plain form
10287 113163 41537 164907 -177821 -144265 -20097 -2641 -28567 -68220 -218558 49593 -186016
10275 -249738 -26185 -221800 -260051 195678 209399 -389745 -25423 -19967 -163004 288776 167192
10264 167192 88980 155984 11747 380455 670871 256310 528943 207098 369715 -6912
10253 12844 62316 -177605 -17471 -77964 240300 214145 -439198 -44367 -10005 -403504 322999
10241 380492 176757 -52634 158333 -273326 142697 106746 -212166 91579 -39705 -322845
10231 -322845 -10931 -224283 98285 -171610 -84032 -246465 -143766 -133678 -30340 157971
10220 -110271 -34138 -148775 76499 334931 -177635 -62717 -75053 -71099 64603 184812 219406
10209 219406 66718 -71274 -224432 -198349 -17913 -11353 -36374 -137176 -161361 67539 -141699
10197a25371C7574b71921a09448r5606e6144A26612e57458F5677J55635a34895
10186b47122F1777J5071a00188H7536b71522A43352b04161j84737J09863B75L01799
10175C02074a36410K2858A5353a54876K3511p508B1862i6925p6439p5721D13825
10163b21421C54101b45559J4139q2111a00571q3177L0741A31631A8731b05758
10152I1312h333q4393j02801j7300q6657c0558j57300j06213C09940H2509a34230
10140a25538D9657f0009j78436b5472j57726L6666A07948a6637k27293g3339k38659
10129c11998J35701A1329a03064A22922a18993J7284B28577j02377m3585b45322
10118B4013L50920A50071c26008a31328D4559a01911k46972a15348o5915A4541
$$ plain form
10197 -125371 37574 -271921 -109448 -205054 -56144 126612 -557458 65677 221312 -134895
10186 -247122 61777 76848 -100188 87536 -271522 143352 -204161 -388898 -279035 275 302074
10175 302074 -136410 -113552 15353 -154876 -131365 -138873 21862 -96925 -173364 -249085 413825
10163 -221421 354101 -245559 -231420 -313531 -100571 -183748 -153007 131631 18731 -205758
10152 91312 -8333 -92726 -195527 -212827 -299484 -30558 -187858 -294071 309940 82509 -134230
10140 -125538 49657 -60009 -238445 -25472 -183198 -146532 107948 -16637 -243930 -73339 -311998
10129 -311998 -176297 11329 -103064 122922 -118993 -101709 228577 126200 82615 -245322
10118 24013 374933 150071 -326008 -131328 44559 -101911 -348883 -115348 -181263 14541
10107I7383R3431c5462A6501b16884c5198k67191c9869C34002h5041j7823q0802
10096a83666H8636J2126J16653d8344D9442a64191D3586K0471a44642f7554E1811
10084A8436b12386A63276b2803n0916D4643e7329j50473i4956C20834a27397a2163
10072c7164A78557c79963B07792b03816k0346j29751E0558k2880h521m0533B88633
10060E5272a36045e759r5460B24655h9090I4222O8622b58174A34946N4687c4786
10048C0305J56244c5627J31J3822A29649b338B6636K12265D1957c12358g5251
10036A16281J81188e7007k9556c1265A09720b31862p5879a03657j57438J15550
10026a45545A3542a60411e9269n9551e6623A23584D16c19021J53670J0152B77381
$$ plain form
10107 97383 190814 -35462 16501 -216884 -35198 -302389 -39869 334002 -85041 -102864 -183666
10096 -183666 88636 100762 217415 -48344 49442 -164191 43586 64057 -144642 -67554 51811
10084 18436 -212386 163276 -22803 -73719 44643 -57329 -207802 -94956 320834 -127397 -12163
10072 -37164 178557 -379963 207792 -203816 -224162 -353913 50558 27678 -8521 -49054 288633
10060 55272 -136045 -5759 -101219 224655 -89090 94222 162844 -258174 134946 189633 -34786
10048 30305 186549 -35627 -35496 -21674 129649 -2338 26636 238901 41957 -312358 -75251
10036 116281 297469 -57007 -86563 -31265 109720 -231862 -307741 -103657 -261095 -145545
10026 -145545 13542 -160411 -59269 -118820 -56623 123584 416 -319021 -165351 -155199 277381
10014H8672d2408D1334K0260j5754b98118k20839C6850a12997o3557H2396C8640
10002D9154a65904L8854K4539l7495o3400I0715a07219k50875A66595a35804D0113
9990i1027A27348C1841K6207P5461a26733K0856k09725E0603A4174a0343k77631
9979b87974G2014B6907b06798B04182b73892R1033j8049Q4087A53582k3050K85
9968A30817c67855b7991A42720k4866J30127d76391a50767d0538m05070J05503
9958c40105K5279b2643A03530b6869F3384q865a60749B09122a64397H4176e03047
9946A74845D2228J86563D5164P2645b83185E0459b12669h8345l87297b6244B12895
9934b0562n9934E7718a86402J6010l2800b2256o2827E2232b1341h283B35645a9436
$$ plain form
10014 88672 -42408 41334 61594 45840 -298118 -518957 36850 -112997 -176554 82396 38640
10002 49154 -165904 -127050 -102511 -140006 -203406 90715 -107219 -358094 166595 -135804 40113
9990 -91027 127348 31841 58048 133509 -126733 -105877 -315602 50603 14174 -10343 -287974
9979 -287974 72014 26907 -206798 204182 -273892 -182859 -200908 -116821 153582 130532 130817
9968 130817 -367855 -27991 142720 117854 247981 -476391 -150767 -40538 -445608 -340105
9958 -340105 -314826 -22643 103530 -26869 63384 54519 -160749 209122 -164397 84176 -503047
9946 174845 42228 228791 45164 117809 -283185 50459 -212669 -88345 -475642 -26244 212895
9934 -20562 -80496 57718 -186402 -170392 -203192 -22256 -85083 52232 -21341 -8283 235645 -19436
9921b0181C40525a79870c1493r5820B02106f4482K8775k03283I1455e2335j4888
9910f7223k09897A60663m4857c19470a47731n4048A2596J54537d1194j05205n0950
9899a97349c7685i251E5812c24866I0576B8053c43519B1213c68267C215f2835
9887B79433a47473D2872a63939A54990b48245B5802a67064A63445K22693E2344
9876b15380R7988A16722a49358A92893a07127M6208k3405D8637a16391B0174f1940
9864a30863N3375j92769d6261A10604f9353O046r4142q3834N8078A81297c1037
9852h0140B62750g4322A20659M7983a01978B01430a88980N4267e502k13689R0105
9841a29086p5606H175J29240a69320K2806P0902n8401A07460f6242k20670f4580
$$ plain form
9921 -20181 340525 -179870 -31493 -127313 202106 -64482 -35707 -238990 91455 -52335 -67223
9910 -67223 -277120 160663 115806 -319470 -147731 -201779 12596 167133 -41194 -146399 -197349
9899 -197349 -37685 -9251 55812 -324866 90576 28053 -343519 21213 -368267 3215 -62835
9887 279433 -147473 42872 -163939 154990 -248245 25802 -167064 163445 386138 52344
9876 -215380 -117392 116722 -149358 192893 -107127 -60919 -84324 48637 -116391 20174 -61940
9864 -130863 -77488 -270257 -46261 110604 -69353 -63307 -157449 -241283 -183205 181297 -31037
9852 -80140 262750 -74322 120659 168642 -101978 201430 -188980 -134713 -5502 -219191 -129086
9841 -129086 -204692 8175 137415 -169320 -146514 -75612 -134013 107460 -66242 -286912 -64580
9829C9776J57218h6351C56708a58544b7561i242A84445n3457b27714h1991I0754
9817a9967l33727d3422B8270f4692F3187b22426A08062a34224m1737B9391J95379
9806B24770c28016b3670k29482D3492c9280k07478A24613a39937B3816a27847
9795b22825A0672L8902d65799a28545L7176M849j0704j98439O018G2995g3995
9783a0277j68j3025B92064b63429F8096A7784a30404N9573O215A99444a44122
9771g2372D024c0655j32905j40436Q9038e9467b1113n2443l39154a88816A09887
9759A45403l8994K70957A8664g9716b6727F4486c1167k17418A1244g4486m6441
9748a20927H2568A8571b2752q4547n9602m4099C58923A04876a17796j33913I8430
$$ plain form
9829 39776 196994 -86351 356708 -158544 -27561 -9242 184445 130988 -227714 -81991 90754
9817 -19967 -353694 -43422 28270 -64692 63187 -222426 108062 -134224 -175961 29391 224770
9806 224770 -328016 -23670 -253152 43492 -39280 -246758 124613 -139937 23816 -127847
9795 -222825 10672 49574 -465799 -128545 -91369 -86520 -97224 -295663 -289645 72995 -73995
9783 -10277 -10445 -23470 292064 -263429 68096 17784 -130404 -70831 -64616 199444 -144122
9771 -72372 4024 -30655 -163560 -303996 -214958 -59467 -21113 -73556 -412710 -188816 109887
9759 145403 106409 377366 18664 -79716 -26727 64486 -31167 -248585 11244 -74486 -120927
9748 -120927 82568 18571 -22752 -107299 -166901 -211000 358923 104876 -117796 -251709 98430
9736c37864a09610r034A24054e4073j21816I0705K45775d4715m3336A62406b19774
9724a85488B07940K6824e8612j34551j67210J41132Q5812K0404b739l4819B09311
9712A86554l2730d0475n6692j61219i5884L1422r0086k17570J08728b6824j43636
9701a70460j21324O0681B49134A9735K7341J0267R1028D658i8862Q265l1802H0044
9688b15386n3091f506j48621B05220a46713I3011b7799j32822G277a3955j53111
9677a67066o1869c1277H7449a07945j99486L7170P4469A8168K34587a00114A6384
9665A14604b28599q5811L0545f3704K2564k4229H0962a32995m7879j05631g2466
9653a04999N2411H5840a25002m58525b33601P8295N3939G2145h9419K7734A7133
$$ plain form
9736 -337864 -109610 -118644 124054 -54073 -175889 90705 336480 -44715 -88051 162406 -219774
9724 -185488 207940 234764 -58612 -193163 -360373 -219241 -133429 -113025 -2739 -37558 209311
9712 186554 153824 -40475 -97167 -258386 -95884 -64462 -154548 -372118 -263390 -26824 -170460
9701 -170460 -291784 -231103 249134 19735 47076 57343 148371 4658 -98862 -90597 -122399 80044
9688 -215386 -268477 -6506 -155127 205220 -146713 93011 -27799 -160621 7277 -13955 -167066
9677 -167066 -228935 -31277 87449 -107945 -307431 -270261 -195792 18168 252755 -100114 16384
9665 114604 -228599 -314410 -283865 -63704 -41140 -65369 80962 -132995 -180874 -286505 -72466
9653 -104999 -52588 85840 -125002 -583527 -233601 -155306 -101367 72145 -89419 -61685 17133
9641b58343B04945a10895B78129C4329J30507h6292B03874b38995E7527K47853
9631C05380A47319c90102J34389a05l12012a37486F4837a15380j5688q79j34086
9620b66033e2222l91645h3815b3604k49731c2170j16562C367a18593C2496a53820
9608c32664a18781j42001J11800P2307A23246B6299h6709A81285a0062E8736J71180
9597B29916h6607j7183F6585f7554K6082A94574o0002b86884G2827B2014a61224
9585h3611A99136p4071H345c901A5863b76443C9077A6127e0736a7089j96403g1905
9572b56061j01472N7532B56811B4232L12745g7649j91832b974A88720q1286b63283
9560b01592N1961d0251j45313g4297B02772b22943A008a22644k747b7654G993
$$ plain form
9641 -258343 204945 -110895 278129 34329 164836 -86292 203874 -238995 57527 305380
9631 305380 147319 -390102 -255713 -105 -312117 -137486 64837 -115380 -131068 -131947 -266033
9620 -266033 -52222 -443867 -83815 -23604 -273335 -32170 -148732 3367 -118593 32496 -153820
9608 -332664 -118781 -260782 -148982 -76675 123246 26299 -86709 181285 -10062 58736 229916
9597 229916 -86607 -103790 66585 -67554 -41472 194574 134572 -286884 72827 22014 -161224
9585 -83611 199136 125065 8345 -3901 15863 -276443 39077 16127 -50736 -17089 -213492 -71905
9572 -256061 -357533 -300001 256811 24232 336977 -77649 -269481 -2974 188720 107434 -263283
9560 -201592 -149631 -40251 -185564 -74297 202772 -222943 1008 -122644 -125391 -27654 7993
9548A19328a22919N3460m6161a7415H454O1163b6536k9673I5767h5544p7696f5437
9535f8258k04663i2991j6752q8098F4284I61L3889b25404M6872F5211k7038a01552
9522E8733d007j05077B11963H2474L6366b77515j82052B43841E2841a71596M7985
9511a23611K3989j34456P3228K7933B23274E2079a4997F733J93327H6371b19863
9499c89429B28543I0267b40373A76387b04706J0422i2245A25490L68D9950a58010
9487a18554l3238A03109a94777j26823J49946d2365C05163a17095N7297j7408
9477g7206l4463B3522a82493J2157b6891A53412b4558A451b36749J12310j36356
9466b60795c6180j03197e091j99765A26538J79660b6575F1301h1949a2797m5652
$$ plain form
9548 119328 -122919 -69459 -115620 -17415 8454 69617 -26536 -56209 95767 -85544 -163240 -65437
9535 -68258 -272921 -92991 -109743 -197841 64284 961 34850 -225404 -178532 65211 38173 -101552
9522 58733 -4007 -109084 211963 82474 118840 -277515 -459567 243841 52841 -171596 -123611
9511 -123611 -99622 -234078 -160850 -132917 223274 52079 -14997 6733 200060 86371 -219863
9499 -389429 228543 90267 -240373 176387 -204706 -194284 -92245 125490 125858 49950 -158010
9487 -118554 -151792 103109 -194777 -321600 -171654 -42365 305163 -117095 -59798 -77206
9477 -77206 -111669 23522 -182493 -170336 -26891 153412 -24558 1451 -236749 -124439 -260795
9466 -260795 -36180 -139377 -5091 -204856 126538 306198 -26575 61301 -81949 -12797 -58449
9455e8449o9289A81960i1534I1199d42988A7177f1974I4394a40081N8959L1512
9444d9610j9763j56017P4895A47700O2118m6531c41155f6085A14773c9759j45625
9433a85384R2449H3224a4797A3801b91401O0781M1734c6422n5987k8301q8178
9422b08888b8920e663k35738i8152c0830j91405k4110a327C67724a78206D14192
9410e208B61772c7081k31398g0808A70964b92158h0835p6497B8770f6065f180
9398a14077K1221c7189j23347j24953B6019g7127j05785o7177M5795N820A8518
9386B29482N936b3247E8316c13122J33354Q2433j59994B7877b33487g756B73658
9374A02178a75369C28684h4059k53981J27701R8534O125o6634O1008j93608h3158
$$ plain form
9455 -58449 -127738 181960 -91534 91199 -442988 17177 -61974 94394 -140081 -81122 -49610
9444 -49610 -69373 -225390 -150495 147700 209818 163287 -341155 -66085 114773 -39759 -185384
9433 -185384 -92935 83224 -14797 13801 -291401 -230620 -188886 -36422 -92409 -120710 -208888
9422 -208888 -28920 -5663 -241401 -98152 -30830 -222235 -246345 -1327 367724 -178206 414192
9410 -5208 261772 -37081 -268479 -70808 170964 -292158 -80835 -157332 28770 -66065 -6180
9398 -114077 -92856 -37189 -160536 -285489 26019 -77127 -182912 -250089 -204294 -198474 18518
9386 229482 235418 -23247 58316 -313122 -179768 -97335 -257329 27877 -233487 -7756 273658
9374 102178 -175369 328684 -84059 -338040 -210339 -111805 -105680 -172314 -111306 -304914 -83158
9362a80728C0969a30785D4439f9673l12565A65116e2831o6189a6976E0356L411
9351E3767a5009j56664Q1407A68517d8583A39265b27924R2807j0803p2268O8920
9340a49268j4293K644A69126A8708c25769R9749n589D4953J07010b25034K2987
9329b02047B78691a0514j31098K4962g002A86135b10568A32971k9427M0800R5760
9318B40104d62311h0775b4357I119b10384j00366A3385P876d7330m5388M2225
9307e0493j26145l2522K6031A94413F1233B7454c1308E6866A4743a89891A22234
9295d9678k09350D2741e4579j20087I856A496a56355k8173A63842f41959c10854
9283B4116K8387r199J11247b06484K3858I8519b19310h0115A42172D2216L2875
$$ plain form
9362 -180728 30969 -130785 44439 -69673 -382238 165116 -52831 -119020 -16976 50356 53767
9351 53767 -15009 -171673 -90266 168517 -48583 139265 -227924 -135117 -145920 -218188 -149268
9340 -149268 -163561 -160917 169126 18708 -325769 -226020 -231609 44953 151963 -225034 -202047
9329 -202047 278691 -10514 -141612 -116650 -7002 186135 -210568 132971 103544 144344 240104
9318 240104 -462311 -80775 -24357 9119 -210384 -310750 13385 21261 -47330 -92718 -50493
9307 -50493 -176638 -209160 -183129 194413 61233 27454 -31308 56866 14743 -189891 122234
9295 -49678 -259028 42741 -54579 -174666 9856 1496 -156355 -184528 163842 -641959 -310854
9283 24116 52503 43304 154551 -206484 -182626 98519 -219310 -80115 142172 42216 75091
9272G5091c42215a23894B93105e5785a8482j236j37472A49711b28169b3526A61141
9260c69533A97204H0363b5761k64966A593K2750P2965f0745j3360k08001d9372
9248a76167E9135K0041K4734N218a29749K0969b7500p7652k274j99079a27737
9236b27470L2903r6170H6087c29985p3862f6351q122F9535c8882B27093m0634
9225A86459c29085a0359B3565E022a98002j32100A26386b44741P0856h467A72059
9213a57484j63513O0904D8978a09138C9942f7783m5822n0246P3327D723a19992
9201D47449g8519n6003r5939A48776B0544J84359b3732q2098A8080J65477G8254
9189A34009h5581k07867j26019a31693n9023e2022m1807o001M719j12918c2784
$$ plain form
9272 75091 -342215 -123894 293105 -55785 -18482 -19718 -157190 149711 -228169 -23526 161141
9260 -369533 197204 80363 -25761 -290727 1593 24343 97308 -60745 -74105 -282106 -49372
9248 -176167 59135 79176 103910 109128 -129749 -108780 -27500 -105152 -107426 -306505 -127737
9236 -227470 -194567 -290737 86087 -329985 -403847 -66351 -74473 69535 -38882 227093 186459
9225 186459 -329085 -10359 23565 5022 -198002 -330102 126386 -244741 -173885 -8467 172059
9213 -157484 -320997 -260093 48978 -109138 39942 -67783 -113605 -163851 -90524 4723 -119992
9201 447449 -78519 -134522 -230461 148776 20544 204903 -23732 -105830 18080 183557 78254
9189 134009 -85581 -293448 -419467 -131693 -190716 -52022 -93829 -99830 -95111 -208029 -32784
9177c13951K4687C4821K59865A9981b20381o6027c6645D1032R9154i8487P048
9166i1439A12556J38321G4629a31112m414A3136a57739A16577a01774J7776l3237
9155a17235L0957A32140a89887A62237k6239a76255B45595b48357A77736a50229
9144C21272a25054F2601J50940c35914i3653k42270B87180b27935o1445H0939
9133b86466R8706p4068n5820O9214n5804J05910Q5564D3516a90560A94743a6877
9121H2863C2173c29441b2050A46038a57560H395J29761o5579b82147C9546J54054
9110A93600b64994A32705b2646j14980f1222B41108d2951B15739I6895R7154N9591
9099B53640G4974J6695c01156J43571g1760l56310B3138Q2191b4602k74976F6677
$$ plain form
9177 -313951 -289264 34821 294686 19981 -220381 -286408 -36645 41032 140186 -98487 -91439
9166 -91439 112556 250877 74629 -131112 -135526 13136 -157739 116577 -101774 -83998 -117235
9155 -117235 -86278 132140 -189887 162237 135998 -176255 245595 -248357 177736 -150229
9144 321272 -125054 62601 213541 -335914 -93653 -335923 287180 -227935 -289380 80939
9133 -286466 -187760 -261828 -317648 -248434 -304238 -198328 -112764 43516 -190560 194743 -16877
9121 82863 32173 -329441 -22050 146038 -157560 8395 138156 72577 -282147 39546 193600
9110 193600 -264994 132705 -22646 -137626 -61222 241108 -42951 215739 96895 194049 253640
9099 253640 74974 91669 -301156 -157585 -71760 -428070 23138 105329 -24602 -299578 66677
9087A25915a56121N7032B01200G2973a99030B7a96694j05004E8035L7091i0388
9075E652e06819a5085k18769G6375j947a61985j0410O7012A06287a49058B85778
9063C3785a25526a0227r1344A65232D0438e1340j67200D7304a09221A94060A9379
9051b25865f0674l33110a75845M6485n6457H0102b18457e2630j52382P7492C7269
9039b13913A1912J17011i2338A36471a57204r9770P5652j6149O9203B7001c12459
9027c9823j35629L4130O0907A2751a00944A95830a04811G7397a4137j31553c7947
9015I3615M2294g8636c7529j03069l5557B54732a25152l47209A69172b86829C5647
9003a68208A97627J04251a5380l34985J00119A77409k557q0061J22372c05596
$$ plain form
9087 125915 -156121 -99089 201200 72973 -199030 27 -196694 -301698 58035 95126 -90388
9075 5652 -506819 -15085 -233854 76375 74428 -161985 -172395 -105383 106287 -149058 285778
9063 33785 -125526 -10227 -101571 165232 40438 -51340 -218540 47304 -109221 194060 19379
9051 -225865 -60674 -393784 -175845 -129360 -185817 80102 -218457 -52630 -205012 -127520 37269
9039 -213913 11912 128923 -92338 136471 -157204 -256974 -181322 -197471 -128268 27001 -312459
9027 -39823 -175452 -141322 -80415 12751 -100944 195830 -104811 77397 -14137 -145690 -37947
9015 93615 135909 -78636 -37529 -140598 -176155 254732 -125152 -472361 169172 -286829 35647
9003 -168208 197627 301878 -15380 -350365 -250246 177409 174852 94791 217163 -305596
8992a4444m2297l22402a46201B89535a64031C49320C830J89135a04741j16776
8982b21517B10865i1408L0316B19338i8413A95561R1571c42043I1610i5865A10650
8970B0674j997d34024C5312c56075A23539b98109a4699j26427d3147j00572B60295
8958A75337C8914a40644L0123k2951K514b7264p6531l1766f2862j09666F540a55805
8945a29849j49140e6887A93892r802O3927F2848f4909k96701K6400e5378C60752
8933B02998c3594j03102b2157j33159j18614I1597c279j55913A68014O08955P26671
8922A503640L091366K565235B056140G01746C21244K3039a56205B45940M018c78116
8911e5666j115J2425j62407I8859D5784c27349G4294a37751F3881M9631b16262
$$ plain form
8992 -14444 -56741 -379143 -146201 289535 -164031 349320 3830 192965 -104741 -221517
8982 -221517 210865 -91408 -61092 219338 -98413 195561 287132 -342043 91610 -95865 110650
8970 20674 18677 -434024 35312 -356075 123539 -298109 -14699 -141126 -43147 -143719 260295
8958 175337 38914 -140644 -110521 -133472 -130958 -27264 -103795 -135561 -62862 -172528 6540 -155805
8945 -129849 -278989 -56887 193892 184090 248017 62848 -64909 -361610 -335210 -55378 360752
8933 202998 -33594 -136696 -22157 -155316 -273930 91597 -3279 -159192 168014 776969 1503640
8922 1503640 4595006 7160241 2056140 701746 321244 344283 -156205 245940 249958 -378116
8911 -55666 -56781 -44356 -206763 98859 45784 -327349 74294 -137751 63881 113512 -216262
8899c39943G0733a44251J4041E8038b0711E8994P7671n9872c05689B8628J48156
8888A76784a00275F3194f6413b4187p0118D44969a45230A25961C082J06051a07597
8876f7766k2784c9999E0407a74949I734c03200E316c8861m4122j22604i0366d0343
8863a2850q4467G9853c99981a24896M1612j38663B73143a99538F2443N5857f3624
8851A68442e3224j46838O6457C19622d6730J0333n6315B47096J8961D7260M2660
$$ plain form
8899 -339943 70733 -144251 -130210 58038 -20711 58994 136665 76793 -305689 28628 176784
8888 176784 -100275 63194 -66413 -24187 -94305 444969 -145230 125961 3082 109133 -107597
8876 -67766 -90550 -39999 50407 -174949 9734 -303200 5316 -38861 -82983 -205587 -90366 -40343
8863 -12850 -97317 79853 -399981 -124896 -83284 -221947 273143 -199538 62443 118300 -63624
8851 168442 -53224 -200062 -133605 319622 -46730 -36397 -92712 247096 266057 47260 89920
$$ [...]
##END NTUPLES=NMR SPECTRUM
##END=
