##TITLE=AC1687_PANAM14368_8637553_FEcPcazRuK
##JCAMPDX= 6.0         $$ Bruker NMR JCAMP-DX V2.0
##DATA TYPE= NMR SPECTRUM
##DATA CLASS= NTUPLES
##ORIGIN= BRUKER
##OWNER= Administrator
$$ 1.72 TOPSPIN		Version 2.1
$$ 2014-05-31 01:28:36.492 -0700  Administrator@X
$$ Compression mode = diff/dup
##.OBSERVE FREQUENCY= 400.02188249412
##.OBSERVE NUCLEUS= ^1H
##.ACQUISITION MODE= SIMULTANEOUS (DQD)
##.ACQUISITION SCHEME= undefined
##.AVERAGES= 64
##.DIGITISER RES= 22
##SPECTROMETER/DATA SYSTEM= spect
##.PULSE SEQUENCE= noesygpps1d.comp
##.SOLVENT NAME= COFFEE_meoh
##.SHIFT REFERENCE= INTERNAL, COFFEE_meoh, 1, 14.96096
##AUDIT TRAIL= $$ (NUMBER, WHEN, WHO, WHERE, PROCESS, VERSION, WHAT)
$$ ##TITLE= Audit trail, TOPSPIN		Version 2.1
$$ ##JCAMPDX= 5.01
$$ ##ORIGIN= Bruker BioSpin GmbH
$$ ##OWNER= Administrator
$$ $$ E:\/data/COFFEE/nmr/AC1687_PANAM14368_8637553_FEcPcazRuK/12/pdata/1/auditp.txt
$$ ##AUDIT TRAIL=  $$ (NUMBER, WHEN, WHO, WHERE, PROCESS, VERSION, WHAT)
(   1,<2014-05-31 01:28:31.351 -0700>,<Administrator>,<X>,<go>,<TOPSPIN 2.1>,
      <created by zg
	started at 2014-05-31 01:17:01.845 -0700,
	POWCHK enabled, PULCHK disabled,
       configuration hash MD5:
       C8 4E 4E 5D D3 5C D8 9E 9F 52 82 E0 59 8A DE 15
       data hash MD5: 64K
       38 A3 57 DC 46 97 34 94 CC 8C C8 32 D8 C2 2B 27>)
(   2,<2014-05-31 01:28:34.351 -0700>,<Administrator>,<X>,<proc1d>,<TOPSPIN 2.1>,
      <Start of raw data processing
       efp LB = 0.3 FT_mod = 6 PKNL = 1 PHC0 = 0 PHC1 = 0 SI = 128K 
       data hash MD5: 128K
       53 9D F5 CE 14 DE DA 80 2D 49 62 08 E6 A9 3B 95>)
(   3,<2014-05-31 01:28:35.414 -0700>,<Administrator>,<X>,<proc1d>,<TOPSPIN 2.1>,
      <pk PHC0 = -86.90735 PHC1 = 0 
       data hash MD5: 128K
       E1 CB 1B A7 DF A3 DD 6F 81 B8 DC 46 1B 42 21 6B>)
(   4,<2014-05-31 01:28:35.836 -0700>,<Administrator>,<X>,<proc1d>,<TOPSPIN 2.1>,
      <abs ABSG = 1 
       data hash MD5: 128K
       72 F6 F3 C4 E5 1A CD C1 91 44 6F 93 5D 01 3E 08>)
(   5,<2014-05-31 01:28:35.945 -0700>,<Administrator>,<X>,<proc1d>,<TOPSPIN 2.1>,
      <abs ABSG = 2 
       data hash MD5: 128K
       DE 3C 44 1A FB EE E9 9A D1 46 3A 86 74 24 2E 02>)
(   6,<2014-05-31 01:28:36.039 -0700>,<Administrator>,<X>,<proc1d>,<TOPSPIN 2.1>,
      <abs ABSG = 3 
       data hash MD5: 128K
       A0 F4 FF 85 3D 4D 98 05 7F D3 F9 AE AF CB 88 47>)
(   7,<2014-05-31 01:28:36.164 -0700>,<Administrator>,<X>,<proc1d>,<TOPSPIN 2.1>,
      <abs ABSG = 4 
       data hash MD5: 128K
       CA 8D 66 59 AA 52 EA 5C 0F 1D B5 DA B7 B3 E9 E7>)
(   8,<2014-05-31 01:28:36.273 -0700>,<Administrator>,<X>,<proc1d>,<TOPSPIN 2.1>,
      <abs ABSG = 5 
       data hash MD5: 128K
       FE FD AE 56 63 56 C0 2E 78 6A F9 3E BA BA 7D 55>)
$$ ##END=
$$ 
$$ $$ hash MD5
$$ $$ A4 36 DD AA 06 B9 5B 40 1C 4D 92 39 80 E5 D3 1B
##$RELAX= 
##$RELAX= 
##$RELAX= 
##$RELAX= 
##$RELAX= 
##$RELAX= 
##$RELAX= 
##$RELAX= 
$$ Bruker specific parameters
$$ --------------------------
##$DU= <E:\>
##$EXPNO= 12
$$ [...]
150 150 150 150 150 150 150 150
##$TP07= 0
##$TPNAME0= <>
##$TPNAME1= <>
##$TPNAME2= <>
##$TPNAME3= <>
##$TPNAME4= <>
##$TPNAME5= <>
##$TPNAME6= <>
##$TPNAME7= <>
##$TPOAL= (0..7)
0.5 0.5 0.5 0.5 0.5 0.5 0.5 0.5
##$TPOFFS= (0..7)
0 0 0 0 0 0 0 0
##$TUNHIN= 0
##$TUNHOUT= 0
##$TUNXOUT= 0
##$USERA1= <user>
##$USERA2= <user>
##$USERA3= <user>
##$USERA4= <user>
##$USERA5= <user>
##$V9= 5
##$VALIST= <valist>
##$VCLIST= <CCCCCCCCCCCCCCC>
##$VD= 0
##$VDLIST= <DDDDDDDDDDDDDDD>
##$VPLIST= <PPPPPPPPPPPPPPP>
##$VTLIST= <TTTTTTTTTTTTTTT>
##$WBST= 2048
##$WBSW= 25
##$XGAIN= (0..3)
0 0 0 0
##$XL= 0
##$YL= 0
##$YMAX_a= 5813345
##$YMIN_a= -11887098
##$ZGOPTNS= <>
##$ZL1= 120
##$ZL2= 120
##$ZL3= 120
##$ZL4= 120
##$ABSF1= 14.96096
##$ABSF2= -5.597221
##$ABSG= 5
##$ABSL= 3
##$ALPHA= 0
##$AQORDER= 0
##$ASSFAC= 0
##$ASSFACI= 0
##$ASSFACX= 0
##$ASSWID= 0
##$AUNMP= <proc_prof1d_extract.lims>
##$AXLEFT= 0
##$AXNAME= <>
##$AXNUC= <1H>
##$AXRIGHT= 0
##$AXTYPE= 0
##$AXUNIT= <>
##$AZFE= 0.1
##$AZFW= 0.1
##$BCFW= 0
##$BC_mod= 0
##$BYTORDP= 0
##$COROFFS= 0
##$CY= 15
##$DATMOD= 1
##$DC= 0
##$DFILT= <>
##$DTYPP= 0
##$F1P= 0
##$F2P= 0
##$FCOR= 0.5
##$FTSIZE= 131072
##$FT_mod= 6
##$GAMMA= 0
##$GB= 0
##$INTBC= 1
##$INTSCL= 1
##$ISEN= 128
##$LB= 0.3
##$LEV0= 0
##$LPBIN= 0
##$MAXI= 10000
##$MC2= 0
##$MEAN= 0
##$ME_mod= 0
##$MI= 0
##$NCOEF= 0
##$NC_proc= -2
##$NLEV= 6
##$NOISF1= 0
##$NOISF2= 0
##$NSP= 0
##$NTH_PI= 0
##$NZP= 0
##$OFFSET= 14.96096
##$PC= 1
##$PHC0= -86.90735
##$PHC1= 0
##$PH_mod= 1
##$PKNL= yes
##$PPARMOD= 0
##$PPDIAG= 0
##$PPIPTYP= 0
##$PPMPNUM= 2147483647
##$PPRESOL= 1
##$PSCAL= 4
##$PSIGN= 0
##$PYNMP= <proc.py>
##$REVERSE= no
##$SF= 400.0200096534
##$SI= 131072
##$SIGF1= 0
##$SIGF2= 0
##$SINO= 400
##$SIOLD= 131072
##$SPECTYP= <>
##$SREGLST= <1H.CDCl3>
##$SSB= 0
##$STSI= 131072
##$STSR= 0
##$SW_p= 8223.68421052631
##$SYMM= 0
##$S_DEV= 0
##$TDeff= 65536
##$TDoff= 0
##$TI= <>
##$TILT= no
##$TM1= 0
##$TM2= 0
##$TOPLEV= 0
##$USERP1= <user>
##$USERP2= <user>
##$USERP3= <user>
##$USERP4= <user>
##$USERP5= <user>
##$WDW= 1
##$XDIM= 131072
##$YMAX_p= 411466408
##$YMIN_p= -11946
##$CURPLOT= <Network HP LaserJet P1505>
##$CURPRIN= <$Network HP LaserJet P1505>
##$DFORMAT= <normdp>
##$LAYOUT= <+/1D_H.xwp>
##$LFORMAT= <normlp>
##$PFORMAT= <normpl>
##$SURQMSG= 1
$$ End of Bruker specific parameters
$$ ---------------------------------
##NTUPLES= NMR SPECTRUM
##VAR_NAME=  FREQUENCY,     SPECTRUM/REAL,   SPECTRUM/IMAG
##SYMBOL=    X,             R,               I
##VAR_TYPE=  INDEPENDENT,   DEPENDENT,       DEPENDENT
##VAR_FORM=  AFFN,          ASDF,            ASDF
##VAR_DIM=   131072,        131072,          131072
##UNITS=     HZ,            ARBITRARY UNITS, ARBITRARY UNITS
##FACTOR=    0.0627417313425164, 1,          1
##FIRST=     8223.62146879497, 730,          -56503
##LAST=      0,             1575,            -56488
##MIN=       0,             -11946,          0
##MAX=       8223.62146879497, 411466408,    0
$$ Real data points
##PAGE= N=1
##DATA TABLE= (X++(R..R)), XYDATA
$$ [...]
63882F22852j4725j3262j2229j0823q402n512l133j369M74K763N162P248Q929
$$ 622852 608127 594865 582636 571813 563411 557899 554766 553397 553871 556634 561796 569044 577973
63869E77973J0272J1412J2589J3907J5059J5582J5439J5085J4897J4713J3991
$$ 577973 588245 599657 612246 626153 641212 656794 672233 687318 702215 716928 730919
63858G30919J2381J0160Q052O444M899K654l20l161n134o445p769r370j1052j2753
$$ 730919 743300 753460 761512 767956 772855 775509 775189 772028 766894 760449 752680 743310 732258 719505
63844G19505j4646j6604j8049j8612j8720j9164k0129k0975k1100k0691k0321
$$ 719505 704859 688255 670206 651594 632874 613710 593581 572606 551506 530815 510494
63833E10494k0009j9218j7842j6560j5969j5732j5119j4031j2969j2200j1455
$$ 510494 490485 471267 453425 436865 420896 405164 390045 376014 363045 350845 339390
63822C39390j0410r045p571o356n769n730n507m512l157k416k559k851k555j637
$$ 339390 328980 319935 312364 306008 300239 294509 289002 284490 281333 278917 276358 273507 270952 269315
63808B69315m79N33R53N21k73m48K58Q67L48j042k107k237k060k507l617m523
$$ 269315 268836 269369 270322 270843 270570 270122 270380 271247 271595 270553 268446 266209 264149 261642 258025 253502
63792B53502m487l691k806k089j278m51l24j315k728l485l344k828k160j118J03
$$ 253502 249015 245324 242518 240429 239151 238700 238376 237061 234333 230848 227504 224676 222516 221398 221501
63777B21501P74O16K06N9p2n34r43o49K97J151J362R96L80l24j039j594j725j352
$$ 221501 222275 222891 223097 223156 223084 222550 221607 220958 221255 222406 223768 224764 225144 224820 223781 222187 220462 219110
63759B19110p61m44o29j003j102q01l26J21M81P15Q97J248J755J890J213J87j18
$$ 219110 218349 217905 217276 216273 215171 214370 214044 214165 214646 215361 216258 217506 219261 221151 222364 222551 222433
63742B22433P43K103L060L371L317L127K863K582K317K020J650J291J080J122
$$ 222433 223176 225279 228339 231710 235027 238154 241017 243599 245916 247936 249586 250877 251957 253079
63728B53079J498K164K910L526L962M231M345M465M843N367N499M974M238L742
$$ 253079 254577 256741 259651 263177 267139 271370 275715 280180 285023 290390 295889 300863 305101 308843
63714C08843L257K376J254K23r39k428l494l163j848j062j446k105k112j618j072
$$ 308843 312100 314476 315730 315953 315014 312586 309092 305929 304081 303019 301573 299468 297356 295738 294666
63699B94666m47K30M99K98L97J308K430K967L059L240L356K962K277J827J404
$$ 294666 294219 294449 294948 295246 295643 296951 299381 302348 305407 308647 312003 314965 317242 319069 320473
63684C20473L46j172k037j621n97p4l33q31j044r93q77o03J14J169J976K098J755
$$ 320473 320819 319647 317610 315989 315392 315318 314985 314154 313110 312117 311240 310637 310751 311920 313896 315994 317749
63667C17749J365R16K94m6M34J240J092m25k246l208l368l518m011m647n155n258
$$ 317749 319114 320030 320324 320278 320712 321952 323044 322619 320373 317165 313797 310279 306268 301621 296466 291208
63651B91208m703l733l067k961k741j833p66m25p58r39o04j20J89M42P70J120
$$ 291208 286505 282772 279705 276744 274003 272170 271404 270979 270221 269282 268678 268558 268747 269189 269959 271079
63635B71079J502K015K594L135L750M544N273N630N728N868O048O135O396P243
$$ 271079 272581 274596 277190 280325 284075 288619 293892 299522 305250 311118 317166 323301 329697 336940
63621C36940Q585R956J1248J2700J4170J5099J5423J5921J7350J9522K1636K3235
$$ 336940 345525 355481 366729 379429 393599 408698 424121 440042 457392 476914 498550 521785
63609E21785K4591K6246K8341L0341L1350L0773K8651K5291K0717J4797P958J455
$$ 521785 546376 572622 600963 631304 662654 693427 722078 747369 768086 782883 790841 792296
63597G92296l336n805o358n946n490n516o132p259q923j1230j4035j6806j9040
$$ 792296 788960 783155 776797 770851 765361 759845 753713 746454 737531 726301 712266 695460 676420
63584F76420k0716k2152k3273k3443k2264k0316j8598j7267j5527j2883r941p572
$$ 676420 655704 633552 610279 586836 564572 544256 525658 508391 492864 479981 470040 462468
63572D62468n811m133k339n69J244L155M671N228N199N602O715P714P890P583
$$ 462468 456657 452524 450185 449616 450860 454015 458686 463914 469113 474715 481430 489144 497034 504617
63558E04617P588Q223R287J0484J1630J2786J4354J6698J9617K2632K5760K9413
$$ 504617 512205 520428 529715 540199 551829 564615 578969 595667 615284 637916 663676 693089
63546F93089L3521L7373M0270M1569M0050L4382K4689J2970J623p779j4131j6613
$$ 693089 726610 763983 804253 845822 885872 920254 944943 957913 959536 951757 937626 921013
63534I21013j5606j2957j0439q506p099o787q095j0518j3248j6483k0851k5867
$$ 921013 905407 892450 882011 873505 866406 859619 851524 841006 827758 811275 790424 764557
63522G64557l0030l2377l3114l2768l1605k9845k7707k5184k2353j9749j7836
$$ 764557 734527 702150 669036 636268 604663 574818 547111 521927 499574 479825 461989
63511D61989j6206j4142j1839j0226r554q990p874o618n873n455m635l227j873
$$ 461989 445783 431641 419802 409576 400022 391032 383158 376540 370667 365212 360577 357350 355477
63498C55477j230j235j344j293j329j599j696j162k50L56N09O52R27R82Q49J141
$$ 355477 354247 353012 351668 350375 349046 347447 345751 344589 344339 344695 345204 345856 346783 347765 348614 349755
63482C49755K019K725K675K302K253K460K651L013L551L424J931k79j913k551
$$ 349755 351774 354499 357174 359476 361729 364189 366840 369853 373404 376828 378759 378480 376567 374016
63468C74016k701k702k513k278k168j852j036l08m82j258j479o60O23J789K715
$$ 374016 371315 368613 366100 363822 361654 359802 358766 358458 357976 356718 355239 354579 355202 356991 359706
63453C59706L275L366L503M457O122P565Q326Q878R680J0586J1367J1989J2196
$$ 359706 362981 366347 369850 374307 380429 387994 396320 405198 414878 425464 436831 448820 461016
63440D61016J1636J0687J0406J1386J3249J5495J8170K1410K4850K7653K8668
$$ 461016 472652 483339 493745 505131 518380 533875 552045 573455 598305 625958 654626
63429F54626K6671K1348J4250P988M122K438K254L451N880Q881J2072J5934K0848
$$ 654626 681297 702645 716895 724883 729005 731443 733697 737148 743028 751909 763981 779915 800763
63416H00763K6095L0435L3228L4337L3351K9695K3434J5509P212k37n941r565
$$ 800763 826858 857293 890521 924858 958209 987904 1011338 1026847 1034059 1033822 1027881 1018316
63404A018316j1352j1666j0765r210q163q740j1097j4479j8071k1569k4961k8107
$$ 1018316 1006964 995298 984533 975323 967160 958420 947323 932844 914773 893204 868243 840136
63392H40136l0687l2396l3047l2506l0788k8360k6120k4614k3274k0948j7401
$$ 840136 809449 777053 744006 711500 680712 652352 626232 601618 578344 557396 539995
63381E39995j3767j1127r187o892l889p53J944M068N677P000Q467J0179J1559
$$ 539995 526228 515101 505914 499022 495133 494380 496324 500392 506069 513069 521536 531715 543274
63368E43274J2185J2580J3324J3878J3350J2300J2406J4319J7062J9826K2984
$$ 543274 555459 568039 581363 595241 608591 620891 633297 647616 664678 684504 707488
63357G07488K6809L0360L2578L3581L4030L3815L2150K8472K2699J5180P024r2
$$ 707488 734297 764657 797235 830816 864846 898661 930811 959283 981982 997162 1004186 1004094
63345A004094n182q630j1071j2218j1578r854q627q831j0286j2650j5977k0157
$$ 1004094 998912 990282 979211 966993 955415 945561 936934 928103 917817 905167 889190 869033
63333H69033k4486k7997k9980l0165k8833k6766k4690k2610j9939j6337j2223
$$ 869033 844547 816550 786570 756405 727572 700806 676116 653506 633567 617230 605007
63322F05007q354n084k133Q99L709M962L123k164r477j6464k1268k3211k2580
$$ 605007 596653 591569 589436 590335 594044 599006 602129 599965 590488 574024 552756 529545 506965
63309E06965k0168j7013j4113j1979j0380q636o371l961k093r97m01k08n99j374
$$ 506965 486797 469784 455671 443692 433312 424676 418305 414344 412251 411254 410853 410645 410046 408672
63295D08672j805j627j631k681m497o102p075p613p709p181o386n975n931n670
$$ 408672 406867 405240 403609 400928 396431 390329 383254 375641 367932 360751 354365 348390 342459 336789
63281C36789n057m428l689k438j081o46j202j561j018l27k58l27J89Q44P59J69
$$ 336789 331732 327304 323615 321177 320096 319450 318248 316687 315669 315342 315084 314757 314946 315790 316549 316718
63265C16718J66J095K193K706K587K142J713J753K555L730M419M234L711L663
$$ 316718 316884 317979 320172 322878 325465 327607 329320 331073 333628 337358 341777 346011 349722 353385
63251C53385M259M955N286N509O290P693Q942R335R204R459J0482J2034J3948
$$ 353385 357644 362599 367885 373394 379684 387377 396319 405654 414858 424317 434799 446833 460781
63238D60781J6203J8360J9816K0672K1640K2928K4040K4798K5718K7033K8199
$$ 460781 476984 495344 515160 535832 557472 580400 604440 629238 654956 681989 710188
63227G10188K8759K8955K9041K8780K8049K7335K7076K7185K7576K8456K9593
$$ 710188 738947 767902 796943 825723 853772 881107 908183 935368 962944 991400 1020993
63216A020993L0135K9734K9054K8435K6814K2915J6971J0344L877k574r218j5794
$$ 1020993 1051128 1080862 1109916 1138351 1165165 1188080 1205051 1215395 1219272 1216698 1207480 1191686
63204A191686k1737k6330k9123l0620l2039l3650l4000l1691k7463k3442k0689
$$ 1191686 1169949 1143619 1114496 1083876 1051837 1018187 984187 952496 925033 901591 880902
63193H80902j8500j5983j3151j0371p757n372l338j454P21L293O067R075J2437
$$ 880902 862402 846419 833268 822897 815140 809768 806430 804976 805697 808990 815057 824132 836569
63180H36569J5630J7663J8235J8172J8454J9234K0032K0438K0330J9657J8434
$$ 836569 852199 869862 888097 906269 924723 943957 963989 984427 1004757 1024414 1042848
63169A042848J6871J5258J3658J1740Q991N195O27m294r424j4680j9612k3705
$$ 1042848 1059719 1074977 1088635 1100375 1109366 1114561 1115188 1110894 1101470 1086790 1067178 1043473
63157A043473k7049l0113l2800l4455l4956l4937l4560l3029l0018k6728k4578
$$ 1043473 1016424 986311 953511 919056 884100 849163 814603 781574 751556 724828 700250
63146G00250k3377k1807j9321j6601j4309j2358j0462q637p011n690m798m189
$$ 700250 676873 655066 635745 619144 604835 592477 582015 573378 566367 560677 555879 551690
63134E51690l254j576L13J458J656J652K201L419M998O587P969R150J0223J0966
$$ 551690 548436 546860 547173 548631 550287 551939 554140 557559 562557 569144 577113 586263 596486 607452
63120F07452J0899R962Q676P309N445K888L31j475k614l410l561k790j789j435
$$ 607452 618351 628313 636989 644298 649743 652631 652962 651487 648873 645463 641902 639112 637323 635888
63106F35888j547j401j125j389k044k342k322k685l342l483l078k985l260k875
$$ 635888 634341 632940 631815 630426 628382 626040 623718 621033 617691 614208 611130 608145 604885 602010
63092F02010j541m71o07j276j426j110q66n26L44J424K091K448L027L825M477
$$ 602010 600469 599998 599391 598115 596689 595579 594713 594187 594531 595955 598046 600494 603521 607346 611823
63077F11823N110O169P510Q403Q470Q080P830Q040Q762R830J0864J1602J2282
$$ 611823 616933 623102 630612 639015 647485 655565 663395 671435 680197 690027 700891 712493 724775
63064G24775J3456J5379J7785K0278K2756K5408K8376L1518L4599L7700M1246
$$ 724775 738231 753610 771395 791673 814429 839837 868213 899731 934330 972030 1013276
63053A013276M5440M9777N3466N6257N8534O0601O2349O3667O4748O5708O6213
$$ 1013276 1058716 1108493 1161959 1218216 1276750 1337351 1399700 1463367 1528115 1593823 1660036
63042A660036O5824O4628O3300O2539O2539O2956O3378O3794O4414O4919O4196
$$ 1660036 1725860 1790488 1853788 1916327 1978866 2041822 2105200 2168994 2233408 2298327 2362523
63031B362523O1120N5467M7683L7979K6116J2175l035j8426l3277m7287o0247
$$ 2362523 2423643 2479110 2526793 2564772 2590888 2603063 2600028 2581602 2548325 2501038 2440791
63020B440791p1780q1230q7774r0862r0597q7648q2896p7184p1049o4431n6910
$$ 2440791 2369011 2287781 2200007 2109145 2018548 1930900 1848004 1770820 1699771 1635340 1578430
63009A578430m8486l9839l1474k3097j4322n638K064Q638J4631K0219K4982K8644
$$ 1578430 1529944 1490105 1458631 1435534 1421212 1415574 1417638 1426276 1440907 1461126 1486108 1514752
62997A514752L1364L3249L4367L5145L6017L6654L6383L5494L5074L5303L4951
$$ 1514752 1546116 1579365 1613732 1648877 1684894 1721548 1757931 1793425 1828499 1863802 1898753
62986A898753L3012K9991K6771K2992J7398R458j57j0455k0760l0654l9889m8487
$$ 1898753 1931765 1961756 1988527 2011519 2028917 2038375 2038218 2027763 2007003 1976349 1936460 1887973
62974A887973n6443o3326o8433p1322p2012p0831o8308o5117o1746n8246n4465
$$ 1887973 1831530 1768204 1699771 1628449 1556437 1485606 1417298 1352181 1290435 1232189 1177724
62963A177724n0490m6588m2833l9123l5653l3013l1489l0379k8512k5663k3049
$$ 1177724 1127234 1080646 1037813 998690 963037 930024 898535 868156 839644 813981 790932
62952G90932k1930k1947k1533j9997j8299j7457j7040j6038j4532j3468j3072
$$ 790932 769002 747055 725522 705525 687226 669769 652729 636691 622159 608691 595619
62941E95619j2566j1453j0150r179q505p896p316o623n520m048k777k197k225
$$ 595619 583053 571600 561450 552271 543766 535870 528554 521931 516411 512363 509586 507389 505164
62928E05164k438k473k103j316l30N70J144J014j33j782k581j881q16r13k006
$$ 505164 502726 500253 498150 496834 496504 497074 498218 499232 499099 497317 494736 492855 492039 491126 489120
62913D89120k690k558k562l122l337k607j679j434j669j837k045k511k886k862
$$ 489120 486430 483872 481310 478188 474851 472244 470565 469131 467462 465625 463580 461069 458183 455321
62899D55321k772k851k668k052j841k668l690l544k212q80k17J41N29O98N01K77
$$ 455321 452549 449698 447030 444978 443137 440469 436779 433235 431023 430143 429926 430067 430596 431294 431795 432072
62883D32072L16M96O49P99R20Q43N89M63O44R17Q85L79l47p67n77j79l79j430
$$ 432072 432388 432884 433533 434332 435252 436095 436684 437147 437791 438708 439593 439972 439625 438858 438281 438102 437723 436293
62865D36293k647l124k684j864j174o96k51K24N40M51O7j06J65L32k04r79p67
$$ 436293 433646 430522 427838 425974 424800 424104 423853 424077 424617 425068 425135 425029 425194 425526 425322 424343 423576
62848D23576P62K424K885K085R35J26k85n72j043j802k484k521j896j220q52n16
$$ 423576 424338 426762 429647 431732 432667 432793 432508 431936 430893 429091 426607 424086 422190 420970 420118 419602
62832D19602K6N02O73P76R85J053R09J045J696K284K223J831J817K356L201M199
$$ 419602 419628 420130 420803 421579 422564 423617 424526 425571 427267 429551 431774 433605 435422 437778 440979 445178
62816D45178N057N168M453L867M318N504O487O978P242P217O780O512P144Q366
$$ 445178 450235 455403 459856 463723 468041 473545 480032 487010 494252 501469 508249 514761 521905 530271
62802E30271R172R312R504J0307J1583J3006J4179J4539J4101J4166J6112J9518
$$ 530271 539443 548755 558259 568566 580149 593155 607334 621873 635974 650140 666252 685770
62790F85770K2749K5414K8891L4002L9616M4383M8650N3704N9917O6699P3576
$$ 685770 708519 733933 762824 796826 836442 880825 929475 983179 1043096 1109795 1183371
62779A183371Q0355Q6635R2228R7690J03433J08463J10963J10179J06832J01530
$$ 1183371 1263726 1350361 1442589 1540279 1643712 1752175 1863138 1973317 2080149 2181679
62769B181679R3641Q2195O7227M9731L0718J0879r009k7997m5421o1142p5059
$$ 2181679 2275320 2357515 2424742 2474473 2505191 2516070 2507061 2479064 2433643 2372501 2297442
62758B297442q6610r5080j00372j03192j04301j03826j01575r7768r3075q7910
$$ 2297442 2210832 2115752 2015380 1912188 1807887 1704061 1602486 1504718 1411643 1323733
62748A323733q2213p6062p0054o4700n9734n4443m8604m2725l7492l3235k9931
$$ 1323733 1241520 1165458 1095404 1030704 970970 916527 867923 825198 787706 754471 724540
62737G24540k7294k4822k2114j9267j6705j4572j2640j0823r317q003o309m070
$$ 724540 697246 672424 650310 631043 614338 599766 587126 576303 566986 558983 552674 548604
62725E48604k068j111q81m55L20Q54J168K163M208O395P778Q623R766J1376J3124
$$ 548604 546536 545425 544544 544089 544409 545263 546431 548594 552802 559197 566975 575598 585364 596740 609864
62710F09864J5100J7679K0789K4040K7400L1088L4959L8771M2851M7669N2832
$$ 609864 624964 642643 663432 687472 714872 745960 780919 819690 862541 910210 963042
62699I63042N7401O1176O4919O9140P3483P7420Q0769Q3188Q3849Q1998P7472
$$ 963042 1020443 1081619 1146538 1215678 1289161 1366581 1447350 1530538 1614387 1696385 1773857
62688A773857P0458O1153M9838L6880K2557P311q043k2833l7165n1192o3933p3680
$$ 1773857 1844315 1905468 1955306 1992186 2014743 2022054 2014011 1991178 1954013 1902821 1838888 1765208
62676A765208p9694q2700q3707q3255q1830p9850p6967p2471o6716o1105n6265
$$ 1765208 1685514 1602814 1519107 1435852 1354022 1274172 1197205 1124734 1058018 996913 940648
62665I40648n1428m6160m1373l7827l4838l1514k8304k6076k4446k2285j9396
$$ 940648 889220 843060 801687 763860 729022 697508 669204 643128 618682 596397 577001
62654E77001j6555j4268j2481j1230j0583j0192r682r264r185q977q054o683n510
$$ 577001 560446 546178 533697 522467 511884 501692 492010 482746 473561 464584 456530 449847 444337
62641D44337m509l238j818p45l8N85R64Q26M97M26K82n12j625k193k162k209k467
$$ 444337 439828 436590 434772 434027 433989 434574 435538 436364 436861 437287 437569 437057 435432 433239 431077 428868 426401
62624D26401k387j844j306q64o5J136K228L079M103N304O011N866N350N053N117
$$ 426401 424014 422170 420864 420000 419935 421071 423299 426378 430481 435785 441796 447662 453012 458065 463182
62609D63182N599O676Q205R587J0435J0948J1579J2706J4640J7452K0796K4343
$$ 463182 468781 475457 483662 493249 503684 514632 526211 538917 553557 571009 591805 616148
62597F16148K8219L2581L6973M0819M4325M8075N1855N4649N5757N5178N2914
$$ 616148 644367 676948 713921 754740 799065 847140 898995 953644 1009401 1064579 1117493
62586A117493M8853M3332L6943K9648K0937J0967P04r212j8791k7703l4983m0101
$$ 1117493 1166346 1209678 1246621 1276269 1297206 1308173 1308877 1299665 1280874 1253171 1218188 1178087
62574A178087m3629m6304m8147m8877m8536m7312m5266m2635l9891l7210l4336
$$ 1178087 1134458 1088154 1040007 991130 942594 895282 850016 807381 767490 730280 695944
62563F95944l1178k8075k5219k2381j9400j6479j3825j1471r566q282p360o315
$$ 695944 664766 636691 611472 589091 569691 553212 539387 527916 518350 510068 502708 496393
62551D96393n206m515m181l510k294j254j061j561k190k520k186j010M93J404
$$ 496393 491187 486672 482491 478981 476687 475433 474372 472811 470621 468101 465915 464905 465398 466802
62537D66802J481J316J200O91l01r14l55J137K868M556O087P156P781Q646J0294
$$ 466802 468283 469599 470799 471490 471189 470275 469920 471057 473925 478481 484568 491724 499505 508151 518445
62522E18445J2444J4613J6837J9257K1607K3761K6272K9655L3558L7340M1057
$$ 518445 530889 545502 562339 581596 603203 626964 653236 682891 716449 753789 794846
62511G94846M5033M8849N1549N2780N2914N2115M9910M5897M0318L3757K6595
$$ 794846 839879 888728 940277 993057 1045971 1098086 1147996 1193893 1234211 1267968 1294563
62500A294563J8886J0694K489m849j0570j4597j7211j8228j7036j3518q375k299
$$ 1294563 1313449 1324143 1326632 1321783 1311213 1296616 1279405 1261177 1244141 1230623 1222248 1219949
62488A219949M608J2288K0171K7692L4811M1551M7535N2534N6958O1027O3602
$$ 1219949 1224557 1236845 1257016 1284708 1319519 1361070 1408605 1461139 1518097 1579124 1642726
62477A642726O2565N6438M5462L1511J7334N307m098j2855k3814l8202n4464o9251
$$ 1642726 1705291 1761729 1807191 1838702 1856036 1861343 1857245 1844390 1820576 1782374 1727910 1658659
62465A658659p9411q3812q3943q2682q1785q0650p7689p2531o6269n9837n3117
$$ 1658659 1579248 1495436 1411493 1328811 1247026 1166376 1088687 1016156 949887 890050 836933
62454H36933m5766l8231l1505k6240k2366j9340j6560j3691j0787q013n345k655
$$ 836933 791167 752936 721431 695191 672825 653485 636925 623234 612447 604434 599089 596434
62442E96434j01J900L113L792M349M878N129M915M378L755K988J822K45j462l207
$$ 596434 596333 598233 601346 605138 609487 614365 619494 624409 628787 632542 635530 637352 637597 636135 632928
62427F32928n172p148q238p876o873o696p746r086r871j0247j0538j0432r567
$$ 632928 627756 620608 612370 604494 597621 590925 583179 574093 564222 553975 543437 533005 523438
62414E23438q285p216o518o035n888o182o442n995m944m123l999m020l330j875
$$ 523438 515153 507937 501419 495384 489496 483314 476872 470877 465933 461810 457811 453791 450461 448586
62400D48586m89R4J23M60J435K470L012L368M043M590M037K441J159J236K211
$$ 448586 448097 448191 448314 448774 450209 452679 455691 459059 463102 467692 471729 474170 475329 476565 478776
62385D78776K956L132L327M099N352O480O902O579O127O180O648P025P304P934
$$ 478776 481732 484864 488191 492290 497642 504122 511024 517603 523730 529910 536558 543583 550887 558821
62371E58821Q873R548R910J0703J2274J3990J5360J6909J9286K2223K5243K8684
$$ 558821 567694 577242 587152 597855 610129 624119 639479 656388 675674 697897 723140 751824
62359G51824L3095L7999M2311M5819M9268N2987N6189N7756N7113N4233M9312
$$ 751824 784919 822918 865229 911048 960316 1013303 1069492 1127248 1184361 1238594 1287906
62348A287906M2582L4257K4644J4530N159k587q916j4643k0189k5336k9824l3673
$$ 1287906 1330488 1364745 1389389 1403919 1409078 1406491 1397575 1382932 1362743 1337407 1307583 1273910
62336A273910l6989l9722m1548m1864m0236l7118l3720l0864k8305k5580k3023
$$ 1273910 1236921 1197199 1155651 1113787 1073551 1036433 1002713 971849 943544 917964 894941
62325H94941k1289k0335j9569j8770j8229j8114j8389j9165k0456k1602k1672
$$ 894941 873652 853317 833748 814978 796749 778635 760246 741081 720625 699023 677351
62314F77351k0518j8888j7403j5944j4192j2251j0490r054p745o245m494k902
$$ 677351 656833 637945 620542 604598 590406 578155 567665 558611 550866 544621 540127 537225
62302E37225k041j893j644n60J148K707L867N009O279P170P177O555O122O384
$$ 537225 535184 533291 531647 531087 532235 534942 538809 543818 550097 557267 564444 570999 577121 583505
62288E83505O932O860N867M857M982O146O982O553N394M533M175L964L987M566
$$ 583505 590437 597297 603164 608021 613003 619149 626131 632684 638078 642611 646786 650750 654737 659303
62274F59303N403N844N937O393P403Q264Q392Q065P954Q393R421J1171J3762J7012
$$ 659303 664706 670550 676487 682880 690283 698547 706939 715004 722958 731351 740772 751943 765705 782717
62260G82717K0503K4032K7908L2693L8435M4241M8948N2246N4633N6184N5992
$$ 782717 803220 827252 855160 887853 926288 970529 1019477 1071723 1126356 1182540 1238532
62249A238532N3234M8182M1580L3630K4309J4383N147k770r778j6601k3689l1144
$$ 1238532 1291766 1339948 1381528 1415158 1439467 1453850 1458997 1456227 1446449 1429848 1406159 1375015
62237A375015l8494m4700m8957n1499n3023n3527n2456m9842m6490m2981l9260
$$ 1375015 1336521 1291821 1242864 1191365 1138342 1084815 1032359 982517 936027 893046 853786
62226H53786l5280l1283k7278k3027j8802j5464j3389j1893j0169q323p002o394
$$ 853786 818506 787223 759945 736918 718116 702652 689263 677370 667201 658878 651876 645482
62214F45482n981n179l910k612j841j684j555p17R24K773M215N114N633N945O211
$$ 645482 639501 634322 630412 627800 625959 624275 622720 622003 622927 625700 629915 635029 640662 646607 652818
62199F52818O589P120P736Q300Q538Q077O867N393M204L465L225L754N050O315
$$ 652818 659407 666527 674263 682563 691101 699178 706045 711438 715642 719107 722332 726086 731136 737451
62185G37451O705O531O918Q235R554R927R409Q548P458N982M384L356L431M656
$$ 737451 744156 750687 757605 765840 775394 785321 794730 803278 810736 816718 821102 824458 827889 832545
62171H32545O706R152J1802J4887J8774K3347K7955L1996L5414L8457M1081M2657
$$ 832545 839251 848403 860205 875092 893866 917213 945168 977164 1012578 1051035 1092116 1134773
62159A134773M2156L8748L2569K4885J7243J0382M164j598o727j1062j4830j8453
$$ 1134773 1176929 1215677 1248246 1273131 1290374 1300756 1304920 1303322 1296595 1285533 1270703 1252250
62147A252250k2261k6375l0482l3722l5264l5159l4270l3125l1321k8319k4454
$$ 1252250 1229989 1203614 1173132 1139410 1104146 1068987 1034717 1001592 970271 941952 917498
62136I17498k0706j7624j5000j2520j0398r078q561q325p918p422p134p001o626
$$ 917498 896792 879168 864168 851648 841250 832172 823611 815286 807368 799946 792812 785811 779185
62123G79185n804m703l480k050m09J195K565L772M725M860L650J269j529m008
$$ 779185 773381 768678 765198 763148 762739 763934 766499 770271 774996 779856 783506 784775 783246 779238
62109G79238n710o349n946m989m121l749m089n312p241r005r543q528o568m476
$$ 779238 773528 767179 761233 756244 752123 748374 744285 738973 731732 722727 713184 704656 698088 693612
62095F93612k631j015L32J113J031L44n9O24K226L794M707N213N811O611P523
$$ 693612 690981 689966 690298 691411 692442 692786 692727 693351 695577 699371 704078 709291 715102 721713 729236
62080G29236Q555R643J0613J1554J2835J4420J5663J6052J5821J5480J5324J5578
$$ 729236 737791 747434 758047 769601 782436 796856 812519 828571 844392 859872 875196 890774
62068H90774J6464J7785J9043K0246K1915K3982K5555K6228K6578K6731K5501
$$ 890774 907238 925023 944066 964312 986227 1010209 1035764 1061992 1088570 1115301 1140802
62057A140802K1916J6696J1175N612k28n605r420j1917j4457j7804k1709k5814
$$ 1140802 1162718 1179414 1190589 1196201 1195973 1190368 1180948 1169031 1154574 1136770 1115061 1089247
62045A089247k9851l3270l5741l7748l9650m0652l9892l7947l5937l3737l0631
$$ 1089247 1059396 1026126 990385 952637 912987 872335 832443 794496 758559 724822 694191
62034F94191k7270k5043k3713k1608j8290j5091j2830j0878q998q129q528q820
$$ 694191 666921 641878 618165 596557 578267 563176 550346 539468 530470 522341 513813 504993
62022E04993p901o417n452n018m712m639m732m251k963j838j765k337k743k925
$$ 504993 497092 490675 485223 480205 475493 470854 466122 461871 458908 457070 455305 452968 450225 447300
62008D47300l050k773j825o39L29J187J963K285K278K803M065N026M954M563M737
$$ 447300 444250 441477 439652 439013 439342 440529 442492 444777 447055 449858 453923 458949 463903 468466 473203
61993D73203N145N046M517L847K583L24k288m452o324q213r388q986p591o650
$$ 473203 478348 483394 487911 491758 494341 494665 492377 487925 481601 473388 464000 455014 447423 440773
61979D40773o668p055p325p318o595m889l030k307k871l673l896l637l168k499
$$ 440773 434105 427050 419725 412407 405812 400923 397893 395586 392715 389042 385146 381509 378341 375842
61965C75842j730j185r83r20q39p27n55l13q4R1J37l00j368k152j301J023K911
$$ 375842 374112 372927 371944 371024 370185 369458 368903 368590 368506 368597 368734 368434 367066 364914 363613 364636 367547
61948C67547L190L052M184O192P295O979O470O839Q003R548J1266J2682J3162
$$ 367547 370737 373789 377973 384165 391460 398439 404909 411748 419751 429299 440565 453247 466409
61935D66409J2741J2107J1614J1011J0182R400Q758Q036P130O106M821L100J138
$$ 466409 479150 491257 502871 513882 524064 533464 542222 550258 557388 563494 568315 571415 572553
61922E72553p75k700m667o155o684o588o426n896m301j921J09J297K324L920O068
$$ 572553 571778 569078 564411 558256 551572 544984 538558 532662 528361 526440 526549 527846 530170 534090 540158
61907E40158Q341J0317J1501J1572J0859R969Q951P395N378L568K359J565J021
$$ 540158 548499 558816 570317 581889 592748 602717 611668 619063 624441 628009 630368 631933 632954
61894F32954Q17Q76R78J287K211L648M938N656N870N636M891L834K684R70k115
$$ 632954 633771 634647 635625 636912 639123 642771 647709 653365 659235 664871 669762 673596 676280 677250 675135
61879F75135o450j0763j3912j5781j6698j6668j5664j4119j2671j1538j0409q806
$$ 675135 668685 657922 644010 628229 611531 594863 579199 565080 552409 540871 530462 521656
61867E21656o601m368l027k784k626j506K36J328J407J524K647M533O369P808
$$ 521656 515055 510687 507660 504876 502250 500744 500980 502308 503715 505239 507886 512419 518788 526596
61853E26596Q974J0039J1250J2901J4816J6277J6805J6677J6369J5874J4940J3588
$$ 526596 535570 545609 556859 569760 584576 600853 617658 634335 650704 666578 681518 695106
61841F95106J1954R868P108L930R87j356l340n357p262q345q004o458m506k597
$$ 695106 707060 716928 724036 727966 728953 727597 724257 718900 711638 703293 695289 688831 684325 681728
61827F81728n04J954M296N996P320Q835J0253J0566R431P697O179M513J787j979
$$ 681728 681224 683178 687474 693470 700790 709625 719878 730444 739875 747572 753751 758264 760051 758072
61813G58072n544p640q123p824p479p060o222n138m537m938o196p976j0165j2536
$$ 758072 752528 744888 736765 728941 721462 714402 708180 703042 698505 693567 687371 679395 669230 656694
61799F56694j4381j5013j4464j3316j1983j0542r095p905p145o781o559o055m953
$$ 656694 642313 627300 612836 599520 587537 576995 567900 559995 552850 546069 539510 533455 528502
61786E28502l530k493k065j678r34l43n70j341j772j477p11K67J263J880J933
$$ 528502 524972 522479 520414 518736 517802 517459 516889 515548 513776 512299 511588 511855 513118 514998 516931
61771E16931J966K673L903M943N609O379P542Q938J0453J2039J3368J4266J5345
$$ 516931 518897 521570 525473 530416 536025 542404 549946 558884 569337 581376 594744 609010 624355
61758F24355J7278J9479K0489J9752J8021J5846J2762Q421L530r73m967q777j2321
$$ 624355 641633 661112 681601 701353 719374 735220 747982 756403 759933 758960 753993 745216 732895
61745G32895j5244j7423j8807j9143j8412j7244j6369j5812j5008j3569j1664
$$ 732895 717651 700228 681421 662278 643866 626622 610253 594441 579433 565864 554200
61734E54200r783q349p386o487n236l776k707k337k342k208j715r22qP63J164
$$ 554200 544417 536068 528682 522195 516959 513183 510476 508139 505797 503589 501874 500952 500944 501707 502871
61719E02871J226J104P68J41n57r41r48p64m18J32N38K80o12j536k097k417k664
$$ 502871 504097 505201 505969 506110 505553 504612 503664 502900 502482 502614 503152 503432 502820 501284 499187 496770 494106
61702D94106k748k650k503k358k278k684l944n522o259n747m855m579m854m916
$$ 494106 491358 488708 486205 483847 481569 478885 474941 469419 463160 457413 452558 447979 443125 438209
61688D38209m393l656l317l602m090m004l060j930j473j623j625j236r97j188
$$ 438209 433816 430160 426843 423241 419151 415147 412087 410157 408684 407061 405436 404200 403203 402015
61674D02015j397j378j539k154k687k427j364k8J132J837J928J588J328J447J849
$$ 402015 400618 399240 397701 395547 392860 390433 389069 389041 390173 392010 393938 395526 396854 398301 400150
61659D00150K545L782N387O618P055P071P020O540N231L496K057J055K74j68r2
$$ 400150 402695 406477 411864 418482 425537 432608 439628 446168 451399 454895 456952 458007 458281 458113 458021
61644D58021R3k03p76r00m27N7K66N84J258J942K406L122M512N975O348N229L370
$$ 458021 458114 457911 457135 456235 455808 455865 456131 456715 457973 459915 462321 465443 469955 475930 482278 487507 490877
61627D90877J654R4j918m632p494r551j0179r463q159p174o796o456n547m372
$$ 490877 492531 492625 490707 486075 478581 469030 458851 449388 441229 434055 427259 420803 415256 410884
61613D10884l838m158m472m052l341l270l950m649m853m701m395l797k791j703
$$ 410884 407046 402888 398416 394364 391023 387753 383803 379154 374301 369600 365205 361408 358617 356914
61599C56914j112j327k041k505k311k015k532l726m220l170j514p48r47j009n47
$$ 356914 355802 354475 352434 349929 347618 345603 343071 339345 335125 331955 330441 329693 328746 327737 327190
61584C27190l25p89j324j334j121j187j342j039j71R00J742K035J707J083O30
$$ 327190 326865 326076 324752 323418 322297 321110 319768 318729 318558 319458 321200 323235 324942 326025 326655
61569C26655M67M64P35J464K278K478K058J816K209K756K909K853K950K985K585
$$ 326655 327122 327586 328321 329785 332063 334541 336599 338415 340624 343380 346289 349142 352092 355077 357662
61554C57662K029J966K404K644K276J754J699J864J372O7r06m17R75J540O10n91
$$ 357662 359691 361657 364061 366705 368981 370735 372434 374298 375670 375737 374831 374414 375389 376929 377539 376948
61538C76948p55j24L57O57J297K069K303K095K026J879Q70q84k341l012l333l537
$$ 376948 376193 376069 376426 377083 378380 380449 382752 384847 386873 388752 389622 388738 386397 383385 380052 376515
61522C76515l303k714k392k383j984r98j29J58J62N3l99q99n69O55J726K077K357
$$ 376515 373212 370498 368106 365723 363739 362741 362612 362770 362932 362985 362586 361687 361118 361773 363499 365576 367933
61505C67933L016L361K914K564L359M953O216O723O811O772O855P385Q126Q122
$$ 367933 370949 374310 377224 379788 383147 388100 394316 401039 407850 414622 421477 428862 436988 445110
61491D45110O976N589M838M283L084J581P60O43L40m04q24k36J215K978M538N458
$$ 445110 452086 457675 462513 466796 469880 471461 472221 472864 473204 472800 471976 471740 472955 475933 480471 485929
61475D85929N507M865L887K742J546N34j74p10j111j204j087j275k061l194m408
$$ 485929 491436 496301 500188 502930 504476 505010 504836 504126 503015 501811 500724 499449 497388 494194 489786
61460D89786n706o798o987o182n323n194n323m689l107j271R7O72M88Pp5M82J312
$$ 489786 484080 477282 470295 464113 458790 453596 448273 443584 440477 439206 439303 439975 440463 440470 440395 440877 442189
61443D42189K118K913L388K954J827J128J308J396M99p99j467j579j820k113j850
$$ 442189 444307 447220 450608 453562 455389 456517 457825 459221 459720 458921 457454 455875 454055 451942 450092
61428D50092j076l94M0N74J374K297L215L849L781L155K793L022L071K258J023
$$ 450092 449016 448622 448662 449236 450610 452907 456122 459971 463752 466907 469700 472722 475793 478051 479074
61413D79074nj060k350l045k384j128n53n97l23K19P1r01j780k014j902j651j133
$$ 479074 479069 478009 475659 472614 470230 469102 468549 467952 467629 467848 467919 467018 465238 463224 461322 459671 458538
61396D58538n32j90R0N90Q04J27p77o48M41J136Q74N28Q46J543K298L353M675
$$ 458538 458006 457816 457906 458496 459300 459427 458650 458002 458443 459579 460453 460981 461827 463370 465668 469021 473696
61379D73696N612N907O124O617O985P007P182P767Q104P543O351N161M056K780
$$ 473696 479308 485215 491339 497956 504941 511948 519130 526897 535001 542544 548895 554056 558112 560892
61365E60892J395J88p48j477j991k345k749l259l624l614l267k750k210j794j550
$$ 560892 562287 562475 561727 560250 558259 555914 553165 549906 546282 542668 539401 536651 534441 532647 531097
61350E31097j323q99k80L84Q69P79k58j879k977k883k201j873j892j620r88n32
$$ 531097 529774 528875 528595 528979 529848 530627 530369 528490 525513 522630 520429 518556 516664 515044 514056 513524
61334E13524m16l56l32o01j041j232j151j088j033q18o43o81m73M36J443J561
$$ 513524 513108 512752 512420 511819 510778 509546 508395 507307 506274 505456 504813 504132 503659 504095 505538 507099
61318E07099J043J232K673M451N622O342P193Q212R063R629J0103J0818J2029
$$ 507099 508142 509374 512047 516498 522120 528462 535655 543867 552930 562559 572662 583480 595509
61305E95509J3538J4616J4761J4351J3909J3103J1277Q656O071L659R03k086m434
$$ 595509 609047 623663 638424 652775 666684 679787 691064 699720 705791 709450 710353 708267 703833
61292G03833n842o985q334r547j0242j0530j0487r990r295q947q848q228o820
$$ 703833 697991 691006 682672 673125 662883 652353 641866 631876 622581 613634 604786 596558 589738
61279E89738n291m219l472k807k289j737o40R40K111K271J854J561J447J202Q31
$$ 589738 584447 580228 576756 573949 571660 569923 569283 570223 572334 574605 576459 578020 579467 580669 581500
61264E81500O33Q80J721L101M632N891O789P270O834N130K850J244P02N42J92
$$ 581500 582133 583013 584734 587835 592467 598358 605147 612417 619251 624381 627231 628475 629177 629719 629911
61249F29911k30m45k58P03K549M294M477K812M48j449k574k982k910l150m400
$$ 629911 629681 629236 628978 629681 632230 636524 641001 643813 644261 642812 640238 637256 634346 631196 626796
61234F26796n933o055m276j948m17L47P97Q88P86J481L633O468Q520R055Q322
$$ 626796 620863 614808 610532 608584 608167 608514 609311 610199 610985 612466 616099 622567 631087 640142 648464
61219F48464P076O201O130O207N385L798K765K878L124K456J237M42L26O05J143
$$ 648464 655540 661741 667871 674078 679463 683261 686026 688904 692028 694484 695721 696163 696489 697094 698237
61204F98237J782K115K135K430L241M040M566N480P310R583J1614J3282J4369
$$ 698237 700019 702134 704269 706699 709940 713980 718546 724026 731336 740919 752533 765815 780184
61191G80184J4065J2022R144O466L948J243j160k595l377m232n056n368n565o601
$$ 780184 794249 806271 815415 821881 825829 827072 825912 823317 819940 815708 810652 805284 799719 793118
61177G93118q532j0400j1501j1984j2237j2432j2579j2509j1884j0796j0066j0313
$$ 793118 784586 774186 762685 750701 738464 726032 713453 700944 689060 678264 668198 657885
61165F57885j1034j1206j0658j0081r854r597q962q225p779p448o592m817k422
$$ 657885 646851 635645 624987 614906 605052 595455 586493 578268 570489 563041 556449 551632 549210
61152E49210j23J655L021M087M501L931K687J304k20k066l735m485m605n065n840
$$ 549210 549087 550742 553763 557850 562351 566282 568969 570273 570053 567987 564252 559767 555162 550097 544257
61137E44257n789m490k960k015j138K89J725K431K815L780N356O879Q088R164
$$ 544257 538468 533978 531018 529003 527865 528154 529879 532310 535125 538905 544261 551140 559228 568392
61123E68392J0115J0885J1706J2781J3901J4855J5788J6791J7696J8606J9850
$$ 568392 578507 589392 601098 613879 627780 642635 658423 675214 692910 711516 731366
61112G31366K1045K1070J9619J7861J6851J6223J5170J3835J2714J1482R509O998
$$ 731366 752411 773481 793100 810961 827812 844035 859205 873040 885754 897236 906745 913743
61100I13743M548K107o68l523n984q212j0581j2763j4164j4851j5225j5185j4515
$$ 913743 918291 920398 919730 916207 910223 902011 891430 878667 864503 849652 834427 819242 804727
61087H04727j3628j3060j2547j1521j0154q995p921o369m409k744j680q72J16
$$ 804727 791099 778039 765492 753971 743817 734822 726901 720532 716123 713379 711699 710827 710943
61074G10943J506L323N181O388O844P378Q738J0728J2796J4768J6396J7105J7027
$$ 710943 712449 715772 720953 727341 734185 741563 750301 761029 773825 788593 804989 822094 839121
61061H39121J7462J9260K1488K2826K3556K4908K6930K8476K9060K9458L0447
$$ 839121 856583 875843 897331 920157 943713 968621 995551 1024027 1053087 1082545 1112992
61050A112992L2005L3755L5324L6359L6790L6884L6473L4717L1420K7942K5747
$$ 1112992 1144997 1178752 1214076 1250435 1287225 1324109 1360582 1395299 1426719 1454661 1480408
61039A480408K4535K2805J9828J6100J2348R134P007N930M941L391K009J811K567
$$ 1480408 1504943 1527748 1547576 1563676 1576024 1585158 1592165 1598095 1603036 1606427 1608436 1610247 1612814
61026A612814L358L933M359M246L728M376P600J2861J8991K6258L5232M4652N2825
$$ 1612814 1616172 1620105 1624464 1628710 1632438 1636814 1644414 1657275 1676266 1702524 1737756 1782408 1835233
61013A835233O0468O9778Q1323R4762J12261J37821J72877K15703K65604L24424
$$ 1835233 1895701 1965479 2046802 2141564 2253825 2391646 2564523 2780226 3045830 3370254
61003C370254L93586M73961N70295O91527Q44750J033053J258590J512582J745297
$$ 3370254 3763840 4237801 4808096 5499623 6344373 7377426 8636016 10148598 11893895
60994A1893895J851527J716435J306556P23297J55549k32334l76331l01168p0425
$$ 11893895 13745422 15461857 16768413 17491710 17647259 17414925 17038594 16737426 16667001
60985A6667001K28966M70842N08747K54974k46316q33559j325391j615936j698486
$$ 16667001 16895967 17366809 17875556 18130530 17884214 17050655 15725264 14109328 12410842
60976A2410842j627109j469145j279864j095101r31177p90207o68775n63594m72044
$$ 12410842 10783733 9314588 8034724 6939623 6008446 5218239 4549464 3985870 3513826
60967C513826l91896l22458k64536k18320j82311j54552j33515j17427j04078
$$ 3513826 3121930 2799472 2534936 2316616 2134305 1979753 1846238 1728811 1624733
60958A624733r2134q1724p3127o5625n8148n0438m3007l6411l1061k7311k5278
$$ 1624733 1532599 1450875 1377748 1312123 1253975 1203537 1160530 1124119 1093058 1065747 1040469
60947A040469k4661k4987k5801k6507k6362k5068k3185k1623k0665j9851j8864
$$ 1040469 1015808 990821 965020 938513 912151 887083 863898 842275 821610 801759 782895
60936G82895j8192j8420j9003j8460j6091j3050j1067j0487j0194r279p945o702
$$ 782895 764703 746283 727280 708820 692729 679679 668612 658125 647931 638652 630707 624005
60924F24005n634m766m429m710n026m782m096l507l164k794k281j861j741j774
$$ 624005 618371 613605 609176 604466 599440 594658 590562 587055 583891 581097 578816 576955 575214 573440
60910E73440j563q23K85J234J593J367P75m7r20j438j358j067j190j889k895m101
$$ 573440 571877 571054 571339 572573 574166 575533 576308 576261 575341 573903 572545 571478 570288 568399 565504 561403
60894E61403n535o880p606p603p251o866o454n872m897l379j907j788l597o022
$$ 561403 555868 548988 541382 533779 526528 519662 513208 507336 502439 499060 497153 495365 491768 485746
60880D85746p167o819o386o689p042o634n589m248k579q67k5m38j243j388p60
$$ 485746 478579 471760 465374 458685 451643 445009 439420 435172 432593 431726 431701 431263 430020 428632 427872
60865D27872K25J441K821L876M234M272M614N329N950O041N376L995K436J495
$$ 427872 428097 429538 432359 436235 440469 444741 449355 454684 460634 466675 472051 476046 478482 479977
60851D79977J458J821K068K219K437K572K436K065J489O46l12j130j955l189m595
$$ 479977 481435 483256 485324 487543 489980 492552 494988 497053 498542 499188 498876 497746 495791 492602 488007
60836D88007n296m884l974l362l241l451l844m111l963l758m178n030n153m002
$$ 488007 482711 477827 473853 470491 467250 463799 459955 455844 451881 448123 443945 438915 433762 429760
60822D29760k486j783k018k667l388l908l900l641m016n143n769m889l306k616
$$ 429760 427274 425491 423473 420806 417418 413510 409610 405969 401953 396810 391041 386152 382846 380230
60808C80230l144l842l865l321k650k129j866j706j248m33J72J64n1N1K73K04
$$ 380230 377086 373244 369379 366058 363408 361279 359413 357707 356459 356026 356198 356362 356311 356362 356635 356839
60792C56839J26N62J308J685J630J696K063K409K628K970L372L357K701J719Q13
$$ 356839 356965 357527 358835 360520 362150 363846 365909 368318 370946 373916 377288 380645 383346 385065 385878
60777C85878J74l9K65Q06J042P29Q2o10j293k003k651l021k929k342j435m61M02
$$ 385878 386052 386013 386278 387084 388126 388855 388937 388327 387034 385031 382380 379359 376430 374088 372653 372192 372594
60760C72594R49R55N06J31J15l2q44j790j820r43k69l39m71j33J70L1N6P71J488
$$ 372594 373543 374498 375004 375135 375250 375218 374374 372584 370764 369821 369552 369213 368742 368609 368779 368810 368866 369637 371125
60741C71125J290M76n5k99r72k180l298l940m135l727k522j003K9M24O56Q93Q61
$$ 371125 372415 372891 372836 372537 371565 369385 366087 362147 358012 354285 351763 350760 350789 351213 351869 352762 353623
60724C53623N85N30Q90J371J678J795J818J924K375L050L235K449J277P28R75
$$ 353623 354208 354738 355628 356999 358677 360472 362290 364214 366589 369639 372874 375323 376600 377328 378303
60709C78303J348J449J509J709J866J871J805J627J213O92K94j48r01j688j898
$$ 378303 379651 381100 382609 384318 386184 388055 389860 391487 392700 393392 393686 393538 392637 390949 389051
60694C89051j470r54p51q33j192j877k549k679k294j990k025k016j641j059m16
$$ 389051 387581 386627 385876 385043 383851 381974 379425 376746 374452 372462 370437 368421 366780 365721 365305
60679C65305M24J406K040K026J750J794K305L067L869M436M317L181J202j073
$$ 365305 365729 367135 369175 371201 372951 374745 377050 380117 383986 388422 392739 395920 397122 396049
60665C96049l073m330m584m063l395k983k551j661m98K54L12Q7L5J08J54M33J270
$$ 396049 392976 388646 384062 379999 376604 373621 371070 369409 368911 369165 369477 369564 369599 369707 369861 370294 371564
60648C71564K426L341L819L969L544K213N15l77k64m10j727l354l948l654l536
$$ 371564 373990 377331 381150 385119 388663 390876 391391 391014 390750 390340 388613 385259 381311 377657 374121
60633C74121l606k863j238M8L23K89O26R20O67L00M84J123J691J944J802J202
$$ 374121 370515 367652 366414 366462 366785 367074 367700 368620 369287 369587 370071 371194 372885 374829 376631 377833
60617C77833N06M15J075J842K276K525K526J841O84J26N91J228J371J510K030
$$ 377833 378339 378754 379829 381671 383947 386472 388998 390839 391523 391649 392240 393468 394839 396349 398379
60602C98379K197J468P25Q59J117K69j286k070j713j090o60j43L40L17J04N85
$$ 398379 400576 402044 402769 403628 404745 405014 403728 401658 399945 398855 398195 398052 398392 398709 398813 399398
60586C99398J687K261J706O80J4j01K73J075J898K273K354K657L090L131K890
$$ 399398 401085 403346 405052 405732 405746 405645 405918 406993 408891 411164 413518 416175 419265 422396 425286
60571D25286L085L894M786N574O656Q007Q870Q835Q332P798P110O136N062L779
$$ 425286 428371 432265 437051 442625 449281 457288 466158 474993 483325 491123 498233 504369 509431 513210
60557E13210J832o63k703l586l777m075m389l957k447l29J730L392M663N697O593
$$ 513210 515042 514379 511676 508090 504313 500238 495849 491892 489445 489116 490846 494238 498901 504598 511191
60542E11191P324P859Q324Q979J0023J1512J3273J4909J6149J7240J8622J9933
$$ 511191 518515 526374 534698 543677 553700 565212 578485 593394 609543 626783 645405 665338
60530F65338J9928J7770J3945R503M906K69l863o899r079j1068j2797j3482j2857
$$ 665338 685266 703036 716981 726484 731390 731659 727796 720897 711818 700750 687953 674471 661614
60517F61614j1584j0368r231p806n910l798k114j400j348r03N13K317L759N052
$$ 661614 650030 639662 630431 622625 616715 612917 610803 609403 608055 607152 607665 609982 613741 618793
60503F18793O788Q899J1022J3453J6683K0376K3822K7066L0482L3446L4740L4144
$$ 618793 625581 634480 645502 658955 675638 696014 719836 746902 777384 810830 845570 879714
60491H79714L2469L0085K6669K2531J8827J6161J4083J2329J1264J0707R439O525
$$ 879714 912183 942268 968937 991468 1010295 1026456 1040539 1052868 1064132 1074839 1084278 1090803
60479A090803K182l300j0367j9113k8175l5686m0855m3911m4990m4048m1598l8641
$$ 1090803 1092985 1089685 1079318 1060205 1032030 996344 955489 911578 866588 822540 780942 742301
60467G42301l5676l2373k8386k4160k0622j8161j6180j3921j1583j0096r757r673
$$ 742301 706625 674252 645866 621706 601084 582923 566743 552822 541239 531143 521386 511713
60455E11713q916p586o255n030l920l441l931m665m734m411m505m730m061k517
$$ 511713 502797 495211 488956 483926 480006 476565 472634 467969 463235 458824 454319 449589 445528 443011
60441D43011j232o69j41O22Q55J89n48o34m97p80j311j647j834j933j568n99L25
$$ 443011 441779 441110 440969 441591 442446 442635 442087 441453 440956 440176 438865 437218 435384 433451 431883 431284 431609
60424D31609N82M00L97P35J205J645J879J681J208R63J069J021M37m02j014j143
$$ 431609 432191 432591 432988 433723 434928 436573 438452 440133 441341 442304 443373 444394 444831 444429 443415 442272
60408D42272o09P02K398L677M098L881L402L003L126L847M302L563K115J485K190
$$ 442272 441663 442365 444763 448440 452538 456419 459821 462824 465950 469797 474099 477662 479777 481262 483452
60393D83452L185L532L484L520L534L517L953M776N003M123K909K161J601P87
$$ 483452 486637 490169 493653 497173 500707 504224 508177 512953 517956 522079 524988 527149 528750 529537
60379E29537J45J40L11O3k90k39l0L3N02J778K914K652J336N00P60J288J295R99
$$ 529537 529682 529822 530133 530196 529906 529667 529637 529670 530172 531950 534864 537516 538852 539352 540112 541400 542695 543694
60361E43694R31J247J925L039M527O127P611Q862R808J0479J0944J0954J0130
$$ 543694 544625 545872 547797 550836 555363 561490 569101 577963 587771 598250 609194 620148 630278
60348F30278Q696P513O902O052M101J273j639m243o255p036o419n638o121p533
$$ 630278 638974 646487 653389 659441 663542 664815 663176 658933 652678 645642 639223 633585 627464 619931
60334F19931q093o899m965l741l547l814m102m323m388m161l614k856k106j618
$$ 619931 611838 604939 599974 596233 592686 588872 584770 580447 576059 571898 568284 565428 563322 561704
60320E61704j422j169m55P38K072L221M020M525N164O523Q597J0474J1258J1134
$$ 561704 560282 559113 558658 559396 561468 564689 568709 573234 578398 584921 593518 603992 615250 626384
60306F26384J1004J1212J1226J0616R697Q893P933O140L375K70k546n138p951
$$ 626384 637388 648600 659826 670442 680139 689032 696965 703105 706480 706750 704204 699066 691115
60293F91115j0964j3475j4828j5048j4547j3436j1495q753n749l275j964j990
$$ 691115 680151 666676 651848 636800 622253 608817 597322 588569 582820 579545 577581 575591
60281E75591k819l479l460l206l391l999m546m895n171n128m386l273k683k977
$$ 575591 572772 569293 565833 562627 559236 555237 550691 545796 540625 535497 531111 527838 525155 522178
60267E22178l669m141m084l357k222j588k088k934k745j537p54j163j903j971
$$ 522178 518509 514368 510284 506927 504705 503117 501029 498095 495350 493813 493059 491896 489993 488022
60253D88022j479q99k55L65N18L33O83J725K304J667P58Q13J520J690J091M28
$$ 488022 486543 485644 485389 485754 486272 486605 487288 489013 491317 492984 493742 494555 496075 497765 498856 499284
60237D99284N8k03k97j3L80M77N00R52J818K753L723M721N240M879M248M421N623
$$ 499284 499342 499139 498842 498829 499209 499686 500186 501138 502956 505709 509432 514153 519393 524272 528520 532941 538564
60220E38564P090Q107Q602Q882R287R987J0686J0811J0335R971J0132J0292R904
$$ 538564 545654 553761 562363 571245 580532 590519 601205 612016 622351 632322 642454 652746 662650
60207F62650R334R193R292R079Q578Q133P607O691N629M875M305L554K768K314
$$ 662650 671984 681177 690469 699548 708126 716259 723866 730557 736186 741061 745366 748920 751688 754002
60193G54002K045J574R14J57j055k913m719n673o030o562p240p369o831o191n745
$$ 754002 756047 757621 758535 758692 757637 754724 750005 744332 738302 731740 724500 717131 710300 704109 698364
60178F98364n349n058n000m758l815k499j612j276j044j003j658k778l435l406
$$ 698364 693015 687957 682957 678199 674384 671885 670273 668997 667953 666950 665292 662514 659079 655673
60164F55673l453l970m347m103l768m028m673m941m532l748k915k040r83K71J446
$$ 655673 652220 648250 643903 639800 636032 632004 627331 622390 617858 614110 611195 609155 608172 608443 609889
60149F09889K115K148J891J742J694J595J578J900K523L206L827M307M495M471
$$ 609889 612004 614152 616043 617785 619479 621074 622652 624552 627075 630281 634108 638415 642910 647381
60135F47381M692N347N932N952N680N682N874N695M965M004L030K042J206Q20
$$ 647381 652073 657420 663352 669304 674984 680666 686540 692235 697200 701204 704234 706276 707482 708302
60121G08302J007J805L335N405P252Q168Q222P979P801P768P897P963P531O595
$$ 708302 709309 711114 714449 719854 727106 735274 743496 751475 759276 767044 774941 782904 790435 797030
60107G97030N642M756L358J467K89O11J380J063j49p93m28p0m16r71j124j002
$$ 797030 802672 807428 810786 812253 812542 813153 814533 815596 815447 814654 814226 814156 813740 812769 811645 810643
60091H10643r89j267k036l425n029o218p019q027r447j0784j1450j1123r752p868
$$ 810643 809654 808387 806351 802926 797897 791679 784660 776633 767186 756402 744952 733829 724077 716209
60077G16209o594o495o754o261n278m940n444n892n867n895o221o338n993n627
$$ 716209 709615 703120 696366 690105 684827 679887 674443 668551 662684 656789 650568 644230 638237 632610
60063F32610n463n155m572m108l851l354k572k191k597l198l182k449j512r38
$$ 632610 627147 621992 617420 613312 609461 606107 603535 601344 598747 595549 592367 589918 588406 587468
60049E87468j004j361j085L21K125L279L989N345P354Q533P849O035M482L646
$$ 587468 586464 585103 584018 584339 586464 589743 593732 599077 606431 614964 622813 628848 633330 636976
60035F36976L112K504J768R40J53m26q51j301j695j947k431l574m899n400m979
$$ 636976 640088 642592 644360 645300 645453 645027 644176 642875 641180 639233 636802 633228 628329 622929 617950
60020F17950m723n465o795p790q049p673o866n951n270m773m092l231k717k879
$$ 617950 613227 607762 600967 593177 585128 577455 570589 564638 559368 554595 550503 547272 544555 541676
60006E41676l384l590l112k091j290j600k855l564k639r62k04m29k07J010K208
$$ 541676 538292 534702 531590 529499 528209 526609 523754 520190 517551 516589 516385 515956 515749 516759 518967
59991E18967K793L542M963O111O060N415N324N855O341O595O672O048M148J453
$$ 518967 521760 525302 530265 536376 542436 547851 553175 559030 565371 571966 578638 584686 588834 590287
59977E90287q47k194k879l180l078k770k782l359m174m704m689m191l424k450
$$ 590287 589440 587246 584367 581187 578109 575339 572557 569198 565024 560320 555631 551440 548016 545566
59963E45566j115N16J783J981J454J362K099K593J805L38k70L92J171J045M33
$$ 545566 544451 544967 546750 548731 550185 551547 553646 556239 558044 558382 558112 558504 559675 560720 561153
59948E61153L41Q58J217J154J354K229K985K572J194O8k90n35j117j395o85O23
$$ 561153 561494 562352 563569 564723 566077 568306 571291 573863 575057 575125 574835 574300 573183 571788 571103 571726
59932E71726J686K319K820L257L705M705O600Q749J0192J0784J0895J0415Q984
$$ 571726 573412 575731 578551 581808 585513 590218 596818 605567 615759 626543 637438 647853 656837
59919F56837O940N103L770K759K260K688L808M855N429N585N274M505L737L157
$$ 656837 663777 668880 672650 675409 677669 680357 684165 689020 694449 700034 705308 709813 713550 716707
59905G16707J964o04l768n875o432o330o223n936n396m931m497l698k665j845
$$ 716707 718671 718067 714299 708424 701992 695662 689439 683503 678107 673176 668679 664981 662316 660471
59891F60471j001M58K194L269L774M766O425P722Q156Q421Q967R295R180R293
$$ 660471 659470 659928 662122 665391 669165 673931 680356 688078 696234 704655 713622 722917 732097 741390
59877G41390R969J0509J0379J0006R749R061P389N059K690M83j427k711l410m037
$$ 741390 751359 761868 772247 782253 792002 801063 808452 813511 816201 816684 815257 812546 809136 805099
59863H05099m825n470n859o172o203n524m496m020m126l863k816j601o50K84J102
$$ 805099 800274 794804 788945 782773 776570 771046 766550 762530 758404 754541 751725 750124 749474 749758 750860
59848G50860J193P37Q49J880K669K053O9k612n246o685n884l323p41R25K117K919
$$ 750860 752053 752790 753639 755519 758188 760241 760310 757698 752452 745767 739883 736560 735819 736744 738861 741780
59832G41780K487P62r44j825k415k796j778R45L534M336M060M190M590M285L505
$$ 741780 744267 745029 744085 742260 739845 737049 735271 736216 739750 744086 748146 752336 756926 761211 764716
59817G64716L282L735M220M583N005N123M506L402K074J14k612n124o443o827
$$ 764716 767998 771733 775953 780536 785541 790664 795170 798572 800646 800760 798148 793024 786581 779754
59803G79754o922o566n497m471m425n195o008o586o905o694o142o174o978p253
$$ 779754 772832 766266 760769 756298 751873 746678 740670 734084 727179 720485 714343 708169 701191 693938
59789F93938o110m683m473n010m733l528k773l194m099m512l984k493n64Q02J167
$$ 693938 687828 683145 678672 673662 668929 665401 662628 659434 655335 650823 646839 644346 643782 644584 645751
59774F45751J251J841K689L282L832M605N113M993M826N137N442N368N616O619
$$ 645751 647002 648843 651532 654814 658646 663251 668364 673357 678183 683320 688762 694130 699746 706365
59760G06365P335O829O058O471P675Q233Q080Q291R029R431R273Q971Q270O554
$$ 706365 713700 720529 726587 733058 740733 748966 757046 765337 774366 783797 793070 802041 810311 816865
59746H16865M304K672J704M68j156k321k725k916l142l157l113l366l545l055
$$ 816865 821169 823841 825545 826013 824857 822536 819811 816895 813753 810596 807483 804117 800572 797517
59732G97517k219j753j366l19R41J234N92J78L95N26L61O00J406J994J949J684
$$ 797517 795298 793545 792179 791860 792801 794035 794627 794805 795200 795726 796087 796687 798093 800087 802036 803720
59716H03720J361N59o40j307q07N76K231L682M538M929N843P996J0589J2215J2781
$$ 803720 805081 805640 805000 803693 802886 803462 805693 809375 813913 818842 824685 832681 843270 855485 868266
59701H68266J3334J4203J4690J4608J4682J5256J5806J6007J6142J6227J5715
$$ 868266 881600 895803 910493 925101 939783 955039 970845 986852 1002994 1019221 1034936
59690A034936J4242J1815Q337L949j74k550l014k694k451k363k618l619n178o691
$$ 1034936 1049178 1060993 1069330 1073279 1073105 1070555 1067541 1064847 1062396 1060033 1057415 1053796 1048618 1041927
59676A041927q158r952j1579j1987j1139j0047r178q067o622n422m439k778j84
$$ 1041927 1033769 1023817 1012238 1000251 989112 979065 969887 961820 955198 949776 945337 942559 942375
59663I42375K359M054N347P093R432J1882J3945J5289J5927J6279J6619J6559
$$ 942375 944734 948788 954135 961228 970660 982542 996487 1011776 1027703 1043982 1060601 1077160
59651A077160J5702J4329J2741J0381O577J673l608r332j5524k0851k3846k5053
$$ 1077160 1092862 1107191 1119932 1130313 1136890 1138563 1134955 1125623 1110099 1089248 1065402 1040349
59639A040349k6152k7200k6631k4113k1269j9198j7207j4684j2431j1138j0084
$$ 1040349 1014197 986997 960366 936253 914984 895786 878579 863895 851464 840326 830242
59628H30242q455o802o319p432r771j2602j4811j5406j4643j3825j3606j3375
$$ 830242 821787 814985 808666 801234 791463 778861 764050 748644 734001 720176 706570 693195
59616F93195j2500j1217r913q620p507o875o344n174l578k575k328j934j159q09
$$ 693195 680695 669478 659565 650945 643438 636563 630219 625045 621467 618892 616564 614630 613471 612662
59602F12662r90n84P94J863J645J026J246K001K201J700J151Q16N96O34R29R10
$$ 612662 611672 611088 611882 613745 615390 616416 617662 619663 621864 623564 624715 625531 626127 626761 627690 628600
59586F28600J64q14j315j430j736k446l386m340m968m843m082l467l586m192m699
$$ 628600 628764 627950 626635 625205 623469 621023 617637 613297 608329 603486 599404 595937 592351 588159 583460
59571E83460m765m274l347k521k322k509k400j962j701j545q43K08M34n85j626
$$ 583460 578695 574421 571074 568553 566231 563722 561322 559360 557659 556114 555271 555479 555913 555328 553702
59556E53702j326K47J998L082L284K882K601L121M213M980N143N365O118P108
$$ 553702 552376 552623 554621 557703 560987 563869 566470 569591 573804 578784 583927 589292 595410 602518
59542F02518Q063R260J0813J2280J3459J4966J7515K0835K3333K2607J6975P560
$$ 602518 610581 619841 630654 642934 656393 671359 688874 709709 733042 755649 772624 780184
59530G80184j533o436o986n931n112m084k328p32j41k32o68j922l984n636o047
$$ 780184 778651 772215 765229 759298 754186 750102 747774 747042 746901 746669 746001 744079 740095 734459 728412
59515G28412n978o513p510q257q674q962q839q049o937n875m820l979l977m714
$$ 728412 722434 715921 708411 700154 691480 682518 673679 665630 658693 652818 647998 644019 640042 635328
59501F35328m967l938k325j140l27P20J998L101L951M587M809M649M718N508O850
$$ 635328 630361 626423 624098 622958 622631 623351 625349 628450 632401 636988 641797 646446 651164 656672 663522
59486F63522Q328R606J0147R484Q092P128O900O536N487M340L734L449L125K848
$$ 663522 671850 681456 691603 701087 709179 716307 723207 729743 735230 739570 743304 746753 749878 752726
59472G52726K529J596r9j932l468m878o044o356n787n063m352k943p11J352K568
$$ 752726 755255 756851 756752 754820 751352 746474 740430 734074 728287 723224 718872 715929 715218 716570 719138
59457G19138L352L979L995L512L663M872N948N900N388N336N353M631L366K051
$$ 719138 722490 726469 730464 733976 737639 742511 748459 754359 759747 765083 770436 775067 778433 780484
59443G80484K95k513n947q944j0884j1581j0996r668q604q039p141n525m024l358
$$ 780484 780779 778266 772319 763375 752491 740910 729914 720246 711642 703603 696462 690937 686913 683555
59429F83555l193l150l480l924l227q61J967M018N666P802J0184J2009J3233J4311
$$ 683555 680362 677212 673732 669808 666581 665720 667687 671705 677371 685173 695357 707366 720599 734910
59415G34910J5447J6905J9222K2362K5669K8749L0975K9784K1975Q202n837j4396
$$ 734910 750357 767262 786484 808846 834515 863264 894239 924023 945998 954200 948363 933967
59403I33967j6484j4429r950l770K802Q723J4522K0078K2100J6816N091p585j6384
$$ 933967 917483 903054 893104 889334 892136 900859 915381 935459 957559 974375 979466 971881 955497
59390I55497k0373k0844j8980j5867j2794j0347q180o084m413l320k534j973j759
$$ 955497 935124 914280 895300 879433 866639 856292 848112 842028 837615 834295 831761 829788 828029
59377H28029j666j370j098j220j447j270q87q70j225j584j927k287k266j620q38
$$ 828029 826363 824993 823895 822675 821228 819958 819071 818201 816976 815392 813465 811178 808912 807292 806454
59362H06454l02M81J933L444M371N213O715Q500R766J0674J1847J3141J4176J5389
$$ 806454 806152 806633 808566 812010 816381 821594 828309 836809 846575 857249 869096 882237 896413 911802
59348I11802J7268J9141K0091K0590K1778K3530K4568K4225K2854K0813J8239
$$ 911802 929070 948211 968302 988892 1010670 1034200 1058768 1082993 1105847 1126660 1144899
59337A144899J5533J2948R970O128K084j144l546n859q416j1165j4135j6915j8499
$$ 1144899 1160432 1173380 1183350 1189478 1191562 1190418 1186872 1181013 1172597 1161432 1147297 1130382 1111883
59324A111883j8734j8969k0113k1102k0695j9716j9729k0430k0289j9137j8139
$$ 1111883 1093149 1074180 1054067 1032965 1012270 992554 972825 952395 932106 912969 894830
59313H94830j7616j6868j5902j5451j5286j4267j2162r973q376p122n911m599
$$ 894830 877214 860346 844444 828993 813707 799440 787278 777305 768929 761807 755896 751297
59301G51297k705Q3L153N679P423P808N249p89p855j2620j4380j4655j4050j1953
$$ 751297 748592 748675 751828 757507 764930 772738 777987 777198 769343 756723 742343 727688 713638 701685
59287G01685q949o903o210n240l061p45O32J511K699M171N724P516R439J0985
$$ 701685 692736 685833 679623 674383 671322 670577 671209 672720 675419 679590 685314 692830 702269 713254
59273G13254J2087J3087J3856J4023J3963J4291J4536J3741J2206J1081J0278
$$ 713254 725341 738428 752284 766307 780270 794561 809097 822838 835044 846125 856403
59262H56403Q534N650K978J284j49j935l557m505n040n353n169m608m256m050
$$ 856403 864937 870587 873565 874849 874700 872765 869208 864703 859663 854310 849141 844533 840277 836227
59248H36227l226j704m02J05J65J59J08L76J562L439M963N501N136L952K058J86
$$ 836227 833001 831297 830895 831000 831165 831324 831432 831808 833370 836809 841772 847273 852409 856361 858419 858605
59232H58605j011k100l991o202p379p467p788q957j0261j1143j1772j1973j1173
$$ 858605 857594 855494 851503 845301 837922 830455 822667 813710 803449 792306 780534 768561 757388
59219G57388r673q549q042p404o461n868n643m997l839k998k659k027q73pJ30
$$ 757388 747715 739166 731124 723720 717259 711391 705748 700751 696912 693914 691255 689228 688355 688348 688478
59204F88478J22N02J215K273L710M857M996M800N671P716R742J1240J2657J3767
$$ 688478 688600 689102 690317 692590 696300 701157 706153 710953 716624 724340 734082 745322 757979 771746
59190G71746J3621J2448J1802J2384J3253J3524J3226J2237J0029O959M195J916
$$ 771746 785367 797815 809617 822001 835254 848778 862004 874241 884270 891229 895424 897340
59178H97340q12m080o660p934q673r487j0090j0508j1311j2156j1801j0142q534
$$ 897340 896528 892448 885788 877854 869181 859694 849604 839096 827785 815629 803828 793686 785152
59165G85152p623o591n148m406m932n663n622n239n140n101n007n361o063o132
$$ 785152 777529 770938 765790 761384 756452 750789 745167 739928 734788 729687 724680 719319 713256 707124
59151G07124n365m828n018m997m169l407l583m364n232o288p336p541o901o575
$$ 707124 701759 696931 691913 686916 682747 679340 675757 671393 666161 659873 652537 644996 638095 631520
59137F31520o991p000n766m143l238k842k211j254k02R23J884K333K710L847N484
$$ 631520 624529 617529 611763 607620 604382 601540 599329 598075 597873 598796 600680 603013 605723 609570 615054
59122F15054O510O877P625Q899R806J0435J1861J3721J4175J2987J2162J2487
$$ 615054 621564 628441 636066 644965 654771 665206 677067 690788 704963 717950 730112 742599
59110G42599J2042R581O902O008O037N114L453K347J646L80j175k172k967m345
$$ 742599 754641 764222 771124 777132 783169 788283 791736 794083 795729 796109 794934 792762 789795 785450
59096G85450n746o105n757n773n957n178l352j668j024j266j727j737j081m69
$$ 785450 779704 773599 767842 762069 756112 750934 747582 745914 744890 743624 741897 740160 739079 738610
59082G38610r19k193k955k875l249m749o114o081n221m614m079l083k189k126
$$ 738610 737691 735498 732543 729668 726419 721670 715556 709475 704254 699640 695561 692478 690289 688163
59068F88163k401k223j910k143k649k904l199l853m239l828l262l246l325k962
$$ 688163 685762 683539 681629 679486 676837 673933 670734 666881 662642 658814 655552 652306 648981 646019
59054F46019k875l834n018n007l839k706k112j571p69N0N75N98J13k70L33J688
$$ 646019 643144 639310 634292 629285 625446 622740 620628 619057 618288 618338 618913 619511 619624 619354 619687 621375
59038F21375K377J727Q65J052J964K475K271J848J674K046K945L645L464L225
$$ 621375 623752 625479 626344 627396 629360 631835 634106 635954 637628 639674 642619 646264 649728 652953
59024F52953M628P663J0266J1207J1609J2662J3523J2810J0695Q140N331K193
$$ 652953 657581 665244 675510 686717 698326 710988 724511 737321 748016 756156 761487 763680
59012G63680o41k631m118n290n530m734l954l791l439k306j115l46Q11K718M177
$$ 763680 763039 760408 756290 751000 745470 740736 736782 732991 729552 727246 726131 725785 726596 729314 733491
58997G33491M325M063M218L895K237K65o39q14j211j641j591j512j693j255K31
$$ 733491 737816 741879 746097 749992 752229 752494 751855 751041 749830 748189 746598 745086 743393 742138 742369
58982G42369J534J793K233M120O513P900Q648R934J1509J2585J3616J5236J6590
$$ 742369 743903 745696 747929 752049 758562 766462 775110 785044 796553 809138 822754 837990 854580
58969H54580J6702J6281J6243J5715J3600J0813Q808P064M429J699L37m22k547
$$ 854580 871282 887563 903806 919521 933121 943934 952742 959806 964235 965934 966271 965849 963302
58956I63302n991q989j1035j3045j5047j6142j6482j6994j7386j6662j5308j4760
$$ 963302 957311 948322 937287 924242 909195 893053 876571 859577 842191 825529 810221 795461
58944G95461j4834j3938j1781r772q608p467n835m334l377k534j555q11n77p47
$$ 795461 780627 766689 754908 745136 736528 729061 723226 718892 715515 712981 711426 710615 710038 709291
58930G09291j108j194m13Q21J009l84j880k109j722j808j812r16m0l83j031l06
$$ 709291 708183 706989 706576 707397 708406 708022 706142 704033 702311 700503 698691 697775 697735 697352 696321 696015
58914F96015J468K698L282M248N367N530N131N748P660R711J1362J2911J4025
$$ 696015 697483 700181 703463 707711 713078 718608 723739 729487 737147 746858 758220 771131 785156
58901G85156J4040J3520J3662J4382J4681J4434J4163J3597J2334J1364J2004
$$ 785156 799196 812716 826378 840760 855441 869875 884038 897635 909969 921333 933337
58890I33337J3828J5531J7206J9723K2404K3512K2704K1045J8974J6277J3595
$$ 933337 947165 962696 979902 999625 1022029 1045541 1068245 1089290 1108264 1124541 1138136
58879A138136J1944J1020R782Q175O648M682J769j005k496l706o169r019j0243
$$ 1138136 1150080 1161100 1170882 1179057 1185705 1190387 1192156 1191151 1188655 1184949 1178780 1169761 1159518
58866A159518j0089j0585j2134j3311j3674j4098j4527j4127j3552j4400j6356
$$ 1159518 1149429 1138844 1126710 1113399 1099725 1085627 1071100 1056973 1043421 1029021 1012665
58855A012665j7416j7005j6456j6394j6060j5342j5051j5049j4348j3172j2748
$$ 1012665 995249 978244 961788 945394 929334 913992 898941 883892 869544 856372 843624
58844H43624j3118j3340j3555j4471j5197j4215j2340j1932j3104j3547j2246
$$ 843624 830506 817166 803611 789140 773943 759728 747388 735456 722352 708805 696559
58833F96559j0498r028o994m451k970k956k801j535j38N12Q52J235J361J568K710
$$ 696559 686061 677033 670039 665588 662618 659662 656861 655326 655188 655700 656552 657787 659148 660716 663426
58818F63426M332M992M643M625N185N208M587M503N021M739L261J817J071L68
$$ 663426 667758 672750 677393 682018 687203 692411 696998 701501 706522 711261 714522 716339 717410 717778
58804G17778n49j217j928l370m745m604l522l483m558m876l979l326l253k321
$$ 717778 717229 716012 714084 710714 705969 701365 697843 694360 689802 684926 680947 677621 674368 672047
58790F72047k28J527K506M048O421Q115Q735R900J2293J4412J5285J5872J6808
$$ 672047 671819 673346 675852 679900 686321 694436 703171 713071 725364 739776 755061 770933 787741
58777G87741J7202J6679J6251J6147J5000J2120Q347L915k090r187j4875j7660
$$ 787741 804943 821622 837873 854020 869020 881140 889487 893402 891312 882125 867250 849590
58765H49590j8642j9216j9322j8780j8142j7352j5625j3343j1986j1548j0351
$$ 849590 830948 811732 792410 773630 755488 738136 722511 709168 697182 685634 675283
58754F75283p990o083n431m883l772k999k937k608j716j110o24J050L630N062
$$ 675283 667293 661210 655779 650896 647124 644125 641188 638580 636864 635754 635130 636180 639810 644872
58740F44872M795M626N541O363O371O508P056O868N805N244N348M633L061K554
$$ 644872 649667 654293 659834 666197 672568 679076 686132 693000 698805 704049 709397 714030 717091 719645
58726G19645L442L602K230J289J796K015R42M28J934M097N398O560Q334R555R328
$$ 719645 723087 726689 728919 730208 732004 734019 734961 735389 737323 741420 746818 753378 761712 771267 780595
58711G80595Q702Q343O959L777K48k402m979q073j0597j2174j4438j8114k1211
$$ 780595 789297 797640 804599 808376 808624 806222 801243 793170 782573 770399 755961 737847 716636
58698G16636k1906k0934j9563j7681j5580j4910j5935j6278j4346j1621r778q105
$$ 716636 694730 673796 654233 636552 620972 606062 590127 573849 559503 547882 538104 529999
58686E29999n689l666l185l296k886k524k661k259r77l17q93r98L72J591J372
$$ 529999 524310 520644 517459 514163 511277 508753 506092 503833 502856 502539 501646 500648 501020 502611 503983
58671E03983J053K013L317L943M842O796Q728J0024J1951J4775J6197J4643J1448
$$ 503983 505036 507049 510366 514309 519151 525947 534675 544699 556650 571425 587622 602265 613713
58658F13713P886K955l554q976j1365j2328j3664j4129j2368j0259j0031j0557
$$ 613713 621599 624554 621000 612024 600659 588331 574667 560538 548170 537911 527880 517323
58646E17323r627p823o972o723n689m196l155j971j37R72L66m82j35M22J65L64
$$ 517323 507696 499873 492901 486178 480489 476293 473138 471167 471030 472002 472368 471886 471751 472173 472338 472702
58630D72702J876K693J126r53j068r0j48p45k46O85M51l18p2P44Q55P43J403K167
$$ 472702 474578 477271 478397 477444 476376 476286 476138 475393 475147 475832 476283 475965 475893 476637 477492 478235 479638 481805
58612D81805K286K863M647N881M982L344K920L060K485K169L352M699M432L322
$$ 481805 484091 486954 491601 497482 502464 505808 508728 511788 514273 516442 519794 524493 528925 532247
58598E32247K866K488J255K41M23N66j61O8K503N030N669O094Q368J1049J2042
$$ 532247 535113 537601 538856 539097 539520 540086 539925 539993 542496 547526 553195 559289 567657 578706 590748
58583E90748J2513J4105J5037J3148J0298R476R749Q458O239N471N662M915M174
$$ 590748 603261 617366 632403 645551 655849 665325 675074 683532 689771 695242 700904 705819 709993
58570G09993N536P986R197J0103J3222J7864K1381K3798K6838K9704L0261K9209
$$ 709993 715529 723515 732712 742815 756037 773901 795282 819080 845918 875622 905883 935092
58558I35092K8641K7632K3636J7219J1163N994O70l607m813m295n057o708o631
$$ 935092 963733 991365 1015001 1032220 1043383 1049377 1050047 1046440 1041627 1037332 1032275 1025567 1018936
58545A018936n195n290p387r562j1754j5490k0008k3052k5050k8062l1139l1206
$$ 1018936 1013741 1008451 1001064 991502 979748 964258 944250 921198 896148 868086 836947 805741
58533H05741k8204k5046k2786k0111j7158j5459j4335j1645p959n924n708n137
$$ 805741 777537 752491 729705 709594 692436 676977 662642 650997 643038 637114 631406 626269
58521F26269l989m053n162n330m560m561m967l913j964j402j974j454r2k17j729
$$ 626269 622280 618227 613065 607735 603175 598614 593647 589734 587770 586368 584394 582940 582848 582631 580902
58506E80902k149j105o38j145r81j9K87J82J171K537K134L62l72L64J094J814
$$ 580902 578753 577648 577010 575865 574884 574865 575152 575334 576505 579042 581176 581538 581166 581530 582624 584438
58490E84438L590N632O535P415R914J2498J2816J2263J3688J6114J6626J6043
$$ 584438 588028 593660 600195 607610 617524 630022 642838 655101 668789 684903 701529 717572
58478G17572J7413K0107K0794J9305J7930J5907J0487K887k758o080j0166j4921
$$ 717572 734985 755092 775886 795191 813121 829028 839515 842402 839644 833564 823398 808477
58466H08477j6812j5353j3809j3087j0789o790l879k247R78N962R538J0946J2728
$$ 808477 791665 776312 762503 749416 738627 731837 727958 725711 726689 732651 742189 753135 765863
58453G65863J5287J6061J4720J3586J2326P927P32n167q411j1615j5374j6890
$$ 765863 781150 797211 811931 825517 837843 845770 846502 841335 832924 821309 805935 789045
58441G89045j5664j4803j5333j4679j2033r813q697o529l296j735j949q16K248
$$ 789045 773381 758578 743245 728566 716533 706720 698023 691494 688198 686463 684514 683698 685946
58428F85946M372M934O509R217R983Q483P982R017Q115M199M37j645m125p425
$$ 685946 690318 695252 701761 710978 720961 729444 737426 746443 754558 758757 759194 757549 753424 745999
58414G45999q979q572r226j1301j1533r285p923q577q472o792o144o749n437j912
$$ 745999 737020 728448 719222 707921 696388 687103 679180 670603 662131 655339 649195 642446 637009 635097
58400F35097J55k19J99K308K985J482J050K544K923J595J686L408L156P61M46
$$ 635097 635252 635033 635232 637540 640525 642007 643057 645601 648524 650119 651805 655213 658369 659130 659576
58385F59576K781L209O73j5L086N646N203N152P381Q494O734N548O748P120N215
$$ 659576 662357 665566 666239 666224 669310 674956 680159 685311 692692 701186 707920 713468 720216 727336 732551
58370G32551M536O595P822O752P186J0735J3353J2894J2908J5273J6316J4126
$$ 732551 737087 743682 751504 758256 765442 776177 789530 802424 815332 830605 846921 861047
58358H61047J2455J3343J2985R069N237M049K567j015l290k329j505k662k435
$$ 861047 873502 886845 899830 908899 914136 918185 920752 919737 916447 914118 912613 909951 907516
58345I07516O59K693J803J868M813O688N579N634R100J1970J1966J2827J6263
$$ 907516 908175 910868 912671 914539 919352 926040 931619 937253 946353 958323 970289 983116 999379
58332I99379J7793J5266J3339J4706J5107J1959R410R651P942J903k907k535j291
$$ 999379 1017172 1032438 1045777 1060483 1075590 1087549 1096959 1106610 1114552 1116455 1113548 1111013 1109722
58319A109722k916l684m98K615K332K221M938O581M844M284P451R500P763P521
$$ 1109722 1106806 1103122 1102624 1105239 1107571 1109792 1114730 1121311 1126155 1130439 1137890 1147390 1155153 1162674
58305A162674J1843J5107J3380J1719J4094J5764J3067J1012J3430J5268J2647
$$ 1162674 1174517 1189624 1203004 1214723 1228817 1244581 1257648 1268660 1282090 1297358 1310005
58294A310005J0834J4071J7235J5932J4956J8266K0602J7928J6014J9584K3100
$$ 1310005 1320839 1334910 1352145 1368077 1383033 1401299 1421901 1439829 1455843 1475427 1498527
58283A498527K1590K0238K3813K7071K5444K4587K9124L2763L0092K7329L0617
$$ 1498527 1520117 1540355 1564168 1591239 1616683 1641270 1670394 1703157 1733249 1760578 1791195
58272A791195L4556L3339L2166L6301M0120L8552L7987M3915M9463M8336M7154
$$ 1791195 1825751 1859090 1891256 1927557 1967677 2006229 2044216 2088131 2137594 2185930 2233084
58261B233084N2411N7510N5743N3405N6628N8250N1916M5971M8592N2576N0102
$$ 2233084 2285495 2343005 2398748 2452153 2508781 2567031 2618947 2664918 2713510 2766086 2816188
58250B816188M8605N5943O4018O4015O3754P2333Q1993Q3404Q4274R3841J03917
$$ 2816188 2864793 2920736 2984754 3048769 3112523 3184856 3266849 3350253 3434527 3528368 3632285
58239C632285J05047J06215J17814J30628J33294J34828J47185J61629J66050
$$ 3632285 3737332 3843547 3961361 4091989 4225283 4360111 4507296 4668925 4834975
58230D834975J69429J84402K02141K10221K18523K40526K66250K81760K97602
$$ 4834975 5004404 5188806 5390947 5601168 5819691 6060217 6326467 6608227 6905829
58221F905829L28668L64382L89586M15707M58949N07922N47030N90603O57515
$$ 6905829 7234497 7598879 7988465 8404172 8863121 9371043 9918073 10508676 11166191
58212A1166191P34519Q03402Q80640R88952J115363J242316J392803J595993J838136
$$ 11166191 11900710 12704112 13584752 14573704 15689067 16931383 18324186 19920179 21758315
58203B1758315K101585K421730K848064L384985M035404M860686N920086P194663
$$ 21758315 23859900 26281630 29129694 32514679 36550083 41410769 47330855 54525518
58195E4525518Q660931J0397105J2522915J5093846J8166520K1871647K6223000
$$ 54525518 63186449 73583554 86106469 101200315 119366835 141238482 167461482
58188A67461482L0887599L5303212L8851342M0502364L8368047L0416846J6389473
$$ 167461482 198349081 233652293 272503635 313005999 351374046 381790892 398180365
58181C98180365j028469j7431348k9344431l5780802l7682205l6524478l3570118
$$ 398180365 397151896 379720548 350376117 314595315 276913110 240388632 206818514
58174B06818514k9813869k5966588k2366528j9085007j6147619j3589367j1384742
$$ 206818514 177004645 151038057 128671529 109586522 93438903 79849536 68464794
58167F8464794r473294p845187o515924n444332m555632l820656l241624k785111
$$ 68464794 58991500 51146313 44630389 39186057 34630425 30809769 27568145 24783034
58159B4783034k397127k064729j801755j591460j398987j223779j087009r81082
$$ 24783034 22385907 20321178 18519423 16927963 15528976 14305197 13218188 12237106
58151A2237106q79395p82501p08958o52494n90878n26543m78311m42875m02033
$$ 12237106 11357711 10575210 9866252 9213758 8622880 8096337 7618026 7175151 6773118
58142F773118l58573l29033l09690k84178k56382k42682k38955k27177k07979
$$ 6773118 6414545 6085512 5775822 5491644 5235262 4992580 4753625 4526448 4318469
58133D318469j96216j90521j76843j56949j45088j40775j31559j18353j12498
$$ 4318469 4122253 3931732 3754889 3597940 3452852 3312077 3180518 3062165 2949667
58124B949667j11890j04708r2867q8012q8251q1992p1077o7247o9139o5142n6099
$$ 2949667 2837777 2733069 2640202 2552190 2463939 2381947 2310870 2243623 2174484 2109342 2053243
58113B053243n3287n6314n4246m6853m4259m7031m6136m1378m0967m4104m2229
$$ 2053243 1999956 1943642 1889396 1842543 1798284 1751253 1705117 1663739 1622772 1578668 1536439
58102A536439l6414l5843m0103m0197l5921l5401l8464l7058l1284k8882k9625
$$ 1536439 1500025 1464182 1424079 1383882 1347961 1312560 1274096 1237038 1205754 1176872 1147247
58091A147247k6076j8959j6215j7469j4761q129n458p323o781l808n300j0831
$$ 1147247 1121171 1102212 1085997 1068528 1053767 1045638 1040180 1032857 1026076 1022268 1016968 1006137
58079A006137j2832j0977j2374j7305j8633j5691j5230j8047j7931j4435j3728
$$ 1006137 993305 982328 969954 952649 934016 918325 903095 885048 867117 852682 838954
58068H38954j6141j5509j1536j0392j2410j1574p798p383j0533j0679p140o363
$$ 838954 822813 807304 795768 785376 772966 761392 753594 746211 735678 724999 717859 711496
58056G11496r413j0244p718p553j0699j1379q451p464r567r366n785m293o291
$$ 711496 702083 691839 684121 676568 665869 654490 646039 638575 629008 619642 613857 609564 603273
58043F03273o745m475m450p663q866o659n956q137q410n358l716n180n648l886
$$ 603273 596528 592053 587603 579940 571074 564415 558459 550322 541912 536554 532838 527658 522010 518124
58029E18124l965o778p898o203o011q446r198o954n702o618n995l179k189l601
$$ 518124 514159 507381 499483 493280 487269 478823 469625 462671 456969 450351 444356 441177 438988 435387
58015D35387l232p17p03l660m308j439l98l128m558j971M87m7n58R48J668M62
$$ 435387 432155 431438 430735 427075 422767 421328 420930 417802 413244 411273 411760 411713 411155 412103 413771 414233
57999D14233O23L042L797J620N84K328K890M37j160K23J013r97k475j097K69n32
$$ 414233 414856 417898 421695 423315 423899 426227 429117 429554 428394 428617 429630 428633 426158 425061 425330 424798
57983D24798j036L39R07p98j963r97l65j072k51K846M544L350K897N197P028O204
$$ 424798 423762 424101 425008 424210 422247 421250 420885 419813 419562 422408 426952 430302 433199 438396 445424 451628
57967D51628N341O077N474J878j437k118k828n838q713r074q674r253r175p521
$$ 451628 456969 463046 468520 470398 468961 466843 464015 458177 449464 440390 431716 422463 413288 405767
57953D05767o736p923q232o095m311m798n145l457j857j906j411Q83K261J084
$$ 405767 399031 391108 382876 376781 372470 367672 362527 359070 357213 355307 353896 354779 357040 358124
57939C58124K94K356N075N906O151P469Q249O918N102M400L659K159J555K119
$$ 358124 358418 360774 365849 371755 377906 385375 393624 400542 405644 410044 413703 415862 417417 419536
57925D19536J181k063m531m587m862p011q374o992n353n748o307n088l852m179
$$ 419536 420717 418654 414123 409536 404674 397663 389289 382297 376944 371196 364889 359801 355949 351770
57911C51770l981j465J199J759J671K698L308J898K6p41j756l935n163m122l077
$$ 351770 347789 346324 347523 349282 350953 353651 356959 358857 358883 358142 356386 352451 347288 343166 340089
57896C40089l738m074k353n67n65n82J054K520K126J717K883L589K079N50J226
$$ 340089 336351 332277 329924 329357 328792 328210 329264 331784 333910 335627 338510 342099 344178 344728 345954
57881C45954K327J699R38K049L275K273L79j58l09j752l139k666j688k023k349
$$ 345954 348281 349980 350918 352967 356242 358515 358894 358736 358427 356675 353536 350870 349182 347159 344810
57866C44810r85M12k98j674j226L79J138J439K405K928J779N37J064K240K316
$$ 344810 343825 344237 343939 342265 341039 341418 342556 343995 346400 349328 351107 351644 352708 354948 357264
57851C57264K097K733K890J328j85K00J025L07q39o43j64r76j880j324n77j105
$$ 357264 359361 362094 364984 366312 366127 366327 367352 367659 366820 366177 366013 365037 363157 361833 361256 360151
57835C60151j372K64K111K140J798L035M174K797L87r1P96N63n04m24L41j00j263
$$ 360151 358779 359043 361154 363294 365092 368127 372301 375098 375485 375394 376190 376753 376249 375825 376166 376066 374803
57818C74803j359q42j288k115j925j718l308n808p067p281p958q712q370p729
$$ 374803 373444 372602 371314 369199 367274 365556 362248 356440 349373 342092 334134 325422 317052 309323
57804C09323q029q195o768m928m425m191k374NQ05N14Q28J283P92P48K767N013
$$ 309323 301294 293099 286331 281403 276978 272787 270413 270418 271223 271737 272565 273848 274640 275388 278155 283168
57788B83168M646K543J680K160J816O49N99J726K378K511L268M009L190J506R14
$$ 283168 287814 290357 292037 294197 296013 296662 297261 298987 301365 303876 307144 311153 314343 315849 316763
57773C16763J307J268J084J791K345J120q50j519j512k722m363m129k332j196
$$ 316763 318070 319338 320422 322213 324558 325678 324828 323309 321797 319075 314712 310583 308251 307055
57759C07055r26j07Q45L89p26l82J171J926J827K320L008K391J226J453K400J800
$$ 307055 306129 306022 306867 307256 306530 306148 307319 309245 311072 313392 316400 318791 320017 321470 323870 325670
57743C25670N7m01M52L55q84j154j63J0j256k277k372k589k976k342r84n41r82
$$ 325670 325727 325326 325778 326133 325249 324095 323932 323942 322686 320409 318037 315448 312472 310130 309146 308605 307623
57726C07623p49J41K22k97K78J804K335J520Q89P31j25j451j635o59o6M0R26K309
$$ 307623 306874 307015 307237 306940 307218 309022 311357 312877 313766 314497 314372 312921 311286 310627 310561 310601 311527 313836
57708C13836K533J656J235J259M16q31p53J83q3j309j208K57O25p41j802j724
$$ 313836 316369 318025 319260 320519 320935 320104 319351 319534 319451 318142 316934 317191 317816 317075 315273 313549
57692C13549k047l332m156m131m571n370m664k406q91r26p37N01J413J718L309
$$ 313549 311502 308170 304014 299883 295312 289942 285278 282872 281981 281055 280318 280819 282232 283950 287259
57677B87259O745R933J1703J3759J7601K2410K7430L3781M2271N1835O1431P0949
$$ 287259 294004 303937 315640 329399 347000 369410 396840 430621 472892 524727 586158 657107
57665F57107P8558P9412O8931M6518J5706j7400m5617o3524p0514o9926o4958
$$ 657107 735665 815077 884008 930526 946232 928832 883215 819691 749177 679251 614293
57654F14293n7171m8396m0926l5057k9135k2774j7575j4131j1015p577n067m154
$$ 614293 557122 508726 467800 432743 403608 380834 363259 349128 338113 330536 325469 321315
57642C21315l789l326l300l413k457r25j018l062m641m222l075k618k500k395
$$ 321315 317526 314200 310900 307487 305030 304105 303087 300025 295384 291162 288087 285469 282969 280574
57628B80574l039m295m584l485k563k672k762k282k211k770k644j564j066j686
$$ 280574 277535 273240 268656 265171 262608 259936 257174 254892 252681 249911 247267 245703 244637 242951
57614B42951j949j244r59j657j862r77o10j575k216j334k03m7k1P01J231J006
$$ 242951 241002 239758 238799 237142 235280 234303 233693 232118 229902 228568 228365 228318 228297 228998 230229 231235
57598B31235J128K009K073N03j039j179r49j369j292K53J809J775J015J074J599
$$ 231235 232363 234372 236445 236948 235909 234730 233781 232412 231120 231373 233182 234957 235972 237046 238645
57583B38645J508J155J254J200L09o20o90n51j160k248l298m462n381m918l320
$$ 238645 240153 241308 242562 243762 244071 243451 242761 242210 241050 238802 235504 231042 225661 220743 217423
57568B17423k659l725m560l648k407k590l356l061k145j923k005j176K55J047
$$ 217423 214764 211039 206479 202831 200424 197834 194478 191417 189272 187349 185344 184168 184423 185470
57554A85470J036Q52O29M24Q59K027K894K901K794K845J993J8j375j133o12j154
$$ 185470 186506 187358 187987 188411 189270 191297 194191 197092 199886 202731 204724 204742 203367 202234 201622 200468
57538B00468j771j062L03R01Q27P41K85q22j527j194j017j929k659j841m37J8
$$ 200468 198697 197635 197938 198839 199666 200407 200692 199870 198343 197149 196132 194203 191544 189703 189266 189284
57522A89284M8Q94J932J757P57L97Q08J084J165J512J796J649J714K369K486J209
$$ 189284 189332 190226 192158 193915 194672 195069 195877 196961 198126 199638 201434 203083 204797 207166 209652 210861
57506B10861k23k97L85M24J29N93J338J091J09m00m27p88j218q40Q1O13Q07J226
$$ 210861 210638 210341 210726 211150 211279 211872 213210 214301 214410 214010 213583 212795 211577 210737 210818 211431 212238 213464
57488B13464J466Q27k17p97j141j835k371k086j619j832k102j473n47n30j147
$$ 213464 214930 215757 215540 214743 213602 211767 209396 207310 205691 203859 201757 200284 199737 199207 198060
57473A98060j312j106j311j734j696j579k157l016l216k861k486j729k22J073
$$ 198060 196748 195642 194331 192597 190901 189322 187165 184149 180933 178072 175586 173857 173635 174708
57459A74708J075M16L18N04m4j042j348q32j12P77J860K194J139j75l78L2j10
$$ 174708 175783 176199 176517 177021 176977 175935 174587 173755 173643 174420 176280 178474 179613 179438 179060 179092 178982
57442A78982l17O30K222K907K620K582K963K844K196J927K175K264K146K270K359
$$ 178982 178665 179295 181517 184424 187044 189626 192589 195433 197629 199556 201731 203995 206141 208411 210770
57427B10770J855J182J044R86J95r05j398j555k117k680k484k038k167k256j324
$$ 210770 212625 213807 214851 215837 216032 215127 213729 212174 210057 207377 204893 202855 200688 198432 197108
57412A97108o7K12lO92K025K538K142J885J540j02k677m259m028k898j508K98
$$ 197108 197041 197253 197250 197942 199967 202505 204647 206532 208072 207970 205293 201034 197006 194108 192600 192898
57396A92898J918K105J010L01P83J494J430P64J27r8L29J195J670J491J692K929
$$ 192898 194816 196921 197931 198232 199015 200509 201939 202703 202830 202732 203061 204256 205926 207417 209109 212038
57380B12038L957L393K100J864K428K098O92l70o82j112j655j303k93j56j293
$$ 212038 215995 219388 221488 223352 225780 227878 228570 228200 227518 226406 224751 223448 223155 222999 221706
57365B21706k395k642k547k419j802q45m18n45k83O19J398J707J899J911J383
$$ 221706 219311 216669 214122 211703 209901 209056 208638 208093 207810 208429 209827 211534 213433 215344 216727
57350B16727Q12J044J722J863J643J904K218J457M9m60j9j8n97l07J189K295J968
$$ 216727 217539 218583 220305 222168 223811 225715 227933 229390 229439 228979 228960 228942 228345 228038 229227 231522 233490
57333B33490J059N54K70q4k16j77n05j037r98n02m41p66n14L26O61K67J64O93
$$ 233490 234549 235103 235373 235289 235073 234896 234391 233354 232356 231854 231413 230647 230133 230459 231120 231387 231551 232244
57315B32244R33M17j19j35L2J37L12K80l08p87k17Q57J101O56Q38J710J970J371
$$ 232244 233177 233594 233475 233340 233372 233509 233821 234101 233793 233006 232789 233646 234747 235403 236241 237951 239921 241292
57297B41292J212K058K901K886K228J217M8m06M98J655J548Q60J454K989L260
$$ 241292 242504 244562 247463 250349 252577 253794 253842 253436 253934 255589 257137 257997 259451 262440 265700
57282B65700J968J267K065K740K331K123K964L664L417L344M171M661L866K859
$$ 265700 267668 268935 271000 273740 276071 278194 281158 284822 288239 291583 295754 300415 304281 307140
57268C07140K707K645J843J138J406J831J430Q53J129J906K279K245K127J695
$$ 307140 309847 312492 314335 315473 316879 318710 320140 320993 322122 324028 326307 328552 330679 332374
57254C32374J010R35J801K672K849K874L219L302K765K357K661L159L391L749
$$ 332374 333384 334319 336120 338792 341641 344515 347734 351036 353801 356158 358819 361978 365369 369118
57240C69118M352M484L923L518L723L981M098M726N781O053N270M843N711O933
$$ 369118 373470 377954 381877 385395 389118 393099 397197 401923 407704 413757 419027 423870 429581 436514
57226D36514P347P062O554N867N473O197P532P871P161P320R092J0751J1092J1381
$$ 436514 443861 450923 457477 463344 468817 475014 482546 490417 497578 504898 513990 524741 535833 547214
57212E47214J2818J4291J4491J4280J4951J5852J5894J5907J7279J9476K0997
$$ 547214 560032 574323 588814 603094 618045 633897 649791 665698 682977 702453 723450
57201G23450K1846K3035K4468K5185K5161K5201K5573K6141K7262K9209L1279
$$ 723450 745296 768331 792799 817984 843145 868346 893919 920060 947322 976531 1007810
57190A007810L2618L3349L4024L4751L5694L7362L9432M0450L9746L8547L8247
$$ 1007810 1040428 1073777 1107801 1142552 1178246 1215608 1255040 1295490 1335236 1373783 1412030
57179A412030L8777L9774M1840M5210M8375M9561M8747M7036M5006M2863M1193
$$ 1412030 1450807 1490581 1532421 1577631 1626006 1675567 1724314 1771350 1816356 1859219 1900412
57168A900412M0226L9224L7675L6184L5202L4013L2028K9952K8586K7592K6448
$$ 1900412 1940638 1979862 2017537 2053721 2088923 2122936 2154964 2184916 2213502 2241094 2267542
57157B267542K5459K4814K3954K2873K2642K3627K4688K5184K6081K7805K8803
$$ 2267542 2293001 2317815 2341769 2364642 2387284 2410911 2435599 2460783 2486864 2514669 2543472
57146B543472K7866K6285K5954K6773K7614K8476K9855L1180L1729L2057L3047
$$ 2543472 2571338 2597623 2623577 2650350 2677964 2706440 2736295 2767475 2799204 2831261 2864308
57135B864308L4546L6296L8896M2340M5104M6215M6930M8714N1117N3273N5931
$$ 2864308 2898854 2935150 2974046 3016386 3061490 3107705 3154635 3203349 3254466 3307739 3363670
57124C363670O0077O5124P0400P6918Q5583R5222J04698J15403J29187J45071
$$ 3363670 3423747 3488871 3559271 3636189 3721772 3816994 3921692 4037095 4166282 4311353
57114D311353J60599J75314J90369K05865K21429K38780K60966K89432L24185
$$ 4311353 4471952 4647266 4837635 5043500 5264929 5503709 5764675 6054107 6378292
57105F378292L66213M17482M79200N52630O41453P51386Q88429J060138J278094
$$ 6378292 6744505 7161987 7641187 8193817 8835270 9586656 10475085 11535223 12813317
57096A2813317J556298J906425K335417K845892L435815M098025M822001N595186
$$ 12813317 14369615 16276040 18611457 21457349 24893164 28991189 33813190 39408376
57088C9408376O400094P210825P993543Q705723R287544R653927R703963R348221
$$ 39408376 45808470 53019295 61012838 69718561 79006105 88660032 98363995 107712216
57080A07712216Q534555P257501N557021L518821J275584j002624l135913m973431
$$ 107712216 116246771 123504272 129061293 132580114 133855698 132853074 129717161 124743730
57072A24743730o425712p472769q145294q495776q579892q451623q160750p746711
$$ 124743730 118318018 110845249 102699955 94204179 85624287 77172664 69011914 61265203
57064F1265203p235730o647125o002831n331053m662797m026216l442249k922810
$$ 61265203 54029473 47382348 41379517 36048464 31385667 27359451 23917202 20994392
57056B0994392k472026k089184j770494j509063j295480j119761r72975q47836
$$ 20994392 18522366 16433182 14662688 13153625 11858145 10738384 9765409 8917573
57048H917573p39398o45424n64931m96197m36900l85708l42256l05678k74422
$$ 8917573 8178175 7532751 6967820 6471623 6034723 5649015 5306759 5001081 4726659
57039D726659k47413k23999k02927j82741j63213j45056j28312j12244r6599q1541
$$ 4726659 4479246 4255247 4052320 3869579 3706366 3561310 3432998 3320754 3224155 3142614
57029C142614o6394m9706l0886j1419M524J0014j753l1306o9617j03210j23219
$$ 3142614 3076220 3026514 2995628 2984209 2988733 2998747 2996994 2965688 2896071 2792861 2669642
57018B669642j28951j24462j14539j03305r3236q4290p5536o7664o2186n8586
$$ 2669642 2540691 2416229 2301690 2198385 2105149 2020859 1945323 1877659 1815473 1756887
57008A756887n4723n0078m6186m3639m1130l8043l5601l4677l4511l4368l4575
$$ 1756887 1702164 1652086 1605900 1562261 1521131 1483088 1447487 1412810 1378299 1343931 1309356
56997A309356l5084l4783l3033l0523k8023k5624k3453k1633j9384j5702j1084
$$ 1309356 1274272 1239489 1206456 1175933 1147910 1122286 1098833 1077200 1057816 1042114 1031030
56986A031030p004l661nL962O736P130M685j382j1162k1922k9531l2676l3556
$$ 1031030 1024026 1020365 1020360 1024322 1031058 1038188 1042873 1041491 1030329 1008407 978876 946200 912644
56973I12644l4076l3802l2075k9533k6586k2667j7997j4024j1168q161m339n65
$$ 912644 878568 844766 812691 783158 756572 733905 715908 701884 690716 682555 678216 677651
56961F77651K870O991J1915J6174J9167K1868K3833K1943J3873J145j2588k4622
$$ 677651 680521 687512 699427 715601 734768 756636 780469 802412 816285 817430 804842 780220
56949G80220l3345l7500l7175l4293l0666k6613k2268j8491j5406j1744o937k273
$$ 780220 746875 709375 672200 637907 607241 580628 558360 539869 524463 512719 505782 503509
56937E03509J227M489Q707J3541J8262K3131K8199L2101L3163L0463K2928R416
$$ 503509 504736 509225 517932 531473 549735 572866 601065 633166 666329 696792 719720 729136
56925G29136q583k5954l7570m2248m2111l9465l5666l1719k8122k4664k1338j8739
$$ 729136 720553 694599 657029 614781 572670 533205 497539 465820 437698 413034 391696 372957
56913C72957j6814j4500j1550r328q746q689p719o152n155m899m816m728m646
$$ 372957 356143 341643 330093 320765 312019 303330 295611 289459 284304 279405 274589 269861 265215
56900B65215m213l347k533j812n45J269K689L533M872P169R414J1011J2916J5893
$$ 265215 261002 257655 255122 253310 252765 254034 256723 260256 265128 272297 281711 292722 305638 321531
56886C21531J9105K1379K2318K1225J6705Q709n05q547j4662j8507j9151j6684
$$ 321531 340636 362015 384333 405558 422263 430972 430467 421920 407258 388751 369600 352916
56874C52916j3118j0149p459m407j635M98L242P468J1937J5345J8652K3537K9847
$$ 352916 339798 329649 322190 317783 316148 316646 319888 327356 339293 354638 373290 396827 426674
56861D26674L6375M2831M8938N2628N1024M2740K8083Q476j2719l0305m0511m3754
$$ 426674 463049 505880 554818 607446 658470 701210 729293 737769 725050 694745 654234 610480
56849F10480m2800l9343l3819k7235k0903j4885q432j443N748J3325K1441K9635
$$ 610480 567680 528337 494518 467283 446380 431495 423063 421620 427368 440693 462134 491769
56837D91769L7961M7478N8395O9000P7634Q3789Q5355P6935N4220J9798j7564
$$ 491769 529730 577208 635603 704603 782237 866026 951381 1028316 1082536 1102334 1084770
56826A084770m9079p0045p9486p9056p2540o3934n5056m5794l6314k7570j9892
$$ 1084770 1035691 965646 886160 807104 734564 670630 615574 569780 533466 505896 486004
56815D86004j2619n158K579J0600J8761K6693L4485M2819N1518N8603O1311N7146
$$ 486004 473385 468227 470806 481406 500167 526860 561345 604164 655682 714285 775596 832742
56803H32742M3919K1044p720l4658n3306o2476o4347o0765n3368m5148l8700l3554
$$ 832742 876661 897705 889985 855327 802021 739545 675198 614433 561065 515917 477217 443663
56791D43663k7626k0717j4403r228m285Q40N811J0898J6647K2535K7480L1120
$$ 443663 416037 395320 380917 371689 367404 368244 374055 384953 401600 424135 451615 482735
56779D82735L2916L0793K2846R996m598j8248k9274l6027l7787l6271l4117l1960
$$ 482735 515651 546444 569290 579286 574688 556440 527166 491139 453352 417081 382964 351004
56767C51004k8760k4510k0601j7726j5324j3071j1214r554p665n958n174n087
$$ 351004 322244 297734 277133 259407 244083 231012 219798 210244 202579 196621 191447 186360
56755A86360m966m823m888m558l307j921j426j477j319j335k012k417j539k17
$$ 186360 181394 176571 171683 167125 163818 161897 160471 158994 157675 156340 154328 151911 150372 150155
56741A50155J34j78p8O9o52j477j003K86Q10N39N79P81K50l42M64K134K696J833
$$ 150155 150289 150111 150033 150102 149450 147973 146970 147256 148066 148605 149184 149965 150215 149873 150337 152471 155167 157000
56723A57000J063J004Q77O29J052J767J435J63n05j34K26K13O19J475J796J463
$$ 157000 158063 159067 159944 160573 161625 163392 164827 164990 164485 164351 164577 164790 165409 166884 168680 170143
56707A70143J381J734J865J839K252K610J904O39K41O06M23l05l68J68Qp82p01
$$ 170143 171524 173258 175123 176962 179214 181824 183728 184367 184608 185214 185637 185332 184964 185132 185140 184358 183657
56690A83657L94Q75J71k93M19J381J619J414J261J136J196J743K333K311K112
$$ 183657 184051 184926 185097 184804 185223 186604 188223 189637 190898 192034 193230 194973 197306 199617 201729
56675B01729K451K599J405l97j039o05p43j688j980j186n13m90l37J10R4k60j7
$$ 201729 204180 206779 208184 207787 206748 206143 205400 203712 201732 200546 200033 199543 199206 199316 199410 199150 199133
56658A99133O39O48K57O35J360Q38o71j106K3R55P24K41m8r11k100k019m71P06
$$ 199133 199772 200420 200677 201312 202672 203510 202839 201733 201756 202711 203435 203676 203628 202717 200617 198598 198127 198833
56640A98833N50J85M00M20j00j91M13N51j97p12n36p52j874k834k912k708k631
$$ 198833 199383 199568 199968 200388 200288 200097 200510 201061 200864 200152 199616 198864 196990 194156 191244 188536 185905
56623A85905k246j664j640j904j419m75l96j055j035l35k88o80J46J986K636J583
$$ 185905 183659 181995 180355 178451 177032 176557 176161 175106 174071 173736 173448 172768 172914 174900 177536 179119
56607A79119P37Q33L88r44j264N9J066P14N81J555J985R12K6N50J027K60l51M45
$$ 179119 179856 180689 181077 180133 178869 178928 179994 180708 181289 182844 184829 185741 185767 186317 187344 187604 187253 187698
56589A87698J281O81l06k47J58j13k66M63Q23k90j532j228p9L64L32Q67J691K016
$$ 187698 188979 189660 189354 189107 189265 189152 188886 189349 190172 189882 188350 187122 187043 187407 187739 188606 190297 192313
56571A92313K199K817L369L425L667M436M846M682N310P313R143R772J0640J3080
$$ 192313 194512 197329 200698 204123 207790 212226 217072 221754 227064 234377 243520 253292 263932 277012
56557B77012J5583J5597J2558P488J251m927q882r473q059o575n435m524m429
$$ 277012 292595 308192 320750 328238 329489 324562 315680 306207 298148 291573 286138 281614 277185
56544B77185n108n118l783k566k793l640l823l513l155k255q98n27j593k326j508
$$ 277185 272077 266959 263176 260610 257817 254177 250354 246841 243686 241431 240533 240006 238413 236087 234579
56529B34579m48n19q37k69L16j68q99q36o99j254j506p32l95j760l358l174j813
$$ 234579 234131 233612 232775 232506 232822 232654 231755 230919 230220 228966 227460 226728 226333 224573 221215 218041 216228
56512B16228j149j303j220r98j359j953k140k341k877k841j725p38p92q70r6M37
$$ 216228 215079 213776 212556 211558 210199 208246 206106 203765 200888 198047 196322 195584 194792 193922 193826 194263
56496A94263k36r07l05O02M74N4M93J063P08K90R06J615J085M7j37J73J1k36m9
$$ 194263 194027 193120 192815 193417 193891 193945 194438 195501 196209 196499 197405 199020 200105 200152 200015 200188 200199 199963 199914
56477A99914k62j295j703o15L39k85j117m63O90P24L95R46J240j90j961j833l46
$$ 199914 199652 198357 196654 196039 196378 196093 194976 194513 195203 195927 196322 197268 198508 198318 196357 194524 194178
56460A94178N80J096K343L402K635R37M51R94P90j36k49O01J346J961K982L706
$$ 194178 194758 195854 198197 201599 204234 205171 205622 206616 207406 207270 207021 207622 208968 210929 213911 217617
56444B17617L331K787L008K734O27j867k578k072k122k275j097N22O67q5K15J260
$$ 217617 220948 223735 226743 229477 230104 228237 225659 223587 221465 219190 218093 218615 219282 219197 219412 220672
56428B20672J212J68k98k22o63r81J03J545J320m7m82m6l17r42k15J448K023J351
$$ 220672 221884 222052 221754 221532 220869 219888 219991 221536 222856 222809 222327 222281 221964 221022 220807 222255 224278 225629
56410B25629R49Q28j89j491j346j48J54m51l41M37L46m48l51M75L67n98p64qK66
$$ 225629 226578 227406 227217 225726 224380 224232 224386 223935 223594 224031 224377 223929 223578 224053 224420 223822 223058 223050 223316
56391B23316M7N85J618J675Q91O63Q93M76m8O62J836J590L25j9N61O24M92J526
$$ 223316 223363 223948 225566 227241 228132 228795 229688 230164 230116 230778 232614 234204 234529 234510 235071 235695 236187 237713
56373B37713K833K298M86p7Q28J165O01O93J414J154J73L48J560J876J275J506
$$ 237713 240546 242844 243330 243253 244081 245246 245847 246540 247954 249108 249281 249629 251189 253065 254340 255846
56357B55846K393K058P63O88J827K030J196J360K371J702q25k251j325k39n41
$$ 255846 258239 260297 261060 261748 263575 265605 266801 268161 270532 272234 271409 269158 267833 267594 267053
56342B67053j016p11n03n19O50K966M313L843L096L003K714K103K385L486L757
$$ 267053 266037 265326 264823 264304 264954 267920 272233 276076 279172 282175 284889 286992 289377 292863 296620
56327B96620K948K651L276L461K892K760L029K332Q52L18Q23O90k99o64l12o23
$$ 296620 299568 302219 305495 308956 311848 314608 317637 319969 320821 321139 321962 322652 322353 321689 321377 320754
56311C20754j407j077J20M35J23J044K872L456K967L772O096P782Q382R334J0004
$$ 320754 319347 318270 318390 318825 318948 319992 322864 326320 329287 333059 339155 346937 355319 364653 374657
56296C74657Q114M512K893M020M741L603K846L748M567M456N049O634P024N772
$$ 374657 382771 387283 390176 394196 398937 402540 405386 409134 413701 418157 423206 429840 436864 442636
56282D42636N434P091Q561Q532Q496R163Q994P794P805R594J0759J0307J0430
$$ 442636 448070 455161 463722 472254 480750 489913 498907 506701 514506 524100 534859 545166 555596
56269E55596J2301J4053J4591J5619J8046K0161K1146K2783K6021K9308L1958
$$ 555596 567897 581950 596541 612160 630206 650367 671513 694296 720317 749625 781583
56258G81583L5658M1169M7010N2720N9807O8273P6028Q2979R1730J02899J13760
$$ 781583 817241 858410 905420 958140 1017947 1086220 1162248 1245227 1336957 1439856 1553616
56247A553616J22763J31351J39811J45757J48288J49473J49968J47192J39501
$$ 1553616 1676379 1807730 1947541 2093298 2241586 2391059 2541027 2688219 2827720
56238B827720J28154J13635R4364P0686M5833K1341m169l0231n3277p1917q8624
$$ 2827720 2955874 3069509 3163873 3234559 3280392 3301733 3297564 3267333 3214056 3142139 3053515
56227C053515j04305j16040j22379j26085j29176j29956j27413j23894j20813
$$ 3053515 2949210 2833170 2710791 2584706 2455530 2325574 2198161 2074267 1953454
56218A953454j16176j08935j01452r5248q8664q1058p4775p0510o5503n8779n3416
$$ 1953454 1837278 1728343 1626891 1531643 1442979 1361921 1287146 1216636 1151133 1092354 1038938
56207A038938n0923m8272m3311l8347l5358l2423k8026k4232k2393k0269j6565
$$ 1038938 988015 939743 896432 858085 822727 790304 762278 738046 715653 695384 678819
56196F78819j3818j3580j3185j0519p651o644o094m834m598o021o490m858l752
$$ 678819 665001 651421 638236 627717 620066 613422 607328 602494 597896 591875 585385 580527 576775
56183E76775m422m252k129j109k644l534j869n89j666k306n68O83o04j616k05
$$ 576775 572353 568101 565972 564863 562219 558685 556816 556227 554561 552255 551687 552370 551766 550150 549945
56168E49945R87L2j71K486N011M999N131P521R189P895O882Q928J1117J0629J0238
$$ 549945 550932 550964 550793 553279 558290 563289 568420 575941 585130 593025 599907 608835 619952 630581 640819
56153F40819J2811J5702J6117J6802K0780K5533K8040L0647L6236M2550M7057
$$ 640819 653630 669332 685449 702251 723031 748564 776604 807251 843487 886037 933094
56142I33094N2546O1950P2335P9885Q6127R3227R7784R5494Q7717P7896O6000
$$ 933094 985640 1047590 1119925 1199810 1285937 1379164 1476948 1572442 1660159 1738055 1804055
56131A804055N2209M1180L6454L4897L2208K9201K7111K2256J1834Nq138j3862
$$ 1804055 1856264 1897444 1933898 1968795 2001003 2030204 2057315 2079571 2091405 2091410 2083272 2069410
56119B069410j9996k4439k5332k7448l6119m9219o1804p3765q6059r4576r5209
$$ 2069410 2049414 2024975 1999643 1972195 1936076 1886857 1825053 1751288 1665229 1570653 1475444
56108A475444r0627q5123p7483o5777n3948m6324m0455l2617k5243k1589j8521
$$ 1475444 1384817 1299694 1222211 1156434 1102486 1056162 1015707 983090 957847 936258 917737
56097I17737j2374o594n588o232l650q2J85o21J310L352J897M26L243O742N896
$$ 917737 905363 898769 893181 886949 883299 883217 883402 882781 884091 887443 889340 889766 893009 899751 905647
56082I05647L883N929R161Q322O095P737J0695R804P749R912J3750J3777J2232
$$ 905647 909530 915459 924620 932942 939037 946774 957469 967273 975022 984934 998684 1012461 1024693
56069A024693J4323J7638J6932J4644J5985J8481J7115J4760J6516J9008J6534
$$ 1024693 1039016 1056654 1073586 1088230 1104215 1122696 1139811 1154571 1171087 1190095 1206629
56058A206629J2553J3332J5724J3299R144R983J3057J1704Q751J0976J5482J5209
$$ 1206629 1219182 1232514 1248238 1261537 1270681 1280664 1293721 1305425 1314176 1325152 1340634 1355843
56046A355843J2944J5897K1202K1198J8406K0723K6184K7249K5781K8814L3832
$$ 1355843 1368787 1384684 1405886 1427084 1445490 1466213 1492397 1519646 1545427 1574241 1608073
56035A608073L3435L0306L2121L6153L4740L1324L4621M1309M1435L6824L6897
$$ 1608073 1641508 1671814 1703935 1740088 1774828 1806152 1840773 1882082 1923517 1960341 1997238
56024A997238M0428L9150L5386L7946M4294M5077M2587M6208N3514N4873N2735
$$ 1997238 2037666 2076816 2112202 2150148 2194442 2239519 2282106 2328314 2381828 2436701 2489436
56013B489436N6836O4435O5493O3105O7971P6919P8605P6137Q1449R1586R4079
$$ 2489436 2546272 2610707 2676200 2739305 2807276 2884195 2962800 3038937 3120386 3211972 3306051
56002C306051R1726R7651J09567J14194J13634J21342J35236J41612J42551J51871
$$ 3306051 3397777 3495428 3604995 3719189 3832823 3954165 4089401 4231013 4373564 4525435
55992D525435J67072J73857J75344J87168K06779K18361K24909K43218K70383
$$ 4525435 4692507 4866364 5041708 5228876 5435655 5654016 5878925 6122143 6392526
55983F392526K89127L02983L30711L68975L97975M20910M58618N08416N50013
$$ 6392526 6681653 6984636 7315347 7684322 8082297 8503207 8961825 9470241 10020254
55974A0020254N88957O49694P28607Q01362Q73889R75448J104233J234691J376225
$$ 10020254 10609211 11258905 11987512 12788874 13662763 14638211 15742444 16977135 18353360
55965A8353360J565750J805090K070743K384215K803321L347021M006295M824093
$$ 18353360 19919110 21724200 23794943 26179158 28982479 32329500 36335795 41159888
55957D1159888N873145P156525Q634847J0356505J2450350J4995030J8032064
$$ 41159888 47033033 54189558 62824405 73180910 85631260 100626290 118658354
55950A18658354K1685841K6051136L0903118L5694737L9783385M2211543M1114494
$$ 118658354 140344195 166395331 197298449 232993186 272776571 314988114 356102608
55943C56102608L4069869K0043745J250186j7440997l1419127l8829431m0592817
$$ 356102608 390172477 410216222 411466408 394025411 362606284 323776853 283184036
55936B83184036l8728973l5006000l0641723k6401830k2615709j9282057j6329009
$$ 283184036 244455063 209449063 178807340 152405510 129789801 110507744 94178735
55929I4178735j3748171j1523186r593317p932953o566357n477508m590113l853000
$$ 94178735 80430564 68907378 59314061 51381108 44814751 39337243 34747130 30894130
55921C0894130l266788k813733k437073k105832j833620j618925j427149j244458
$$ 30894130 27627342 24813609 22376536 20270704 18437084 16818159 15391010 14146552
55913A4146552j092615r77189q72521p69306o87982o33268n81070n21841m74109
$$ 14146552 13053937 12076748 11204227 10434921 9746939 9113671 8532601 8010760 7536651
55904G536651m44120m12614l72406l40720l23461l03261k73405k49586k37893
$$ 7536651 7092531 6679917 6307511 5966791 5643330 5340069 5066664 4817078 4579185
55895D579185k23497k00825j84064j78095j68571j50074j36008j31558j24014
$$ 4579185 4355688 4154863 3970799 3792704 3624133 3474059 3338051 3206493 3082479
55886C082479j08642r7855r6116r1097p8495p1159p4769p7714p3686p1741p5600
$$ 3082479 2973837 2875982 2779866 2688769 2610274 2539115 2464346 2386632 2312946 2241205 2165605
55875B165605p4939o5884n9455o1194o2129n7727n6289o0852o1751n4882m9303
$$ 2165605 2090666 2024782 1965327 1904133 1842004 1784277 1727988 1667136 1605385 1550503 1501200
55864A501200m9422m7392m0152l6225l8616l8346l2074k8953l2817l4421k8898
$$ 1501200 1451778 1404386 1364234 1328009 1289393 1251047 1218973 1190020 1157203 1122782 1093884
55853A093884k4472k6166k6729k1627j7851j9842k1143j7714j5727j8677k0265
$$ 1093884 1069412 1043246 1016517 994890 977039 957197 936054 918340 902613 883936 863671
55842H63671j7188j5763j8945j9856j5191j2108j4901j7334j5043j3158j4898
$$ 863671 846483 830720 811775 791919 776728 764620 749719 732385 717342 704184 689286
55831F89286j4819j0233p398r557j0448o430l567n816p624n121l686p277j0832
$$ 689286 674467 664234 656836 647279 636831 630401 626834 621018 613394 608273 604587 597310 586478
55818E86478j0190r375j1408j1903q412o178q115q807m811j241j837k166R41K904
$$ 586478 576288 566913 555505 543602 535190 529012 520897 512090 507279 506038 504201 502035 502976 505880
55804E05880Q18j14L688P234O356N121P171Q420N191J254J16j570o508j0608j0668
$$ 505880 506698 506584 510272 517506 523862 528983 536154 544574 549765 551019 551135 549565 543057 532449 521781
55789E21781j0362j2517j3306j0213p621q394q042l729q85l955q371q782p905
$$ 521781 511419 498902 485596 475383 467762 459368 451326 447597 446712 442757 434386 425604 417699
55776D17699r989j2421j1177q327p238o123k839k46o80r67J307K571N0k557j910
$$ 417699 407710 395289 384112 375785 368547 362424 359585 359339 358659 357692 358999 361570 361620 359063 357153
55761C57153j225l626n723m079j981l303n418m547k714l125l969k874k258m304
$$ 357153 355928 352302 346579 342500 340519 337216 331798 327251 324537 321412 317443 314569 312311 308007
55747C08007n853m113k227l427m986l769k410l984n828m746l222m383n762m225
$$ 308007 302154 298041 295814 292387 287401 283632 281222 277238 271410 266664 263442 259059 253297 249072
55733B49072k209k922m083k565o17j391k783j825p27k493m835m558l627m890o061
$$ 249072 246863 243941 239858 237293 236676 235285 232502 230677 229950 227457 222622 218064 214437 209547 203486
55718B03486m126j559j895l173j944P7l35j431M2K309J833p5k6J192R15J64J079
$$ 203486 199360 197801 195906 192733 190789 190866 190531 189100 189142 191451 193284 193209 193183 194375 195290 195454 196533
55701A96533J863p9k916l652l571m991n961l819q55o72j894j191M20O2j126l93
$$ 196533 198396 198317 195401 191749 188178 183187 177226 173407 172552 171880 169986 168795 169215 169277 168151 167758
55685A67758J005L61r29N8K060K079J045J646K928K448J347J888K446M28k257
$$ 167758 168763 169124 168195 168253 170313 172392 173437 175083 178011 180459 181806 183694 186140 186568 184311
55670A84311k192n52p58k209j972n74n61j218j06J878K212J635K345L284K287
$$ 184311 182119 181567 180809 178600 176628 176054 175493 174275 174169 176047 178259 179894 182239 185523 187810
55655A87810Q34J530L027K536J243J870L100J985k44m23L94j098m071n001m062
$$ 187810 188644 190174 193201 195737 196980 198850 201950 203935 203691 203268 203662 202564 198493 193492 189430
55640A89430m327n722n524l882l385l934l322j986k089k830j749L12N67m35k1
$$ 189430 185103 179381 173857 169975 166590 162656 159334 157348 155259 152429 150680 150992 151559 151124 151103
55625A51103J282Q21p92o52R45J182J62M27J708J357n20j413j322k366l932l401
$$ 151103 152385 153206 152414 151762 152707 153889 154051 154478 156186 157543 157023 155610 154288 151922 147990 144589
55609A44589j306o74j562j240L43L91j400k245j258m43m75j0O40m10k678l567
$$ 144589 143283 142609 141047 139807 140150 140541 139141 136896 135638 135195 134720 134710 135350 134940 132262 128695
55593A28695k709k144k288j741q36j231k227j657q4k9j326j516m78l32j074p37
$$ 128695 125986 123842 121554 119813 118977 117746 115519 113862 113778 113749 112423 110907 110429 110097 109023 108286
55577A08286M53M98o8J116L433L884K424K017L284L799K975K812L441K628L76
$$ 108286 108739 109237 109169 110285 113718 117602 120026 122043 125327 129126 132101 134913 138354 140982 141358
55562A41358n97K52L34j324k659k682k865l435k575l40N70q87k633l252l638m062
$$ 141358 140761 141013 141347 140023 137364 134682 131817 128382 125807 125467 126037 125150 122517 119265 115627 111565
55546A11565l249j347l26o03m72M49O34l7R0R89P10p73j117K81J244O50q8j00
$$ 111565 108316 106969 106643 106040 105568 106017 106651 106614 106704 107693 108403 107630 106513 106794 108038 108688 108600 108500
55528A08500l28j012j088p07j175k048j564k04k95j816k266j107n11j240j540
$$ 108500 108172 107160 106072 105365 104190 102142 100578 100374 100079 98263 95997 94890 94379 93139 91599
55513I1599q68p99j521j206K16M98q34j472n15P7o77j128l93R3l25k28Q16J177
$$ 91599 90731 89932 88411 87205 87421 87919 87085 85613 85098 85175 84498 83370 82977 83070 82745 82517 83333 84510
55495H4510L85J65J085J370K76m53K46J141J338J574J986J543N59O84J636J300
$$ 84510 84895 85060 86145 87515 87791 87338 87584 88725 90063 91637 93623 95166 95725 96409 98045 99345
55479I9345k90n48J149K291J616J014J646J879O75m54n62j059k648l590k854j949
$$ 99345 99055 98507 99656 101947 103563 104577 106223 108102 108777 108323 107761 106702 104054 100464 97610 95661
55463I5661j988j814p01k7n61r29l63j56q84r63L09J193N91k6N18J041M47l18
$$ 95661 93673 91859 91158 91131 90570 89641 89278 89122 88238 87275 87584 88777 89368 89342 89860 90901 91348 91030
55445I1030m07o65j478j523k65P30L99k45m15q75j746j591j29Q44N04M06J473
$$ 91030 90623 89958 88480 86957 86692 87422 87821 87576 87161 86286 84540 82949 82820 83664 84168 84574 86047
55428H6047K325K003J574J582P20j376k751k185j085p86n69J91N92L61P56J893
$$ 86047 88372 90375 91949 93531 94251 92875 90124 87939 86854 86068 85499 85690 86282 86643 87399 89292
55412H9292J981O64Q4J065J404k14j720j214L1K81K35Q55J023k19j455j278o34
$$ 89292 91273 91937 92021 93086 94490 94276 92556 91342 91373 91654 91889 92744 93767 93548 92093 90815 90181
55395I0181o55n26L94P29m63j656j409p09o55k79J150K008R29p07j135r04j031
$$ 90181 89526 89000 89394 90123 89660 88004 86595 85886 85231 84952 86102 88110 89039 88332 87197 86293 85262
55378H5262p47N48J349M89n73k99K07n07j382q67J27K4n49k72J88m12j291j055
$$ 85262 84515 85063 86412 86901 86328 86029 86236 85729 84347 83480 83607 83631 83082 82810 82998 82586 81295 80240
55360H0240k70k24n13j18M88N14O72J620K117R94m82m34P25J358J183P89mj266
$$ 80240 79970 79746 79233 79115 79603 80117 80789 82409 84526 85520 85038 84604 85329 86687 87870 88659 88655 87389
55342H7389j871j223n64p90o85P16J949J459L03J89O54N25L70R90J204j37j566
$$ 87389 85518 84295 83731 82941 82256 82972 84921 86380 86683 86872 87526 88051 88421 89411 90615 90478 88912
55325H8912j138K86O36R8J62N08k05j411j451n46k35n28k56L91K46l80j34Q90
$$ 88912 87774 88060 88696 88794 88956 89464 89259 87848 86397 85851 85616 85088 84832 85223 85469 85089 84955 85845
55307H5845J312Q54M89N45N30M39N11K76n67j078m49L52L7q88j123p52o36o58
$$ 85845 87157 88011 88500 89045 89575 90014 90525 90801 90234 89156 88707 89059 89096 88208 87085 86333 85697 85039
55289H5039k92j0l34n35J23Q95R29Q11J143R79l40j364o30P65R37K20J29N09J39
$$ 85039 84747 84737 84403 83868 83991 84886 85815 86626 87769 88748 88408 87044 86414 87179 88116 88336 88465 88974 89113
55270H9113q28j275j108p76J12J628K252R39p49q72r0p3l65M04J491J141k10p80
$$ 89113 88285 87010 85902 85126 85238 86866 89118 90057 89308 88436 88346 88273 87908 88312 89803 90944 90734 89954
55252H9954o33j090j689q46R20J463N65Q8O12P08k30j062j106j000j045o94K9
$$ 89954 89321 88231 86542 85696 86616 88079 88644 88732 89344 90052 89822 88760 87654 86654 85609 84915 84944
55235H4944M26M69O10N54j62p68l19M18Q8p93o11N71J220R02M98K02n35j323j188
$$ 84944 85370 85839 86449 87003 86841 86073 85754 86172 86260 85467 84856 85427 86647 87549 88047 88249 87714 86391 85203
55216H5203m50k76o70p64o55r05q79K44J368P85q09j157OP50K57k15R8M00K33
$$ 85203 84753 84477 83807 83043 82388 81483 80604 80848 82216 83001 82192 81035 81041 81791 82048 81833 81931 82331 82564
55197H2564L14R30J376J386J512J848J828J360P89m5j302k118j695q13o03n13
$$ 82564 82878 83808 85184 86570 88082 89930 91758 93118 93907 93862 92560 90442 88747 87934 87331 86818
55181H6818N19J676J340ql72N62J226R48N78M28r9p89o79P2M02L13N52O53m13
$$ 86818 87337 89013 90353 90345 89973 90535 91761 92709 93287 93715 93616 92827 92148 92220 92622 92935 93487 94140 93727
55162I3727j878j870m34N49M34L98R28J096O72N13O09k1j156j345m19K18M4L3
$$ 93727 91849 89979 89545 90094 90528 90926 91854 92950 93622 94135 94744 94723 93567 92222 91803 92021 92065 92098
55144I2098M73M30k30m30P2K14k72l86J58M31J30mO8m37j284j266l76J30Q7O05
$$ 92098 92571 93001 92771 92341 92413 92627 92355 91969 92127 92558 92688 92684 92752 92315 91031 89765 89389 89519 89606 90211
55124I0211J669J793O48k66q5L11K30J39J99j44o03j10J091J441O06m7Q3J47l1
$$ 90211 91880 93673 94321 94055 93970 94281 94511 94650 94849 94705 94102 93992 95083 96524 97130 97083 97166 97313 97282
55105I7282N23J635J651K30q53n24J49K56M63J088J042q2q56l13N10N14K61M97
$$ 97282 97805 99440 101091 101321 100468 99944 100093 100349 100812 101900 102942 102860 102004 101691 102201 102715 102976 103473
55087A03473P13M04K29O76J058Q82P75J094J065L17k54q4P7l14n06Q8Q05R62Q32
$$ 103473 104186 104590 104819 105495 106553 107435 108210 109304 110369 110686 110432 110348 110425 110111 109605 109693 110498 111460 112292
55068A12292O17j05j085j191l06J41n48j152n86L53M15l10j076j678k015j648
$$ 112292 112909 112804 111719 110528 110222 110363 109815 108663 108077 108430 108845 108535 107459 105781 103766 102118
55052A02118p51k96n77o49R5J025J477J473Q72o52k273k316o37R17J052M04j52
$$ 102118 101367 101071 100494 99845 99940 100965 102442 103915 104787 104135 101862 99546 98909 99826 100878 101282 101130
55035A01130o62r14j17J300J554K51o88J4J036Q65J63J90N62L28q1J65N85K53
$$ 101130 100468 99554 99437 100737 102291 102542 101854 101868 102904 103769 103932 104122 104684 105012 104931 105096 105681 105934
55017A05934m74o48l39k12k39J5M43O80O86M00l17r31m80P90J386P02j26j17K30
$$ 105934 105460 104812 104473 104261 104022 104037 104480 105160 105846 106246 105929 104998 104518 105308 106694 107396 107270 107153 107383
54998A07383L03M72R33J007N03L61R49J219N15k71l77m33r72j203n00L54N32M42
$$ 107383 107686 108158 109091 110098 110601 110962 111911 113130 113645 113374 112997 112564 111592 110389 109889 110243 110775 111217
54980A11217M73R2p49q70J65R37M09l18M6Q44Q89N73P84J036M86l21m02q8j48
$$ 111217 111690 111782 111033 110163 110328 111265 111674 111356 111402 112246 113135 113708 114492 115528 116014 115693 115291 115203 115055
54961A15055k05L77R58O28j10k67j40n82j257j211n74k10k48j84J54P78J857K806
$$ 115055 114850 115227 116185 116813 116703 116436 116296 115714 114457 113246 112672 112462 112214 112030 112184 112962 114819 117625
54943A17625K197j93k295k217p42J26M4Q6M88O03M74O96J032Q54O33J450L138
$$ 117625 119822 119629 117334 115117 114375 114501 114545 114631 115119 115722 116196 116892 117924 118778 119411 120861 123999
54926A23999M317M323L921M100N130O689Q173Q927Q756Q059P087N624L644J517
$$ 123999 128316 132639 136560 140660 145790 152479 160652 169579 178335 186394 193481 199105 202749 204266
54912B04266p37l455o140p528p391p010p199p181o275n212m731m262l225k241
$$ 204266 203529 200074 193934 186406 179015 172005 164806 157625 151350 146138 141407 137145 133920 131679
54898A31679j894j522n93K4m46j150j005m65m15m56J67R85J205J282K040L102
$$ 131679 129785 128263 127670 127694 127248 126098 125093 124628 124213 123757 123924 124909 126114 127396 129436 132538
54882A32538L639L782M032M210M332N355P582R395R197P491N539L239J03k799
$$ 132538 136177 139959 143991 148201 152533 157888 165470 174865 184062 191553 197092 200331 200434 197635
54868A97635m052m195m872o257p217p357p125o501n286m194l938l840k952j884
$$ 197635 193583 189388 184516 178259 171042 163685 156560 150059 144773 140579 136641 132801 129849 127965
54854A27965j822k416k429j815j474j518j457j482j881j918r60N3K1l69pL96l87
$$ 127965 126143 123727 121298 119483 118009 116491 115034 113552 111671 109753 108793 108846 108867 108498 108491 108887 108500
54837A08500j453r72N98J143L86Q0P99J250R79J175K167K465J151o55j560j573
$$ 108500 107047 106075 106673 107816 108202 108282 109081 110331 111310 112485 114652 117117 118268 117613 116053 114480
54821A14480j367j279j491k021k192j297J40J002J335K054L000K966J732M63q1
$$ 114480 113113 111834 110343 108322 106130 104833 104973 105975 107310 109364 112364 115330 117062 117525 117444
54806A17444k42k17K80R60J012M48J38K75J93k33l39P4N16Q82J436J803J342M46
$$ 117444 117202 116985 117265 118225 119237 119685 119823 120098 120291 120058 119719 119793 120309 121191 122627 124430 125772 126218
54788A26218J41M35M64Q3j54l51r52j245n8K059L131K448J235N57K70L11J177
$$ 126218 126359 126794 127258 127341 127187 126836 125884 124639 124581 126640 129771 132219 133454 134011 134281 134592 135769
54771A35769K690L868M506N342O467P100P187P625Q479Q631P550N839L788R90
$$ 135769 138459 142327 146833 152175 158642 165742 172929 180554 189033 197664 205214 211053 214841 215831
54757B15831k183m493n674o721p853p984o816n649n301m944l913k996k921l013
$$ 215831 213648 209155 203481 196760 188907 180923 174107 168458 163157 158213 154300 151304 148383 145370
54743A45370k520j968k072k373k089j358o89k2P55J125P29J35J09P39J726K869
$$ 145370 142850 140882 138810 136437 134348 132990 132301 132279 133034 134159 134888 135023 135132 135871 137597 140466
54727A40466L821M161M177M704N851O750O929O899O983O596N290L498J633o31
$$ 140466 144287 148448 152625 157329 163180 169930 176859 183758 190741 197337 202627 206125 207758 207127
54713B07127l499o243p958q530q401p891p183o353n207l648k255j764j914j748
$$ 207127 203628 197385 189427 180897 172496 164605 157422 151069 145862 142214 139959 138195 136281 134533
54699A34533j071o11o50o09k27Lj10j28l8m88j545k302k264k027k094k014j345
$$ 134533 133462 132851 132201 131592 131365 131368 131258 131130 131092 130604 129059 126757 124493 122466 120372 118358 117013
54682A17013n20j25p7m8q1k85n20o80p29l88N10J348J312O45L15M25J63n97r10
$$ 117013 116493 116368 116291 116243 116162 115877 115357 114677 113948 113560 114070 115418 116730 117375 117690 118115 118278 117681 116771
54663A16771l73J61K4k65nN83Q79O77R9o28j029p79l72n46r95p39K19Q07N97L41
$$ 116771 116398 116559 116583 116318 116313 116896 117775 118452 118551 117923 116894 116115 115743 115197 114202 113463 113682 114489 115086 115427
54643A15427M95N09P9j84J03L93J87k10l80l42j26K74L63l64j294j241k29N25
$$ 115427 115922 116431 116510 116326 116429 116822 117009 116799 116419 116077 115951 116225 116588 116224 114930 113689 113460 113985
54625A13985N66O30R00N80l48o17K40R29M11n79r43q18p41m56L36J045J066P03
$$ 113985 114551 115181 116081 116661 116313 115696 115936 116865 117276 116697 115754 114936 114195 113739 114075 115120 116186 116889
54607A16889M31R7l84n47l15l61p31l32J291K736K502J010j86m61l14j61l6j06
$$ 116889 117320 117417 117033 116486 116171 115810 115079 114747 116038 118774 121276 122286 122100 121639 121325 121164 121128 121022
54589A21022m70p77o15l5O46J170J207O17J3K46J110J453Q08j23p73j311j669
$$ 121022 120552 119775 119160 119125 119771 120941 122148 122765 122778 123024 124134 125587 126395 126272 125499 124188 122519
54572A22519j356o95p86j648j834o36P49J132R92J212J502J248Q06P62Q57P18
$$ 122519 121163 120468 119682 118034 116200 115564 116313 117445 118437 119649 121151 122399 123205 123967 124824 125542
54556A25542P06J008R15M6o66l00O08J012Q71O74L73j88n86n48n93r54q48K35
$$ 125542 126248 127256 128171 128217 127551 127251 127859 128871 129742 130416 130789 130601 130015 129467 128874 127920 127072 127307
54538A27307J394J599J208J066J012M61k81n64n61p62q98n74k94p58j632k015
$$ 127307 128701 130300 131508 132574 133586 134047 133766 133202 132641 131879 130981 130407 130113 129355 127723 125708
54522A25708j634p20N87J825K077J239O06J062J601Q55p20j533j170n90m57o31
$$ 125708 124074 123354 123941 125766 127843 129082 129688 130750 132351 133206 132486 130953 129783 129193 128736 128105
54506A28105r53j337j322n69L98Q03P07O95R16J162J299J053K7j348j723n82Q59
$$ 128105 127152 125815 124493 123924 124322 125125 125832 126527 127443 128605 129904 130957 130984 129636 127913 127331 128190
54489A28190J324J094R41O04l24j073p69nJ22j74k1L73K78R9P54J826K071J487
$$ 128190 129514 130608 131549 132153 131829 130756 129987 129982 130104 129930 129909 130282 130560 130659 131413 133239 135310 136797
54471A36797J174J356J269R48J379K612L298K534J008p2k29K67P73N70m42j380
$$ 136797 137971 139327 140596 141544 142923 145535 148833 151367 152375 152303 152074 152341 153114 153684 153242 151862
54455A51862j463j136j281j704j557q89n25n92m75j45k28p40r65p23n94p19n17
$$ 151862 150399 149263 147982 146278 144721 143832 143307 142715 142240 142095 141867 141127 140162 139439 138845 138126 137609
54438A37609J62O00K77m49r69j010n33K95R57J048R27J192J712J841J501J269
$$ 137609 137771 138371 138648 138199 137230 136220 135687 135982 136939 137987 138914 140106 141818 143659 145160 146429
54422A46429J393J488J152L69o40j412j406p10k14m48p49l40L25K29o35j377j499
$$ 146429 147822 149310 150462 150831 150191 148779 147373 146663 146449 146001 145252 144912 145237 145466 144831 143454 141955
54405A41955j126l32P49J447J268P90Q25J079P41R2J69J064J752J643J127N91
$$ 141955 140829 140497 141246 142693 143961 144751 145576 146655 147396 147488 147657 148721 150473 152116 153243 153834
54389A53834K1l95l58k03n47j172j229n31K55O60P08L01n98j263q85O8L14l23
$$ 153834 153855 153460 153102 152899 152352 151180 149951 149420 149675 150335 151043 151344 150746 149483 148598 148666 148980 148657
54371A48657o25J68J387K160K579L180M015M716M891M346L299K389J937J452M95
$$ 148657 148032 148200 149587 151747 154326 157506 161521 166237 171128 175474 178773 181162 183099 184551 185046
54356A85046l71l59O1l45j753l054l477l328l051k618k105j902k066k173k068
$$ 185046 184675 184316 184377 184032 182279 179225 175748 172420 169369 166751 164646 162744 160678 158505 156437
54341A56437j977j842j317n20j2Jk13n98j242j667j154J49J269J622J426R11M5
$$ 156437 154460 152618 151301 150781 150769 150770 150557 149959 148717 147050 145896 146045 147314 148936 150362 151273 151318
54324A51318q12r60l42K34J26m58r10q58k85M06N79N5n64p89j011j633j961j094
$$ 151318 150506 149546 149204 149438 149564 149106 148196 147338 147053 147459 148038 148093 147529 146740 145729 144096 142135 141041
54306A41041M36J110M56m87p66m76p7J84N1o00j159q08K77J039R31L96o1l81m62
$$ 141041 141477 142587 143043 142556 141790 141314 141237 141421 141472 140872 139713 138905 139182 140221 141152 141548 141487 141106 140644
54287A40644p5N55Q72Q09P39O98M00m1j82k0J01K19N87R59Q90N56M03K44l07q16
$$ 140644 140569 141124 141996 142805 143544 144242 144642 144601 144419 144399 144500 144719 145306 146265 147155 147711 148114 148358 148051 147235
54267A47235n72R6K47q1%O91J345J783K401K939K591J523R25J252J638J367P21
$$ 147235 146663 146759 147006 146925 146925 147616 148961 150744 153145 156084 158675 160198 161123 162375 164013 165380 166101
54250A66101J22m19p12m25N2j06p87j022o77p19j550k313k331j986j690j132j86
$$ 166101 166223 165804 165092 164667 164719 164613 163826 162804 162127 161408 159858 157545 155214 153228 151538 150406 150220
54233A50220N44O01K99k6m25p06l65M60R20O79L25K36P3k92m05j71j81o73j096
$$ 150220 150764 151365 151664 151638 151213 150507 150142 150602 151522 152201 152526 152762 152835 152543 152138 151967 151786 151113 150017
54214A50017j049p31k15O73J508J444N70j5J17J54l90p68k73O12J011O86j49j215
$$ 150017 148968 148237 148022 148695 150203 151647 152217 152202 152319 152473 152083 151315 151042 151654 152665 153351 153202 151987
54196A51987j908j611o50j05k60l10J64N53M72M63Q52J051O70L48P75J649K216
$$ 151987 150079 148468 147818 147713 147453 147143 147307 147860 148332 148795 149647 150698 151368 151716 152491 154140 156356
54179A56356K174J633R03M99O12N44m03j490j384l26L0q55j678j524j039q32m24
$$ 156356 158530 160163 161066 161565 162177 162721 162318 160828 159444 159118 159148 158293 156615 155091 154052 153220 152796
54162A52796K85K37r17j699q61O82J238O31j41n94q26p17k38L0l46q74q69l95
$$ 152796 153081 153318 152401 150702 149841 150523 151761 152392 152251 151657 150831 150114 149876 149906 149560 148686 147817 147422
54144A47422R7M05L47k31p53l11P91J038n9j053o70M62J143J360J596J580R78
$$ 147422 147519 147924 148271 148040 147287 146976 147767 148805 148746 147693 147023 147485 148628 149988 151584 153164 154142
54127A54142L58K86L00p5k62K53O58l1j254j605p05O77J849K549K610K192J873
$$ 154142 154500 154786 155086 155011 154749 155002 155660 155629 154375 152770 152065 152742 154591 157140 159750 161942 163815
54110A63815J835J604J158J304K262K955K569J794J509J348O67j30m48o64j253
$$ 163815 165650 167254 168412 169716 171978 174933 177502 179296 180805 182153 182820 182690 182242 181578 180325
54095A80325j677j409j114j521k030j750j057p37m59M22J321J327Q79R95J312
$$ 180325 178648 177239 176125 174604 172574 170824 169767 169030 168571 168993 170314 171641 172520 173515 174827
54080A74827N98j147k598k901k247r54O59J821J982J760K067K684K765K260J703
$$ 174827 175425 174278 171680 168779 166532 165578 166237 168058 170040 171800 173867 176551 179316 181576 183279
54065A83279J126L99J08P07J346R36j11o23o12q94j233o35O30J097L04n97o54
$$ 183279 184405 184804 184912 185619 186965 187901 187790 187167 186555 185661 184428 183793 184423 185520 185824 185227 184573
54048A84573j20N70J516K671L545L963M217M382M311M312M886N751O047N575N027
$$ 184573 184453 185023 186539 189210 192755 196718 200935 205317 209628 213940 218826 224577 230624 236199 241226
54033B41226M983N404N959O152N395L732K257J977K545K870K552J897J020m5p60
$$ 241226 246209 251613 257572 263724 269119 272851 275108 277085 279630 282500 285052 286949 287969 287924 287164
54018B87164o53j27J26Pm44j616l444m794m962m903n593o155n300l759l314m016
$$ 287164 286511 286384 286510 286517 286073 284457 281013 276219 271257 266354 260761 254606 249306 245547 242233 238217
54002B38217m375l922l501l283k657k016k455l497l307j531J06M29J07k05r16
$$ 238217 233842 229920 226419 223136 220479 218463 216008 212511 209204 207673 207779 208208 208315 208110 207194
53987B07194k026k471j884j328j406j273m00L10J40j60J53M63J29j48M70J459
$$ 207194 205168 202697 200813 199485 198079 196806 196406 196716 196856 196696 196849 197312 197441 197293 197763 199222
53971A99222J883J882K047K154J879J974L413N742P512Q023P639O585M584J689
$$ 199222 201105 202987 205034 207188 209067 211041 214454 220196 227708 235731 243370 249955 254539 256228
53957B56228j315l545m611m573l776k792k148j987j999j626n22J023K194K516
$$ 256228 254913 251368 246757 242184 238408 235616 233468 231481 229482 227856 227334 228357 230551 233067
53943B33067K372K347K427K458K907M237N753O170N336M364L910L438K448J477
$$ 233067 235439 237786 240213 242671 245578 249815 255568 261738 267074 271438 275348 278786 281234 282711
53929B82711J306J854K364K216J393N76P36K083L596M223M297M850N884O491O527
$$ 282711 284017 285871 288235 290451 291844 292420 293156 295239 298835 303058 307355 312205 318089 324580 331107
53914C31107O765P322P356O643O020N834N275L877K420J616J018M4r48j434j688
$$ 331107 337872 345194 352550 359193 365213 371047 376322 380199 382619 384235 385253 385297 384349 382915 381227
53899C81227k189k779l193l650m294m739m830n152o070o989p246p097p105p133
$$ 381227 379038 376259 373066 369416 365122 360383 355553 350401 344331 337342 330096 322999 315894 308761
53885C08761o729n975n303m921m904n304n696n229l760k325j896k224k504k554
$$ 308761 302032 296057 290754 285833 280929 275625 269929 264700 260940 258615 256719 254495 251991 249437
53871B49437k626k659k489k377k647l065l250l223l114k633j598n61k64p32j498
$$ 249437 246811 244152 241663 239286 236639 233574 230324 227101 223987 221354 219756 219195 218931 218199 216701
53856B16701k363l289l799l275j838l97K60P3n09r73j012o15k3M76O98N88L30
$$ 216701 214338 211049 207250 203975 202137 201740 202000 202073 201564 200591 199579 198964 198941 199417 200115 200703 201033
53839B01033L69Q95J385J090J7r99j262q29j01O02R63P59K07j60j06J76N11P77
$$ 201033 201402 202297 203682 204772 204789 203790 202528 201699 201598 202200 203163 203922 204129 203969 203863 204039 204550 205327
53821B05327O91J30l70j90L70N03K44L78R75J159P04O58J795L385M218M135L847
$$ 205327 206018 206148 205778 205588 205958 206461 206705 207083 208058 209217 209921 210579 212374 215759 219977 224112 227959
53804B27959L887M331N036N585N507M940M605M731M734M229L636L323K996K489
$$ 227959 231846 236177 241213 246798 252305 257245 261850 266581 271315 275544 279180 282503 285499 287988
53790B87988K332K849L377L154K434J903J536Q16l23j484k458l290l940m423m978
$$ 287988 290320 293169 296546 299700 302134 304037 305573 306389 306066 304582 302124 298834 294894 290471 285493
53775B85493n601n766n138m223l786l937m259m490m639m642m357l757k875j859
$$ 285493 279892 274126 268988 264765 260979 257042 252783 248293 243654 239012 234655 230898 228023 226164
53761B26164j148j170j654j879j728j844k414k649k024j225j184j751k076j817
$$ 226164 225016 223846 222192 220313 218585 216741 214327 211678 209654 208429 207245 205494 203418 201601
53747B01601j241n26K87R26J178J309J667J972J592L71j164k275k434j525m7J163
$$ 201601 200360 199834 200121 201047 202225 203534 205201 207173 208765 209136 207972 205697 203263 201738 201691 202854
53731B02854J657J631J341P72P4k38M2M56N61N85R77J735K521L091L294L061K675
$$ 202854 204511 206142 207483 208255 208329 208091 208133 208589 209150 209735 210712 212447 214968 218059 221353 224414 227089
53714B27089K619K824K577J458mr20q25K98K113L809M444L835K679J696J238J706
$$ 227089 229708 232532 235109 236567 236563 235643 234818 235116 237229 241038 245482 249317 251996 253692 254930 256636
53698B56636L333N333O243N627M482L596K602J242L15M42Q44M36o11j360j473
$$ 256636 259969 265302 271545 277172 281654 285250 287852 289094 289409 289851 290695 291131 290520 289160 287687
53683B87687j174n29K21K85o51j573j406n59j57k79j92N8k75j112j410p02K53
$$ 287687 286513 285984 286205 286490 285839 284266 282860 282301 282144 281865 281673 281731 281456 280344 278934 278232 278485
53666B78485O08L92J16K6k3l74j177j911j681l90Q31J015O75R11J695K046J554
$$ 278485 279093 279485 279601 279627 279604 279230 278053 276142 274461 274071 274902 275917 276592 277503 279198 281244 282798
53649B82798P44O9l72k80N97J592J541L71o54m91N74J666K410K837K849K334J583
$$ 282798 283542 283611 283239 282959 283556 285148 286689 287060 286406 285915 286489 288155 290565 293402 296251 298585 300168
53632C00168J184J520K429L297L550L219K872K883K982K844K636K648K728K593
$$ 300168 301352 302872 305301 308598 312148 315367 318239 321122 324104 326948 329584 332232 334960 337553
53618C37553K416K526K750K618K163J955K415L440M607N359N208M253L302L097
$$ 337553 339969 342495 345245 347863 350026 351981 354396 357836 362443 367802 373010 377263 380565 383662
53604C83662L489L752L456K670J559L56n04o54k07M42J017J294R51l5j045j359
$$ 383662 387151 390903 394359 397029 398588 398944 398440 397786 397579 398021 399038 400332 401283 401248 400203 398844
53588C98844r40l66j66m50r73j311j234j113j529k298k477j703q68r46j769k552
$$ 398844 397904 397538 397372 396922 395949 394638 393404 392291 390762 388464 385987 384284 383416 382470 380701 378149
53572C78149l044l380l306k481j309o27o36p63o32m79o10q61p70q6Q47J241O47
$$ 378149 375105 371725 368419 365938 364629 364002 363366 362603 361971 361492 360882 360021 359251 359165 360012 361253 361900
53555C61900l26o25j12K51k18j017j261p37J88J077J502J282R75J381K284K632
$$ 361900 361574 360949 360837 361088 360870 359853 358592 357855 358043 359120 360622 361904 362879 364260 366544 369176
53539C69176K289K479L867N431O042O013O039N822M994M420N118O614P676Q177
$$ 369176 371465 373944 377811 383242 389284 395297 401336 407158 412152 416572 421690 428304 435980 444157
53525D44157Q841R753J0413J0890J1565J2154J2196J2105J2538J3168J3421J3849
$$ 444157 452998 462751 473164 484054 495619 507773 519969 532074 544612 557780 571201 585050
53513E85050J5385J7582J9157J9942K0804K1859K2427K2609K3291K4438K4894
$$ 585050 600435 618017 637174 657116 677920 699779 722206 744815 768106 792544 817438
53502H17438K4163K2983K1996K1086K0247J9742J9197J7846J5923J4628J4473
$$ 817438 841601 864584 886580 907666 927913 947655 966852 984698 1000621 1015249 1029722
53491A029722J4814J5172J5693J6219J6215J5952J6338J7271J7540J6767J6076
$$ 1029722 1044536 1059708 1075401 1091620 1107835 1123787 1140125 1157396 1174936 1191703 1207779
53480A207779J6231J6469J5932J5066J4678J4560J3926J2491J0408P796M959K462
$$ 1207779 1224010 1240479 1256411 1271477 1286155 1300715 1314641 1327132 1337540 1345336 1350295 1352757
53468A352757M21j739m427p310r843j1737j2678j2417j1520j1188j1915j2932
$$ 1352757 1353178 1351439 1347012 1339702 1329859 1318122 1305444 1293027 1281507 1270319 1258404 1245472
53456A245472j3405j3477j3760j4446j5377j6423j7357j7836j7800j7572j7414
$$ 1245472 1232067 1218590 1204830 1190384 1175007 1158584 1141227 1123391 1105591 1088019 1070605
53445A070605j7373j7467j7545j7072j5727j3991j2438j0703q103n049k717j358
$$ 1070605 1053232 1035765 1018220 1001148 985421 971430 958992 948289 940186 935137 932420 931062
53433I31062j88J045J666J438J076J070J171J410K455M396O274P419Q294R554
$$ 931062 930874 931919 933585 935023 936099 937169 938340 939750 942205 946601 952875 960294 968588 978142
53419I78142J1103J2616J4129J5638J6906J8034J9471K1141K2410K3149K3937
$$ 978142 989245 1001861 1015990 1031628 1048534 1066568 1086039 1107180 1129590 1152739 1176676
53408A176676K5013K6020K7003K8492L0301L1489L1915L2692L4563L6974L9254
$$ 1176676 1201689 1227709 1254712 1283204 1313505 1344994 1376909 1409601 1444164 1481138 1520392
53397A520392M1489M3685M5286M6255M7410M9007N0112N0139M9911N0308N0943
$$ 1520392 1561881 1605566 1650852 1697107 1744517 1793524 1843636 1893775 1943686 1993994 2044937
53386B044937N0993N0325M9041M6927M4278M2174M0990L9582L6875L3273K9588
$$ 2044937 2095930 2146255 2195296 2242223 2286501 2328675 2369665 2409247 2446122 2479395 2508983
53375B508983K5709K1374J7201J3676J0058N485L60m553r503j5006k0578k5598
$$ 2508983 2534692 2556066 2573267 2586943 2597001 2602486 2602846 2598293 2588790 2573784 2553206 2527608
53363B527608l0629l6287m1526m4649m5618m5835m5980m5647m4863m4339m4089
$$ 2527608 2496979 2460692 2419166 2374517 2328899 2283064 2237084 2191437 2146574 2102235 2058146
53352B058146m3270m1537l9426l7262l4888l2657l1540l1889l2967l3921l4462
$$ 2058146 2014876 1973339 1933913 1896651 1861763 1829106 1797566 1765677 1732710 1698789 1664327
53341A664327l4452l3663l2215l0498k8603k6400k4196k2556k1427k0156j8439
$$ 1664327 1629875 1596212 1563997 1533499 1504896 1478496 1454300 1431744 1410317 1390161 1371722
53330A371722j6565j4642j2449j0272r131r759j1727j3893j5409j6133j6321j6176
$$ 1371722 1355157 1340515 1328066 1317794 1308663 1298904 1287177 1273284 1257875 1241742 1225421 1209245
53318A209245j5720j4982j4217j3627j2918j1620r924q535p474n895l550j598
$$ 1209245 1193525 1178543 1164326 1150699 1137781 1126161 1116237 1107702 1100228 1094333 1090783 1089185
53306A089185j124j532j309Q5K015L974N993P950R468J0583J1774J3262J4942
$$ 1089185 1088061 1086529 1085220 1085305 1087320 1091294 1097287 1105237 1114705 1125288 1137062 1150324 1165266
53293A165266J6838J9010K1110K2711K3929K5028K5549K4670K2509K0228J8689
$$ 1165266 1182104 1201114 1222224 1244935 1268864 1293892 1319441 1344111 1366620 1386848 1405537
53282A405537J7570J6062J3959J1796J0144Q885P151M164K79l244n679p549r523
$$ 1405537 1423107 1439169 1453128 1464924 1475068 1483953 1491104 1495268 1495547 1492303 1486624 1479075 1469552
53269A469552j1402j2828j4318j6561j9098k0815k1493k1918k2508k2890k2833
$$ 1469552 1458150 1445322 1431004 1414443 1395345 1374530 1353037 1331119 1308611 1285721 1262888
53258A262888k2659k2578k2452k2412k2895k3854k4555k4458k3699k2669k1651
$$ 1262888 1240229 1217651 1195199 1172787 1149892 1126038 1101483 1077025 1053326 1030657 1009006
53247A009006k0998k0995k1316k1273k0709k0198k0120k0142j9771j8968j7951
$$ 1009006 988008 967013 945697 924424 903715 883517 863397 843255 823484 804516 786565
53236G86565j6866j5867j5154j4709j4245j3508j2387j0803q891p241o415o202
$$ 786565 769699 753832 738678 723969 709724 696216 683829 673026 664135 656894 650479 644277
53224F44277n843n178n039o271q642j1050j2593j3266j3674j4274j4938j5249
$$ 644277 638434 633256 628217 621946 613304 602254 589661 576395 562721 548447 533509 518260
53212E18260j5144j4887j4440j3292j1233q906p181o307o079o416p186p787p687
$$ 518260 503116 488229 473789 460497 449264 440358 433177 426870 420791 414375 407189 399402 391715
53199C91715p278p485q460r272r043p955o920o595o864p045o647n981n830o326
$$ 391715 384437 376952 368492 359220 350177 342222 335302 328707 321843 314798 308151 302170 296340 290014
53185B90014o560n685m043k666j980j674j563j740j923j495l87O50R20M95j17
$$ 290014 283454 277769 273726 271060 269080 267406 265843 264103 262180 260685 260298 260948 261868 262363 262246
53170B62246n94r28j286j776k161j937j043l17o16j573j930j161q7K90Pk71k39
$$ 262246 261652 260724 259438 257662 255501 253564 252521 252204 251588 250015 248085 246924 246837 247127 247134 246863 246624
53153B46624j29j00N8O06J374J691Q92q64k442k734j831p89l38k00J21N19O09
$$ 246624 246495 246395 246453 247059 248433 250124 251016 250152 247710 244976 243145 242356 242018 241818 241939 242458 243067
53136B43067M81O31J146J467J111L83P7N16J190J434J226J018R29N88j56p48m62
$$ 243067 243548 244179 245325 246792 247903 248286 248363 248879 250069 251503 252729 253747 254676 255264 255108 254360 253898
53119B53898P43K209L262L753L854L625K988K112J512J451J376M85j072k236k567
$$ 253898 254641 256850 260112 263865 267719 271344 274332 276444 277956 279407 280783 281268 280196 277960 275393
53104B75393k889l858m707m426l457k940k735j758j33O84J82n47q22j447k885
$$ 275393 272504 268646 263939 259513 256056 253116 250381 248623 248490 249174 249356 248809 247987 246540 243655
53089B43655l977l605k388j565j209p54l02j51R5O99Q42j55j354j329k40O01P54
$$ 243655 239678 236073 233685 232120 230911 230157 229855 229704 229799 230498 231340 231185 229831 228502 228262 228863 229617
53072B29617P78O97j00j493k500k649k297j655o21L68N37rl19k3J77l01j074j359
$$ 229617 230395 231092 230992 229499 226999 224350 222053 220398 219777 220145 220682 220673 220354 220331 220508 220207 219133 217774
53054B17774p82M27J532J724R91L59O18J162R23k2p09p84p14p22o56o43q69r17
$$ 217774 216992 217419 218951 220675 221666 222025 222643 223805 224728 224706 223997 223213 222499 221777 221121 220478 219609 218692
53036B18692l91J08j92p66n34J92O1j002j470n57O49R60O36N08O63P50P43P75
$$ 218692 218301 218409 218217 217451 216917 217109 217170 216168 214698 214141 214790 215750 216386 216894 217557 218307 219050 219825
53018B19825Q22R57J344J771J845J659J520J130M9j150j421r18p56j021n82P59
$$ 219825 220647 221604 222948 224719 226564 228223 229743 230873 230922 229772 228351 227433 226677 225656 225074 225833
53002B25833J601J085K51K77P59P63M61N23P91P12M60N00O44M43J23K25P15J167
$$ 225833 227434 228519 228770 229047 229806 230569 231030 231553 232344 233056 233516 234016 234660 235103 235226 235451 236166 237333
52984B37333J465J644J481R88Q27J500K452K677J971R43P5o33j244j647j706j323
$$ 237333 238798 240442 241923 242911 243738 245238 247690 250367 252338 253281 253356 252723 251479 249832 248126 246803
52968B46803n52K11M78K68J06K47M16M74P19J204J401R59K68j57l65o23r21j199
$$ 246803 246251 246462 246940 247208 247314 247561 247977 248451 249170 250374 251775 252734 253002 252845 252480 251857 250936 249737
52950B49737j594k023k010j403q46j018j760k301k155j395m31K43L57J42P1K31
$$ 249737 248143 246120 244110 242707 241861 240843 239083 236782 234627 233232 232801 233044 233401 233543 233614 233845
52934B33845L52M50Q86J641K167K096J617Q96q9j013j202n38K36M47J96o8j35
$$ 233845 234197 234647 235533 237174 239341 241437 243054 243950 243861 242848 241646 241108 241344 241791 241987 241919 241784
52917B41784L5L41L77j37o53l08P05J220P45P2j17j99o99j337j654j722j622r90
$$ 241784 241819 242160 242537 242400 241747 241439 242144 243364 244109 244181 244064 243865 243166 241829 240175 238453 236831 235841
52899B35841J86J056R59L61J11L17N81P63R43J095J277J622J771J070k53r78m81
$$ 235841 236027 237083 238042 238403 238514 238831 239412 240175 241118 242213 243490 245112 246883 247953 247700 246722 246241
52882B46241L54M52r5o16r51j131p55L62J526K015K089K375K842L112L198L214
$$ 246241 246595 247047 246952 246336 245385 244254 243499 243861 245387 247402 249491 251866 254708 257820 261018 264232
52866B64232K897K199J726J822J922J525J030P62mj876l989m998m896m611m340
$$ 264232 267129 269328 271054 272876 274798 276323 277353 278115 278111 276235 272246 267248 262352 257741 253401
52851B53401l664k908k866l271k958j751q68j161k000k363k109j758j593j471
$$ 253401 249737 246829 243963 240692 237734 235983 235115 233954 231954 229591 227482 225724 224131 222660
52837B22660j131m90J74L73J4l42j74L17O56Q51J130J220O36m79j420j742j524
$$ 222660 221529 221039 221213 221586 221600 221258 221084 221401 222057 222908 224038 225258 225894 225415 223995 222253 220729
52820B20729j002m76k91m79n66k69j1j81l30K56J475K548K955K633J567m2j505
$$ 220729 219727 219251 218960 218481 217915 217646 217635 217454 217124 217380 218855 221403 224358 226991 228558 228516 227011
52803B27011k248k488k738k941k777k437k352k415k202j675j022j38Q94J312N96
$$ 227011 224763 222275 219537 216596 213819 211382 209030 206615 204413 202738 201716 201578 202472 203784 204380
52788B04380m42n56J86O37L97K47O66J101J000O30M51M40M24M95O91P16L21l58
$$ 204380 203938 203382 203568 204205 204602 204849 205515 206616 207616 208246 208697 209137 209561 210056 210747 211463 211784 211426
52770B11426r04r31l18N43R03L99n29j291j799k077j733n69O94J114P84N16N99
$$ 211426 210522 209591 209273 209816 210719 211118 210589 209298 207499 205422 203689 203120 203814 204928 205712 206228 206827
52753B06827O59O24Q50J329J614J612J732K167K666L072L396L394K791J903J389
$$ 206827 207486 208110 208960 210289 211903 213515 215247 217414 220080 223152 226548 229942 232733 234636 236025
52738B36025J317J143O03n9o30j115j329j067o14m76n93m80m4L41N04M92P5r22
$$ 236025 237342 238485 239088 239029 238399 237284 235955 234888 234274 233798 233205 232725 232681 233022 233526 234018 234093 233171
52720B33171j917j992j132k49L7r7l16m76l15L26R13O53l24j048j045p76o49m33
$$ 233171 231254 229262 228130 227881 227918 227821 227505 227029 226714 227040 227953 228606 228282 227234 226189 225413 224764 224331
52702B24331K1L73M05M37P56J196J426J238N28m96j129r08m16n37j030q26K19
$$ 224331 224352 224725 225130 225567 226323 227519 228945 230183 230711 230215 229086 228178 227762 227225 226195 225369 225588
52685B25588J026R38N98O53O81P5q14j126o14K89J079J396J056L01k50k23K09
$$ 225588 226614 227552 228150 228803 229484 229559 228745 227619 227005 227294 228373 229769 230825 231126 230876 230653 230862
52668B30862P07J083J196J029R68J391J980K082J716J526J631J469J001J046J962
$$ 230862 231569 232652 233848 234877 235845 237236 239216 241298 243014 244540 246171 247640 248641 249687 251649
52653B51649K844K721J809R44L49l36j200j915k218k068j539r05n74o50p59o09
$$ 251649 254493 257214 259023 259967 260316 259980 258780 256865 254647 252579 251040 250135 249561 248911 248152 247543
52637B47543l64l09m45o04o16k53O22J695K440K841L294L701L327J924L41n23
$$ 247543 247179 246870 246425 245821 245205 244952 245574 247269 249709 252550 255844 259545 262872 264796 265137 264614
52621B64614q31j319k050k384j975j275r25j015j126q95l82R1L54M75M82L10J33
$$ 264614 263783 262464 260414 258030 256055 254780 253855 252840 251714 250819 250437 250528 250882 251357 251839 252149 252282
52604B52282L52R89J509J628J812K373K625J726P9j008r87m84j47J7J42J49P3
$$ 252282 252634 253623 255132 256760 258572 260945 263570 265296 265375 264367 263380 262896 262749 262766 262908 263057 263130
52587B63130M5o1l31k13Q96K524L493L508L350L385K988J848P11K63J09m82j378
$$ 263130 263175 263114 262783 262570 263466 265990 269483 272991 276341 279726 282714 284562 285273 285536 285645 285163 283785
52570B83785j806j369m84l3o79k103l006k492j309q53j169j072k30K70k13q60
$$ 283785 281979 280610 280126 280093 279414 277311 274305 271813 270504 269651 268482 267410 267180 267450 267237 266377
52554B66377q74p09j017j410j251q01o61p58o92m90l01J04P64J094P51L20M32
$$ 266377 265503 264794 263777 262367 261116 260315 259654 258896 258204 257714 257413 257517 258281 259375 260126 260446 260878
52537B60878P48O11J83J60P15J420J882J927J544J055R20R75M86n96j222o31N56
$$ 260878 261626 262237 262420 262580 263295 264715 266597 268524 270068 271123 272043 273018 273504 272908 271686 271055 271611
52520B71611J297J426J303R46L59J14O44J455J836J887K103K493K882L446M044
$$ 271611 272908 274334 275637 276583 276942 277056 277700 279155 280991 282878 284981 287474 290356 293802 297846
52505B97846L738J979k37j539j999k628l544l932l573l127k893k513j969j743
$$ 297846 301584 303563 303326 301787 299788 297160 293616 289684 286111 282984 280091 277578 275609 273866
52491B73866j816j576q56j80J96N23O66L2j233j904j106N67J828K061J532P70
$$ 273866 272050 270474 269618 269438 269634 270157 270823 270855 269622 267718 266612 267179 269007 271068 272600 273370
52475B73370J96k2j37n12r69q09K04J380J974K147K616L549M290M262L677L200
$$ 273370 273566 273544 273407 272895 271926 271117 271321 272701 274675 276822 279438 282987 287277 291539 295216 298416
52459B98416L031K672J588p8j628k562k977l260l613l899l792l124k263j949k429
$$ 298416 301447 304119 305707 305629 304001 301439 298462 295202 291589 287690 283898 280774 278511 276562 274133
52444B74133k989k840k226j990k132j803q19j36l62p77n35jNl56k19O31J498J737
$$ 274133 271144 268304 266078 264088 261956 260153 259334 259198 258836 258059 257524 257523 257528 257172 256953 257584 259082 260819
52426B60819J283M32k95k85N56J497J828J720J761J966J933J673J562J659J690
$$ 260819 262102 262534 262239 261954 262510 264007 265835 267555 269316 271282 273215 274888 276450 278109 279799
52411B79799J677J942K579L448M594O141P832R182R956J0090R273P129L784j25
$$ 279799 281476 283418 285997 289445 294039 300180 308012 317194 327150 337240 346513 353642 357426 357301
52397C57301l816o494p550p111o132n461n046m463l747l113k318j047L23J046
$$ 357301 353485 346991 339441 332330 326198 320737 315691 311228 307481 304368 302050 301003 301326 302372
52383C02372R35M17o7j50N62J937L034L162K925L348M291M763M645M854N729O308
$$ 302372 303307 303724 303657 303507 304069 306006 309040 312202 315127 318475 322766 327529 332174 337028 342757 349065
52367C49065N668M060K280P00o05j382j442j086q22q14q37o05q2L89L22l16q48
$$ 349065 354733 358793 361073 361773 361168 359786 358344 357258 356436 355622 354785 354180 354098 354487 354809 354493 353645
52350C53645o02K13P93Q12P64J203K069K904L379L546L751M329N235O107O765
$$ 353645 353043 353256 354049 354861 355625 356828 358897 361801 365180 368726 372477 376806 382041 388148 394913
52335C94913P345P857Q074Q165Q840J0359J1975J3028J4010J5735J7898J9466
$$ 394913 402258 410115 418189 426354 435194 445553 457528 470556 484566 500301 518199 537665
52323E37665K0235K0972K1962K2517K2108K1189K0545K0439K0675K0968K1077
$$ 537665 557900 578872 600834 623351 645459 666648 687193 707632 728307 749275 770352
52312G70352K0942K0855K1131K1634K1946K1904K1559K0822J9666J8413J7292
$$ 770352 791294 812149 833280 854914 876860 898764 920323 941145 960811 979224 996516
52301I96516J6024J4390J2915J2133J1503R945P257M150J015k244n247p185q077
$$ 996516 1012540 1026930 1039845 1051978 1063481 1073426 1080683 1084833 1085848 1083604 1078357 1071172 1063095
52288A063095q863r979j0827j1020j1079j1409j1476j0725r424p930n859k867
$$ 1063095 1054232 1044253 1033426 1022406 1011327 999918 988442 977717 968293 960363 954504 951637
52276I51637L25K638M074N585P626R611J0946J1887J3040J4412J5389J5622J5541
$$ 951637 951962 954600 958674 964259 971885 981496 992442 1004329 1017369 1031781 1047170 1062792 1078333
52263A078333J5736J6111J6090J5643J5510J6125J6909J7055J6537J5797J4890
$$ 1078333 1094069 1110180 1126270 1141913 1157423 1173548 1190457 1207512 1224049 1239846 1254736
52252A254736J3681J2450J1495J0277P896M337M41l227o663r647j1691j2941j4182
$$ 1254736 1268417 1280867 1292362 1302639 1310535 1314872 1315313 1312086 1305423 1295776 1284085 1271144 1256962
52239A256962j5721j6997j7522j7455j7049j6365j5770j5810j6221j5904j4329
$$ 1256962 1241241 1224244 1206722 1189267 1172218 1155853 1140083 1124273 1108052 1092148 1077819
52228A077819j2330j0947j0163r326q240p261o687o502o409n832m291k147m89
$$ 1077819 1065489 1054542 1044379 1035053 1026813 1019552 1012865 1006363 999954 994122 989831 987684 987195
52215I87195J04K95J121K750M460N518N795N706N737N904N642M601L431L207M080
$$ 987195 987299 987594 988715 991465 995925 1001443 1007238 1012944 1018681 1024585 1030227 1034828 1038259 1041466 1045546
52200A045546N084N447N336N208N215N526O469P852Q759Q529P489O305N150L895
$$ 1045546 1050630 1056077 1061413 1066621 1071836 1077362 1083831 1091683 1100442 1108971 1116460 1122765 1127915 1131810
52186A131810K590J208n62k772m878o416p645r008j0317j0952j0669r749q632
$$ 1131810 1134400 1135608 1135046 1132274 1127396 1120980 1113335 1104327 1094010 1083058 1072389 1062640 1054008
52173A054008p680p109o739o091m973l724k642j607m81N54J392K269L306M154
$$ 1054008 1046328 1039219 1032480 1026389 1021416 1017692 1015050 1013443 1012962 1013516 1014908 1017177 1020483 1024637
52159A024637M519M591M538M016K741J236L78L08L04k98j371k207k194j310n5
$$ 1024637 1029156 1033747 1038285 1042301 1045042 1046278 1046656 1046964 1047268 1046970 1045599 1043392 1041198 1039888 1039833
52144A039833J094K122L200M103M363L978L518L416L620M018M681N534O394P515
$$ 1039833 1040927 1043049 1046249 1050352 1054715 1058693 1062211 1065627 1069247 1073265 1077946 1083480 1089874 1097389
52130A097389R513J2464J5621J8332K0693K2981K5049K6723K8190K9576L0594
$$ 1097389 1106902 1119366 1134987 1153319 1174012 1196993 1222042 1248765 1276955 1306531 1337125
52119A337125L1058L1249L1320L0860K9571K7829K6059K4031K1440J8761J6723
$$ 1337125 1368183 1399432 1430752 1461612 1491183 1519012 1545071 1569102 1590542 1609303 1626026
52108A626026J5217J3423J0919Q115N735M297L909M022L639K182N8k090m350p244
$$ 1626026 1641243 1654666 1665585 1673700 1679435 1683732 1687641 1691663 1695302 1697484 1697542 1695452 1691102 1683858
52094A683858j0658j3894j6630j9233k1965k4447k6041k6411k5546k3599k0843
$$ 1683858 1673200 1659306 1642676 1623443 1601478 1577031 1550990 1524579 1499033 1475434 1454591
52083A454591j7681j4540j1817r765q264o881n300l526j552Q66L864P116J0070
$$ 1454591 1436910 1422370 1410553 1400788 1392524 1385643 1380343 1376817 1375265 1376131 1379995 1387111 1397181
52070A397181J2436J4172J5337J6154J7022J8092J9029J9480J9498J9265J8734
$$ 1397181 1409617 1423789 1439126 1455280 1472302 1490394 1509423 1528903 1548401 1567666 1586400
52059A586400J7907J7132J6666J6092J4693J2391R792P359M927K160r48m234p780
$$ 1586400 1604307 1621439 1638105 1654197 1668890 1681281 1691073 1698432 1703359 1705519 1704571 1700337 1692557
$$ [...]
##END NTUPLES=NMR SPECTRUM
##END=
