##TITLE=AC1688_PANAH14369_8637421_liXURSuNMN
##JCAMPDX= 6.0         $$ Bruker NMR JCAMP-DX V2.0
##DATA TYPE= NMR SPECTRUM
##DATA CLASS= NTUPLES
##ORIGIN= BRUKER
##OWNER= Administrator
$$ 1.72 TOPSPIN		Version 2.1
$$ 2014-05-31 01:52:04.728 -0700  Administrator@X
$$ Compression mode = diff/dup
##.OBSERVE FREQUENCY= 400.02188249412
##.OBSERVE NUCLEUS= ^1H
##.ACQUISITION MODE= SIMULTANEOUS (DQD)
##.ACQUISITION SCHEME= undefined
##.AVERAGES= 8
##.DIGITISER RES= 22
##SPECTROMETER/DATA SYSTEM= spect
##.PULSE SEQUENCE= zg30
##.SOLVENT NAME= COFFEE_meoh
##.SHIFT REFERENCE= INTERNAL, COFFEE_meoh, 1, 14.98509
##AUDIT TRAIL= $$ (NUMBER, WHEN, WHO, WHERE, PROCESS, VERSION, WHAT)
$$ ##TITLE= Audit trail, TOPSPIN		Version 2.1
$$ ##JCAMPDX= 5.01
$$ ##ORIGIN= Bruker BioSpin GmbH
$$ ##OWNER= Administrator
$$ $$ E:\/data/COFFEE/nmr/AC1688_PANAH14369_8637421_liXURSuNMN/10/pdata/1/auditp.txt
$$ ##AUDIT TRAIL=  $$ (NUMBER, WHEN, WHO, WHERE, PROCESS, VERSION, WHAT)
(   1,<2014-05-31 01:51:57.541 -0700>,<Administrator>,<X>,<go>,<TOPSPIN 2.1>,
      <created by zg
	started at 2014-05-31 01:50:51.728 -0700,
	POWCHK enabled, PULCHK disabled,
       configuration hash MD5:
       C8 4E 4E 5D D3 5C D8 9E 9F 52 82 E0 59 8A DE 15
       data hash MD5: 64K
       EC 53 4F 66 6A 33 0E 29 77 64 05 D8 D1 D5 1A AB>)
(   2,<2014-05-31 01:52:00.603 -0700>,<Administrator>,<X>,<proc1d>,<TOPSPIN 2.1>,
      <Start of raw data processing
       efp LB = 0 FT_mod = 6 PKNL = 1 PHC0 = 0 PHC1 = 0 SI = 32K 
       data hash MD5: 32K
       20 9E 4C 6D A1 A9 3C 77 5A F1 73 E0 26 C3 00 4A>)
(   3,<2014-05-31 01:52:00.978 -0700>,<Administrator>,<X>,<proc1d>,<TOPSPIN 2.1>,
      <pk PHC0 = 92.50488 PHC1 = 0 
       data hash MD5: 32K
       28 1E A4 5D 68 13 E2 C6 A9 73 6F 91 5D 2F 9B 98>)
(   4,<2014-05-31 01:52:01.134 -0700>,<Administrator>,<X>,<proc1d>,<TOPSPIN 2.1>,
      <abs ABSG = 1 
       data hash MD5: 32K
       24 F3 86 61 AC BE C5 A1 1F 2E D1 00 B2 C4 E6 6A>)
(   5,<2014-05-31 01:52:01.228 -0700>,<Administrator>,<X>,<proc1d>,<TOPSPIN 2.1>,
      <abs ABSG = 2 
       data hash MD5: 32K
       08 AD 42 DC C6 41 4D 02 A7 88 A4 2D D9 85 F0 EF>)
(   6,<2014-05-31 01:52:01.291 -0700>,<Administrator>,<X>,<proc1d>,<TOPSPIN 2.1>,
      <abs ABSG = 3 
       data hash MD5: 32K
       23 8E 82 88 B7 74 9B C2 C2 B1 98 4C 46 C5 90 47>)
(   7,<2014-05-31 01:52:01.369 -0700>,<Administrator>,<X>,<proc1d>,<TOPSPIN 2.1>,
      <abs ABSG = 4 
       data hash MD5: 32K
       97 5B 83 04 55 CC ED 6E C4 55 AC 30 BE AB CD 8B>)
(   8,<2014-05-31 01:52:01.431 -0700>,<Administrator>,<X>,<proc1d>,<TOPSPIN 2.1>,
      <abs ABSG = 5 
       data hash MD5: 32K
       28 7A BD 96 FE F3 4D 3E 7E 7F 3C 0F DE 80 5D B5>)
$$ ##END=
$$ 
$$ $$ hash MD5
$$ $$ 2C 01 4A 1E AB 79 BF 25 82 67 28 19 B3 EB 08 5A
##$RELAX= 
##$RELAX= 
##$RELAX= 
##$RELAX= 
##$RELAX= 
##$RELAX= 
##$RELAX= 
$$ Bruker specific parameters
$$ --------------------------
##$DU= <E:\>
##$EXPNO= 10
##$NAME= <AC1688_PANAH14369_8637421_liXURSuNMN>
$$ [...]
150 150 150 150 150 150 150 150
##$TP07= 0
##$TPNAME0= <>
##$TPNAME1= <>
##$TPNAME2= <>
##$TPNAME3= <>
##$TPNAME4= <>
##$TPNAME5= <>
##$TPNAME6= <>
##$TPNAME7= <>
##$TPOAL= (0..7)
0.5 0.5 0.5 0.5 0.5 0.5 0.5 0.5
##$TPOFFS= (0..7)
0 0 0 0 0 0 0 0
##$TUNHIN= 0
##$TUNHOUT= 0
##$TUNXOUT= 0
##$USERA1= <user>
##$USERA2= <user>
##$USERA3= <user>
##$USERA4= <user>
##$USERA5= <user>
##$V9= 5
##$VALIST= <valist>
##$VCLIST= <CCCCCCCCCCCCCCC>
##$VD= 0
##$VDLIST= <DDDDDDDDDDDDDDD>
##$VPLIST= <PPPPPPPPPPPPPPP>
##$VTLIST= <TTTTTTTTTTTTTTT>
##$WBST= 2048
##$WBSW= 25
##$XGAIN= (0..3)
0 0 0 0
##$XL= 0
##$YL= 0
##$YMAX_a= 639107
##$YMIN_a= -543889
##$ZGOPTNS= <>
##$ZL1= 120
##$ZL2= 120
##$ZL3= 120
##$ZL4= 120
##$ABSF1= 14.98509
##$ABSF2= -5.573092
##$ABSG= 5
##$ABSL= 3
##$ALPHA= 0
##$AQORDER= 0
##$ASSFAC= 0
##$ASSFACI= 0
##$ASSFACX= 0
##$ASSWID= 0
##$AUNMP= <proc_prof1d_extract_pilot.lims>
##$AXLEFT= 0
##$AXNAME= <>
##$AXNUC= <1H>
##$AXRIGHT= 0
##$AXTYPE= 0
##$AXUNIT= <>
##$AZFE= 0.1
##$AZFW= 0.1
##$BCFW= 0
##$BC_mod= 0
##$BYTORDP= 0
##$COROFFS= 0
##$CY= 15
##$DATMOD= 1
##$DC= 0
##$DFILT= <>
##$DTYPP= 0
##$F1P= 0
##$F2P= 0
##$FCOR= 0.5
##$FTSIZE= 32768
##$FT_mod= 6
##$GAMMA= 0
##$GB= 0
##$INTBC= 1
##$INTSCL= 1
##$ISEN= 128
##$LB= 0
##$LEV0= 0
##$LPBIN= 0
##$MAXI= 10000
##$MC2= 0
##$MEAN= 0
##$ME_mod= 0
##$MI= 0
##$NCOEF= 0
##$NC_proc= -8
##$NLEV= 6
##$NOISF1= 0
##$NOISF2= 0
##$NSP= 0
##$NTH_PI= 0
##$NZP= 0
##$OFFSET= 14.98509
##$PC= 1
##$PHC0= 92.50488
##$PHC1= 0
##$PH_mod= 1
##$PKNL= yes
##$PPARMOD= 0
##$PPDIAG= 0
##$PPIPTYP= 0
##$PPMPNUM= 2147483647
##$PPRESOL= 1
##$PSCAL= 4
##$PSIGN= 0
##$PYNMP= <proc.py>
##$REVERSE= no
##$SF= 400.02
##$SI= 32768
##$SIGF1= 0
##$SIGF2= 0
##$SINO= 400
##$SIOLD= 32768
##$SPECTYP= <>
##$SREGLST= <1H.CDCl3>
##$SSB= 0
##$STSI= 32768
##$STSR= 0
##$SW_p= 8223.68421052631
##$SYMM= 0
##$S_DEV= 0
##$TDeff= 65536
##$TDoff= 0
##$TI= <>
##$TILT= no
##$TM1= 0
##$TM2= 0
##$TOPLEV= 0
##$USERP1= <user>
##$USERP2= <user>
##$USERP3= <user>
##$USERP4= <user>
##$USERP5= <user>
##$WDW= 1
##$XDIM= 32768
##$YMAX_p= 466913229
##$YMIN_p= -757797
##$CURPLOT= <Network HP LaserJet P1505>
##$CURPRIN= <$Network HP LaserJet P1505>
##$DFORMAT= <normdp>
##$LAYOUT= <+/1D_H.xwp>
##$LFORMAT= <normlp>
##$PFORMAT= <normpl>
##$SURQMSG= 1
$$ End of Bruker specific parameters
$$ ---------------------------------
##NTUPLES= NMR SPECTRUM
##VAR_NAME=  FREQUENCY,     SPECTRUM/REAL,   SPECTRUM/IMAG
##SYMBOL=    X,             R,               I
##VAR_TYPE=  INDEPENDENT,   DEPENDENT,       DEPENDENT
##VAR_FORM=  AFFN,          ASDF,            ASDF
##VAR_DIM=   32768,         32768,           32768
##UNITS=     HZ,            ARBITRARY UNITS, ARBITRARY UNITS
##FACTOR=    0.250966925370066, 1,           1
##FIRST=     8223.43324360094, 13326,        -160979
##LAST=      0,             -99097,          -192557
##MIN=       0,             -757797,         0
##MAX=       8223.43324360094, 466913229,    0
$$ Real data points
##PAGE= N=1
##DATA TABLE= (X++(R..R)), XYDATA
$$ [...]
$$ plain form
19546 -255559 -114011 -704 -2209 92598 -6608 51536 -39248 26838 -227332 -56608 23718 68706
19534 68706 111871 8901 -233370 -305686 -142598 -298874 -149345 -93499 64459 -208526 -250633
19523 -250633 226356 -132509 244460 -385529 -137124 -173680 271537 -494415 -109193 204769
19512 -270590 156628 -387638 -221836 -301075 93324 24417 -71920 48199 -30348 -442185 -231204
19501 -231204 254758 280297 53321 -320231 -164601 77725 -93882 -268344 -108765 -94895
19491 -94895 201890 77124 -157033 -110976 120846 -145560 -14084 -4779 -152215 -94062 -145567
19480 -145567 -273004 -258447 -414151 87260 -66887 -93115 39155 43965 -216006 -145761 161353
19468 -100126 -222372 15935 107161 289561 113700 -158011 46456 -148108 90402 -267334
$$ packed form
19546b55559a14011g04j505I2598f608E1536c9248B6838b27332e6608B3718M4988
19534F8706M3165H901b33370p2316a42598j56276a49345N5846F4459b08526m2107
19523b50633B26356a32509B44460c85529a37124l6556B71537d94415a09193B04769
19512b70590A56628c87638J65802p9239I3324B4417g1920D8199c0348m11837K10981
19501b31204B54758K5539E3321c20231J55630G7725i3882j74462a08765J3870
19491i4895B01890G7124a57033M6057A20846a45560a4084d779j47436N8153n1505
19480a45567j27437J4557j55704H7260f6887k6228C9155M810b16006P0245A61353
19468a00126j22246A5935R1226J82400A13700a58011D6456a48108I0402b67334
$$ plain form
19457 250182 -141610 -130303 -12950 -164455 -30728 337588 70496 -18697 491476 -33742 28784
19445 -5548 -3446 25427 45237 -112458 54285 159997 132673 -218901 217760 155473 -242681
19433 -111816 40506 -32707 -193168 32918 -82988 -113940 15848 -5873 -375242 102739 -359497
19421 -320974 -75416 19181 -295152 183059 157505 3985 125242 216819 -105663 -115996 30355
19409 -292743 -72030 -164622 -319620 -31250 -191697 145910 34296 104622 48776 -47647 -290773
19398 -290773 -204249 86371 -53653 -152307 -80714 -233280 72393 -65678 417371 -303132 -59525
19386 -290798 -503322 85856 -537262 -275050 -231887 -40787 15073 65227 42026 -142095 -90194
19375 -90194 -213030 242153 184435 2061 -75182 -168684 149491 -79076 -130549 -68487 -184394
$$ packed form
19457B50182a41610J1307a2950j51505c0728C37588G0496a8697D91476c3742B8784
19445e548K102B5427J9810a12458E4285J05712k7324b18901B17760o2287b42681
19433a11816D0506c2707j60461C2918h2988l0952A5848e873l69369A02739c59497
19421c20974g5416A9181b95152A83059k5554C985J21257R1577a05663j0333C0355
19409b92743g2030r2592j54998c1250j60447A45910C4296P0326D8776d7647k43126
19398b90773Q6524H6371e3653r8654P1593j52566G2393f5678D17371c03132e9525
19386b90798k12524H5856e37262K62212M3163d0787A5073N0154k3201a42095N1901
19375i0194j22836B42153n7718B061g5182r3502A49491g9076n1473O2062j15907
$$ plain form
19364 -184394 62298 -275697 14463 -105372 213901 -44445 -36389 -204677 -139089 152034 -58569
19352 159315 44409 11078 -222220 -118248 -111653 -220481 -175283 81631 -10894 147156 180115
19341 180115 -84262 -120194 70524 -19223 -45826 -136042 -144607 -231181 -29800 -63444 152098
19329 298 -61405 -94271 143230 161246 -111214 74293 351513 40751 43269 45618 157299 -71127
19316 24858 -27751 -469189 -69378 -183551 -90235 109240 -195956 -207758 -92413 158072 6317
19304 -19954 -98473 -117198 -409105 -222722 -71407 39926 105782 -180325 -309271 -39881 387338
19292 -158543 119002 -244338 -52578 -386553 -143719 -95662 -25231 224279 -431557 -76268
19281 23227 120575 114388 -258113 -50765 62438 -210827 -250912 -81196 -123074 -194023 -100834
$$ packed form
19364a84394F2298b75697A4463a05372B13901d4445Q056j68288O5588A52034e8569
19352A59315D4409A1078b22220J03972O595j08828M5198H1631a0894A47156L2959
19341A80115h4262l5932G0524a9223k6603r0216q565q6574b9800l3644A52098
19329B98f1405l2866A43230J8016a11214G4293K77220D0751K518K349J11681g1127
19316B4858b7751m41438f9378j14173i0235A09240a95956j1802i2413A58072F317
19304a9954p8519j8725k91907J86383g1407C9926O5856a80325j28946c9881C87338
19292a58543A19002b44338e2578l33975a43719M8057b5231B24279d31557g6268
19281B3227R7348o187b58113e0765F2438b10827m0085h1196m1878p0949R3189
$$ plain form
19270 -100834 179755 -192910 -170299 -115487 -37864 142940 -31007 -29473 -102469 -242247 243985
19258 91287 37742 288262 -303956 -13276 -238845 -116629 -234450 83591 -333017 192271
19247 133948 -44435 24355 -198239 -291959 67824 -193578 9084 125058 134352 -157906 63106
19235 -273705 -13774 267709 57649 -13450 -41977 -496561 -56285 110823 52471 -83062 -341152
19224 -341152 -212834 108533 -175236 -279426 229560 -145214 -96860 91172 258315 -64029
19213 29747 55339 14472 204090 -217473 -129828 -278684 -157847 85804 -22672 -59208 41831
19201 249517 29911 -317376 204627 105923 -380436 346190 -256639 -6807 352728 -189739
19190 102453 289564 59041 -179250 91348 -34179 -212929 -93680 415969 277927 -182239
$$ packed form
19270a00834A79755a92910K2611N4812c7864A42940c1007J534p2996j39778B43985
19258I1287C7742K50520c03956a3276k25569a16629j17821H3591c33017A92271
19247A33948d4435B4355a98239r3720F7824a93578I084J15974R294a57906F3106
19235b73705a3774B67709E7649a3450k8527m54584e6285A10823E2471h3062k58090
19224c41152J28318A08533a75236j04190B29560a45214M8354I1172J67143f4029
19213B9747K5592A4472J89618b17473Q7645j48856J20837H5804b2672l6536D1831
19201B49517B9911c17376B04627r8704c80436C46190b56639f807C52728a89739
19190A02453J87111E9041a79250I1348c4179j78750i3680D15969j38042a82239
$$ plain form
19179 283497 -110009 -201233 -144665 17527 -146310 -22710 -284742 103338 -169279 -211339
19169 -211339 -7648 -208603 158237 149349 22636 -98549 -129888 -199065 101340 -391179 -237249
19158 -237249 -17861 -175849 -138587 9093 69585 254092 161920 -167190 132486 70547 296092
19147 296092 -93339 -58027 -218371 76597 -355861 -276365 113078 239222 38996 -248672
19136 180362 -117004 65582 -4946 -201555 43981 -341915 -187733 112366 193707 -386267
19125 -226973 -96674 -247229 -314627 209222 195564 -350586 265260 159263 -43309 368633
19114 -336344 -345430 -265136 -21191 -50986 66950 305930 52182 -285718 325413 -41722 58567
19102 -83695 -143188 -184344 -289498 7250 -81554 85838 -144424 288310 -336462 -609432 35643
$$ packed form
19179B83497a10009r1224N6568A7527a46310b2710k62032A03338a69279m2060
19169b11339g648k00955A58237q888B2636i8549l1339o9177A01340c91179J53930
19158b37249a7861j57988L7262I093O0492J84507r2172a67190A32486o1939K25545
19147B96092i3339L5312j60344G6597c55861P9496A13078J26144C8996b48672
19136A80362a17004F5582d946j96609D3981c41915J54182A12366Q1341c86267
19125b26973i6674j50555o7398B09222j3658c50586B65260j05997d3309C68633
19114c36344r086Q0294b1191k9795F6950K38980E2182b85718C25413d1722E8567
19102h3695n9493m1156j05154G250h1554H5838a44424B88310c36462k72970C5643
$$ plain form
19090 -27393 -100308 -98131 232209 29463 81591 -144201 -228306 -25158 126257 -27704 -343202
19079 -343202 107284 -166511 -147389 298173 -122836 192520 51329 -147080 26745 1319
19068 -194144 -63286 104608 357637 -115255 84955 -65849 -282766 -59446 186285 -109466
19057 -888 -75545 -46874 -238359 -101146 -45975 -177030 146754 177991 -230841 72800 281634
19046 281634 -12423 146643 -140226 -104438 -36556 -29905 -66037 -45292 -183483 -91206 -154102
19035 -154102 -135112 118832 -76993 -43731 -282244 126777 -84211 307513 136911 28531
19024 177111 121808 -88862 321096 -112777 226059 36380 156339 -28469 -282854 6085 -102014
19012 110885 -69638 121174 44123 -26195 80509 -235145 107755 20989 -71996 154325 -138365
$$ packed form
19090b7393p2915K177B32209B9463N2128a44201q4105b5158A26257b7704l15498
19079c43202A07284a66511J9122B98173a22836A92520E1329a47080B6745A319
19068a94144f3286A04608K53029a15255H4955f5849k16917e9446A86285a09466
19057h88p4657K8671j91485a01146d5975j31055A46754L1237b30841G2800K08834
19046B81634a2423A46643a40226L5788c6556O651l6132K0745j38191i1206o2896
19035a54102J8990A18832g6993L3262k38513A26777h4211C07513A36911B8531
19024A77111n5303h8862C21096a12777B26059C6380J19959b8469k54385F085a02014
19012A10885f9638A21174D4123b6195H0509b35145A07755B0989g1996A54325a38365
$$ plain form
19000 -150412 240984 135623 -71704 -1680 16515 260624 3387 -236194 118196 303279 -59644
18988 -238807 -87928 -37951 -45380 -70919 -76876 -33583 -401596 -89954 -69737 -19654 -18345 -204054
18976 -204054 -331011 -16928 -184303 -59578 -17727 -411924 23533 -72345 -30826 -279620 -391362
18965 -391362 -225342 80116 -149283 -72143 175745 -43511 -12777 -319197 256132 -62527
18954 210781 184396 -313458 -2644 139572 47638 70233 -236129 -135959 -409923 -264270
18944 -264270 -237140 -58702 -303419 34105 -68785 -46818 -74219 -62563 2803 -201056 -423720
18933 -423720 -389075 69815 136716 -367711 123133 91190 -72949 -211918 -126982 -67118 -192940
18922 -192940 276880 -421299 93459 45281 -262920 -351910 280207 -102883 -242854 -62299
$$ packed form
19000a50412B40984j05361g1704a680A6515K44109C387b36194A18196J85083e9644
18988b38807h7928c7951p429k5539n957c3583l68013h9954K0217a9654J309j85709
18976b04054j26957a6928j67375e9578a7727l94197B3533g2345c0826k48794j11742
18965c91362J66020H0116a49283g2143A75745d3511a2777l06420B56132f2527
18954B10781k6385c13458b644A39572D7638K2595b36129J00170k73964J45653
18944b64270K7130e8702k44717C4105f8785K1967k7401J1656B803b01056k22664
18933d23720L4645F9815O6901c67711A23133l1943g2949j38969Q4936N9864j25822
18922a92940B76880d21299I3459D5281b62920q8990B80207a02883j39971f2299
$$ plain form
18911 -46765 -35526 -30299 29478 87316 254389 78241 -145043 7787 -64061 -94397 159885
18899 260750 179091 150371 211888 -63007 -217217 143403 2235 -81266 187583 -97804 -36511
18887 -207150 -75864 -132077 111897 -11919 49602 141854 -359049 7014 160415 26645 -143772
18875 271466 -162580 362695 82052 -79484 -105579 318530 -69553 -5067 -288915 -154445 203984
18863 -97079 -118527 -100400 -109307 128144 -387042 88347 -21950 -276013 1043 -185239 -180295
18852 -180295 2601 -51835 178241 182476 159538 214026 243008 -85375 30824 -230118 83744
18840 -9592 217397 -223790 -104427 112117 -502355 199866 106615 213852 -84018 -8995 -139594
18829 -139594 -13346 122579 171227 -183333 167716 -130922 -324164 -111310 172427 -103467
$$ packed form
18911d6765J1239N227B9478N7838J67073G8241a45043G787f4061l0336A59885
18899B60750q1659k8720O1517f3007j54210A43403B235h1266A87583i7804c6511
18887b07150g5864n6213A11897a1919D9602R2252c59049G014J53401B6645a43772
18875B71466a62580C62695H2052g9484k6095C18530f9553e067k83848J34470B03984
18863i7079k1448J8127q907A28144c87042H8347b1950k54063A043a85239M944
18852a80295B601e1835A78241M235k2938N4488K8982h5375C0824b30118H3744
18840i592B17397b23790a04427A12117e02355A99866r3251J07237h4018h995j30599
18829a39594a3346A22579M8648a83333A67716a30922j93242a11310A72427a03467
$$ plain form
18818 98770 282266 357709 145272 -131668 1116 -128051 -214230 194429 274771 126409 258070
18807 258070 273176 42209 -95205 51 423673 -233971 -78843 176081 41546 71561 -197655
18795 -151016 -253297 -219484 -212825 -72635 -113824 -1451 -296529 108507 20557 25296 80371
18784 80371 117727 18213 -240141 -131943 -94052 238786 -107858 -384370 -16880 -124374
18774 -124374 -161489 -212557 -86306 -76034 -107138 -78887 -103605 -71755 -3771 291305 -315771
18762 393562 32522 68431 180082 -1812 -176681 -274656 260078 -24436 36757 -208956 -234571
18751 -234571 52088 86486 120768 -107631 186018 -257498 160157 -219964 -89378 -209980
18741 -209980 107432 -76788 2633 90319 -213259 54622 109535 -378026 12403 158363 -44557
$$ packed form
18818I8770J83496P5443A45272a31668A116a28051q6179A94429Q0342A26409J31661
18807B58070J5106D2209i5205E1M23622b33971g8843A76081D1546L0015a97655
18795a51016j02281L3813O659g2635m1189a451k95078A08507B0557M739N5075
18784H0371L7356A8213b40141J08198L7891B38786a07858k76512a6880j07494
18774a24374l7115n1068h6306J0272l1104K8251k4718L1850c771B91305c15771
18762C93562C2522L5909J11651a812j74869r7975B60078b4436C6757b08956k5615
18751b34571E2088L4398L4282a07631A86018b57498A60157b19964h9378j20602
18741b09980A07432g6788B633Q7686b13259E4622N4913c78026A2403J45960d4557
$$ plain form
18729 3633 -118839 30423 -457697 89906 -19994 -302131 103631 69235 -127404 -40625 186369
18717 57523 171993 -2147 -76431 -105641 135717 -160498 -19994 155960 -405374 137318 -214710
18705 -12001 92506 180732 4310 115503 53598 -59563 -100427 -46066 15834 -314850 92666
18693 -75070 -78376 -149957 87809 -101989 -184349 -179015 32137 117105 -226732 -182343 -8537 177641
18680 -65195 -20113 -77226 183580 -396705 58775 204270 160669 -61266 -68733 -16170 -141567
18669 -141567 48321 -144308 33902 47733 97642 111186 -318798 -117566 -85283 -114568 -234228
18658 -234228 -138852 17890 76509 -50224 -299385 -6864 -180930 74005 -152362 31724 -127315
18646 1364 295672 73599 -4476 -93189 -165912 87620 -27413 -104526 -157682 -63133 -500821 289858
$$ packed form
18729C633a18839C0423d57697H9906a9994k82137A03631l4396a27404d0625A86369
18717E7523J14470b147p4284k9210A35717a60498a9994A55960d05374A37318b14710
18705a2001I2506Q8226D310J11193E3598e9563m0864d6066A5834c14850I2666
18693g5070l306p1581H7809a01989q2360N334C2137Q4968b26732M4389h537A77641
18680f5195b0113n7113A83580c96705E8775J45495m3601f1266p467a6170j25397
18669a41567D8321a44308C3902J3831M9909J3544c18798a17566L2283k9285j19660
18658b34228R5376A7890N8619e0224k49161f864j74066G4005a52362C1724a27315
18646A364K94308G3599d476q8713p2723H7620b7413p7113n3156f3133m37688B89858
$$ plain form
18633 -67582 -107483 67135 -72939 -14100 314184 -67536 -32529 -98943 -110007 -53479 -23483
18621 -184566 -135498 -115363 -237273 121705 -291392 -450463 -221934 -160663 -107206 -38717
18610 270061 -69526 -4906 -16332 -52050 -299464 -175602 104579 -164455 151885 -116361
18599 -370714 341462 175790 156511 -90341 -78149 -91511 129099 -268634 199345 -51712
18588 87181 87105 -57655 -238064 311698 -192843 85595 -63117 -205026 167174 44220 -273947
18576 -90529 -663133 -2951 -149329 -228780 55246 186687 -87644 -269928 -379935 -2065 -146155
18565 -146155 -137394 227040 4307 -205600 -51275 -280176 -226528 -92721 -101216 -243397 520689
18553 -72011 110472 -151471 -139818 -30327 55278 -433039 9157 158912 -75567 -141341 104948
$$ packed form
18633f7582l9901F7135g2939a4100C14184f7536c2529o6414j1064e3479b3483
18621a84566M9068K0135j21910A21705b91392j59071b21934O1271N3457c8717
18610B70061f9526d906j1426l5718k47414J23862A04579a64455A51885a16361
18599c70714C41462j65672j9279i0341J2192j3362A29099b68634A99345e1712
18588H7181p6e7655j80409C11698a92843H5595f3117j41909A67174D4220b73947
18576i0529n72604b951j46378p9451E5246J31441h7644j82284j10007b065j44090
18565a46155Q761B27040D307b05600e1275k28901N3648i2721q495j42181E20689
18553g2011A10472a51471J1653c0327E5278d33039I157J49755g5567o5774A04948
$$ plain form
18541 -191369 -169787 -114774 105367 -251181 83731 -19501 56823 242945 76397 494649 -26115
18529 -99052 177176 118294 -212733 204020 63948 -7535 -47786 -128610 -281600 -185780 -77445
18517 -141369 -157822 -141563 181364 -113972 291790 110967 55963 147215 128180 10717 -3886
18505 12473 -231104 -97685 -170267 171523 55410 -173865 -97666 2122 103958 -101917 177132
18493 -118703 4104 -269764 -60935 -50221 -5822 -201112 -119769 -9270 42052 -120721 40615
18481 -141734 -253986 -233145 -22840 -25612 -235490 -160376 236014 -157223 9021 -81100 153319
18469 -96320 230756 -16734 -21804 166160 4545 110157 166910 -220691 -190178 -16883 -180254
18458 -180254 20205 77612 -24558 -256446 227971 156405 -164652 -44179 123235 -46037 -31731
$$ packed form
18541a91369K1582N5013A05367b51181H3731a9501E6823J86122G6397M18252b6115
18529i9052A77176n8882b12733B04020F3948g535m0251q0824j52990R5820g7445
18517a41369j6453J6259A81364a13972B91790A10967n5004R1252j9035A0717c886
18505A2473b31104i7685p2582A71523E5410a73865P6199B122J01836a01917A77132
18493a18703D104b69764f0935J0714e822j95290Q1343i270D2052a20721D0615
18481a41734j12252K0841b2840k772k09878P5114B36014a57223I021h1100A53319
18469i6320B30756a6734n070A66160D545J05612N6753b20691L0513a6883j63371
18458a80254B0205N7407b4558k31888B27971p1566a64652d4179A23235d6037J4306
$$ plain form
18447 -31731 -283068 -73530 52345 47790 -242940 -104083 21812 73418 -33775 254340 292139
18436 292139 -388224 123650 105852 10493 37450 142645 -283112 -13283 -84975 290991
18425 -47331 -602896 -71615 -11879 35816 158473 -361706 -406788 -58701 -288365 136648 -197252
18413 9265 -45382 -92974 246558 -263543 19353 -34392 161476 188730 155950 -84432 -131799
18402 -131799 140623 12194 -236127 -165756 234823 53675 19464 -262069 126730 -60352
18391 -176228 42354 -4908 -122196 390079 -235074 84004 -229876 -28587 -33173 -162117 -343921
18380 -343921 -8280 -184044 -201053 148952 175709 -151906 -105460 -15479 -258591 -12240 -10493
18369 -10493 23351 39596 -32817 -94548 405564 -67645 -131637 -318870 165601 -244421 -100357
$$ packed form
18447c1731k51337g3530E2345m555b42940a04083B1812N1606c3775B54340L7799
18436B92139c88224A23650j7798A0493K6957J05195b83112a3283p1692B90991
18425d7331n55565g1615a1879C5816J22657c61706m5082e8701k29664A36648a97252
18413I265d5382m7592B46558b63543A9353c4392A61476K7254l2780h4432m7367
18402a31799A40623A2194b36127P0371B34823E3675A9464b62069A26730f0352
18391a76228D2354d908j17288C90079b35074H4004b29876b8587m586j28944j81804
18380c43921h280j75764j7009A48952K6757a51906M6446a5479k43112a2240J747
18369a0493B3351J6245c2817o1731D05564f7645o3992j87233A65601b44421a00357
$$ plain form
18357 -258510 -40293 -317516 68244 -369576 108552 53420 -82161 -191456 73154 -327287
18346 -245364 -348095 -296343 -214770 151310 -5386 112470 -110048 -153381 37015 133836 419266
18335 419266 -26049 -116893 -217366 -66000 53644 21643 153139 -38840 -115724 -90044 -15709
18323 161979 -196 -122205 -35979 90617 51794 111552 -331400 -129132 -19548 -168464 396397
18311 -65689 161298 -222177 -1051 -67948 294877 217423 -374425 29580 -72253 83602 80398
18300 80398 -85142 -84969 -307984 -80267 -161411 -439670 -445957 -50382 -166493 -256104 -29381 297430
18287 59640 -157780 -173711 -374027 -58708 -79738 -13008 -86737 30896 155127 -194621 -313575
18276 -313575 -49007 -181463 -148397 -175407 74436 195583 -115617 211365 220863 97510 299150
$$ packed form
18357b58510d0293k77223F8244c69576A08552E3420h2161j09295G3154c27287
18346b45364j02731N1752Q1573A51310e386A12470a10048m3333C7015R6821K85430
18335D19266b6049r0844j00473f6000E3644B1643J31496c8840p6884K5680a5709
18323A61979a96j22009c5979I0617l8823N9758c31400a29132a9548j48916C96397
18311f5689A61298b22177a051o6897B94877p7454c74425B9580g2253H3602l204
18300H0398h5142J73k23015h0267q1144k78259o287e0382j16111q9611b9381B97430
18287E9640a57780j5931k00316e8708k1030a3008p3729C0896J24231a94621j18954
18276c13575d9007j32456L3066k7010G4436J21147a15617B11365R498I7510K01640
$$ plain form
18265 299150 72658 260640 -215493 -150711 -199751 35474 -124223 -114049 -111770 33682 -6007
18253 278735 37113 143510 -127393 10682 25655 -49280 34732 -172205 -46311 50073 40248
18242 40248 -105956 62399 91768 165529 188906 239333 358160 -16619 -401951 -116404 30737
18230 -197394 37964 -296432 -77493 -52866 -167588 -175265 13453 134325 -131859 -46168 356620
18218 68749 -23857 91573 -106199 -145800 -26453 -119723 -98674 -99254 -57999 -250610 -288684 -170686
18206 -170686 -10951 -243070 41176 -125611 271754 -69675 26954 93674 49561 6243 -60410
18194 -124684 61761 -180598 71494 -203749 -78863 -112846 -165052 -6575 -93576 48632 -59212
18182 -90898 -274234 -566833 185081 -49225 231762 97270 9459 64813 23853 14780 59077
$$ packed form
18265B99150G2658J87982b15493O4782m9040C5474a24223J0174K279C3682f007
18253B78735C7113J06397a27393A0682J4973d9280C4732a72205d6311E0073r825
18242D0248a05956F2399K9369P3761K3377N0427J18827a6619l85332a16404C0737
18230a97394C7964b96432g7493K4627j14722p677A3453J20872a31859d6168C56620
18218F8749b3857I1573a06199l9601b6453r3270K1049n80M1255j92611l8074J17998
18206a70686a0951k32119D1176a25611B71754f9675B6954O6720m4113F243f0410
18194a24684F1761a80598G1494b03749g8863l3983n2206f575q7001D8632e9212
18182i0898j83336k92599A85081d9225B31762I7270I459N5354B3853r073M4297
$$ plain form
18171 59077 -294102 -321027 -519441 102733 53124 -285149 -327288 5910 -96290 -232296 -270487
18160 -270487 -86787 -175402 115867 252763 -133527 -41838 -9711 -55548 -33095 122882 -110183
18148 -51660 -99089 70568 -203034 19781 62160 240652 -34540 -73892 137512 45170 98071
18137 98071 56450 69173 -78528 -149948 -63200 -248738 384813 22785 -146650 -14887 -214441
18126 -214441 -266271 -242180 19325 -125861 107165 109591 106130 -128170 -167467 -116062 98628
18114 -290123 18013 287291 107213 28465 287027 -53134 1462 20456 3662 304812 354909
18103 354909 -480548 -168138 -19868 -454251 128125 194877 101532 -43528 13192 124296
18093 124296 -36218 1203 100533 329412 115373 -351383 -321852 146686 126604 28782 -102142
$$ packed form
18171E9077b94102k6925j98414A02733m9609b85149m2139E910i6290j36006l8191
18160b70487h6787q8615A15867J36896a33527d1838i711m5837K2453A22882a10183
18148e1660m7429G0568b03034A9781M2379J78492c4540l9352A37512D5170N2901
18137I8071m1621J2723g8528p1420f3200j85538C84813B2785a46650a4887j99554
18126b14441n1830K4091A9325a25861A07165K426l461a28170l9297N1405I8628
18114b90123A8013K69278A07213B8465K58562e3134A462J8994C662L01150N0097
18103C54909d80548a68138a9868m34383A28125O6752r3345d3528A3192J11104
18093A24296c6218A203R9330K28879A15373c51383K9531A46686k0082B8782a02142
$$ plain form
18081 25177 30139 118402 -159394 -6054 -66150 -162721 -169080 -272357 -312695 -221713 1041 -133099
18068 281659 -95743 73567 -251408 -66405 -161434 18983 -181128 -447601 -135486 -207191 -100294
18056 -158530 -42415 -27287 -25472 -367380 -222950 265915 -29074 123147 314729 119915
18045 248633 49873 362339 66912 -283006 -255029 -217183 -105157 162085 -87704 42950 -185590
18033 226379 -120248 231225 -171724 129645 -63102 -75906 -218418 -101054 205700 312725
18023 312725 -202507 185094 -14262 -88396 -14163 317435 207184 -477754 30230 -253636
18012 -163343 -679590 -53371 25214 74839 -204513 -68488 84129 62162 -34647 -161042 -40358
18000 114736 -195283 -267729 -101185 -193273 108356 -21377 -67108 -117514 63190 140360 284306
$$ packed form
18081B5177M962Q8263a59394f054o0096r6571o359j03277m0338R0982A041a33099
18068B81659i5743G3567b51408f6405r5029A8983a81128k66473a35486p1705a00294
18056a58530d2415J5128J815l41908J44430B65915b9074A23147J91582A19915
18045B48633D9873L12466F6912b83006K7977L7846a05157A62085h7704D2950a85590
18033B26379a20248B31225a71724A29645f3102j2804j42512a01054B05700J07025
18023C12725b02507A85094a4262p4134a4163C17435j10251d77754C0230b53636
18012a63343n16247e3371B5214M9625b04513f8488H4129k1967c4647j26395d0358
18000A14736a95283p2446a01185r2088A08356b1377m5731n0406F3190P7170J43946
$$ plain form
17989 284306 -94781 -210663 49066 80697 -279656 50732 24345 -166100 157391 345295
17979 345295 -216925 82084 -49311 -52778 4793 280892 -44513 14005 -57967 -226636 -142162
17968 -142162 82714 -325706 96551 -71702 205007 -132408 91060 -125785 188936 232388
17958 232388 -301183 241162 -102580 -111190 -167949 28573 -70436 -263204 -50952 -148192 -192572
17947 -192572 -147990 -190398 57176 90947 192345 204730 68321 265059 -128483 28677 -128804
17935 4388 -152726 -106005 -147869 -45878 229152 64312 -79520 37713 110593 41257 155499
17924 155499 453382 -170065 64308 193406 203228 29040 -82138 -112989 333100 -151029 -408507
17913 -408507 81701 201542 -141425 -206484 -126522 59296 -203747 -119583 48863 -71383 -192711
$$ packed form
17989B84306i4781j15882D9066L1631b79656E0732B4345a66100A57391J87904
17979C45295b16925H2084d9311l467D793K76099d4513A4005e7967j68669Q4474
17968a42162H2714c25706I6551g1702B05007a32408I1060a25785A88936M3452
17958B32388c01183B41162a02580q610n6759B8573g0436j92768e0952r7240m4380
17947a92572M4582m2408E7176L3771J01398J2385F8321J96738a28483B8677a28804
17935D388a52726M6721m1864d5878B29152F4312g9520C7713P2880D1257J14242
17924A55499K97883a70065F4308J29098R822B9040h2138l0851C33100a51029k57478
17913d08507H1701J19841a41425o5059P9962E9296b03747Q4164D8863g1383j21328
$$ plain form
17902 -192711 107274 46104 -125784 -147529 -92584 -147387 -6068 200230 32041 -108480 247509
17890 345369 17564 -11235 127704 235057 246830 -476727 -22613 53129 -196471 231173
17879 -369903 -61250 -59862 -135245 -215904 251304 20715 185345 -25339 19072 -40020 258725
17867 -86403 110327 -300149 39000 272903 -1507 -414 168801 -49209 201030 32023 492470
17856 492470 117529 57448 -290855 -157900 459186 -349160 -45679 -57659 73476 -124255
17845 -63656 145764 26899 81304 71165 167397 -141542 -24450 -176682 64897 169186 43099
17833 -92183 266481 -2903 325542 -22828 17194 214425 27795 44258 149278 -265730 -499
17821 49475 52376 -14431 -38379 181412 -309556 -301401 -6438 -315986 -251671 -238034 17776 21682
$$ packed form
17902a92711A07274D6104a25784k1745N4945n4803f068B00230C2041a08480B47509
17890C45369A7564a1235A27704J07353J1773d76727b2613E3129a96471B31173
17879c69903f1250J388p5383q0659B51304B0715J64630b5339A9072d0020B58725
17867h6403A10327c00149C9000K33903a507d14A68801d9209B01030C2023M60447
17856D92470A17529E7448b90855J32955D59186c49160d5679j1980G3476a24255
17845f3656A45764B6899N4405j0139R6232a41542b4450j52232F4897J04289D3099
17833i2183B66481b903C25542b2828A7194J97231B7795J6463J05020b65730d99
17821D9475K901a4431k3948A81412c09556Q155f438l09548O4315J3637A7776L906
$$ plain form
17809 21682 75936 72385 5731 -129812 98696 -212057 125289 -9515 329997 -143576 -40001
17797 86664 -31971 432897 137553 32062 -167963 19355 162236 75631 -3193 200227 26921
17785 -103020 227397 88446 -185523 263901 -16430 -12786 -137478 -183815 -102880 -61460 156846
17773 -176373 -336051 279174 363725 165423 76116 -446713 188470 26707 -213190 201951
17762 -207490 -143200 -201565 183870 134559 -43815 73232 361082 -96326 60652 107858 27349
17750 27549 107764 62439 -144310 -29222 21573 -145531 152852 -206369 -184 279369 192556
17739 192556 -82356 90722 85536 -434854 -145303 272383 342309 246114 -28647 -107317 -128333
17728 -128333 26721 -1898 -219267 -379570 -90551 140347 230610 224570 118206 120721 -78771
$$ packed form
17809B1682N4254l551E731a29812I8696b12057A25289i515C29997a43576d0001
17797H6664c1971D32897A37553C2062a67963A9355J42881G5631c193B00227B6921
17785a03020B27397H8446a85523B63901a6430L644j24692m6337Q0935M1420A56846
17773a76373j59678B79174Q4551A65423G6116d46713A88470B6707b13190B01951
17762b07490O4290n8365A83870m9311d3815G3232K87850i6326F0652M7206B7349
17750B7549Q0215m5325a44310b9222B1573a45531A52852b06369a84B79369q6813
17739A92556h2356I0722n186d34854a45303B72383O9926r6195b8647p8670k1016
17728a28333B6721a898k17369j60303i0551A40347R0263o040j06364K515g8771
$$ plain form
17716 -118004 58440 299805 68861 65728 -70316 -79780 361309 1264 155674 164466 -106244
17704 1070 -139886 -108489 -90916 147114 -211661 -253589 -87240 -104834 -63776 52425 32707
17693 32707 -166010 -129599 -176340 -194246 -12694 -134648 -163554 105844 71523 243489 148581
17682 148581 -3067 43329 112119 -51906 111856 -52811 243425 56460 135156 130687 5879 118364
17670 118364 93857 -13058 -84960 174564 116441 -46791 284996 251573 -197046 -151243 58383
17658 9492 37873 152449 61528 72357 -130418 29759 310398 90288 140521 -96444 103717
17646 353965 -103756 -84807 -275394 -79047 -144345 -143943 -12537 74352 47154 325990 283998
17635 283998 -376430 34431 -331127 -94213 -188559 99773 85869 64310 178338 188543 -14646
$$ packed form
17716a18004E8440K41365F8861l133g0316r464C61309A264J54410Q792a06244
17704A070a39886L1397J7573A47114b11661m1928h7240j7594M1058E2425j9718
17693C2707a66010L6411m6741j7906a2694j21954k8906A05844l4321J71966r4908
17682A48581c067D3329O8790e1906A11856e2811B43425E6460P8696m469E879J12485
17670A18364k4507a3058p1902A74564n8123d6791B84996l3423a97046M5803E8383
17658I492K8381J14576F1528J0829a30418B9759K80639I0288N0233i6444A03717
17646C53965a03756J8949j90587g9047o5298M02a2537G4352k7198K78836m1992
17635B83998c76430C4431c31127i4213r4346I9773j3904k1559J14028J0205a4646
$$ plain form
17623 -62897 -113363 76387 8188 67532 75739 31206 240281 -230100 -250322 27843 -70454 172653
17610 208880 -123838 58522 -42506 46256 -18065 73660 134008 -17625 326427 121636 -153139
17598 -134942 111434 -57471 -108049 119100 210359 687 66374 84214 128419 -5043 -79544 11640
17585 191482 56658 -23740 -174139 14322 -230724 105215 36507 125205 -212903 -70139 -174865
17574 -174865 -233265 -50716 -358533 168823 -149423 126197 -11988 -35191 239627 454608
17564 454608 179661 16544 -230426 -14063 69926 -28931 441443 304344 -10112 7883 321266
17553 321266 -239293 -44162 -513185 -4089 75431 -142791 60176 -171767 185120 -168096
17542 219415 -246707 241095 137916 133953 52413 -5130 214367 310026 163832 180323 144976
$$ packed form
17623f2897n0466G6387H188N9344Q207C1206K09075b30100k0222B7843g0454A72653
17610B08880a23838E8522d2506D6256a8065G3660O0348a7625C26427A21636a53139
17598a34942A11434e7471n0578A19100R1259F87O5687J7840M4205e043p4501A1640
17585A91482E6658b3740j50399A4322b30724A05215C6507Q8698b12903g0139j04726
17574a74865n8400e0716l07817A68823a49423A26197a1988k3203B39627K14981
17564D54608A79661A6544b30426a4063F9926b8931D41443j37099a0112G883L13383
17553C21266b39293d4162m69023d089G5431a42791F0176a71767A85120a68096
17542B19415b46707B41095j03179l963E2413e130B14367R5659j46194J6491l5347
$$ plain form
17531 144976 -13462 -164397 257049 94559 118249 218607 -52292 30744 243691 167754 68144
17519 -22307 277137 133048 -165882 -198204 -195301 26587 311048 -140120 46193 326271 -132737
17507 -34413 -39810 -12789 227026 189904 80466 -164973 27340 142903 168411 663837 308143
17495 -103869 185329 -32002 326923 -466591 6742 11508 76837 73358 70941 447707 65011
17483 144151 441498 80543 64279 389398 -40717 164369 -31442 -41687 -162902 379084
17472 -29272 -97399 -195556 78320 417805 178837 -179867 228685 94403 452564 -80345 231270
17460 -22824 -39675 61147 139979 -33502 108174 83938 -42801 -194421 109560 107111 390629
17449 390629 473559 349168 546067 90554 247873 385071 285167 534727 122305 506773
$$ packed form
17531A44976a3462j50935B57049I4559K3690J00358e2292C0744K12947p5937F8144
17519b2307B77137A33048a65882l2322K903B6587K84461a40120D6193K80078a32737
17507c4413n397a2789B27026l7122H0466a64973B7340J15563K5508M95426C08143
17495a03869A85329c2002C26923d66591F742M766O5329l479k417L76766F5011
17483A44151K97347H0543j6264L25119d0717A64369c1442j0245j21215C79084
17472b9272o8127r8157G8320L39485A78837a79867B28685I4403L58161h0345B31270
17460b2824j6851F1147P8832c3502A08174k4236d2801j51620A09560k449K83518
17449C90629Q2930j24391J96899I0554J57319J37198r9904K49560A22305L84468
$$ plain form
17439 506773 410938 163135 25884 331034 181863 424417 322922 73232 287322 563678
17429 563678 371444 148302 331249 175995 -92281 -73 347049 128325 248877 264981 336962
17418 336962 150499 -50409 233680 432299 85371 -198543 145638 75766 83418 205066
17408 205066 -39965 -26035 71785 176396 -188402 152739 193859 181817 125771 167269 123482
17397 123482 219752 272521 94074 71827 170536 60357 10355 262768 475005 19786 8402
17385 299173 105284 87777 -113334 -170449 463911 209005 367150 17692 -54747 135011
17374 351492 101116 150655 333793 165349 312260 205733 -3353 253669 252895 72839 29639
17362 77576 3735 -235063 97129 166634 -35968 75565 110721 333257 332556 131973 16015 457839
$$ packed form
17439E06773r5835A63135B5884L05150j49171K42554j01495G3232K14090K76356
17429E63678j92234A48302J82947j55254i2281g3C47049A28325J20552J6104P1981
17418C36962A50499e0409B33680J98619H5371a98543A45638o9872P652J21648
17408B05066c9965J3930G1785J04611a88402A52739M1120j2042n6046M1498m3787
17397A23482R6270N2769I4074k2247R8709F0357A0355K52413K12237A9786H402
17385B99173A05284j7507a13334n7115D63911B09005J58145A7692e4747A35011
17374C51492A01116M9539J83138A65349J46911j06527c353B53669p74G2839B9639
17362G7576C735b35063I7129O9505c5968G5565L5156K22536p01A31973A6015M41824
$$ plain form
17350 457839 196827 98573 328242 22150 336145 -214000 -32923 19731 -59470 137482
17339 45354 94667 265263 197608 300150 58033 -63538 123946 470106 356350 294577 224571
17328 224571 59000 -6469 70035 258102 -175999 -42952 159088 -36024 330970 52594 38053
17317 38053 197758 46753 288451 204007 187426 62285 97308 144303 -235703 232927 -39810
17305 288404 200489 25231 -43664 112147 53399 152810 137553 291991 205271 325953 162900
17293 -65966 323028 -136372 7570 282759 471226 233841 441711 208959 -63245 241222
17282 119752 128281 177832 30160 290663 146805 -24551 250827 178650 56343 -131778 101756
17270 355466 321816 181706 144592 123541 161855 61150 -49280 -73246 236046 150090 85472
$$ packed form
17350D57839A96827r8254K29669B2150L13995b14000c2923A9731e9470A37482
17339D5354M9313J70596o7655J02542E8033f3538A23946L46160j13756o1773p0006
17328B24571E9000f469G0035J88067a75999d2952A59088c6024C30970E2594j4541
17317C8053J59705D6753K41698q4444j6581F2285L5023M6995b35703B32927c9810
17305B88404q7915B5231d3664A12147E3399R9411j5257J54438q6720J20682A62900
17293f5966C23028a36372G570K75189J88467B33841K07870B08959f3245B41222
17282A19752Q529M9551C0160K60503j43858b4551B50827p2177E6343a31778A01756
17270C55466l3650j40110l7114k1051L8314F1150d9280k3966B36046q5956o4618
$$ plain form
17259 85472 146964 213152 339909 36452 350948 222497 -305808 310184 420482 -69839
17248 309936 474106 307646 108380 100431 212586 381024 203358 46589 146180 122632
17238 122632 395029 450079 250698 51580 651060 140 302343 318208 41218 148161 498834
17227 498834 423354 431200 217754 375795 339159 -118981 -18619 318798 -128851 367164
17216 201273 220552 32456 47982 143502 299861 131212 434172 687720 326394 379506
17206 379506 213407 228631 214515 57900 127137 504174 226669 -110987 132914 157975
17196 157975 488971 472440 150755 37050 420524 556238 409781 129809 267889 574738
17186 574738 70436 396391 460584 254399 226558 4944 473588 301862 315961 378146 87471
$$ packed form
17259H5472O1492O6188J26757C6452L14496j28451c05808C10184J10298f9839
17248C09936J64170j66460A08380p949J12155J68438j77666D6589R9591k3548
17238A22632K72397N5050j99381E1580N99480A40L02203J5865D1218J06943L50673
17227D98834p5480P846k13446J58041l6636a18981a8619C18798a28851C67164
17216B01273J9279C2456J5526R5520J56359A31212L02960K53548C26394N3112
17206C79506j66099J5224j4116E7900O9237L77037B26669a10987A32914K5061
17196A57975L30996j6531A50755C7050L83474J35714j46457A29809J38080L06849
17186E74738G0436L25955O4193k06185k7841D944M68644j71726J4099O2185H7471
$$ plain form
17174 213446 366396 335362 687146 167819 160164 323363 -37709 625585 401606 136682
17163 221803 410216 605348 452453 198688 435609 202475 188323 359201 114982 172234
17153 172234 323577 542323 167991 182230 261051 237894 23278 158869 428878 -50782
17142 180232 224657 162665 224256 227816 321601 357974 650584 108862 345947 197118 252438
17131 252438 219226 426266 269691 352656 611866 208778 74180 40686 516708 284239
17121 284239 141838 202248 498362 455133 270213 541149 151880 376733 332448 283618
17111 283618 271861 510817 270358 431475 345681 563099 517738 504705 346740 377679
17101 377679 472494 336458 564136 438274 574943 516467 423502 554770 420726 471393
$$ packed form
17174B13446J52950l1034L51784A67819p655J63199c7709F25585k23979A36682
17163B21803J88413J95132j52895A98688K36921B02475j4152J70878A14982N7252
17153A72234J51343K18746A67991J4239P8821k3157B3278J35591K70009e0782
17142A80232M4425o1992O1591L560R3785L6373K92610A08862K37085j48829N5320
17131B52438l3212K07040j56575Q2965K59210B08778G4180l3494M76022k32469
17121B84239A41838O0410K96114m3229j84920K70936A51880K24853m4285m8830
17111B83618j1757K38956k40459J61117q5794K17418m5361j3033j57965L0939
17101C77679R4815j36036K27678j25862J36669n8476r2965J31268j34044N0667
$$ plain form
17091 471393 214717 203277 414264 63918 358501 557752 677939 661221 288605 611469
17081 611469 419137 272574 598648 425306 292878 558277 397835 634961 503267 393321
17071 393321 467969 824771 546042 255523 469465 282044 556790 456432 87939 495143
17061 495143 252886 386934 421042 276652 394880 504787 243790 437845 593002 550240
17051 550240 363006 761429 249245 455053 482583 643021 623462 213044 651796 643836
17041 643836 661018 298705 353816 854380 857186 379924 774180 572747 416153 618122
17031 618122 645921 642298 305655 465235 264740 792658 678766 682010 606953 935038 770357
17020 770357 647528 553655 724775 651077 658037 819070 513468 891627 649292 917029
$$ packed form
17091D71393B14717j1440K10987F3918K94583J99251J20187j6718B88605L22864
17081F11469j92332j46563L26074j73342j32428K65399j60442K37126j31694j09946
17071C93321P4648L56802k78729B55523K13942j87421K74746j00358H7939M07204
17061D95143k42257J34048L4108j44390J18228J09907B43790J94055J55157m2762
17051E50240j87234L98423B49245K05808K7530J60438j9559B13044M38752p960
17041F43836J7182B98705N5111N00564K806C79924L94256k01433j56594K01969
17031F18122K7799l623C05655J59580k00495N27918j13892L244p5057L28085j64681
17020G70357j22829r3873J71120p3698O960J61033l05602L78159k42335K67737
$$ plain form
17010 917029 777926 797512 765967 763771 519728 455272 560016 677932 1008769 641536
17000 641536 705220 564474 790077 439412 513992 511889 1098055 575563 519796 945483
16990 945483 1008421 564170 879027 842995 986130 955575 349747 1070068 840456 958228
16980 958228 451379 848506 982861 803196 764210 1114359 618786 1389514 795634 1019335
16970 1019335 900509 791835 946066 1046338 949104 1105711 1057962 1052260 1102814 1143679
16960 1143679 978447 1074677 987304 1184371 1178148 1077312 1137091 1499589 1125405 828695
16950 828695 880744 1417773 1111460 1198008 1073775 1299566 957925 1148130 1085720 1198544
16940 1198544 1256690 1460423 1327655 1043329 1317349 1432909 1367334 1218908 1295703 1257349
$$ packed form
17010I17029j39103J9586l1545k196k44043o4456J04744J17916L30837l67233
17000F41536O3684j40746K25603l50665P4580k103N86166n22492n5767M25687
16990I45483O2938m44251L14857l6032J43135l0555C49747P20321k29612J17772
16980I58228D51379L97127J34355j79665l8986L50149m95573P70728n93880K23701
16970A019335j18826j08674J54231J00272r7234J56607m7749n702N0554M0865
16960A143679j65232R6230q7373J97067o223j00836N9779L62498l74184k96710
16950H28695N2049N37029l06313Q6548j24233K25791l41641J90205o2410J12824
16940A198544N8146K03733j32768k84326K74020J15560o5575j48426P6795l8354
$$ plain form
16930 1257349 1495168 1001300 1304062 1199159 1341104 999521 1477167 1078208 1691355
16921 1691355 1308837 1674592 1302124 1410496 1265492 1677651 1071916 1435848 1337673 1839739
16911 1839739 1589326 1737695 1516213 1544384 1557543 1644205 1717219 1687683 1961796 1624406
16901 1624406 1652891 1778865 1690267 1919686 1821649 1949696 2091878 1769400 1944522 2097261
16891 2097261 1743979 1708340 1810586 2146436 1956790 2041119 2220261 1968297 1647273 1992870
16881 1992870 2182717 2298811 2542153 2274238 2223714 2044364 1905883 2495349 2207419 2363801
16871 2363801 2342698 2381863 2443880 2668809 2433633 2402647 2818061 2727551 2844104 2617058
16861 2617058 2400662 2776917 2829078 3273330 2860162 2965221 3051956 2976649 2995450 3078339
$$ packed form
16930A257349K37819m93868L02762j04903J41945l41583M77646l98959O13147
16921A691355l82518L65755l72468J08372j45004M12159o05735L63932r8175N02066
16911A839739k50413J48369k21482K8171J3159Q6662P3014k9536K74113l37390
16901A624406K8485J25974q8598K29419r8037J28047J42182l22478J75122J52739
16891B097261l53282l5639J02246L35850j89646Q4329J79142k51964l21024L45597
16881A992870J89847J16094K43342k67915n0524j79350j38481N89466k87930J56382
16871B363801k1103L9165O2017K24929k35176l0986M15414r0510J16553k27046
16861B617058k16396L76255N2161M44252m13168J05059Q6735p5307J8801Q2889
$$ plain form
16851 3078339 2956504 3293606 3566216 3230496 3281705 3650579 3302398 3655324 3374501 3458357
16841 3458357 3799572 3548705 4234792 3772985 3472172 3897493 4245596 4361446 4478765
16832 4478765 4325715 4185002 4145929 4361127 4562440 4653765 4706179 4869690 4882935 5035639
16822 5035639 4843282 4820223 5375166 5452853 5328467 5530634 5730050 5748086 5803269 6002821
16812 6002821 6165757 6388384 6151960 6426565 6856652 6658211 6927871 6959176 6817798 7245660
16802 7245660 7582495 7589914 7493783 7871542 8035988 8265890 8348856 8461297 8773627 9350490
16792 9350490 9366019 9565640 9556839 10026498 10383940 10667391 10561538 11237524 10910267 11708309
16782 11708309 11946304 12108202 12548514 12773734 13467086 13640003 14128191 14788292 15133726
$$ packed form
16851C078339j21835L37102K72610l35720N1209L68874l48181L52926k80823Q3856
16841C458357L41215k50867O86087m61807l00813M25321L48103J15850J17319
16832D478765j53050j40713l9073K15198K01313R1325N2414J63511J3245J52704
16822E035639j92357k3059N54943P7687j24386K02167J99416J8036N5183J99552
16812F002821J62936K22627k36424K74605M30087j98441K69660L1305j41378M27862
16802G245660L36835P419r6131L77759J64446K29902Q2966J12441L12330N76863
16792I350490J5529J99621q801M69659L57442K83451j05853O75986l27257P98042
16782A1708309K37995J61898M40312K25220O93352J72917M88188O60101L45434
$$ plain form
16773 15133726 15546299 15965444 16657894 17086311 17479863 18383231 18879306 19670077 20033917
16764 20033917 21101239 21677403 22622438 23542300 24205346 25544084 26536861 27547529 28664661
16755 28664661 29481342 30851491 31971246 33826204 35397300 36710642 38431060 40165081
16747 40165081 42290268 44445175 46493454 48865766 51259106 54433635 56998683 59728785
16739 59728785 63281660 66811729 70385604 74541517 78731270 83272533 88128741 93123643
16731 93123643 98856802 104491868 110731147 117076492 123381269 130108914 137132919 144319000
16723 144319000 151035054 158363005 165131910 171241615 176824934 181962025 186172881 188963155
16715 188963155 190851755 191412859 190814838 189118633 186234261 181837551 177146934 171471931
$$ packed form
16773A5133726M12573M19145O92450M28417L93552R03368M96075P90771L63840
16764B0033917J067322N76164R45035R19862O63046J338738R92777J010668J117132
16755B8664661Q16681J370149J119755J854958J571096J313342J720418J734021
16747D0165081K125187K154907K048279K372312K393340L174529K565048K730102
16739E9728785L552875L530069L573875M155913M189753M541263M856208M994902
16731I3123643N733159N635066O239279O345345O304777O727645P024005P186081
16723A44319000O716054P327951O768905O109705N583319N137091M210856K790274
16715A88963155J888600N61104n98021j696205k884372m396710m690617n675003
$$ plain form
16707 171471931 165072718 158095238 150866791 143623194 136126939 129182008 121717576 115021839
16699 115021839 108354445 102100571 96040004 90122931 84962669 80002593 75607935 71407728
16691 71407728 66851876 63562220 59875545 56792880 53801373 50857663 48235230 45542729
16683 45542729 43516508 41422221 39350387 37286295 35755897 34170420 32192378 31006655
16675 31006655 29654640 28177673 27147633 26170398 25272693 24243390 22880069 22364286
16667 22364286 21450410 20399762 19480917 18943653 18457296 17549470 17222849 16650756 15897305
16658 15897305 15487112 14824560 14154245 13908300 13243594 13071383 12738056 12231593 12004117
16649 12004117 11659399 11184255 10737287 10552855 10243629 9980319 9875220 9298630 9166457
$$ packed form
16707A71471931o399213o977480p228447p243597p496255o944931p464432o695737
16699A15021839o667394o253874o060567n917073n160262m960076m394658m200207
16691G1407728m555852l289656l686675l082665k991507k943710k622433k692501
16683D5542729k026221k094287k071834k064092j530398j585477j978042j185723
16675C1006655j352015j476967j030040r77235q97705j029303j363321n15783
16667B2364286r13876j050648r18845n37264m86357r07826l26621n72093p53451
16658A5897305m10193o62552o70315k45945o64706j72211l33327n06463k27476
16649A2004117l44718m75144m46968j84432l09226k63310j05099n76590j32173
$$ plain form
16640 9166457 8741610 8527788 8271656 8288125 8023923 7616277 7253841 7427421 7358536 7150661
16630 7150661 7020546 6919699 6626756 6195253 6134522 5639745 5891837 5941732 5529568 5544684
16620 5544684 5523869 5263540 5221151 4736529 4961606 4816601 4701212 4888739 4669842 4398140
16610 4398140 4342972 4532156 4176799 3830915 3935318 4092802 3876831 4025245 3613017 4098475
16600 4098475 3534447 3507597 3443271 3288219 3522449 3396226 3235967 3309931 3126596 2969518
16590 2969518 3146258 2847700 3149048 2906741 2903883 2797328 3133565 2764232 2676257 2900565
16580 2900565 2348180 2377708 2494929 2408708 2373798 2308438 2199676 1832734 2261536 2608010
16570 2608010 2525318 1893381 2182875 2248139 1995387 2017255 1988022 2377045 1843585 1959596
$$ packed form
16640I166457m24847k13822k56132J6469k64202m07646l62436J73580o8885k07875
16630G150661j30115j00847k92943m31503o0731m94777K52092M9895m12164J5116
16620E544684k0815k60329m2389m84622K25077j45005j15389J87527k18897k71702
16610D398140n5168J89184l55357l45884J04403J57484k15971J48414m12228M85458
16600D098475n64028k6850o4326j55052K34230j26223j60259P3964j83335j57078
16590B969518J76740k98558L01348k42307k858j06555L36237l69333q7975K24308
16580B900565n52385K9528J17221q6221l4910o5360j08762l66942M28802L46474
16570B608010q2692o31937K89494O5264k52752K1868k9233L89023n33460J16011
$$ plain form
16560 1959596 2017684 1725784 2111467 1791884 1646587 1684993 1593022 1707866 1833309 1688671
16550 1688671 1740925 1841934 1645063 1148222 1444181 2005993 1578461 1902845 1480830 1843318
16540 1843318 1442937 1476324 1473802 1072157 1425644 1215979 1340719 1550046 1411687 1148352
16530 1148352 1344338 1160149 1058213 1219428 1027587 1346057 1347252 1091694 1081036 1228489
16520 1228489 875612 1007330 999624 1225786 1038656 1313363 1178391 946656 730321 943070
16510 943070 1121569 1032971 838557 913450 992411 971792 1073183 834870 870814 837750 705516
16499 705516 824397 890715 939396 773225 570202 1165608 1168036 492084 808890 638533
16489 638533 564751 1063762 487854 928212 793381 790754 732307 932520 563420 1053036
$$ packed form
16560A959596N8088k91900L85683l19583j45297L8406r1971J14844J25443j44638
16550A688671N2254J01009j96871m96841K95959N61812m27532L24384m22015L62488
16540A843318m00381L3387k522m01645L53487k09665J24740K09327j38359k63335
16530A148352J95986j84189j01936J61215j91841L18470J195k55558j0658J47453
16520A228489l52877J31718p706K26162j87130K74707j34972k31735k16335K12749
16510I43070J78499q8598j94414P4893P8961k0619J01391k38313L5944l3064j32234
16499G05516J18881O6318M8681j66171k03023N95406K428D92084L16806j70357
16489F38533p3782M99011D87854M40358j34831k627n8447K00213l69100M89616
$$ plain form
16479 1053036 710998 515215 684404 796046 752897 457135 660748 546506 605704 542209
16469 542209 550930 808049 785482 691081 696756 823377 711803 404282 506545 615263 583404
16458 583404 715013 681005 441604 528950 539494 712709 419261 528656 538896 342659
16448 342659 767141 474989 423395 436030 287500 427501 594711 587291 750727 570010
16438 570010 663185 324194 518073 625379 562507 439430 362593 649276 624241 461125
16428 461125 617567 400162 384088 525796 511280 280611 416738 513380 266765 265666
16418 265666 340878 239266 635510 518264 367725 379886 394721 389691 449124 547101 570664
16407 570664 392436 429971 397732 280034 434141 208783 554197 -78308 161214 632120
$$ packed form
16479A053036l42038j95783J69189J11642m3149k95762K03613j14242N9198o3495
16469E42209Q721K57119k2567r4401N675J26621j11574l07521J02263J08718l1859
16458E83404J31609l4008k39401Q7346J0544J73215k93448J09395J0240j96237
16448C42659M24482k92152n1594J2635j48530J40001J67210p420J63436j80717
16438E70010R3175C24194J93879J07306o2872j23077p6837K86683k5035j63116
16428D61125J56442k17405j6074J41708j4516k30669J36127R6642k46615j099
16418B65666P5212j01612L96244j17246j50539J2161J4835n030N9433R7977K3563
16407E70664j78228L7535l2239j17698J54107B08783L45414g8308A61214M70906
$$ plain form
16397 632120 296926 320286 758007 76217 153302 156061 356567 556750 441653 141532
16386 25999 512281 394700 99935 469935 276038 467283 443708 278048 391089 394815
16376 394815 261164 251355 94718 564958 414206 135892 338625 428298 323609 585494
16366 585494 132313 199665 211813 268035 422207 226414 167208 75839 170013 261140 127937
16354 176967 71495 365886 31120 297191 354633 275182 173919 208499 262071 518919 -16127
16342 52344 429198 297074 -90133 303311 138289 110388 175206 194813 39719 160870 119812
16331 119812 331284 148368 181565 174073 79637 256808 80337 -98496 71763 471446 419726
16320 419726 193179 101715 499688 -86973 219552 173301 183942 129267 -20423 191218 107156
$$ packed form
16397F32120B96926K3360M37721G6217P7085K759K00506K00183j15097A41532
16386B5999M86282j17581I9935L70000j93897J91245k3575j65660J13041L726
16376C94815j33651r809I4718M70240j50752A35892K02733Q9673j04689K61885
16366E85494A32313O7352J2148N6222J54172j95793n9206G5839R4174R1127A27937
16354A76967G1495K94391C1120K66071N7442p9451j01263L4580N3572K56848a6127
16342E2344L76854j32124i0133C03311A38289k7901O4818J9607C9719J21151m1058
16331A19812K11472A48368L3197p492G9637J77171H0337i8496G1763L99683n1720
16320D19726A93179r1464L97973h6973B19552m6251J0641n4675b0423A91218q4062
$$ plain form
16309 107156 251747 124755 -154604 409784 176790 54452 102896 272508 220346 168914
16299 168914 127456 178662 13296 89860 107003 -38420 344216 359413 290426 174367 42993
16287 100042 326101 4437 154278 166755 283042 151501 -111066 287689 -44401 137162
16276 206633 -80814 -47748 231691 -122299 -116590 111487 183624 135447 -177945 114330 -277033
16264 -43127 83557 214598 20091 67614 -39987 -80804 57207 -58424 513840 17622 -122603
16252 -74612 218725 433572 -34786 -31203 -43290 339005 90118 -250536 115969 69707 128681
16241 128681 135897 114057 10798 -118362 291360 -47995 -131391 195901 78123 -243831 229087
16229 37710 -33020 57062 -39423 323039 169228 8925 138793 341582 276267 31766 228845
$$ packed form
16309A07156J44591A24755a54604D09784A76790E4452M8444J69612n2162n1432
16299A68914m1458N1206A3296P6564J7143c8420C44216J5197o8987j16059D2993
16287A00042K26059D437J49841J2477J16287j31541a11066B87689d4401A37162
16276B06633h0814L3066B31691a22299N709A11487P2137m8177a77945A14330b77033
16264d3127H3557J31041B0091M7523c9987m0817E7207e8424E13840A7622a22603
16252g4612B18725K14847c4786L583j2087C39005I0118b50536A15969m6262N8974
16241A28681P216k1840A0798a18362B91360d7995q3396A95901G8123b43831B29087
16229C7710c3020E7062c9423C23039j53811H925J29868K02789o5315C1766J97079
$$ plain form
16218 228845 -297229 22629 14126 -80598 -94308 -224852 96649 98786 195857 163160 163218 -156280
16205 122173 213166 -144923 339015 350312 -47574 -143393 -71848 -26528 54894 361244 -4263
16193 80567 82960 -30859 -204878 198910 -63731 325278 -251932 13673 68617 -139987 -13556
16181 60853 -73936 134503 339515 -113108 60819 -163530 -99924 -264242 -8421 -263055 36819
16169 -43330 68376 179264 194918 -140271 -193701 -79417 245574 50358 -89438 -157390 59784
16157 60338 -217178 -226314 59347 429668 -149598 112559 80527 305146 2549 87246 -48571
16145 -528696 -71322 212217 -40883 -160350 -28195 50664 4371 -31794 -112981 67906 -115752
16133 33939 -138899 69760 -266596 52796 81918 -13525 -117788 -210986 -260397 -186564 -205770
$$ packed form
16218B28845b97229B2629q503h0598j3710j30544I6649K137R7071l2697N8a56280
16205A22173R0993a44923C39015J1297d7574r5819P1545b6528E4894L06350d263
16193H0567K393c0859j74019A98910f3731C25278b51932A3673N4944a39987a3556
16181F0853g3936A34503K05012a13108F0819a63530O3606j64318h421k54634C6819
16169d3330F8376J10888J5654a40271n3430g9417B45574E0358h9438o7952E9784
16157F0338b17178r136E9347L70321a49598A12559l2032K24619B549Q4697d8571
16145e28696g1322B12217d0883j19467b8195E0664D371c1794q1187F7906a15752
16133C3939a38899F9760b66596E2796K9122a3525j04263r3198m9411P3833j9206
$$ plain form
16122 -205770 216964 182612 -163280 -67693 176520 139534 -60315 155582 -25223 155655
16111 40997 -91615 61501 -105951 42443 -5684 -1899 13831 -105316 81622 -261355 230829
16099 209602 -26001 -361949 43349 219709 162545 212957 -101618 -23881 78036 342461 -318470
16087 295462 -2085 72357 218972 -364063 74023 96975 -269400 -250463 233325 17114 -34838
16075 103335 -54964 10368 187477 -33554 12997 -16722 -288261 -89220 -133352 124229 97051
16064 97051 56675 -507812 162323 -146225 -205385 132161 164587 -70468 -6000 369221 -102820
16052 325122 -148803 94322 -310785 35464 -275096 -106336 -278562 34734 -67170 -116791
16042 -116791 -211512 111086 -217157 -117 -226779 -326132 52809 -103668 -32033 -460239 309354
$$ packed form
16122b05770B16964l4352a63280f7693A76520l6986f0315A55582b5223A55655
16111D0997i1615F1501a05951D2443e684a899A3831a05316H1622b61355B30829
16099B09602b6001l35948D3349J76360n7164N0412a01618b3881G8036K64425c18470
16087B95462b085G2357J46615c64063G4023K2952b69400J8937B33325A7114c4838
16075A03335e4964A0368J77109c3554A2997a6722k71539h9220m4132A24229k7178
16064I7051m0376e07812A62323a46225n9160A32161L2426g0468f000C69221a02820
16052C25122a48803I4322c10785C5464b75096a06336j72226C4734f7170m9621
16042a16791r4721A11086b17157a17k26662r9353E2809a03668c2033m28206C09354
$$ plain form
16030 -62238 -364080 -125247 -32773 -24344 -219381 -79291 184379 -61641 -89494 -409411 122332
16018 -18785 -256593 33514 172090 248120 -187721 1117 -7229 73547 -151064 -101447 148968
16006 109519 -141328 -94892 164797 51354 342067 -261033 -72771 -154163 -84434 -40425 -52731
15995 -52731 126457 51156 40780 -156703 -48605 -135250 109576 -186939 76289 -168026 74013
15983 402536 2330 573209 325399 493993 303098 -108282 203052 -222964 74175 7711
15972 198767 438450 -84662 114544 -121375 169695 -129192 61502 -179802 -141674 -213832
15962 -213832 257608 -49129 153237 -146527 -243363 -34078 -73199 -243055 10917 -45537 -11878
15950 -87671 -45484 15868 -147963 -112814 250726 78259 -231273 148597 -180443 -104583 22681
$$ packed form
16030f2238l01842a25247c2773Q429j95037g9291A84379f1641k7853l19917A22332
16018a8785k37808C3514J38576P6030a87721A117g229G3547a51064M9617A48968
16006A09519a41328M6436A64797E1354K90713b61033g2771q1392O9729d0425j2306
15995e2731A26457E1156j0376a56703d8605q6645A09576a86939G6289a68026G4013
15983D02536B330N70879k47810J68594j90895a08282B03052b22964G4175G711
15972A98767K39683h4662A14544a21375A69695a29192F1502a79802L8128p2158
15962b13832B57608d9129A53237a46527r6836c4078l9121j69856A0917d5537a1878
15950h7671M2187A5868a47963L5149B50726G8259b31273A48597a80443P5860B2681
$$ plain form
15938 258075 -242989 -31428 -40042 -202040 -32011 -117516 -108379 74852 53017 -36912 40127
15926 -153400 -389017 -150144 -336030 -15304 -96383 274076 54374 283685 -95847 70272
15915 40490 -221797 -107751 77705 -80589 83963 -573913 24680 79184 -81415 243776 -63667
15903 -106332 144659 164158 -271277 -10902 -94108 45807 -159762 332948 -6872 -94090 100112
15891 124706 -172932 117016 96773 213679 262792 125829 -21413 -341896 -138065 42494
15880 -341462 -178324 -102910 138131 -201340 -349141 185613 -200186 202914 16159 -112689
15869 67006 -191265 -88297 -140931 -235550 -118837 152283 -210033 -184412 -59310 -27120 -64049
15858 -64049 404464 143231 36964 -100867 277340 -188345 -77762 -124096 2146 148797 -16582
$$ packed form
15938B58075b42989c1428q614j61998c2011q5505R137G4852k1835c6912D0127
15926a53400k35617a50144j85886a5304q1079B74076E4374K29311i5847G0272
15915D0490b21797a07751G7705h0589H3963e73913B4680N4504h1415B43776f3667
15903a06332A44659J9499b71277a0902q3206D5807a59762C32948f872q7218A00112
15891A24706a72932A17016k0243J16906M9113A25829b1413l20483a38065D2494
15880c41462J63138P5414A38131b01340j47801A85613b00186B02914A6159a12689
15869F7006a91265h8297n2634r4619J16713A52283b10033K5621e9310b7120l6929
15858f4049D04464A43231C6964a00867B77340a88345g7762m6334B146J46651a6582
$$ plain form
15846 204627 15203 14914 73738 -53406 143164 -241428 -299020 -109135 -198732 104103 -152296
15834 -73585 -62570 -295575 72543 -140046 144604 -152351 -42483 -300106 -87450 -31342 -66171
15823 -66171 206690 -131195 -249933 -93617 128917 -106264 -345973 -50599 151247 106989
15813 106989 59510 11286 -239042 -387327 -289416 129368 -207374 47152 -35551 -94167 -74726
15802 -74726 63467 71303 114225 81040 46608 -12373 -65271 92838 -149915 19452 148821
15791 148821 159019 147813 -159156 -294633 30233 69005 280979 223325 3681 263946 188438
15780 188438 -86719 -284615 -206753 241875 -147068 -70423 -148610 -12410 -301487 -185687
15770 -185687 -277871 126637 81105 -174164 -195474 29525 -41198 156259 305274 212675 -265174
$$ packed form
15846B04627A5203k89N8824e3406A43164b41428n7592a09135q9597A04103a52296
15834g3585J1015k33005G2543a40046A44604a52351d2483k57623h7450c1342l4829
15823f6171B06690a31195j18738i3617A28917a06264k39709e0599A51247m4258
15813A06989m7479A1286b39042j48285R7911A29368b07374D7152c5551n8616J9441
15802g4726F3467P836M2922l3185l4432a2373n2898I2838a49915A9452J29369
15791A48821J0198j1206a59156j35477C0233L8772K11974n7654C681K60265p5508
15780A88438h6719j97896P7862B41875a47068g0423p8187a2410k89077J15800
15770a85687r2184A26637m5532a74164k1310B9525d1198A56259J49015r2599b65174
$$ plain form
15758 -150157 228157 -144889 89554 -7359 121941 56455 360659 -157474 -330409 -42821
15747 74384 -40346 -32957 -87087 210016 113285 -390668 -351907 -292433 -109864 88629 121348
15736 121348 107494 -130958 -306679 36807 -116366 -17895 170552 -159027 -37992 77903
15725 -243568 249919 -26171 289689 7158 -126589 -16416 -58933 -27590 36857 -147591 127313
15713 -156147 -125309 -29194 244717 62918 -8741 -46014 -140657 196202 -52668 -21968 52403
15701 -236782 -32837 110277 23758 -47567 -111194 -260844 -73721 -346847 139750 148320 338740
15690 338740 283856 14036 145071 188899 67637 -140869 19561 -174187 19245 -150485 -213729
15679 -213729 -165060 -186821 -242810 -53293 174201 14630 16383 69624 -68859 201312 39185
$$ packed form
15758a50157B28157a44889H9554g359A21941E6455L04204a57474j72935d2821
15747G4384d0346P389n4130B10016r6731c90668L8761N9474a09864H8629L2719
15736A21348j3854a30958j75721C6807a16366a7895A70552a59027c7992G7903
15725b43568B49919b6171B89689G158a26589a6416m2517b7590C6857a47591A27313
15713a56147L0838b9194B44717F2918h741l7273r4643A96202e2668b1968E2403
15701b36782c2837A10277B3758d7567o3627j49650g3721k73126A39750Q570J90420
15690C38740n4884A4036J31035M3828F7637a40869A9561a74187A9245a50485o3244
15679b13729M8669k1761n5989e3293A74201A4630J753N3241f8859B01312C9185
$$ plain form
15667 11927 -83999 -9642 -137251 142891 -289082 66699 -405764 48739 -180380 6046 277134
15656 277134 -261676 39829 79094 103862 -155038 83460 122361 -84645 75065 -125699 60594
15644 251015 199764 -299481 154704 -175582 -322423 -39035 -149647 61350 -151387 116108
15633 57756 10312 9318 120774 41364 147766 28383 -95317 199601 103869 -88879 74598
15621 -210552 -239400 30173 301358 17983 115087 -314668 3307 -63243 261063 296803 -107999
15609 -139653 199102 66514 290380 97820 47151 -41074 -309143 81725 186334 -458067
15598 101272 303273 204936 -48050 -42672 64675 -22777 -178575 52404 23545 -170824 19774
15586 282528 -112130 228179 526695 72070 -35267 -18451 -85731 87424 194504 20041 84387
$$ packed form
15667A1927h3999i642j27609A42891b89082F6699d05764D8739a80380F046K71088
15656B77134b61676C9829L9265K4768a55038H3460L8901h4645G5065a25699F0594
15644B51015n1251b99481A54704a75582j46841c9035j10612F1350a51387A16108
15633E7756A0312r94J11456D1364J06402B8383i5317A99601r5732h8879G4598
15621b10552k8848C0173K71185A7983R7104c14668C307f3243B61063L5740a07999
15609a39653A99102F6514K23866I7820D7151d1074k68069H1725J04609d58067
15598A01272K02001r8337d8050N378F4675b2777j55798E2404B3545a70824A9774
15586B82528a12130B28179K98516G2070c5267J6816o7280H7424J07080B0041O4346
$$ plain form
15575 84387 -12888 -187277 35233 108226 244595 -263284 24351 -4749 126633 -187256 195410
15563 34034 -61978 41665 21937 58052 111047 21951 -208785 1100 275916 68329 -166330
15551 -111979 273958 -144889 110235 -112894 -144112 53015 -112754 -285178 -140949 -264297
15541 -264297 -92628 226949 -343368 -190890 -31905 152609 208758 -36527 9976 -63130 118155
15529 112965 -262799 224204 144016 -298938 452863 257413 20750 41905 -25131 -25635 53361
15517 -46772 113069 -75654 -273432 123 -49623 -9296 228777 -125421 87720 97504 -309729
15505 -148067 178566 25425 -310183 -12374 -244357 -48178 -321851 -130133 -45776 147142
15494 22685 -214359 156406 -424019 -271120 -25961 -292479 -189446 78519 117142 -250316
$$ packed form
15575H4387a2888j74389C5233P2993J36369b63284B4351d749A26633a87256A95410
15563C4034f1978D1665j9728L6115N2995B1951b08785A100K74816F8329a66330
15551a11979B73958a44889A10235a12894l1218E3015a12754j72424a40949j23348
15541b64297i2628B26949c43368J52478c1905A52609N6149c6527I976f3130A18155
15529A12965b62799B24204q0188b98938D52863j95450B0750K1155b5131n04E3361
15517d6772A13069g5654j97778A23d9623i296B28777a25421H7720R784c09729
15505a48067A78566B5425c10183a2374k31983d8178k73673a30133d5776A47142
15494B2685b14359A56406d24019J52899b5961k66518J03033G8519L8623b50316
$$ plain form
15483 19773 101908 114316 -87440 -170104 303827 -15750 49681 28257 -62399 -76072 31761
15471 -30936 31722 -108197 40524 287945 -73760 -254071 152630 6229 286859 219255 -114531
15459 -22402 96572 -372376 96886 37677 -94182 -249013 173332 14126 189802 97421 127350
15448 127350 -179506 -155805 -32295 -164127 143280 -11435 196122 77226 54467 -145003
15437 -316578 -489754 -38153 -316725 84764 -111539 84510 266492 82853 67197 29751 -159949
15425 95336 -31244 -75038 -191584 47279 104338 8752 -388942 -95095 -302627 -213338 -62062
15413 -173473 -197991 48166 -29076 -165805 -46784 -131301 298151 77107 54870 25383 8884
15401 184997 167952 110818 209913 374152 70452 -43324 -213316 -5218 288369 -156311 -61732
$$ packed form
15483A9773Q2135J2408h7440q2664C03827a5750D9681k1424f2399j3673C1761
15471c0936C1722a08197D0524K47421g3760j80311A52630F229K80630o7604a14531
15459b2402I6572c72376I6886C7677i4182j54831A73332A4126J75676r2381K9929
15448A27350a79506K3701c2295j31832A43280a1435A96122G7226k2759a45003
15437c16578j73176c8153k78572H4764a11539H4510J81982H2853j5656B9751a59949
15425I5336c1244m3794j16546D7279N7059H752c88942i5095k07532Q9289f2062
15413a73473k4518D8166b9076j36729d6784q4517B98151G7107k2237B5383H884
15401A84997j7045n7134R9095J64239G0452d3324j69992e218B88369a56311f1732
$$ plain form
15389 30616 -38589 15994 362967 15018 -87918 28616 -167833 -45186 -174282 -133326 283410
15377 42231 -114785 278747 -101864 46240 -62658 -2861 77365 338005 -313898 -21559 -372236
15366 -372236 -170211 -88085 -221734 -203025 284797 174970 56976 -70461 373829 -55079
15355 27740 422394 191866 139632 -184865 -58557 -33451 391911 100197 101047 -221671 18347
15343 69704 -490751 -86061 -159799 35438 339450 -52595 215864 313735 -45421 -42986 163011
15331 -42202 -142751 -55746 -186851 -204277 -242627 49478 219746 160686 122412 -246220 107137
15319 -7836 83344 295627 30135 -143620 -134293 91718 -14413 1095 88572 305214 430219
15308 430219 -231323 -89929 -327923 25071 -183509 -18320 -203291 521361 -80283 464353
$$ packed form
15389C0616c8589A5994L46973A5018h7918B8616a67833d5186j29096M0956B83410
15377D2231a14785B78747a01864D6240f2658b861G7365K60640c13898b1559l50677
15366c72236a70211Q2126j33649J8709B84797j09827E6976g0461C73829e5079
15355B7740L94654A91866n2234a84865e8557K5106C91911A00197Q50b21671A8347
15343F9704d90751h6061p3738C5438L04012e2595B15864R7871d5421K435A63011
15331d2202j00549e5746j31105j7426l8350D9478J70268n9060l8274b46220A07137
15319g836H3344K12283C0135a43620R327I1718a4413A095Q7477K16642J25005
15308D30219b31323h9929k37994B5071a83509a8320j84971E21361h0283D64353
$$ plain form
15297 286529 80040 104867 -81525 -124028 104364 12980 351563 -59278 386146 88603 305998
15286 305998 150077 241437 187819 177785 -176012 348193 160092 -356311 375003 114989
15275 -32103 101958 -131781 -118581 237030 26182 -277133 173465 326261 -230208 -280613
15265 -280613 -196899 138010 21026 11243 41180 334915 -168742 21274 388732 -108335 -128447
15254 -128447 -63520 179484 480050 281519 540407 635216 857397 1485655 1088264 1454093
15244 1454093 742983 197977 73471 142352 227578 160160 83221 149171 76093 -52694 -62817
15233 -62817 239965 -84785 -99145 146968 58074 -120129 -4009 -223332 286263 220853 208205
15222 208205 -116420 174407 177007 207796 207600 164466 -55534 179437 132138 392048 25781
$$ packed form
15297B86529H0040K4827h1525m2503A04364A2980L38583e9278C86146H8603K17395
15286C05998A50077R1360n3618j0034a76012C48193A60092c56311C75003A14989
15275c2103A01958a31781J3200B37030B6182b77133A73465J52796b30208n0405
15265b80613Q3714A38010B1026r783K9937K93735a68742B1274L67458a08335k0112
15254a28447f3520A79484L00566j98531K58888R4809K22181O28258l97391L65829
15244A454093p11110A97977G3471O8881Q5226o7418p6939O5950p3078e2694j0123
15233f2817B39965h4785j4360A46968E8074a20129d009k19323B86263o5410j2648
15222B08205a16420A74407K600L0789j96m3134e5534A79437m7299K59910B5781
$$ plain form
15210 -76706 -24881 -63248 190716 152601 11584 -24895 -177096 127438 -135434 144840 32487
15198 275835 -115885 58416 302459 105617 138764 60671 120883 51636 227451 166833 -169798
15186 284733 180743 51910 -69989 -48690 -39716 31974 -30144 43191 137121 -117071 135701
15174 -27141 200581 -25398 -79672 115764 86342 13231 -193431 287179 110831 -4385 234884
15162 -197199 306330 387755 39698 89621 94769 -73803 -227504 -20519 -3849 125123 114178
15151 114178 335021 280597 286033 230372 160639 206681 201698 84571 167486 300116 132395
15139 -146743 13284 2223 -3464 -161381 52663 422116 -53690 526103 -76388 -65792 -207252
15128 -207252 345486 104747 22079 221087 92029 69641 127207 -5418 117163 309142 277726
$$ packed form
15210g6706b4881l8367A90716l8115A1584b4895j52201A27438a35434A44840C2487
15198B75835a15885E8416K44043A05617L3147F0671O0212E1636J75815o0618a69798
15186B84733j03990E1910f9989K1299Q974C1974c0144D3191R3930a17071A35701
15174b7141B00581b5398n4274A15764k9422A3231a93431B87179A10831d385B34884
15162a97199C06330Q1425C9698M9923N148g3803j53701b0519c849A25123j0945
15151A14178K20843n4424N436n5661o9733M6042m983H4571Q2915J32630A32395
15139a46743A3284B223c464j57917E2663L69453e3690E26103g6388J0596j41460
15128b07252C45486A04747B2079J99008I2029k2388N7566e418A17163J91979l1416
$$ plain form
15117 277726 133927 65340 197195 172165 100049 94406 238618 152420 -152109 244135 185297
15106 185297 298039 90066 -274233 52311 252939 7639 231298 232065 77684 80399 217539
15095 217539 367308 444510 214426 326354 26097 382398 151289 363760 21302 340950
15085 340950 38585 38841 137295 248349 119244 171460 271159 457337 -197577 513985 28676
15073 174542 496941 141923 490741 200655 251737 97548 407999 -152255 225386 213693
15063 213693 -34087 443448 444948 28895 357755 164773 -81487 360666 22009 64223 109039
15052 109039 476842 271778 155955 -267432 283416 342026 -46377 17612 85667 144822
15042 144822 589711 -249077 72899 143484 201157 155049 -55329 85439 419631 224596 225495
$$ packed form
15117B77726A33927F5340J31855k5030p2116n643J44212q6198a52109B44135n8838
15106A85297J12742I0066b74233E2311K00628G639K23659P67G7684K715J37140
15095B17539J49769P7202B14426J11928B6097L56301A51289K12471B1302L19648
15085C40950C8585K56R8454J11054A19244N2216R9699J86178a97577E13985B8676
15073A74542L22399A41923L48818B00655N1082I7548L10451a52255B25386j1693
15063B13693c4087D43448J500B8895L28860A64773h1487C60666B2009M2214M4816
15052A09039L67803k05064j15823b67432B83416N8610d6377A7612O8055N9155
15042A44822M44889b49077G2899P0585N7673m6108e5329H5439L34192j95035Q99
$$ plain form
15031 225495 336859 -141311 501940 215450 295413 282567 237963 204701 -81649 161300
15020 401926 39618 406260 273492 57052 473790 299580 112289 239196 -26385 -80189
15010 -80189 173457 444947 -14209 184147 289132 97370 499761 553933 48248 -159058
14999 256377 53075 377684 116409 117675 251898 473949 -251350 281040 219950 493215
14989 493215 521293 138020 241902 35543 34191 443383 273435 229665 155715 18149 404458
14978 404458 35254 356125 36839 247207 46765 314541 453858 175107 406303 156634
14967 228596 345502 200817 583273 185698 111638 204449 239307 423463 -38727 179376
14956 303688 28227 149068 320552 410949 287766 402227 548871 289641 -71869 -43712
$$ packed form
15031B25495J11364a41311E01940B15450P9963j2846m4604l3262h1649A61300
15020D01926C9618L66642j32768E7052M16738j74210A12289J26907b6385n3804
15010h0189A73457K71490a4209A84147J04985I7370M02391N4172D8248a59058
14999B56377E3075L24609A16409J266J34223K22051b51350B81040o1090K73265
14989D93215K8078A38020J03882C5543j352M09192j69948m3770p3950A8149L86309
14978D04458C5254L20871C6839K10368D6765K67776J39317A75107K31196A56634
14967B28596J16906j44685L82456A85698p4060R2811L4858J84156c8727A79376
14956C03688B8227J20841J71484R0397j23183J14461J46644k59230g1869K8157
$$ plain form
14946 -43712 291688 285856 447624 104793 471604 187660 175303 330847 212482 329143
14936 329143 223767 102639 65106 347213 348941 92586 478636 134855 337743 255446
14926 255446 331334 148956 263224 255354 527484 261353 526115 306228 335261 535211
14916 535211 230353 609027 290625 104191 241114 70742 327401 339863 504601 140841
14905 237007 387125 405572 166011 630383 63762 -69322 147836 251846 142757 423038
14895 423038 787904 346661 442091 105163 122436 196383 54578 509433 413477 226528
14885 226528 387745 273547 150958 444833 729502 15418 187903 300549 309520 392284
14875 392284 321472 628464 173906 353988 306773 736764 589768 336421 630867 386091
$$ packed form
14946d3712B91688n832J61768A04793L66811A87660j2357J55544j18365J16661
14936C29143j05376A02639l7533K82107J728I2586L86050A34855K02888q2297
14926B55446P5888A48956J14268p870K72130B61353K64762k19887K9033J99950
14916E35211B30353L78674B90625A04191J36923G0742K56659J2462J64738A40841
14905B37007J50118J8447A66011M64372F3762f9322A47836J04010j09089K80281
14895D23038L64866C46661R5430A05163J7273P3947E4578M54855r5956j86949
14885B26528J61217j14198j22589K93875K84669A5418J72485J12646Q971Q2764
14875C92284p0812L06992A73906J80082m7215M29991j46996k53347K94446k44776
$$ plain form
14865 386091 476441 423051 729439 590062 435446 402600 236259 427194 496070 390606
14855 390606 362688 547846 475514 -243340 513009 518714 560737 530702 -142407 474840 352599
14844 352599 248674 162463 534098 529648 453400 342695 479865 568876 224923 284672 225554
14833 225554 94470 778189 625822 175618 396310 541830 474521 668039 470414 783751
14823 783751 370437 450465 433431 590130 772678 512175 508558 568870 491257 675655 492227
14812 492227 833198 513288 562200 296217 904350 347482 584191 614556 678949 498541
14802 498541 156725 395007 554500 474274 572742 409152 595127 268891 572732 465875
14792 465875 638553 491453 470764 436812 315342 382519 676843 488455 512076 332989
$$ packed form
14865C86091R0350n3390L06388j39377j54616l2846j66341J90935O8876j05464
14855C90606k7918J85158p2332b43340E13009N705M2023l0035a42407D74840j22241
14844C52599j03925q6211L71635m450p6248j10705J37170Q9011B24923N9749n9118
14833B25554I4470O83719j52367A75618K20692J45520o7309J93518j97625L13337
14823G83751C70437Q0028j7034J56699J82548k60503l617O0312p7613J84398j83428
14812D92227L40971l19910M8912k65983O08133C47482K36709L0365O4393j80408
14802D98541A56725K38282J59493q0226R8468j63590J85975B68891L03841j06857
14792D65875J72678j47100k0689l3952j21470O7177K94324j88388K3621j79087
$$ plain form
14782 332989 732043 349025 457164 761177 352067 767523 605572 413123 633400 434358
14772 434358 763795 541772 866761 773094 240001 250756 1120459 616736 392734 465254
14762 465254 426829 577194 712064 570661 452329 907843 572393 526890 812291 846044
14752 846044 807230 784351 793396 604251 710721 349619 707955 854299 536651 732101
14742 732101 703346 599384 499020 513343 639409 607949 692572 599780 428580 808889
14732 808889 857151 710837 653577 446913 820148 822158 734536 579203 541477 989866 808813
14721 808813 1005455 916945 910112 850684 581835 740097 1071277 734375 890443 514470
14711 514470 791565 959784 1023192 626103 898379 847981 860269 500442 862887 803233
$$ packed form
14782C32989L99054C49025J08139L04013C52067M15456j61951j92449K20277j99042
14772D34358L29437k22023L24989r3667B40001J0755Q69703n03723k24002P2520
14762D65254l8425J50365J34870j41403j18332M55514l35450m5503K85401L3753
14752H46044l8814k2879R045j89145J06470C49619L58336J46344l17648J95450
14742G32101k8755j03962j00364J4323J26066l1460Q4623r2792j71200L80309
14732H08889M8262j46314n7260k06664L73235K010q7622j55333l7726M48389j81053
14721H08813J96642q8510o833n9428k68849J58262L31180l36902J56068l75973
14711E14470K77095J68219O3408l97089K72276n0398J2288l59827L62445n9654
$$ plain form
14701 803233 860556 1013320 646886 791772 998082 1010688 1040982 1213071 731111 894377
14691 894377 1002625 1123052 725834 919286 950240 993301 915139 694476 772912 972765
14681 972765 980830 1123618 1078617 772476 1003461 846070 1174648 992503 841398 1470320
14671 1470320 936292 878498 1208045 834350 893380 1069585 947761 816961 1175000 671676
14661 671676 1038089 1177377 1151034 1368155 1261833 1096442 1075791 1274365 1283058 1041610
14651 1041610 1079694 1057765 1204339 1359109 1087736 1371420 1667642 994752 1465132 1018989
14641 1018989 1225221 1136492 1214546 1106899 1414282 1579813 1051107 1425755 1142505 1384266
14631 1384266 1086295 1242055 1553570 1428521 1355641 1334178 1600376 1416470 1758730 1542888
$$ packed form
14701H03233N7323J52764l66434J44886K06310J2606L0294J72089m81960J63266
14691H94377J08248J20427l97218J93452L0954M3061p8162k20663P8436J99853
14681I72765Q065J42788m5001l06141K30985j57391L28578j82145j51105O28922
14671A470320n34028n7794L29547l73695N9030J76205j21824j30800L58039n03324
14661F71676L66413J39288k6343K17121j06322j65391k0651J98574Q693k41448
14651A041610L8084k1929J46574J54770k71373K83684K96222o72890M70380m46143
14641A018989K06232q8729P8054j07647L07383J65531n28706L74648k83250K41761
14631A384266k97971J55760L11515j25049p2880k1463K66198j83906L42260k15842
$$ plain form
14621 1542888 1627746 1590390 1501847 1523389 1280216 1274900 1346673 1463140 1448038 1837174 1842717
14610 1842717 1642376 1660909 1461204 1442876 1921262 1675902 1556011 1559818 1510671 1491263
14600 1491263 1549083 1531685 1626492 1402941 1746077 1995643 1705656 1582171 1807165 1572214
14590 1572214 1614981 1796058 1450227 1980759 1825497 1546181 1725616 1742638 1702866 1902582
14580 1902582 2288053 2222428 2041716 2023658 2046172 1874172 1997007 2237222 2083155 1880517
14570 1880517 2231781 2316815 2337736 2287735 2442423 2420957 2522009 2712324 2704949 2631765 2555915
14559 2555915 2772668 3022794 3160155 2816519 3214304 3396016 3875886 3738344 4976930
14550 4976930 5671199 6801703 10680842 20937809 42648488 43850283 23426578 9740245
$$ packed form
14621A542888Q4858l7356q8543K1542k43173n316P1773J16467j5102L89136N543
14610A842717k00341J8533j99705j8328M78386k45360j19891L807m9147j9408
14600A491263N7820j7398R4807k23551L43136K49566k89987j23485K24994k34951
14590A572214M2767J81077l45831N30532j55262k79316J79435J7022l9772J99716
14580A902582L85471o5625j80712j8058K2514j72000J22835K40215j54067k02638
14570A880517L51264Q5034K0921n0001J54688k1466J01052J90315p375p3184p5850
14559B555915K16753K50126J37361l43636L97785J81712M79870j37542J238586
14550D976930O94269J130504L879139J0256967K1710679J201795k0423705I740245
$$ plain form
14541 4491321 2738554 2274308 1939579 1885799 1966172 1564353 2220227 2305443 2093773 1889321
14531 1889321 2189331 2194511 1977225 2027057 2635521 2225019 2800313 2175398 2337907 2370600
14521 2370600 2651305 2549015 2366688 2639978 2534091 2684865 2363068 2686646 2587168 2922873
14511 2922873 3005512 2894246 2598119 2891764 2893438 3223327 2962952 2654109 2815808 3290100
14501 3290100 2920227 3139218 2991883 3373448 3274869 3581439 3339702 3272013 3599424 3506339
14491 3506339 3486371 3484929 3688325 3462519 3647285 3208272 3610706 3923336 3936098 3961717
14481 3961717 3824531 3969145 4076816 4136918 3901440 4114673 4328415 4369376 4291560 4356859
14471 4356859 4280322 4416024 4539404 4129606 4227618 4472477 4438190 4655875 4972205 4720551
$$ packed form
14541D491321j752767m64246l34729n3780Q0373m01819O55874Q5216k11670k04452
14531A889321L00010N180k17286M9832O08464m10502N75294o24915J62509L2693
14521B370600K80705j02290j82327K73290j05887J50774l21797L23578r9478L35705
14511B922873Q2639j11266k96127K93645J674L29889k60375l08843J61699M74292
14501C290100l69873K18991j47335L81565r8579L06570k41737o7689L27411r3085
14491C506339j9968j442K03396k25806J84766m39013M02434L12630J2762K5619
14481C961717j37186J44614J07671O0102k35478K13233K13742M0961p7816O5299
14471D356859p6537J35702J23380m09798R8012K44859l4287K17685L16330k51654
$$ plain form
14461 4720551 4988627 4649238 5188414 4807640 5044310 5076139 5181235 5121720 5062417 5455962
14451 5455962 5226748 5461003 5470408 5521201 5759937 5298350 5766136 5935934 6153758 6114602
14441 6114602 5963646 6189076 6382958 6825802 6478582 6485686 6426944 6589250 6591878 7007981
14431 7007981 6941390 6845533 7150624 7039455 7174595 7385882 7506236 7500320 7606693 7801799
14421 7801799 7689920 7988711 8030436 7871278 8188126 8503447 8939478 8771608 8953569 8573838
14411 8573838 9215165 9013909 9291454 9082421 9336144 10055448 9866741 10087396 10349481
14402 10349481 10076308 10564473 10544785 10809059 11097945 11516213 11418854 11312870 11447989 11898181
14392 11898181 12212206 12347368 12624231 12632353 12863205 13166794 13389764 13543827 14188546 14149107
$$ packed form
14461D720551K68076l39389N39176l80774K36670L1829J05096n9515n9303L93545
14451E455962k29214K34255R405N0793K38736m61587M67786J69798K17824l9156
14441F114602j50956K25430J93882M42844l47220P104n8742J62306K628M16103
14431G007981o6591r5857L05091j11169J35140K11287J20354n916J06373J95106
14421G801799j11879K98791M1725j59158L16848L15321M36031j67870J81961l79731
14411H573838O41327k01256K77545k09033K53723P19304j88707K20655K62085
14402A0349481k73173M88165j9688K64274K88886M18268r7359j05984J35119M50192
14392A1898181L14025J35162K76863Q122K30852L03589K22970J54063O44719l9439
$$ plain form
14382 14149107 14731414 14822554 14743838 15092477 15654966 15793875 16016857 16482272 17027278 16759616
14372 16759616 17268394 18054575 18235377 18246561 18909932 19137588 19648537 19766223 20418768
14363 20418768 21194475 21289200 21473531 22314253 22596769 22946153 23638455 24390041 24914902
14354 24914902 25435760 25925485 26491424 27058710 27612359 28316634 29077586 30108491 30856581
14345 30856581 31501226 32054192 33184301 33991420 34686114 35365636 37027627 37524503 39141469
14336 39141469 39957238 41044562 42335692 43565802 45086070 46021720 47804923 49171213
14328 49171213 50887808 52435647 54105764 55779496 57399045 59983380 61964563 63810541
14320 63810541 66145347 68764478 71115512 74175627 77039581 79848115 82551762 85889313
$$ packed form
14382A4149107N82307R1140p8716L48639N62489J38909K22982M65415N45006k67662
14372A6759616N08778P86181J80802J1184O63371K27656N10949J17686O52545
14363B0418768P75707R4725J84331Q40722K82516L49384O92302P51586N24861
14354B4914902N20858M89725N65939N67286N53649P04275P60952J030905P48090
14345C0856581O44645N52966J130109Q07119O94694O79522J661991M96876J616966
14336C9141469Q15769J087324J291130J230110J520268R35650J783203J366290
14328D9171213J716595J547839J670117J673732J619549K584335J981183J845978
14320F3810541K334806K619131K351034L060115K863954K808534K703647L337551
$$ plain form
14312 85889313 89705409 93475570 97074635 101746845 105818857 110844801 115224396 120685956
14304 120685956 126286548 131721956 137804054 144487232 151102270 158062367 165738040 173916774
14296 173916774 182416107 191320420 201057429 210686686 221324829 232677066 244119604
14289 244119604 256184556 269331282 282336209 296101010 310330084 324731231 339339313
14282 339339313 353990394 368951905 383693374 397899494 411678632 425206974 436871748
14275 436871748 447711438 457075049 463752745 466913229 466210084 463024377 457866278 458267109
14267 458267109 453618107 447394089 439932647 428644206 415298802 400588680 385532725
14260 385532725 369249770 353325182 337358243 321536283 306350875 291348939 277982216
$$ packed form
14312H5889313L816096L770161L599065M672210M072012N025944M379595N461560
14304A20685956N600592N435408O082098O683178O615038O960097P675673Q178734
14296A73916774Q499333Q904313R737009R629257J0638143J1352237J1442538
14289B44119604J2064952J3146726J3004927J3764801J4229074J4401147J4608082
14282C39339313J4651081J4961511J4741469J4206120J3779138J3528342J1664774
14275D36871748J0839690R363611O677696L160484p03145l185707n158099M00831
14267D58267109m649002o224018p461442j1288441j3345404j4710122j5055955
14260C85532725j6282955j5924588j5966939j5821960j5185408j5001936j3366723
$$ plain form
14253 277982216 263931937 250568285 237935184 226151667 214937752 203730290 193968732
14246 193968732 184296980 175546495 167503282 159668180 151639569 144552078 138077003 131408941
14238 131408941 126195704 120977177 115265943 110519084 105744457 101311928 97375115 93761939
14230 93761939 90097214 86488928 83140924 79747737 76735744 73928412 71305726 68420447
14222 68420447 66710737 64184043 62363729 59977317 57512956 55481299 54415851 52281412
14214 52281412 51230855 49847471 48192619 46533091 45361348 43768638 42639585 41480172
14206 41480172 40734481 39116862 37741364 36750979 35803965 35504466 34407793 33646034 32363349
14197 32363349 31726363 30338739 29761459 29193395 28999076 27705192 26688234 26446766 25672255
$$ packed form
14253B77982216j4050279j3363652j2633101j1783517j1213915j1207462r761558
14246A93968732r671752q750485q043213p835102q028611p087491o475075o668062
14238A31408941n213237n218527n711234m746859m774627m432529l936813l613176
14230I3761939l664725l608286l348004l393187l011993k807332k622686k885279
14222F8420447j709710k526694j820314k386412k464361k031657j065448k134439
14214E2281412j050557j383384j654852j659528j171743j592710j129053j159413
14206D1480172p45691j617619j375498r90385r47014k99499j096673p61759j282685
14197C2363349o36986j387624n77280n68064j94319j293884j016958k41468p74511
$$ plain form
14188 25672255 25268283 24588647 24162699 23481083 22997831 22485171 21972593 21337515 20788671
14179 20788671 20266574 20256480 19561350 18954527 18813735 18348685 18442025 18236064 17552030 17078669
14169 17078669 16808140 16372876 16278609 16256260 15556592 15193298 15204011 14898994 14509169 14241228
14159 14241228 14260750 13786987 13815857 13561371 12948342 12797326 12555091 12719798 12189951 12060751
14149 12060751 11943870 11952953 11672628 11205225 11124279 10939751 10559915 10705556 10468194 10523369
14139 10523369 10216158 10398781 9814783 9698669 8926637 9766844 9138836 8773590 8690458
14130 8690458 8883885 8597233 8400578 9227684 8532230 8437267 8271184 7991266 8378288 7884217
14120 7884217 7403914 7385721 7578692 7451333 7082158 7064074 7083418 6986395 6998169 7249509
$$ packed form
14188B5672255m03972o79636m25948o81616m83252n12660n12578o35078n48844
14179B0788671n22097j0094o95130o06823j40792m65050R3340k05961o84034m73361
14169A7078669k70529m35264r4267k2349o99668l63294J0713l05017l89825k67941
14159A4241228J9522m73763K8870k54486o13029j51016k42235J64707n29847j29200
14149A2060751j16881R083k80325m67403q0946j84528l79836J45641k37362N5175
14139A0523369l07211J82623n83998j16114p72032Q40207o28008l65246q3132
14130H690458J93427k86652j96655Q27106o95454r4963j66083k79918L87022m94071
14120G884217m80303j8193J92971j27359l69175j8084J9344r7023J1774K51340
$$ plain form
14110 7249509 7038252 6715365 6730608 6861581 6491205 6394377 6522791 6184862 6085856 6293922
14100 6293922 5994915 5898034 5766915 5673548 5720989 5955397 5687687 5671019 5465912 5459895
14090 5459895 5620572 5176442 5142637 5084219 4913275 5087010 4987728 5287910 5247949 4661657
14080 4661657 4921436 4808778 4639465 4541056 4459036 4454136 4603208 4470450 4482753 4589758
14070 4589758 4434493 4355875 4369827 4105131 4078587 3654617 4120510 4030412 4021305 3933301 3985380
14059 3985380 3550584 4205534 3972114 3809112 4074840 3914662 3834773 3902597 3415412 4035145
14049 4035145 3342014 3330279 3375845 3122675 3461635 3136897 3322624 3093670 3141815 3289766
14039 3289766 3034612 2949167 3314503 2787847 2924392 3373223 3422777 3146229 3105733 3072020
$$ packed form
14110G249509k11257l22887J5243J30973l70376r6828J28414l37929r9006K08066
14100F293922k99007r6881j31119r3367M7441K34408k67710j6668k05107o017
14090E459895J60677m44130l3805n8418j70944J73735r9282L00182l9961n86292
14080D661657K59779j12658j69313r8409q2020m900J49072j32758J2303J07005
14070D589758j55265p8618J3952k64696k6544m23970M65893r0098r107q8004N2079
14059C985380m34796O54950k33420j63002K65728j60178p9889O7824m87185O19733
14049D035145o93131j1735M5566k53170L38960l24738J85727k28954M8145J47951
14039C289766k55154q5445L65336n26656J36545M48831M9554k76548m0496l3713
$$ plain form
14029 3072020 3058977 2748332 2674938 2993438 2825176 2645075 2744139 2728940 2923220 2639430
14019 2639430 2680694 2674300 2191173 2552596 3038907 2290393 2398591 2407345 2456367 2616027
14009 2616027 2321709 2147703 2703994 2284151 2700932 2432708 1838008 2287948 1999583
14000 1999583 2274746 2209835 2137999 2244711 1931668 2284824 2050995 2304819 2003960 2453051
13990 2453051 2421568 3364891 5340402 13033398 35168238 45037380 27792007 13852756
13981 8146468 5498755 4785967 3937796 3627188 3364703 3086724 3078388 2656267 2678144 2491907
13971 2491907 2677916 2453873 2551225 2349774 2310788 2531661 2068889 2290951 2242521 2095861
13961 2095861 2148961 2119171 2031993 1917837 2241991 2328620 1588417 2241150 2104736 1818282
$$ packed form
14029C072020j3043l10645p3394L18500j68262j80101R9064j5199J94280k83790
14019B639430M1264o394m83127L61423M86311p48514J08198Q754M9022J59660
14009B616027k94318j74006N56291m19843M16781k68224n94700M49940k88365
14000A999583K75163o4911p1836J06712l13043L53156k33829K53824l00859M49091
13990B453051l1483R43323J975511P692996K2134840R869142j7245373A3852756
13981H146468k647713p12788q48171l10608k62485k77979q336m22121K1877j86237
13971B491907J86009k24043R7352k01451l8986K20873m62772K22062m8430j46660
13961B095861N3100k9790q7178j14156L24154Q6629p40203O52733j36414k86454
$$ plain form
13951 1818282 2066101 1960256 1601835 1643208 2009813 2173897 1845683 2105715 1529767 1846825
13941 1846825 1897810 1852247 1752990 1734521 1529191 1677605 1729188 1550049 1615605 1780379
13931 1780379 1780071 1597921 1805837 1434892 1679348 1848100 1518268 1798463 1366830 1579723
13921 1579723 1366869 1494999 1624624 1696022 1644200 1737244 1717020 1560567 1274048 1706845
13911 1706845 1730267 1402291 1568968 1653839 1565308 1372194 1305378 1344540 1555513 1320020
13901 1320020 1338316 1601105 901644 1115214 1324276 1324424 1149134 1214949 1585534 1178354
13891 1178354 1275619 1189936 1136323 1114364 1147556 1292340 1252374 1479996 1177048 1314775
13881 1314775 1134918 1356129 1171633 1099355 1220204 1033092 1314425 1092099 1055658 1290894
$$ packed form
13951A818282K47819j05845l58421M1373L66605J64084l28214K60032n75948L17058
13941A846825N0985m5563r9257j8469k05330J48414N1583j79139O5556J64774
13931A780379l08j82150K07916l70945K44456J68752l29832K80195m31633K12893
13921A579723k12854J28130J29625P1398n1822R3044k0224j56453k86519M32797
13911A706845K3422l27976J66677Q4871q8531j93114o6816L9162K10973k35493
13901A320020J8296K62789o99461K13570K09062J48j75290O5815L70585m07180
13891A178354R7265q5683n3613k1959L3192J44784l9966K27622l02948J37727
13881A314775j79857K21211j84496p2278J20849j87112K81333k22326l6441K35236
$$ plain form
13871 1290894 1246772 1137454 1600349 1166201 1445025 1185954 1248943 980850 1047423 1185359
13861 1185359 1275281 1083138 876087 780388 834945 1128202 1245461 1186366 1047836 863902
13851 863902 998401 796362 1183796 1126545 663240 957038 770379 1170485 1059101 697887
13841 697887 878906 905732 908418 1139519 1113865 1158485 919154 1004980 898404 1201404 830622
13830 830622 1013399 931305 1224304 784985 883107 891295 1168855 1001780 720938 879875
13820 879875 718207 662752 816872 963364 735076 547699 768914 614914 940321 364485
13809 1042695 900418 763408 1066200 907992 702491 582314 779762 782891 685076 902175
13799 902175 1001574 885677 640709 832769 509948 566310 744494 687426 774978 793767
$$ packed form
13871A290894m4122j09318M62895m34148K78824k59071O2989k68093O6573J37936
13861A185359Q9922j92143k07051r5699N4557K93257J17259n9095j38530j83934
13851H63902J34499k02039L87434n7251m63305K93798j86659M00106j11384l61214
13841F97887J81019K6826K686K31101k5654M4620k39331Q5826j06576L03000l70782
13830H30622J82777q2094K92999m39319R8122Q188K77560j67075k80842J58937
13820H79875j61668n5455J54120J46492k28288j87377K21215j54000L25407C64485
13809A042695j42277j37010L02792j58208k05501j20177J97448L129r7815K17099
13799I02175R9399j15897k44968J92060l22821N6362J78184n7068Q7552J8789
$$ plain form
13789 793767 818681 649209 767123 496648 895446 627560 1012622 1011355 657732 936861
13779 936861 835688 821697 510110 1025337 732946 602035 714988 783555 406122 804317
13769 804317 669684 879098 497741 667940 688116 448164 775297 466363 728750 550789
13759 550789 587061 592788 1153933 728035 370022 543188 630387 705451 548508 703405
13749 703405 629286 430440 701187 376185 960420 1019557 468457 801500 588656 1044557
13739 1044557 749004 642273 650156 429889 298211 817660 555367 514792 386988 766783
13729 766783 559342 329100 597505 510416 574596 459401 297057 754661 528214 387727
13719 387727 492727 593971 639994 610356 660503 612132 505720 277489 290363 465775
$$ packed form
13789G93767K4914j69472J17914k70475L98798k67886L85062j267l53623K79129
13779I36861j01173j3991l11587N15227k92391j30911J12953O8567l77433L98195
13769H04317j34633K09414l81357J70199K0176k39952L27133l08934K62387j77961
13759E50789L6272N727N61145m25898l58013J73166Q7199P5064j56943J54897
13749G03405p4119j98846K70747l25002N84235N9137D68457L33043k12844M55901
13739A044557k95553j06731P883k20267j31678N19449k62293m0575j27804L79795
13729G66783k07441k30242K68405q7089O4180j15195j62344M57604k26447j40487
13719C87727J05000J01244M6023k9638N0147m8371j06412k28231J2874J75412
$$ plain form
13709 465775 738906 679853 204275 480648 447556 529863 354172 518364 877982 656857
13699 656857 412201 257056 625725 308787 573887 175572 606245 496191 741415 897512
13689 897512 389136 590866 294216 349430 451575 636325 820282 589270 522955 175599
13678 649413 423424 375765 627474 605025 301708 403044 590834 283938 740575 554686
13668 554686 719636 361391 366911 461622 326448 538871 402128 447699 450928 478655 442922
13657 442922 428011 355539 341900 317670 263198 428502 506838 352633 605907 376401 361783
13646 361783 428174 -57772 406772 696079 93460 480706 505714 401312 485527 201230
13635 248958 495206 193428 347867 221426 -16141 337506 606647 250452 377501 444906
$$ packed form
13709D65775K73131n9053B04275K76373l3092Q2307j75691J64192L59618k21125
13699F56857k44656j55145L68669C08787K65100A75572M30673j10054K45224J56097
13689H97512C89136K01730B94216N5214J02145J84750J83957k31012o6315A75599
13678F49413k25989m7659K51709k2449C01708J01336J87790B83938M56637j85889
13668E54686J64950l58245N520R4711j35174K12423j36743M5571L229K7727l5733
13657D42922j4911p2472j3639k4230n4472J65304P8336j54205K53274k29506j4618
13646C61783O6391e7772D06772K89307I3460L87246K5008j04402Q4215B01230
13635B48958K46248A93428J54439j26441a6141C37506K69141B50452J27049O7405
$$ plain form
13625 444906 286378 164370 262695 311495 500786 429570 336639 106369 565874 237188
13614 315273 445416 515457 210314 430861 486910 365049 104138 421756 185689 227243
13604 227243 337518 306360 258521 312280 235527 250909 476570 495345 125400 493511 240308
13592 327693 372686 577823 351057 790281 382408 331002 188797 -79652 222306 418986
13582 418986 208438 307699 425053 533669 214240 383651 375923 334753 106044 460455
13572 460455 256845 429325 378889 429541 415714 6227 234329 309556 286053 532603 336554
13561 336554 115124 275779 237424 346840 366378 764779 549042 258946 132317 301409
13551 301409 156794 300162 442965 72335 371699 442434 488389 68076 275193 376525
$$ packed form
13625D44906j58528j22008R8325M8800J89291p1216r2931A06369M59505B37188
13614C15273J30143P0041B10314K20547N6049j21861A04138L17618A85689M1554
13604B27243J10275l1158m7839N3759p6753J5382K25661J8775A25400L68111B40308
13592C27693M4993K05137k26766M39224C82408n1406j42205g9652B22306J96680
13582D18986B08438R9261J17354J08616B14240J69411p728m1170A06044L54411
13572D60455k03610J72480n0436N0652j3827F227K28102P5227k3503K46550j96049
13561C36554A15124J60655l8355J09416J9538L98401k15737B58946j26629J69092
13551C01409j44615J43368J42803G2335K99364P0735M5955F8076K07117J01332
$$ plain form
13541 376525 318245 521152 224051 313540 259371 323664 318392 322340 32253 128604 329401
13530 329401 206378 543766 250145 626212 199640 89269 -64387 450206 151941 -73942
13519 342257 158661 273805 200590 90367 110316 382234 281744 -14175 172400 -146015
13508 474553 381191 78214 281330 206894 393512 269090 74982 392707 94398 721839
13498 721839 407618 156942 348530 390573 313949 -70938 127475 144209 418741 412477 143899
13486 147184 77129 259713 516981 270148 -104372 54931 163199 283400 167239 217022
13476 217022 520057 642929 396956 294132 519040 239644 288643 170422 190624 521685
13466 521685 177337 265380 228812 -91437 386353 127122 323398 91507 325417 467121
$$ packed form
13541C76525n8280K02907B24051Q9489n4169O4293n272L948C2253R6351K00797
13530C29401j23023L37388B50145L76067A99640H9269f4387D50206A51941g3942
13519C42257A58661J15144p3215I0367J9949K71918j00490a4175A72400a46015
13508D74553r3362G8214K03116p4436J86618j24422G4982L17725I4398O27441
13498G21839l14221A56942J91588M2043p6624g0938A27475J6734K74532o264A43899
13486A47184p0055J82584K57268k46833a04372E4931J08268J20201j16161M9783
13476B17022L03035J22872k45973j02824K24908B39644M8999j18221K0202L31061
13466E21685A77337Q8043l6568i1437C86353A27122J96276I1507K33910J41704
$$ plain form
13456 467121 324051 73425 275728 53727 378845 -4232 276007 -31466 78582 269691 305849
13445 305849 59924 422594 473932 210397 160381 350278 198740 82541 89247 -45853 315548
13433 138791 167876 421094 140909 89008 498591 112845 140488 234614 265414 134309
13423 134309 373358 -6952 156484 -181637 84346 205430 555740 245212 460167 46444
13412 194618 187700 288130 88200 291560 275079 -175645 143735 61234 425084 61511 -120188
13400 367632 495503 -53890 426577 314064 119997 373160 126983 312621 265199 635772
13390 635772 148364 368739 264152 -121900 -114006 257612 164753 -4096 469268 195868
13379 -16416 127141 -183678 305084 174703 274145 168273 163928 445165 -155592 -59947
$$ packed form
13456D67121j43070G3425K02303E3727L25118d232B76007c1466G8582J91109L6158
13445C05849E9924L62670N1338B10397n0016J89897j51538H2541O706d5853C15548
13433A38791K9085K53218A40909n1901M09583A12845K7643R4126L0800j31105
13423A34309K39049f952A56484a81637H4346J21084L50310B45212K14955D6444
13412A94618o918J00430H8200K03360j6481a75645A43735F1234L63850F1511a20188
13400C67632J27871e3890D26577j12513A19997K53163A26983J85638m7422L70573
13390F35772A48364K20375j04587a21900P894B57612r2859d096D69268A95868
13379a6416A27141a83678C05084j30381R9442j05872m345K81237a55592e9947
$$ plain form
13368 343576 387291 306635 64305 270899 -67710 152813 92701 -136510 99760 249336 287608
13357 287608 130297 81461 422636 284406 328892 99016 -74392 295167 40742 260968
13347 260968 -145578 213957 398513 226133 313079 588145 69812 -43855 47059 334356
13337 334356 36306 245311 144132 671789 373536 443781 300785 88728 277070 440171
13327 440171 582733 35426 15925 -17864 274173 -195285 369410 61845 458034 121205
13316 361660 495558 165811 163323 51845 221158 142354 214075 104027 58654 -43258 137794
13304 85648 -4778 -152829 298187 -65307 154132 261910 -208441 225402 121215 -82337
13293 -54918 118847 180804 250296 -84132 99034 -88586 -101530 -183383 146850 111598 354058
$$ packed form
13368C43576M3715q0656F4305K06594f7710A52813o0112a36510I9760J49576L8272
13357B87608A30297m8836L41175j38230M4486I9016g4392B95167D0742K20226
13347B60968a45578B13957J84556j72380Q6946K75066F9812d3855D7059K87297
13337C34356C6306K09005j01179N27657k98253P0245j42996H8728J88342J63101
13327D40171J42562C5426A5925a7864B74173a95285C69410F1845L96189A21205
13316C61660J33898A65811k488E1845J69313p8804P1721A04027m5373d3258A37794
13304H5648d778j48051B98187f5307A54132J07778b08441B25402j04187h2337
13293e4918A18847O1957O9492h4132I9034h8586j2944q1853A46850l5252K42460
$$ plain form
13282 354058 -284410 188229 -56474 172939 167605 -105916 252854 34872 235338 208626
13272 208626 -254959 128222 420378 128611 165626 104787 361407 3029 29036 13148 9409
13261 9409 84524 95453 -152922 620301 15642 75678 300732 461933 548557 308437 -14470
13249 163139 -287 171914 153052 -115247 204562 -36696 -55160 189335 -143344 235844 -87093
13237 386998 33015 -86953 -126964 208214 -151491 308465 228772 383517 10134 142612
13227 142612 62933 -297092 -33688 -4842 -53367 -41296 -15338 562073 -107226 251552 194556
13216 194556 354542 -258234 190086 34537 -46731 -112810 -212378 30547 -23463 -133800 91642
13204 -19867 96920 35536 58302 132272 246177 169669 260567 177669 245223 140209 20095
$$ packed form
13282C54058b84410A88229e6474A72939n334a05916B52854C4872K00466k6712
13272B08626b54959A28222K92156A28611L7015o0839K56620C029K6007A3148l739
13261I409P5115J0929a52922F20301A5642O0036K25054J61201Q6624k40120a4470
13249A63139b87A71914j8862a15247B04562c6696j8464A89335a43344B35844h7093
13237C86998C3015h6953m0011B08214a51491C08465p9693J54745A0134J32478
13227A42612F2933b97092c3688d842m8525J2071a5338E62073a07226B51552n6996
13216A94556J59986b58234A90086C4537d6731o6079r9568C0547b3463j10337I1642
13204a9867I6920C5536K2766P3970J13905p6508R0898q2898O7554j05014B0095
$$ plain form
13192 43243 77175 63974 -3734 -110950 -397227 -44166 225974 231013 -271392 108843 277657
13181 277657 277101 213486 -138969 -91099 -76851 223902 144980 -174395 34916 89548 315459
13170 315459 438752 260499 182519 179823 258094 18476 -20635 56215 -82472 71111 -23064
13158 116451 -220416 261524 122428 -154494 125150 88563 -247479 210079 -143404 -4005
13147 195938 97969 155876 448805 150476 338534 366019 418894 -227489 238203 96744
13136 234541 35324 84228 -49337 -97798 364842 -114430 207326 -99858 71344 42980 274200
13125 274200 -41468 -129954 80096 85808 236579 -117424 58603 95941 140496 179384 237423
13114 237423 4770 -179994 -46823 -35168 310458 837 263379 -345437 -5880 19108 60443
$$ packed form
13192D3243L3932j3201c734j07216k86277d4166B25974N039b71392A08843J68814
13181B77657n56o3615a38969M7870J4248B23902p8922a74395C4916N4632K25911
13170C15459J23293j78253p7980k696P8271A8476b0635E6215h2472G1111b3064
13158A16451b20416B61524A22428a54494A25150l6587b47479B10079a43404d005
13147A95938I7969N7907K92929A50476J88058K7485N2875b27489B38203I6744
13136B34541C5324M8904d9337m8461C64842a14430B07326i9858G1344k8364K31220
13125B74200d1468q8486H0096N712J50771a17424E8603L7338M4555L8888N8039
13114B37423D770a79994d6823J1655C10458H37K62542c45437e880A9108M1335
$$ plain form
13103 60443 271577 268941 108573 66425 -10497 261788 -69049 37359 336441 87248 34141
13091 134656 -138441 44438 -19606 170239 87910 418381 59286 231212 -58592 110610
13080 -52898 328230 95761 -65095 358962 -72323 40598 -119361 -121297 -101888 415184 -23797
13068 273101 -90877 81572 103135 209956 230970 -330325 205467 325538 259119 32602 29545
13057 29545 122630 -45029 376059 238798 47837 -121304 -126310 302032 433533 4071 68063
13046 68063 511459 443999 412615 229982 141391 54024 177037 214206 -35549 -128380 46718
13034 25159 -47593 47474 135366 170829 264366 -110852 385597 -3767 322081 154254 315571
13023 315571 -80902 292115 -91704 -184074 92770 107443 158333 379989 101011 84444 353916
$$ packed form
13103F0443K11134k636A08573m2148a0497B61788f9049C7359K99082H7248C4141
13091A34656a38441D4438a9606A70239q2329L30471E9286J71926e8592A10610
13080e2898C28230I5761f5095C58962g2323D0598a19361j936J9409D15184b3797
13068B73101i0877H1572K1563J06821K1014c30325B05467J20071o6419C2602l057
13057B9545R3085d5029C76059j37261D7837a21304n006C02032J31501D071O3992
13046F8063M43396o7460l1384j82633q8591E4024J23013L7169c5549r2831D6718
13034B5159d7593D7474Q7892L5463R3537a10852C85597c767C22081A54254J61317
13023C15571h0902B92115i1704r2370I2770J4673N0890K21656A01011j6567K69472
$$ plain form
13012 353916 119465 95480 -218770 143125 -22284 214813 14417 45089 219230 114622
13002 114622 -79773 232972 -335005 190485 -20739 237174 81519 -53233 362313 225310
12992 225310 155150 -39681 -59374 -56302 -237202 -134650 206397 51697 310455 165261 -9344
12980 13309 139219 58973 -120460 457290 138585 -160728 -76484 87210 167911 -56892 3483
12968 -51420 289292 -218907 357795 33687 -243714 -88996 349523 280403 121215 186616
12958 186616 -15771 -97142 -21639 8446 184268 15781 20406 176379 42520 244236 -272392
12946 320468 21043 -230518 459853 18930 165231 186833 -59397 50084 146089 -213422 -23360
12934 633729 -230962 -149651 38132 81633 -478018 199957 68898 202531 1620 13843 -128655
$$ packed form
13012C53916A19465k3985b18770A43125b2284B14813A4417L0672J74141j04608
13002A14622g9773B32972c35005A90485b0739B37174H1519e3233C62313j37003
12992B25310p0160c9681j9693L072j80900J02552B06397E1697K58758j45194i344
12980A3309J25910E8973a20460D57290A38585a60728g6484H7210Q0701e6892C483
12968e1420B89292b18907C57795C3687b43714h8996C49523o9120A21215O5401
12958A86616a5771q1371b1639H446J75822A5781M625J55973D2520K01716b72392
12946C20468B1043b30518D59853A8930J46301K1602e9397E0084R6005b13422b3360
12934F33729b30962Q1311C8132M3501d78018A99957F8898J33633A620J2223a28655
$$ plain form
12922 -232787 -228503 9342 -107715 9280 -40167 -189162 26134 -240140 252607 -217086 -62881
12910 -34681 22996 427488 -207311 -120289 -146155 92818 49654 1848 210174 -42956 338737
12898 134028 22615 15570 60771 -215704 229412 246572 323101 14293 -67149 -74540 96575
12886 -299692 100412 -107865 -21780 -135266 -216512 246341 213058 204029 301744 98874 168305
12875 168305 -45411 97057 230556 88113 540960 -461273 -424536 -91137 -77398 -512760 -20527
12863 221916 244539 122499 -443554 39995 -142640 -207834 -221423 160026 -78831 32864 156318
12852 156318 83990 62320 -49223 292224 54951 12923 50075 121706 -39943 -213729 465016
12840 -270374 -74524 68033 -124126 -201199 -15307 84085 409052 -36374 -92504 328020 119317
$$ packed form
12922b32787M284I342a07715I280d0167j48995B6134b40140B52607b17086f2881
12910c4681B2996M04492b07311Q7022k5866I2818m3164A848K08326d2956C38737
12898A34028B2615p045M5201b15704B29412J7160P6529A4293f7149p391I6575
12886b99692A00412a07865b1780j13486q1246B46341l3283r029R7715I8874O9431
12875A68305d5411I7057J33499H8113M52847d61273L6737i1137J3739m35362b0527
12863B21916K2623j22040d43554C9995a42640o5194j3589A60026g8831C2864J23454
12852A56318p2328k1670d9223B92224E4951A2923L7152P1631c9943j73786D65016
12840b70374g4524F8033a24126p7073a5307H4085L24967c6374n6130C28020A19317
$$ plain form
12828 130909 -118486 -47313 -25409 37003 -155134 416 -195889 -200766 50780 263700 -221772
12816 -6957 -268788 -143247 80396 258751 120523 137689 50864 214209 -172926 -162892 -138401
12805 -138401 132597 -368597 -167989 -170317 225696 65413 -136680 -24733 -72176 190877
12794 220470 -195650 -141117 56645 310019 133786 -136421 -42753 214160 -48882 -107183
12784 -107183 237961 52823 -380641 -211764 73054 15457 -232777 326365 39674 65226
12774 65226 -124778 138806 -13298 9587 -55867 -334622 -81028 -80560 296757 -180330 17272
12762 -53316 178685 62030 -139601 -85018 130063 -210418 -63582 439331 687 45376 -12543
12750 -426287 176863 -276906 -120484 104068 -109597 251460 383579 -116685 25987 -18179
$$ packed form
12828A30909a18486d7313K1904C7003a55134D16a95889m877E0780K12920b21772
12816f957k61831J25541H0396J78355A20523J7166E0864J63345a72926J0034K4491
12805a38401A32597c68597a67989k328B25696F5413a36680b4733m7443A90877
12794B20470a95650N4533E6645K53374A33786a36421d2753B14160d8882n8301
12784a07183B37961E2823c80641J68877G3054A5457b32777C26365C9674K5552
12774F5226a24778A38806a3298I587e5867k78755h1028M68B96757a80330A7272
12762e3316A78685F2030a39601N4583A30063b10418f3582D39331F87M4689a2543
12750d26287A76863b76906a20484A04068a09597B51460J32119a16685B5987a8179
$$ plain form
12739 -71825 383468 -62603 452988 178123 -50611 -26465 324204 150143 197071 9953 18394
12728 18394 -52603 21240 117937 -159338 -60825 3188 -321413 -171839 166022 -88714 28690
12716 82650 401744 16147 321450 -88800 -32892 101186 41419 368620 391617 459703 362458
12705 362458 -125285 181634 -5223 182548 210545 -69978 282010 9663 221525 -43016 -160997
12694 -160997 -62496 182271 -66906 145602 87311 -160985 5060 -321234 44252 169234 -106079
12682 17810 243492 316030 82194 76659 126133 -100987 333175 60574 103754 -88432 -278836
12671 -278836 189849 -125669 12652 121703 -19612 178231 135843 224296 218259 131928 183093
12660 183093 134967 251912 -70078 36875 91459 -129683 36348 74379 15463 95860 -210413
$$ packed form
12739g1825C83468f2603D52988A78123e0611K4146C24204A50143M6928I953Q441
12728A8394e2603B1240R6697a59338f0825C188c21413J49574A66022h8714B8690
12716H2650L19094A6147L05303h8800c2892A01186D1419L27201K2997O8086r7245
12705C62458a25285A81634e223A82548K7997f9978B82010I663K11862d3016j17981
12694a60997f2496A82271f6906A45602n8291a60985E060c21234D4252J24982a06079
12682A7810K25682P2538H2194n535M9474a00987C33175F0574M3180h8432j90404
12671b78836A89849a25669A2652J09051a9612A78231m2388Q8453o037q6331N1165
12660A83093m8126J16945g0078C6875N4584a29683C6348L8031A5463Q0397b10413
$$ plain form
12648 43075 200593 263390 123519 -122914 145891 -11111 226691 67656 7447 91567 85394
12637 85394 -163044 221471 -116327 -285001 7689 -212964 118105 7153 306844 62120 203734
12626 203734 28275 344825 199894 123735 42888 10331 -86086 226645 336853 72977 24851
12614 -119133 161002 497860 -118649 125065 -198448 -47184 84913 -71631 188024 -82968
12603 -47174 250719 -35825 14772 391553 184471 47958 309654 -37043 195629 -274256
12592 132775 -26482 109655 -16552 424885 300611 -46062 226212 72998 -64629 -150133 48912
12580 288087 -286787 -4734 -217590 92767 -47703 164335 -134662 506075 175156 112491
12570 112491 -282930 182120 -176966 53897 -381708 7597 78180 235946 55520 116560 78436
$$ packed form
12648D3075J57518O2797A23519a22914A45891a1111B26691F7656G447Q4120o173
12637H5394a63044B21471a16327j68674G689b12964A18105G153K99691F2120J41614
12626B03734B8275L16550j44931p6159D2888A0331h6086B26645J10208G2977B4851
12614a19133A61002L36858a18649A25065a98448d7184H4913g1631A88024h2968
12603d7174B50719c5825A4772L76781A84471D7958K61696c7043A95629b74256
12592A32775b6482A09655a6552D24885j24274d6062B26212G2998f4629q5504D8912
12580B88087b86787d734k12856I2767d7703A64335a34662E06075A75156o2665
12570A12491b82930A82120a76966E3897c81708G597P0583J57766E5520O1040l8124
$$ plain form
12559 78436 -374054 -250217 124168 -157773 261064 -316205 -113950 317512 9754 163348
12549 163348 -142333 11656 -32041 93114 -248752 -346268 380896 -120702 -50924 -79131 -164801
12538 -164801 17709 -54787 160012 257417 428079 -276749 -215126 61094 47859 -252540 -74399
12526 -259706 303664 -121588 -129530 -14822 71960 -137567 -61776 165965 185590 -165444 130219
12514 -32318 -53591 46193 -93158 145471 335085 -282066 190943 -53975 -76073 -60015 206215
12502 -136574 82656 85504 239438 -24679 -329103 17474 -289372 90528 152019 154283 254511
12491 254511 25233 61683 -76907 288522 140782 -50286 145831 91311 -80416 362369 182249
12480 182249 94348 249601 -168358 180772 82739 122849 89044 -83599 71466 -173218 209880
$$ packed form
12559G8436c74054J23837A24168a57773B61064c16205a13950C17512I754J53594
12549A63348a42333A1656c2041I3114b48752r7516C80896a20702e0924k8207q5670
12538a64801A7709e4787A60012R7405J70662b76749O1623F1094j3235b52540g4399
12526b59706C03664a21588p942a4822G1960a37567f1776A65965J9625a65444A30219
12514c2318k1273D6193i3158A45471J89614b82066A90943e3975k2098J6058B06215
12502a36574H2656K848J53934b4679l04424A7474b89372I0528O1491K264J00228
12491B54511B5233L6450g6907B88522A40782e0286A45831n4520h0416C62369j80120
12480A82249q7901J55253a68358A80772H2739M0110l3805h3599G1466a73218B09880
$$ plain form
12468 238325 -241041 -135736 -50811 -128518 61187 128127 130784 203777 -148219 -362161 121841
12456 16033 -70613 -31938 452348 -64734 85741 184865 218914 -51136 -215339 -139506 -288662
12445 -288662 -38906 -105795 -160171 -55204 60007 15969 -51893 321544 60084 -87324 99599
12433 -261737 -241463 106805 -126660 84305 160902 243535 191277 -64619 -182633 16247 44899
12422 44899 -121106 -231635 171446 -183910 318077 -134975 17543 -291291 136321 -152033
12411 32132 308141 31848 -127724 -366654 50391 171264 -17970 195693 226573 -101553
12400 -428127 127815 143177 -145042 218150 -201119 50414 92262 28072 -247569 288854
12389 57699 -64550 27121 -46322 8412 50644 94762 -151844 53065 164101 255128 -239538
$$ packed form
12468B38325b41041J05305e0811p7707F1187O6940K657P2993a48219k13942A21841
12456A6033g0613c1938D52348f4734H5741R9124L4049e1136j64203P5833j49156
12445b88662c8906o6889n4376e5204F0007A5969e1893C21544F0084h7324I9599
12433b61737K0274A06805a26660H4305P6597Q2633n2258f4619j18014A6247K8652
12422D4899a21106j10529A71446a83910C18077a34975A7543b91291A36321a52033
12411C2132K76009C1848a27724k38930E0391J20873a7970A95693L0880a01553
12400d28127A27815J5362a45042B18150b01119E0414M1848B8072b47569B88854
12389E7699f4550B7121d6322H412M2232M4118a51844E3065J11036R1027b39538
$$ plain form
12377 229133 -213855 -137307 -210679 198021 184927 60680 126514 87060 -311632 -20811 72197
12365 -41475 19791 326973 -224558 189318 -164914 -20657 12566 -170308 54470 34535 -181972
12353 238216 -69739 149369 -180109 32512 270829 215547 122490 -125142 142849 90719
12343 90719 53903 -63516 90053 -190045 -155996 -71346 176281 59191 -18732 -141403 -2050
12331 -71435 -44131 -457657 14257 112381 79892 -588422 -84893 197533 431428 37161 33177
12320 33177 -355982 -179119 10866 249761 115734 36673 -6671 121286 -310826 95710 -56855
12308 -139830 363247 -30352 20329 198795 -36762 50890 122549 -222518 129262 -298745
12297 24084 328018 35362 25694 96879 -11380 201415 269803 141537 -59605 90404 -5405
$$ packed form
12377B29133b13855P6548p3372A98021j3094F0680O5834l9454c11632b0811G2197
12365d1475A9791L07182b24558A89318a64914b0657A2566a70308E4470j9935a81972
12353B38216f9739A49369a80109C2512K38317n5282r3057a25142A42849n2130
12343I0719l6816f3516I0053a90045L4049g1346A76281E9191a8732j22671b050
12331g1435K7304m13526A4257R8124l2489e88422h4893A97533K33895C7161l984
12320C3177c55982J76863A0866K38895A15734C6673f671A21286c10826I5710e6855
12308a39830C63247c0352B0329J78466c6762E0890P1659b22518A29262b98745
12297B4084L03934C5362r668P1185a1380B01415O8388j28266e9605I0404e405
$$ plain form
12285 -119517 -19974 -128651 -172167 172067 244184 208682 20033 84669 339179 160870 13473
12273 253979 -4886 120991 128402 232401 -27153 263601 34604 72592 86736 71116 370235
12262 370235 91729 -175673 -32089 185753 -8411 400587 565202 220078 71031 -178963
12251 -157527 109310 -171704 437277 234511 -21745 131533 -2139 -215219 -159843 275336
12240 75512 -127470 263518 -97226 170573 188382 170119 384648 286944 240268 91316 255754
12229 255754 356431 226290 235733 171739 230985 77889 384639 714024 208262 269858 291428
12218 291428 252697 57298 179384 77445 252353 -98805 64745 -67414 -196004 98305 -33028
12206 -41580 214589 215816 279947 103062 122207 40008 287374 -56532 25058 291993 -154815
$$ packed form
12285a19517a9974j08677m3516A72067P2117l5502B0033O4636K54510A60870A3473
12273B53979d886A20991P411J03999b7153B63601C4604L7988J4144j5620K99119
12262C70235I1729a75673c2089A85753h411D00587J64615B20078G1031a78963
12251a57527A09310a71704D37277k02766b1745A31533b139k13080N5376B75336
12240G5512a27470B63518i7226A70573J7809j8263K14529r7704m6676I1316J64438
12229B55754J00677j30141R443o3994N9246G7889L06750L29385B08262O1596K1570
12218B91428l8731E7298J22086G7445J74908i8805F4745f7414j28590I8305c3028
12206d1580B14589J227O4131A03062J9145D0008K47366e6532B5058K66935a54815
$$ plain form
12194 213771 280183 43405 297262 209976 249201 -10900 -48857 261143 -6040 9378 142933
12183 142933 -117920 224161 -203510 -356517 -186157 -347958 53885 171058 348767 114702
12172 -81484 53725 -67276 330781 42238 -34746 -59396 42535 32113 -198557 3191 -177437
12160 147349 441977 63892 250484 50210 1853 106164 7262 -138075 -255978 151119 240503
12149 240503 -50785 -25947 203628 158431 76594 -128436 -29546 276474 -55740 247203 -8468
12137 -193512 223049 -81840 102462 97721 -177428 -15286 -30693 -127319 -115674 22111 344147
12126 344147 131704 33058 -151905 301498 -125341 -4235 164207 253258 -150151 -179817
12116 -179817 -70253 -268834 -253383 -89861 -33572 -156079 -31244 81562 448214 -180158 -116676
$$ packed form
12194B13771O6412D3405K53857q7286L9225a0900l7957B61143f040I378J33555
12183A42933a17920B24161b03510j53007J70360j61801E3885J17173J77709A14702
12172h1484E3725f7276C30781D2238c4746k4650D2535j0422a98557C191a77437
12160A47349K94628F3892J86592E0210A853J04311G262a38075j17903A51119Q9384
12149B40503e0785K4838B03628m5197G6594a28436b9546B76474e5740B47203h468
12137a93512B23049h1840A02462m741a77428a5286j5407r6626J1645B2111L22036
12126C44147A31704C3058a51905C01498a25341d235A64207Q9051a50151k9666
12116a79817g0253j98581J5451h9861c3572j22507c1244H1562L66652a80158O3482
$$ plain form
12105 -116676 -103788 66828 -147336 -123275 124186 -123287 -48958 -355360 56003 246847
12095 246847 189728 76754 101802 210552 230758 -472402 -26778 71620 170174 213250 -165216
12083 -94765 -52157 430350 -37366 -101836 -5395 574129 1520579 1979817 1037215 368491 318864
12072 318864 172791 96109 -222213 -25780 111181 -245045 -23537 -147113 -207856 39090
12061 11843 -168820 171326 92143 -93709 -258535 17093 20682 76794 111940 248746 -31696
12049 -262851 50874 -32943 -50347 147581 -297959 -184257 147128 152579 -175815 248057
12038 -156711 153416 -205489 544803 232479 -175635 -58419 159889 -285684 2448 -231367
12027 -182324 53414 347473 -329240 -22313 -197585 -126641 215592 -51287 12107 -46624 -150063
$$ packed form
12105a16676J2888F6828a47336K4061A24186a23287d8958l06402E6003J90844
12095B46847n7119G6754K5048J08750K0206d72402b6778G1620R8554M3076a65216
12083i4765M2608D30350c7366o4470e395E74129R46450M59238r42602C68491m9627
12072C18864j46073p6682b22213b5780A11181b45045b3537j23576o0743C9090
12061A1843a68820A71326p9183i3709j64826A7093L589N6112L5146J36806c1696
12049b62851E0874c2943j7404A47581b97959J13702A47128N451a75815B48057
12038a56711A53416b05489E44803B32479a75635e8419A59889b85684B448b31367
12027a82324E3414K94059c29240b2313j75272P0944B15592e1287A2107d6624j03439
$$ plain form
12016 -150063 192554 200408 25973 167966 25746 409187 -16690 153965 305294 -121053
12005 -91576 -18061 82675 -210995 152866 68502 -51240 -274388 39973 29039 -195473 22905
11993 131973 -268210 -52627 59828 -117159 62154 -163305 -395606 243667 179482 -53587
11982 -32836 79266 -130867 161157 7267 118526 -292527 -84662 160558 142119 -143503 -212028
11971 -212028 -328375 -107708 155493 -183439 71102 15426 -220958 -35554 444533 16387
11960 141699 64490 -109341 -5332 -44501 -61775 164653 -238141 -146494 -118311 -179727 67141
11948 -231900 27270 137826 -128198 88036 66411 -16464 -39464 -61679 73739 -288378 -8873
11936 -31633 190562 -96878 -195107 140195 -373237 95660 -143896 10764 34480 -322777 327584
$$ packed form
12016a50063A92554P854B5973J41993B5746L83441a6690A53965J51329a21053
12005i1576a8061H2675b10995A52866F8502e1240k23148C9973j0934a95473B2905
11993A31973b68210e2627E9828a17159F2154a63305k32301B43667o4185e3587
11982c2836G9266a30867A61157G267J11259b92527h4662A60558j8439a43503o8525
11971b12028j16347a07708A55493a83439G1102A5426b20958c5554D44533A6387
11960A41699F4490a09341e332l9169j7274A64653b38141R1647K8183o1416F7141
11948b31900B7270J10556a28198H8036k1625a6464k3000k2215G3739b88378h873
11936c1633A90562i6878r8229A40195c73237I5660a43896A0764K3716c22777C27584
$$ plain form
11924 -146313 -262571 -9616 -268005 -274842 76648 -93792 -3076 -42031 288890 336973 91965
11912 -229028 -9958 167804 20383 -118317 133273 -272121 88894 -13171 -149934 -103497 14494
11900 363261 -348788 160201 -92485 -189549 -121994 118756 214733 -345913 259409 173779
11890 173779 -170476 -263327 -176905 99888 -93932 20849 159125 -360419 -118299 -288337
11880 -288337 -115297 -67989 -85979 -157926 -38243 -314115 254883 153297 78589 135560 -202270
11868 -48568 -118249 156498 -150918 109587 54169 176721 -223029 156588 169253 -290908
11857 -4864 -162207 -6832 -42116 -65938 18242 -147992 -25246 -171859 30471 -53190 165286
11845 -283636 119506 -204155 -82057 -225133 54501 -88998 -205394 93676 90306 6782 166116
$$ packed form
11924a46313j16258i616k58389o837G6648i3792c076l8955B88890M8083I1965
11912b29028i958A67804B0383a18317A33273b72121H8894a3171j36763M6437A4494
11900C63261c48788A60201i2485r7064O7555A18756R5977c45913B59409q5630
11890A73779a70476r2851Q6422I9888i3932B0849J38276c60419a18299j70038
11880b88337a15297M7308j7990p1947c8243k75872B54883j01586p4708N6971b02270
11868d8568o9681A56498a50918A09587E4169J22552b23029A56588J2665b90908
11857d864j57343f832l5284k3822A8242a47992b5246j46613C0471e3190A65286
11845b83636A19506b04155h2057j43076E4501h8998j16396I3676l370F782J59334
$$ plain form
11834 166116 120501 -218620 -55990 194930 37493 30955 91644 37299 -251942 31211 -270592
11822 -175100 -49986 80007 611 190213 128356 77267 -13745 203699 -419192 49993 -51068
11810 168335 -147678 116265 224359 -160114 -12705 22382 -278039 -20426 301559 226395
11800 226395 110959 24341 21597 -355508 333246 -64056 185723 21014 237243 70500 185286
11789 185286 -174113 1189 -22103 6214 -357609 -55739 -40657 105657 -6959 226918 -138490
11777 -52641 258065 76111 27459 30703 143249 -138505 -213898 -141564 72070 -138861 121476
11765 148876 -196185 25803 50742 -237099 -92292 -146422 -63091 -66286 -537167 -454155 169315
11753 54505 71871 52327 -175900 -163083 -313451 -86198 -60336 -165112 -126028 -164468 -19530
$$ packed form
11834A66116m5615b18620e5990A94930C7493o538O0689C7299b51942C1211b70592
11822a75100d9986H0007F11J89602o1857n1089a3745B03699d19192D9993e1068
11810A68335a47678A16265J08094a60114a2705B2382b78039b0426C01559p5164
11800B26395A10959B4341k744c55508C33246f4056A85723B1014K16229G0500J14786
11789A85286a74113A189b2103F214c57609e5739J5082A05657f959B26918a38490
11777e2641B58065G6111B7459L244J12546a38505p5393P2334G2070a38861A21476
11765A48876a96185B5803K4939b37099i2292n4130f3091l195m70881Q3012A69315
11753E4505J7366j9544a75900J2817j50368h6198K5862j04776L9084l8440a9530
$$ plain form
11741 77181 -287098 -117973 324555 -9962 -222099 -44914 -263289 -10266 50457 168651 31715
11729 -135675 387050 68120 53007 -30262 93630 -31827 75693 326717 102223 -341561 -222792
11718 -222792 288379 -56295 -305111 138357 -127886 -74254 427142 59213 148273 131431
11708 131431 128742 215047 -75395 48139 46479 -130870 -49405 351456 144051 -129843 121283
11696 529278 -6977 -16541 -246361 -311014 115716 240768 -416792 128286 343770 265762 43402
11684 52342 1327 140753 169927 -123926 -124420 -75719 24290 289947 371613 97226 30601 -112507
11671 -206471 148182 231962 134175 28332 101125 -12849 -179861 -98731 309188 305240 -35579
11659 -214116 -22855 148871 120989 431549 156173 -106508 280004 -49350 50299 -208121
$$ packed form
11741G7181b87098a17973C24555i962k12137d4914k18375a0266E0457J18194C1715
11729a35675C87050F8120j5113c0262I3630c1827G5693K51024A02223c41561J18769
11718b22792B88379e6295k48816A38357a27886N3632D27142E9213Q9060j6842
11708A31431k689Q6305g5395D8139j660a30870d9405C51456A44051a29843A21283
11696E29278f977r564k29820o4653A15716J25052d16792A28286K15484p8008D3402
11684E2342A327J39426K9174a23926m94M8701B4290K65657Q1666I7226C0601a12507
11671b06471A48182Q3780r7787B8332P2793a2849j67012Q1130C09188l948c5579
11659b14116b2855A48871k7882L10560A56173a06508B80004d9350E0299b08121
$$ plain form
11648 -21748 180284 87304 210395 -8868 -41197 -190815 -364333 -78438 322458 126308 100312
11637 100312 237040 -180931 -216401 -25031 -276482 -34161 519644 39107 134404 16059 291259
11626 291259 -16639 48727 234028 140940 137552 242133 156996 5826 15435 340103 -125342
11614 -51987 -60917 -23022 96081 28293 220160 261872 -298203 -186429 -60276 -73021 202735
11602 65449 131324 83618 -28955 105795 87944 57592 107856 -172975 59841 368175 -47829
11590 454317 -105019 -34150 215889 255525 313446 253240 131892 221641 -130029 -127490 287908
11578 -301606 47756 -59573 222161 70857 132984 129398 178876 119925 190892 -42648 241269
11566 327047 -205399 28682 198070 34059 124115 161189 16828 372424 442898 -311240 207277
$$ packed form
11648b1748A80284H7304J23091h868l2329j49618j73518g8438C22458A26308k5996
11637A00312J36728a80931l5470b5031k51451c4161E19644C9107R5297A6059K75200
11626B91259a6639D8727J85301r3088l388J04581q5137E826R609L24668a25342
11614e1987q930b3022I6081B8293J91867M1712b98203J11774f0276j2745B02735
11602F5449O5875m7706b8955A05795j7851l0352N0264a72975E9841L08334d7829
11590D54317a05019c4150B15889L9636N7921o0206j21348Q9749a30029K539B87908
11578c01606D7756e9573B22161G0857O2127l586M9478n8951P0967d2648B41269
11566C27047b05399B8682J69388C4059R0056L7074A6828L55596P0474c11240B07277
$$ plain form
11554 -649 221760 -124602 -281370 -62636 -157618 3324 35293 137738 274569 212002 104172
11542 -123112 245307 -125219 24361 104573 -206886 143180 -34589 -244030 105152 -92684
11531 272837 399123 24243 164717 241087 273232 56533 86175 220205 115512 100409 -98749
11519 119150 -48620 -24909 456804 -126551 167502 -148157 447706 -68989 51383 82972
11509 82972 -65451 -125289 -144136 -151772 -299217 185955 225598 118706 165952 -70509 -197122
11498 -197122 -187558 355991 323529 89873 33504 -13957 46638 -341482 -131143 51774 221175
11487 221175 308013 149000 -38966 68545 -29210 24569 -29141 14204 18684 -148992 -116346
11476 -116346 317079 275323 218103 324620 295637 164449 34687 58541 22900 -369341 241772
$$ packed form
11554f49B21760a24602j56768f2636r4982C324L1969J02445J36831o2567A04172
11542a23112B45307a25219B4361Q0212b06886A43180c4589k09441A05152i2684
11531B72837J26286B4243J40474P6370L2145E6533K9642J34030j04693j5103i8749
11519A19150d8620K3711D56804a26551A67502a48157D47706f8989E1383L1589
11509H2972f5451n9838j8847p636j47445A85955L9643j06892M7246g0509j26613
11498a97122R564C55991l2462H9873C3504a3957D6638c41482a31143E1774J69401
11487B21175Q6838A49000c8966F8545b9210B4569b9141A4204M480a48992L2646
11476a16346C17079m1756n7220J06517k8983j31188C4687K3854B2900c69341B41772
$$ plain form
11464 3243 169806 10050 341884 332998 276342 39163 4282 102200 239272 -18028 172316
11452 -104904 50477 -63611 -60546 -143111 137626 -105459 -23788 -201483 68594 196021 -103192
11440 -161980 155746 141650 -49335 423656 -29598 143536 57734 51081 -73979 -178674 48978
11428 -286513 14058 -141358 210214 246639 127925 191524 -248288 -58331 -21734 -14389 103641
11416 -65411 102381 -123524 -147784 212370 252193 16615 7091 -196141 96958 103014 94274
11405 94274 62537 395053 182675 -42799 -14045 73791 -207094 341450 108685 118464 41363
11393 -329063 188597 213356 112510 -1020 132345 -65227 130992 -98765 121063 -221649
11382 222065 109201 166862 20053 -83562 213428 1921 114780 208016 852 394190 53434
$$ packed form
11464C243J66563A0050L31834q886n6656C9163D282R7918J37072a8028A72316
11452a04904E0477f3611L065q2565A37626a05459b3788j77695F8594J27427a03192
11440a61980A55746j4096d9335D23656b9598A43536E7734o653g3979j04695D8978
11428b86513A4058a41358B10214L6425j18714O3599b48288e8331b1734P345A03641
11416f5411A02381a23524k4260B12370L9823A6615G091a96141I6958O056q740
11405I4274l1737L32516A82675d2799a4045G3791b07094C41450A08685R779D1363
11393c29063A88597K4759j00846a020A32345f5227A30992i8765A21063b21649
11382B22065A09201N7661B0053h3562B13428A921J12859R3236H52L93338E3434
$$ plain form
11370 130372 -120803 -78982 -66792 154483 -38902 68506 -162349 93723 -261423 -43227 -39247
11359 -39247 -190192 52088 -77034 194501 197242 125132 419 131054 -41211 -400317 234109
11347 -10828 -193015 113088 -129914 -94054 -20220 -23139 6652 -385299 -325063 253886 232985
11336 232985 12565 236615 70517 -47038 -400241 -12287 200390 -2796 -24256 -148790 187413
11324 -278937 -154173 292687 -61755 165347 -73264 75819 115843 -41482 60596 267126 -32663
11312 154096 165996 -179620 273262 -63058 133340 147017 131596 -16282 -8328 1946 -161678
11300 -39934 67289 7990 14267 -157641 -245831 188406 286880 -68403 56916 243586 92966
11288 61974 81548 290364 -337326 -308195 -135696 -170096 86459 40817 117011 208173 -140024
$$ packed form
11370A30372a20803M1821J2190A54483c8902F8506a62349I3723b61423d3227L980
11359c9247j50945E2088g7034A94501K741p2110D19J30635d1211l59106B34109
11347a0828j82187A13088a29914L5860b0220k919F652c85299O0236B53886k0901
11336B32985A2565K24050G0517d7038l53203a2287B00390b796k1460j24534A87413
11324b78937J24764B92687f1755A65347g3264G5819M0024d1482F0596K06530c2663
11312A54096J1900a79620B73262f3058A33340J3677j5421a6282P954A946a61678
11300c9934F7289G990O277a57641q8190A88406R8474f8403E6916J86670I2966
11288F1974J9574K08816c37326K9131a35696l4400H6459D0817P6194R1162a40024
$$ plain form
11276 -162708 19760 -26275 101716 -128408 -330080 -152983 -107219 -177790 -265983 -14516 51335
11264 219511 -202750 -101981 -310564 38088 -6259 -483904 -163589 60522 -118358 20109
11253 -84531 39763 -114139 59772 -248880 150864 34544 106045 -373860 -124794 -163722 222489
11241 -297152 -169242 287600 -45923 158658 -50915 41712 -133423 27596 -353213 -304634
11231 -304634 62348 89477 110579 -184563 55703 -88293 -343659 -19659 -117294 4338 -252992
11219 -214428 145113 -251391 67148 77927 78752 -314265 -70190 -80212 -73310 21320 128177
11208 128177 -99050 -150192 -122475 -77631 -332750 129798 258543 429216 -88543 -3169 45404
11196 -102451 -151356 -63327 -81530 -5705 -185245 167826 -515280 -120098 34312 -228878 87319
$$ packed form
11276a62708A9760b6275A01716a28408k01672a52983M5764p0571q8193a4516E1335
11264B19511b02750J00769k08583C8088f259m77645a63589F0522a18358B0109
11253h4531C9763a14139E9772b48880A50864C4544P1501c73860a24794l8928B22489
11241b97152J27910B87600d5923A58658e0915D1712a33423B7596c53213M8579
11231c04634F2348K7129K1102a84563E5703h8293k55366a9659r7635D338b52992
11219b14428A45113b51391F7148J0779Q25c14265g0190j0022O902B1320J06857
11208A28177i9050n1142K7717M4844k55119A29798J28745J70673h8543c169D5404
11196a02451m8905f3327j8203e705j79540A67826e15280a20098C4312b28878H7319
$$ plain form
11184 145768 -123032 -11334 -105314 -101680 -253967 -15752 -38693 -337498 -143950 159721 -49495
11172 240165 24510 -39210 -37330 232116 39812 -117428 -160379 -305645 130923 15361 156741
11161 156741 -24130 -209698 -24763 266107 -24408 164331 -174564 -88298 227600 18089
11150 341600 -51526 76434 229046 -210045 -218434 -13757 -273125 -165418 -155540 -103222 62874
11138 -35775 202935 -322931 227054 -147395 14658 -110717 -395377 320091 116103 -31360
11127 69299 -57641 22434 15608 -75006 -23048 54252 450053 74835 -21182 -151603 86662
11115 108731 -4658 103076 146884 -102015 -41377 22462 -1111 54062 -33342 190913 -83893
11103 -2971 79442 279169 -56543 377927 160706 -198377 128987 -144178 265093 186217
$$ packed form
11184A45768a23032a1334r3980L634j52287a5752k2941k98805a43950A59721d9495
11172B40165B4510c9210J880B32116C9812a17428m2951j45266A30923A5361J41380
11161A56741b4130j85568b4763B66107b4408A64331a74564Q6266B27600A8089
11150C41600e1526G6434J52612b10045q389a3757k59368J07707R878N2318F2874
11138c5775B02935c22931B27054a47395A4658a10717k84660C20091A16103c1360
11127F9299e7641B2434o826g5006b3048E4252L95801G4835b1182j30421H6662
11115A08731d658A03076M3808a02015d1377B2462a111E4062c3342A90913h3893
11103b971G9442J99727e6543C77927A60706a98377A28987a44178B65093p8876
$$ plain form
11093 186217 236467 -197777 138710 402161 203003 306860 458957 169527 213258 375156
11083 375156 522122 455629 496020 157176 200804 146219 7669 91179 519633 656338 368806
11072 368806 -85485 463914 426114 290736 357049 516104 272708 292727 524646 622934
11062 622934 400619 671381 528397 746821 494030 688315 701605 417115 502302 1103033
11052 1103033 533826 797139 693676 705037 772026 827501 597037 478988 993332 695388
11042 695388 462976 583080 557513 770920 1071286 596899 571203 843455 665008 577489
11032 577489 586877 870939 673639 1019503 727656 846593 737433 886643 347292 602976
11022 602976 785375 482883 374149 778421 471959 569794 815995 454764 444260 318354
$$ packed form
11093A86217N0250a97777A38710K63451j99158J03857J52097A69527M3731J61898
11083C75156J46966o6493M0391A57176M3628n4585G669Q3510M28454J36705k87532
11072C68806h5485D63914l7800j35378O6313J59055k43396K0019K31919R8288
11062F22934k22315K70762j42984K18424k52791J94285J3290k84490Q5187O00731
11052A103033E33826K63313j03463J1361O6989N5475k30464j18049N14344k97944
11042F95388k32412J20104k5567K13407L00366m74387k5696K72252j78447q7519
11032E77489R388K84062j97300L45864k91847J18937j09160J49210C47292K55684
11022F02976J82399l02492j08734M04272l06462R7835K46201l61231j0504j25906
$$ plain form
11012 318354 409626 655971 387117 536476 1045166 405010 910176 528732 469791 569986
11002 569986 585216 872360 685151 712551 831417 592571 821927 511525 588442 701197
10992 701197 675216 826362 651678 905335 887652 874452 713970 849801 807182 892021
10982 892021 1241244 1296204 1305378 956623 1285755 1441506 1661000 1804427 2283085 2572160
10972 2572160 2458863 2800277 2835929 2705427 2252781 2498792 2163937 1523192 1692651 1385423
10962 1385423 1396213 1598962 1664623 1513611 1866894 1837518 1873337 1825468 1602086 1685751
10952 1685751 1423142 1200218 977727 1035250 832880 696268 571381 433898 384305 564633
10942 564633 167229 134048 257050 269232 307129 372516 335812 -182907 119163 116150 56956
$$ packed form
11012C18354R1272K46345k68854J49359N08690D05010N05166l81444n8941J00195
11002E69986J5230K87144j87209K7400J18866k38846K29356l10402P6917J12755
10992G01197k5981J51146j74684K53657j7683j3200j60482J35831m2619Q4839
10982H92021L49223N4960R174l48755L29132J55751K19494J43427M78658K89075
10972B572160j13297L41414L5652j30502m52646K46011l34855o40745J69459l07228
10962A385423J0790K02749O5661j51012L53283k9376L5819m7869k23382Q3665
10952A685751k62609k22924k22491N7523k02370j36612j24887j37483m9593J80328
10942E64633A67229l3181J23002J2182L7897O5387l6704a82907A19163l013E6956
$$ plain form
10930 -109354 -154509 40133 302529 -153219 107117 -62705 -74403 -195880 -112393 172725
10919 -74678 -21346 -74563 21107 313517 -53422 -220927 -183755 134665 199642 243602 -246643
10907 -163688 -120125 316940 338514 175677 68054 -196056 -272014 1880 262646 122303 -245267
10895 -51231 61784 -59367 -154800 -15311 259395 -35982 -4446 152835 147514 20875 41752 55961
10883 55961 108795 -189773 -38216 -167452 167315 299554 -157205 101065 58507 202170
10873 202170 -103680 -73625 -34825 -14909 -225021 104606 -190751 -239845 135603 17633
10862 51870 -203235 400981 -48028 76123 -153533 -84345 -47460 -57287 74563 224994 -86794
10850 -161813 -1611 151493 -412964 133538 37792 -48581 -232218 41978 439863 100910
$$ packed form
10930a09354m5155D0133K62396a53219A07117f2705j1698j21477Q3487A72725
10919g4678b1346n3217B1107K92410e3422j67505L7172A34665O4977M3960b46643
10907a63688M3563C16940K1574j62837F8054a96056p5958A880K60766A22303b45267
10895e1231F1784e9367r5433a5311B59395c5982d446A52835n321B0875K0877J4209
10883E5961N2834a89773c8216j29236A67315J32239a57205A01065m2558J43663
10873B02170a03680L0055c4825a4909k10112A04606a90751m9094A35603A7633
10862E1870b03235D00981d8028G6123a53533O9188L6885r827G4563J50431h6794
10850a61813a611A51493d12964A33538C7792d8581j83637D1978L97885A00910
$$ plain form
10839 -202575 12415 -75124 139981 -27220 55433 78553 155681 -165465 147391 76735 -118900
10827 -53202 -408616 -17994 25864 68438 -1196 -68891 -103364 29680 -63084 -81525 -98815 156887
10814 -710 251258 191890 -234525 -120588 -663521 -298817 22838 -54459 218893 203686 108629
10803 108629 -5283 -81304 -270967 -219276 -269341 -32649 174219 128671 -89943 -21139 -126573
10792 -126573 -610 -98628 -181879 -2373 -308069 -389948 31067 106523 166253 -257106 99067 -139049
10779 227474 245544 71007 -4077 13087 -103612 56939 -46890 -452808 -116371 120197 141746
10768 141746 -208237 -227395 13401 -243491 -136525 35497 -371847 -69183 -490034 154357
10757 -130936 -191633 -15047 -53619 -116778 -138195 -367392 35911 81941 -165057 53057 -125509
$$ packed form
10839b02575A2415g5124A39981b7220E5433K3120P7128a65465A47391p0656a18900
10827e3202l55414a7994B5864M2574a196o7695l4473B9680f3084j8441j7290A56887
10814g10B51258n9368b34525J13937n42933b98817B2838e4459B18893j5207r5057
10803A08629e283p6021j89663N1691n0065c2649A74219m5548h9943b1139j05434
10792a26573f10r8018q3251b373l05696q1879C1067P5456N9730b57106I9067a39049
10779B27474J8070G1007d077A3087a03612E6939d6890m05918a16371A20197K1549
10768A41746b08237j9158A3401b43491J06966C5497c71847f9183m20851A54357
10757a30936o0697a5047l8572o3159k1417k29197C5911M6030a65057E3057a25509
$$ plain form
10745 43910 361545 -99773 -255195 -66224 224811 -220300 -58900 182640 157379 -96948 131649
10733 -219968 237358 -138540 -240513 138619 -90199 -158270 -194540 -220319 -307262 -71114 -34013
10721 -193006 -131960 224109 94779 -80040 -239129 207976 -150779 -55283 -103034 -104471 93199
10709 39915 -214208 136957 -46154 -57341 -25163 -298826 166695 129492 -252133 120549
10698 -54717 -278346 -313035 -117794 -197900 -124765 123010 -168582 22791 -10316 -136630 -305064
10687 -305064 189362 35169 -153387 49027 -96674 -8678 -203292 230927 -126319 -238946
10677 -238946 -122052 -189191 -74131 378833 118926 -102365 79482 271851 126612 142236
10667 142236 -188717 -25825 -356658 232584 -166029 -68287 -206065 95362 -47650 -422023
$$ packed form
10745D3910L17635i9773j55422f6224B24811b20300e8900A82640k5261i6948A31649
10733b19968B37358a38540j01973A38619i0199o8071l6270k5779q6943g1114c4013
10721a93006O1046B24109I4779h0040j59089B07976a50779e5283m7751j437I3199
10709C9915b14208A36957d6154j1187b5163k73663A66695l7203b52133A20549
10698e4717k23629l4689a17794q0106P3135A23010a68582B2791a0316j26314j68434
10687c05064A89362C5169a53387D9027i6674h678j94614B30927a26319j12627
10677b38946J16894o7139g4131C78833A18926a02365G9482J92369A26612J5624
10667A42236a88717b5825l30833B32584a66029f8287j37778I5362d7650l74373
$$ plain form
10657 -422023 -93488 108629 -326036 -273526 -134858 -127999 395675 -237547 196619 -150519
10646 8523 93389 -169380 -159134 154977 7043 -173036 -212199 -61091 128388 27926 24043
10635 24043 -238526 -78648 -173862 -356306 40221 40664 56800 -36059 -130072 -115564 -110755 141935
10622 98124 102633 -177316 -316778 170361 69362 69803 4210 -229946 -197830 138832 -171411
10610 -50064 48995 206413 39027 -96074 -96113 -121011 260079 234564 -168842 84886 121178 407746
10598 407746 185035 -29172 -39244 68565 -90405 113895 76268 -336078 53054 17516 -121952
10586 -168721 -202981 254472 30888 -382418 -234265 -240194 -369253 -90005 -19255 -270175 -294344
10575 -294344 -16901 -51719 151431 -24306 -277988 -321800 -49554 -14761 -219613 -83941 -12692
$$ packed form
10657d22023i3488A08629c26036N2510a34858O859C95675b37547A96619a50519
10646H523Q4866a69380J0246A54977G043a73036l9163f1091A28388B7926l883
10635B4043b38526g8648r5214j82444D0221M43J6136c6059r4013J4508M809A41935
10622I8124M509a77316j39462A70361F9362M41D210b29946L2116A38832a71411
10610e0064D8995J57418C9027i6074l9k4898B60079k5515a68842H4886L6292K86568
10598D07746A85035b9172j0072F8565i0405A13895l7627c36078E3054A7516a21952
10586a68721l4260B54472C0888c82418J48153n929j29059i0005a9255k50920k4169
10575b94344a6901l4818A51431b4306k53682m3812d9554a4761k04852h3941a2692
$$ plain form
10563 217616 27565 -316655 7598 25642 -39099 7195 -172714 289045 61155 40891 -108001
10551 80188 -101973 198838 -30351 -70129 -47932 -94246 -104843 61649 124613 -70424 -164522
10540 -164522 -63423 -178488 132359 -64029 -41245 -40442 -18351 -260652 37096 -50171 -247327
10529 -247327 345661 212388 -165176 10058 -215288 -489384 -26346 114042 -66791 -50459
10519 -50459 -207697 290494 165775 92450 -55752 48996 96391 129731 70620 113563 -134432
10507 -21743 -31898 -1452 90087 168767 45966 -71719 -45918 333875 45342 -460671 -128711
10495 -297522 143206 92670 2879 -56002 -85830 93044 -321324 -195454 271068 182731 53054
10483 191350 128592 253032 702532 605687 206721 69921 389147 -150362 -60767 169219
$$ packed form
10563B17616B7565c16655G598J8044c9099G195a72714B89045F1155k0264a08001
10551H0188a01973A98838c0351l9778K2197m6314j0597F1649O2964g0424r4098
10540a64522f3423j15065A32359f4029K2784Q03a8351k42301C7096e0171j97156
10529b47327C45661j33273a65176A0058b15288k74096b6346A14042f6791J6332
10519e0459j57238B90494j24719p3325e5752D8996M7395L3340n9111M2943a34432
10507b1743j0155a452I0087P8680D5966g1719K5801C33875D5342d60671a28711
10495b97522A43206n0536B879e6002k9828I3044c21324J25870B71068q8337E3054
10483A91350o2758J24440M49500r6845B06721F9921L19226a50362f0767A69219
$$ plain form
10472 -68882 -33086 133885 29790 174025 204353 380983 -143158 -96104 -171252 150444 -74113
10460 44790 55900 -58025 -283768 94679 -209328 118942 74531 -370058 117950 -42252 11125
10448 -193086 -377140 229603 93384 -155586 -122181 -226726 205123 -71653 -94046 -14982
10437 -196652 -184791 -130373 -54232 -38960 -166693 207547 -485212 152022 90567 130573 -26804
10425 -130313 -264988 -34712 -192750 -54535 -56133 334796 -145547 67145 316089 103151
10414 44987 298326 37012 -256416 126002 62347 -176138 67345 -109176 21050 -324957
10403 -126721 184257 231653 -216693 -161046 -182852 193624 264014 -97735 -115296 53677 100302
10392 100302 241351 217962 -117115 263189 252903 142565 222454 113553 -85252 187757
$$ packed form
10472f8882c3086A33885B9790J44235L0328J76630a43158M7054p5148A50444g4113
10460D4790J1110e8025k25743I4679b09328A18942m4411c70058A17950d2252A1125
10448a93086j84054B29603I3384a55586L3405j04545B05123g1653k2393a4982
10437a96652J1861N4418e4232J5272j27733B07547d85212A52022o1455M0006b6804
10425a30313j34675c4712j58038e4535j598C34796a45547F7145K48944A03151
10414D4987K53339C7012b56416A26002F2347a76138F7345a09176B1050c24957
10403a26721A84257M7396b16693N5647k1806A93624P0390i7735j7561E3677M6625
10392A00302J41049k3389a17115B63189j0286j10338P9889j08901h5252A87757
$$ plain form
10381 468348 -219817 264900 -127863 435579 -4260 109243 44623 372130 267917 -3128
10370 -101031 229811 76790 134725 399508 418902 275306 400311 378910 94799 121262 214344
10359 214344 313661 -56044 200839 368701 214346 -106589 236916 43822 306978 700975
10349 700975 461932 622707 379490 272665 105650 -92450 286885 460417 346379 402926
10339 402926 -3899 379779 267512 18552 218320 245372 88209 254834 181294 148275 -220154
10327 -14983 115974 24059 182755 385660 160751 240759 229040 83062 -215358 -43294 316471
10315 93088 197085 408177 -117604 -50020 363735 134543 -68247 -6126 24287 -108514 91603
10303 -165267 -184238 25521 -50393 -162290 98289 337188 -249946 184291 -52836 106816
$$ packed form
10381D68348b19817B64900a27863D35579d260A09243D4623L27507j04213c128
10370a01031B29811G6790N7935K64783J9394j43596J25005k1401I4799K6463R3082
10359B14344R9317e6044B00839J67862j54355a06589B36916D3822K63156L93997
10349G00975k39043J60775k43217j06825A05650i2450B86885J73532j14038N6547
10339D02926c899C79779j12267A8552J99768K7052H8209J66625p3540l3019b20154
10327a4983A15974B4059J58696K02905A60751Q0008j1719H3062b15358d3294C16471
10315I3088J03997K11092a17604e0020C63735A34543f8247f126B4287a08514I1603
10303a65267j8971B5521e0393j11897I8289K38899b49946A84291e2836A06816
$$ plain form
10292 156377 -202117 -377959 -104945 -36772 -212920 58809 -362059 -244456 -315382 4241
10281 -43633 -12310 -60603 96696 221495 169427 -54348 395 -164903 -295423 -20796 -138850
10270 -138850 -119087 23696 270807 -90530 -161252 218208 373843 135359 74749 -23382 552659
10258 696680 203434 596841 177742 613881 381617 -6399 24744 -62887 -251221 115943
10247 58393 -8853 -160296 -93949 147963 15562 143184 -29692 -213060 -97340 -93561 -12726
10235 190914 -22829 -31910 -94751 -214594 127737 62358 -109766 -119959 -193192 -528123 -117499
10223 -221544 -186197 -163155 -158371 -19507 124578 178785 110983 -140192 87909 22721 -176475
10211 26937 104665 57710 4746 11904 68215 -591700 141672 72457 187175 -52690 27633
$$ packed form
10292A56377b02117j75842a04945c6772j76148E8809c62059J17603p0926D241
10281d3633a2310m8293I6696J24799n2068e4348C95a64903j30520b0796j18054
10270a38850J9763B3696K47111i0530p0722B18208J55635A35359o0610b3382E52659
10258F96680B03434L93407A77742M36139k32264f399B4744f2887j88334A15943
10247E8393h853j51443O6347A47963A5562J27622b9692j83368i7340L779a2726
10235A90914b2829r081o2841j19843A27737F2358a09766j0193p3233l34931a17499
10223b21544L5347K3042M784a9507A24578N4207o7802a40192H7909B2721a76475
10211B6937P7728m6955D746P158N6311e91700A41672o9215J14718e2690B7633
$$ plain form
10199 -349116 -122095 -171349 -74039 -197897 -186681 169596 -94269 -69290 -237470 -23422 -201085
10188 -201085 -24121 -73671 115590 -130210 -45260 69058 -112612 -265733 8072 45617 94865
10177 94865 -77079 231356 58766 -199869 -343403 129222 -151825 158717 -156875 -488974
10167 -488974 -66919 4959 -33338 39324 61665 -173366 -283734 202295 248508 -206739 -384643
10156 -384643 393480 -35810 124917 -134164 -86235 -181365 -278318 -67913 -42447 -255845 136
10144 -250182 173474 158565 15919 34239 -2601 10093 -31879 273891 -369267 -80349 15353
10132 -162420 185013 295447 -72238 -274617 112548 -46740 -182480 188392 -222434 -119260
10122 -119260 129509 -118265 -225763 -167815 -317601 -13648 -9510 -144157 -338103 -54568
$$ packed form
10199c49116a22095m9254g4039j23858J1216A69596i4269K4979j68180b3422j77663
10188b01085b4121m9550A15590a30210d5260F9058a12612j53121H072L7545M9248
10177I4865g7079B31356E8766a99869j43534A29222a51825A58717a56875l32099
10167d88974f6919D959c3338C9324K2341a73366j10368B02295M6213b06739j77904
10156c84643C93480c5810A24917a34164M7929r5130r6953f7913K5466k13398A36
10144b50182A73474j4909A5919J8320b601A0093c1879B73891c69267h0349A5353
10132a62420A85013J10434g2238k02379A12548d6740j35740A88392b22434J03174
10122a19260A29509a18265j07498N7948j49786a3648M138j34647j93946e4568
$$ plain form
10111 25282 -76944 -114845 -1383 -313094 -146025 -90312 250415 -218024 -132770 -286764 -33199
10099 21127 -202185 -88371 26262 -13005 48455 -217365 -129364 118305 -318301 -73619 -200897
10088 -200897 55083 -120575 118752 -315730 -275783 356629 6427 -315345 2882 119552 -111689
10076 1159 3407 -143055 134961 -224786 176834 -111803 264595 -167028 -185547 -19633 -225144
10065 -225144 -43397 83193 -4461 57498 134323 67273 194605 -79564 118247 -39315 -111375
10054 -111375 136651 47073 33389 268596 -85861 -158695 -67427 54993 -630433 -29299 -433204
10043 -433204 -120419 72211 -87159 111665 -208885 -66625 -250221 -98511 -116576 81058 -308723
10031 -123483 -101150 191720 -226964 -98365 73483 -138302 -45133 -260938 212131 201071
$$ packed form
10111B5282g6944l7901a383l11711a46025N5713B50415b18024Q5254j53994c3199
10099B1127b02185h8371B6262a3005D8455b17365Q8001A18305c18301g3619j27278
10088b00897E5083a20575A18752c15730L9947C56629F427c15345B882J16670a11689
10076A159K248a43055A34961b24786A76834a11803B64595a67028j8519a9633k05511
10065b25144d3397H3193d461E7498P6825o7050J27332g9564A18247c9315p2060
10054a11375A36651D7073j3684K35207h5861p2834f7427E4993f30433b9299m03905
10043d33204a20419G2211h7159A11665b08885f6625j83596i8511j8065H1058c08723
10031a23483K2333A91720b26964i8365G3483a38302d5133k15805B12131j1060
$$ plain form
10021 201071 -8326 28949 133994 -21453 155844 -265264 -264956 -157508 98740 -119930 -152976
10010 -152976 244377 145480 146168 -186105 -92795 98113 82080 -16010 162142 -140086 -127964
9999 -127964 6773 333661 146770 27273 56000 43916 -336365 68362 -370438 38166 4629
9987 188790 61551 116090 339808 66379 -111169 18792 -45448 -179259 -395561 -179684 -204514
9976 -204514 -2079 -75150 -392684 977 -239159 -382185 -202882 86210 -76081 -157387 115745
9964 -5961 1417 -83954 -181708 -232438 -301272 -238353 332967 -394901 -340772 -42250 167617 -142976
9951 -128804 16116 377524 -98355 63036 23578 -207408 -103669 -282462 -144948 171196
9940 -92160 42969 -145365 87305 -324767 -11779 -362000 -235331 -17922 182185 156691 -167375
$$ packed form
10021B01071h326B8949J05045b1453A55844b65264L08J07448I8740a19930l3046
10010a52976B44377r8897O88a86105i2795I8113j6033a6010A62142a40086J2122
9999a27964F773L26888A46770B7273K8727j2084c36365F8362c70438C8166D629
9987A88790F1551N4539K23718F6379a11169A8792d5448j33811k16302a79684k4830
9976b04514b079p3071l17534I77b39159j43026J79303H6210g6081q1306A15745
9964e961A417h3954r7754n0730o8834O2919C32967c94901N4129d2250A67617a42976
9951a28804A6116L61408i8355F3036B3578b07408a03669j78793J37514A71196
9940i2160D2969a45365H7305c24767a1779l50221J26669a7922A82185k5494a67375
$$ plain form
9928 332178 -233831 -92117 128301 70616 -111336 -21029 -231404 71072 37902 -293152 -279218
9917 -279218 68235 -183045 139879 -234852 197754 -56691 -81517 -141489 -171839 218463 133011
9906 133011 5811 -272840 -113896 67315 233136 256452 -31627 -198977 -265072 -104484 271500
9894 14192 -185734 -1695 -109229 -249915 12763 -420946 75155 -94868 89335 -149162 61216
9882 -207953 -124681 210021 26148 -118340 68140 161298 13347 -464083 9725 50261 62927
9871 62927 -361800 -228277 -196917 36366 244554 -125571 132129 91274 112683 -466407 -73743
9859 -136701 101666 -87673 38664 25619 301716 182932 248575 12088 -346988 -182911 19363
9847 76126 80712 5439 10576 -50493 -286179 -371369 -303757 169442 -5975 59545 202208 -89778
$$ packed form
9928C32178b33831i2117A28301n7685a11336b1029k10375G1072l3170b93152J3934
9917b79218F8235a83045A39879b34852A97754e6691k4826n9972l0350B18463q5452
9906A33011E811b72840a13896F7315J65821K3316c1627j67350o6095a04484B71500
9894A4192a85734a695j07534j40686A2763d20946G5155i4868H9335a49162F1216
9882b07953Q3272B10021B6148a18340F8140R3158A3347d64083I725M0536J2666
9871F2927c61800J33523L1360C6366K08188a25571A32129m0855K1409d66407g3743
9859a36701A01666h7673C8664j3045K76097j18784O5643A2088c46988J64077A9363
9847G6126M586E439N137e0493k35686q5190O7612A69442e975E9545J42663h9778
$$ plain form
9834 -184190 -322091 -154605 44450 191147 -268710 133293 931 -75387 102762 -81033 -122134
9823 -122134 136122 7010 43494 -84098 -135807 -110821 -118132 -6090 131585 76502 -335212 -43952
9810 -11193 -156161 -420532 58372 -254050 -289230 59781 -54299 19487 -244393 -50838 -149686
9799 -149686 -42370 -148831 70213 -114803 -159929 -191603 -118533 -85015 110210 -99585 -44169
9787 96677 -233752 -50304 160210 32574 -130910 -4860 167855 -116763 -84522 -13426 -213144
9776 -213144 -201757 -74613 377721 -89692 -46464 -162519 167470 -238939 80672 71868 -332468
9764 -27490 -300761 -432754 150248 265449 4964 26950 -337312 118214 -49401 -43363 2341
9752 197517 -94223 217442 -94946 -118966 -177098 -229160 -159396 -65818 -137213 130617 -169186
$$ packed form
9834a84190j37901a54605D4450J46697b68710A33293I31g5387A02762h1033m1101
9823a22134A36122G010L6484h4098n1709K4986p311f090A31585n5083c35212d3952
9810a1193j44968k64371E8372b54050l5180E9781e4299A9487b44393e0838r8848
9799a49686d2370j06461G0213a14803m5126l1674P3070L3518A10210i9585d4169
9787I6677b33752e0304A60210C2574a30910d860A67855a16763L2241a3426j99718
9776b13144J1387g4613C77721h9692M3228j16055A67470b38939H0672q804c32468
9764b7490k73271j31993A50248J15201D964K1986c37312A18214d9401O038B341
9752A97517i4223B17442i4946k4020n8132n2062O9764f5818p1395A30617a69186
$$ plain form
9740 245046 113239 -31254 -54137 32459 -51461 95869 -120526 -163696 -63583 9132 -114580
9728 107816 -182928 56079 138595 133757 -226529 -39084 226687 158538 5903 -77790 -201464
9717 -201464 127522 17895 -107826 -372017 -147330 131403 -465899 -143356 60294 -98070
9706 161982 -413260 -359805 -378515 -78243 325484 86338 -37806 -182266 32101 338907 -129795
9694 -336571 125968 -378790 -203353 -266961 -195654 -61054 278994 -118845 -52221 9281 -197858
9682 -286356 -217948 -152584 44005 32181 -141780 269637 158441 -189220 -306029 -204754
9672 -204754 -265594 -20099 184608 -168710 255538 -255342 250723 -16263 -273296 -41688
9661 -308545 314304 -4861 154068 -247129 130922 -98394 -159306 -100823 -48995 -32988 189755
$$ packed form
9740B45046A13239c1254k2883C2459e1461I5869a20526m3170f3583I132a14580
9728A07816a82928E6079Q2516m838b26529c9084B26687o8149E903g7790j23674
9717b01464A27522A7895a07826k64191a47330A31403d65899a43356F0294i8070
9706A61982d13260N3455j8710g8243C25484H6338c7806j44460C2101L06806a29795
9694c36571A25968c78790J75437o3608P1307f1054B78994a18845e2221I281a97858
9682b86356O8408O5364D4005j1824a41780B69637j11196a89220j16809J01275
9672b04754o0840b0099A84608a68710B55538b55342B50723a6263k57033d1688
9661c08545C14304d861A54068b47129A30922i8394o0912N8483d8995J6007A89755
$$ plain form
9649 174472 -117451 -125550 -403142 -38046 226 -52138 -83084 -62502 -169447 368474 -82249
9637 -43366 243373 -41888 -333663 -60886 -349647 -191926 -119179 230869 18864 283178 -233726
9625 32807 112951 -68337 210630 -24901 -250727 97467 -78386 -236078 26531 120825 89526
9614 89526 24077 151184 -175495 94236 -303758 -234086 78679 -222696 -111925 -11119 -115318
9603 -115318 116901 -35502 104336 -62898 -265876 95271 107749 -60905 -344151 -249960 -318566
9592 -318566 -203900 689 -331700 8517 -197534 -62497 6135 25773 -439401 23077 20677 -5418
9579 -77712 -85999 -147004 -92259 -235846 94179 139825 -46491 -82051 52598 150320 131951 -92402
9566 39248 -22243 -227289 29595 -95253 -162025 62080 115289 -91600 -268950 -64168 -99667
$$ packed form
9649A74472a17451q099k77592c8046B26e2138l0946K0582j06945C68474h2249
9637d3366B43373d1888k91775f0886k88761J57721P2747B30869A8864K64314b33726
9625C2807Q0144f8337B10630b4901k25826I7467g8386j57692B6531R4294l1299
9614H9526B4077J27107a75495I4236c03758O9672G8679b22696J10771a1119j04199
9603a15318A16901c5502A04336f2898k02978I5271J2478f0905k83246R4191o8606
9592c18566J14666F89c31700H517a97534f2497F135J9638d39401B3077k400e418
9579g7712q287o1005N4745j43587I4179M5646d6491l5560E2598R7722j8369i2402
9566C9248b2243k05046B9595i5253o6772F2080N3209i1600j77350f4168l5499
$$ plain form
9555 -99667 -52045 -100637 -271934 886 -49852 -458498 4040 -208625 130573 -244747 -118396
9543 -192230 238481 -279258 10275 -273327 -1631 -424469 101600 -91759 -73439 -25565 -225905
9532 -225905 242434 -136227 91814 -130636 26321 -156449 -130891 -7473 -114768 62103 -252676
9520 -158140 -188789 115598 -142922 -95791 -226553 -33643 -80518 13049 -133724 -9520 110514
9508 15588 -284149 31753 -173438 -150257 239906 -314309 315512 -107192 -263687 120641
9497 144440 -24363 -83473 63509 57508 -432071 64581 -114472 -154137 328049 -54222 -178911
9486 -178911 -4828 -79981 218030 -194677 -184910 367594 -80228 -108681 -109137 176812 117729 -274624
9473 -30817 73795 -117116 -318958 -135056 154730 -239947 -133401 14629 -91679 112058
$$ packed form
9555i9667M7622m8592j71297H86d9852m08646D040b08625A30573b44747a18396
9543a92230B38481b79258A0275b73327a631m22838A01600i1759J8320b5565k00340
9532b25905B42434a36227I1814a30636B6321a56449K5558g473j07295F2103b52676
9520a58140l0649A15598a42922M7131j30762c3643m6875A3049a33724i520A10514
9508A5588b84149C1753a73438K3181B39906c14309C15512a07192j56495A20641
9497A44440b4363n9110F3509o001d32071F4581a14472l9665C28049e4222j24689
9486a78911d828p5153B18030a94677R767C67594h0228k8453m56A76812n9083b74624
9473c0817G3795a17116k01842a35056A54730b39947J06546A4629i1679A12058
$$ plain form
9462 167470 -38022 80590 102946 36845 -85398 297487 211090 68447 129615 12751 -135466
9450 -52390 -105284 168966 27653 113739 -438010 -135895 -213903 -162350 -187983 -66071 29641
9438 59365 -183587 94959 -108904 -131882 -74236 62451 -34316 -229217 -237595 73073 -1107 -114051
9426 -114051 -162652 -181307 -180637 -338494 -66137 97737 56890 -49729 -269471 -186133 15739 -82173
9413 280222 -4199 172551 -300018 -80642 95081 -367782 -187483 49786 -30452 -82483 -113807
9402 -113807 -211289 58956 -124101 -208427 191737 -116162 -270788 -179344 -250144 -74243 67552
9390 -312829 -215982 -47774 54777 57443 -13847 -43238 -242240 -129079 114326 -53991 24722
9378 60074 31930 -197993 83481 -339968 -289511 -261510 92136 -104385 -76148 131933 58239
$$ packed form
9462A67470c8022H0590K2356C6845h5398B97487q6397F8447O1168A2751a35466
9450e2390n2894A68966B7653Q6086d38010a35895p8008N1553k5633f6071B9641
9438E9365a83587I4959a08904k2978N7646F2451c4316j94901q378G3073a107j12944
9426a14051m8601j8655O70j57857f6137I7737m0847d9729k19742Q3338A5739h2173
9413B80222d199A72551c00018h0642I5081c67782J80299D9786c0452n2031l1324
9402a13807r7482E8956a24101q4326A91737a16162j54626R1444p0800g4243F7552
9390c12829R6847d7774E4777K666a3847k9391j99002J13161A14326e3991B4722
9378F0074k8144a97993H3481c39968N0457K8001I2136a04385K8237A31933E8239
$$ plain form
9366 69364 26305 -152843 253959 -253676 -295008 -103946 63774 -163847 -204049 -104451 -172202
9355 -172202 171216 141925 133268 -74342 -159878 -25565 -274416 -28838 495527 -197804 -144851
9344 -144851 -149654 -73076 203945 302071 -106745 -10936 240031 176725 1473 -102722 -3806
9332 -1030 -77227 88576 -252015 -289664 -143408 67598 -197123 -79374 -307388 21246 -272549
9320 -26188 4790 -408188 -26543 -373706 -289951 -173254 -44804 -328566 38448 -185261 210563
9308 -344120 69259 -81736 69756 46969 68947 -159520 286 259075 -2470 -163697 -123914 -178221
9296 -178221 -420126 -205409 -75477 -113653 66545 -52618 127730 20361 218641 277459 41490
9284 -128182 -191666 -78082 87051 92722 40378 -329459 -118352 -24982 -234391 -324850 228595
$$ packed form
9366F9364B6305a52843B53959b53676m1332a03946F3774a63847m0202R9598o7751
9355a72202A71216k9291q657g4342q5536b5565k48851b8838D95527a97804N2953
9344a44851m803g3076B03945R8126a06745a0936B40031o3306A473a02722c806
9332a030p6197H8576b52015l7649a43408F7598a97123g9374k28014B1246b72549
9320b6188D790d08188b6543l47163Q3755J16697d4804k83762C8448a85261B10563
9308c44120F9259h1736F9756k2787K1978a59520B86K58789b470j61227L9783n4307
9296a78221k41905b05409g5477l8176F6545e2618A27730B0361J98280N8818D1490
9284a28182o3484g8082H7051N671D0378c29459a18352b4982k09409r0459B28595
$$ plain form
9272 -37956 -311965 -45068 -208762 -15817 -117267 80690 147518 149900 -21067 -6852 210384
9260 -87332 -57832 -115489 137101 18520 -21574 -374621 -253000 8212 137702 -224963 148163
9248 -159718 -186619 227442 -203437 -395297 20761 335689 -128807 81905 80386 -154977 209874
9236 -78762 175993 80774 162890 146244 -101446 -17838 282576 -10161 -150585 318840 -186537
9224 -39116 -7736 -103812 149447 181615 226233 105682 -393896 -194638 130746 -90834 -186967
9213 -186967 24504 24773 -108643 -183748 -275733 78860 36108 -182597 120624 -155815 52918
9201 -98713 -223567 -140864 -35699 -18402 19947 84936 -393363 123487 -203019 254406 -377217
9189 -164732 -15718 -209174 -94100 238697 -253473 148904 -81772 -102811 -5056 -13008 280526
$$ packed form
9272c7956k74009d5068j63694a5817j01450H0690O6828K382b1067f852B10384
9260h7332K9500n7657A37101A8520b1574l53047J21621H212J29490b24963A48163
9248a59718k6901B27442b03437j91860B0761L14928a28807H1905j519a54977B09874
9236g8762A75993H0774Q2116j6646a01446a7838B82576a0161j40424C18840a86537
9224c9116g736r6076A49447L2168M4618A05682c93896a94638A30746i0834r6133
9213a86967B4504K69a08643p5105r1985G8860C6108a82597A20624a55815E2918
9201i8713j24854Q2703c5699J7297A9947O4989c93363A23487b03019B54406c77217
9189a64732a5718j93456i4100B38697b53473A48904h1772k1039e056p952B80526
$$ plain form
9177 -176360 -146455 138752 -132090 -239297 -151738 15709 37690 6159 -132939 20948 -188838
9165 -13902 119896 235893 46128 95297 -268489 -395483 -80747 -23035 52237 71748 -115328
9153 24743 69415 245290 -146615 81213 72035 -96746 49436 -198437 -51310 -446522 -55322
9141 -190878 18878 -276631 11461 -194571 -70772 -201835 49213 -48566 25991 114219 -111288
9129 196947 -185881 189270 -256346 55444 22970 -291367 -178717 -273547 247329 91459
9118 283176 -235987 -384207 -442893 45578 -305454 -127893 -209758 -160982 -79563 -23506 183278
9106 -183468 15843 39379 151615 -168310 -46542 -37123 -89840 27439 -150449 120741 -198113
9094 175282 -216824 79540 167639 184615 292208 49974 4563 163643 -259939 -224440 -144100
$$ packed form
9177a76360K9905A38752a32090j07207Q7559A5709K1981F159a32939B0948a88838
9165a3902A19896J15997D6128M9169b68489j26994h0747b3035E2237J9511a15328
9153B4743M4672J75875a46615H1213r178i6746D9436a98437e1310l95212e5322
9141a90878A8878b76631A1461a94571g0772j31063D9213d8566B5991Q8228a11288
9129A96947a85881A89270b56346E5444B2970b91367J12650r4830B47329I1459
9118B83176b35987j48220n8686D5578c05454a27893q1865M8776g9563b3506A83278
9106a83468A5843K3536J12236a68310d6542R419n2717B7439a50449A20741a98113
9094A75282b16824G9540Q8099J6976J07593D9974D563J59080b59939L5499Q0340
$$ plain form
9083 -144100 83590 36228 -172958 177082 75536 -146744 -55804 -12150 -135159 -142093 -344852
9072 -344852 107079 10078 -169003 38070 -155605 -89155 43259 132427 -362652 -329723 -184652
9061 -184652 -212182 69431 -261610 -202735 -289881 129816 176624 -154295 -604502 120033 -424212
9049 -153580 7331 -47443 110802 -190399 -174592 -180770 -92401 -61416 28330 -106849 -145711
9038 -145711 -155992 -176996 160939 -204739 75692 -327497 -108109 15255 -195306 -122988 -49206
9026 16787 -268434 147815 -239571 181822 106724 71484 204379 -382572 -136571 -150470
9016 -150470 132782 -165830 -341549 -56332 -116031 -60860 -139418 -191064 -64997 -267707 86671
9004 241789 -337083 -305049 -211653 -96199 118933 137772 234781 -25903 228976 93153 -134038
$$ packed form
9083a44100H3590C6228a72958A77082G5536a46744e5804a2150j23009o934k02759
9072c44852A07079A0078a69003C8070a55605O6450D3259Q9168c62652L2929J45071
9061a84652k7530F9431b61610N8875q7146A29816M6808a54295m50207A20033d24212
9049a53580G331d7443A10802a90399J5807o178Q8369L0985B8330a06849l8862
9038a45711j0281k1004A60939b04739G5692c27497a08109A5255a95306P2318d9206
9026A6787b68434A47815b39571A81822p5098l5240J32895c82572a36571j3899
9016a50470A32782a65830j75719e6332n9699N5171p8558n1646f4997k02710H6671
9004B41789c37083L2034R3396i6199A18933J8839R7009b5903B28976I3153a34038
$$ plain form
8992 -354185 53338 -46333 21143 121062 171881 -249190 283508 -243480 122216 115974 -164276
8980 -15719 -2798 38623 65721 -95638 35986 -17015 -130323 -210415 -112653 -80962 21408 198083
8968 198083 194591 179797 -511899 -115619 -153726 -214118 -41350 -176331 -59294 7346 188703
8957 188703 -57736 197183 125120 -19011 -306021 8307 -54260 163642 59759 -171252 71568
8945 -183099 57546 107001 11106 27331 -108718 148706 -61638 28311 -48110 16718 353477
8934 353477 66104 -215791 -54862 -289403 -67579 47914 -17873 86487 -142296 259211 211209
8923 211209 1299579 6334867 6950646 2451381 765352 318916 75445 302923 319010 45069
8912 180257 -151878 -228905 -139829 74209 277719 14196 -281860 -64382 246904 327085 51037
$$ packed form
8992c54185E3338d6333B1143R9919N0819b49190B83508b43480A22216o242a64276
8980a5719b798C8623K7098i5638C5986a7015j13308q0092R7762L1691B1408J76675
8968A98083l492j4794e11899a15619l8107o0392d1350j34981e9294G346J81357
8957A88703e7736A97183p2063a9011k87010H307e4260A63642E9759a71252G1568
8945a83099E7546M9455A1106J6225a08718A48706f1638B8311d8110A6718L36759
8934C53477F6104b15791e4862k34541f7579D7914a7873H6487a42296B59211m8002
8923B11209J088370N035288O15779B451381G65352C18916G5445K27478J6087D5069
8912A80257a51878p7027Q9076G4209K03510A4196b81860f4382B46904Q0181E1037
$$ plain form
8900 -70104 -36053 203347 -140574 -219955 -213146 75987 -157883 112553 -66567 10493 -79397
8888 -87540 113540 64390 128586 -2926 -56872 -252190 -7957 91557 -84991 -20511 -382392 -220137
8876 -220137 -37031 -201282 -144381 308838 -237295 152156 298006 112784 82721 -335856
8865 89534 -6134 -294750 261324 -288060 -23398 143661 -114214 -245588 253802 -210644
8854 -132362 -329188 -65306 311159 -40108 30335 -28030 -167465 108262 77975 -33093 -53405
$$ packed form
8900g0104L4051B03347a40574p9381O809G5987a57883A12553f6567A0493g9397
8888h7540A13540m9150O4196b926n3946j95318g957I1557h4991b0511l61881J62255
8876b20137c7031j64251N6901C08838b37295A52156J45850A12784l0063c35856
8865H9534f134k88616B61324b88060b3398A43661a14214j31374B53802b10644
8854a32362j96826f5306C11159d0108C0335b8030j39435A08262l0287c3093k0312
$$ [...]
##END NTUPLES=NMR SPECTRUM
##END=
