##TITLE=AC1688_PANAH14369_8637421_liXURSuNMN
##JCAMPDX= 6.0         $$ Bruker NMR JCAMP-DX V2.0
##DATA TYPE= NMR SPECTRUM
##DATA CLASS= NTUPLES
##ORIGIN= BRUKER
##OWNER= Administrator
$$ 1.72 TOPSPIN		Version 2.1
$$ 2014-05-31 02:05:04.995 -0700  Administrator@X
$$ Compression mode = diff/dup
##.OBSERVE FREQUENCY= 400.02188249412
##.OBSERVE NUCLEUS= ^1H
##.ACQUISITION MODE= SIMULTANEOUS (DQD)
##.ACQUISITION SCHEME= undefined
##.AVERAGES= 64
##.DIGITISER RES= 22
##SPECTROMETER/DATA SYSTEM= spect
##.PULSE SEQUENCE= noesygpps1d.comp
##.SOLVENT NAME= COFFEE_meoh
##.SHIFT REFERENCE= INTERNAL, COFFEE_meoh, 1, 14.96097
##AUDIT TRAIL= $$ (NUMBER, WHEN, WHO, WHERE, PROCESS, VERSION, WHAT)
$$ ##TITLE= Audit trail, TOPSPIN		Version 2.1
$$ ##JCAMPDX= 5.01
$$ ##ORIGIN= Bruker BioSpin GmbH
$$ ##OWNER= Administrator
$$ $$ E:\/data/COFFEE/nmr/AC1688_PANAH14369_8637421_liXURSuNMN/12/pdata/1/auditp.txt
$$ ##AUDIT TRAIL=  $$ (NUMBER, WHEN, WHO, WHERE, PROCESS, VERSION, WHAT)
(   1,<2014-05-31 02:04:59.605 -0700>,<Administrator>,<X>,<go>,<TOPSPIN 2.1>,
      <created by zg
	started at 2014-05-31 01:53:29.916 -0700,
	POWCHK enabled, PULCHK disabled,
       configuration hash MD5:
       C8 4E 4E 5D D3 5C D8 9E 9F 52 82 E0 59 8A DE 15
       data hash MD5: 64K
       1C 96 03 18 B8 81 00 92 6D FD 2A 65 1A D4 7F F2>)
(   2,<2014-05-31 02:05:02.777 -0700>,<Administrator>,<X>,<proc1d>,<TOPSPIN 2.1>,
      <Start of raw data processing
       efp LB = 0.3 FT_mod = 6 PKNL = 1 PHC0 = 0 PHC1 = 0 SI = 128K 
       data hash MD5: 128K
       E0 BF 1B A1 FF 2A 3A 1A 93 49 DC 8E C5 24 1F 28>)
(   3,<2014-05-31 02:05:03.870 -0700>,<Administrator>,<X>,<proc1d>,<TOPSPIN 2.1>,
      <pk PHC0 = -85.14404 PHC1 = 0 
       data hash MD5: 128K
       01 CC 65 3F 1C 35 42 34 F9 DB 36 33 9E D6 88 F1>)
(   4,<2014-05-31 02:05:04.402 -0700>,<Administrator>,<X>,<proc1d>,<TOPSPIN 2.1>,
      <abs ABSG = 1 
       data hash MD5: 128K
       56 06 94 72 91 C2 32 1B 63 9F BF 00 68 94 EB 67>)
(   5,<2014-05-31 02:05:04.511 -0700>,<Administrator>,<X>,<proc1d>,<TOPSPIN 2.1>,
      <abs ABSG = 2 
       data hash MD5: 128K
       C7 95 F2 38 CF C7 7B D4 56 67 8A 18 91 E6 0F BD>)
(   6,<2014-05-31 02:05:04.605 -0700>,<Administrator>,<X>,<proc1d>,<TOPSPIN 2.1>,
      <abs ABSG = 3 
       data hash MD5: 128K
       1D 6F 2D AF 77 A5 E6 56 DB 99 AB 1D 46 F8 07 DD>)
(   7,<2014-05-31 02:05:04.683 -0700>,<Administrator>,<X>,<proc1d>,<TOPSPIN 2.1>,
      <abs ABSG = 4 
       data hash MD5: 128K
       01 9A AF F8 31 3C 35 93 DD 7B BD 27 2B B8 82 F5>)
(   8,<2014-05-31 02:05:04.777 -0700>,<Administrator>,<X>,<proc1d>,<TOPSPIN 2.1>,
      <abs ABSG = 5 
       data hash MD5: 128K
       52 5E 78 02 05 A1 91 D5 86 73 C3 05 DC CF 2B 1C>)
$$ ##END=
$$ 
$$ $$ hash MD5
$$ $$ F2 29 0A 93 EC 30 92 0C 54 24 16 84 7C A2 63 D3
##$RELAX= 
##$RELAX= 
##$RELAX= 
##$RELAX= 
##$RELAX= 
##$RELAX= 
##$RELAX= 
##$RELAX= 
$$ Bruker specific parameters
$$ --------------------------
##$DU= <E:\>
##$EXPNO= 12
$$ [...]
##$TP07= 0
##$TPNAME0= <>
##$TPNAME1= <>
##$TPNAME2= <>
##$TPNAME3= <>
##$TPNAME4= <>
##$TPNAME5= <>
##$TPNAME6= <>
##$TPNAME7= <>
##$TPOAL= (0..7)
0.5 0.5 0.5 0.5 0.5 0.5 0.5 0.5
##$TPOFFS= (0..7)
0 0 0 0 0 0 0 0
##$TUNHIN= 0
##$TUNHOUT= 0
##$TUNXOUT= 0
##$USERA1= <user>
##$USERA2= <user>
##$USERA3= <user>
##$USERA4= <user>
##$USERA5= <user>
##$V9= 5
##$VALIST= <valist>
##$VCLIST= <CCCCCCCCCCCCCCC>
##$VD= 0
##$VDLIST= <DDDDDDDDDDDDDDD>
##$VPLIST= <PPPPPPPPPPPPPPP>
##$VTLIST= <TTTTTTTTTTTTTTT>
##$WBST= 2048
##$WBSW= 25
##$XGAIN= (0..3)
0 0 0 0
##$XL= 0
##$YL= 0
##$YMAX_a= 6156294
##$YMIN_a= -12879717
##$ZGOPTNS= <>
##$ZL1= 120
##$ZL2= 120
##$ZL3= 120
##$ZL4= 120
##$ABSF1= 14.96097
##$ABSF2= -5.597212
##$ABSG= 5
##$ABSL= 3
##$ALPHA= 0
##$AQORDER= 0
##$ASSFAC= 0
##$ASSFACI= 0
##$ASSFACX= 0
##$ASSWID= 0
##$AUNMP= <proc_prof1d_extract.lims>
##$AXLEFT= 0
##$AXNAME= <>
##$AXNUC= <1H>
##$AXRIGHT= 0
##$AXTYPE= 0
##$AXUNIT= <>
##$AZFE= 0.1
##$AZFW= 0.1
##$BCFW= 0
##$BC_mod= 0
##$BYTORDP= 0
##$COROFFS= 0
##$CY= 15
##$DATMOD= 1
##$DC= 0
##$DFILT= <>
##$DTYPP= 0
##$F1P= 0
##$F2P= 0
##$FCOR= 0.5
##$FTSIZE= 131072
##$FT_mod= 6
##$GAMMA= 0
##$GB= 0
##$INTBC= 1
##$INTSCL= 1
##$ISEN= 128
##$LB= 0.3
##$LEV0= 0
##$LPBIN= 0
##$MAXI= 10000
##$MC2= 0
##$MEAN= 0
##$ME_mod= 0
##$MI= 0
##$NCOEF= 0
##$NC_proc= -2
##$NLEV= 6
##$NOISF1= 0
##$NOISF2= 0
##$NSP= 0
##$NTH_PI= 0
##$NZP= 0
##$OFFSET= 14.96097
##$PC= 1
##$PHC0= -85.14404
##$PHC1= 0
##$PH_mod= 1
##$PKNL= yes
##$PPARMOD= 0
##$PPDIAG= 0
##$PPIPTYP= 0
##$PPMPNUM= 2147483647
##$PPRESOL= 1
##$PSCAL= 4
##$PSIGN= 0
##$PYNMP= <proc.py>
##$REVERSE= no
##$SF= 400.020009650949
##$SI= 131072
##$SIGF1= 0
##$SIGF2= 0
##$SINO= 400
##$SIOLD= 131072
##$SPECTYP= <>
##$SREGLST= <1H.CDCl3>
##$SSB= 0
##$STSI= 131072
##$STSR= 0
##$SW_p= 8223.68421052631
##$SYMM= 0
##$S_DEV= 0
##$TDeff= 65536
##$TDoff= 0
##$TI= <>
##$TILT= no
##$TM1= 0
##$TM2= 0
##$TOPLEV= 0
##$USERP1= <user>
##$USERP2= <user>
##$USERP3= <user>
##$USERP4= <user>
##$USERP5= <user>
##$WDW= 1
##$XDIM= 131072
##$YMAX_p= 401377687
##$YMIN_p= -11705
##$CURPLOT= <Network HP LaserJet P1505>
##$CURPRIN= <$Network HP LaserJet P1505>
##$DFORMAT= <normdp>
##$LAYOUT= <+/1D_H.xwp>
##$LFORMAT= <normlp>
##$PFORMAT= <normpl>
##$SURQMSG= 1
$$ End of Bruker specific parameters
$$ ---------------------------------
##NTUPLES= NMR SPECTRUM
##VAR_NAME=  FREQUENCY,     SPECTRUM/REAL,   SPECTRUM/IMAG
##SYMBOL=    X,             R,               I
##VAR_TYPE=  INDEPENDENT,   DEPENDENT,       DEPENDENT
##VAR_FORM=  AFFN,          ASDF,            ASDF
##VAR_DIM=   131072,        131072,          131072
##UNITS=     HZ,            ARBITRARY UNITS, ARBITRARY UNITS
##FACTOR=    0.0627417313425164, 1,          1
##FIRST=     8223.62146879497, -398,         -59177
##LAST=      0,             1582,            -59589
##MIN=       0,             -11705,          0
##MAX=       8223.62146879497, 401377687,    0
$$ Real data points
##PAGE= N=1
##DATA TABLE= (X++(R..R)), XYDATA
$$ [...]
61627D90536j50j086k442l642m074l896l691l616l451l257l396l880m296m394
$$ 490536 490386 489300 486858 483216 479142 475246 471555 467939 464488 461231 457835 453955 449659 445265
61613D45265m369m370m239l891l636l799m253m563m490m170l940m000m221m206
$$ 445265 440896 436526 432287 428396 424760 420961 416708 412145 407655 403485 399545 395545 391324 387118
61599C87118l723l026k600k609k793k862k701k282j739j495j855k476k630k130
$$ 387118 383395 380369 377769 375160 372367 369505 366804 364522 362783 361288 359433 356957 354327 352197
61585C52197j492j078o73j77k9m99j060j105q43q54j035q14k30j9m99j032q84
$$ 352197 350705 349627 348954 348777 348748 348249 347189 346084 345241 344387 343352 342538 342308 342289 341790 340758 339874
61568C39874j13O82J109J274J504J946K317K102J209L88N53J682K764L000K578
$$ 339874 339761 340443 341552 342826 344330 346276 348593 350695 351904 352292 352845 354527 357291 360291 362869
61553C62869K148J950J847J770J714J447P65j6j94M69J317J455P48j9k4P40J592
$$ 362869 365017 366967 368814 370584 372298 373745 374510 374494 374300 374769 376086 377541 378289 378270 378246 378986 380578
61536C80578K019K092K045J801J180L30l81p67q71p39m62l37o17j158j656k132
$$ 380578 382597 384689 386734 388535 389715 390045 389664 388897 388026 387287 386825 386488 385871 384713 383057 380925
61520C80925k786l423l558l121k578k166j575o44J49K96K2pN09J313K023K388
$$ 380925 378139 374716 371158 368037 365459 363293 361718 361074 361223 361519 361541 361534 362043 363356 365379 367767
61504C67767K304J898J520J295R10K00k61L26J881L382L987L817L474L235L034
$$ 367767 370071 371969 373489 374784 375694 375894 375633 375959 377840 381222 385209 389026 392500 395735 398769
61489C98769K880K869K844K547K086J952K303K606K256J532J441K557M217N217
$$ 398769 401649 404518 407362 409909 411995 413947 416250 418856 421112 422644 424085 426642 430859 436076
61475D36076N060M261L457K687J599J57j175j839j686j088o76q75j582k323k740
$$ 436076 441136 445397 448854 451541 453140 453297 452122 450283 448597 447509 446833 445958 444376 442053 439313
61460D39313k859k922l063l231l301l196k950k657k328j868j270p44n13m86l38
$$ 439313 436454 433532 430469 427238 423937 420741 417791 415134 412806 410938 409668 408924 408411 407925 407587
61445D07587P5O11J071J416J633J651J434J143J092J488K087K167J218k10q15
$$ 407587 407662 408273 409344 410760 412393 414044 415478 416621 417713 419201 421288 423455 424673 424463 423648
61430D23648n6J055J262O81L02K46k77j193j111O93K890L630K761J602J024Q02
$$ 423648 423592 424647 425909 426590 426892 427138 426861 425668 424557 425250 428140 431770 434531 436133 437157 437959
61414D37959O42O86R52J062Q69O95Q05J025J031O28k62j474k390k299j187J64
$$ 437959 438601 439287 440239 441301 442170 442865 443670 444695 445726 446354 446092 444618 442228 439929 438742 438906
61398D38906Q87P16ko51q11o23o13r32j066o76k71l77m42M78K094L026K770K363
$$ 438906 439793 440509 440507 439856 439045 438422 437809 436877 435811 435135 434864 434487 434045 434523 436617 439643 442413 444776
61380D44776K703L306L476L698M730N950O021M974M359M998N749N166L536K404
$$ 444776 447479 450785 454261 457959 462689 468639 474660 479634 483993 488991 494740 499906 503442 505846
61366E05846K416K662K163J163N05K49l18j492k569k751k097j175j36J302K996
$$ 505846 508262 510924 513087 514250 514755 515004 514686 513194 510625 507874 505777 504602 504466 505768 508764
61351E08764M130M059L077K045J522J426J411J258R37M88nl53k95K21Q00Q83L68
$$ 508764 512894 516953 520030 522075 523597 525023 526434 527692 528629 529117 529112 528759 528464 528685 529485 530368 530736
61334E30736k12l85l30m63o84n93k98m02j031j515j308o97k36Q9O65J521K343
$$ 530736 530524 530139 529809 529346 528662 528069 527771 527369 526338 524823 523515 522818 522582 522671 523336 524857 527200
61317E27200L074M030N347O756P949Q984J0147J1580J3130J4558J5856J7237J8741
$$ 527200 530274 534304 539651 546407 554356 563340 573487 585067 598197 612755 628611 645848 664589
61304F64589J9962K0423K0135J9502J8607J6976J4234J0655O867L268J1k726m838
$$ 664589 684551 704974 725109 744611 763218 780194 794428 805083 811950 815218 815229 812503 807665
61291H07665o476p881r130j0310j1728j3539j5268j6034j5369j3635j1732j0488
$$ 807665 801189 793308 784178 773868 762140 748601 733333 717299 701930 688295 676563 666075
61279F66075j0116r988r109p148m902l402k720k055r11L03R50R76P84O92P78J089
$$ 666075 655959 645971 636862 629714 624812 621410 618690 616635 615724 616027 616977 617953 618737 619429 620207 621296
61263F21296J664K372K965L320L530L765M066M303M279L890L216K440J748J189
$$ 621296 622960 625332 628297 631617 635147 638912 642978 647281 651560 655450 658666 661106 662854 664043
61249F64043O36j15j062j830j989j564j036q23q94r81r47q33p39p82r73j022n82
$$ 664043 664679 664564 663502 661672 659683 658119 657083 656260 655366 654385 653438 652605 651866 651084 650111 649089 648507
61232F48507K20Q29J075J539K766M429N785O690P617Q794R910J0645J1007J1088
$$ 648507 648727 649556 650631 652170 654936 659365 665150 671840 679457 688251 698161 708806 719813 730901
61218G30901J0974J0941J1245J1638J1537J0836J0065R594R108Q190O953N822
$$ 730901 741875 752816 764061 775699 787236 798072 808137 817731 826839 835029 841982 847804
61206H47804N013M571M624N145N673N685N293N190N946P513R473J1503J3474J5174
$$ 847804 852817 857388 862012 867157 872830 878515 883808 888998 894944 902457 911930 923433 936907 952081
61192I52081J6084J5641J3729J0864P796M992K601O82q87k560m780p392r689j1159
$$ 952081 968165 983806 997535 1008399 1016195 1021187 1023788 1024470 1023583 1021023 1016243 1008851 999162 988003
61178I88003j1909j2363j2822j3441j4244j5010j5420j5427j5282j5127j4925
$$ 988003 976094 963731 950909 937468 923224 908214 892794 877367 862085 846958 832033
61167H32033j4777j4869j4986j4630j3827j3277j3372j3535j3043j2022j1106
$$ 832033 817256 802387 787401 772771 758944 745667 732295 718760 705717 693695 682589
61156F82589j0406r412p761n567l120p80J012K053K648L088L041J989J92j444
$$ 682589 672183 662771 655010 649443 646323 645543 646555 648608 651256 654344 657385 659374 659566 658122
61142F58122k453l227m273n536o580o979o361m635k302k05J240K263L182M083
$$ 658122 655669 652442 648169 642633 636053 629074 622713 618078 615776 615571 616811 619074 622256 626339
61128F26339N114O499Q035R127R667J0395J2052J4498J7031J9178K0856K2099
$$ 626339 631453 637952 645987 655114 664781 675176 687228 701726 718757 737935 758791 780890
61116G80890K3175K4578K6429K8077K8772K8553K8015K7378K6337K4734K2826
$$ 780890 804065 828643 855072 883149 911921 940474 968489 995867 1022204 1046938 1069764
61105A069764K0788J8555J6205J4051J2108R877O916L333m57m225p899j1296j4203
$$ 1069764 1090552 1109107 1125312 1139363 1151471 1161348 1168264 1171597 1171140 1166915 1159016 1147720 1133517
61092A133517j6609j8626k0217k1167k1361k0935k0173j9328j8524j7740j6819
$$ 1133517 1116908 1098282 1078065 1056898 1035537 1014602 994429 975101 956577 938837 922018
61081I22018j5552j3823j1705r498p483n594l398o21K356M789O388P650R194J1025
$$ 922018 906466 892643 880938 871440 863957 858363 854965 854344 856700 861489 867877 875527 884721 895746
61067H95746J2685J4023J5417J7188J9176K1128K3184K5554K7904K9550L0516
$$ 895746 908431 922454 937871 955059 974235 995363 1018547 1044101 1072005 1101555 1132071
61056A132071L1837L4388L7631M0086M1024M1153M1492M2070M2141M1343M0084
$$ 1132071 1163908 1198296 1235927 1276013 1317037 1358190 1399682 1441752 1483893 1525236 1565320
61045A565320L8830L7442L5374L2244K8117K3363J8505J4085J0479P659N222K810
$$ 1565320 1604150 1641592 1676966 1709210 1737327 1760690 1779195 1793280 1803759 1811418 1816640 1819450
61033A819450N82r42j541j673j910k148j752m61J311L076M766O510Q428J0988
$$ 1819450 1820032 1819090 1817549 1815876 1813966 1811818 1810066 1809605 1810916 1813992 1818758 1825268 1833696 1844684
61019A844684J5005K0849K7903L5258M2633N0207N7954O5907P4917Q6460J01664
$$ 1844684 1859689 1880538 1908441 1943699 1986332 2036539 2094493 2160400 2235317 2321777 2423441
61008B423441J21106J45526J76172K14621K63193L25719M07112N12418O47512
$$ 2423441 2544547 2690073 2866245 3080866 3344059 3669778 4076890 4589308 5236820
60999E236820Q19852J033154J274564J505127J668195J715826J633998J446350
$$ 5236820 6056672 7089826 8364390 9869517 11537712 13253538 14887536 16333886
60991A6333886J196793R30335O86771N00725L93082L54768L42373K98622J84172
$$ 16333886 17530679 18461014 19147785 19648510 20041592 20396360 20738733 21037355 21221527
60982B1221527n885k50838n23263p98978j055816j271706j428181j515361j533287
$$ 21221527 21215642 20964804 20441541 19642563 18586747 17315041 15886860 14371499 12838212
60973A2838212j489748j397391j271307j126857r77791q34883p05073n91517m94718
$$ 12838212 11348464 9951073 8679766 7552909 6575118 5740235 5035162 4443645 3948927
60964C948927m13869l47336k92766k47814k10994j81334j57354j37121j19451
$$ 3948927 3535058 3187722 2894956 2647142 2436148 2254814 2097460 1960339 1840888
60955A840888j04235r1380q0079o9562n9970n1936m5669m0912l7464l5185l3618
$$ 1840888 1736653 1645273 1565194 1495632 1435662 1383726 1338057 1297145 1259681 1224496 1190878
60944A190878l2140l0605k9449k9088k9296k9296k8405k6646k4737k3377k2546
$$ 1190878 1158738 1128133 1098684 1069596 1040300 1011004 982599 955953 931216 907839 885293
60933H85293k1692k0509j9256j8211j7202j5941j4429j2805j1020r085p466o790
$$ 885293 863601 843092 823836 805625 788423 772482 758053 745248 734228 725143 717677 710887
60921G10887p110p765q063p858p414o956o460n730m594l157j889j256j150r23
$$ 710887 703777 696012 687949 680091 672677 665721 659261 653531 648937 645780 643891 642635 641485 640562
60907F40562j37Q12J149O62p9n27p84j263k048k917l767m596n201n403n536o171
$$ 640562 640425 641237 642386 643048 642969 642442 641658 640395 638347 635430 631663 627067 621866 616463 610927 604756
60891F04756p174p699p332o738o633o760o512o149o471p456q136p933p276o685
$$ 604756 597582 589883 582551 575813 569180 562420 555908 549759 543288 535832 527696 519763 512487 505802
60877E05802o051n252m669m510m157l018j597r82j358j770j400m25N70J457K470
$$ 505802 499751 494499 489830 485320 481163 478145 476548 475566 474208 472438 471038 470613 471183 472640 475110
60862D75110L583M439M840N052N507O286O901O739N767M688M220M294M263L805
$$ 475110 478693 483132 487972 493024 498531 504817 511718 518457 524224 528912 533132 537426 541689 545494
60848E45494L260K980K726K094J273Q85J041J001L3j686l276m119m337m460m898
$$ 545494 548754 551734 554460 556554 557827 558712 559753 560754 560787 559101 555825 551706 547369 542909 538011
60833E38011n720o599o991o667o064n792n794n419m417l396l025l240l589l942
$$ 538011 532291 525692 518701 512034 505970 500178 494384 488965 484548 481152 478127 474887 471298 467356
60819D67356m363m668m666m579m698m746m255l406k926l112l563l921m219m460
$$ 467356 462993 458325 453659 449080 444382 439636 435381 431975 429049 425937 422374 418453 414234 409774
60805D09774m381l854l029j990q29q7l87j395j884j186K4Q01J083J309J540J603
$$ 409774 405393 401539 398510 396520 395691 395604 395217 393822 391938 390752 390776 391577 392660 393969 395509 397112
60789C97112J602J631J391P58L58Q51J939K760L048L113K999K491J908J884K251
$$ 397112 398714 400345 401736 402494 402852 403703 405642 408402 411450 414563 417562 420053 421961 423845 426096
60774D26096K007P33p36j448j537j733k151k187j449l07N40O82K49k85n06m21
$$ 426096 428103 428836 428100 426652 425115 423382 421231 419044 417595 417288 417828 418510 418759 418474 417968 417547
60758D17547m00p10j190j476j464j379j385j374j205j020j026j017m58O94J615
$$ 417547 417147 416437 415247 413771 412307 410928 409543 408169 406964 405944 404918 403901 403443 404137 405752
60743D05752J490N55k42n29q09j412j957k152k404l047l581l367k622k031j689
$$ 405752 407242 407797 407555 407026 406217 404805 402848 400696 398292 395245 391664 388297 385675 383644 381955
60728C81955j245q14r00j402j526q35K56J173J747K000J951J793J780J791J501
$$ 381955 380710 379896 378996 377594 376068 375233 375489 376662 378409 380409 382360 384153 385933 387724 389225
60713C89225J058J082J818K809L537L889L878L500L030K865K852K394J444P34
$$ 389225 390283 391365 393183 395992 399529 403418 407296 410796 413826 416691 419543 421937 423381 424115
60699D24115O56O84L92K41O79J040L52j113k061j879j221q30o26k85K1o3m51p66
$$ 424115 424771 425455 425847 426088 426767 427807 428159 427046 424985 423106 421885 421055 420429 420144 420165 420102 419651 418885
60681D18885q54p65m34K68J175J905K261K368K301J960J431J192J600K198J992
$$ 418885 418031 417266 416832 417100 418275 420180 422441 424809 427110 429070 430501 431693 433293 435491 437483
60666D37483O29j098k094k156j935j975k228k475k650k648k278j601r78m91K53
$$ 437483 438112 437014 434920 432764 430829 428854 426626 424151 421501 418853 416575 414974 413996 413505 413758
60651D13758J502K797L483L533L448L413L091K329J553J144P80j60j541k397k135
$$ 413758 415260 418057 421540 425073 428521 431934 435025 437354 438907 440051 440831 440671 439130 436733 434598
60636D34598j456j592k729l735l557k348r67J67J126J757J656R06K73L60R30J294
$$ 434598 433142 431550 428821 425086 421529 419181 418214 418381 419507 421264 422920 423826 424099 424459 425389 426683
60620D26683J091N39Q7N6M59J040J466J457Q89n4p62o28J93Q05O51K09J74L88
$$ 426683 427774 428313 428400 428456 428915 429955 431421 432878 433767 433713 432951 432323 432516 433321 433972 434181 434355 434743
60602D34743K19l62q64j167j481j539q79N3K07m35o14L74J632K045J786J616J536
$$ 434743 434962 434600 433736 432569 431088 429549 428670 428723 428930 428495 427881 428255 429887 431932 433718 435334 436870
60585D36870J106N78O30J234J660J528J147Q98Q30Q27P36M99M53J199K767M350
$$ 436870 437976 438554 439184 440418 442078 443606 444753 445651 446481 447308 448044 448543 448996 450195 452962 457312
60569D57312N370O303P803R470J0353J0324J0068R812R066P583N760L991K394
$$ 457312 462682 468985 476788 486258 496611 506935 517003 526815 535881 543464 549224 553215 555609
60556E55609J163M53j96j440l008l743l114j921j138p28k9J176K572L842M821
$$ 555609 556772 557225 557029 555589 552581 548838 545724 543803 542665 541937 541908 543084 545656 549498 554319
60541E54319N401N707O279P655R840J2337J4565J6150J7020J7404J7639J7777
$$ 554319 559720 565427 571706 579361 589201 601538 616103 632253 649273 666677 684316 702093
60529G02093J7415J5941J2990Q824M467J056j186l201n821q537j0107j0242r925
$$ 702093 719508 735449 748439 757263 761730 762786 761600 758399 752578 744041 733934 723692 713767
60516G13767r975j0068r503q234o756n401m232l291k512j603l09J369L313N456
$$ 713767 703792 693724 684221 675987 669231 663830 659598 656307 653795 652192 651883 653252 656565 662021
60502F62021P667R864J2363J5686J9722K3509K6212K7996K9603L1404L3200L4646
$$ 662021 669688 679552 691915 707601 727323 750832 777044 805040 834643 866047 899247 933893
60490I33893L5392L5027L3379L0855K8074K5185K1841J7821J3295Q477L213k909
$$ 933893 969285 1004312 1037691 1068546 1096620 1121805 1143646 1161467 1174762 1183239 1186452 1183543
60478A183543j0050j7756k5066l1147l5878l9666m2645m4317m4119m2124l9004
$$ 1183543 1173493 1155737 1130671 1099524 1063646 1023980 981335 937018 892899 850775 811771
60467H11771l5527l2267k9530k7235k4936k2238j9275j6572j4470j2800j1168
$$ 811771 776244 743977 714447 687212 662276 640038 620763 604191 589721 576921 565753
60456E65753r520q316q013q345q329p244n455l933l108k655k351k446k971l260
$$ 565753 556233 547917 539904 531559 523230 515986 510531 506598 503490 500835 498484 496038 493067 489807
60442D89807k721j671r94j126j796k555l118l282k976k372j745j187p00m20m95
$$ 489807 487086 485415 484421 483295 481499 478944 475826 472544 469568 467196 465451 464264 463564 463144 462649
60427D62649p77r02o75j47O12J524K303K502J971J162Q01J216K005K452K272J814
$$ 462649 461872 460970 460295 460148 460760 462284 464587 467089 469060 470222 471023 472239 474244 476696 478968 480782
60411D80782J434J024M47J40P19J958K812K670K010J634J725K031K401K740K796
$$ 480782 482216 483240 483687 483827 484546 486504 489316 491986 493996 495630 497355 499386 501787 504527 507323
60396E07323K542K419K726L125L200L177L464L820L685L159K865K908K733K138
$$ 507323 509865 512284 515010 518135 521335 524512 527976 531796 535481 538640 541505 544413 547146 549284
60382E49284J670J788K207K418K336K153J949J809J959K439K969L354L739M127
$$ 549284 550954 552742 554949 557367 559703 561856 563805 565614 567573 570012 572981 576335 580074 584201
60368E84201M029L067J688Q21Q54J335J677J774J852K190L087M755O880Q606R415
$$ 584201 588230 591297 592985 593806 594660 595995 597672 599446 601298 603488 606575 611330 618210 626816 636231
60353F36231R928J1219J3263J4685J4406J2939J1489J0245Q453N950L478J332
$$ 636231 646159 657378 670641 685326 699732 712671 724160 734405 742858 748808 752286 753618
60341G53618j161m241o825p919q173q912j0059j0226q787o731n317m827m914n292
$$ 753618 752457 748216 741391 733472 725299 716387 706328 696102 687315 680584 675267 670440 665526 660234
60327F60234n596n362m595l980m025m443m689m640m357l662k425r16N68K150M014
$$ 660234 654638 649276 644681 640701 636676 632233 627544 622904 618547 614885 612460 611544 612112 614262 618276
60312F18276N911P506Q991J0791J2761J4134J4319J3433J2054J0721R618Q543
$$ 618276 624187 631693 640684 651475 664236 678370 692689 706122 718176 728897 738515 747058
60300G47058P171N447L620J761m80l367o570r418j1571j3127j4217j4779j4707
$$ 747058 754229 759676 763296 765057 764577 761210 754640 745222 733651 720524 706307 691528 676821
60287F76821j3915j2349j0181p941o149m886l897l179l040l593m373m675m248
$$ 676821 662906 650557 640376 632435 626286 621400 617503 614324 611284 607691 603318 598643 594395
60274E94395l599l533m291n205n422m890m362m393m797n163n335n119m168k684
$$ 594395 590796 587263 582972 577767 572345 567455 563093 558700 553903 548740 543405 538286 534118 531434
60260E31434j727k057k982l165k345j418q64j67J010K028K168J677J301J290J398
$$ 531434 529707 527650 524668 521503 519158 517740 516876 516709 517719 519747 521915 523592 524893 526183 527581
60245E27581J485J603J692J716J810J941J659O99m07q40n28j25m8n4J62M72N93
$$ 527581 529066 530669 532361 534077 535887 537828 539487 540186 539779 538939 538411 538286 538238 538184 538346 538818 539411
60228E39411N71O64J005J471J908K317K896L797M821N527N820O176P015Q057Q723
$$ 539411 539982 540646 541651 543122 545030 547347 550243 554040 558861 564388 570208 576384 583399 591456 600179
60213F00179Q980R307R854J0290J0493J0777J1168J1124J0401R650R512R623R167
$$ 600179 609159 618466 628320 638610 649103 659880 671048 682172 692573 702223 711735 721358 730525
60200G30525Q216P658P791P804O878N163L318J655K09q72j540k225l379m800n908
$$ 730525 738741 746399 754190 761994 768872 774035 777353 779008 779217 778345 776805 774580 771201 766401 760493
60185G60493o570p157p791q148q143q217q603q812q231o945n586m538l746l108
$$ 760493 753923 746766 738975 730827 722684 714467 705864 697052 688821 681876 676290 671752 668006 664898
60171F64898k727k705k983l371l551l249k586k132k321k942l433l521l212k508
$$ 664898 662171 659466 656483 653112 649561 646312 643726 641594 639273 636331 632898 629377 626165 623657
60157F23657j550q63q59j172j115p02n24o30l51N66J544K225K996L934M148L103
$$ 623657 622107 621244 620385 619213 618098 617396 616872 616242 615891 616457 618001 620226 623222 627156 631304 634407
60141F34407J890K100L759N464O364O934P772Q709R366R702R622Q860P636O803
$$ 634407 636297 638397 642156 647620 653984 660918 668690 677399 686765 696467 706089 714949 722585 729388
60127G29388O767O826O049M500L098K519K677L071L315L374L574M176M917N185
$$ 729388 736155 742981 749030 753530 756628 759147 761824 764895 768210 771584 775158 779334 784251 789436
60113G89436M739L961L267K666K069J573J171N07o70k133l492m594n369n592n247
$$ 789436 794175 798136 801403 804069 806138 807711 808882 809389 808719 806586 803094 798500 793131 787539 782292
60098G82292m770m532m306l637k623j891j897k517l264l600l153j997p06J5j39
$$ 782292 777522 772990 768684 765047 762424 760533 758636 756119 752855 749255 746102 744105 743399 743414 743275
60083G43275q81j549j591j089p79j231k058k442k367k619l559m638n441o310p422
$$ 743275 742394 740845 739254 738165 737386 736155 734097 731655 729288 726669 723110 718472 713031 706721 699299
60068F99299q175q152p893p966q005p559p127p271p356o479n139m537m519l809
$$ 699299 691124 682972 675079 667113 659108 651549 644422 637151 629795 623316 618177 613640 609121 605312
60054F05312k296j358j570j687o37Q36J492J465J745K584L451M158N040O213P328
$$ 605312 603016 601658 600088 598401 597764 598600 600092 601557 603302 605886 609337 613495 618535 624748 632076
60039F32076P962P852O969N700M628L844K902J717Q86P03N12l89j741k852l663
$$ 632076 640038 647890 654859 660559 665187 669031 671933 673650 674536 675239 675751 675362 673621 670769 667106
60024F67106m607n722o645p302p973q756r466r933j0055r710q963q146p413o566
$$ 667106 662499 656777 650132 642830 634857 626101 616635 606702 596647 586937 577974 569828 562415 555849
60010E55849n589m902m671m360l540k688k499k731k450j277K45J360J677J270
$$ 555849 550260 545358 540687 536327 532787 530099 527600 524869 522419 521142 521387 522747 524424 525694
59996E25694P14P60J431J863J620J637K963M933N805N059L936L573L765L876L886
$$ 525694 526408 527168 528599 530462 532082 533719 536682 541615 547420 552479 556415 559988 563753 567629 571515
59981E71515L911L535K332O25q76j849k421k788l125l499l680l316k578k137k253
$$ 571515 575426 578961 581293 581918 581042 579193 576772 573984 570859 567360 563680 560364 557786 555649 553396
59966E53396k323j713o07M11J249K246L401M226M355L931L409L127L115L087K669
$$ 553396 551073 549360 548753 549164 550413 552659 556060 560286 564641 568572 571981 575108 578223 581310 583979
59951E83979J739N66m44j039j211j096q78o85n57n95r73j621k095k088j972k333
$$ 583979 585718 586284 585840 584801 583590 582494 581616 580931 580374 579779 578806 577185 575090 573002 571030 568697
59935E68697k986l027j958l14J080K028K849L791M957O469Q192R458R546Q490
$$ 568697 565711 562684 560726 560412 561492 563520 566369 570160 575117 581586 589778 599236 608782 617272
59921F17272P064N904M869L414J412m94j403j069j58M46N75Q52J829L301M524
$$ 617272 624336 630240 635109 638523 639935 639441 638038 636969 636811 637257 637832 638684 640513 643814 648338
59906F48338M921M476L566K634J911J342P53Q0n79j064j234j069p88p14q55p52
$$ 648338 653259 657735 661301 663935 665846 667188 667941 668021 667442 666378 665144 664075 663287 662573 661718 660966
59890F60966m7J042K097L168M547O006O910P168P470Q261R034R121Q715Q567Q822
$$ 660966 660919 661961 664058 667226 671773 677779 684689 691857 699327 707588 716622 725743 734458 743025 751847
59875G51847Q779P899O555N521M926M144K752J228L45N2m35j377k010j742j293
$$ 751847 760626 768525 775080 780601 785527 789671 792423 793651 793996 794048 793613 792236 790226 788484 787191
59860G87191j847l410m847n474n653n750n492m755m135m042l894k868j122M34
$$ 787191 785344 781934 777087 771613 765960 760210 754718 749963 745828 741786 737892 735024 733902 734336
59846G34336J325J846K363K766K658J769K12j381k209k001j248m82L14J306K144
$$ 734336 735661 737507 739870 742636 745294 747063 747275 745894 743685 741684 740436 739954 740268 741574 743718
59831G43718K201J349M8j214k184k575k143j096j98j65j057k213k750k281j294
$$ 743718 745919 747268 747316 746102 743918 741343 739200 738104 737906 737741 736684 734471 731721 729440 728146
59816G28146p06r10j449j709j655j663j932k369k779k884k437j665j328j877k810
$$ 728146 727440 726530 725081 723372 721717 720054 718122 715753 712974 710090 707653 705988 704660 702783 699973
59801F99973l344l482l870m707n452n617n282m718m113l736l888m446m904n015
$$ 699973 696629 693147 689277 684570 679118 673501 668219 663501 659388 655652 651764 647318 642414 637399
59787F37399m941m639l671k064q08q76k019l054l213k653j749n32R13K102K630
$$ 637399 632458 627819 624148 622084 621276 620400 618381 615327 612114 609461 607712 607180 608093 610195 612825
59772F12825K757L050L599L992M117M420N218O054O202N578M886M792N316O040
$$ 612825 615582 618632 622231 626223 630340 634760 639978 646032 652234 657812 662698 667490 672806 678846
59758F78846O632P084P634Q541R753J0758J0946J0261R327Q880R148R778J0126
$$ 678846 685478 692562 700196 708737 718490 729248 740194 750455 759782 768662 777810 787588 797714
59745G97714R651Q333O759N540M653L653K505J661J173M08r94k411l057l080l150
$$ 797714 807365 815698 822457 827997 832650 836303 838808 840469 841642 842050 841056 838645 835588 832508 829358
59730H29358l261k814j816j087j053j017k31R00J236L66r24j654j623j255r00
$$ 829358 826097 823283 821467 820380 819327 818310 818079 818979 820215 820581 819657 818003 816380 815125 814225
59715H14225o42o38j161k142k951k918k021q83j54m2l47o05k75R02K516L800M471
$$ 814225 813583 812945 811784 809642 806691 803773 801752 800869 800715 800673 800326 799721 799446 800348 802864 806664 811135
59698H11135N012N957P166Q064Q364Q246P981P689P327O670N330L171P22j082
$$ 811135 816147 822104 829270 837334 845698 853944 861925 869614 876941 883611 888941 892112 892834 891752
59684H91752j761j767k025k984m292n392o238p129p949q088p340o425o118o244
$$ 891752 889991 888224 886199 883215 878923 873531 867293 860164 852215 844127 836787 830362 824244 818000
59670H18000o154n863n836n853n101l577k270j581o31J149K821L289L053L460
$$ 818000 811846 805983 800147 794294 789193 785616 783346 781765 781134 782283 785104 788393 791446 794906
59656G94906M646N496N500N423N998O929P492P345O476M993L248J618m4k292n192
$$ 794906 799552 805048 810548 815971 821969 828898 836390 843735 850211 855204 858452 860070 860026 857734 852542
59641H52542q043j0142j1426j2153j2391j2078j1287j0240r203q422p890p234
$$ 852542 844499 834357 822931 810778 798387 786309 775022 764782 755579 747157 739267 732033
59629G32033o155m951m267m357m932n623o199o431o278o180o618p376p722p332
$$ 732033 725878 720927 716660 712303 707371 701748 695549 689118 682840 676660 670042 662666 654944 647612
59615F47612o530n645m692l793l242k976k520j688q09j23M72R39R69N71K32K09
$$ 647612 641082 635437 630745 626952 623710 620734 618214 616526 615717 615594 616066 617005 617974 618545 618777 618986
59599F18986K27J42L00Q54J286J121O41M25N34O38O15O49R10J469K205K588K002
$$ 618986 619213 619355 619655 620509 621795 622916 623557 623982 624516 625154 625769 626418 627328 628797 631002 633590 635592
59582F35592O07o11j029j169j806k833l578l870m031m120l889l397l008k806k547
$$ 635592 636199 635588 634559 633390 631584 628751 625173 621303 617272 613152 609263 605866 602858 600052 597505
59567E97505k138j712j288q34o07q85j452j761j644j372j097p13k74j1J74O32
$$ 597505 595367 593655 592367 591533 590926 590041 588589 586828 585184 583812 582715 582002 581728 581717 581891 582523
59551E82523J309J653J426J150J387J991K492K907L742N226P010Q709J0438J2607
$$ 582523 583832 585485 586911 588061 589448 591439 593931 596838 600580 605806 612816 621525 631963 644570
59537F44570J5216J7527J8494J7559J4959J1338P260L166m39l100m697n398n338
$$ 644570 659786 677313 695807 713366 728325 739663 746923 750089 749650 746550 741853 736455 731117
59524G31117m555l220j810q77p19j217j910k303k273k230k764m085n762p041p409
$$ 731117 726562 723342 721532 720655 719936 718719 716809 714506 712233 710003 707239 703154 697392 690351 682942
59509F82942o972o319n945n813n598n275n163n309n205m399l132j983j128l07
$$ 682942 675970 669651 663706 657893 652295 647020 641857 636548 631343 626944 623812 621829 620701 620394
59495F20394N93J359J797J908J742J473J566K361L443L922L585L292L889N137
$$ 620394 620987 622346 624143 626051 627793 629266 630832 633193 636636 640558 644143 647435 651324 656461
59481F56461O125O469O549O719O871O840O809P007P286P219O492N126L436J862
$$ 656461 662586 669055 675604 682323 689194 696034 702843 709850 717136 724355 730847 735973 739409 741271
59467G41271O91j37q65j581k166k588k861k691j648J06J649K312K569L392M898
$$ 741271 741962 741825 740960 739379 737213 734625 731764 729073 727425 727531 729180 731492 734061 737453 742351
59452G42351O253O847O911O818O445N536M306L231K511J967J253n9k214m854p123
$$ 742351 748604 755451 762362 769180 775625 781161 785467 788698 791209 793176 794429 794370 792156 787302 780179
59437G80179q417q745q252o950n234m032l848m070l748k768j658o86K17R75J623
$$ 780179 771762 763017 754765 747815 742581 738549 734701 730631 726883 724115 722457 721771 721988 722963 724586
59422G24586K794N044P872J0208J1832J3479J5682J8392K1664K5485K8812K9907
$$ 724586 727380 732424 740296 750504 762336 775815 791497 809889 831553 857038 885850 915757
59410I15757K8124K4384J9542J3424O109q88n730p806p386m552M04N977J0074
$$ 915757 943881 968265 987807 1001231 1007340 1006452 1000722 992916 985530 980978 981382 987359 997433
59397I97433J1612J0810Q160M095n82m914q660j2206j5509j7760j8279j7272j5541
$$ 997433 1009045 1019855 1028015 1032110 1031528 1026614 1017954 1005748 990239 972479 954200 936928 921387
59384I21387j3868j2660j1720j0365q205n833m298l849l756l392k948k880l147
$$ 921387 907519 894859 883139 872774 864569 858736 854438 850589 846833 843441 840493 837613 834466
59371H34466l308l090k573j993j559j305j045n36K38J115J968K763L426L910M365
$$ 834466 831158 828068 825495 823502 821943 820638 819593 819057 819295 820410 822378 825141 828567 832477 836842
59356H36842N059O138P606R365J1097J2352J3082J3905J5425J7377J8856J9412
$$ 836842 841901 848039 855645 865010 876107 888459 901541 915446 930871 948248 967104 986516
59344I86516J9419J9359J9151J8405J6977J5051J2882J0596Q086N065J413k470
$$ 986516 1005935 1025294 1044445 1062850 1079827 1094878 1107760 1118356 1126442 1131507 1132920 1130450
59332A130450n872q423j0318j1911j3328j4590j5833j7132j8202j8545j7966j6897
$$ 1130450 1124578 1116155 1105837 1093926 1080598 1066008 1050175 1033043 1014841 996296 978330 961433
59320I61433j6067j5858j5994j5956j5572j5000j4231j2992j1330r868r177r030
$$ 961433 945366 929508 913514 897558 881986 866986 852755 839763 828433 818565 809388 800358
59308H00358q710p883o883o062n238l891j749R48L715O183Q115R102Q608O556
$$ 800358 791648 783765 776882 770820 765582 761691 759942 760890 764605 770788 778903 788005 796613 803169
59294H03169L725J042j402m170p322j0026j1563j2097j2135j1717j0622q909o751
$$ 803169 806894 807936 806534 802364 795042 785016 773453 761356 749221 737504 726882 717973 711222
59281G11222m111j117J586L430M691O152Q126J0232J2022J3374J4364J5026J5267
$$ 711222 707111 705994 707580 711010 715701 721853 729979 740211 752233 765607 779971 794997 810264
59268H10264J4905J4027J3269J3171J3144J1853R015N965L853K204R4k120l414
$$ 810264 825169 839196 852465 865636 878780 890633 899648 905613 909466 911670 911764 909644 906230
59255I06230l857m371n067n220m709m222l913l216k037r69q5J223K918M046M234
$$ 906230 902373 898002 892935 887715 883006 878784 874871 871655 869618 868649 868564 869787 872705 876751 880985
59240H80985M262M684M946M536L874L338K411P01j060k047k738m232o564q651
$$ 880985 885247 889931 894877 899413 903287 906625 909036 909737 908677 906630 903892 899660 893096 884445
59226H84445r718j0013j0269j0954j1993j2789j2701j1787j0755j0020r282q323
$$ 884445 874727 864714 854445 843491 831498 818709 806008 794221 783466 773446 764164 755841
59214G55841p492p004o411n381m368l840l434k573j405l93N30J570K274K109J572
$$ 755841 748349 741345 734934 729553 725185 721345 717911 715338 713933 713540 714070 715640 717914 720023 721595
59199G21595J792L064M574N496N695N435N135N369O360P505Q048Q121Q447R027
$$ 721595 723387 726451 731025 736521 742216 747651 752786 758155 764515 772020 780068 788189 796636 805663
59185H05663Q992P895O401N388M911M423L547K401J360O68J05q86k463m004m821
$$ 805663 814655 822550 828951 834339 839250 843673 847220 849621 850981 851649 851754 850868 848405 844401 839580
59170H39580n065n318n543n204m341l713l717l903l863l886m371n168n887o431
$$ 839580 834515 829197 823654 818450 814109 810396 806679 802776 798913 795027 790656 785488 779601 773170
59156G73170o792o853o694o787p411q218q686q746q607q310p833p361p066o763
$$ 773170 766378 759525 752831 746044 738633 730415 721729 712983 704376 696066 688233 680872 673806 667043
59142F67043o173n384m758m476m453m528m486m075l317k656k440k391j927r34
$$ 667043 660870 655486 650728 646252 641799 637271 632785 628710 625393 622737 620297 617906 615979 615045
59128F15045K12J262K353L574M744N755O800P978Q971R406R445R710J0608J1913
$$ 615045 615257 616519 618872 622446 627190 632945 639745 647723 656694 666100 675545 685255 695863 707776
59114G07776J3018J3496J3320J2691J1699J0301Q587O993N987N489M760L123P18
$$ 707776 720794 734290 747610 760301 772000 782301 790888 797881 803868 809357 814117 817240 817958
59101H17958j571k983l472l518l533l612l725l907m225m586m653m120l167k436
$$ 817958 816387 813404 809932 806414 802881 799269 795544 791637 787412 782826 778173 774053 770886 768450
59087G68450k357k577k445j946j734k179k901l514m201n154n896n876n390n223
$$ 768450 766093 763516 761071 759125 757391 755212 752311 748797 744596 739442 733546 727670 722280 717057
59073G17057n526n738n555n186m645l623k322j660k121k980l204k731k339k522
$$ 717057 711531 705793 700238 695052 690407 686784 684462 682802 680681 677701 674497 671766 669427 666905
59059F66905k991l128k576j498n32l17q35j414j558j436j346j107m67K81N49K43
$$ 666905 663914 660786 658210 656712 656180 655863 655028 653614 652056 650620 649274 648167 647700 647981 648530 648773
59043F48773j98l97l49k25k43n73j058j176o19K19P60J086J798L091M441N269
$$ 648773 648575 648178 647829 647604 647361 646788 645730 644554 643935 644154 644914 646000 647798 650889 655330 660599
59027F60599N579N869O677Q227J0273J2301J3986J5315J6090J5665J3667J0716
$$ 660599 666178 672047 678724 686951 697224 709525 723511 738826 754916 770581 784248 794964
59015G94964P906N603L338Q21j596l546n097o318o900o599n639m422l099j736
$$ 794964 802870 808473 811811 812632 811036 807490 802393 796075 789175 782576 776937 772515 769416 767680
59001G67680n08N64J719K894L419K780J572J058J700K626K737J975J129P42O40
$$ 767680 767172 767736 769455 772349 775768 778548 780120 781178 782878 785504 788241 790216 791345 792087 792727
58986G92727N40O09J131J918K371K175J718J785K876M792O793Q294R508J1217
$$ 792727 793267 793876 795007 796925 799296 801471 803189 804974 807850 812642 819435 827729 837237 848454
58972H48454J3715J6187J7540J7697J7534J7561J7392J6726J6061J5866J5543
$$ 848454 862169 878356 895896 913593 931127 948688 966080 982806 998867 1014733 1030276
58961A030276J4053J1350Q448O018L642O34k947o476r551j2228j4579j6472j7743
$$ 1030276 1044329 1055679 1064127 1070145 1073787 1074421 1071474 1064998 1055447 1043219 1028640 1012168 994425
58948I94425j8431j8703j8666j8319j7694j6917j6072j5062j3700j1926r797p422
$$ 994425 975994 957291 938625 920306 902612 885695 869623 854561 840861 828935 819138 811716
58936H11716n090l311k337j665n13J105K226K098J102K20l3J45L12J02o44j632
$$ 811716 806626 803315 800978 799313 798800 799905 802131 804229 805331 805551 805518 805663 805975 806077 805433 803801
58920H03801k253k304k325k775l175k624j084M16R18M78j4K86J563L267M706N783
$$ 803801 801548 799244 796919 794144 790969 788345 787261 787677 788595 789073 789059 789345 790908 794175 798881 804664
58904H04664P053Q925J1135J3211J5038J6592J7496J7434J6730J6059J5696J5562
$$ 804664 811717 820642 831777 844988 860026 876618 894114 911548 928278 944337 960033 975595
58892I75595J5712J6235J6820J7085J7201J7643J8365J8783J8498J7515J5934
$$ 975595 991307 1007542 1024362 1041447 1058648 1076291 1094656 1113439 1131937 1149452 1165386
58881A165386J3987J2182J0737R036O374L130L08j925m258o751q471q931q866
$$ 1165386 1179373 1191555 1202292 1211328 1217702 1220832 1221140 1219215 1214957 1208206 1199735 1190804 1181938
58868A181938r065r281q964q283p804p665p747q122q782r408r894j0630j1702
$$ 1181938 1172873 1163592 1154628 1146345 1138541 1130876 1123129 1115007 1106225 1096817 1086923 1076293 1064591
58855A064591j2374j2032j1204j0896j1252j1605j1596j1448j1260j0854j0350
$$ 1064591 1052217 1040185 1028981 1018085 1006833 995228 983632 972184 960924 950070 939720
58844I39720j0246j0778j1720j2804j3853j4463j4195j3217j2289j1900j1806
$$ 939720 929474 918696 906976 894172 880319 865856 851661 838444 826155 814255 802449
58833H02449j1620j1370j1194j0829r810p984n550k814j85J712K489K572K995
$$ 802449 790829 779459 768265 757436 747626 739642 734092 731278 731093 732805 735294 737866 740861
58820G40861M271N763O431O088N542N553O046O434O322N635M473L184K291J879
$$ 740861 745132 750895 757326 763414 768956 774509 780555 786989 793311 798946 803419 806603 808894 810773
58806H10773J269k18k211l589l835l591l792m721o064p416q439q877q772q444
$$ 810773 812042 811824 809613 806024 802189 798598 794806 790085 784021 776605 768166 759289 750517 742073
58792G42073q071p520o748o020n516m924l749j899K33K116L402M150M867O069
$$ 742073 734002 726482 719734 713714 708198 703274 699525 697626 697859 699975 703377 707527 712394 718463
58778G18463P578Q511Q211P011N742M633L143Q87j633l533m628n624p118q730
$$ 718463 726041 734552 742763 749774 755516 760149 763292 764179 762546 759013 754385 748761 741643 732913
58764G32913r580r464q962q429p587o440n699n666n389l913j903r37j337j954
$$ 732913 723333 713869 704907 696478 688891 682451 676752 671086 665697 661784 659881 658944 657607 655653
58750F55653k012j888j838j295j01Q22R05J064K401M473N922O306O316O477O674
$$ 655653 653641 651753 649915 648620 648519 649341 650246 651310 653711 658184 664106 670412 676728 683205 689879
58735F89879O796O910O831O308N667N587O095O435N983M892L796L287L593M323
$$ 689879 696675 703585 710416 716724 722391 727978 734073 740508 746491 751383 755179 758466 762059 766382
58721G66382M706M508M495N413O800P528P470P689Q851J0242J0698R874Q166N908
$$ 766382 771088 775596 780091 785504 792304 799832 807302 814991 823842 834084 844782 854656 862822 868730
58707H68730L177J24k915n625p882r904j2220j5118j8053k0018k0696k0781k0829
$$ 868730 871907 872031 869116 863491 855609 845705 833485 818367 800314 780296 759600 738819 717990
58694G17990k0364j8694j6271j4398j3606j3037j1785j0152r085q662p996o595
$$ 717990 697626 678932 662661 648263 634657 621620 609835 599683 590598 581936 573940 567345
58682E67345n088m285m106l932l638l564l620l222k212j215p26m12L12J402K406
$$ 567345 562257 557972 553866 549934 546296 542732 539112 535890 533678 532463 531737 531325 531637 533039 535445
58667E35445L329M706O784R016J0450J0599R805Q812P933O665M343J099k093m422
$$ 535445 538774 543480 550264 559280 569730 580329 590134 598946 606879 613544 617887 618986 616893 612471
58653F12471n920p086q153q924r060q387p123n920n352n243m915m085l111k219
$$ 612471 606551 599465 591312 582388 573328 564941 557818 551898 546546 541303 536388 532303 529192 526973
58639E26973j179m8N28K95M4O23J694K290K168J811J328L88p83j298q34j78j90
$$ 526973 525794 525746 526274 526569 526613 527236 528930 531220 533388 535199 536527 536915 536132 534834 534000 533822 533632
58622E33632p05r62o54j24L47R23J874L062L974M241M049L938M209M673M971M915
$$ 533632 532927 531965 531311 531187 531534 532457 534331 537393 541367 545608 549657 553595 557804 562477 567448 572363
58606E72363M458L666K857K544K841L254L195K584J682O93j34l61J74Q78R74N41
$$ 572363 576821 580487 583344 585888 588729 591983 595178 597762 599444 600137 600003 599642 599816 600694 601668 602209
58590F02209N69J852M100O229P367P630P980R206J0950J2054J1975J1452J1419
$$ 602209 602778 604630 608730 614959 622326 629956 637936 647142 658092 670146 682121 693573 704992
58577G04992J1668J1192R614P713O559O584P482Q649R703J0895J2901J5973J9507
$$ 704992 716660 727852 737466 745179 751738 758322 765804 774453 784156 795051 807952 823925 843432
58564H43432K2661K5274K7709L0066L1945L2843L2347L0063K5914K0525J4892
$$ 843432 866093 891367 919076 949142 981087 1013930 1046277 1076340 1102254 1122779 1137671
58553A137671R642M826L27l762p073r006r132p908o699o617p589q916j0439j2520
$$ 1137671 1147313 1152139 1152466 1148704 1141631 1132625 1123493 1115585 1108886 1102269 1094680 1085764 1075325 1062805
58539A062805j5212j8124k1008k3853k6355k7882k8073k7089k5322k3216k1179
$$ 1062805 1047593 1029469 1008461 984608 958253 930371 902298 875209 849887 826671 805492
58528H05492j9228j6947j4207j1629r800q419o881n389m577m364m037l460l202
$$ 805492 786264 769317 755110 743481 733681 725262 718381 712992 708415 704051 700014 696554 693352
58515F93352l432l593l333k954k763k665k509k199j468l08M56Nj054j185j05P69
$$ 693352 689920 686327 682994 680040 677277 674612 672103 669904 668436 668128 668584 668589 667535 666350 666245 667014
58499F67014L91n04p45l19J45O23J384K059K071J657J635K412L848N812Q160J0442
$$ 667014 667405 666901 666156 665837 665982 666605 667989 670048 672119 673776 675411 677823 681671 687483 695643 706085
58483G06085J2280J3918J5822J7892J9599K0746K1488K1680K0777J8462J4982
$$ 706085 718365 732283 748105 765997 785596 806342 827830 849510 870287 888749 903731
58472I03731J0827O440K197j568m645o920q413r370j0124j0673j0573r399p135
$$ 903731 914558 920998 923195 921627 916982 910062 901649 892279 882155 871482 860909 851510 844375
58459H44375m044m73L071O131Q830J1755J4963J7431J7920J6204J3002R006M463
$$ 844375 840331 839858 842929 849060 857890 869645 884608 902039 919959 936163 949165 958171 962634
58446I62634m04n107r186j2446j4808j6150j6415j5824j4847j3863j2781j1108
$$ 962634 962230 957123 947937 935491 920683 904533 888118 872294 857447 843584 830803 819695
58434H19695q616n789l352j428L66K128L512M548N892P893R838J0642J0031Q590
$$ 819695 811079 805290 801938 800510 800876 803004 806516 811064 816956 824849 834687 845329 855360 863950
58420H63950O936N222L299R80j773m587o695p644p861q249r199j0275j0840j0655
$$ 863950 870886 876108 879407 880387 878614 874027 867332 859688 851827 843578 834379 824104 813264 802609
58406H02609r813q490o953n618m785m274l541k262p15N16J142J350J531J970K753
$$ 802609 792796 784306 777353 771735 766950 762676 759135 756873 756158 756674 757816 759166 760697 762667 765420
58391G65420L675M190L841K830J869J353J033O15K51K21N85J411K821M468N477
$$ 765420 769095 773285 777126 779956 781825 783178 784211 784826 785077 785298 785883 787294 790115 794583 800060
58376H00060N445N046N196O019P134Q357R449R799R214Q646R182J0687J2215J3413
$$ 800060 805505 810551 815747 821766 828900 837257 846706 856505 865719 874365 883547 894234 906449 919862
58362I19862J4493J5233J5207J4769J4605J4412J3254J1209R401Q192O764M687
$$ 919862 934355 949588 964795 979564 994169 1008581 1021835 1033044 1042445 1050637 1057401 1062088
58350A062088K717J520Q14K54J26N99J226J745K554L896N389O785Q359J0159J1728
$$ 1062088 1064805 1066325 1067139 1067393 1067519 1068118 1069344 1071089 1073643 1077539 1082928 1089713 1098072 1108231 1119959
58335A119959J2970J4456J6341J7916J8630J8665J8130J6698J4604J2894J1965
$$ 1119959 1132929 1147385 1163726 1181642 1200272 1218937 1237067 1253765 1268369 1281263 1293228
58324A293228J0854Q761O351M662L698K950K583K979L686L870L532L424M048N300
$$ 1293228 1304082 1312843 1319194 1323856 1327554 1330504 1333087 1336066 1339752 1343622 1347154 1350578 1354626 1359926
58310A359926O843Q264R214R886J0915J2465J3879J4613J4943J5346J5798J6119
$$ 1359926 1366769 1375033 1384247 1394133 1405048 1417513 1431392 1446005 1460948 1476294 1492092 1508211
58298A508211J6462J6996J7656J8472J9571K0604K0933K0626K0509K0996K1769
$$ 1508211 1524673 1541669 1559325 1577797 1597368 1617972 1638905 1659531 1680040 1701036 1722805
58287A722805K2721K4160K5833K6996K7745K8994L0716L1649L1386L1279L2384
$$ 1722805 1745526 1769686 1795519 1822515 1850260 1879254 1909970 1941619 1973005 2004284 2036668
58276B036668L3945L4897L5545L6614L7834L8680L9488M0676M1844M2769M4286
$$ 2036668 2070613 2105510 2141055 2177669 2215503 2254183 2293671 2334347 2376191 2418960 2463246
58265B463246M7083N0451N3367N5919N8622O1173O3041O4510O6066O7471O8303
$$ 2463246 2510329 2560780 2614147 2670066 2728688 2789861 2852902 2917412 2983478 3050949 3119252
58254C119252O8797O9396P0228P1570P3847P6750P9475Q2296Q6409R1851R7249
$$ 3119252 3188049 3257445 3327673 3399243 3473090 3549840 3629315 3711611 3798020 3889871 3987120
58243C987120J02228J08106J15377J22664J29127J35867J43701J51784J59697
$$ 3987120 4089348 4197454 4312831 4435495 4564622 4700489 4844190 4995974 5155671
58234E155671J68669J79280J90259K01077K13319K27876K43332K58908K76285
$$ 5155671 5324340 5503620 5693879 5894956 6108275 6336151 6579483 6838391 7114676
58225G114676K96544L18159L40255L64893L93638M24823M56946M91871N31903
$$ 7114676 7411220 7729379 8069634 8434527 8828165 9252988 9709934 10201805 10733708
58216A0733708N76726O26068O82098P46302Q17627Q97022R89724J099815J227092
$$ 10733708 11310434 11936502 12618600 13364902 14182529 15079551 16069275 17169090 18396182
58207A8396182J373199J545616J751079J991166K270276K602675L006859L501446
$$ 18396182 19769381 21314997 23066076 25057242 27327518 29930193 32937052 36438498
58199C6438498M115145M894380N894977P177987Q825991J0956777J3716030J7266536
$$ 36438498 40553643 45448023 51343000 58520987 67346978 78303755 92019785 109286321
58191A09286321K1750731K7126529L2873275L7832453M0510382L9779275L5445859
$$ 109286321 131037052 158163581 191036856 228869309 269379691 309158966 344604825
58184C44604825K8219705J9193084R360073m96857r697931j7630437k3847221
$$ 344604825 372824530 392017614 401377687 400880830 391182899 373552462 349705241
58177C49705241k8151664l0576567l1308837l0632730k8894433k6461184k3673053
$$ 349705241 321553577 290977010 259668173 229035443 200141010 173679826 150006773
58170A50006773k0803462j8039915j5489124j3200803j1192273r459976p983490
$$ 150006773 129203311 111163396 95674272 82473469 71281196 61821220 53837730
58163E3837730o733756n682605m804521m073604l464862k958072k537080k186702
$$ 53837730 47103974 41421369 36616848 32543244 29078382 26120310 23583230 21396528
58155B1396528j893738j649546j447945j281341j141594j023166r22316q34458
$$ 21396528 19502790 17853244 16405299 15123958 13982364 12959198 12036882 11202424
58147A1202424p55452o84334o21694n66127n14905m67258m24207l85857l51434
$$ 11202424 10446972 9762638 9140944 8574817 8059912 7592654 7168447 6782590 6431156
58138F431156l21262k96262k75837k58379k43224k30165k17911k05174j92623
$$ 6431156 6109894 5813632 5537795 5279416 5036192 4806027 4588116 4382942 4190319
58129D190319j81612j71669j61287j50562j40819j32089j23162j13905j05554
$$ 4190319 4008707 3837038 3675751 3525189 3384370 3252281 3129119 3015214 2909660
58120B909660r8666r2610q6974q1999p7640p3550o9852o6692o3389n9363n5511
$$ 2909660 2810994 2718384 2631410 2549411 2471771 2398221 2328369 2261677 2198288 2138925 2083414
58109B083414n3257n2500n1820n0402m8588m6821m5278m4248m3736m2998m1555
$$ 2083414 2030157 1977657 1925837 1875435 1826847 1780026 1734748 1690500 1646764 1603766 1562211
58098A562211m0155l9607l9222l7658l4879l1951k9370k6925k4847k3595k2724
$$ 1562211 1522056 1482449 1443227 1405569 1370690 1338739 1309369 1282444 1257597 1234002 1211278
58087A211278k1332j9576j8447j8165j7962j7456j7067j7035j7110j7225j7534
$$ 1211278 1189946 1170370 1151923 1133758 1115796 1098340 1081273 1064238 1047128 1029903 1012369
58076A012369j7868j7963j8087j8520j8685j7846j6404j5466j5215j4800j3817
$$ 1012369 994501 976538 958451 939931 921246 903400 886996 871530 856315 841515 827698
58065H27698j2744j1901j0991r879q938q359p906p472p254p275p355p648q549
$$ 827698 814954 803053 792062 782183 773245 764886 756980 749508 742254 734979 727624 719976 711427
58052G11427r981j1223j1492j0491q570o724n986o363o720o252n474n237n395
$$ 711427 701446 690223 678731 668240 659670 652946 646960 640597 633877 627625 622151 616914 611519
58039F11519n279m898m674m425l749l124l550n184p141q569r152q842p996p543
$$ 611519 606240 601342 596668 592243 588494 585370 581820 576636 569495 560926 551774 542932 534936 527393
58025E27393q041q789q710p879p197o875o346n547n038m872m448l642l018k817
$$ 527393 519352 510563 501853 493974 486777 479902 473556 468009 462971 458099 453651 450009 446991 444174
58011D44174k643k344k218k266k130j886j974k211j897j045m35k29L29J451K175
$$ 444174 441531 439187 436969 434703 432573 430687 428713 426502 424605 423560 423125 422896 423225 424676 426851
57996D26851J807J014P46R39J062J242J836K415K087P45p92j791k199k248k054
$$ 426851 428658 429672 430418 431357 432419 433661 435497 437912 439999 440744 439952 438161 435962 433714 431660
57981D31660j810j947k714l733m129l309j539L24J575K016J687P56k01m05K72
$$ 431660 429850 427903 425189 421456 417327 414018 412479 412803 414378 416394 418081 418837 418636 418231 418503
57966D18503J012J043N53J36j92q57j839k690l232l607l737l422k920k824l306
$$ 418503 419515 420558 421111 421247 421055 420198 418359 415669 412437 408830 405093 401671 398751 395927 392621
57951C92621l953m305m127l348k260j549j493j379m03J088K040K224K407L025
$$ 392621 388668 384363 380236 376888 374628 373079 371586 370207 369804 370892 372932 375156 377563 380588
57937C80588L719M304N225O663P964Q391P935P032N978M849L573J906k71k540
$$ 380588 384307 388611 393836 400499 408463 416854 424789 431821 437799 442648 446221 448127 447856 445316
57923D45316m262n323o093o755p241p728q451r039q809p811o781o002n071l931
$$ 445316 441054 435731 429638 422883 415642 407914 399463 390424 381615 373804 367023 361021 355950 352019
57909C52019l170k988k713j863q27j26L36O59M05p05k039k669k382j631q56k86
$$ 352019 348849 345861 343148 341285 340458 340332 340668 341327 341732 341027 338988 336319 333937 332306 331450 331164
57893C31164J7L35J131K353L291L538L571L964M484M536M103L697L581L569L389
$$ 331164 331181 331516 332647 335000 338291 341829 345400 349364 353848 358384 362487 366184 369765 373334 376723
57878C76723K883K004J037M79M25K69n02j504j859j278l36K80L84K04o0m63j119
$$ 376723 379606 381610 382647 383126 383551 383820 383318 381814 379955 378677 378341 378621 379005 379209 379149 378686 377567
57861C77567j806j929j144J01J010J349J503J691J731J657J847K342K618K351
$$ 377567 375761 373832 372688 372789 373799 375148 376651 378342 380073 381730 383577 385919 388537 390888
57847C90888J850J384O73m88j636k129j940j535j277j325j649j804j147K65J436
$$ 390888 392738 394122 394795 394307 392671 390542 388602 387067 385790 384465 382816 381012 379865 380130 381566
57832C81566J603J246J304J795J934J423Q81R21J436J903J999J749J337R39O04
$$ 381566 383169 384415 385719 387514 389448 390871 391752 392673 394109 396012 398011 399760 401097 402036 402640
57817D02640K66j35o15j226j970k684l303m172n643p380q635r266r772j0173r729
$$ 402640 402906 402771 402156 400930 398960 396276 392973 388801 383158 375778 367143 357877 348105 337932 328203
57802C28203q258o812o300o125n114l334j947j551j641j625j459j150m95M22J089
$$ 328203 319945 313133 306833 300708 295594 292260 290313 288762 287121 285496 284037 282887 282392 282814 283903
57787B83903J211J059J026J229J625K157K696L220L976N071N984O045N421N015
$$ 283903 285114 286173 287199 288428 290053 292210 294906 298126 302102 307173 313157 319202 324623 329638
57773C29638N231N330M424K614Q36k22o17p66r61j371k161l343m464m821m258
$$ 329638 334869 340199 344623 347237 348073 347851 347234 346468 345507 344136 341975 338632 334168 329347 325089
57758C25089l503l285l287k494p47Q49J338J102J043J256J278J192J584K499L320
$$ 325089 321586 318301 315014 312520 311773 312622 313960 315062 316105 317361 318639 319831 321415 323914 327234
57743C27234L575L254K332Q64n15r97p24p09j369j942j753j227j114j295j180
$$ 327234 330809 334063 336395 337259 336744 335747 335023 334314 332945 331003 329250 328023 326909 325614 324434
57728C24434q48r84j707k195j704n12L87L62k62o39k89N31J247J561J523J244
$$ 324434 323586 322602 320895 318700 316996 316484 316871 317233 316971 316332 316043 316574 317821 319382 320905 322149
57712C22149P64J53m53q97r72n66l4l9o76r92j12J404K065J379M21K85P61J018
$$ 322149 322913 323066 322613 321716 320744 320178 320144 320105 319429 318437 318325 319729 321794 323173 323594 323879 324640 325658
57694C25658Q59O58N18J78m54j216j981k562k638k216j843j902j888j035N52K097
$$ 325658 326517 327175 327693 327871 327417 326201 324220 321658 319020 316804 314961 313059 311171 310136 310688 312785
57678C12785L356M910P241J0190J3572J7663K2906K9646L8358M9319O1444P1877
$$ 312785 316141 321051 328292 338482 352054 369717 392623 422269 460627 509946 571390 643267
57666F43267P7403P6195O8089N3814L4806J3518p082k4875l9249n0367n8191o2303
$$ 643267 720670 796865 864954 918768 953574 967092 960010 935135 895886 845519 787328 725025
57654G25025o2418n8878n2823m5869l9318l3516k8158k3183j9014j5923j3527
$$ 725025 662607 603729 550906 505037 465719 432203 404045 380862 361848 345925 332398
57643C32398j1197q699o261m298l171k904k961k607j768j156j291j843k296k748
$$ 332398 321201 312502 306241 301943 298772 295868 292907 290300 288532 287376 286085 284242 281946 279198
57629B79198l428l820l188j845r98j160j566j500j372j860k617k641j731p49m01
$$ 279198 275770 271950 268762 266917 265919 264759 263193 261693 260321 258461 255844 253203 251472 250723 250322
57614B50322m72m59m55q91j647j972j442n94l54q69j362j212p43o60j023j260
$$ 250322 249850 249391 248936 248045 246398 244426 242984 242390 242036 241167 239805 238593 237850 237190 236167 234907
57598B34907j099q77q85q90n80j09R6j55p69j583k375k779k471j499l55L09J26
$$ 234907 233808 232931 232046 231156 230576 230467 230563 230408 229639 228056 225681 222902 220431 218932 218577 218886 219012
57581B19012o47j285j306r86r55j323j574j361j024j149j837k603k847k365j619
$$ 219012 218365 217080 215774 214788 213833 212510 210936 209575 208551 207402 205565 202962 200115 197750 196131
57566A96131j356j773k198j937j236q36p87m71J46K77m23j156j051k55N63J136
$$ 196131 194775 193002 190804 188867 187631 186795 186008 185537 185683 185960 185537 184381 183330 183075 183638 184774
57550A84774J481J449J098R73J352J698J515J270J606K126J913J029M72P06J167
$$ 184774 186255 187704 188802 189775 191127 192825 194340 195610 197216 199342 201255 202284 202756 203462 204629
57535B04629J278J044N38l72j434j904j456o33j58j54l54n76p33p33o79q34j179
$$ 204629 205907 206951 207489 207117 205683 203779 202323 201690 201532 201378 201024 200448 199715 198982 198303 197469 196290
57518A96290j312r46k80L25P48J036J225J384J573J674J480J100R81J384K031
$$ 196290 194978 194032 193752 194077 194825 195861 197086 198470 200043 201717 203197 204297 205278 206662 208693
57503B08693K442K420K038J353L49q29j811k265k247k174k349k563k394j800j123
$$ 208693 211135 213555 215593 216946 217295 216466 214655 212390 210143 207969 205620 203057 200663 198863 197740
57488A97740n87j85n8l79p92p02l26o29j765k427j573k6O12M1p75j292j759k174
$$ 197740 197153 196968 196910 196531 195739 195037 194711 194082 192317 189890 188317 188291 188903 188944 188169 186877 185118 182944
57470A82944k128j731j585j696j427p16k77l75m06M1N79Q48J024J231J242J079
$$ 182944 180816 179085 177500 175804 174377 173661 173384 173009 172603 172644 173223 174071 175095 176326 177568 178647
57454A78647J104J175O59m21j097q08j33K43M33O90P79O01O10J004J290J197J182
$$ 178647 179751 180926 181585 181164 180067 179259 179126 179369 179802 180492 181271 181872 182482 183486 184776 185973 187155
57437A87155J415J268N36J84Q69J648J301K04l62j01L15O72J241J735J575J093
$$ 187155 188570 189838 190374 190558 191427 193075 194376 194580 194218 194117 194432 195104 196345 198080 199655 200748
57421B00748J228J938K130J246n7r37j134o95J53P48N93L26J030K513L302K645
$$ 200748 201976 203914 206044 207290 207233 206296 205162 204467 204620 205368 205961 206287 207317 209830 213132 215777
57405B15777J401N26j32r39j416j035l34j94m39j80P07J351J200P12N01M58J64
$$ 215777 217178 217704 217572 216633 215217 214182 213848 213654 213215 213035 213742 215093 216293 217005 217506 217964 218128
57388B18128j46L08J761L343L985L626L042K622J969R60M04R48J924K094J316
$$ 218128 217982 218290 220051 223394 227379 231005 234047 236669 238638 239598 240002 240950 242874 244968 246284
57373B46284N41L10K16p6k51j63k77q51j367j374j295j697k203j874n09J007J672
$$ 246284 246825 247135 247351 247275 247024 246861 246584 245733 244366 242992 241697 240000 237797 235923 235414 236421 238093
57356B38093J343P34P35J594K677L164L003K850K945K675J589L59K2O27J281J433
$$ 238093 239436 240170 240905 242499 245176 248340 251343 254193 257138 259813 261402 261761 261783 262410 263691 265124
57340B65124J383J457J361P36j58o67n05P4P28J362J956K315K154J406L76m67
$$ 265124 266507 267964 269325 270061 269903 269236 268731 268805 269533 270895 272851 275166 277320 278726 279102 278635
57324B78635q16o51j13O08J277J647J614J363J242J458J903K249K268K008J724
$$ 278635 277819 277168 277055 277663 278940 280587 282201 283564 284806 286264 288167 290416 292684 294692 296416
57309B96416J601J658J839K043K101J904J721K024K840L485L338K699K447K926
$$ 296416 298017 299675 301514 303557 305658 307562 309283 311307 314147 317632 320970 323669 326116 329042
57295C29042L610L971M151M562N162N505N338M825M307M033M031M102M038L930
$$ 329042 332652 336623 340774 345336 350498 356003 361341 366166 370473 374506 378537 382639 386677 390607
57281C90607M099M587M968M894M634M777N453O228O711O922O997O915O647O380
$$ 390607 394706 399293 404261 409155 413789 418566 424019 430247 436958 443880 450877 457792 464439 470819
57267D70819O316O423O542O674O952P443Q103Q835R439R671R578R720J0701J2452
$$ 470819 477135 483558 490100 496774 503726 511169 519272 528107 537546 547217 556795 566515 577216 589668
57253E89668J4228J5357J5800J6021J6589J7945K0032K2027K2965K2954K3308
$$ 589668 603896 619253 635053 651074 667663 685608 705640 727667 750632 773586 796894
57242G96894K5024K7583K9795L1371L2959L4911L6933L8821M0651M2177M2902
$$ 796894 821918 849501 879296 910667 943626 978537 1015470 1054291 1094942 1137119 1180021
57231A180021M3019M3465M4767M6562M8499N0719N3092N4918N6032N7295N9215
$$ 1180021 1223040 1266505 1311272 1357834 1406333 1457052 1510144 1565062 1621094 1678389 1737604
57220A737604O0791O0735N9316N7932N7243N6750N6020N5231N4456N3494N2632
$$ 1737604 1798395 1859130 1918446 1976378 2033621 2090371 2146391 2201622 2256078 2309572 2362204
57209B362204N2798N4531N7292O0048O2171O3663O4889O6116O6965O6405O3776
$$ 2362204 2415002 2469533 2526825 2586873 2649044 2712707 2777596 2843712 2910677 2977082 3040858
57198C040858N9739N5710N2486M9895M7676M5968M4990M4804M5517M7119M9113
$$ 3040858 3100597 3156307 3208793 3258688 3306364 3352332 3397322 3442126 3487643 3534762 3583875
57187C583875N0904N2549N4486N6553N8059N8862N9565O0435O1032O1241O1734
$$ 3583875 3634779 3687328 3741814 3798367 3856426 3915288 3974853 4035288 4096320 4157561 4219295
57176D219295O2858O3751O3263O1389N9188N7704N7384N8186N9588O0824O1581
$$ 4219295 4282153 4345904 4409167 4470556 4529744 4587448 4644832 4703018 4762606 4823430 4885011
57165D885011O2352O3654O5074O5622O4905O3508O2271O1504O0945O0184N8947
$$ 4885011 4947363 5011017 5076091 5141713 5206618 5270126 5332397 5393901 5454846 5515030 5573977
57154E573977N7177N4982N2512M9845M6881M3353L9138L4629L0505K6815K2578
$$ 5573977 5631154 5686136 5738648 5788493 5835374 5878727 5917865 5952494 5982999 6009814 6032392
57143F032392J6758R609K706k257m396l634n30L768P950J1338J4067J6558J9017
$$ 6032392 6049150 6058759 6061465 6059208 6054812 6051178 6050648 6054416 6062366 6073704 6087771 6104329 6123346
57130F123346K1274K2669K2140J8963J3457O641n21p127j1942j3936j3162j0429
$$ 6123346 6144620 6167289 6189429 6208392 6221849 6228490 6227969 6220842 6208900 6194964 6181802 6171373
57118F171373o079M3P455J4885K1546K7839L4550M2130N1131O2574P7339R5587
$$ 6171373 6165294 6165337 6172792 6187677 6209223 6237062 6271612 6313742 6364873 6427447 6504786 6600373
57106F600373J17116J41990J70772K04626K45276K94622L54619M27922N18191
$$ 6600373 6717489 6859479 7030251 7234877 7480153 7774775 8129394 8557316 9075507
57097I075507O29079P63585R25305J119126J348745J613727J910067K231725K568331
$$ 9075507 9704586 10468171 11393476 12512602 13861347 15475074 17385141 19616866 22185197
57088B2185197K902213L212650L484631L709675L876310L964040L949609L814324
$$ 22185197 25087410 28300060 31784691 35494366 39370676 43334716 47284325 51098649
57080E1098649L540164L104506K492542J723499Q62860L076p73204j419956j931580
$$ 51098649 54638813 57743319 60235861 61959360 62822220 62825296 62052092 60632136 58700556
57071E8700556k329769k645353k903656l117602l288061l407727l465883l454063
$$ 58700556 56370787 53725434 50821778 47704176 44416115 41008388 37542505 34088442
57063C4088442l371342l225677l030404k800008k548606k289714k034934j792374
$$ 34088442 30717100 27491423 24461019 21661011 19112405 16822691 14787757 12995383
57055A2995383j566858j361247j177093j014783q73927p53491o51362n64466m90047
$$ 12995383 11428525 10067278 8890185 7875402 7001475 6247984 5596622 5032156 4542109
57046D542109m26492l72642l26911k87633k53741k24584j99409j77547j58665
$$ 4542109 4115617 3742975 3416064 3128431 2874690 2650106 2450697 2273150 2114485
57037B114485j42394j27915j14389j01502q9322p7803o6603n5024m1992k6644
$$ 2114485 1972091 1844176 1729787 1628285 1538963 1461160 1394557 1339533 1297541 1270897
57027A270897r362P868K2209L0855L1625K3819R015r457k8337m5508n9591o9496
$$ 1270897 1261535 1269403 1291612 1322467 1354092 1377911 1386926 1377469 1349132 1303624 1244033 1174537
57015A174537p4890p6471p5205p1721o6581o0596n4389m8252m2541l7666l3385
$$ 1174537 1099647 1023176 947971 876250 809669 749073 694684 646432 603891 566225 532840
57004E32840k8965k4442k0916j8979j7696j5897j3800j2361j1605j0660r188p765
$$ 532840 503875 479433 458517 439538 421842 405945 392145 379784 368179 357519 348331 340566
56992C40566o796n935m705l001p99K022N347Q642J1262J2706J2606J0802P571
$$ 340566 333770 327835 323130 320129 319330 321352 326699 335341 346603 359309 371915 382717 390288
56979C90288L495r37n469r846j3674j6535j8084j8162j6965j5036j2924j0839
$$ 390288 393783 392846 387377 377531 363857 347322 329238 311076 294111 279075 266151 255312
56967B55312q696o374l824j010K149N764R926J4550J9296K3561K6467K6878K3945
$$ 255312 246616 240242 236418 235408 237557 243321 253247 267797 287093 310654 337121 363999 387944
56954C87944J7987J0517L036l997j0581j6092j9627k1167k1495k0982j9363j6729
$$ 387944 405931 416448 419484 415487 404906 388814 369187 348020 326525 305543 286180 269451
56942B69451j3846j1124q180m719j044K736P240J2927J9211K4930K9306L1966
$$ 269451 255605 244481 236301 231582 230538 233274 240514 253441 272652 297582 326888 358854
56930C58854L2519L0558K5780J8095Q125k302j1009j7260k2058k6317k9548l0803
$$ 358854 391373 421931 447711 465806 473931 471629 460620 443360 421302 394985 365437 334634
56918C34634l0045k7962k5097k1894j8992j6709j4629j2308r971q065o609n553
$$ 334634 304589 276627 251530 229636 210644 193935 179306 166998 157027 148962 142353 136800
56906A36800n098n043m533l134j637r56q31m35K79Q32J322K284L706N210O986
$$ 136800 131702 126659 122126 118992 117355 116399 115568 115133 115412 116244 117566 119850 123556 128766 135752
56891A35752R581J2799J5652J7501J8543J9130J9253J8592J6667J3139Q402L631
$$ 135752 145333 158132 173784 191285 209828 228958 248211 266803 283470 296609 305011 308642
56879C08642k61l436o394q930j0410j0680r970q268n569k419N98L600O997J0758
$$ 308642 308381 304945 298551 289621 279211 268531 258561 250293 244724 242305 242903 246503 253500 264258
56865B64258J4906K0213K7374L5637M3081M8027M9495M6911M0415L1217K0640
$$ 264258 279164 299377 326751 362388 405469 453496 502991 549902 590317 621534 642174
56854F42174R129k906j3893k2031k7086l0003l1112l0099k7354k3736j9143j2922
$$ 642174 651303 648397 634504 612473 585387 555384 524272 494173 466819 443083 423940 411018
56842D11018n614J528Q853J8202L0113M2912N5075O6400P5879Q0519P7828O8288
$$ 411018 405404 406932 415785 433987 464100 507012 562087 628487 704366 784885 862713 931001
56830I31001N3999L6169J5529n904k5324m1054n2725o0081o2951o2135n8963n4016
$$ 931001 985000 1021169 1036698 1030794 1005470 964416 911691 851610 788659 726524 667561 613545
56818F13545m7202l8914l0138k1403j2449k937P249J8239K9958M1536N1344N7576
$$ 613545 566343 527429 497291 475888 463439 460502 467751 485990 515948 557484 608828 666404
56806F66404N8638N3550M2639K7699J0974n861k1474l4360m3376m8608n1029n1403
$$ 666404 725042 778592 821231 848930 859904 854043 832569 798209 754833 706225 655196 603793
56794F03793m9924m6606m1507l4871k7514k0714j5119j0019m215K675J0154J7540
$$ 603793 553869 507263 465756 430885 403371 382657 367538 357519 353304 355979 366133 383673
56782C83673K3991K8270K9378K7308K2615J5597O656k893j1424j8368k4151k8799
$$ 383673 407664 435934 465312 492620 515235 530832 537488 534595 523171 504803 480652 451853
56770D51853l1559l2046l0961k9284k7351k5046k2330j9311j6177j3355j1346
$$ 451853 420294 388248 357287 328003 300652 275606 253276 233965 217788 204433 193087
56759A93087j0209r445q577p549o496n435m360l397k714k407k476k712k735k333
$$ 193087 182878 173433 164856 157307 150811 145376 141016 137619 134905 132498 130022 127310 124575 122242
56745A22242j781j507j547j518j113l91L55Q13Q46O66O61Q35P09R5l89n7Q07J264
$$ 122242 120461 118954 117407 115889 114776 114385 114740 115553 116399 117065 117726 118561 119270 119365 118976 118919 119726 120990
56727A20990R70N99Q90J759K487K488J801J009P12R36J237J436J836K448K535
$$ 120990 121960 122559 123449 125208 127695 130183 131984 132993 133705 134641 135878 137314 139150 141598 144133
56712A44133J591L02k00J47M50L86N85J396K188K299J901J478J114P66O82R40
$$ 144133 145724 146026 145826 145973 146423 146809 147394 148790 150978 153277 155178 156656 157770 158536 159218 160158
56696A60158J070O94K28L32Q96J157P06p8n57l61M94J593K225J998J359J173J675
$$ 160158 161228 161922 162150 162482 163378 164535 165241 165163 164606 164245 164739 166332 168557 170555 171914 173087 174762
56679A74762K206K144J686J443J484J238L05r21j652j591j205j156j541j862j666
$$ 174762 176968 179112 180798 182241 183725 184963 185268 184347 182695 181104 179899 178743 177202 175340 173674
56664A73674j075n60k91K3O08J187J316J036Q31R12Q67K93n51j049r58n81k24
$$ 173674 172599 172039 171748 171771 172379 173566 174882 175918 176749 177661 178528 178821 178270 177221 176263 175682 175458
56647A75458O4K87L76K71m9o18j235j360p26O8J60l67n93j97K2n27j183r84j08
$$ 175458 175522 175809 176185 176456 176407 175789 174554 173194 172468 172536 172696 172329 171736 171539 171561 171034 169851 168867 168759
56628A68759M97N12M32N16M39L9l19l85m22p48j281j705j774j306l47N97Q61L78
$$ 168759 169256 169768 170200 170716 171155 171194 170875 170490 170068 169320 168039 166334 164560 163254 162907 163504 164365 164743
56610A64743k59n75o84q37q51m10L72R86J089P51K73p0j34N4L08M61N17N85P04
$$ 164743 164484 163909 163225 162388 161537 161127 161499 162485 163574 164325 164598 164528 164394 164448 164756 165217 165734 166319 167023
56591A67023Q20R07J091J501J966J999J314L51j9N06J190J104K37n02l88L83J077
$$ 167023 167843 168750 169841 171342 173308 175307 176621 176972 176953 177459 178649 179753 179990 179488 179100 179483 180560
56574A80560J217R13N96N98R09J235J343J378J793K905M518O088P351Q664J0515
$$ 180560 181777 182690 183286 183884 184793 186028 187371 188749 190542 193447 197965 204053 211404 220068 230583
56559B30583J2633J3896J3449J1567R160O670M096J771K57o37j806l474m680m658
$$ 230583 243216 257112 270561 282128 291288 297958 302054 303825 304082 303445 301639 298165 293485 288827
56545B88827l986l690l835l846l684l748l901l642l136l153l799m144l379j798
$$ 288827 284841 281151 277316 273470 269786 266038 262137 258495 255359 252206 248407 244263 240884 239086
56531B39086l60K12k24j264k151k283j759j136o94l18l3j33o99j403j944k274
$$ 239086 238726 238938 238714 237450 235299 233016 231257 230121 229427 229109 229076 228943 228244 226841 224897 222623
56515B22623k370k210j996j965j976j762j549j813k386k460j705p52k96k80l07
$$ 222623 220253 218043 216047 214082 212106 210344 208795 206982 204596 202136 200431 199679 199383 199103 198796
56500A98796l22m65n93m72k13j79n40j120j576j602j135m53J51P21J419K008K031
$$ 198796 198474 198009 197416 196944 196731 196552 196012 194892 193316 191714 190579 190126 190277 190998 192417 194425 196456
56483A96456J459P17N1n37p47j34R29J293N27k91J2J095J612J080L74L82R34J227
$$ 196456 197915 198632 198683 198146 197399 197265 198194 199487 200014 199723 199735 200830 202442 203522 203896 204278 205212 206439
56465B06439Q63J29m51o09m00kM71Q54Q61L70k42l81P8O63R58R77Q91P98R36J609
$$ 206439 207302 207431 206980 206371 205971 205969 206440 207294 208155 208525 208283 207902 207980 208643 209601 210578 211469 212267 213203 214812
56445B14812K609L166K843K108J607J281O81j52p37r39j061j176r08j12O85P93
$$ 214812 217421 220587 223430 225538 227145 228426 229107 228955 228218 227279 226218 225042 224134 224022 224707 225500
56429B25500J67n10n93k06j07p20j431j215M2J305J624J183Q17Q46Q83N26k08
$$ 225500 225667 225157 224564 224358 224251 223531 222100 220885 220927 222232 223856 225039 225856 226702 227585 228111 227903
56412B27903r80j275n90R82K459K795K039J189Q76P17K05l92m19J53P68J170J680
$$ 227903 226923 225648 225058 226040 228499 231294 233333 234522 235398 236115 236320 235928 235509 235662 236430 237600 239280
56395B39280K383K640J847M91j91L21J222J458R42L59Q7n3j62p1J72K28J12L05
$$ 239280 241663 244303 246150 246641 246450 246771 247993 249451 250393 250752 250839 250786 250624 250553 250725 250953 251065 251370
56377B51370R72J527J409Q75N62N67M72J33n1L35J277K378L072K922K074J311
$$ 251370 252342 253869 255278 256153 256715 257282 257754 257887 257836 258171 259448 261826 264898 267820 269894 271205
56361B71205J268J645J595R00K73L76J035J696K223K735K963K396J114j05o44
$$ 271205 272473 274118 275713 276613 276886 277262 278297 279993 282216 284951 287914 290310 291424 291319 290675
56346B90675o07k67M76J560K214J711O04K88J188K198K371K271K957M284N151
$$ 290675 290068 289801 290277 291837 294051 295762 296366 296654 297842 300040 302411 304682 307639 311923 317074
56331C17074N101M666M322M004L707L626L569L084K381K226K662K684J728O12
$$ 317074 322175 326841 331163 335167 338874 342500 346069 349153 351534 353760 356422 359106 360834 361446
56317C61446M15J100J898K449K723K345J053m46j004m21N17J407K711M634O374
$$ 361446 361861 362961 364859 367308 370031 372376 373429 372983 371979 371558 372075 373482 376193 380827 387201
56302C87201P087O989O911P065P009O658O548O847O799N716M215L697M637O062
$$ 387201 394288 401277 408188 415253 422262 428920 435468 442315 449114 454830 459045 462742 467379 473441
56288D73441O943P391Q078R064R886J0505J1248J2043J2407J2287J2210J2540
$$ 473441 480384 487775 495853 504917 514803 525308 536556 548599 561006 573293 585503 598043
56276E98043J3199J4189J5630J7158J8021J8132J8381J9592K1655K4039K6473
$$ 598043 611242 625431 641061 658219 676240 694372 712753 732345 754000 778039 804512
56265H04512K8799L0798L2669L5137L8632M2862M7625N3386O0478O8420P6748
$$ 804512 833311 864109 896778 931915 970547 1013409 1061034 1114420 1174898 1243318 1320066
56254A320066Q6026R7141J09967J23568J37502J51989J66968J81849J96243K10024
$$ 1320066 1406092 1503233 1613200 1736768 1874270 2026259 2193227 2375076 2571319 2781343
56244B781343K22412K31797K36806K37089K32759K23523K08791J88352J62586
$$ 2781343 3003755 3235552 3472358 3709447 3942206 4165729 4374520 4562872 4725458
56235D725458J32158R7863O0845K2715j4816n0526q3828j14235j40863j62810
$$ 4725458 4857616 4955479 5016324 5039039 5024223 4973697 4889869 4775634 4634771 4471961
56225D471961j79870j92473k00925k05262k05885k03696j99295j92648j83952
$$ 4471961 4292091 4099618 3898693 3693431 3487546 3283850 3084555 2891907 2707955
56216B707955j74165j64165j53871j42920j31770j21394j12058j03211r4544q6409
$$ 2707955 2533790 2369625 2215754 2072834 1941064 1819670 1707612 1604401 1509857 1423448
56206A423448p9100p2318o5667n9255n3526m8623m4154l9580l4891l0784k7915
$$ 1423448 1344348 1272030 1206363 1147108 1093582 1044959 1000805 961225 926334 895550 867635
56195H67635k6007k4090k1710j9350j7426j5482j2958j0289q572q268q740q966
$$ 867635 841628 817538 795828 776478 759052 743570 730612 720323 711751 703483 694743 685777
56183F85777q333o900n266m103l510l038k420j925j771j666j317q77m80R6Q56
$$ 685777 677444 670544 665278 661175 657665 654627 652207 650282 648511 646845 645528 644651 644171 644267 645123
56168F45123J249J067J076J987L226L764L789M476O168P776Q272Q018Q285R906
$$ 645123 646372 647439 648515 650502 653728 657492 661281 665757 671925 679701 687973 695991 704276 714182
56154G14182J2569J5150J6772J7736J9235K1881K5043K8075L1617L6837M3768
$$ 714182 726751 741901 758673 776409 795644 817525 842568 870643 902260 939097 982865
56143I82865N1402N9216O7641P6977Q6602R5319J01759J04532J02993R8025R1432
$$ 982865 1034267 1093483 1161124 1238101 1324703 1420022 1521781 1626313 1729306 1827331 1918763
56132A918763Q4390P7088O9717O2830N6481M9903M2422L4094K5327J6582Q659
$$ 1918763 2003153 2080241 2149958 2212788 2269269 2319172 2361594 2395688 2421015 2437597 2446256
56121B446256K359k634p954j5066k4068l4236m5187n6862o8711p9577q8370r4536
$$ 2446256 2448615 2445981 2438027 2422961 2398893 2364657 2319470 2262608 2193897 2114320 2025950 1931414
56109A931414r7883r8376r6169r1660q5365p7652o8697n8860m9074m0521l3793
$$ 1931414 1833531 1735155 1638986 1547326 1461961 1384309 1315612 1256752 1207678 1167157 1133364
56098A133364k8534k4018j9770j5581j1477p966n719m593l455j505P03K161K768
$$ 1133364 1104830 1080812 1061042 1045461 1033984 1026018 1020299 1015706 1012251 1010746 1011449 1013610 1016378
56085A016378L140L594M131N076O696Q366R091Q862Q715R329J0393J1420J2445
$$ 1016378 1019518 1023112 1027243 1032319 1039015 1047381 1056472 1065334 1074049 1083378 1093771 1105191 1117636
56072A117636J3664J4895J5724J5937J5720J5693J6507J8106J9570K0100J9907
$$ 1117636 1131300 1146195 1161919 1177856 1193576 1209269 1225776 1243882 1263452 1283552 1303459
56061A303459J9699J9611J9223J8378J7400J6605J6030J5546J4909J3989J3124
$$ 1303459 1323158 1342769 1361992 1380370 1397770 1414375 1430405 1445951 1460860 1474849 1487973
56050A487973J2905J3362J3961J4580J5750J7575J9289K0484K1815K3805K5945
$$ 1487973 1500878 1514240 1528201 1542781 1558531 1576106 1595395 1615879 1637694 1661499 1687444
56039A687444K7667K9225L0760L1619L1640L2001L3569L5480L6620L7452L8886
$$ 1687444 1715111 1744336 1775096 1806715 1838355 1870356 1903925 1939405 1976025 2013477 2052363
56028B052363M0428M1131M1546M2864M4810M6159M6802M7616M8820N0151N2136
$$ 2052363 2092791 2133922 2175468 2218332 2263142 2309301 2356103 2403719 2452539 2502690 2554826
56017B554826N5443N9449O3046O6305O9779P3002P5465P8135Q2094Q6435Q9625
$$ 2554826 2610269 2669718 2732764 2799069 2868848 2941850 3017315 3095450 3177544 3263979 3353604
56006C353604R2156R5617J00058J04554J09529J15996J23193J29616J35738J43029
$$ 3353604 3445760 3541377 3641435 3745989 3855518 3971514 4094707 4224323 4360061 4503090
55996D503090J51074J58454J65798J74896J85402J95598K05858K18133K32495
$$ 4503090 4654164 4812618 4978416 5153312 5338714 5534312 5740170 5958303 6190798
55987F190798K47658K64241K83969L06014L27942L49966L74474M01856M30874
$$ 6190798 6438456 6702697 6986666 7292680 7620622 7970588 8345062 8746918 9177792
55978I177792M62751N00479N44325N92317O44824P04297P71272Q45604R30758
$$ 9177792 9640543 10141022 10685347 11277664 11922488 12626785 13398057 14243661 15174419
55969A5174419J031610J149149J283302J439602J626439J847743K106615K415170
$$ 15174419 16206029 17355178 18638480 20078082 21704521 23552264 25658879 28074049
55961B8074049K792893L258455L834668M561193N492863O690476Q229090J0215622
$$ 28074049 30866942 34125397 37960065 42521258 48014121 54704597 62933687 73149309
55953G3149309J2788975J6109939K0339128K5515581L1276174L6609591M0015214
$$ 73149309 85938284 102048223 122387351 147902932 179179106 215788697 255803911
55946B55803911M0152873L6527127K9631181K0506662J0226014k82049j0159527
$$ 255803911 295956784 332483911 362115092 382621754 392847768 392565719 382406192
55939C82406192j8625265k5130607k9466971l1709549l2098460l0975555k8758062
$$ 382406192 363780927 338650320 309183349 277473800 245375340 214399785 185641723
55932A85641723k5884573k2742795j9626906j6731148j4157876j1935402j0047927
$$ 185641723 159757150 137014355 117387449 100656301 86498425 74563023 64515096
55925F4515096q462234p138033o031687n104692m329328l683620l145307k694329
$$ 64515096 56052862 48914829 42883142 37778450 33449122 29765502 26620195 23925866
55917B3925866k316812k002197j739323j518342j333070j178279j047227r34401
$$ 23925866 21609054 19606857 17867534 16349192 15016122 13837843 12790616 11856215
55909A1856215q37800p55964o85210o22018n65763n16777m73737m34829l99583
$$ 11856215 11018415 10262451 9577241 8955223 8389460 7872683 7398946 6964117 6564534
55900F564534l67828l38539l11226k86819k65855k47296k30089k14278j99804
$$ 6564534 6196706 5858167 5546941 5260122 4994267 4746971 4516882 4302604 4102800
55891D102800j85935j72640j60713j49853j38530j26517j15521j06503r8365r0239
$$ 4102800 3916865 3744225 3583512 3433659 3295129 3168612 3053091 2946588 2848223 2757984
55881B757984q3088p7951p4269p1157o8755o7358o6541o6089o6415o7277o7359
$$ 2757984 2674896 2596945 2522676 2451519 2382764 2315406 2248865 2182776 2116361 2049084 1981725
55870A981725o5932o3704o1457n9135n6733n4679n2802n0275m7162m4585m2893
$$ 1981725 1915793 1852089 1790632 1731497 1674764 1620085 1567283 1517008 1469846 1425261 1382368
55859A382368m1093l8584l6015l3905l1946l0141k9103k8606k7432k5331k3609
$$ 1382368 1341275 1302691 1266676 1232771 1200825 1170684 1141581 1112975 1085543 1060212 1036603
55848A036603k3077k2964k2563k2407k2833k2996k2304k1517k1267k0801j9281
$$ 1036603 1013526 990562 967999 945592 922759 899763 877459 855942 834675 813874 794593
55837G94593j7276j5824j4974j4290j3799j3544j2968j1770j0536r722q833p452
$$ 794593 777317 761493 746519 732229 718430 704886 691918 680148 669612 659890 651057 643605
55825F43605o260o094o716p313p659p977q303q653r250r964j0097r294q044o885
$$ 643605 637345 631251 624535 617222 609563 601586 593283 584630 575380 565416 555319 546025 537981 531096
55811E31096n801m778m063l432k119l1J854K952L974N633P329P973P413O252M899
$$ 531096 525295 520517 516454 513022 510903 510872 512726 515678 519652 525285 532614 540587 548000 554252 559151
55796E59151L536K450J543Q7k349n140p359q772r554r640r037q289p970q054q308
$$ 559151 562687 565137 566680 566767 564418 559278 551919 543147 533593 523953 514916 506627 498657 490603 482295
55781D82295q833r743j0752j1523j1977j1920j0970r263p616o491n397l822k135
$$ 482295 473462 463719 452967 441444 429467 417547 406577 397314 389698 383207 377810 373988 371853
55768C71853j035o52p02r98j334j357j124j269k190l503m614n305n430m810l798
$$ 371853 370818 370166 369464 368466 367132 365775 364651 363382 361192 357689 353075 347770 342340 337530 333732
55753C33732l261l458l688l535l621m452n291n149m274l793m254n258o258o898
$$ 333732 330471 327013 323325 319790 316169 311717 306426 301277 297003 293210 288956 283698 277440 270542
55739B70542o919o382n833n685n654n296m732m290l815k909j673o92m55j050k249
$$ 270542 263623 257241 251408 245723 240069 234773 230041 225751 221936 219027 217354 216662 216207 215157 212908
55724B12908l484m121m023l663l421l180k746k164j427m77K71J46p31j336j092
$$ 212908 209424 205303 201280 197617 194196 191016 188270 186106 184679 184202 184473 184619 183888 182552 181460
55709A81460n56k67J75J191K179K257J559Q84N50K82j02o49j464k318k520j874
$$ 181460 180904 180637 180812 182003 184182 186439 187998 188882 189432 189714 189612 188963 187499 185181 182661 180787
55693A80787j324j799k841l227k636j809j308r75n78j40L81J090J770K069K096
$$ 180787 179463 177664 174823 171596 168960 167151 165843 164868 164290 164150 164531 165621 167391 169460 171556
55678A71556K338K940L494L499K773J501J67p50j232j595j775j316l35J61l95
$$ 171556 173894 176834 180328 183827 186600 188101 188268 187518 186286 184691 182916 181600 181265 181426 181031
55663A81031j130q13M32J373J373J020J140J904K954L823M153L919L484L104K553
$$ 181031 179901 179088 179520 180893 182266 183286 184426 186330 189284 193107 197260 201179 204663 207767 210320
55648B10320J510J11j187k032k252j922j661k303l876n392o121o419o781o767
$$ 210320 211830 211941 210754 208722 206470 204548 202887 200584 196708 191316 185195 178776 171995 165228
55634A65228n823m526l920l998l793k871j725q12j55J60J7j51K84J148J587J275
$$ 165228 159405 154879 150959 146961 143168 140297 138572 137760 137605 137765 137782 137631 137915 139063 140650 141925
55618A41925O73O2q31k028k979l289l138k694j894j046q84j503j927j337l06n9
$$ 141925 142598 142660 141829 139801 136822 133533 130395 127701 125807 124761 123877 122374 120447 119110 118804 118745
55602A18745q35j628j615j164j157j716k092j766j100o95n42l22k62q95j947k330
$$ 118745 117910 116282 114667 113503 112346 110630 108538 106772 105672 104977 104435 104113 103851 102956 101009 98679
55586I8679j549m42k8k73m64k65K17R16J670J966J561J001R46J257J426J545K069
$$ 98679 97130 96688 96660 96387 95923 95658 95875 96791 98461 100427 101988 102989 103935 105192 106618 108163 110232
55569A10232K917L543L758L708L275K278J141N56M51J02p54j628k149k462k669
$$ 110232 113149 116692 120450 124158 127433 129711 130852 131408 131859 131961 131207 129579 127430 124968 122299
55554A22299k583k220j937j863j668j109m27j13m70j366k121j922p25N19R69R22
$$ 122299 119716 117496 115559 113696 112028 110919 110492 110379 109909 108543 106422 104500 103775 104294 105263 106185
55538A06185J148J593J564R34L36K48N90J119J530J323L27p53j098r12j017j563
$$ 106185 107333 108926 110490 111424 111760 112008 112598 113717 115247 116570 116897 116144 115046 114134 113117 111554
55522A11554k046k365k795l023k422j359r96j582k108j931j543j368r64q7O24
$$ 111554 109508 107143 104348 101325 98903 97544 96548 94966 92858 90927 89384 88016 87052 86965 87589
55507H7589O24K54o8n09j067j062k44M85K25o35j122j004o32r5O04J070J022Q87
$$ 87589 88213 88467 88399 87890 86823 85761 85517 86002 86227 85592 84470 83466 82834 82739 83343 84413 85435 86322
55489H6322J127J383J063L24k74o83j139j351q72j6N10P12J187J932K207J680
$$ 86322 87449 88832 89895 90219 89945 89262 88123 86772 85900 85884 86394 87106 88293 90225 92432 94112
55473I4112R04M17P5m18q70r48p75p81j121j484j491j165q66p55m86K42R99R67
$$ 94112 95016 95433 95508 95090 94220 93272 92497 91716 90595 89111 87620 86455 85589 84834 84348 84590 85589 86556
55455H6556J10o00m26K29N44L68M6l33p86r28m18K77L65j23m29l07l10p15r77
$$ 86556 86666 86066 85640 85869 86413 86781 86827 86494 85708 84780 84362 84639 85004 84881 84452 84145 83835 83120 82143
55436H2143o22L6M69O47P33N22j81r08q89j8R68J322J005N36L90O27R42R89P29
$$ 82143 81521 81557 82026 82673 83406 83928 83747 82839 81950 81932 82900 84222 85227 85763 86153 86780 87722 88711 89440
55417H9440M92N24O48N26K27J94N46P86M18l79j030j363j636j835j491m22P62
$$ 89440 89932 90456 91104 91630 91857 92051 92597 93383 93801 93422 92392 91029 89393 87558 86067 85645 86407
55400H6407J239Q06j07r81j443j266o19r4j03l07o7O44J207J153O13j1m15m35
$$ 86407 87646 88452 88345 87364 85921 84655 84036 83942 83839 83532 83465 84109 85316 86469 87082 87071 86656 86221
55382H6221j60K2j51l32kO72Q87K78n92r13m51M24J144J226N48m86j371k041k580
$$ 86221 86061 86083 85932 85600 85598 86270 87157 87435 86843 85930 85479 85903 87047 88273 88821 88335 86964 84923 82343
55363H2343k574j458L63J591J497P16K10Q3m2q8L20J053J509J336P17O1l26l69
$$ 82343 79769 78311 78674 80265 81762 82478 82688 82771 82729 82641 82961 84014 85523 86859 87576 87637 87311 86942
55345H6942l94q67j718k169j608l96N61Q35P01N81O07O63N35J12l74n49m15l86
$$ 86942 86548 85681 83963 81794 80186 79790 80351 81186 81887 82468 83075 83738 84273 84385 84011 83462 83047 82661
55327H2661n80m92K19J009J036K61m99n81q4M47N83K37l04n96m17RL26M12K99
$$ 82661 82081 81589 81808 82817 83853 84114 83615 83034 82950 83397 83980 84217 83913 83317 82900 82909 83235 83647 83946
55308H3946l0n10q49p67l29J55L97K21l82j063j183l95R59K118K479J888P10l07
$$ 83946 83916 83406 82557 81790 81461 81616 82013 82234 81852 80789 79606 79211 80170 82288 84767 86655 87365 87058
55290H7058n44j43J74L3j82L4N91J010R33L34m86r54p08j63q3m51m55J80O64L65
$$ 87058 86514 86371 86545 86578 86396 86430 87021 88031 88964 89298 88812 87858 87150 86987 86904 86453 85998 86178 86842 87207
55270H7207k31l79j70p3ML07N31L56K37O10Q14p1j562k142j323k46j4l97n43j06
$$ 87207 86976 86597 86427 86354 86358 86665 87196 87552 87789 88399 89213 89142 87580 85438 84115 83869 83855 83458 82915 82809
55250H2809O21J137J094O43M91J058J655J277J50m52j0N47L17l71o94n34l25k73
$$ 82809 83430 84567 85661 86304 86795 87853 89508 90785 90935 90483 90473 91020 91337 90966 90272 89738 89413 89140
55232H9140l53n78p91n66J04M44j23r57q52L59J469J324Q7j051j154k91P51J259
$$ 89140 88787 88209 87418 86852 86956 87400 87277 86320 85468 85827 87296 88620 88707 87656 86502 86211 86962 88221
55214H8221J041M14j12j39K67N47K73k15j90K67J83q40j695j138L57J184Q10K62
$$ 88221 89262 89676 89564 89425 89692 90239 90512 90297 90107 90374 90557 89717 88022 86884 87241 88425 89235 89497
55196H9497K85K55n38j521j650r86n10o24o90j25P00R38L79k47q4Q74J741J760
$$ 89497 89782 90037 89499 87978 86328 85342 84832 84208 83518 83393 84093 85031 85410 85163 85079 85953 87694 89454
55178H9454J126N41K33j19n62o22n7O69R23O56K70O5M5J34L13N90Q74Q34J38r47
$$ 89454 90580 91121 91354 91235 90673 90051 89994 90663 91586 92242 92512 92577 92622 92756 93069 93659 94533 95367 95505 94558
55158I4558j436o14R55J983J972J506J027K52q99j677j481q39n96n33K76J821
$$ 94558 93122 92508 93463 95446 97418 98924 99951 100203 99304 97627 96146 95307 94711 94178 94454 96275
55142I6275K701J770l92j994j981r79l39n19q12n57n5lm02o77n64l54k93l47n20
$$ 96275 98976 100746 100354 98360 96379 95400 95061 94542 93730 93173 93118 93115 92713 92036 91472 91118 90825 90478 89958
55123H9958p55o14K77J381J676J030L53J70j6n29p00N2J161J731J808J962K134
$$ 89958 89203 88589 88866 90247 91923 92953 93306 93476 93460 92931 92231 92283 93444 95175 96983 98945 101079
55106A01079J823J068L47k35q39j228j034n31k88j98L31J254J851J828J606J426
$$ 101079 102902 103970 104317 104082 103243 102015 100981 100450 100162 99964 100295 101549 103400 105228 106834 108260
55090A08260J001L03p6K14P09Q22N97M38N04P14R68J068P66J67k35j45K37O47
$$ 108260 109261 109564 109488 109702 110411 111233 111830 112268 112772 113486 114454 115522 116288 116455 116220 116075 116312 116959
55072A16959J050J291R43l9q97q60j11M63M31K01K84N91O51K03n96j413j934j951
$$ 116959 118009 119300 120243 120204 119307 118447 118336 118799 119230 119431 119715 120306 120957 121160 120564 119151 117217 115266
55054A15266j462q23n70r01j382j396r78p96j161j435r05P1M09k03q42o17J78
$$ 115266 113804 112981 112411 111510 110128 108732 107754 106958 105797 104362 103457 103528 103937 103734 102892 102275 102453
55037A02453N73J87m92q49p14l16p4l21r17j211o93K66P93O01L71Q31J834K573
$$ 102453 103026 103213 102721 101872 101158 100842 100768 100447 99530 98319 97626 97892 98685 99286 99657 100488 102322 104895
55019A04895K498J709O21l72r02p67k37k4n69j493j976j656r15k77J25L90M69
$$ 104895 107393 109102 109723 109351 108449 107682 107445 107421 106852 105359 103383 101727 100812 100535 100660 101050 101519
55002A01519L02J11K32O51J020J128J094J042Q85N94L48K72K12M8K3M05R13Q69
$$ 101519 101821 101932 102164 102815 103835 104963 106057 107099 107984 108578 108926 109198 109410 109458 109481 109886 110799 111668
54984A11668Q8p66q87k34N11Q07P47P30Q62R37Q55Q23J008J137P03l53j330j380
$$ 111668 111756 110990 110103 109869 110380 111187 111934 112664 113526 114463 115318 116141 117149 118286 118989 118636 117306 115926
54966A15926m45O22R47M17m41j106j249o44O33J888K196J338R6o04n53j74J06
$$ 115926 115481 116103 117050 117467 117026 115920 114671 114027 114660 116548 118744 120082 120178 119574 119021 118847 118953
54949A18953J62Q7J15M53R15R17J59q70j366j130o70n16p13r32p55Q3J361K349
$$ 118953 119115 119202 119317 119770 120685 121602 121761 120891 119525 118395 117725 117209 116496 115564 114809 114892 116253 118602
54931A18602K488K122K121K759L396L382K881K634L140M292N624O741P538Q054
$$ 118602 121090 123212 125333 128092 131488 134870 137751 140385 143525 147817 153441 160182 167720 175774
54917A75774Q081P226N575L938K910J946R3k522m724n894o566p190p236o193m743
$$ 175774 183855 191081 196656 200594 203504 205450 205543 203021 198297 192403 185837 178647 171411 165218 160475
54902A60475m031m151m152l408k257j352r39r18j149j466j605j289m45O02J250
$$ 160475 156444 152293 148141 144733 142476 141124 140185 139267 138118 136652 135047 133758 133313 133915 135165
54887A35165J180P94P34J082J444J799K538L576M316M777N839P741R214Q970P378
$$ 135165 136345 137139 137873 138955 140399 142198 144736 148312 152628 157405 163244 170985 180199 189169 196547
54872A96547N735M453L029J362j20j449l127n073o572p340p722p843p437o630
$$ 196547 202282 206735 209764 211126 211006 209557 206430 201357 194785 187445 179723 171880 164443 157813
54858A57813n888n137l929k617k224k820l203k662j950j859j915j399p00n94q50
$$ 157813 151925 146788 142859 140242 138018 135198 131995 129333 127383 125524 123609 122210 121510 120916 120066
54843A20066o86j48J9l96r64j556k320k875k548j493o47l55K8Q86J619J614J203
$$ 120066 119380 119232 119251 118855 117891 116335 114015 111140 108592 107099 106452 106097 106125 107011 108630 110244 111447
54826A11447J053J069P12P5j54K63P27O59K66J44M43P65P46M16K0k48k38J20O67
$$ 111447 112500 113569 114281 114356 114202 114465 115192 115851 116117 116261 116704 117469 118215 118631 118651 118403 118165 118285 118952
54807A18952J033J026Q60Q34R08Q16M69km64p53n74J70J020J341J100Q17P21M61
$$ 118952 119985 121011 121871 122705 123613 124429 124898 124896 124432 123679 123105 123275 124295 125636 126736 127553 128274 128735
54789A28735j72p89r52p73n93l96k7L89O32P92J063J291J181Q20N80O32R26J498
$$ 128735 128563 127774 126822 126049 125456 125060 125033 125422 126054 126846 127909 129200 130381 131201 131781 132413 133339 134837
54771A34837K359L206L784M445N740P417Q489Q537Q280Q391Q363P170M828K445
$$ 134837 137196 140402 144186 148631 154371 161788 170277 178814 187094 195485 203848 211018 215846 218291
54757B18291P67o24k349m172n388n887o190o510o485n933n277m919m636m071l443
$$ 218291 219058 218434 216085 211913 206525 200638 194448 187938 181453 175520 170243 165324 160688 156617 153174
54742A53174l309l643l752l051j664k13O47O19L1l19J4O32R88J321K185L245L553
$$ 153174 149865 146222 142470 139419 137755 137542 138189 138808 138839 138520 138534 139166 140154 141475 143660 146905 150458
54725A50458L179L487N201P165P735O777N466M613M100L536K595R24j412l520
$$ 150458 153637 157124 162325 169490 177225 184002 189468 194081 198181 201717 204312 205236 203824 200304
54711B00304m591n010n695o504o375n195m286m542n074m496k852j442j070j247
$$ 200304 195713 190703 185008 178504 172129 166934 162648 158106 153032 148536 145684 144242 143172 141925
54697A41925j080l73K43O1q90j724j621q18l63q03j589j957j815j482j072o23
$$ 141925 140845 140472 140715 140776 139886 138162 136541 135723 135360 134557 132968 131011 129196 127714 126642 126019
54681A26019m38p01j039r60n81l99m97n27l80l40n63q24r03q01n59j98J09J30
$$ 126019 125581 124880 123841 122881 122300 121901 121404 120877 120497 120157 119594 118770 117867 117066 116507 116309 116418 116548
54663A16548l4j2L12O25O14L51J14Q9L30P46J057R57M66m3k60k04p4o4l20q35
$$ 116548 116514 116502 116814 117439 118053 118404 118518 118607 118937 119683 120740 121697 122163 122120 121860 121656 121582 121518 121198 120363
54643A20363j245j069k67O21J025P98J18o98j142p51K28Q09L84m37n98k9L37r0
$$ 120363 119118 118049 117782 118403 119428 120226 120344 119646 118504 117753 117981 118790 119174 118737 118139 118110 118447 118357
54625A18357q51j249j197r38m18M57J304J518J030L80R2K15N08P28P28N28L52
$$ 118357 117506 116257 115060 114122 113704 114161 115465 116983 118013 118393 118485 118700 119208 119936 120664 121192 121544
54608A21544L98N63N66L50J34L8m1k00l68m06k52N3K89R2n71j081p80M8L73j75
$$ 121544 121942 122505 123071 123421 123555 123593 123552 123352 122984 122578 122326 122379 122668 122760 122189 121108 120328 120376 120749 120574
54588A20574p13l06P41J406J333J002O76O4q70j445j025J64J276J682J358P06
$$ 120574 119861 119555 120296 121702 123035 124037 124713 124777 123907 122462 121437 121601 122877 124559 125917 126623
54572A26623J58j44l60n87n76r7N51Q66Q45R04J065Q85L11j04j06j83n90o62K02
$$ 126623 126781 126637 126277 125690 125114 125017 125568 126434 127279 128183 129248 130133 130444 130340 130234 130051 129461 128799 129001
54553A29001J371J696J078M25J73j69q77j345j021k65K18L93P86J607K478K884
$$ 129001 130372 132068 133146 133571 133744 133575 132698 131353 130332 130067 130285 130678 131464 133071 135549 138433
54537A38433K593J688M86n27r52p63l07m8j97n04n03j04J63k64j239k040k189
$$ 138433 141026 142714 143200 142673 141721 140958 140651 140603 140406 139902 139399 139295 139458 139194 137955 135915 133726
54520A33726j768j015m7Q59J264J020M53j00n49p78n99j99j02l58l48J99N58j2
$$ 133726 131958 130943 130896 131755 133019 134039 134492 134392 133843 133065 132466 132267 132165 131807 131459 131658 132216 132204
54502A32204j045j391p60K0J94j07k81J9O90J262J221O36L14P68J311R21j59o22
$$ 132204 131159 129768 129008 129028 129222 129115 128834 128853 129543 130805 132026 132662 132976 133744 135055 135976 135817 135195
54484A35195l2N76L93M9M47J237J444J019P26P07L37n53j205r83j28P50J387J752
$$ 135195 135163 135739 136132 136181 136628 137865 139309 140328 141054 141761 142098 141545 140340 139357 139229 139979 141366 143118
54466A43118J739J387J104J284J845K311K226J406M8j272j924j763j173n53qL97
$$ 143118 144857 146244 147348 148632 150477 152788 155014 156420 156468 155196 153272 151509 150336 149783 149775 150172
54450A50172M40P2l56n54p23j129j495j287n40J15L01K95L24J01n84j229j174
$$ 150172 150612 150684 150328 149774 149051 147922 146427 145140 144600 144715 145016 145311 145635 145736 145152 143923 142749
54433A42749n58j21j18j20M0o4n15n69K72J256J320O67N15J290K075J987J234
$$ 142749 142191 142070 141952 141832 141872 141808 141293 140724 140996 142252 143572 144239 144754 146044 148119 150106 151340
54416A51340M30k59p69o99j1M37j32j210j608j023j75M11Q54J156R98N58O21J419
$$ 151340 151770 151511 150742 150043 150032 150469 150337 149127 147519 146496 146321 146732 147586 148742 149740 150298 150919 152338
54398A52338K070J751Q83M63O44O78J55m16l60L08R46J001M93p3k52j62k90p60
$$ 152338 154408 156159 157042 157505 158149 158827 158982 158566 158206 158514 159460 160461 160954 160881 160629 160467 160177 159417
54380A59417j079q62n04p03j353j513o04Q25J807K160K524L269L924L868L319
$$ 159417 158338 157476 156972 156269 154916 153403 152799 153624 155431 157591 160115 163384 167308 171176 174495
54365A74495L156L814M752N153M781L889K658J167k26j064j419j853k563l012
$$ 174495 177651 181465 186217 191370 196151 200040 202698 203865 203639 202575 201156 199303 196740 193728
54351A93728k724k052j773k182k953l702m242m349l789k634j329l10K03Q3o65
$$ 193728 191004 188952 187179 184997 182044 178342 174100 169751 165962 163328 161999 161689 161892 161975 161310
54336A61310j635k091j640o44J64M65N01N25M43J36p8K89J131J615J083r7r11
$$ 161310 159675 157584 155944 155300 155464 155929 156430 156955 157398 157534 157456 157745 158876 160491 161574 161477 160566
54319A60566q76m15j16m8K3J64K78L26K29j71p72j151j076q46p32n32j07o7j062
$$ 160566 159690 159275 159159 159111 159134 159298 159576 159902 160131 159960 159188 158037 156961 156115 155383 154851 154744 154677 153615
54300A53615k521k968j810j35O05J82n56p91l00O78J531J560P49M0K58R74J114
$$ 153615 151094 148126 146316 146181 146786 146968 146412 145621 145321 145999 147530 149090 149839 149879 150137 151111 152225
54283A52225N02O9M22J034J188R97R17Q57M20k20m65k12K0k7j1K94N03K09k94
$$ 152225 152727 152796 153218 154252 155440 156437 157354 158211 158631 158411 157946 157734 157754 157727 157716 158010 158513 158722 158428
54264A58428l15M14J515K418K701K190J138K46J14N94J039J195J430J918K092
$$ 158428 158113 158527 160042 162460 165161 167351 168489 168735 168849 169443 170482 171677 173107 175025 177117
54249A77117J320j39j356j765j563j113m92J73M45K2p97j425j679j708j457o54
$$ 177117 178437 178298 176942 175177 173614 172501 172009 172182 172627 172649 171852 170427 168748 167040 165583 164929
54233A64929N61J498J634J129M03l47r60j038l70N57J001Q11M20J48k0r9j12l75
$$ 164929 165490 166988 168622 169751 170154 169807 168847 167809 167439 167996 168997 169808 170228 170376 170356 170257 170145 169770
54215A69770j031j396o31P70J168j6j284j081P3M41m23j347j441j035o42j42N54
$$ 169770 168739 167343 166712 167482 168650 168634 167350 166269 166342 166783 166360 165013 163572 162537 161895 161753 162307
54198A62307R75P59K31j04j50L5N15J134J379R93L23j96m97o43o10n77q31j112
$$ 162307 163282 164041 164272 164168 164018 164053 164568 165702 167081 168074 168397 168201 167704 167061 166451 165874 165043 163931
54180A63931p11M40J431J632J566J907K285J878P88j24m29l41kN01O26k04j534
$$ 163931 163220 163660 165091 166723 168289 170196 172481 174359 175147 175023 174594 174253 174251 174752 175378 175174 173640
54163A73640k145j593p57o10j098j555j607j321q72m92m39o60o72n9R80J718J558
$$ 173640 171495 169902 169145 168535 167437 165882 164275 162954 162082 161590 161151 160491 159819 159760 160740 162458 164016
54146A64016N59o45j434j693j579j008J76J413J602N18n42k77R05J501R20m9n72
$$ 164016 164575 163930 162496 160803 159224 158216 158392 159805 161407 161925 161383 161106 162011 163512 164432 164383 163811
54129A63811o19l64K02Q01Q37K81j37R5O59J046J195J242J205J225J509J826J707
$$ 163811 163192 162828 163030 163831 164668 164949 164812 164907 165566 166612 167807 169049 170254 171479 172988 174814 176521
54112A76521J344J500K158K316J621J190K005L307L686L084K502K147J290j08
$$ 176521 177865 179365 181523 183839 185460 186650 188655 191962 195648 198732 201234 203381 204671 204563
54098B04563j003q16l34n47j340j925j940j572r92k45M63Q26P87N52K87J7k03
$$ 204563 203560 202744 202410 201863 200523 198598 196658 195086 194094 193849 194312 195138 195925 196477 196764 196781 196578
54081A96578k07N1K66o7j137k425k998k275n00J474K733K772J810P18K83L77J96
$$ 196578 196371 196422 196688 196621 195484 193059 190061 187786 187286 188760 191493 194265 196075 196793 197076 197453 197649
54064A97649n65j253j206o80l88m66n19l81k49j55R6M46N94N72Q88J860L114L889
$$ 197649 197084 195831 194625 193945 193557 193091 192572 192191 191942 191787 191883 192329 192923 193495 194383 196243 199357 203246
54046B03246L751K946K204K090K475K761K695K658K964L336L468L668M330N081
$$ 203246 206997 209943 212147 214237 216712 219473 222168 224826 227790 231126 234594 238262 242592 247673
54032B47673N166M571M051M033M161M055L866L829L827L608L098K352J554J085
$$ 247673 252839 257410 261461 265494 269655 273710 277576 281405 285232 288840 291938 294290 295844 296929
54018B96929J129J186N07q94k229l030l634m365m886m797m294l802l470l371l716
$$ 296929 298058 299244 299751 298857 296628 293598 289964 285599 280713 275916 271622 267820 264350 260979 257263
54003B57263m361m586l945k999k583k646k451j724r46n80n76o57o47m73k98n65
$$ 257263 252902 248316 244371 241372 238789 236143 233692 231968 231022 230442 229866 229209 228562 228089 227791 227226
53987B27226j482k452k591j886j278j415j872j858j290p01l74p1M57J064J482
$$ 227226 225744 223292 220701 218815 217537 216122 214250 212392 211102 210401 210027 209956 210413 211477 212959
53972B12959J714K018K548L207L883M682N789P043P915P988P343O285M865K944
$$ 212959 214673 216691 219239 222446 226329 231011 236800 243843 251758 259746 267089 273374 278239 281183
53958B81183O28j633l448m679n218m945m102l364l148l024k200o24Q32J450J542
$$ 281183 281811 280178 276730 272051 266833 261888 257786 254422 251274 248250 246050 245426 246258 247708 249250
53943B49250J891K579K935K643K372K929M149N102N200M703M141L740L438L111
$$ 249250 251141 253720 256655 259298 261670 264599 268748 273850 279050 283753 287894 291634 295072 298183
53929B98183K555J624N81M4L59J207K081K829L504L966M024L898M083M718N416
$$ 298183 300738 302362 302943 302987 303346 304553 306634 309463 312967 316933 320957 324855 328938 333656 339072
53914C39072N774N788N742N831N934N698M834L524K415K002K081K017J473O60
$$ 339072 344846 350634 356376 362207 368141 373839 378673 382197 384612 386614 388695 390712 392185 392845
53900C92845n0m57n49n40q88j908l348m654n668o637p479p609o829n921n809o396
$$ 392845 392795 392338 391789 391249 390361 388453 385105 380451 374783 368146 360667 353058 346229 340308 334499 328103
53884C28103o744o345n689n465n644n623n043m256l848l830l486k249p05j97j275
$$ 328103 321359 315014 309325 303860 298216 292593 287550 283294 279446 275616 272130 269881 269176 268979 267704
53869B67704k885l626l374l107l306l406k926k266j985j986j962k099k622l028
$$ 267704 264819 261193 257819 254712 251406 248000 245074 242808 240823 238837 236875 234776 232154 229126
53855B29126k618j614r77j045j127p00k48n02j355k029k022j442o97k40m03r69
$$ 229126 226508 224894 223917 222872 221745 221045 220797 220295 218940 216911 214889 213447 212750 212510 212107 211138
53839B11138j105j77J339K256J994J125N17L52K08k39q44j188r31j21P08R16M55
$$ 211138 210033 209856 211195 213451 215445 216570 217087 217439 217647 217408 216564 215376 214445 214324 215032 215948 216403
53822B16403k0J10P14J198J321J361J494J497J228J021J246J646J601J009N50
$$ 216403 216383 216493 217207 218405 219726 221087 222581 224078 225306 226327 227573 229219 230820 231829 232379
53807B32379Q64J800K713L301L794M406M965N205N130M958M877M964N198N371
$$ 232379 233243 235043 237756 241057 244851 249257 254222 259427 264557 269515 274392 279356 284554 289925
53793B89925N170M444L388K373J718J595J913K229K032J315N75O7o25j887l267
$$ 289925 295095 299539 302927 305300 307018 308613 310526 312755 314787 316102 316677 316744 316119 314232 310965
53778C10965l950l885l825m159m363l937l349l422m119m525m117l434l276l601
$$ 310965 307015 303130 299305 295146 290783 286846 283497 280075 275956 271431 267314 263880 260604 257003
53764B57003l654l066k369k246k595k774k534k248k160j927j257n15k50m02n28
$$ 257003 253349 250283 247914 245668 243073 240299 237765 235517 233357 231430 230173 229658 229408 229006 228478
53749B28478o17r90j484j461q60m59p43j091o82K56P62M48k10p07r45p98j8J163
$$ 228478 227861 226871 225387 223926 223066 222607 221864 220773 220091 220347 221109 221557 221347 220640 219695 218897 218879 220042
53731B20042J918J809J407J477J825J596O06l00l81J10N11P28J067J391J216O85
$$ 220042 221960 223769 225176 226653 228478 230074 230680 230380 229999 230109 230620 231348 232415 233806 235022 235707
53715B35707O61J538K505K542J688P61J91j74k24N39K130L741M624M791M592M159
$$ 235707 236368 237906 240411 242953 244641 245402 245593 245419 245195 245734 247864 251605 256229 261020 265612 269771
53699B69771L596L265L419L808M115M397M683M521L561K353J867K117J959N07
$$ 269771 273367 276632 280051 283859 287974 292371 297054 301575 305136 307489 309356 311473 313432 313939
53685C13939j682l154l072j935q82n43o48o00k67L0J71M50Q90R01P6r79j209m55
$$ 313939 312257 309103 306031 304096 303214 302671 302023 301423 301156 301186 301357 301807 302697 303598 303674 302695 301486 301031
53667C01031L59M34o8n62q07q77p49m25k12m00p44o38R5R00J076N62o8l20k75
$$ 301031 301390 301824 301756 301194 300387 299510 298761 298336 298124 297724 296980 296342 296437 297337 298413 298975 298907 298587 298312
53648B98312k95l81j53M88J099J294J344J770K509K951K787K344K058K013K130
$$ 298312 298017 297636 297483 297971 299070 300364 301708 303478 305987 308938 311725 314069 316127 318140 320270
53633C20270K400K685K646K238J976K395L312M017M084L732L410L290L238L056
$$ 320270 322670 325355 328001 330239 332215 334610 337922 341939 346023 349755 353165 356455 359693 362749
53619C62749K677K211J907J961K323K730K980L130L403L857M174L962L239K581
$$ 362749 365426 367637 369544 371505 373828 376558 379538 382668 386071 389928 394102 398064 401303 403884
53605D03884K560L139L730L829L442K890K415K036J621J091N38J91J19J09n8k76
$$ 403884 406444 409583 413313 417142 420584 423474 425889 427925 429546 430637 431175 431366 431485 431594 431536 431260
53589D31260k54K3K65K15j66q11j564k164k495k802l307l666l340k475j834j696
$$ 431260 431006 431029 431294 431509 431343 430532 428968 426804 424309 421507 418200 414534 411194 408719 406885 405189
53573D05189j523r74n94r96j855k410k445k137j347Q3J499J841J025J16r2N9n3
$$ 405189 403666 402692 402098 401102 399247 396837 394392 392255 390908 390991 392490 394331 395356 395472 395380 395439 395386
53556C95386l10k14J94L49q2q78j554j656r91J59J148J577J674J831K064K189
$$ 395386 395076 394862 395056 395405 395323 394445 392891 391235 390244 390403 391551 393128 394802 396633 398697 400886
53540D00886K358K905L743M424M832N400O387P283P344O575N869O071P110Q211
$$ 400886 403244 406149 409892 414316 419148 424548 430935 438218 445562 452137 458006 464077 471187 479398
53526D79398Q880R397J0273J1410J2158J2239J2223J2801J3910J4899J5450J5812
$$ 479398 488278 497675 507948 519358 531516 543755 555978 568779 582689 597588 613038 628850
53514F28850J6201J6585J7203J8673K1005K3113K3959K3989K4579K6045K7121
$$ 628850 645051 661636 678839 697512 718517 741630 765589 789578 814157 840202 867323
53503H67323K6761K5587K4888K4763K4212K2826K1376K0592K0231J9769J9297
$$ 867323 894084 919671 944559 969322 993534 1016360 1037736 1058328 1078559 1098328 1117625
53492A117625J9198J9343J9184J8557J7913J7865J8686K0063K1028K0559J8674
$$ 1117625 1136823 1156166 1175350 1193907 1211820 1229685 1248371 1268434 1289462 1310021 1328695
53481A328695J6775J6362J7429J8634J8881J8192J7059J5649J3935J2060J0136
$$ 1328695 1345470 1361832 1379261 1397895 1416776 1434968 1452027 1467676 1481611 1493671 1503807
53470A503807Q005N527K816l7l103o146q428r428r592r922j0949j2527j4318j5952
$$ 1503807 1511812 1517339 1520155 1520118 1517015 1510869 1502441 1493013 1483421 1473499 1462550 1450023 1435705 1419753
53456A419753j6906j6896j6504j6774j7967j9194j9581j9347j9323j9797k0284
$$ 1419753 1402847 1385951 1369447 1352673 1334706 1315512 1295931 1276584 1257261 1237464 1217180
53445A217180k0213j9447j8186j6757j5436j4222j2751j0749q505o616n310m337
$$ 1217180 1196967 1177520 1159334 1142577 1127141 1112919 1100168 1089419 1080914 1074298 1068988 1064651
53433A064651l461k695k001j168j92O52J321K287L910N781P103P667Q083R017
$$ 1064651 1061190 1058495 1056494 1055326 1055134 1055786 1057107 1059394 1063304 1069085 1076188 1083855 1091938 1100955
53419A100955J0577J2433J4190J5565J6571J7650J9387K1759K3988K5375K6078
$$ 1100955 1111532 1123965 1138155 1153720 1170291 1187941 1207328 1229087 1253075 1278450 1304528
53408A304528K6794K7853K9036L0205L1541L3114L4677L6125L7827M0122M2754
$$ 1304528 1331322 1359175 1388211 1418416 1449957 1483071 1517748 1553873 1591700 1631822 1674576
53397A674576M5127M7067M8914N0894N2755N4150N5064N5683N6057N6118N5893
$$ 1674576 1719703 1766770 1815684 1866578 1919333 1973483 2028547 2084230 2140287 2196405 2252298
53386B252298N5505N5017N4432N3736N2784N1291M9105M6456M3655M0595L6836
$$ 2252298 2307803 2362820 2417252 2470988 2523772 2575063 2624168 2670624 2714279 2754874 2791710
53375B791710L2314K7603K3301J9395J5365J0740N360o86o994j2956j8277k3380
$$ 2791710 2824024 2851627 2874928 2894323 2909688 2920428 2925788 2925102 2918108 2905152 2886875 2863495
53363B863495k8827l4424l9291m2903m5540m7599m8994m9640n0011n0559n0888
$$ 2863495 2834668 2800244 2760953 2718050 2672510 2624911 2575917 2526277 2476266 2425707 2374819
53352B374819n0165m8353m6393m5012m3928m2508m0759l9323l8715l8856l9236
$$ 2374819 2324654 2276301 2229908 2184896 2140968 2098460 2057701 2018378 1979663 1940807 1901571
53341A901571l9239l8479l7025l5236l3271l0990k8407k5879k3603k1305j8765
$$ 1901571 1862332 1823853 1786828 1751592 1718321 1687331 1658924 1633045 1609442 1588137 1569372
53330A569372j6415j4845j3983j3296j2692j2622j3240j4175j5233j6611j8060
$$ 1569372 1552957 1538112 1524129 1510833 1498141 1485519 1472279 1458104 1442871 1426260 1408200
53319A408200j8582j7632j6047j5085j4764j4011j2331j0487r320q682p888o706
$$ 1408200 1389618 1371986 1355939 1340854 1326090 1312079 1299748 1289261 1279941 1271259 1263371 1256665
53307A256665n365l994k566j225k10N90J628L220N251P338R155J0679J2265J4426
$$ 1256665 1251300 1247306 1244740 1243515 1243305 1243895 1245523 1248743 1253994 1261332 1270487 1281166 1293431 1307857
53293A307857J7282K0256K2526K3770K4329K4714K5146K5546K5708K5384K4430
$$ 1307857 1325139 1345395 1367921 1391691 1416020 1440734 1465880 1491426 1517134 1542518 1566948
53282A566948K2956K1227J9349J7132J4352J1047P592M527K215M17j672m646q135
$$ 1566948 1589904 1611131 1630480 1647612 1661964 1673011 1680603 1685130 1687345 1687762 1686090 1681444 1673309
53269A673309j1183j3469j5666j8368k1082k2861k3598k4070k4785k5450k5807
$$ 1673309 1662126 1648657 1632991 1614623 1593541 1570680 1547082 1523012 1498227 1472777 1446970
53258A446970k6271k7260k8343k8647k7971k6961k6171k5572k5062k4926k5301
$$ 1446970 1420699 1393439 1365096 1336449 1308478 1281517 1255346 1229774 1204712 1179786 1154485
53247A154485k5607k5023k3571k2233k1815k2033k1941k1148k0253j9996k0255
$$ 1154485 1128878 1103855 1080284 1058051 1036236 1014203 992262 971114 950861 930865 910610
53236I10610k0110j8878j6842j4863j3417j2339j1398j0693j0347j0063r391q316
$$ 910610 890500 871622 854780 839917 826500 814161 802763 792070 781723 771660 762269 753953
53224G53953p393p262q181r870j1604j2649j2953j3283j4364j5901j6904j6867
$$ 753953 746560 739298 731117 721247 709643 696994 684041 670758 656394 640493 623589 606722
53212F06722j6183j5376j4564j3831j3434j3212j2396j0599q594p500p504p955
$$ 606722 590539 575163 560599 546768 533334 520122 507726 497127 488533 481033 473529 465574
53200D65574q464r116r819j0216j0339j0613j1100j1311j0890r983q794p469o452
$$ 465574 457110 447994 438175 427959 417620 407007 395907 384596 373706 363723 354929 347460 341008
53187C41008o189o251n558l898k474k343k994l246k929k767k929k781k066j423
$$ 341008 334819 328568 323010 319112 316638 314295 311301 308055 305126 302359 299430 296649 294583 293160
53173B93160j483k098k693k865k412j343r1O24M73j41o18p84q33r08j001j077
$$ 293160 291677 289579 286886 284021 281609 280266 280175 280799 281272 281131 280513 279729 278896 277988 276987 275910
53157B75910j148j210j177q73j98N90R17M42n20j349j730j738j469j034p59r05
$$ 275910 274762 273552 272375 271502 271304 271894 272811 273253 272733 271384 269654 267916 266447 265413 264654 263749
53141B63749j169r64k30M55O45M79L11L26O43J276J849J801J175P17R38J432J488
$$ 263749 262580 261616 261386 261841 262486 262965 263276 263602 264245 265521 267370 269171 270346 271063 272001 273433 274921
53124B74921R59K85m8K35J096J991K180J615J156J433J951J859J245R43J170J171
$$ 274921 275880 276165 276117 276352 277448 279439 281619 283234 284390 285823 287774 289633 290878 291821 292991 294162
53108B94162L00j149k387k927k793k310j935j934k102k019j614j214r81p27l61
$$ 294162 294462 293313 290926 287999 285206 282896 280961 279027 276925 274906 273292 272078 271097 270370 270009
53093B70009j71m02q59j181j308j429j600j650j421r85o20o27j056j640k007j942
$$ 270009 269838 269436 268577 267396 266088 264659 263059 261409 259988 259003 258383 257756 256700 255060 253053 251111
53077B51111j415n25M04Q62O17P6j03K73Q85J423J737J549N79q45j902k208k205
$$ 251111 249696 249171 249575 250437 251054 251130 251027 251300 252185 253608 255345 256894 257473 256628 254726 252518 250313
53060B50313k364k435j957j060k67K88Q37J308J316Q44M05L93O57Q67R82J150
$$ 250313 247949 245514 243557 242497 242230 242518 243355 244663 245979 246823 247228 247621 248278 249145 250127 251277
53044B51277J361J465J298P13k58j177j405q07p8J0n00r21r44r78j371j718j399
$$ 251277 252638 254103 255401 256114 255856 254679 253274 252467 252389 252399 251899 250978 250034 249056 247685 245967 244568
53027B44568n50L5k5j94J91R78J426J182O55M19N70P67O18L8o67r42m78L57Q57
$$ 244568 244018 244053 244028 243834 244025 245003 246429 247611 248266 248685 249255 250022 250640 250678 250011 249069 248591 248948 249805
53008B49805Q02O59Q57J155J031M54j11l36k64k2L42O17M42k20q65r51m79J33
$$ 249805 250607 251266 252123 253278 254309 254763 254652 254316 254052 254030 254372 254989 255431 255211 254346 253395 252916 253049
52990B53049N83Q88J076J026P03M10N44J141J850K361K751L202L567L409K524
$$ 253049 253632 254520 255596 256622 257325 257735 258279 259420 261270 263631 266382 269584 273151 276560 279084
52975B79084J224P3n20m47Q4N83N67N5m09m46l66o81j213j212l93N75Q73N01J06
$$ 279084 280308 280381 279861 279414 279498 280081 280648 280703 280294 279848 279482 278801 277588 276376 275983 276558 277431 277932 278038
52956B78038Kj57p35j470j775j483j033q98j003r25n71l62o93j362j750j474p05
$$ 278038 278040 277883 277148 275678 273903 272420 271387 270489 269486 268561 267990 267628 266935 265573 263823 262349 261644
52939B61644Q2M54K88j01j72K87P84P07K07N3N29R86P93J77k55m34o08n56J17
$$ 261644 261726 262180 262468 262367 262195 262482 263266 263973 264180 264233 264762 265748 266541 266718 266463 266029 265421 264865 264982
52920B64982J034J245N93rL3Q7n63j382j299m02J47k29q49r88q15p21n12P8O05
$$ 264982 266016 267261 267854 267845 267878 267965 267402 266020 264721 264319 264466 264237 263388 262400 261585 260864 260352 260430 261035
52901B61035M08l98j082j267j055m13P90K006K177J068j92l87L67J036J152J153
$$ 261035 261443 261045 259963 258696 257641 257228 258018 260024 262201 263269 263077 262690 263057 264093 265245 266398
52885B66398J378J472J016K44l03m74n05m83k26K99P91J036J201J564K024K246
$$ 266398 267776 269248 270264 270508 270205 269731 269226 268743 268517 268816 269607 270643 271844 273408 275432 277678
52869B77678K167K146K462K924L109K841K263J577R50N84N72O20K18q13k101l138
$$ 277678 279845 281991 284453 287377 290486 293327 295590 297167 298117 298701 299273 299893 300111 299298 297197 294059
52853B94059l744m041m133m000l657l186k664k133j665j372j383j787k489l084
$$ 294059 290315 286274 282141 278141 274484 271298 268634 266501 264836 263464 262081 260294 257805 254721
52839B54721l020k142r94m49q58j672j958j296j47P33J103J294J539J586J200
$$ 254721 251701 249559 248565 248116 247258 245586 243628 242332 242185 242918 244021 245315 246854 248440 249640
52824B49640O49L09l4r07k167k916k541j410k88M63Q84J005R16Q97J122J416J618
$$ 249640 250289 250598 250564 249657 247490 244574 242033 240623 240335 240798 241682 242687 243603 244500 245622 247038 248656
52807B48656J864K162K054J143k77j550k387k810k769k383k230k588k710j698
$$ 248656 250520 252682 254736 255879 255602 254052 251665 248855 246086 243703 241473 238885 236175 234477
52793B34477k6P96J91q21j142q21l91N7N42P31N92P48J423J650N54j113j733r73
$$ 234477 234451 235247 235438 234617 233475 232654 232263 232320 232862 233593 234185 234933 236356 238006 238560 237447 235714 234741
52775B34741pL34N18J118J681J457N77j19j57J80L57J13m03p52o23k52k25o97
$$ 234741 234734 235068 235586 236704 238385 239842 240419 240300 240143 240323 240680 240793 240390 239638 239015 238763 238538 237841
52757B37841j128j031o22l73j50N61J626K161J688R11P99J252J303O41J68P10
$$ 237841 236713 235682 235060 234687 234537 235098 236724 238885 240573 241484 242283 243535 244838 245479 245647 246357
52741B46357J811K347K014J499J336J293J027O74M60L00R6P9M15P96P98M24j5
$$ 246357 248168 250515 252529 254028 255364 256657 257684 258358 258818 259118 259214 259293 259708 260504 261302 261726 261711
52724B61711l08m39m93p27j353k004j952j142n08p17j206j182r03j057j323p92
$$ 261711 261403 260964 260471 259744 258391 256387 254435 253293 252785 252068 250862 249680 248777 247720 246397 245605
52708B45605L36Q46L95M9N02J029Q11L09L54P55P87M99N17Q51R06N06R9n9j54
$$ 245605 245941 246787 247182 247231 247733 248762 249573 249882 250236 250991 251778 252277 252794 253645 254551 255057 255156 255097 254943
52689B54943k89k72o8J38L12N82Q40Q83Q58J074J302R28n9q36p58j47K73L14K99
$$ 254943 254654 254382 254314 254452 254764 255346 256186 257069 257927 259001 260303 261231 261172 260336 259578 259431 259704 260018 260317
52670B60317L61K76q2m26l54J89P84R16N14L8oM22R92J487J954K457K930L239
$$ 260317 260678 260954 260872 260446 260092 260281 261065 261981 262495 262533 262527 262949 263941 265428 267382 269839 272769 276008
52652B76008L203K613J488K76n32r65j449k040k237j696q22l14m14p48q71o44
$$ 276008 279211 281824 283312 283588 283056 282091 280642 278602 276365 274669 273847 273533 273119 272371 271500 270856
52636B70856k27J05K05K13M14Q91J438J892K313K692K738K226J377N89r4q91j719
$$ 270856 270629 270734 270939 271152 271566 272457 273895 275787 278100 280792 283530 285756 287133 287722 287628 286737 285018
52619B85018k114j817j125m88jM20O43M20r6l45k0N38Q07P27O06N69M35J70O5
$$ 285018 282904 281087 279962 279474 279473 279893 280536 280956 280860 280515 280495 281033 281840 282567 283173 283742 284177 284347 284412
52600B84412K87N75N77K75j23m71o17k89N75J462J690J155L96j17l47l38L2O99
$$ 284412 284699 285274 285851 286126 286003 285532 284915 284626 285201 286663 288353 289508 289904 289787 289440 289102 289134 289833
52582B89833J215J266J180J516K260K734K369J332L00k01j88n6j34l97n68n02
$$ 289833 291048 292314 293494 295010 297270 300004 302373 303705 304005 303804 303616 303560 303426 303029 302461 301959
52566C01959l64m00n98p05n85l68k82m05o98j160j798k409k576k036j039j63J90
$$ 301959 301595 301195 300597 299892 299307 298939 298657 298252 297554 296394 294596 292187 289611 287575 286536 286373 286563
52549B86563M9l66q57j142q90r6O98R23O26L39L18K95L7k10p0M01P38O32K68J49
$$ 286563 286612 286246 285389 284247 283357 283261 283959 284882 285508 285847 286165 286460 286497 286287 286217 286618 287356 287988 288256 288405
52529B88405N57J176J364R36N28Q62J669J902J081K3j86M86J151J261J168J417
$$ 288405 288962 290138 291502 292438 292966 293828 295497 297399 298480 298503 298317 298803 299954 301215 302383 303800
52513C03800J990K417K397K096J951K275K973L538L432K436P38j203k808l633
$$ 303800 305790 308207 310604 312700 314651 316926 319899 323437 326869 329305 330043 328840 326032 322399
52499C22399l730l602l648l734l511k932k140j081K29J185J001k17j331j435p88
$$ 322399 318669 315067 311419 307685 304174 301242 299102 298021 298250 299435 300436 300219 298888 297453 296665
52484B96665j98L0J12J14m8k01o6J91J54j35j56K73P28Q43Q05R03J087J264J598
$$ 296665 296467 296497 296609 296723 296675 296474 296408 296599 296753 296618 296462 296735 297463 298306 299111 300014 301101 302365 303963
52465C03963K169K672K865K986L285L425K897J873J006N15K1o79j344j895k628
$$ 303963 306132 308804 311669 314655 317940 321365 324262 326135 327141 327656 327677 326998 325654 323759 321131
52450C21131l534l967l430k377j709j713j882j670j089o04o46j174j648j578j124
$$ 321131 317597 313630 310200 307823 306114 304401 302519 300849 299760 299156 298510 297336 295688 294110 292986
52435B92986q58q88o68N3O74N54l5k93L7N92J027J182Q41N4m66k0R78J351P31
$$ 292986 292128 291240 290572 290625 291299 291853 291818 291525 291562 292154 293181 294363 295204 295258 294792 294772 295750 297101 297832
52416B97832OJ8N58J036J431J998K630L149L867N246P115Q797R864J0293J0001
$$ 297832 297838 297856 298414 299450 300881 302879 305509 308658 312525 317771 324886 333683 343547 353840 363841
52401C63841Q795O846M785L098J660lk091m321o206p401p733p010n240l067j632
$$ 363841 372636 379482 384267 387365 389025 389022 386931 382610 376404 369003 361270 354260 349020 345953 344321
52386C44321j508j990j931j180n45l55J3R64J878K048J785J917K620L462M288
$$ 344321 342813 340823 338892 337712 337167 336812 336825 337789 339667 341715 343500 345417 348037 351499 355787
52371C55787N240O035O008N020L759K952K662K442J948J231N87J73k63r99j690
$$ 355787 361027 367062 373070 378090 381849 384801 387463 389905 391853 393084 393671 393844 393581 392582 390892
52356C90892j554m92N49Q06P40J201J950J979J105K88K77Q44J545K438L611M670
$$ 390892 389338 388846 389395 390201 390941 392142 394092 396071 397176 397464 397741 398585 400130 402568 406179 410849
52340D10849N138N006M609M322M499N371O670P783Q409Q821R358J0123J1270J2990
$$ 410849 415987 420993 425602 429924 434423 439794 446464 454247 462656 471477 480835 490958 502228 515218
52326E15218J5024J6690J7721J8547J9536K0427K0889K1156K1609K2164K2530
$$ 515218 530242 546932 564653 583200 602736 623163 644052 665208 686817 708981 731511
52315G31511K2755K3062K3398K3556K3525K3409K3227K3080K3214K3586K3726
$$ 731511 754266 777328 800726 824282 847807 871216 894443 917523 940737 964323 988049
52304I88049K3386K2956K2779K2480K1489J9984J8581J7277J5391J2561R226O024
$$ 988049 1011435 1034391 1057170 1079650 1101139 1121123 1139704 1156981 1172372 1184933 1194159 1200183
52292A200183L159N11j996m307o347q105r738j1356j2590j2677j1446r920r314
$$ 1200183 1203342 1203853 1201857 1197550 1191203 1183098 1173360 1162004 1149414 1136737 1125291 1115371 1106057
52279A106057r551r370p929n651l430j591P6J831L809O036Q225R901J0934J1737
$$ 1106057 1096506 1087136 1079207 1073556 1070126 1068535 1068611 1070442 1074251 1080287 1088512 1098413 1109347 1121084
52265A121084J2726J3856J4947J6074J7276J8178J8361J8059J8002J8520J9192
$$ 1121084 1133810 1147666 1162613 1178687 1195963 1214141 1232502 1250561 1268563 1287083 1306275
52254A306275J9489J9407J9220J8831J7720J5516J2360Q636M612N61l050n854
$$ 1306275 1325764 1345171 1364391 1383222 1400942 1416458 1428818 1437454 1442066 1442627 1439577 1433723
52242A433723q057j0258j2676j4852j6281j7063j7709j8504j9347k0039k0428
$$ 1433723 1425666 1415408 1402732 1387880 1371599 1354536 1336827 1318323 1298976 1278937 1258509
52231A258509k0357j9803j9069j8534j8193j7651j6641j5309j3952j2656j1267
$$ 1258509 1238152 1218349 1199280 1180746 1162553 1144902 1128261 1112952 1099000 1086344 1075077
52220A075077r710q205p154o645o142m892k776n55Q71J255J010P49J040K187L812
$$ 1075077 1065367 1057162 1050008 1043363 1037221 1032329 1029553 1028998 1029869 1031124 1032134 1032883 1033923 1036110 1039922
52205A039922M897M768L846L019K545K191K150L000M615O005O521O565O795P236
$$ 1039922 1044819 1049587 1053433 1056452 1058997 1061188 1063338 1066338 1070953 1076958 1083479 1090044 1096839 1104075
52191A104075P610P932Q128P567N758L348J625R66L65j241l694o009p632q763
$$ 1104075 1111685 1119617 1127745 1135312 1141070 1144418 1146043 1147009 1147374 1146133 1142439 1136430 1128798 1120035
52177A120035r598r877r450q827q625q620q009o617n223m459l994l243k273j319
$$ 1120035 1110437 1100560 1091110 1082283 1073658 1065038 1057029 1050412 1045189 1040730 1036736 1033493 1031220 1029901
52163A029901L1K252M739O275O550O248N625M235K270R47Q70J103P02K23O51J614
$$ 1029901 1029932 1032184 1036923 1043198 1049748 1055996 1061621 1065856 1068126 1069073 1069943 1071046 1071748 1071971 1072622 1074236
52147A074236J944J537J360J734J941J682J741K738M076M692M294L427K824L059
$$ 1074236 1076180 1077717 1079077 1080811 1082752 1084434 1086175 1088913 1092989 1097681 1101975 1105402 1108226 1111285
52133A111285M366O408Q439J0007J1396J3164J5535J8226K0737K2714K4360K6440
$$ 1111285 1115651 1122059 1130498 1140505 1151901 1165065 1180600 1198826 1219563 1242277 1266637 1293077
52121A293077K9436L2770L5235L6304L6432L6072L5078L3398L1597L0143K8636
$$ 1293077 1322513 1355283 1390518 1426822 1463254 1499326 1534404 1567802 1599399 1629542 1658178
52110A658178K6388K3478K0668J8423J6556J4800J3193J1837J0585R118P205M897
$$ 1658178 1684566 1708044 1728712 1747135 1763691 1778491 1791684 1803521 1814106 1823224 1830429 1835326
52098A835326K559N86j131l237o212r791j3357j6658j9798k2651k4789k6018k6598
$$ 1835326 1837885 1838471 1837340 1834103 1827891 1818100 1804743 1788085 1768287 1745636 1720847 1694829 1668231
52085A668231k6777k6452k5432k3807k1853j9738j7430j4843j1963q921n995l426
$$ 1668231 1641454 1615002 1589570 1565763 1543910 1524172 1506742 1491899 1479936 1471015 1465020 1461594
52073A461594j187J007L427O052Q585J0726J2503J4333J6575J8941K0560K0871
$$ 1461594 1460407 1461414 1464841 1470893 1479478 1490204 1502707 1517040 1533615 1552556 1573116 1593987
52061A593987K0245J9544J9207J9120J9176J9418J9519J8744J6743J4076J1591
$$ 1593987 1614232 1633776 1652983 1672103 1691279 1710697 1730216 1748960 1765703 1779779 1791370
52050A791370R395O860L490n05m541q228j1526j4551j7438k0283k3003k5239k6526
$$ 1791370 1800765 1807625 1811115 1810610 1806069 1797841 1786315 1771764 1754326 1734043 1711040 1685801 1659275
52037A659275k6746k6428k6392k6895k7252k6551k4776k2940k1960k1708k1397
$$ 1659275 1632529 1606101 1579709 1552814 1525562 1499011 1474235 1451295 1429335 1407627 1386230
52026A386230k0703j9995j9532j8986j7991j6834j6123j5917j5652j4930j4006
$$ 1386230 1365527 1345532 1326000 1307014 1289023 1272189 1256066 1240149 1224497 1209567 1195561
52015A195561j3321j2903j2508j2165j2093j2209j2095j1611j1235j1530j2523
$$ 1195561 1182240 1169337 1156829 1144664 1132571 1120362 1108267 1096656 1085421 1073891 1061368
52004A061368j3772j4861j5605j5985j6191j6558j7097j7171j6095j4069j2149
$$ 1061368 1047596 1032735 1017130 1001145 984954 968396 951299 934128 918033 903964 891815
51993H91815j1110j0766j0555j0363j0483j1008j1810j2907j4417j6141j7485
$$ 891815 880705 869939 859384 849021 838538 827530 815720 802813 788396 772255 754770
51982G54770j7899j7274j6002j4829j4434j4798j5083j4491j3182j1904j0816
$$ 754770 736871 719597 703595 688766 674332 659534 644451 629960 616778 604874 594058
51971E94058r310p061m639k662r23J112L312N065O261P391Q523Q876P711N309
$$ 594058 584748 577687 573048 570386 569463 570575 573887 578952 585213 592604 601127 610003 617714 623023
51957F23023K681N21j178k654l936m982n863o507o428n084k614J03K294M045N928
$$ 623023 625704 626225 625047 622393 618457 613475 607612 601105 594677 589593 586979 587082 589376 593421 599349
51942E99349Q145J0510J3110J6356K0241K4078K7298K9960L2001L2504L0416K5755
$$ 599349 607494 618004 631114 647470 667711 691789 719087 749047 781048 813552 843968 869723
51930H69723J9480J2288M276m259j2393j9281k4683k8615l0973l1826l1615l0752
$$ 869723 889203 901491 905767 901508 889115 869834 845151 816536 785563 753737 722122 691370
51918F91370k9359k7545k5509k3216k0492j7611j5232j3356j1043p749m321j892
$$ 691370 662011 634466 608957 585741 565249 547638 532406 519050 508007 500258 495937 494045
51906D94045k78J557L703N085N127M538M133L664K494P45q84k147l471n234p229
$$ 494045 493767 495324 499027 504112 509239 513777 517910 521574 524068 524813 523929 521782 518311 513077 505848
51891E05848q880r689r563q932q450q352q106o931m677k049J35J727L200M917
$$ 505848 496968 487279 477716 468784 460334 451982 443876 436945 432268 430219 430354 432081 435281 440198
51877D40198O583P616P879P785P639P235O362N362M743M340L392J536o49k285
$$ 440198 446781 454397 462276 470061 477700 484935 491297 496659 501402 505742 509134 510670 510021 507736
51863E07736l067l298l352l230k579j121Q29K398K959K829K749K831K529J684
$$ 507736 504669 501371 498019 494789 492210 491089 491918 494316 497275 500104 502853 505684 508213 509897
51849E09897P95M2j219l427n784p037p033o804p167p832q008p374o199m881l600
$$ 509897 510692 510734 509515 506088 500304 493267 486234 479430 472263 464431 456423 449049 442850 437969 434369
51834D34369k390j330n89k41p8J79M61M24J2m30p47j265k152k904k939k411j871
$$ 434369 431979 430649 430060 429819 429741 429920 430381 430805 430817 430387 429640 428375 426223 423319 420380 417969 416098
51817D16098j383o65M6P0o81j396j332n62M15J270J738J472M75o12j067p69j05
$$ 416098 414715 414050 414096 414166 413485 412089 410757 410195 410610 411880 413618 415090 415565 414953 413886 413117 413012
51800D13012N98J139J273Q38J47k33r4J77Q4m97j332k110k556k411j558k66Q24
$$ 413012 413610 414749 416022 416860 417007 416774 416680 416857 416941 416444 415112 413002 410446 408035 406477 406211 407035
51783D07035J207R50N13J48k69p22q02k65N06J022J486K597M586O861Q650R540
$$ 407035 408242 409192 409705 409853 409584 408862 408060 407795 408301 409323 410809 413406 417992 424853 433503 443043
51767D43043R482Q753P957P566P270O287M421K312M40j451l623n672p099q082
$$ 443043 452525 461278 469235 476801 484071 490358 494779 497091 497531 496080 492457 486785 479686 471604
51753D71604r036r740r614q695p698p072o582n864m925l977l092k170j059L26
$$ 471604 462568 452828 443214 434519 426821 419749 413167 407303 402378 398401 395309 393139 392080 392406
51739C92406J819L065L891M497N013N138M628L911L634L723L479K652J853J710
$$ 392406 394225 397290 401181 405678 410691 415829 420457 424368 428002 431725 435204 437856 439709 441419
51725D41419K117K531K579K200J498P51K17k22r74k081l052l508l654l784l726
$$ 441419 443536 446067 448646 450846 452344 453095 453312 453090 452116 450035 446983 443475 439821 436037 432311
51710D32311l195k397j833j573j190m23M85J168J554J814K016J995J483M24p91
$$ 432311 429116 426719 424886 423313 422123 421700 422185 423353 424907 426721 428737 430732 432215 432639 431848
51695D31848j471j184k10O73Q82N15J23K2j76j173k993m632n028m329l687l724
$$ 431848 430377 429193 428983 429656 430538 431053 431176 431198 431022 429849 426856 422224 417196 412867 409180 405456
51679D05456l811l161k025j202p24J42J615K919L306L046L018L693M841O062P118
$$ 405456 401645 398484 396459 395257 394533 394675 396290 399209 402515 405561 408579 412272 417113 423175 430293
51664D30293P855Q105P774O907N611L989K136J59j793l480m546m610l383r10K143
$$ 430293 438148 446253 454027 460934 466545 470534 472670 472829 471036 467556 463010 458400 455017 454107 456250
51649D56250M555N257M150K144K78j108k264l376m286m713m511l739k681j837
$$ 456250 460805 466062 470212 472356 472634 471526 469262 465886 461600 456887 452376 448637 445956 444119
51635D44119j616j978k457k672k605k372j948j388j125j627k735l618l617k928
$$ 444119 442503 440525 438068 435396 432791 430419 428471 427083 425958 424331 421596 417978 414361 411433
51621D11433k347k464l242m133m483l993l096k664l047l582l474k927k803l155
$$ 411433 409086 406622 403380 399247 394764 390771 387675 385011 381964 378382 374908 371981 369178 366023
51607C66023k982j661M4R72R47O22M36N36J344L239N681P615Q801R907J1051J1216
$$ 366023 363041 361380 361424 362396 363343 363965 364401 364937 366281 369520 375201 382816 391617 401524 412575 423791
51591D23791R637O937M226J724q56l156m408m664m780n067m884l735k018k52J707
$$ 423791 433428 440365 444591 446315 445459 442303 437895 433231 428451 423384 418500 414765 412747 412495 414202
51576D14202M144O707Q757J0229J1510J2603J3105J3053J3153J3916J4951J5492
$$ 414202 418346 425053 433810 444039 455549 468152 481257 494310 507463 521379 536330 551822
51564E51822J5379J5166J5381J6087J7245J9147K2090K5641K8490K9319K7840
$$ 551822 567201 582367 597748 613835 631080 650227 672317 697958 726448 755767 783607
51553G83607K4928K1610J7964J3180O745o02p378j2720j6867k0286k2863k4332
$$ 783607 808535 830145 848109 861289 868034 867432 860054 847334 830467 810181 787318 762986
51541G62986k4992k5293k4868k2876j9437j5938j3439j1530r398p437o812p634
$$ 762986 737994 712701 687833 664957 645520 629582 616143 604613 595215 587778 580966 573332
51529E73332q649q898q840r343j0309j0869j0636j0085r730r492r008q280p729
$$ 573332 564683 555785 546945 537602 527293 516424 505788 495703 485973 476481 467473 459193 451464
51516D51464p605p546o959n737m421l479k773k065j682k087k928l227k633j816
$$ 451464 443859 436313 429354 423617 419196 415717 412944 410879 409197 407110 404182 400955 398322 396506
51502C96506j421j263r34n51m11k71L53J387K216K389J983J414J162J475K012
$$ 396506 395085 393822 392888 392337 391926 391655 392008 393395 395611 398000 399983 401397 402559 404034 406046
51487D06046K052J408Q21R26J259R00j46r68j061q69r00j059j109j255j837k749
$$ 406046 408098 409506 410327 411253 412512 413412 413266 412298 411237 410368 409468 408409 407300 406045 404208 401459
51471D01459l504l731l496l252l505m236m791m531l585k614j991j654j558j706
$$ 401459 397955 394224 390728 387476 383971 379735 374944 370413 366828 364214 362223 360569 359011 357305
51457C57305j742j163o9Q06J014Q37P56R80J591K643L903N033O141P570R081R959
$$ 357305 355563 354400 354331 355137 356151 356988 357744 358724 360315 362958 366861 371894 378035 385605 394686 404645
51441D04645J0153J0470J1297J1863J1305R816Q140O591N121L759K336L58k156
$$ 404645 414798 425268 436565 448428 459733 469549 477689 484280 489401 493160 495496 495854 493698
51428D93698m274n327n869o673p400p280o633o474o862o941o456o000n661m763
$$ 493698 489424 484097 478228 471555 464155 456875 450242 443768 436906 429965 423509 417509 411848 407085
51414D07085l242k082j834j763j124l79l52q54r98l84O60J756K638K990K681K126
$$ 407085 403843 401761 399927 398164 397040 396661 396309 395455 394457 394073 394733 396489 399127 402117 404798 406924
51398D06924J894K103K486K903L389L852M159M467N151O299P585Q684R731J1218
$$ 406924 408818 410921 413407 416310 419699 423551 427710 432177 437328 443627 451212 459896 469627 480845
51384D80845J3428J6052J8638K1378K5077K9967L5070L9252M2514M5385M7286
$$ 480845 494273 510325 528963 550341 575418 605385 640455 679707 722221 767606 814892
51373H14892M6678M2999L7419L1200K4272J6021O676k902j2236k1169k9141l5304
$$ 814892 861570 904569 941988 973188 997460 1013481 1020157 1017255 1005019 983850 954709 919405
51361I19405l9270m1246m1634m0962l9874l8662l6979l4499l1537k8578k5565
$$ 919405 880135 838889 797255 756293 716419 677757 640778 606279 574742 546164 520599
51350E20599k2240j8809j5684j2859j0178p957o584n793n061m510m562m801m197
$$ 520599 498359 479550 463866 451007 440829 432872 426288 420495 415434 410924 406362 401561 397364
51337C97364k563r20j27N2K16L34J6p08j379j624j458j174j140j462j845k003
$$ 397364 394801 393881 393754 393806 394022 394356 394372 393664 392285 390661 389203 388029 386889 385427 383582 381579
51321C81579k074k297k423j997j160n45l52j67K16M96N68Q03J336J733J742J705
$$ 381579 379505 377208 374785 372788 371628 371083 370731 370564 370780 371276 371844 372647 373983 375716 377458 379163
51305C79163J751J374L27o84r71r79j565k483k613j647o20m63q59q70k20N51R07
$$ 379163 380914 382288 382615 381931 380960 379981 378416 375933 373320 371673 371053 370590 369731 368861 368641 369192 370099
51288C70099Q36P04Q33J292J922K532L073L568L966M160M197M321M660M928M570
$$ 370099 370935 371639 372472 373764 375686 378218 381291 384859 388825 392985 397182 401503 406163 411091 415661
51273D15661L344J831J089J568K441K440J311J06j60L90R49J131J016N38m87j747
$$ 415661 419005 420836 421925 423493 425934 428374 429685 429791 429631 430021 430970 432101 433117 433655 433168 431421
51257D31421k610k993l472m248m663m189l393l254l758l898l125k077j604j609
$$ 431421 428811 425818 422346 418098 413435 409246 405853 402599 398841 394943 391818 389741 388137 386528
51243C86528j396q45o01j077j756j790r63J64R47J221J264J436J824K168K128
$$ 386528 385132 384287 383686 382609 380853 379063 378100 378264 379211 380432 381696 383132 384956 387124 389252
51228C89252J663J070N67K8p33j562k083k160k030j906j688j071J0J100J479Q90
$$ 389252 390915 391985 392552 392580 391847 390285 388202 386042 384012 382106 380418 379347 379357 380457 381936 382826
51212C82826j7k77K93R68J216J466K295L373L896L768L633L766L762L420L161
$$ 382826 382809 382532 382825 383793 385009 386475 388770 392143 396039 399807 403440 407206 410968 414388 417549
51197D17549L233L230K726J890J068K84m63q88r63j268k205l202l346k657k011
$$ 417549 420782 424012 426738 428628 429696 429980 429517 428629 427666 426398 424193 420991 417645 414988 412977
51182D12977j901j924j588j002m53J41J065K241L175L403K871J942J060M46M5
$$ 412977 411076 409152 407564 406562 406109 406250 407315 409556 412731 416134 419005 420947 422007 422453 422498
51167D22498k81o16j032j498j665j061K55J487J897J646J479J657J628Q19n74
$$ 422498 422217 421601 420569 419071 417406 416345 416600 418087 419984 421630 423109 424766 426394 427213 426639
51152D26639j727j993j471q89r11j453j826j560r43n35l92j31L56P27P49O79Q61
$$ 426639 424912 422919 421448 420559 419648 418195 416369 414809 413866 413331 412939 412808 413164 413891 414640 415319 416180
51135D16180J238J444J287R57P73P81P06L79J20M82J487K393K441J649P15K59
$$ 416180 417418 418862 420149 421106 421879 422660 423366 423745 423865 424347 425834 428227 430668 432317 433032 433291
51119D33291M38J067J738K024J885J815K184K575K267J309N69N69Q61Q12N16N26
$$ 433291 433729 434796 436534 438558 440443 442258 444442 447017 449284 450593 451162 451731 452592 453404 453920 454446
51103D54446J011J624K034K242K360K474K643K823K753K149J141L13J79O37J068
$$ 454446 455457 457081 459115 461357 463717 466191 468834 471657 474410 476559 477700 478013 478192 478829 479897
51088D79897R90N23J60J66L10K17k19q03j247j337j063p37p78j120j097k02J136
$$ 479897 480887 481410 481570 481736 482046 482263 482044 481241 479994 478657 477594 476857 476079 474959 473862 473660 474796
51071D74796J947J851J418J365J814K457L151M109N650P986J1002J4127J6527
$$ 474796 476743 478594 480012 481377 483191 485648 488799 492908 498558 506544 517546 531673 548200
51058E48200J7700J7820J7432J6842J5887J4273J2136J0194R190R049Q836P854
$$ 548200 565900 583720 601152 617994 633881 648154 660290 670484 679674 688723 697559 705413
51046G05413O555N860N640M569J842j554l886m618m700n019n384n322n185n755
$$ 705413 711968 717828 723468 728037 729879 728325 724439 719821 715121 710102 704718 699396 694211 688456
51032F88456p010q006q223q391r566j1627j3241j3312j1987j0197q585p096n307
$$ 688456 681446 673440 665217 656826 647260 635633 622392 609080 597093 586896 578311 571215 565908
51019E65908k940j85K343M201N720P619R897J1655J2270J2204J2127J1840J0800
$$ 565908 562968 562783 565126 569327 575047 582666 592563 604218 616488 628692 640819 652659 663459
51006F63459R319Q260P638O581M770L024K072J572Q86R9l26m64q30j530k077j940
$$ 663459 672778 681038 688676 695257 700027 703051 705123 706695 707581 707680 707354 706890 706060 704530 702453 700513
50990G00513j012M02J857L165M690O953R854J2707J5174J7616K0163K2101K2844
$$ 700513 699501 699903 701760 704925 709615 716568 726422 739129 754303 771919 792082 814183 837027
50977H37027K2912K3221K3750K3866K3827K4907K7778L1690L5686L9871M4875
$$ 837027 859939 883160 906910 930776 954603 979510 1007288 1038978 1074664 1114535 1159410
50966A159410N0608N6334O1778O7397P3420P9252Q4046Q7478Q9652R0537Q9920
$$ 1159410 1210018 1266352 1328130 1395527 1468947 1548199 1632245 1719723 1809375 1899912 1989832
50955A989832Q7764Q4170P8985P1986O3501N4383M5058L5109K4342J3852N245
$$ 1989832 2077596 2161766 2240751 2312737 2376238 2430621 2475679 2510788 2535130 2548982 2554227
50944B554227j133o355j1314j5732j9076k1583k3777k5564k6571k7009k7525k8351
$$ 2554227 2553094 2546739 2535425 2519693 2500617 2479034 2455257 2429693 2403122 2376113 2348588 2320237
50932B320237k9272l0301l1724l3467l5066l6397l7938m0144m2980m6195m9628
$$ 2320237 2290965 2260664 2228940 2195473 2160407 2124010 2086072 2045928 2002948 1956753 1907125
50921A907125n3026n5871n7731n8601n8774n8403n7325n5264n2196m8586m5121
$$ 1907125 1854099 1798228 1740497 1681896 1623122 1564719 1507394 1452130 1399934 1351348 1306227
50910A306227m2052l8982l5544l2074k9185k6874k4540k1947j9544j7731j6295
$$ 1306227 1264175 1225193 1189649 1157575 1128390 1101516 1076976 1055029 1035485 1017754 1001459
50899A001459j4905j3666j2797j2105j1204j0000q582o846m775k921k016k004
$$ 1001459 986554 972888 960091 947986 936782 926782 918200 911354 906579 903658 901642 899638
50887H99638j981j299k49N87J217K034L074M045M984O243P763R004R804J0719
$$ 899638 897657 896358 896109 896696 897913 899947 903021 907066 912050 918293 926056 935060 944864 955583
50873I55583J2134J3629J4765J5998J7937K0051K1193K1416K2255K4694K7844
$$ 955583 967717 981346 996111 1012109 1030046 1050097 1071290 1092706 1114961 1139655 1167499
50862A167499L0314L2196L4782L8695M3273M7785N2487N8248O5681P4786Q5120
$$ 1167499 1197813 1230009 1264791 1303486 1346759 1394544 1447031 1505279 1570960 1645746 1730866
50851A730866R6124J07468J19173J31273J43517J55591J67377J78676J88877J97307
$$ 1730866 1826990 1934458 2053631 2184904 2328421 2484012 2651389 2830065 3018942 3216249
50841C216249K03626K07456K07820K03596J94481J80965J63374J41641J16179
$$ 3216249 3419875 3627331 3835151 4038747 4233228 4414193 4577567 4719208 4835387
50832D835387Q8293N9512L0898L308k2188m4475o2692p6203q4552q7775q6526
$$ 4835387 4923680 4983192 5014090 5017398 4995210 4950735 4888043 4811840 4727288 4639513 4552987
50821D552987q1834p4915o7148n9686n3030m7437m3841m3679m7501n4368o2984
$$ 4552987 4471153 4396238 4329090 4269404 4216374 4168937 4125096 4081417 4033916 3979548 3916564
50810C916564p2917q4212r6399j08485j19651j29332j36884j41795j44168j44493
$$ 3916564 3843647 3759435 3663036 3554551 3434900 3305568 3168684 3026889 2882721 2738228
50800B738228j42977j39455j33868j26444j17537j07619r7374q7364p7679o8186
$$ 2738228 2595251 2455796 2321928 2195484 2077947 1970328 1872954 1785590 1707911 1639725
50790A639725n9012n0491m2840l6195l0716k6157k1693j6779j2089q886p499p101
$$ 1639725 1580713 1530222 1487382 1451187 1420471 1394314 1372621 1355842 1343753 1334867 1327368 1320267
50778A320267o919o881o918o591n900n708o610p952q697q926r594j0923j1929
$$ 1320267 1313348 1306467 1299549 1292958 1287058 1281350 1274740 1266788 1258091 1249165 1239571 1228648 1216719
50765A216719j1852j1279j1372j2333j3262j3386j2897j2402j1953j1012r223
$$ 1216719 1204867 1193588 1182216 1169883 1156621 1143235 1130338 1117936 1105983 1094971 1085748
50754A085748o875m449k059N04L342O325R296J2251J5393J9124K3773K9007L3782
$$ 1085748 1078873 1074424 1072365 1072869 1076211 1082536 1091832 1104083 1119476 1138600 1162373 1191380 1225162
50741A225162L7363M0413M4428M9985N6066O1436O6136P1191P7115Q3343Q8925
$$ 1225162 1262525 1302938 1347366 1397351 1453417 1514853 1580989 1652180 1729295 1812638 1901563
50730A901563R3320R6560R9083J01412J03641J05266J05679J04701J02218R7614
$$ 1901563 1994883 2091443 2190526 2291938 2395579 2500845 2606524 2711225 2813443 2911057
50720B911057R0180Q0035O7947N4157L8145J9899P28j7656l4329m8853o0398o8029
$$ 2911057 3001237 3081272 3149219 3203376 3241521 3261420 3262148 3244492 3210163 3161310 3100912 3032883
50708C032883p1732p2380p0607o6318n9480n0833m1631l3002k5729k0270j6855
$$ 3032883 2961151 2888771 2818164 2751846 2692366 2641533 2599902 2566900 2541171 2520901 2504046
50697B504046j5749j7404k2004k8836l6656m4788n3402o2487p1021p7544q1230
$$ 2504046 2488297 2470893 2448889 2420053 2383397 2338609 2285207 2222720 2151699 2074155 1992925
50686A992925q2226q1224p9003p5967p1787o5837n8356n0731m4138l8249l1932
$$ 1992925 1910699 1829475 1750472 1674505 1602718 1536881 1478525 1427794 1383656 1345407 1313475
50675A313475k4943j8217j2473p397k398K465O677R953J2315J3760J4273J4065
$$ 1313475 1288532 1270315 1257842 1250445 1248047 1250512 1257189 1267142 1279457 1293217 1307490 1321555
50663A321555J3450J2579J1561J0833J1036J2328J3978J4937J4952J4898J5760
$$ 1321555 1335005 1347584 1359145 1369978 1381014 1393342 1407320 1422257 1437209 1452107 1467867
50652A467867J7488J9233K0605K2149K4386K7046K9608L2160L5082L8286M1443
$$ 1467867 1485355 1504588 1525193 1547342 1571728 1598774 1628382 1660542 1695624 1733910 1775353
50641A775353M4649M8079N1124N2826N3220N3423N4083N4560N3979N2403N0453
$$ 1775353 1820002 1868081 1919205 1972031 2025251 2078674 2132757 2187317 2241296 2293699 2344152
50630B344152M8506M6882M6230M6764M7238M5496M0242L1962K2138J2038K332
$$ 2344152 2392658 2439540 2485770 2532534 2579772 2625268 2665510 2697472 2719610 2731648 2733980
50619B733980o547j4040j9498k2576k3449k2545k0124j6345j1738p130l023M80
$$ 2733980 2727433 2713393 2693895 2671319 2647870 2625325 2605201 2588856 2577118 2569988 2566965 2567445
50607B567445K965L471J332l192r447j7062k5700l4711m3638n2631o1598o9365
$$ 2567445 2570410 2573881 2575213 2572021 2562574 2545512 2519812 2485101 2441463 2388832 2327234 2257869
50595B257869p4543p7029p7836p7588p6129p3550p0544o7416o3740n9398n5181
$$ 2257869 2183326 2106297 2028461 1950873 1874744 1801194 1730650 1663234 1599494 1540096 1484915
50584A484915n1752m8749m5490m1947l8360l4418k9682k4550j9993j6410j3273
$$ 1484915 1433163 1384414 1338924 1296977 1258617 1224199 1194517 1169967 1149974 1133564 1120291
50573A120291r929o154k132J615M351N807O818Q643J1511J4436J6546J8024J9453
$$ 1120291 1110362 1104208 1102076 1103691 1108042 1113849 1120667 1129310 1140821 1155257 1171803 1189827 1209280
50560A209280K0889K2088K3136K4205K4938K4858K4267K4046K4457K4699K4028
$$ 1209280 1230169 1252257 1275393 1299598 1324536 1349394 1373661 1397707 1422164 1446863 1470891
50549A470891K2775K1845K1578K1559K1454K1448K1868K2835K4428K6897L0388
$$ 1470891 1493666 1515511 1537089 1558648 1580102 1601550 1623418 1646253 1670681 1697578 1727966
50538A727966L4689L9427M4407M9639N5084O0626O6163P1548P6543Q1156Q6034
$$ 1727966 1762655 1802082 1846489 1896128 1951212 2011838 2078001 2149549 2226092 2307248 2393282
50527B393282R2091R9523J07364J14350J20028J24673J28230J29868J28818J25170
$$ 2393282 2485373 2584896 2692260 2806610 2926638 3051311 3179541 3309409 3438227 3563397
50517C563397J19430J11533J00818Q6969P0560N2546L3658J4375m938k4127m3078
$$ 3563397 3682827 3794360 3895178 3982147 4052707 4105253 4138911 4153286 4148348 4124221 4081143
50506D081143o1048p6521q8093r5416r8933r8914r5259q8054p7736o4721m9339
$$ 4081143 4020095 3943574 3855481 3760065 3661132 3562218 3466959 3378905 3301169 3236448 3187109
50495C187109l2270j4652K255J7297K9423L7958M2777M3657L9613K9607J4146
$$ 3187109 3154839 3140187 3142442 3159739 3189162 3227120 3269897 3313554 3353167 3382774 3396920
50484C396920m639k4741m5350o5920q5116j01417j14117j23032j27838j28655
$$ 3396920 3392281 3367540 3322190 3256270 3171154 3069737 2955620 2832588 2704750 2576095
50474B576095j26745j23494j18860j11890j02839r3675q6079p9845p3617o6664
$$ 2576095 2449350 2325856 2206996 2095106 1992267 1898592 1812513 1732668 1659051 1592387
50464A592387n9354n2444m6380m1149l6385l1672k6814k1773j6447j0844n420
$$ 1592387 1533033 1480589 1434209 1393060 1356675 1325003 1298189 1276416 1259969 1249125 1243705
50453A243705p88K976O389R814J3178J6442J9912K3786K7827L1712L5334L8509
$$ 1243705 1242917 1245893 1252282 1262096 1275274 1291716 1311628 1335414 1363241 1394953 1430287 1468796
50441A468796M0738M1561M0791L8225L3516K6761J8947J1392M917k88m233o992
$$ 1468796 1509534 1551095 1591886 1630111 1663627 1690388 1709335 1720727 1725644 1725356 1721123 1714131
50429A714131q822j0056j0868j1307j1418j1179j0405q929o723l790j67L845P818
$$ 1714131 1705309 1695253 1684385 1673078 1661660 1650481 1640076 1631147 1624424 1620634 1620467 1624312 1632130
50416A632130J1738J6156K1495K7541L3783L9919M5719N0737N4645N7633O0020
$$ 1632130 1643868 1660024 1681519 1709060 1742843 1782762 1828481 1879218 1933863 1991496 2051516
50405B051516O1652O2149O1572O0324N8427N5309N0399M3635L5379K6081J5943
$$ 2051516 2113168 2175317 2236889 2297213 2355640 2410949 2461348 2504983 2540362 2566443 2582386
50394B582386M752p772k1191l4144m5367n4666o2430o8471p2023p2806p1350o8150
$$ 2582386 2587138 2579366 2558175 2524031 2478664 2423998 2361568 2293097 2221074 2148268 2076918 2008768
50382B008768o3157n6321m8085l8978k9267j9242r495n56P338J3833J8169J9650
$$ 2008768 1945611 1889290 1841205 1802227 1772960 1753718 1744223 1743667 1751005 1764838 1783007 1802657
50370A802657J8228J4286Q193M22q146j6516k4154l1035l7194m2447m6433m8699
$$ 1802657 1820885 1835171 1843364 1843786 1835640 1819124 1794970 1763935 1726741 1684294 1637861 1589162
50358A589162m8884m7002m3525l9140l4621l0811k8320k6978k6072k5419k5680
$$ 1589162 1540278 1493276 1449751 1410611 1375990 1345179 1316859 1289881 1263809 1238390 1212710
50347A212710k7206k9076k9995k9733k8911k7585k5054k1121j6657j2626r271
$$ 1212710 1185504 1156428 1126433 1096700 1067789 1040204 1015150 994029 977372 964746 955475
50336I55475o511m344k456r2K936N725P337P979Q495R112R450R529R877J0608
$$ 955475 948964 944620 942164 942072 945008 950733 958070 966049 974544 983656 993106 1002635 1012512 1023120
50322A023120J1190J1309J1286J1417J1501J1261J0712R794Q221O063M047K708
$$ 1023120 1034310 1045619 1056905 1068322 1079823 1091084 1101796 1111590 1119811 1125874 1129921 1132629
50310A132629J657K44j287j982j458l63O30J680L311N478P593R362J1231J3845
$$ 1132629 1134286 1134530 1133243 1131261 1129803 1129440 1130070 1131750 1135061 1140539 1148132 1157494 1168725 1182570
50296A182570J7371K1661K6866L3454M1188M8262N1930N0305M3467L2883K0137
$$ 1182570 1199941 1221602 1248468 1281922 1323110 1371372 1423302 1473607 1517074 1549957 1570094
50285A570094O431p143j9515k9890l7810m2894m4855m3837m0510l5774l0502k5475
$$ 1570094 1576525 1569382 1549867 1519977 1482167 1439273 1394418 1350581 1310071 1274297 1243795 1218320
50273A218320k1169j7496j3999j0472p240m726k999j796p90L12J703L266M667
$$ 1218320 1197151 1179655 1165656 1155184 1147944 1143218 1140219 1138423 1137633 1137945 1139648 1142914 1147581
50260A147581N836P167Q982J0989J2605J3744J4804J5886J6493J6243J5511J4974
$$ 1147581 1153417 1160584 1169566 1180555 1193160 1206904 1221708 1237594 1254087 1270330 1285841 1300815
50248A300815J4641J3775J1804Q949N841K819j39k988n493p575r332j0657j1053
$$ 1300815 1315456 1329231 1341035 1349984 1355825 1358644 1358505 1355517 1350024 1342449 1333117 1322460 1311407
50235A311407j0123q112n743l667k379k488m573q451j3024j7118k0424k3276k5760
$$ 1311407 1301284 1293172 1287429 1283762 1281383 1278895 1274322 1265871 1252847 1235729 1215305 1192029 1166269
50222A166269k7446k8048k7894k7477k6841k5677k3866k1592j9038j6371j3991
$$ 1166269 1138823 1110775 1082881 1055404 1028563 1002886 979020 957428 938390 922019 908028
50211I08028j2322j1194r860p956o116n176n041m851m209l637l690m155m419m235
$$ 908028 895706 884512 874652 866696 860580 855404 850363 845512 841303 837666 833976 829821 825402 821167
50197H21167l828l580l859m848o186p075p096o682o372o048n428m981n493o738
$$ 821167 817339 813759 809900 805052 798866 791791 784695 778013 771641 765593 760165 755184 749691 742953
50183G42953p389o645n195m249m088m115l929l711l635l524l161k554j758p71
$$ 742953 735564 728919 723724 719475 715387 711272 707343 703632 699997 696473 693312 690758 689000 688229
50169F88229K16O74K30p55j325q66K22R62Q91M87M78J048J929K997M347N943P587
$$ 688229 688445 689119 689349 688594 687269 686403 686625 687587 688478 688965 689443 690491 692420 695417 699764 705707 713294
50152G13294R282J1177J3136J4718J5755J6660J7915J9552K1338K3150K4976K6647
$$ 713294 722576 733753 746889 761607 777362 794022 811937 831489 852827 875977 900953 927600
50140I27600K7876K8488K8532K8264K8131K8599K9768L1199L2207L2290L1309
$$ 927600 955476 983964 1012496 1040760 1068891 1097490 1127258 1158457 1190664 1222954 1254263
50129A254263K9388K6679K3031J7961J1231L488m017j0449j5852k0540k4475k7434
$$ 1254263 1283651 1310330 1333361 1351322 1362553 1366041 1362024 1351575 1335723 1315183 1290708 1263274
50117A263274k9384l0321l0061k8602k6437k4081k1512j8533j5556j3489j2750
$$ 1263274 1233890 1203569 1173508 1144906 1118469 1094388 1072876 1054343 1038787 1025298 1012548
50106A012548j2796j2762j2245j1381j0432r590r057q980r251r435r117q323p435
$$ 1012548 999752 986990 974745 963364 952932 943342 934285 925305 916054 906619 897502 889179 881744
50093H81744o647n628m066k282r63k55L89J314K151K409K208K033K164K669L605
$$ 881744 875097 869469 865403 863121 862158 861903 862292 863606 865757 868166 870374 872407 874571 877240 880845
50078H80845M769N503N346M690M344M505M682M567M391M307L972L037J771Q37
$$ 880845 885614 891117 896463 901153 905497 910002 914684 919251 923642 927949 931921 934958 936729 937566
50064I37566N23L67l64j816l327m112m203m355n018n796o134o059n860n441m543
$$ 937566 938089 938456 938092 936276 932949 928837 924634 920279 915261 909465 903331 897272 891412 885971 881428
50049H81428l402k483j736o12J121L156N170P052Q579R521J0091J0809J1689J2180
$$ 881428 878026 875543 873807 873195 874316 877472 882642 889694 898273 907794 917885 928694 940383 952563
50035I52563J2099J2118J2908J4220J5205J5410J5075J4690J4600J4910J5492
$$ 952563 964662 976780 989688 1003908 1019113 1034523 1049598 1064288 1078888 1093798 1109290
50024A109290J6047J6369J6505J6637J6871J7089J6865J5614J3156J0199P919
$$ 1109290 1125337 1141706 1158211 1174848 1191719 1208808 1225673 1241287 1254443 1264642 1272561
50013A272561O861O462N700M017J466j745n555r875j4375j8494k1785k4242k6112
$$ 1272561 1279422 1285884 1291584 1295601 1297067 1295322 1289767 1279892 1265517 1247023 1225238 1200996 1174884
50000A174884k7363k7645k6864k5478k3847k1738j8970j6135j4048j2651j1305
$$ 1174884 1147521 1119876 1093012 1067534 1043687 1021949 1002979 986844 972796 960145 948840
49989I48840j0055r632j0177j0930j1458j2244j3581j4850j5468j5765j6123j5975
$$ 948840 938785 929153 918976 908046 896588 884344 870763 855913 840445 824680 808557 792582
49977G92582j4647j2664j1242j0690j0221r265q066o985n950m848l862l255l152
$$ 792582 777935 765271 754029 743339 733118 723853 715787 708802 702852 698004 694142 690887 687735
49964F87735l579m299m681m166k976j847j077k58J032K623M015M876N276N646
$$ 687735 684156 679857 675176 671010 668034 666187 665110 664852 665884 668507 672522 677398 682674 688320
49950F88320O440P538Q164P806P017O718O863O501N220L741K885K532J991Q57
$$ 688320 694760 702298 710462 718268 725285 732003 738866 745367 750587 754328 757213 759745 761736 762593
49936G62593q42k907m964o603p773q803r755j0277j0295j0370j0855j1162j0435
$$ 762593 761751 758844 753880 747277 739504 730701 720946 710669 700374 690004 679149 667987 657552
49923F57552q699o720m966l349j849p97l01J0N08J156J769K323K828L175L331
$$ 657552 648853 642133 637167 633818 631969 631172 630871 630881 631389 632545 634314 636637 639465 642640 645971
49908F45971L491L858M457N313O580Q227R774J0625J0690J0381J0078R785R379
$$ 645971 649462 653320 657777 663090 669670 677897 687671 698296 708986 719367 729445 739230 748609
49895G48609Q806P912O358M062J585l64j832l588n980q256r400r410r215r453
$$ 748609 757415 765327 771685 775747 777332 776968 775136 771548 765568 757312 747912 738502 729287 719834
49881G19834r938j0293j0517j0601j0170q984p538o511n854m941l618k491k035
$$ 719834 709896 699603 689086 678485 668315 659331 651793 645282 639428 634487 630869 628378 626343
49868F26343j876j327k66Q87J892K978M390N925P116P793Q362R425J1105J2792
$$ 626343 624467 623140 622874 623761 625653 628631 633021 638946 646062 653855 662217 671642 682747 695539
$$ [...]
##END NTUPLES=NMR SPECTRUM
##END=
