##TITLE=AC1689_PANAH14370_8637644_dT1z0TakX9
##JCAMPDX= 6.0         $$ Bruker NMR JCAMP-DX V2.0
##DATA TYPE= NMR SPECTRUM
##DATA CLASS= NTUPLES
##ORIGIN= BRUKER
##OWNER= Administrator
$$ 1.72 TOPSPIN		Version 2.1
$$ 2014-05-30 19:03:23.321 -0700  Administrator@X
$$ Compression mode = diff/dup
##.OBSERVE FREQUENCY= 400.02188249412
##.OBSERVE NUCLEUS= ^1H
##.ACQUISITION MODE= SIMULTANEOUS (DQD)
##.ACQUISITION SCHEME= undefined
##.AVERAGES= 8
##.DIGITISER RES= 22
##SPECTROMETER/DATA SYSTEM= spect
##.PULSE SEQUENCE= zg30
##.SOLVENT NAME= COFFEE_meoh
##.SHIFT REFERENCE= INTERNAL, COFFEE_meoh, 1, 14.98509
##AUDIT TRAIL= $$ (NUMBER, WHEN, WHO, WHERE, PROCESS, VERSION, WHAT)
$$ ##TITLE= Audit trail, TOPSPIN		Version 2.1
$$ ##JCAMPDX= 5.01
$$ ##ORIGIN= Bruker BioSpin GmbH
$$ ##OWNER= Administrator
$$ $$ E:\/data/COFFEE/nmr/AC1689_PANAH14370_8637644_dT1z0TakX9/20/pdata/1/auditp.txt
$$ ##AUDIT TRAIL=  $$ (NUMBER, WHEN, WHO, WHERE, PROCESS, VERSION, WHAT)
(   1,<2014-05-30 19:03:16.556 -0700>,<Administrator>,<X>,<go>,<TOPSPIN 2.1>,
      <created by zg
	started at 2014-05-30 19:02:10.665 -0700,
	POWCHK enabled, PULCHK disabled,
       configuration hash MD5:
       C8 4E 4E 5D D3 5C D8 9E 9F 52 82 E0 59 8A DE 15
       data hash MD5: 64K
       3F BD E2 BD 6C 60 BB 7B 9E 19 6F 2A 78 4F 00 4B>)
(   2,<2014-05-30 19:03:19.462 -0700>,<Administrator>,<X>,<proc1d>,<TOPSPIN 2.1>,
      <Start of raw data processing
       efp LB = 0 FT_mod = 6 PKNL = 1 PHC0 = 0 PHC1 = 0 SI = 32K 
       data hash MD5: 32K
       1A B6 7B 1C 5C 10 0F 09 C9 82 7E C3 E7 71 79 54>)
(   3,<2014-05-30 19:03:19.743 -0700>,<Administrator>,<X>,<proc1d>,<TOPSPIN 2.1>,
      <pk PHC0 = 91.11511 PHC1 = 0 
       data hash MD5: 32K
       E4 7A 05 7E CC 9E C5 E6 A7 06 58 09 4F A2 15 5E>)
(   4,<2014-05-30 19:03:19.837 -0700>,<Administrator>,<X>,<proc1d>,<TOPSPIN 2.1>,
      <abs ABSG = 1 
       data hash MD5: 32K
       6C EB D6 7F 26 E4 BF BA 22 C4 9A 70 D4 4F AD A3>)
(   5,<2014-05-30 19:03:19.899 -0700>,<Administrator>,<X>,<proc1d>,<TOPSPIN 2.1>,
      <abs ABSG = 2 
       data hash MD5: 32K
       F8 D1 AD 82 17 0E 79 CE B9 25 75 32 2A 29 D4 20>)
(   6,<2014-05-30 19:03:19.993 -0700>,<Administrator>,<X>,<proc1d>,<TOPSPIN 2.1>,
      <abs ABSG = 3 
       data hash MD5: 32K
       80 C0 A0 4A 05 AB 38 A1 AD 81 84 99 50 EC A4 CB>)
(   7,<2014-05-30 19:03:20.071 -0700>,<Administrator>,<X>,<proc1d>,<TOPSPIN 2.1>,
      <abs ABSG = 4 
       data hash MD5: 32K
       4F 34 25 54 A8 12 74 44 9F 42 F3 CB 94 75 9D 3D>)
(   8,<2014-05-30 19:03:20.134 -0700>,<Administrator>,<X>,<proc1d>,<TOPSPIN 2.1>,
      <abs ABSG = 5 
       data hash MD5: 32K
       41 6E 4B A6 B7 66 21 C5 B6 2B 43 72 B5 14 02 46>)
$$ ##END=
$$ 
$$ $$ hash MD5
$$ $$ 31 77 82 54 2C 1E 30 6B 8B 95 BC 59 3D EE 48 E1
##$RELAX= 
##$RELAX= 
##$RELAX= 
##$RELAX= 
##$RELAX= 
##$RELAX= 
##$RELAX= 
$$ Bruker specific parameters
$$ --------------------------
##$DU= <E:\>
##$EXPNO= 20
##$NAME= <AC1689_PANAH14370_8637644_dT1z0TakX9>
$$ [...]
150 150 150 150 150 150 150 150
##$TP07= 0
##$TPNAME0= <>
##$TPNAME1= <>
##$TPNAME2= <>
##$TPNAME3= <>
##$TPNAME4= <>
##$TPNAME5= <>
##$TPNAME6= <>
##$TPNAME7= <>
##$TPOAL= (0..7)
0.5 0.5 0.5 0.5 0.5 0.5 0.5 0.5
##$TPOFFS= (0..7)
0 0 0 0 0 0 0 0
##$TUNHIN= 0
##$TUNHOUT= 0
##$TUNXOUT= 0
##$USERA1= <user>
##$USERA2= <user>
##$USERA3= <user>
##$USERA4= <user>
##$USERA5= <user>
##$V9= 5
##$VALIST= <valist>
##$VCLIST= <CCCCCCCCCCCCCCC>
##$VD= 0
##$VDLIST= <DDDDDDDDDDDDDDD>
##$VPLIST= <PPPPPPPPPPPPPPP>
##$VTLIST= <TTTTTTTTTTTTTTT>
##$WBST= 2048
##$WBSW= 25
##$XGAIN= (0..3)
0 0 0 0
##$XL= 0
##$YL= 0
##$YMAX_a= 636820
##$YMIN_a= -546232
##$ZGOPTNS= <>
##$ZL1= 120
##$ZL2= 120
##$ZL3= 120
##$ZL4= 120
##$ABSF1= 14.98509
##$ABSF2= -5.573092
##$ABSG= 5
##$ABSL= 3
##$ALPHA= 0
##$AQORDER= 0
##$ASSFAC= 0
##$ASSFACI= 0
##$ASSFACX= 0
##$ASSWID= 0
##$AUNMP= <proc_prof1d_extract_pilot.lims>
##$AXLEFT= 0
##$AXNAME= <>
##$AXNUC= <1H>
##$AXRIGHT= 0
##$AXTYPE= 0
##$AXUNIT= <>
##$AZFE= 0.1
##$AZFW= 0.1
##$BCFW= 0
##$BC_mod= 0
##$BYTORDP= 0
##$COROFFS= 0
##$CY= 15
##$DATMOD= 1
##$DC= 0
##$DFILT= <>
##$DTYPP= 0
##$F1P= 0
##$F2P= 0
##$FCOR= 0.5
##$FTSIZE= 32768
##$FT_mod= 6
##$GAMMA= 0
##$GB= 0
##$INTBC= 1
##$INTSCL= 1
##$ISEN= 128
##$LB= 0
##$LEV0= 0
##$LPBIN= 0
##$MAXI= 10000
##$MC2= 0
##$MEAN= 0
##$ME_mod= 0
##$MI= 0
##$NCOEF= 0
##$NC_proc= -8
##$NLEV= 6
##$NOISF1= 0
##$NOISF2= 0
##$NSP= 0
##$NTH_PI= 0
##$NZP= 0
##$OFFSET= 14.98509
##$PC= 1
##$PHC0= 91.11511
##$PHC1= 0
##$PH_mod= 1
##$PKNL= yes
##$PPARMOD= 0
##$PPDIAG= 0
##$PPIPTYP= 0
##$PPMPNUM= 2147483647
##$PPRESOL= 1
##$PSCAL= 4
##$PSIGN= 0
##$PYNMP= <proc.py>
##$REVERSE= no
##$SF= 400.02
##$SI= 32768
##$SIGF1= 0
##$SIGF2= 0
##$SINO= 400
##$SIOLD= 32768
##$SPECTYP= <>
##$SREGLST= <1H.CDCl3>
##$SSB= 0
##$STSI= 32768
##$STSR= 0
##$SW_p= 8223.68421052631
##$SYMM= 0
##$S_DEV= 0
##$TDeff= 65536
##$TDoff= 0
##$TI= <>
##$TILT= no
##$TM1= 0
##$TM2= 0
##$TOPLEV= 0
##$USERP1= <user>
##$USERP2= <user>
##$USERP3= <user>
##$USERP4= <user>
##$USERP5= <user>
##$WDW= 1
##$XDIM= 32768
##$YMAX_p= 459608300
##$YMIN_p= -766346
##$CURPLOT= <Network HP LaserJet P1505>
##$CURPRIN= <$Network HP LaserJet P1505>
##$DFORMAT= <normdp>
##$LAYOUT= <+/1D_H.xwp>
##$LFORMAT= <normlp>
##$PFORMAT= <normpl>
##$SURQMSG= 1
$$ End of Bruker specific parameters
$$ ---------------------------------
##NTUPLES= NMR SPECTRUM
##VAR_NAME=  FREQUENCY,     SPECTRUM/REAL,   SPECTRUM/IMAG
##SYMBOL=    X,             R,               I
##VAR_TYPE=  INDEPENDENT,   DEPENDENT,       DEPENDENT
##VAR_FORM=  AFFN,          ASDF,            ASDF
##VAR_DIM=   32768,         32768,           32768
##UNITS=     HZ,            ARBITRARY UNITS, ARBITRARY UNITS
##FACTOR=    0.250966925370066, 1,           1
##FIRST=     8223.43324360094, 68077,        -419298
##LAST=      0,             -99834,          -88229
##MIN=       0,             -766346,         0
##MAX=       8223.43324360094, 459608300,    0
$$ Real data points
##PAGE= N=1
##DATA TABLE= (X++(R..R)), XYDATA
$$ [...]
$$ plain form
19553 141714 29533 147531 -279719 152289 -108385 17802 -34338 -140296 96966 -217592
19542 -50214 219158 28890 31779 -197597 63013 179392 373383 180822 44647 -179491 -55493
19530 -223354 148675 38468 -185786 -121536 89885 -98494 105439 70291 82544 -46367 150004
19518 -260992 5841 -203636 134560 73749 -321842 176844 47193 -185886 -153536 -182190 -8829
19506 204294 16327 33409 -201041 -77083 -32641 -138159 -1243 -90062 98214 -284531 167189
19494 -131213 92292 73181 -91206 -58411 -4580 -91269 -196362 -178285 -316569 -110430 114524
19482 152438 -198199 -211510 45767 -249207 16940 28816 -254897 -187279 -27209 -34376 79013
19470 -236539 -121048 68397 546 35416 -352412 -235652 -113730 304771 -44150 16392 112220
$$ packed form
19553A41714B9533J17998b79719A52289a08385A7802c4338j05958I6966b17592
19542e0214B19158B8890K889a97597F3013J16379J93991A80822D4647a79491e5493
19530b23354A48675C8468a85786O4250H9885i8494A05439l5148J2253d6367A50004
19518b60992E841b03636A34560o0811c21842A76844D7193a85886L2350k8654h829
19506B04294A6327J7082b01041g7083c2641j05518a243q8819I8214b84531A67189
19494a31213I2292j9111i1206L2795d580q6689j05093J8077j38284a10430A14524
19482A52438a98199j3311D5767b49207A6940J1876b54897O7618b7209p167G9013
19470b36539J15491F8397E46L4870c52412J16760a13730C04771d4150A6392R5828
$$ plain form
19459 112220 14942 18708 100856 104374 5014 -151610 -273730 16520 -478092 217267 -15732
19447 -197969 52591 163325 -3773 339081 -93310 -17302 -275599 -209009 -97675 -129106 9021
19435 29864 -132150 -115661 -36532 44773 11883 -76137 85538 -294006 -35559 -189244 -185969
19424 -185969 -24388 262984 -208729 -128062 -245800 177667 -3893 54146 42213 -24603 319029
19412 -60165 -115342 354076 -130565 -76259 199736 -71442 -146730 70731 -59472 45068 -109803
19400 240364 19821 -326609 -238637 11815 67381 209891 240332 -14046 264749 -35071 -7451
19388 -227404 219463 -90234 -56584 -88271 140670 -24018 83729 -36289 144821 179741 -36651
19376 -127983 -136758 282629 -254334 -233996 -344043 116067 -38067 172952 -73438 39594 98784
$$ packed form
19459A12220A4942L766Q2148L518E014a51610j22120A6520d78092B17267a5732
19447a97969E2591J10734c773C39081i3310a7302k58297O6590i7675l1431I021
19435B9864a32150J6489c6532D4773A1883g6137H5538b94006c5559j53685L275
19424a85969b4388B62984b08729Q0667j17738A77667c893E4146j1933b4603C19029
19412f0165n5177C54076a30565N4306A99736g1442p5288G0731e9472D5068a09803
19400B40364A9821c26609Q7972A1815N5566J42510L0441a4046B64749c5071g451
19388b27404B19463i0234L3650l1687A40670b4018H3729c6289A44821L4920c6651
19376a27983q775B82629b54334K0338j10047A16067c8067A72952g3438C9594N9190
$$ plain form
19365 98784 -131949 -60550 -121365 -76519 -129351 -268612 -26956 198555 -44060 26767 162477
19354 162477 154974 -221579 -260830 -41971 -4237 145740 -229853 220881 66092 -410691 19260
19342 -65211 -107722 -448171 -230173 91499 -53869 127376 107918 286514 130106 -4832 -274392
19331 -274392 -2046 42603 -391331 -68638 -377636 396455 266240 -208835 -500081 -24925
19320 -43809 -282922 -288460 263988 -265106 -257981 -346829 107729 -17720 -49032 144889 -154920
19308 -170969 -131717 -71382 -217883 143779 202632 -399283 -487057 -262433 134586 61202
19297 -248657 -9778 15241 -128231 -266933 -239048 -82991 -40613 124169 -73059 -281455 164613
19285 -98484 -67294 -198416 -174681 120653 268818 12435 -298902 153255 73623 -43642 -178422
$$ packed form
19365I8784a31949f0550o0815M4846n2832j39261b6956A98555d4060B6767J35710
19354A62477p503b21579l9251d1971d237A45740b29853B20881F6092d10691A9260
19342f5211m2511l40449K17998I1499e3869A27376j9458J78596A30106d832k69560
19331b74392b046D2603c91331f8638l08998C96455j30215b08835k91246b4925
19320d3809k39113n538B63988b65106P125q8848A07729a7720l1312A44889a54920
19308a70969L9252O0335j46501A43779N8853c99283q7774K24624A34586F1202
19297b48657i778A5241a28231j38702K7885h2991d0613A24169g3059k08396A64613
19285i8484L1190j31122K3735A20653J48165A2435b98902A53255G3623d3642j34780
$$ plain form
19274 -178422 31319 52272 -61310 -314134 -74976 -348700 -320908 -155000 -232501 52043 33421
19263 33421 -153643 36707 155649 -255395 42711 109649 23071 -128746 -101601 -240401 -42883
19251 -249646 -154341 -259451 -76638 122614 -178287 98588 -75466 -203300 -297032 -277183 3140
19239 -218416 38157 -136802 -360665 -66775 -218591 -108777 34543 -206711 -14374 260666
19228 -111451 212854 -133598 -56225 185676 -137936 -209454 9039 -227488 59738 -136517
19217 7086 245647 170169 -58165 17428 156392 -50852 463607 -2339 174671 86661 -115282
19205 3399 -157357 -165900 -81077 -22490 -49656 34797 143714 -154805 20821 -218959 -294543
19194 -294543 -4600 -13548 -155470 -102183 -192252 15855 97497 423161 -234358 -63423 17123
$$ packed form
19274a78422C1319K0953f1310k52824g4976k73724K7792a55000p7501E2043j8622
19263C3421a53643C6707J18942b55395D2711O6938B3071a28746K7145j38800d2883
19251b49646R5305j05110g6638A22614a78287I8588g5466j27834r3732J9849C140
19239b18416C8157a36802k23863f6775j51816a08777C4543b06711a4374B60666
19228a11451B12854a33598e6225A85676a37936p1518I039b27488E9738a36517
19217G086K38561p5478e8165A7428J38964e0852D63607b339A74671H6661a15282
19205C399a57357q543h1077b2490k7166C4797J08917a54805B0821b18959p5584
19194b94543d600q948j41922N3287r0069A5855Q1642L25664b34358f3423A7123
$$ plain form
19182 -214072 77958 -117822 -206942 -5759 -51572 33512 7295 -216988 -167920 64538 -348 271412
19169 -212184 -79449 113771 -176620 -240404 89227 -170962 -206768 -243308 -372670 -166674
19158 85524 14805 74754 40063 -167270 -27952 -99296 -87947 -244331 242731 -67026 -363276
19147 -363276 -154319 138339 157134 -254906 -227701 225986 119393 -177943 110888 -165715
19136 169796 -174672 26018 24054 -200318 205932 66626 4744 192470 -182476 153787 -32891
19124 -43292 138210 -18180 -271020 93797 -85798 -94487 336096 -14030 -384994 -42503 -20969
19112 -86158 5807 -273181 -58349 -222900 52535 -72310 -106726 138763 -66621 163896 -232007
19100 125712 -247592 -74191 240475 -481360 166903 -476471 -10007 18527 19464 200808 -327294
$$ packed form
19182b14072G7958a17822q9120e759m5813C3512G295b16988M9068F4538c48B71412
19169b12184g9449A13771a76620o3784H9227a70962l5806l6540j29362a66674
19158H5524A4805N9949l4691a67270b7952p1344J1349j56384B42731f7026k96250
19147c63276a54319A38339J8795b54906K7205B25986j06593a77943A10888a65715
19136A69796a74672B6018j964b00318B05932F6626D744J87726a82476A53787c2891
19124d3292A38210a8180k52840I3797h5798q689C36096a4030l70964d2503b0969
19112h6158E807b73181e8349j64551E2535g2310l4416A38763f6621A63896b32007
19100A25712b47592g4191B40475d81360A66903d76471a0007A8527R37J81344c27294
$$ plain form
19088 118553 268207 100348 -239041 -144097 217097 -242666 85120 29837 -578588 -231784
19077 -41181 117140 56043 -326507 -263191 29764 58032 -232660 -116036 9632 -86920 24063
19065 11955 105426 -136460 134797 -124148 -232792 69 103444 69475 -115673 201816 71408
19053 39752 -213575 -348619 202236 -124501 76919 21794 -33597 309166 -53263 -18806 82836
19041 -21885 95927 5409 -229434 193123 -104152 232837 -76454 -139964 -340890 221052 -40119
19029 -50676 29216 182954 234196 -87768 273660 -109321 -16022 119901 219398 128146 -199116
19017 -26957 127794 205013 154132 34762 4910 295775 -1028 170267 -7907 -11935 -150974 -351139
19005 -351139 -342693 -268156 83073 -59115 -150296 37584 -145126 -175171 -228680 48806 -49101
$$ packed form
19088A18553J49654A00348b39041R4944B17097b42666H5120B9837e78588b31784
19077d1181A17140E6043c26507O3316B9764K8268b32660a16036I632h6920B4063
19065A1955R3471a36460A34797a24148j08644F9J03375l3969a15673B01816G1408
19053C9752b13575j35044B02236a24501G6919B1794c3597C09166e3263a8806H2836
19041b1885I5927E409b29434A93123a04152B32837g6454o3510k00926B21052d0119
19029e0676B9216J53738N1242h7768B73660a09321a6022A19901R9497r1252a99116
19017b6957A27794P7219n0881C4762D910K90865a028A70267g907m028j39039k00165
19005c51139Q446P4537H3073e9115r1181C7584a45126l0045n3509D8806d9101
$$ plain form
18993 -246582 9776 -168555 -289880 277789 -164779 -81373 -132266 231201 57769 -378 -91217
18982 -91217 -80099 -100336 -202312 -24637 53010 10032 241306 -206466 102624 -295962 -70189
18970 29115 -263494 344289 -128283 -166711 -48099 -20912 -195062 104990 -356741 20510
18959 -94542 18348 -231142 317043 191052 54021 -64105 -103989 121543 100376 202216 97157
18947 -195810 -57064 -157009 99980 -321671 -89239 -70566 144948 286253 -434274 -20679 -52198
18936 -52198 -93098 -52694 -162235 -477 18273 -11170 -351267 -53847 24976 -37682 26965 -161592
18923 -105515 228510 81455 -164711 -96232 -44134 -302932 -22089 22237 12448 -124725 -34676
18911 -154543 -355351 -19844 -66715 101495 42284 71113 -396927 -104515 -294313 -431073
$$ packed form
18993b46582I776a68555j21325B77789a64779h1373n0893B31201E7769c78r0839
18982i1217J1118k0237j01976b4637E3010A0032K31274b06466A02624b95962g0189
18970B9115b63494C44289a28283l8428d8099b0912j74150A04990c56741B0510
18959i4542A8348b31142C17043j25991E4021f4105l9884A21543k1167J01840I7157
18947a95810e7064r9945I9980c21671h9239J8673A44948J41305d34274b0679l1519
18936e2198m0900M0404j09541d77A8273a1170l40097e3847B4976c7682B6965a61592
18923a05515B28510H1455a64711O8479d4134k58798b2089B2237r789a24725c4676
18911a54543k00808a9844m6871A01495D2284K8829c96927a04515j89798j36760
$$ plain form
18901 -431073 -143240 -29621 -331627 17735 314429 -394 -219102 323 -29343 289462 -250410
18889 -84983 -22680 -215679 -133257 87164 72819 22267 -101306 -136858 238844 157103 -49788
18877 -211470 -196574 -133627 -83425 87155 77888 -231255 92055 178977 -231916 -30888 -109494
18866 -109494 81256 147065 -118190 -253208 303123 465 -284846 -73093 71651 -47928 -19105
18854 -277789 -138879 33954 -147305 -5725 -85328 102608 -56325 -102329 -236848 -32980 -55208
18843 -55208 225291 326001 -9448 -173741 -9719 -51810 50339 -4071 -117640 335587 -142990
18831 -166633 41328 -156010 43247 -119704 -421943 -210355 -86825 67682 67002 -92105 -2314
18819 158839 -12580 19823 115112 408951 -58181 -90929 -278159 131196 -227961 -31922 -114455
$$ packed form
18901d31073a43240b9621l02006A7735K96694c94k18708C23b9343B89462b50410
18889h4983b2680j92999Q2422H7164j4345B2267a01306l5552B38844q1741d9788
18877b11470J4896O2947N0202H7155r267b31255I2055Q6922b31916c0888p8606
18866a09494H1256O5809a18190j35018C03123D65b84846g3093G1651d7928a9105
18854b77789a38879C3954a47305e725p9603A02608e6325m6004j34519c2980k2228
18843e5208B25291J00710i448j64293i719m2091E0339d071j13569C35587a42990
18831a66633D1328a56010D3247a19704l02239b10355h6825F7682o80i2105b314
18819A58839a2580A9823R5289K93839e8181l2748j87230A31196b27961c1922q2533
$$ plain form
18808 -114455 211608 169918 -341835 -8380 -7578 330170 -261239 -88515 63558 178394 84441
18796 -498868 -113975 25283 41250 237821 -122293 79825 -154809 -94107 -208975 -163323
18786 -163323 180406 -14921 -120875 -3082 50820 332796 -415580 -56494 25528 -610417 56171
18774 -89664 -152657 -56775 -55829 -13270 254630 -339448 256770 -325444 -15892 101019 -347794
18762 146188 -106500 -69128 -265915 146841 -83636 -10144 181307 -153503 -17752 -175328
18752 -175328 271477 31867 -20552 2337 -49241 -145442 328516 -27544 80406 330356 159381
18740 -129759 -148174 -114561 147184 225057 76359 108148 -88501 42801 -101139 -29396 -88644
18729 -88644 118656 40299 -290406 372381 -123239 -152393 -86631 -271953 -229314 170345
$$ packed form
18808a14455B11608m1690c41835h380Q02C30170b61239h8515F3558J14836H4441
18796d98868a13975B5283J5967J96571a22293G9825a54809O0702j14868M5652
18786a63323A80406a4921j05954c082E0820K81976d15580e6494B5528f10417E6171
18774h9664o2993e6775R46a3270B54630c39448B56770c25444a5892A01019c47794
18762A46188a06500L7372j96787A46841h3636a0144A81307a53503a7752j57576
18752a75328B71477C1867b0552B337d9241r6201C28516b7544H0406K49950A59381
18740a29759j8415L3613A47184P7873G6359L1789h8501D2801a01139b9396n9248
18729h8644A18656D0299b90406C72381a23239k9154O5762j85322M2639A70345
$$ plain form
18718 15590 -52225 93782 -130698 -92379 173168 129689 -8862 -78890 -260130 -13647 -444246
18707 -444246 -189547 -116117 -207225 -83726 307072 7745 104583 156303 -347740 -193457 -435528
18696 -435528 -76151 249997 15398 -513556 -154047 -255393 -10232 112771 -101576 -216679
18686 -216679 -285354 5756 -1526 -113454 99907 148033 -24614 -172788 129808 -196158 -136262
18675 -136262 -49181 266747 175216 -96258 5467 -143859 -61891 -15765 117017 -128717 119126
18663 101143 -243840 60016 -129452 312963 -39358 25624 -115951 -294640 -45590 -151403
18653 -151403 216090 -325243 820 76326 71436 -263844 44404 120721 -325817 14203 -283413
18641 -43180 -128016 -107623 320696 -407002 -194905 11525 -92671 -266448 363304 75008 -59139
$$ packed form
18718A5590e2225I3782a30698L8319A73168m3479h862p0028j81240a3647m30599
18707d44246a89547P3430r1108h3726C07072G745R6838N1720c47740J54283k42071
18696d35528g6151B49997A5398e13556a54047j01346a0232A12771a01576j15103
18686b16679o8675E756a526j11928I9907M8126b4614j48174A29808a96158N9896
18675a36262d9181B66747r1531i6258E467a43859f1891a5765A17017a28717A19126
18663A01143b43840F0016a29452C12963c9358B5624a15951j78689d5590j05813
18653a51403B16090c25243H20P5506m890b63844D4404P6317c25817A4203b83413
18641d3180q4836K0393C20696d07002a94905A1525i2671j73777C63304G5008e9139
$$ plain form
18629 -174568 -110563 -251643 -168391 1627 -28236 9792 23262 -215841 3679 310907 220765
18618 220765 -260917 -90355 -52695 73337 -176443 100195 -112699 -163088 -41756 -113154 66312
18606 53107 -366883 2190 -27105 -138732 -248805 203880 179077 83628 -25082 140982 -98281
18594 -229972 -91570 -92629 -155468 -61804 -126908 873 -190211 -58337 41045 -130857 -154032 -72666
18581 -114751 -337480 -75208 72663 -227195 143487 6744 -208765 -97448 -7139 -32975 -362167
18570 -362167 -159510 204927 26187 -138293 407766 -136503 -309732 78918 -37645 203983
18559 -328215 -440840 15366 196348 172266 67455 167647 -61198 112411 43012 -74004 -193622
18548 -193622 127151 18240 29846 -41749 -25097 -149295 139486 -145436 -58521 -314638
$$ packed form
18629a74568O4005j41080Q3252A627b8236I792J3470b15841C679L07228r0142
18618B20765b60917i0355L7660G3337a76443A00195a12699n0389d1756p1398F6312
18606E3107c66883B190b7105j11627j10073B03880k4803H3628b5082A40982i8281
18594b29972i1570j059o2839f1804o5104H73a90211e8337D1045a30857k3175g2666
18581a14751k22729g5208G2663b27195A43487F744b08765i7448g139k5836l29192
18570c62167a59510B04927B6187a38293D07766a36503j73229G8918c7645B03983
18559c28215j12625A5366J80982k4082F7455J00192f1198A12411D3012g4004j19618
18548a93622A27151A8240J1606d1749J6652j24198A39486a45436e8521k56117
$$ plain form
18538 -314638 159672 -89649 -173942 -140358 39300 -107860 -69800 -55387 -108019 -229200 206310
18526 20886 -199122 19305 -37288 143967 -70936 -171627 -29234 -10960 -249175 -283723 -175259
18515 -175259 -265280 324459 -49721 266612 -78377 -104435 40950 155159 -13111 137349 -104796
18503 88793 -193761 12302 -363700 73529 -217519 -175151 28667 10111 -2095 -171307 -163000
18492 -163000 233365 33133 334515 73693 24073 29415 -131630 292386 24749 43303 175478
18481 175478 174561 174738 144611 -368708 -236795 -213658 -113597 -158981 -73415 -44755 23453 109593
18469 109593 -127630 53524 -304252 -38490 -133925 8137 -64445 -205663 -429738 -174428 212696
18457 -286202 -227309 -106921 -141609 112117 -100248 46642 28178 -183702 23933 -166136
$$ packed form
18538c14638A59672h9649q4293L3584C9300a07860L8060J4413n2632j21181B06310
18526B0886a99122A9305c7288A43967g0936j00691b9234a0960k38215l4548J08464
18515a75259r0021C24459d9721B66612g8377k6058D0950J14209a3111A37349a04796
18503H8793a93761A2302c63700G3529b17519M2368B8667A0111b095j69212Q307
18492a63000B33365C3133L01382G3693B4073N342a31630B92386B4749J8554J32175
18481A75478r17J77l0127c68708J31913K3137J00061m5384g3415K8660B3453Q6140
18469A09593a27630E3524c04252c8490r5435H137f4445j41218k24075a74428B12696
18457b86202N8893a06921l4688A12117a00248D6642j8464a83702B3933a66136
$$ plain form
18446 18655 -175225 -226589 209673 204360 201884 -335464 -253172 119888 64385 133753 -382880
18434 29320 -2799 -80876 -547192 628 -66875 11322 -41129 -85542 -229333 26576 -48949 104720
18421 -290898 103811 175651 -170686 225407 -94388 -65110 -14855 -115685 -65253 -66699 -173541
18410 -173541 205801 341674 83274 411223 -100414 -179632 -13071 157722 2310 44055 -190114
18398 -56796 -252422 -130789 -166803 185796 334578 435 98867 37540 -95674 102722 -4326
18386 -308954 -120163 -172370 -130382 -27469 -38717 77290 136608 373131 183982 -257453 -37470
18374 -66196 -144654 126442 87998 -135209 12866 272499 -151183 -166127 -167195 93456 -8807
18362 -117816 252570 -71634 -100527 -123398 -58448 85838 -68507 -251609 -1616 -45132 -164276
$$ packed form
18446A8655a75225n1364B09673n313k476c35464Q2292A19888n5503O9368c82880
18434B9320b799p8077m66316F28f6875A1322d1129m4413j43791B6576d8949A04720
18421b90898A03811P1840a70686B25407i4388K9278a4855j00830N0432j446j06842
18410a73541B05801J35873H3274L27949a00414p9218a3071A57722B310M1745a90114
18398e6796j95626J21633l6014A85796J48782D35R8432C7540i5674A02722d326
18386c08954a20163n2207M1988b7469j1248G7290N9318K36523A83982b57453c7470
18374f6196p8458A26442l8444a35209A2866K59633a51183j4944j068I3456h807
18362a17816B52570g1634k8893k2871e8448H5838f8507j83102a616m3516j19144
$$ plain form
18351 -164276 207902 -448615 376980 176738 -54257 29401 -312569 -122877 275626 32548
18340 249631 486250 393704 293765 -104049 -56697 -288447 -324367 -202386 -194739 -158758 -76464
18328 -247124 -71838 78161 -387993 -312419 -40022 -300015 -466356 -258704 44242 -158140
18317 314598 -397327 84143 -11061 -86724 168274 49484 182300 -111143 -172529 793 14381
18306 14381 -4921 -16346 -194249 -109946 -190747 -72898 -169624 -71020 -236843 -8655 -32518 224292
18293 -53080 -210230 66320 54990 104485 24053 -108124 -204168 107547 1586 -280018 241510
18281 -34756 15321 -242731 79349 202058 -136469 -57557 314885 -92956 50203 -20434 34710
18269 -259504 -176844 88886 -217541 193046 204528 -161419 -207343 4776 -89117 -152407 63922
$$ packed form
18351a64276B07902d48615C76980A76738e4257B9401c12569a22877B75626C2548
18340B49631K36619r2546r9939a04049M7352k31750l5920J21981P647L5981g6464
18328b47124g1838G8161c87993P5574d0022k59993j66341K07652D4242a58140
18317C14598c97327H4143a1061p5663A68274D9484J32816a11143o1386G93J3588
18306A4381d921j1425j77903Q4303q0801g2898r6726g1020j65823h655k3863B24292
18293e3080j57150F6320j1330M9495B4053a08124r6044A07547A586b80018B41510
18281c4756A5321b42731G9349J22709a36469e7557C14885i2956E0203b0434C4710
18269b59504Q2660H8886b17541A93046J1482a61419m5924D776h9117o3290F3922
$$ plain form
18257 -428637 -181861 -151185 19675 -108544 37700 79437 39378 -176120 -86447 -280358 189982
18245 115783 -132258 200310 -224962 4996 -126137 135768 -307249 12170 -74969 238654
18234 -63363 -22914 153105 -165745 -169048 -268812 -221526 -1598 29130 101528 1839 98052 -93454
18221 -103065 41737 -132434 -40202 109404 288617 -236273 30855 217034 -108129 -98210
18211 -98210 -330301 -36701 -113525 -312026 -62522 -150529 152531 59356 57708 -268258 396819
18199 138667 -226906 -65285 27473 108385 -207593 263314 -198359 200916 -151162 -274863
18189 -274863 -478910 -365915 -173877 -131575 -63929 132272 185253 -256499 146353 132095
18179 132095 67348 106014 -117236 -76136 108879 -188672 225774 -192015 156317 -59811
$$ packed form
18257d28637a81861L0676A9675a08544C7700M1737C9378a76120h6447j93911A89982
18245A15783a32258B00310b24962D996a26137A35768c07249A2170g4969B38654
18234f3363b2914A53105a65745l303r9764M7286a598B9130P2398A839R6213i3454
18221a03065D1737a32434d0202A09404J79213b36273C0855J86179a08129R919
18211i8210k32091c6701p6824j98501f2522q8007A52531E9356j648b68258C96819
18199A38667b26906f5285B7473Q0912b07593B63314a98359B00916a51162j23701
18189b74863k04047J12995a73877M2302f3929A32272N2981b56499A46353j4258
18179A32095o4747L8666a17236M1100A08879a88672B25774a92015A56317e9811
$$ plain form
18168 141371 58214 -134009 -39564 -4140 15681 213405 105024 -199809 -325997 -93860 -247357
18157 -247357 -161869 -27074 -102057 -111217 147044 -47568 60946 71390 17354 13551 97860 -142141
18144 155059 -152210 109783 159891 96298 124586 112543 -106483 -131180 39230 -75998 -177801
18133 -177801 128050 -202866 -82970 -188101 233615 2691 3297 -8101 197254 -451931 73349
18121 70511 173448 -235109 -51885 -183212 -98089 -246622 -5880 -152203 158438 256090 -362768
18109 96932 -232137 -121059 -71135 30040 20976 -106792 -212128 -59716 100770 52527 -120296
18097 -84944 -204061 -212460 139493 -27268 437512 -127245 93224 226440 -144502 -17886 138
18085 -154212 -44071 211635 -35913 154566 1847 -246438 40722 -185615 188966 19005 50409
$$ packed form
18168A41371E8214a34009c9564d140A5681J97724A05024a99809j26188i3860j53497
18157b47357Q5488b7074p4983r160A47044d7568F0946J0444A7354l803Q4309a42141
18144A55059a52210A09783N0108o3593K8288j2043a06483k4697C9230g5998j01803
18133a77801A28050b02866h2970j05131B33615B691O06h101A97254d51931G3349
18121G0511J02937b35109e1885j31327Q5123j48533e880j46323A58438R7652c62768
18109I6932b32137J11078M9924C0040r064a06792j05336e9716A00770m8243a20296
18097h4944j19117q399A39493b7268D37512a27245I3224J33216a44502a7886A38
18085a54212d4071B11635c5913A54566A847b46438D0722a85615A88966A9005L1404
$$ plain form
18074 50409 -112426 -45942 -135681 -69748 99093 -53707 96958 58422 163155 -4934 -83587
18063 -83587 -504253 -63297 274496 113209 -30311 -53562 -108700 85510 -119014 -35869 -116482
18052 -116482 119707 -147872 54646 -272596 23516 237013 112903 33947 143403 -177669
18041 1535 -240627 -146492 -3813 17198 29093 339569 -61204 388719 -13653 54521 14061
18029 140807 -83792 -140546 -75958 -253874 -146829 -228108 -82428 237209 -234921 314557
18018 347068 96135 -153641 55127 22887 -302218 -28731 61070 -3381 -236106 195208 -49798
18006 -365421 -10000 -50563 -262775 182011 250716 -242431 -25669 105439 -68585 -140583 -258637
17995 -258637 -443454 -19379 89370 -104609 80528 -60057 -128911 -324248 -170728 108098
$$ packed form
18074E0409a12426d5942q9739O5933I9093e3707I6958l8536J04733d934p8653
18063h3587m20666f3297B74496A13209c0311k3251n5138H5510a19014c5869q0613
18052a16482A19707a47872E4646b72596B3516K13497A12903C3947J09456a77669
18041A535b40627R4135c813A7198J1895L10476f1204C88719a3653E4521A4061
18029A40807h3792n6754O4588j77916J07045q1279h2428B37209b34921C14557
18018C47068I6135a53641E5127B2887c02218b8731F1070c381k32725A95208d9798
18006c65421a0000m0563k12212A82011O8705b42431b5669A05439f8585p1998j18054
17995b58637j84817a9379H9370a04609H0528f0057o8854j95337J53520A08098
$$ plain form
17984 55839 64982 295221 146249 167615 128007 -386741 -50252 -345472 200822 -32491 -303292
17973 -303292 -179422 65682 162353 -122623 -265719 299050 -289133 -160762 -83497 -8117
17962 161766 69700 185735 -70852 53568 -112395 230670 186663 -201612 -162467 50219 -8830
17950 243828 -161919 -215438 -155887 25333 89662 112161 -175474 503884 -105071 207694
17939 17449 28275 -65865 294614 256330 55788 350593 -19617 -16193 312230 -255935 -38602
17927 322764 -94348 18809 -189900 193857 65226 392166 87352 184480 -179515 -111719 -120950
17916 -120950 -173959 -254202 16705 -165777 231890 189519 -173388 -53486 -37632 27839 -105160
17904 -147685 47468 149645 87795 -172271 -174495 52372 -204933 -8354 15333 99128 76325
$$ packed form
17984E5839R143K30239A46249K1366l9608c86741e0252k95220B00822c2491k70801
17973c03292J23870F5682R6671a22623j43096B99050b89133J28371P7265h117
17962A61766F9700J16035g0852E3568a12395B30670m4007b01612L9145E0219h830
17950B43828a61919n3519N9551B5333O4329K2499a75474E03884a05071B07694
17939A7449J0826f5865B94614l8284E5788K94805a9617L424C12230b55935c8602
17927C22764i4348A8809a89900A93857F5226L26940H7352R7128a79515O7796r231
17916a20950n3009q0243A6705a65777B31890m2371a73388e3486J5854B7839a05160
17904a47685D7468J02177o1850a72271k224E2372b04933h354A5333Q3795k2803
$$ plain form
17893 76325 -6509 458920 -95204 78144 146795 9750 59226 2889 372840 -103365 -106848 -18943
17880 21240 -79056 -80120 -211652 -21208 -121916 -74959 -241839 277921 217108 93736 -18069
17868 -72057 11117 -185756 -69148 -167719 101689 414162 129092 -292880 -10045 -144541
17858 -144541 101118 232624 -98967 -227478 74943 140168 -111275 99366 231161 75911
17847 81970 219088 -252437 -9054 -53852 -80295 -103467 69096 80260 -338103 55991 39962
17836 39962 -85609 -507175 92834 12506 -141278 -289006 -112925 250066 -132330 -323886
17826 -323886 154403 -90985 137395 14263 -281595 -213710 -122023 -313811 -53164 69052 -85363
17814 77822 -198474 -57311 154148 373653 -62880 114136 13382 37514 59103 192212 408767
$$ packed form
17893G6325f509D58920i5204G8144O8651I750M9476B889L69951a03365l483a8943
17880B1240g9056j064j31532b1208j00708M6957j66880B77921o0813I3736a8069
17868g2057A1117a85756f9148r8571A01689L12473A29092b92880a0045j34496
17858a44541A01118J31506i8967j28511G4943O5225a11275I9366J31795G5911
17847H1970J37118b52437i054m4798k6443k3172F9096J1164c38103E5991j6029
17836C9962h5609m21566I2834A2506a41278j47728a12925B50066a32330j91556
17826c23886A54403i0985A37395A4263b81595O7885R1687j91788e3164F9052h5363
17814G7822a98474e7311A54148K19505f2880A14136A3382K4132K1589J33109K16555
$$ plain form
17803 408767 -44973 152122 12053 -165672 52514 154248 238526 -9725 72979 -118319 -311790
17792 -311790 148621 79343 124789 -80951 109005 47512 155362 17500 288646 306935 -137536
17780 -169574 -125416 49786 -361188 -532 51404 66678 11680 -33805 241585 303134 -79838
17768 25982 -137196 -384037 11354 -23918 198028 -79607 192708 273478 52895 220919 -742
17756 -37718 278692 -207856 98220 -56668 -222336 -37754 30350 -45761 -105851 197386 82206
17744 187606 142688 -79293 -303469 279369 239 274000 -111949 105936 106869 211548 68478
17732 -160705 -167178 -63547 -100504 379182 10856 60776 266457 -175394 -96036 -163397 -33261
17720 -74580 -51030 -109311 -76341 -192864 -41393 112745 -139799 36253 594781 -26723 79850
$$ packed form
17803D08767d4973A52122A2053a65672E2514J01734Q4278i725G2979a18319j93471
17792c11790A48621o9278M5446h0951A09005D7512J07850A7500K71146J8289a37536
17780a69574M4158D9786c61188e32E1404J5274A1680c3805B41585O1549g9838
17768B5982a37196k46841A1354b3918A98028g9607A92708Q0770E2895J68024g42
17756c7718B78692b07856I8220e6668j65668c7754C0350d5761o0090A97386H2206
17744A87606m4918g9293k24176B79369B39K73761a11949A05936R33J04679F8478
17732a60705o473f3547l6957C79182A0856M9920K05681a75394P9358o7361c3261
17720g4580K3550n8281L2970j16523d1393A12745a39799C6253N58528b6723G9850
$$ plain form
17708 25815 -45090 290576 -5301 -127312 287481 205346 -47941 285518 106197 166721 124585
17697 124585 79392 -93528 -159327 -117665 -174789 -43389 43730 58343 160386 75770 121035
17686 121035 -121215 -62521 203289 -175920 -7984 -257098 -30292 -141188 -218452 -108208
17675 -27976 81591 -21361 -76181 -101124 222254 -110255 103400 124214 -109175 319909 246728
17664 246728 31369 -187536 -169281 103666 168258 194670 7323 277177 -128402 -156137 74174
17652 -238292 243954 -244333 70495 253642 -66935 94646 -48228 49535 63971 132461 -80057
17640 54664 -296804 -133994 -103798 -45271 7241 344528 -97403 122013 73364 121039 134109
17629 134109 92911 79079 117782 -209103 -15129 -42458 77622 81095 -30478 111199 -82324
$$ packed form
17708B5815d5090B90576e301j22011B87481q2135d7941B85518A06197O0524m2136
17697A24585m5193i3528o5799M1662n7124d3389D3730J4613J02043G5770M5265
17686A21035a21215N8694B03289a75920g984k49114c0292j10896p7264a08208
17675b7976H1591b1361n4820k4943B22254a10255A03400K0814a09175C19909p3181
17664B46728C1369a87536J8255A03666O4592K6412G323K69854a28402k7735G4174
17652b38292B43954b44333G0495J83147f6935I4646d8228D9535J4436O8490h0057
17640E4664b96804a33994L0196d5271G241L37287i7403A22013m8649M7675J3070
17629A34109m1198j3832L8703b09103a5129k7329G7622L473c0478A11199h2324
$$ plain form
17617 -255327 196574 58199 -53526 -81344 77839 -86831 49315 40067 -101285 131012 -77190
17605 -76217 -197147 151611 299003 -461614 5184 160433 41678 -36712 -368121 342537
17594 28326 68869 245124 270927 250413 236021 110532 -37424 -36570 120198 -48499 60155
17582 78837 -97102 -165866 204806 -139787 125885 346302 -85859 220110 260988 -230743
17571 -118492 -16147 125261 -2076 -157925 -257309 36386 -299337 420274 179511 -65759 -211919
17560 -211919 179714 361019 -346190 301362 91326 10859 -13344 -85867 -112088 17489 390108
17549 390108 142533 299160 -16008 -60029 169830 120349 -65740 -85439 53256 331447 355800
17538 355800 246548 91666 -47991 -44496 -183335 -120587 61014 -163274 185348 -59150 105679
$$ packed form
17617b55327A96574E8199e3526k7818G7839h6831D9315r248a01285A31012g7190
17605g6217j20930A51611J47392d61614E184J55249D1678c6712l31409C42537
17594B8326M0543J76255K5803k0514j4392A10532c7424Q54A20198d8499F0155
17582G8837i7102o8764B04806a39787A25885K20417h5859B20110M0878b30743
17571a18492a6147A25261b076j55849r9384C6386b99337D20274A79511f5759j46160
17560b11919A79714J81305c46190C01362I1326A0859a3344p2523k6221A7489L72619
17549C90108A42533J56627a6008m4021A69830m9481f5740j9699E3256K78191K4353
17538C55800j09252I1666d7991L495j38839O2748F1014a63274A85348e9150A05679
$$ plain form
17526 254446 116700 142049 12330 -96433 161763 83032 288305 255572 58051 191898 243533
17515 243533 92322 -183838 179029 -475887 53934 -9087 -73411 435408 79590 -170304 -99158
17504 -99158 155603 61825 7581 245236 46440 3243 84997 49566 256311 -209361 48480
17492 530451 214096 -40096 342180 141786 209844 -216 382110 68838 -139336 104028 150554
17481 150554 248279 47286 281385 22568 163577 -153925 177224 210317 -184919 -9146 78711
17469 164608 132258 273430 13569 40353 321108 69469 114247 151751 43469 180688 189131
17458 189131 287418 20714 390701 109183 154033 245526 209475 301905 463151 93589 327686
17447 327686 205904 286773 273014 299863 95270 212158 290051 288186 -38116 333174 228686
$$ packed form
17526B54446A16700K5349A2330i6433A61763p8731K05273l2733E8051J33847N1635
17515B43533I2322a83838A79029d75887E3934i087o4324D35408G9590a70304P1146
17504i9158A55603F1825G581K37655D6440C243Q1754l5431K06745b09361D8480
17492E30451B14096d0096C42180A41786O8058b16C82110F8838a39336A04028M6526
17481A50554R7725D7286K34099B2568J41009a53925A77224L3093a84919i146G8711
17469A64608l2350J41172A3569K6784K80755F9469M4778L7504D3469J37219Q443
17458A89131R8287B0714L69987A09183M4850R1493l6051R2430J61246I3589K34097
17447C27686j21782Q0869j3759K6849I5270J16888P7893j865c8116C33174j04488
$$ plain form
17436 228686 47104 -76399 -140735 523339 59057 245851 170049 -20655 303381 459288 -4858
17424 533658 289076 45143 140782 368742 443223 135969 175416 175506 286084 321136 168165
17413 168165 125909 62164 333032 184995 232829 300386 563344 -113832 182786 294729
17403 294729 94522 36180 65800 209756 173972 147443 59059 29202 644373 -239809 479390
17391 274106 -65412 655 572998 42810 40510 183066 112192 285189 7613 145983 -198012
17379 -102319 207512 169859 402635 157513 -152360 188509 27401 391868 322479 32803
17368 -114734 -3250 -2833 172203 383701 205887 598400 5867 115222 108005 -23000 -15327 -118950
17356 -118950 189160 -360367 79796 391649 232436 31905 181812 24469 80435 308144
$$ packed form
17436B28686D7104g6399o4336E23339E9057J86794p5802b0655C03381J55907d858
17424E33658k44582D5143R5639K27960P4481A35969L9447R0J10578L5052j52971
17413A68165m2256F2164K70868j48037M7834O7557K62958a13832A82786J11943
17403B94729I4522C6180K9620J43956l5784k6529E9059B9202O15171b39809D79390
17391B74106f5412F55N72343D2810k300J42556p0874J72997G613J38370a98012
17379a02319B07512l7653K32776A57513a52360A88509B7401L64467o9389C2803
17368a14734c250M17A72203K11498j77814L92513E867J09355p217b3000P673j03623
17356a18950A89160c60367G9796L11853j59213C1905J49907B4469N5966K27709
$$ plain form
17346 308144 95828 -73872 194240 234086 365629 -274056 115269 30246 19604 -17734 -114694
17335 -114694 341656 -117780 264664 -73228 -92376 203604 266216 199815 198620 230204 -70689
17323 311639 -154356 36468 136649 119590 64385 47426 385193 -46778 83027 232506 40172
17311 272942 316108 524658 -231138 241123 107505 112870 116853 -46999 322609 188101 182425
17300 182425 -148935 76784 372900 197541 -104823 -170575 -139148 131797 498472 77222
17289 191481 -122305 125293 12764 412876 -59735 221536 332125 161956 195821 597528
17279 597528 404961 150237 49139 324126 -16497 351055 468625 88407 370472 23974
17268 244781 246831 185595 230930 138610 271223 162470 379696 231249 479547 88585 87400
$$ packed form
17346C08144I5828g3872A94240L9846J31543b74056A15269C0246j0642a7734r6960
17335a14694C41656a17780B64664g3228j9148B03604O2612o6401j195L1584g0689
17323C11639a54356C6468J00181j7059n5205j6959L37767d6778H3027J49479D0172
17311B72942M3166K08550b31138B41123A07505N365L983d6999C22609j34508n676
17300A82425a48935G6784K96116j75359a04823o5752L1427A31797L66675G7222
17289A91481a22305A25293A2764M00112e9735B21536J10589A61956L3865M01707
17279E97528j92567A50237D9139K74987a6497C51055J17570H8407K82065B3974
17268B44781K050o1236M5335r2320J32613j08753K17226j48447K48298H8585j185
$$ plain form
17257 87400 412823 114458 184290 218237 264987 192776 110920 327688 501908 36385 71464
17246 71464 147607 306256 97961 19772 -193541 318691 352900 -34160 21716 269202 54463
17234 349980 271430 416703 241076 326411 323214 164540 303812 66316 106679 217008 -35606
17222 4565 107030 123862 125570 331682 249715 -20450 161689 15262 216111 387152 82678
17210 631248 189737 913 161865 87286 292985 87926 340532 237861 41171 32616 63915
17199 63915 214555 177358 482009 365570 440416 261580 271308 75149 -18807 358153 480818
17188 480818 185135 32542 223143 40178 -94811 524576 261666 -214866 281601 23619
17177 319811 203445 -97048 103263 200949 332916 -15126 163181 74574 196150 116746
$$ packed form
17257H7400L25423A14458O9832L3947M6750p2211q1856K16768J74220C6385L5079
17246G1464P6143J58649I7961A9772a93541C18691L4209c4160B1716K47486E4463
17234C49980p8550J45273j75627Q5335l197j58674J39272F6316M0363J10329c5606
17222D565J02465J6832J708K06112q1967b0450A61689A5262K00849J71041H2678
17210F31248A89737I13J60952p4579K05699H7926K52606j02671D1171q555L1299
17199F3915J50640l7197L04651j16439P4846j78836R728G5149a8807C58153J22665
17188D80818A85135C2542J90601D0178i4811E24576B61666b14866B81601B3619
17177C19811j16366i7048A03263R7686J31967a5126A63181G4574J21576p9404
$$ plain form
17167 116746 462158 162638 132951 249028 54280 271509 46691 194018 487658 470604
17157 470604 482604 22536 469026 155121 64123 100250 147637 344380 304810 439940 173288
17145 349636 247246 -216687 115018 432761 283365 165732 125965 220549 722165 349306
17134 353296 540092 325410 128935 -155465 329003 175557 370264 368333 579393 52282
17123 627489 440915 63418 461159 133046 256473 421208 405957 341064 177750 544939
17113 544939 198259 553365 370142 486262 238651 473235 305638 504160 291537 170320
17103 170320 200706 216986 182801 537611 27080 430559 514525 220117 410795 419064 211190
17092 211190 561771 569337 257396 679193 -226 590787 313068 179976 445274 510126 546608
$$ packed form
17167A16746L45412A62638k9687J16077E4280K17229D6691J47327K93640j7054
17157D70604J2000B2536M46490A55121F4123L6127M7387J96743l9570J35130A73288
17145C49636j02390b16687A15018L17743j49396j17633l9767R4584N01616C49306
17134C53296J86796k14682A28935a55465C29003j53446J94707j931K11060E2282
17123F27489j86574F3418L97741A33046J23427J64735j5251o4893j63314L67189
17113E44939A98259L55106j83223J16120B38651K34584j67597J98522k12623j21217
17103A70320L0386J6280l4185L54810B7080M03479Q3966B20117J90678Q269k07874
17092B11190L50581P566B57396M21797b26E90787k77719j33092K65298O4852L6482
$$ plain form
17081 546608 124064 740448 416644 466431 286672 185810 627809 77129 502425 384120
17071 384120 541537 295365 668637 351283 644727 391702 409612 749103 332757 632517
17061 632517 322607 555309 412661 472235 208266 452038 110128 768728 690166 370985
17051 370985 374624 359262 374810 367016 742080 468482 450653 821492 528060 562338 614484
17040 614484 487982 435804 480903 583244 469263 388655 784545 454877 738193 722060
17030 722060 884958 747795 328312 548823 753008 459580 574596 863583 807871 448423
17020 448423 356072 665952 876369 577256 567779 810759 565235 574484 736158 613230
17010 613230 814209 658476 1063741 921027 737322 651269 421091 746571 677544 831693
$$ packed form
17081E46608A24064O16384l23804M9787j79759j00862M41999G7129M25296j18305
17071C84120J57417k46172L73272l17354K93444k53025J7910L39491C32757K99760
17061F32517l09910K32702j42648N9574B08266K43772A10128O58600p8562l19181
17051C70985L639j5362J5548p794L75064k73598j7829L70839k93432L4278N2146
17040F14484j26502n2178M5099J02341j13981q0608L95890l29668K83316j6133
17030G22060J62898j37163C28312K20511K04185k93428J15016K88987n5712l59448
17020D48423r2351L09880K10417k99113r477K42980k45524R249J61674j22928
17010F13230K00979j55733M05265j42714j83705q6053k30178L25480o9027J54149
$$ plain form
17000 831693 825341 583115 752337 1256719 485054 486369 820811 574619 592487 848032
16990 848032 866373 542951 627088 748348 923077 704445 727668 921126 870903 1254128
16980 1254128 1079187 858227 835596 1132033 1016322 852792 1085877 884871 727689 845290
16970 845290 877762 888040 1048242 861916 890730 914632 856842 1113696 484388 1118579
16960 1118579 1078159 986794 928045 908304 958261 1078527 931359 998137 1286594 1312577 1213628
16949 1213628 903593 958865 1501278 1134601 1166728 872479 942462 993421 1282365 1034117
16939 1034117 1177097 1167105 683657 1112070 1155865 1462523 1229611 1184704 1343063 1492941
16929 1492941 1218978 1045881 1233104 1458296 1721810 1379336 1634281 1221232 1488621
$$ packed form
17000H31693o352k42226J69222N04382D85054J315L34442k46192J7868K55545
16990H48032J8341l23422Q4137J21260J74729k18632K3223J93458n0223L83225
16980A254128j74941k20960k2631K96437j15711j63530K33085k01006j57182J17601
16970H45290L2472J0278J60202j86326K8814K3902n7790K56854D84388O34191
16960A118579m0420r1365n8749j9741M9957J20266j47168O6778K88457K5983r8949
16949A213628l10035N5272N42413l66677L2127k94249O9983N0959K88944k48248
16939A034117J42980r992m83448M28413M3795L06658k32912m4907J58359J49878
16929A492941k73963j73097J87223K25192K63514l42474K54945m13049K67389
$$ plain form
16920 1488621 1444994 1894941 1395705 1472790 1444581 1494290 2025196 1872045 1659940 1276312
16910 1276312 1580295 1644906 1312020 1720057 1561600 1927071 1453631 1610093 1503009 1522704
16900 1522704 1750344 1970806 1827474 1741028 2034772 2157063 1756588 1746453 1758099 2104750
16890 2104750 2052486 2128602 1770582 1772248 1980222 2037942 1926051 2143034 2430832 2143566
16880 2143566 2068644 2124629 2113562 2385099 2023596 2386840 2172337 2361272 2330060 2460574
16870 2460574 2575099 2295541 2207278 2697360 2378885 2889070 2279641 2709403 2935942 2529398
16860 2529398 2955998 3166918 3010942 2873899 3184909 3166020 2842160 3266105 2888143 3359476
16850 3359476 3059064 3289445 3216039 3401586 3527366 3360560 3427726 3585453 3482927 3686086
$$ packed form
16920A488621m3627M49947m99236P7085k8209M9709N30906j53151k12105l83628
16910A276312L03983O4611l32886M08037j58457L65471m73440J56462j07084J9695
16900A522704K27640K20462j43332q6446K93744J22291m00475j0135J1646L46651
16890B104750n2264P6116l58020J666K07974N7720j11891K16983K87798k87266
16880B143566p4922N5985j1067K71537l61503L63244k14503J88935l1212J30514
16870B460574J14525k79558q8263M90082l18475N10185o09429M29762K26539m06544
16860B529398M26600K10920j55976j37043L11010j8889l23860M23945l77962M71333
16850C359476l00412K30381p3406J85547J25780j66806O7166J57727j02526K03159
$$ plain form
16840 3686086 3337214 3926652 3852518 3487929 4093551 3848765 3840153 4190134 4091639 4166714
16830 4166714 4155693 4504771 4570274 4854296 4922636 4732483 4905353 5065503 5351980 5060625
16820 5060625 5158062 5278107 5456090 5605675 5772955 5714911 6129879 5719182 6217601 6207316
16810 6207316 6362521 6756579 6617259 7000933 7241100 6916354 7486633 7845173 7487519
16801 7487519 8012879 7960106 8375668 8416947 8790591 8995021 9077390 9688925 9465692 9875806
16791 9875806 9940837 10256357 10557655 10982094 10884258 11642973 11746482 11970215 12503718 12695639
16781 12695639 13166365 13321816 13813770 14047264 14564708 15030347 15305991 15846727 16668564
16772 16668564 17291688 17632409 18384207 19177114 19607722 20036017 21023526 22174260 22853421
$$ packed form
16840C686086l48872N89438p4134l64589O05622k44786q612L49981r8495P5075
16830D166714j1021L49078O5503K84022O8340j90153J72870J60150K86477k91355
16820E060625R7437J20045J77983J49585J67280n8044M14968m10697M98419j0285
16810F207316J55205L94058j39320L83674K40167l24746N70279L58540l57654
16801G487519N25360n2773M15562M1279L73644K04430Q2369O11535k23233M10114
16791I875806O5031L15520L01298M24439r7836P58715J03509K23733N33503J91921
16781A2695639M70726J55451M91954K33494N17444M65639K75644N40736Q21837
16772A6668564O23124L40721P51798P92907M30608M28295R87509J150734O79161
$$ plain form
16763 22853421 23509441 24684779 25972563 26598478 27668185 29035976 30171426 31355058
16755 31355058 32543637 34222120 35635275 37093191 39452861 41285348 43253418 45440567
16747 45440567 47347558 50321097 52618952 56054972 58780545 61812330 65300516 68804009
16739 68804009 73347248 77683741 81855069 87012800 92131426 97796615 103298631 109688257
16731 109688257 115989271 122574020 129461887 136194858 143396524 150572381 157872376 164194128
16723 164194128 170775626 176353001 181096378 185407526 188062268 190209418 190856215 190300245
16715 190300245 188192201 185474354 181573082 176512374 171045820 164872966 157952235 150829957
16707 150829957 143840290 136628339 129623079 122383794 115689984 109014668 102956711 97053898
$$ packed form
16763B2853421O56020J175338J287784O25915J069707J367791J135450J183632
16755C1355058J188579J678483J413155J457916K359670J832487J968070K187149
16747D5440567J906991K973539K297855L436020K725573L031785L488186L503493
16739F8804009M543239M336493M171328N157731N118626N665189N502016O389626
16731A09688257O301014O584749O887867O732971P201666P175857P299995O321752
16723A64194128O581498N577375M743377M311148K654742K147150O46797n55970
16715A90300245k108044k717847l901272n060708n466554o172854o920731p122278
16707A50829957o989667p211951p005260p239285o693810o675316o057957n902813
$$ plain form
16699 97053898 91507680 86283751 81197181 76654215 72350358 68217456 64885026 61345130
16691 61345130 58037833 54591501 51926600 49222178 46672191 44419575 42329640 40161128
16683 40161128 38715101 36703690 34922267 33288487 32023127 30467863 29476196 28092250
16675 28092250 26689841 25776101 24662629 23711879 23193532 21918289 20896740 20404054 19311231
16666 19311231 18903239 18122422 17486443 16974856 16489624 16062958 15370565 14681640 14091254
16657 14091254 13693544 13729777 12944184 12558695 12092032 11938059 11700468 11179931 10470629
16648 10470629 10683451 10165248 10553221 9573835 9155974 8878552 9045145 9068276 8426561
16639 8426561 8278933 7660857 7741629 7511868 7921428 7247452 7341261 6858820 6694352 6738765
$$ packed form
16699I7053898n546218n223929n086570m542966m303857m132902l332430l539896
16691F1345130l307297l446332k664901k704422k549987k252616k089935k168512
16683D0161128j446027k011411j781423j633780j265360j555264r91667j383946
16675B8092250j402409r13740j113472r50750n18347j275243j021549m92686j092823
16666A9311231m07992p80817o35979n11587m85232m26666o92393o88925n90386
16657A4091254l97710L6233p85593l85489m66663j53973k37591n20537p09302
16648A0470629K12822n18203L87973r79386m17861k77422J66593K3131o41715
16639H426561j47628o18076Q0772k29761M09560o73976R3809m82441j64468M4413
$$ plain form
16629 6738765 6077984 5996099 6144647 6079526 5695801 5710182 5475272 5783486 5201936 5350402
16619 5350402 5158653 5096045 4862542 5247190 5002190 4749475 4669511 4420540 4854239 4301920
16609 4301920 4163829 4250891 3859831 4166694 3882651 4352426 4130199 3859491 3647874 3479688
16599 3479688 3473100 3453058 3186445 3387443 3510630 3128065 3125778 2969903 2485574 3199245
16589 3199245 3013063 2852241 2901222 2657035 2906016 2840588 2985598 2814202 2424789 2897774
16579 2897774 2787902 2275548 2495501 2626393 2688571 2646312 2462728 2410895 2406566 2350695
16569 2350695 2484391 2543028 2150913 1890337 1827897 2153590 2201056 2005079 2095277 2121525
16559 2121525 1956712 2018124 1846090 1907798 2032864 1879268 1826900 2079801 1829279 1739686
$$ packed form
16629F738765o60781q1885J48548o5121l83725J4381k34910L08214n81550J48466
16619E350402j91749o2608k33503L84648k45000k52715p9964k48971M33699n52319
16609D301920j38091Q7062l91060L06863k84043M69775k22227k70708k11617j68186
16599C479688o588k0042k66613K00998J23187l82565k287j55875m84329P13671
16589C199245j86182j60822M8981k44187K48981o5428J45010j71396l89413M72985
16579B897774j09872n12354K19953J30892O2178m2259j83584n1833m329n5871
16569B350695J33696N8637l92115k60576o2440L25693M7466j95977R0198K6248
16559B121525j64813O1412j72034O1708J25066j53596n2368K52901k50522q9593
$$ plain form
16549 1739686 1692078 2031692 1772612 1813923 1760872 2005042 1278651 1626560 1481473 1593630
16539 1593630 1718405 1442911 1168483 1677038 1397940 1503598 1406151 1503826 1313245 1590153
16529 1590153 1508559 1053456 1229280 1547652 1230628 1163244 1489633 1173374 1338912 1182956
16519 1182956 1430359 1295049 998435 1357104 1179123 1137782 924697 1183105 1089023 770381
16509 770381 1034706 926820 1080438 969059 944393 931116 1142556 941329 981470 711372
16499 711372 678709 841875 972255 735127 1084386 1168159 914134 963121 1100181 990843
16489 990843 929574 734809 1080655 1016284 650306 632761 840621 604714 1183816 772934
16479 772934 925566 966540 610919 748749 820986 1023343 813424 1011048 763703 498274
$$ packed form
16549A739686m7608L39614k59080M1311n3051K44170p26391L47909j45087J12157
16539A593630J24775k75494k74428N08555k79098J05658r7447R7675j90581K76908
16529A590153q1594m55103J75824L18372l17024o7384L26389l16259J65538j55956
16519A182956K47403j35310k96614L58669j77981m1341k13085K58408r4082l18642
16509G70381K64325j07886J53618j11379k4666j3277K11440k01227M0141k70098
16499G11372l2663J63166J30380k37128L49259Q3773k54025M8987J37060j09338
16489I90843o1269j94765L45846o4371l65978j7545K07860k35907N79102m10882
16479G72934J52632M0974l55621J37830P2237K02357k09919J97624k47345k65429
$$ plain form
16469 498274 744177 846338 838557 729305 1044263 621640 738703 403881 696656 676269
16459 676269 355767 606410 814079 623040 619479 691303 509462 353447 579795 517470
16449 517470 832127 669228 532241 757746 834484 608008 476440 585082 529430 370481
16439 370481 775187 516206 664844 384937 477078 249625 366826 421799 536299 587923
16429 587923 588780 541807 433649 673773 393648 108997 677482 396216 617687 311044
16419 311044 612714 488998 569906 248134 488492 408428 395234 518842 382064 244245
16409 244245 158224 541008 412156 495282 441912 422315 697437 541717 880176 220166
16398 591567 608378 600329 522731 521060 295425 432591 365752 598362 116623 317077 199440
$$ packed form
16469D98274K45903J02161p781j09252L14958m22623J17063l34822K92775k0387
16459F76269l20502K50643K07669j91039l561P1824j81841j56015K26348o2325
16449E17470L14657j62899j36987K25505P6738k26476j31568J08642n5652j58949
16439C70481M04706k58981J48638k79907R2141k27453J17201N4973J14500N1624
16429E87923Q57m6973j08158K40124k80125A08997N68485k81266K21471l06643
16419C11044L01670j23716Q0908B48134K40358q0064j3194J23608j36778j37819
16409B44245q6021L82784j28852Q3126n3370j9597K75122j55720L38459B20166
16398E91567J6811q049p7598j671k25635J37166o6839K32610A16623K00454j17637
$$ plain form
16387 199440 542488 244533 638412 56547 618017 389683 485886 563223 20206 348975
16377 348975 241270 326671 488164 475712 702852 483607 415390 407793 502333 456824 296587
16366 296587 219632 263086 310361 254176 475811 -286172 228239 227994 325061 -12629 274231
16354 263453 396232 531464 340749 506012 224836 272681 261701 -24471 328129 97158
16343 669739 558343 -8725 416972 292535 313753 227437 556315 379381 252453 309324
16333 309324 123096 285184 169505 456973 63505 346045 -60261 292444 195133 -113338
16322 245289 190513 15495 186598 35238 416406 142571 664337 239731 196687 574563
16312 574563 345157 409123 123003 263390 270961 338110 112903 84385 452703 -45194 318934
$$ packed form
16387A99440L43048B44533L93879E6547N61470k28334R6203P7337B0206L28769
16377C48975j07705Q5401J61493j2452K27140k19245o8217p597R4540m5509j60237
16366B96587p6955M3454M7275n6185K21635b86172B28239k45R7067a2629B74231
16354B63453J32779J35232j90715J65263B24836M7845j0980b4471C28129I7158
16343F69739j11396h725D16972j24437K1218q6316L28878j76934j26928N6871
16333C09324A23096J62088j15679K87468F3505K82540f0261B92444r7311a13338
16322B45289n4776A5495J71103C5238L81168A42571N21766B39731m3044L77876
16312E74563k29406O3966A23003J40387P571O7149A12903k8518L68318d5194C18934
$$ plain form
16300 89235 230141 305421 -146502 13880 78255 114321 -50065 101811 293604 -31345 163765
16288 254806 207953 146970 220905 143593 166045 354209 -98197 410794 539009 197472 402158
16277 402158 234452 188626 134735 157835 359745 236126 -103459 -70892 51827 283364
16267 283364 120661 81077 -224079 -69176 -95732 164959 92433 201484 412854 -32876
16256 -32661 339733 92743 270439 49543 18357 240023 66904 129525 -8337 319679 259016
16245 259016 -63627 344898 46327 -31981 10317 43209 397768 211004 288509 313386 86249
16233 297894 25492 1199 38446 266129 16656 186983 339299 559998 317925 104974
16222 -72335 126511 204477 -72680 -106489 60110 -12952 271265 130843 281450 -90860 233072
$$ packed form
16300H9235J40906P5280a46502A3880O4375L6066e0065A01811J91793c1345A63765
16288B54806m6853o0983P3935p7312K2452J88164i8197D10794J28215A97472K04686
16277D02158j67706m5826n3891K3100K01910j23619a03459L2567E1827K31537
16267B83364A20661l9584b24079f9176k6556A64959p2526J09051K11370c2876
16256c2661C39733I2743J77696D9543A8357K21666F6904O2621h337C19679o0663
16245B59016f3627C44898D6327c1981A0317L2892L54559j86764P7505K4877H6249
16233B97894B5492A199L7247K27683A6656J70327J52316K20699k42073A04974
16222g2335A26511P7966g2680l3809F0110a2952B71265A30843J50607i0860B33072
$$ plain form
16210 -2726 434030 220302 -198070 -152316 75594 400712 91077 -66309 -269897 41153 536867
16199 536867 180901 6468 53120 130849 117314 139215 -114531 233080 -88882 265311 55120
16187 56036 -54883 153564 425087 206942 159120 84667 199969 197416 3897 325591 312791
16176 312791 113660 79561 347431 545570 259797 155116 -14058 53923 -78214 12880
16165 343906 344949 238362 256622 122911 258323 80614 -156850 156944 23489 184597
16155 184597 60738 -49240 -264602 116272 -157551 279553 305277 200001 140203 116987
16145 116987 249905 -168077 222991 125112 33301 -5518 135969 161414 12985 -52919 -207566
16134 -207566 -256373 189562 -13269 -196381 244056 136605 81093 51358 -96984 193616
$$ packed form
16210b726D34030k13728a98070M5754G5594L25118I1077f6309k03588D1153M95714
16199E36867A80901F468M6652P7729j3535K1901a14531B33080h8882B65311E5120
16187E6036e4883A53564K71523B06942m7822p4453J15302k553C897L21694j2800
16176C12791A13660l4099K67870J98139B59797j04681a4058E3923g8214A2880
16165C43906J043j06587J8260A22911J35412H0614a56850A56944B3489J61108
16155A84597F0738d9240k15362A16272a57551B79553K5724j05276n9798k3216
16145A16987J32918a68077B22991r7879C3301e518A35969K5445A2985e2919j54647
16134b07566m8807A89562a3269j83112B44056j07451n5512k9735i6984A93616
$$ plain form
16123 86040 -176618 23516 -131426 75682 146440 282835 287483 257047 -54291 106317 1301
16111 24956 -151347 -58800 -80869 122285 1837 235423 37664 -218759 138656 372492 104706
16099 -85460 204340 115487 241551 200534 130187 -18635 19458 -13294 -116373 -105153 -62730
16088 -62730 -296945 13010 4118 102926 168631 -263543 307281 84092 -388309 208738 50143
16076 -449219 132647 -66016 39972 189122 -233900 -306194 -258992 -12602 -170166 437744
16065 47466 210030 193725 30214 112126 -186601 -48084 -16741 -471859 -47398 135482 161745
16054 161745 126324 -42877 248843 43351 139680 -218746 250182 -53021 53768 -187040 -246175
16043 -246175 134931 73557 -137205 -89628 -65097 212317 134223 -93732 313680 363985 -177642
$$ packed form
16123H6040a76618B3516a31426G5682P0758J36395M648l0436e4291A06317A301
16111B4956a51347e8800k2069A22285A837K33586C7664b18759A38656K33836A04706
16099h5460B04340q8853J26064m1017p0347a8635A9458a3294j03079J1220M2423
16088f2730k34215A3010D118R8808O5705b63543C07281H4092c88309B08738E0143
16076d49219A32647f6016C9972J49150b33900p2294M7202a2602j57564D37744
16065D7466J62564j6305C0214Q1912a86601d8084a6741m55118d7398A35482K6263
16054A61745l5421d2877B48843D3351R6329b18746B50182e3021E3768a87040n9135
16043b46175A34931o1374a37205M7577K4531B12317p8094i3732C13680N0305a77642
$$ plain form
16031 65491 48467 -36969 23817 -8539 -18452 197019 -298298 -25512 -23208 -39128 -70496 108585
16018 -28993 -535534 411245 -56729 18981 -249800 17822 108765 -2382 -191937 -135283 -20333
16006 199373 -111839 -179215 -273077 -7290 225042 -121780 -223785 42120 112386 -171625 -138701
15995 -138701 119495 112446 26651 -155603 -172466 156236 87147 171451 28018 182846 98236
15984 98236 230154 187755 126164 613441 455538 100022 93240 224364 7866 -142880 257648
15972 -71815 -110474 98654 307 -139964 -86241 36017 -139124 -2675 101621 -187762 188137
15960 -223685 -62378 -67059 143996 96078 -383130 -44289 92280 62982 -87050 -158772 -196615
15949 -196615 -56866 -169790 30655 -390902 135137 37519 -142088 -136403 184496 -85045 62010
$$ packed form
16031F5491j7024c6969B3817h539r913A97019b98298b5512K304j5920l1368A08585
16018b8993n06541D11245e6729A8981b49800A7822R0943b382j89555N6654b0333
16006A99373a11839o7376r3862g290B25042a21780j02005D2120P0266a71625L2924
15995a38701A19495p049B6651a55603j6863A56236o9089Q4304B8018J54828q4610
15984I8236J31918m2399o1591M87277j57903A00022o782J31124G866a42880B57648
15972g1815l8659I8654C07a39964N3723C6017a39124b675A01621a87762A88137
15960b23685f2378m681A43996m7918c83130d4289I2280k9298h7050p1722l7843
15949a96615e6866j12924C0655c90902A35137C7519a42088N685A84496h5045F2010
$$ plain form
15937 185947 39629 -187556 -210197 126711 55996 176112 -245276 17904 -80316 -190552
15927 -190552 163560 83613 -19335 -91613 -238875 447986 -92543 127713 -306394 -462576
15917 -462576 7196 -340660 -182693 -171416 -150331 93864 80115 -162713 -298527 -73863 -13620
15905 24294 -23017 -30633 -61629 -54245 -40700 138469 27141 -186179 108376 -48216 45191
15893 -265045 -142009 365535 -20102 -165257 -98234 -157685 292813 -164987 4227 51192 203945
15882 203945 228806 -168012 387121 44917 175685 -10046 -175029 -163872 -105195 -27908 507
15870 242073 -308578 -193089 -126558 -65054 -167954 16766 -285949 136567 -212056 -191706
15860 -191706 -143745 -171388 -111318 285527 -80957 166108 -113362 -72715 262588 117299
$$ packed form
15937A85947C9629a87556k2641A26711E5996J20116b45276A7904h0316j10236
15927a90552A63560p9947a9335p2278j47262D47986i2543A27713c06394j56182
15917d62576G196c40660J57967J1277K1085I3864j3749a62713j35814g3863a3620
15905B4294b3017p616l0996P384J3545A38469B7141a86179A08376d8216D5191
15893b65045J23036C65535b0102j45155O7023n9451B92813a64987D227M6965J52753
15882B03945K4861a68012C87121D4917J30768a0046j64983J1157N8677b7908E07
15870B42073c08578J15489O6531O1504j02900A6766b85949A36567b12056K0350
15860a91706M7961k7643O0070B85527h0957A66108a13362M0647B62588A17299
$$ plain form
15849 84125 -69939 57831 46489 104021 194047 53187 -167299 -112103 164369 -131379 68742
15837 -33701 64003 228192 367051 44136 96348 -34308 -262834 11918 -416901 23472 78031
15826 78031 146148 -85386 -86760 -22184 -56403 58024 -35627 172 34430 -175845 36874 151356
15814 151356 -159836 1129 -222898 130978 -14563 -120489 15189 49677 -41881 -66185 -180842
15803 -180842 -93409 173215 -240561 5493 -188769 208007 97476 -5067 -332304 -210447 -26271
15791 -201165 63684 -226275 50574 -182164 -73963 -8179 -101888 7125 48496 320835 -291666
15779 -182000 -533389 -325219 96379 49485 90617 216178 -4270 -58820 -182202 -39311 -130848
15768 -130848 11119 -115492 53195 -169043 -46066 2636 108252 -101091 118262 95498 461347
$$ packed form
15849H4125f9939E7831j1342N7532R0026E3187a67299N5196A64369a31379F8742
15837c3701F4003J64189J38859D4136N2212c4308k28526A1918d16901B3472N4559
15826G8031O8117h5386j374b2184l4219E8024c5627A72L4258a75845C6874J14482
15814A51356a59836A129b22898A30978a4563j05926A5189L4488d1881k4304j14657
15803a80842Q7433A73215b40561E493a88769B08007I7476e067l27237J21857b6271
15791b01165F3684b26275E0574a82164g3963h179r3709G125M1371K72339b91666
15779a82000l51389K08170I6379m6894M1132J25561d270n4550j23382c9311r1537
15768a30848A1119a15492E3195a69043d6066B636J05616a01091A18262k2764L65849
$$ plain form
15757 461347 86472 -82288 -341504 624 81677 -213052 68899 1917 329159 19241 -269536
15745 -129472 187617 146911 214535 -137796 -146109 347022 -2535 -204055 -163557 -131478 124087
15733 -213560 -188526 -53814 -39006 -32825 -154328 138520 -115160 60316 119985 11789 -152040
15721 132033 -22555 53297 -228371 -97446 -112420 344204 16973 -121052 110069 -63423 -171186
15710 -171186 -39220 51834 261 -79683 -234310 -28125 191067 -69409 98902 129138 -183403
15698 181514 66999 -35631 -142019 236600 -160736 47508 -146072 -4936 447031 -97124 -30388
15686 -199757 50381 90574 133916 118003 174593 -363014 205253 -45266 307960 -10506 -222137
15675 -222137 -26830 40843 60656 -129866 112356 162210 -113361 127578 -189721 -106730
$$ packed form
15757D61347H6472h2288k59216F24Q1053b13052F8899A917L27242A9241b69536
15745a29472A87617m0706O7624a37796q313C47022b535k01520M0498L2079A24087
15733b13560K5034e3814J4808O181j21503A38520a15160F0316N9669A1789a52040
15721A32033b2555E3297b28371i7446j4974C44204A6973a21052A10069f3423j07763
15710a71186c9220E1834B61g9683j54627b8125A91067f9409I8902L0236a83403
15698A81514F6999c5631j06388B36600a60736D7508a46072d936D47031i7124c0388
15686a99757E0381M0193M3342j5913N6590c63014B05253d5266C07960a0506k11631
15675b22137b6830D0843J9813a29866A12356M9854a13361A27578a89721Q2991
$$ plain form
15665 -106730 -335478 -393938 61810 176604 384128 -4869 -171474 -115398 -132107 147736 155039
15654 155039 9901 -215005 413243 -159204 69189 28479 4529 38722 -131975 4990 -93606
15642 -225366 278466 3229 143851 204417 -75427 -7603 13152 236095 -152092 -56196 113630
15630 84442 -188152 30674 -90060 310564 126891 -208812 -180979 -86036 158129 62677 -16188
15618 58036 -72728 -258297 86845 -60508 -105493 -107027 -406280 108999 -267226 -34486 322081
15606 -55193 -247094 -19613 40536 -114900 -140039 381799 -63528 -87371 145179 -7447 -184488
15595 -184488 -100736 -345819 256422 84297 -98314 19534 -15493 -144622 -233887 300437 -172015
15583 -223159 -112714 -32224 -231010 -134782 231274 -116592 189826 -66512 -255284 81562
$$ packed form
15665a06730k28748n8460F1810J14794K07524d869j66605N6076j6709A47736P303
15654A55039I901b15005D13243a59204F9189B8479D529L4193a31975D990i3606
15642b25366B78466C229J40622O0566g5427g603A3152K22943a52092e6196A13630
15630H4442a88152C0674i0060C10564A26891b08812K7833h6036A58129F2677a6188
15618E8036g2728j85569H6845f0508m4985j534k99253A08999b67226c4486C22081
15606e5193j91901a9613D0536a14900k5139C81799f3528k3843A45179g447j77041
15595a84488Q3752k45083B56422H4297i8314A9534a5493j29129q9265C00437a72015
15583b23159J10445c2224j98786R6228B31274a16592A89826f6512j88772H1562
$$ plain form
15572 -46136 -23924 -185546 -10913 -103926 159367 -261338 -190505 -107458 106280 50169 123152
15561 123152 -160305 22869 44736 -17355 212143 -176543 -128099 39385 -26979 -189135 -287633
15550 -287633 37803 136193 166491 45652 -181257 386121 -180986 -696 -126491 -151434 203807
15538 85885 155143 -10086 -104036 -123721 182367 69151 118644 -45976 176185 5134 80176
15527 80176 -254959 -265711 314431 -107158 40348 -126350 -102182 -109406 -186936 36353 -167706
15515 -90687 -585166 223778 -20021 71853 -173772 -60812 -104004 -162649 -30682 -31137 24214
15503 -339391 -80632 57533 -149537 139933 -232627 68287 284164 -132138 107310 246900
15493 246900 225236 156439 -151982 -170762 364163 54698 58036 2545 -250916 -31172 -166341
$$ packed form
15572d6136K2212j61622a0913r3013A59367b61338P0833Q3047A06280E0169P2983
15561A23152a60305B2869K1867a7355B12143a76543M8444C9385b6979j62156r8498
15550b87633C7803R8390L0298D5652a81257C86121a80986f96j25795k4943B03807
15538H5885O9258a0086r3950j9685A82367F9151M9493d5976A76185E134P5042
15527H0176b54959j0752C14431a07158D0348a26350K4168p224p7530C6353a67706
15515i0687m94479B23778b0021G1853a73772f0812m3192n8645c0682m55B4214
15503c39391h0632E7533a49537A39933b32627F8287K15877a32138A07310J39590
15493B46900k1664o8797a51982j8780C64163E4698L338B545b50916c1172j35169
$$ plain form
15482 -166341 241745 196393 -132286 112344 53089 49475 -3909 41561 -33581 43971 84972
15471 84972 -115835 61457 -153996 -262241 92632 50550 -32863 -1892 -93698 329192 -81112
15459 -410544 53121 -55595 -502063 127588 -7011 249643 -55957 -145289 -47612 -278122 147761
15447 -46137 -29195 -99113 31888 -70463 -147423 135961 161231 -103068 -44770 -169086 73710
15435 472006 292128 -146950 -15879 -47222 169090 -6391 7706 258895 -255078 16303 13553
15424 13553 -82771 -261920 44857 69868 -5976 -30477 -127526 264868 48435 322739 -339311
15412 223920 235944 286953 124831 153925 -210663 -174367 -112675 47866 77634 32231 18002
15401 18002 191635 100725 81139 -207049 9148 83967 74511 -411507 -57680 -232029 -35522
$$ packed form
15482a66341B41745m5352a32286A12344E3089l614c909D1561c3581D3971M1001
15471H4972a15835F1457a53996j08245I2632m2082c2863a892r1806C29192h1112
15459d10544E3121e5595m46468A27588g011B49643e5957q9332d7612k30510A47761
15447d6137J6942o9918C1888g0463p6960A35961K5270a03068d4770j24316G3710
15435D72006j79878a46950a5879l1343A69090f391G706K51189b55078A6303k750
15424A3553h2771j79149D4857K5011e976k4501r7049B64868D8435K74304c39311
15412B23920J2024N1009A24831K9094b10663L6296O1692D7866K9768C2231j4229
15401A8002J73633r0910j9586b07049I148P4819r456d11507e7680j74349c5522
$$ plain form
15389 249761 -24002 153097 149298 8368 198175 -90802 -166463 133440 -115809 79105 107368
15378 107368 79683 -114292 184518 -117400 27917 71496 -243072 21113 -159307 -216898
15368 -216898 118448 -161830 -213189 132413 -51680 -91968 -71406 -206225 -29537 88909 -206550
15356 139205 109396 246123 62328 -190943 250970 167841 69105 14618 334354 235025 80167
15344 106506 126964 163639 104406 -9730 176611 164972 134020 -352306 68200 -163564 359680
15332 -22898 164081 212208 -45040 -101513 246986 94008 -60039 121115 137194 161022 69482
15320 -49979 326573 -40618 28758 306490 187397 380598 -88755 146745 51235 201438
15310 201438 -4269 231563 -7344 -121450 98073 -37953 -67606 -41677 105459 39775 -165280
$$ packed form
15389B49761b4002A53097l799H368J89807i0802p5661A33440a15809G9105K8263
15378A07368k7685a14292A84518a17400B7917M3579b43072B1113a59307n7591
15368b16898A18448a61830n1359A32413e1680m0288K0562j34819b9537H8909b06550
15356A39205k9809J36727F2328a90943B50970q3129F9105A4618L19736r9329H0167
15344A06506K0458L6675n9233i730A76611j1639l0952c52306F8200a63564C59680
15332b2898A64081M8127d5040n6473B46986I4008f0039A21115J6079K3828F9482
15320d9979C26573d0618B8758K77732j19093J93201h8755A46745E1235J50203
15310B01438d269B31563g344j14106I8073c7953k9653K5929A05459C9775a65280
$$ plain form
15298 47017 -397241 -211319 28021 125171 43278 -217335 117439 174185 44030 -83076 42745
15286 35644 28174 -74455 105037 -148081 -127479 317805 -15616 -103351 -30515 56659 120992
15275 120992 -20759 -140494 326766 -4129 350622 259380 -78041 -120703 12028 316951 -140641
15263 -283398 -43558 -16906 122010 -34998 -52037 198683 -949 67851 240659 154417 270030
15252 270030 334121 115083 550681 547576 1258838 1057120 1417258 1181401 762587 193193
15241 427360 43177 -104584 321924 -83569 99028 224844 56411 -37201 -114081 327216 -158369
15229 408993 62509 134507 -51434 358540 -39998 176325 45817 161068 -35028 33876 72409
15218 72409 205117 339034 -111093 50728 -9926 21033 -30447 -95834 138913 -31702 283023
$$ packed form
15298D7017c97241J85922B8021R7150D3278b17335A17439N6746D4030h3076D2745
15286C5644p470g4455A05037a48081K0602C17805a5616q7735c0515E6659O4333
15275A20992b0759j19735C26766d129C50622r1242g8041m2662A2028L04923a40641
15263b83398d3558a6906A22010c4998j7039A98683i49F7851J72808q6242J15613
15252B70030O4091A15083M35598l105P11262k01718L60138k35857m18814A93193
15241D27360D3177a04584C21924h3569I9028J25816E6411c7201p6880C27216a58369
15229D08993F2509P1998e1434C58540c9998A76325D5817J15251c5028C3876L8533
15218G2409J32708J33917a11093E0728i926B1033c0447o5387A38913c1702B83023
$$ plain form
15206 -139093 -71688 195007 -140367 14718 167047 3629 183520 84978 49052 -118592 161845
15194 -69165 -19847 162257 65147 71215 75213 6445 -139806 -132446 20145 -226296 -74191 129513
15181 130781 -74154 22845 1608 183821 209778 299779 184952 50096 322982 172650 -132625
15169 118228 -33246 60797 148424 52974 112535 275295 224861 267203 51021 239413 191813
15158 191813 218315 364258 -219642 88466 266805 79742 -108884 -72708 248966 49985
15147 185070 7411 94499 -77354 -1248 150080 89516 -45945 180964 60493 341269 254440
15136 254440 237788 124692 80387 413243 211413 210495 184213 -16673 -95499 454855 260339
15125 260339 -77494 229955 140904 222540 101927 136627 -275830 174955 44426 -39263 419688
$$ packed form
15206a39093O7405A95007a40367A4718J52329C629J79891H4978l5926a18592A61845
15194f9165a9847A62257F5147O068L998F445a39806P360B0145b26296g4191A29513
15181A30781g4154B2845A608J82213K5957R0001j14827E0096K72886j50332a32625
15169A18228c3246F0797Q7627E2974N9561J62760n0434M2342E1021J88392m7600
15158A91813K6502J45943b19642H8466J78339G9742a08884L6176B48966D9985
15147A85070G411Q7088g7354a248A50080o0564d5945A80964F0493K80776q6829
15136B54440j6652j13096m4305L32856k01830r18k6282a6673p8826D54855j94516
15125B60339g7494B29955q9051Q1636A01927L4700b75830A74955D4426c9263D19688
$$ plain form
15113 211563 -187783 -4334 82529 -15477 106889 -218051 182166 388746 155225 373104
15103 373104 4752 23939 201439 -21526 132326 55592 259761 125765 50182 -25615 -195697
15092 -195697 142549 45140 -2899 -3845 302418 67493 68886 133067 320850 70632 -21709 -90957
15080 -90957 222102 95152 375449 15343 347941 214445 324700 404704 378976 180022
15069 137667 282927 79934 -62052 419333 334617 322389 -219573 225680 61839 444341
15059 444341 -32342 140777 58555 286567 359115 209705 145795 -4883 402876 -17539 272999
15047 101373 136473 -49192 139078 22738 -4732 -7248 64872 418737 224472 -46783 105741
15035 125572 -6463 -106841 -80013 296646 652 193981 25524 -164240 409614 -107576 202087
$$ packed form
15113B11563a87783d334H2529a5477A06889b18051A82166K06580A55225K17879
15103C73104D752J9187J77500b1526A32326E5592K04169A25765E0182b5615j70082
15092a95697A42549D5140b899r46C02418F7493J393O4181J87783G0632b1709o9248
15080i0957B22102I5152K80297A5343L32598j33496J10255Q0004k5728A80022
15069A37667J45260G9934f2052D19333q4716j2228b19573B25680F1839L82502
15059D44341c2342A40777E8555K28012P2548j49410o3910d883D02876a7539B72999
15047A01373L5100d9192A39078B2738d732k516F4872L53865j94265d6783A05741
15035A25572f463j00378K6828B96646F52J93329B5524a64240D09614a07576B02087
$$ plain form
15023 244497 289581 57842 303820 424562 386252 81888 172989 426923 160204 391724
15013 391724 131241 309621 282829 94713 195138 584330 476633 385614 112620 117263
15003 117263 352303 99712 -26957 246295 -26308 543508 370542 -162427 458769 372976
14993 372976 102199 314705 146446 471794 128297 380155 162582 118684 287075 266477
14983 266477 160296 134633 345341 330907 506494 50247 -22520 198961 13332 401869
14973 401869 158105 443266 401586 -543 97646 185749 44580 443706 344342 373592 88208
14961 71692 -7197 359216 212021 226865 -35715 377518 325836 154400 437525 11543 129526
14950 129526 249893 333215 351990 251294 -47418 701481 211717 222865 44685 195064
$$ packed form
15023B44497M5084E7842K45978J20742l8310H1888R1101K53934A60204K31520
15013C91724A31241J78380k6792I4713J00425L89192j07697r1019A12620M643
15003A17263K35040I9712b6957B46295b6308E43508j72966a62427D58769q5793
14993C72976A02199K12506A46446L25348A28297K51858A62582m3898J68391k0598
14983B66477j06181k5663K10708j4434J75587E0247b2520A98961A3332L88537
14973D01869A58105K85161m1680e43I7646Q8103D4580L99126r9364K9250H8208
14961G1692g197C59216j47195J4844c5715C77518n1682A54400K83125A1543J17983
14950A29526J20367Q3322J8775j00696d7418G01481B11717J1148D4685J50379
$$ plain form
14940 195064 576249 -278295 302022 224553 469814 385372 389233 339605 616346 380379
14930 380379 420694 556449 156648 191042 204580 173945 397051 363775 252880 271770 477677
14919 477677 488578 241379 261250 206884 120667 320778 276535 235902 101233 463930 301149
14908 301149 267363 258588 113867 148730 217805 566689 226171 528699 121297 508291
14898 508291 15916 133381 496119 102842 829149 667129 280107 511751 520826 439296
14888 439296 392674 399688 142356 159820 135578 571087 159492 312869 131296 202947 376635
14877 376635 83346 200836 699966 681945 455468 759645 427803 -164822 73450 206214
14867 206214 27549 279596 626525 245727 788545 350364 678931 247225 443385 523948
$$ packed form
14940A95064L81185b78295C02022p7469K45261q4442L861m9628K76741k35967
14930C80379M0315J35755A56648L4394J3538l0635K23106l3276j10895J8890K05907
14919D77677J0901B41379J9871n4366q6217K00111m4243m0633A01233L62697j62781
14908C01149l3786q775A13867L4863O9075L48884B26171L02528A21297L86994
14898E08291A5916J17465L62738A02842P26307j62020B80107K31644R075q1530
14888D39296m6622P014A42356J7464k4242M35509A59492J53377A31296P1651J73688
14877C76635H3346J17490M99130j8021k26477L04177l31842a64822G3450J32764
14867B06214B7549K52047L46929B45727N42818C50364L28567B47225J96160Q0563
$$ plain form
14857 523948 129195 250208 461198 449423 263414 314663 447325 816482 251311 344340
14847 344340 392813 294297 356860 400979 401644 476629 388579 506013 408206 654672 491800
14836 491800 619396 602433 540796 420311 437191 660832 619587 700631 580224 602761 518762
14825 518762 571874 399824 702837 508732 602518 888739 347182 582144 771038 610246
14815 610246 875069 665833 555466 650452 481350 474885 259364 389409 581848 364808
14805 364808 352375 613173 380870 672753 268742 660531 619341 639491 296734 406156
14795 406156 784734 618242 791513 530538 546384 305422 623775 230588 783597 349097
14784 738248 290278 491658 545230 336648 478026 742669 624522 517360 489992 675302
$$ packed form
14857E23948A29195J21013K10990j1775j86009N1249J32662L69157B51311R3029
14847C44340M8473r8516O2563M4119O65P4985q8050J17434r7807K46466j62872
14836D91800J27596j6963o1637j20485J6880K23641m1245Q1044j20407K2537q3999
14825E18762N3112j72050L03013j94105R3786K86221C47182K34962J88894j60792
14815F10246K64823k09236j10367R4986j69102o465k15521J30045J92439k17040
14805C64808j2433K60798k32303K91883B68742L91789m1190K0150B96734J09422
14795D06156L78578j66492J73271k60975J5846k40962L18353B30588N53009C49097
14784G38248B90278K01380N3572k08582J41378K64643j18147j07162k7368J85310
$$ plain form
14774 675302 449930 573787 524053 367446 657866 663656 673877 631220 440393 633510
14764 633510 811035 600588 556934 641708 742122 388464 812583 748216 796589 539646
14754 539646 793637 488239 753806 640610 441968 759130 934632 785037 843410 771015
14744 771015 495094 495944 868823 582836 690564 827083 882087 315185 1119183 1000235
14734 1000235 652808 806433 858485 615984 555865 968734 734918 898954 921065 869842
14724 869842 597311 797243 655057 551793 1220179 597375 754921 1029972 620007 758562
14714 758562 925521 533182 787280 889532 708124 856968 469503 654301 1029680 979373
14704 979373 766934 984086 957367 856148 1046388 1139915 765101 733358 1047726 1115695
$$ packed form
14774F75302k25372J23857m9734j56607K90420N790J0221m2657j90827J93117
14764F33510J77525k10447m3654Q4774J00414l53658M24119o4367M8373k56943
14754E39646K53991l05398K65567j13196j98642L17162J75502j49595N8373p2395
14744G71015k75921Q50L72879k85987J07728J36519N5004C15185Q03998j18948
14734A000235l47427J53625N2052k42501o0119M12869k33816J64036K2111n1223
14724H69842k72531J99932j42186j03264O68386E97375J57546K75051m09965J38555
14714G58562J66959l92339K54098J02252j81408J48844l87465J84798L75379n0307
14704I79373k12439K17152k6719j01219J90240R3527l74814l1743L14368O7969
$$ plain form
14694 1115695 899191 969102 1063674 996809 860691 892189 1024299 708180 1004161 1100217
14684 1100217 1144000 859023 1208580 729164 973507 963245 1089212 851185 1168767 977761
14674 977761 960659 969470 1148129 1166015 1250680 984351 1174505 1110032 1265665 691170 918679
14663 918679 977998 1058641 1132296 1008887 1047904 955699 1425584 1098568 1018777 934156 1131747
14652 1131747 935037 1215362 1122560 1131035 1087893 1056650 1818758 933977 1321979 1045414
14642 1045414 1366422 1504100 1395390 1333680 1241192 1602259 1128383 919834 1359300 1272025
14632 1272025 1563336 1089956 1593752 1711382 1443831 1307861 1452061 1496962 1300267 1617469
14622 1617469 1358245 1405245 1443144 1242297 1643531 1416968 1362061 1724857 1682081 1691599
$$ packed form
14694A115695k16504O9911R4572o6865j36118L1498J32110l16119K95981R6056
14684A100217M3783k84977L49557m79416K44343j0262J25967k38027L17582j91006
14674I77761j7102Q811J78659J7886Q4665k66329J90154o4473J55633n74495K27509
14663I18679N9319Q0643P3655j23409L9017r2205M69885l27016p9791q4621J97591
14652A131747j96710K80325r2802Q475m3142l1243P62108q84781L88002k76565
14642A045414L21008J37678j08710o1710r2488L61067m73876k08549M39466q7275
14632A272025K91311m73380N03796J17630k67551j35970J44200M4901j96695L17202
14622A617469k59224M7000L7899k00847M01234k26563n4907L62796m2776R518
$$ plain form
14612 1691599 1501474 1732188 1456885 1642282 1870133 1850884 1639773 1860761 1626304 1431665
14602 1431665 1498878 2147432 1546495 1760938 1758902 1689989 1877255 1787557 1946199 1841362
14592 1841362 1850529 1443292 1719074 2012851 1647209 1669699 1928052 1926603 2285215 1919413
14582 1919413 1806981 1918899 1980993 1942974 2172506 1901393 1937371 2001150 2094489 2358741
14572 2358741 2148031 2073846 2532841 2132354 2266442 2527370 1932346 2494101 2352561 2513232
14562 2513232 2515145 2895473 3040954 2659178 3041131 2994730 3055616 3446725 3797966 3599033
14552 3599033 4574081 5176938 6378772 8381512 12336748 19675208 35847678 43673804
14544 43673804 24351720 11423268 5636271 3611493 2876838 2182980 1906034 2187726
$$ packed form
14612A691599j90125K30714k75303J85397K27851j9249k11111K20988k34457j94639
14602A431665O7213O48554o00937K14443k036o8913J87266q9698J58642j04837
14592A841362R167m07237K75782K93777l65642K2490K58353j449L58612l65802
14582A919413j12432J11918O2094l8019K29532k71113L5978O3779R3339K64252
14572B358741k10710p4185M58995m00487J34088K60928n95024N61755j41540J60671
14562B513232J913L80328J45481l81776L81953m6401O0886L91109L51241j98933
14552C599033R75048O02857J201834K002740L955236P338460J6172470P826126
14544D3673804j9322084A1423268E636271k024778p34655o93858k76946K81692
$$ plain form
14536 2187726 2194729 2261264 2389888 2119878 1981085 2077803 1791230 2088996 2505628 2297954
14526 2297954 2203381 2658111 2521841 2475903 2620338 2539785 2331310 2763849 2466320 2298074
14516 2298074 2654369 2413176 2639994 2838245 2895021 2761113 2839231 2935253 2953161 3149879
14506 3149879 3218305 3029535 2690642 2937335 3500391 3038943 3094584 3663498 3433922 3118874
14496 3118874 3064992 3283911 3468545 3333012 3596543 3615504 3630950 3482841 3470538 3594668
14486 3594668 3750431 4007127 3654468 3759935 3998663 3869718 4161312 4168716 4220535 4004667
14476 4004667 3769061 4293991 4572942 4353077 4210409 4154219 4286651 4223834 4584842 4400149
14466 4400149 4551438 4822441 4472024 4544607 4601369 4790756 4774051 4988290 4610690 4938271
$$ packed form
14536B187726P003O6535J28624k70010j38793R6718k86573K97766M16632k07674
14526B297954r4573M54730j36270m5938J44435q0553k08475M32539k97529j68246
14516B298074L56295k41193K26818J98251N6776j33908P8118R6022J7908J96718
14506C149879O8426j88770l38893K46693N63056m61448N5641N68914k29576l15048
14496C118874n3882K18919J84634j35533K63531J8961J5446j48109j2303J24130
14486C594668J55763K56696l52659J05467K38728j28945K91594P404N1819k15868
14476D004667k35606N24930K78951k19865j42668n6190J32432o2817L61008j84693
14466D400149J51289K71003l50417P2583N6762J89387j6705K14239l77600L27581
$$ plain form
14456 4938271 5061449 5549208 5441700 5313387 5475053 5234423 5602590 5730360 5525145
14447 5525145 5738984 5605003 5883791 5806299 5823881 5883940 6194716 6078912 6314208 5984668
14437 5984668 6504237 6603062 6573108 6387796 6802031 6829864 6775763 6884495 7216752 7436284
14427 7436284 7388790 7293991 7162095 7343470 7614649 7996039 7933361 8281778 8055152 8024779
14417 8024779 8369585 8509212 8651115 8806306 8658467 9386098 9108995 9079033 9577059 9506449
14407 9506449 9753317 9783224 9869380 9823950 10260709 10582235 10498348 10714154 11065475 10933239
14397 10933239 11314067 11554421 11586680 11524201 11826128 12192256 12595634 12111191 12780878 13065723
14387 13065723 13302828 13387104 13831546 13740435 14089846 14377727 14607721 14568518 15362543 15250323
$$ packed form
14456D938271J23178M87759j07508j28313J61666k40630L68167J27770k05215
14447E525145K13839j33981K78788p7492J7582O0059L10776j15804K35296l29540
14437E984668N19569R8825k9954j85312M14235K7833n4101J08732L32257K19532
14427G436284m7494r4799j31896J81375K71179L81390o2678L48417k26626l0373
14417H024779L44806J39627J41903J55191j47839P27631k77103k9962M98026p0610
14407I506449K46868K9907Q6156m5430M36759L21526q3887K15806L51321j32236
14397A0933239L80828K40354L2259o2479L01927L66128M03378m84443O69687K84845
14387A3065723K37105Q4276M44442r1111L49411K87881K29994l9203P94025j12220
$$ plain form
14377 15250323 15670809 15949352 16391994 16650426 17027722 17310425 17591470 18045120 18380178
14368 18380178 18896029 19252321 19448755 20222377 20384950 20702340 21309473 21641096 22378631
14359 22378631 22763913 23201677 23963411 24382114 24999917 25454574 26038556 26796480 27234993
14350 27234993 27632626 28667365 29380224 30084560 31043054 31506204 32374493 33066300 34264046
14341 34264046 35146838 36040691 37185307 38183689 39179655 40022035 41085824 42589756 43678253
14332 43678253 44863399 46230835 47976185 49179076 50798805 52420643 54070264 56272097
14324 56272097 57701800 59964792 61703371 63920585 66372101 68734613 71247881 73742812
14316 73742812 76416860 79623987 82661728 86089713 89403640 93093738 96832692 101130837
$$ packed form
14377A5250323M20486K78543M42642K58432L77296K82703K81045M53650L35058
14368A8380178N15851L56292J96434P73622J62573L17390O07133L31623P37535
14359B2378631L85282M37764P61734M18703O17803M54657N83982P57924M38513
14350B7234993L97633J034739P12859P04336R58494M63150Q68289O91807J197746
14341C4264046Q82792Q93853J144616R98382R95966Q42380J063789J503932J088497
14332D3678253J185146J367436J745350J202891J619729J621838J649621K201833
14324E6272097J429703K262992J738579K217214K451516K362512K513268K494931
14316G3742812K674048L207127L037741L427985L313927L690098L738954M298145
$$ plain form
14308 101130837 105428790 110284796 114815809 120251046 125686700 131616987 137947715 144155634
14300 144155634 151277209 158162569 165878172 174136748 182533080 191704388 201144443 211550233
14292 211550233 222414166 233707291 245745659 258051481 271089143 284711631 298746780
14285 298746780 313352242 328370940 343408134 358619685 373545619 388572360 403264059
14278 403264059 416705530 429362762 440871417 450194367 456003676 458312861 459180762 459256588
14270 459256588 459319219 459608300 454082143 449223293 443118698 434502800 423826886 411167783
14262 411167783 397297997 383138249 368851965 353507155 338129532 322287425 306831418
14255 306831418 292379729 278793790 264962575 251908739 239372548 227308722 216316279
$$ packed form
14308A01130837M297953M856006M531013N435237N435654N930287O330728O207919
14300A44155634P121575O885360P715603Q258576Q396332R171308R440055J0405790
14292B11550233J0863933J1293125J2038368J2305822J3037662J3622488J4035149
14285B98746780J4605462J5018698J5037194J5211551J4925934J5026741J4691699
14278D03264059J3441471J2657232J1508655R322950N809309K309185Q67901P5826
14270D59256588O2631K89081n526157m858850o104595q615898j0675914j2659103
14262D11167783j3869786j4159748j4286284j5344810j5377623j5842107j5456007
14255C06831418j4451689j3585939j3831215j3053836j2536191j2063826j0992443
$$ plain form
14248 216316279 205566456 195477130 186008245 177300637 169012890 161102765 153474338 146590651
14240 146590651 139366977 133517112 127463201 122144535 116807411 111728894 106989500 102611717
14232 102611717 98679167 95090661 91520580 87388491 83836050 80655369 78083230 74906915
14224 74906915 72096651 69523774 67121780 64467157 63030272 60859946 58638924 56429075
14216 56429075 54744939 52815797 51315834 50045257 48608881 47135772 45260675 44238270
14208 44238270 42691965 41952547 40784088 39748640 37991026 36974663 36001034 35441685
14200 35441685 34586635 33722658 32394310 32054874 30755895 30397795 29333354 29126366 27916595
14191 27916595 27578470 26680010 25908424 25343340 24950731 24367496 23652741 23297209 22567109
$$ packed form
14248B16316279j0749823j0089326r468885q707608q287747p910125p628427o883687
14240A46590651p223674n849865o053911n318666n337124n078517m739394m377783
14232A02611717l932550l588506l570081m132089l552441l180681k572139l176315
14224G4906915k810264k572877k401994k654623j436885k170326k221022k209849
14216E6429075j684136j929142j499963j270577j436376j473109j875097j022405
14208D4238270j546305p39418j168459j035448j757614j016363r73629n59349
14200C5441685q55050q63977j328348l39436j298979l58100j064441k06988j209771
14191B7916595l38125q98460p71586n65084l92609n83235p14755l55532p30100
$$ plain form
14182 22567109 22277023 21818716 21245548 20836582 20331046 20016644 19577999 19094590 18843542
14173 18843542 18569285 18005853 17887405 17641450 16997815 16813507 16376898 16315139 15908103
14164 15908103 15747233 15309479 15089803 14953119 14652956 14249774 13885159 13458651 13706222
14155 13706222 13308698 12793478 12779751 12461419 12028256 12162003 12055965 12191200 12017432
14146 12017432 11497414 11136755 11067082 10776252 10617425 10301265 10628752 10341705 10197487
14137 10197487 9985346 9917538 9430896 9360390 9399403 9131123 9240216 8582165 8927444 8810647
14127 8810647 8796729 8373571 8524132 8236313 8303410 7850658 8089963 7874149 7211055 7746377
14117 7746377 7714140 7583681 7434646 7129536 7280754 7170104 6967903 6783582 6551941 6217184
$$ packed form
14182B2567109k90086m58307n73168m08966n05536l14402m38645m83409k51048
14173A8843542k74257n63432j18448k45955o43635j84308m36609o1759m07036
14164A5908103j60870m37754k19676j36684l00163m03182l64615m26508K47571
14155A3706222l97524n15220j3727l18332m33163J33747j06038J35235j73768
14146A2017432n20018l60659o9673k90830j58827l16160L27487k87047j44218
14137A0197487k12141o7808m86642p0506L9013k68280J09093o58051L45279j16797
14127H810647j3918m23158J50561k87819O7097m52752K39305k15814o63094N35322
14117G746377l2237j30459j49035l05110J51218j10650k02201j84321k31641l34757
$$ plain form
14107 6217184 6682493 6572895 6523271 6580247 6240545 6250120 5812446 6162215 5978720 6013264
14097 6013264 6246029 5742671 5319902 5654787 5583580 5629922 5622346 5313417 5719916 5355263
14087 5355263 5313835 5005492 5276856 4894979 4683447 4661451 4985086 4951576 4672473 4623404
14077 4623404 4701581 4569380 4352808 4829457 4362909 4041856 4571190 4398534 4290975 4079011
14067 4079011 4017318 4154949 4251551 3822871 3984367 4087468 3785733 3817344 4147663 4043581
14057 4043581 3907950 3839431 3962591 3810830 3860824 3560122 3799327 3893256 3463140 3561813
14047 3561813 3391417 3300380 3466000 3455515 3426949 3029311 3424120 3190178 3148357 3103605
14037 3103605 3485615 2714020 2793259 2979474 3019358 2953558 2957854 2943969 2712030 3157455
$$ packed form
14107F217184M65309j09598m9624N6976l39702R575m37674L49769j83495L4544
14097F013264K32765n03358m22769L34885p1207M6342p576l08929M06499l64653
14087E355263m1428l08343K71364l81877k11532k1996L23635l3510k79103m9069
14077D623404P8177j32201k16572M76649m66548l21053N29334j72656j07559k11964
14067D079011o1693J37631R6602m28680J61496J03101l01735L1611L30319j04082
14057D043581j35631o8519J23160j51761M9994l00702K39205R3929m30116R8673
14047C561813j70396r1037J65620j0485k8566l97638L94809k33942m1821m4752
14037C103605L82010p71595P9239J86215L9884o5800M296j3885k31939M45425
$$ plain form
14027 3157455 2773633 2862917 2721478 3053347 2595401 2718611 2724700 2840047 2348796 2231140
14017 2231140 2185627 2541852 2633684 2672340 2470427 2414586 2415577 2483377 2364211 2605151 2412996
14006 2412996 2302649 1996596 1856777 2683722 1999306 1997169 2015542 1991223 2104620 2117933
13996 2117933 2277172 1688349 2109692 2086042 2111544 2608096 3010969 4724826 7054138
13987 7054138 13450852 28964150 43041764 27058254 15175009 8977102 6285762 5140783
13979 5140783 4312395 3886291 3484702 3201386 2859252 2999661 2648987 2542903 2828616
13970 2828616 2474205 2273363 2521500 2154531 2572173 2245107 2306886 2059185 2219057 2062428
13960 2062428 2036137 1905467 2321471 2019952 1903904 1931568 1739931 1967299 1814666 2229504
$$ packed form
14027C157455l83822Q9284j41439L31869m57946J23210O089J15347m91251j17656
14017B231140m5513L56225R1832L8656k01913n5841R91O7800j19166K40940j92155
14006B412996j10347l06053j39819Q26945o84416k137J8373k4319J13397J3313
13996B117933J59239n88823M21343k3650K5502M96552M02873J713857K329312
13987G054138O396714J5513298J4077614j5983510j1883245o197907k691340j144979
13979E140783q28388m26104m01589k83316l42134J40409l50674j06084K85713
13970B828616l54411k00842K48137l66969M17642l27066O1779k47701J59872j56629
13960B062428k6291j30670M16004l01519j16048K7664j91637K27368j52633M14838
$$ plain form
13950 2229504 1847979 2041506 1916302 1885551 1755086 1533805 1582742 1975832 1944091 1599821
13940 1599821 1839481 1704402 1944090 1748845 1704559 1624823 1590012 1431876 1788000 1589461
13930 1589461 1647672 1741928 1457758 1612558 1856033 1707128 1394150 1599153 1758688 1731176
13920 1731176 1333146 1680359 1412868 1488731 1640043 1253311 1764614 1548792 1231756 1582219
13910 1582219 1724649 1317096 1542851 1521433 1293650 1591926 1267060 1426523 1269118 1655207
13900 1655207 1364819 1398448 1470421 1494723 1682222 1519514 1553209 1515022 1396014 1407514
13890 1407514 1402715 1669021 1228293 1060628 1304916 1268058 1113646 966191 1162089 1384875
13880 1384875 1064503 989789 1259433 870717 1159184 988840 1336043 1363388 1025873 1117849
$$ packed form
13950B229504l81525J93527j25204l0751j30465k21281M8937L93090l1741l44270
13940A599821K39660j35079K39688j95245m4286p9736l4811j58136L56124j98539
13930A589461N8211R4256k84170J54800K43475j48905l12978K05003J59535k7512
13920A731176l98030L47213k67491P5863J51312l86732N11303k15822l17036L50463
13910A582219J42430m07553K25755k1418k27783K98276l24866J59463j57405L86089
13900A655207k90388L3629P1973K4302J87499j62708L3695l8187j19008J1500
13890A407514m799K66306m40728j67665K44288l6858j54412j47455J95898K22786
13880A384875l20372p4714K69644l88716K88467j70344L47203K7345l37515R1976
$$ plain form
13870 1117849 898103 1201929 947207 1113026 1136945 1273669 1180836 1197085 1133904 1281568
13860 1281568 776437 918719 1006361 912472 1264300 1104498 1067864 1368785 1167659 1084784
13850 1084784 1088317 1001019 1154160 1244574 1177446 1201059 962682 1026020 1223497 1060413 969158
13839 969158 1194359 1006326 1167200 947522 725079 1016536 1197353 890805 928631 928796
13829 928796 643185 796943 1114560 683913 566689 1175333 777154 839145 470234 711399
13819 711399 1014286 1368420 1030071 827021 663788 1128289 1021571 730005 792373 777201
13809 777201 526831 1179996 1064704 757754 689507 559058 764223 744388 664567 622012
13799 622012 707624 874396 711198 698604 731623 626178 525265 870827 540079 732698
$$ packed form
13870A117849k19746L03826k54722J65819K3919J36724r2833J6249o3181J47664
13860A281568n05131J42282Q7642r3889L51828j59802l6634L00921k01126q2875
13850A084784L533q7298J53141R0414o7128K3613k38377O3338J97477j63084r1255
13839I69158K25201j88033J60874k19678k22443K91457J80817l06548L7826J65
13829I28796k85611J53758L17617m30647j17224O08644l98179O1991l68911K41165
13819G11399L02887L54134l38349k03050j63233M64501j06718k91566O2368j5172
13809G77201k50370O53165j15292l06950o8247j30449K05165j9835p9821m2555
13799F22012Q5612J66772j63198j2594L3019j05445j00913L45562l30748J92619
$$ plain form
13789 732698 872206 976207 821753 636560 778085 888059 324351 405431 829500 827104
13779 827104 651175 492763 996026 732852 506102 846852 774217 577526 274843 674717
13769 674717 801074 552729 648641 626881 712754 712647 414680 714141 885566 570560 528708
13758 528708 654213 556903 526565 656690 878481 402376 765464 733373 796723 668810
13748 668810 471731 396195 661620 688589 906666 617066 709045 642803 842524 699048
13738 699048 796824 415131 395665 324316 341745 939293 781990 571537 654555 471007
13728 471007 373649 849657 815601 615423 555664 380758 456729 465665 512677 495588 311616
13717 311616 361941 468417 594930 475070 514429 221805 455779 436796 564762 769854
$$ packed form
13789G32698J39508J04001j54454j85193J41525J09974C24351Q1080M24069k396
13779H27104j75929j58412N03263k63174k26750L40750p2635j96691B74843L99874
13769F74717J26357k48345R5912k1760Q5873j07k97967K99461J71425l15006m1852
13758E28708J25505r7310l0338J30125K21791D02376L63088l2091O3350j27913
13748F68810j97079p5536K65425K6969K18077k89600R1979o6242J99721j43476
13738F99048R7776l81693j9466p1349J7429N97548j57303k10453Q3018j83548
13728D71007r7358M76008l4056k00178n9759j74906P5971Q936M7012j7089j83972
13717C11616N0325J06476J26513j19860L9359B21805K33974j8983J27966K05092
$$ plain form
13707 769854 243446 772962 662343 481262 675516 407060 107677 539068 726746 739604
13697 739604 503544 463038 466440 208095 117482 536121 510681 395516 732096 349334
13686 527750 509880 416704 -529 780007 597642 531676 316007 572858 549818 566137 470251
13675 470251 561424 207674 454969 538077 805072 314110 484551 362000 428428 635399
13665 635399 709971 264034 471800 856815 559475 221209 366028 367623 561464 585910
13655 585910 415008 451276 564305 537144 265288 456229 537183 413364 313479 671783
13645 671783 391262 466106 256778 689827 548097 20304 406394 591595 248341 100286
13634 506555 154983 -75203 192267 320633 246494 254405 606960 330486 475564 378985
$$ packed form
13707G69854B43446N29516j10619j81081J94254k68456A07677M31391J87678J2858
13697G39604k36060m0506L402B08095r0613M18639k5440j15165L36580C49334
13686E27750j7870r3176e29G80007j82365o5966k15669K56851k3040J6319r5886
13675D70251R1173B07674K47295Q3108K66995C14110J70441j22551O6428K06971
13665F35399P4572B64034K07766L85015k97340B21209J44819J595J93841K4446
13655E85910j70902L6268J13029k7161B65288J90941Q0954j23819r9885L58304
13645F71783k80521P4844k09328M33049j41730B0304L86090J85201B48341A00286
13634E06555A54983g5203A92267J28366p4139P911L52555k76474J45078r6579
$$ plain form
13624 378985 431261 459518 635373 266359 380754 190732 130186 225300 349951 500314
13614 500314 266945 559639 285359 219434 351146 -66997 386791 344765 433868 493443
13604 493443 440233 173906 829286 434951 563735 450457 546605 624100 403884 -2760
13593 297562 475000 32965 566701 383521 525777 403375 356840 150498 350119 592011
13583 592011 402334 180107 539082 150396 391836 623632 431096 361063 407904 332893
13573 332893 762512 150908 266203 350600 353424 476214 222213 502717 -3077 432342
13562 386446 55953 248699 333973 260521 363270 183721 26594 694755 391310 109050
13551 359395 451531 2795 300445 98926 -36501 320137 296705 295942 470819 274652 -35558
$$ packed form
13624C78985N2276K8257J75855B66359J14395j90022o0546R5114J24651J50363
13614E00314k33369K92694k74280o5925J31712f6997C86791m2026Q9103N9575
13604D93443n3210A73906O55380l94335J28784j13278R6148P7495k20216b760
13593B97562J77438C2965N33736j83180J42256j22402m6535A50498J99621K41892
13583E92011j89677A80107L58975A50396K41440K31796j92536p0033M6841p5011
13573C32893M29619A50908J15295Q4397K824J22790B22213K80504c077D32342
13562C86446E5953J92746Q5274p3452J02749j79549B6594O68161l03445A09050
13551C59395R2136B795K97650I8926c6501C20137k3432p63J74877j96167c5558
$$ plain form
13539 -6083 547580 276423 256084 505452 158070 326593 251055 239600 427920 88122 284069
13528 284069 306680 321381 285403 438057 753149 338410 31820 247623 381275 340387
13518 340387 200690 244322 125091 589698 403861 229291 210377 174769 265151 338306
13508 338306 374324 8029 194519 -53280 121386 430650 404823 -34461 232277 321711 258931
13497 258931 546148 158158 87939 366348 423803 -2334 -172870 135942 330301 82598
13486 176014 447154 101590 -71272 209181 294593 278744 98241 -81967 358824 92773 -52602
13474 348575 44390 -30465 -117224 418328 226741 134400 98305 -120509 -66835 -51314 123556
13462 317016 212159 124405 159961 273829 237372 96574 -53276 396478 233118 -4625 -183705
$$ packed form
13539f083E47580k71157k0339K49368A58070J68523p5538j1455J88320H8122J95947
13528B84069K2611J4701l5978J52654L15092C38410C1820K15803J33652m0888
13518C40387j39697M3632j19231M64607j85837j74570j8914l5608R0382P3155
13508C38306L6018H029J86490e3280A21386L09264k5827c4461B32277Q9434o2780
13497B58931K87217A58158p0219K78409N7455b334j70536A35942J94359H2598
13486A76014K71140A01590g1272B09181Q5412j5849I8241h1967C58824I2773e2602
13474C48575D4390c0465q6759D18328j91587r2341l6095a20509N3674J5521A23556
13462C17016j04857q7754L5556J13868l6457I6574e3276C96478j63360d625j79080
$$ plain form
13451 -183705 309940 342950 291139 356435 130549 187982 40356 195542 284972 91642 188401
13440 188401 160868 57327 226952 237512 175355 69511 218958 106528 160533 274509 318771
13429 318771 148983 -18249 -72032 324248 414594 185410 -112032 59441 314981 126750
13418 -13782 -162017 123731 232064 281091 234421 -18653 259157 324624 164198 191457 -97920
13406 124961 344313 90937 123804 215390 146792 359113 -8741 -35605 -48659 10939 -33235
13394 198101 173020 407907 351808 125245 308903 359450 253270 89419 8719 274911 136992
13382 331052 424620 -43320 396419 239619 238062 228046 -100925 464072 342816 273423 425434
13371 425434 132763 346633 246337 -26378 178385 307673 148465 328078 185951 4737
$$ packed form
13451a83705C09940L3010n1811O5296A30549N7433D0356J55186Q9430I1642R6759
13440A88401k7533E7327J69625J0560o2157F9511J49447A06528N4005J13976M4262
13429C18771A48983a8249n3783C24248R0346A85410a12032E9441K55540A26750
13418a3782j48235A23731J08333M9027m6670a8653B59157O5467j60426K7259i7920
13406A24961K19352I0937L2867R1586o8598K12321h741k6864j3054A0939c3235
13394A98101k5081K34887n6099A25245J83658N0547j06180H9419H719K66192A36992
13382C31052R3568d3320C96419j56800j557j0016a00925D64072j21256o9393J52011
13371D25434A32763K13870j00296b6378A78385J29288A48465J79613j42127D737
$$ plain form
13360 394059 243696 88881 194829 287321 283295 164043 -76741 553323 128753 164397 233708
13349 233708 152510 531570 211534 357053 100094 469429 231574 -109521 101153 223122
13339 223122 432932 286784 238383 558409 284140 380696 355544 117888 123771 273845
13329 273845 167726 -226227 523901 89103 194833 386054 28626 121311 379892 108330
13318 11509 -69235 281135 204930 101512 524285 -67533 268328 108672 30709 -3708 327735
13306 158693 448457 82540 237440 317480 114094 255929 187476 339561 376476 344274
13296 344274 48316 27445 120027 266281 477495 -141845 206690 335942 498652 -128148
13285 -64596 163330 -8733 354830 42522 241710 -81463 114716 -7207 345536 -106976 3746
$$ packed form
13360C94059j50363H8881J05948R2492m026j19252g6741E53323A28753L5644O9311
13349B33708q1198L79060B11534J45519A00094L69335B31574a09521A01153J21969
13339B23122K09810j46148m8401L20026k74269R6556k5152A17888N883J50074
13329B73845j06119b26227E23901H9103J05730J91221B8626R2685K58581A08330
13318A1509f9235B81135p6205A01512M22773f7533B68328A08672C0709c708C27735
13306A58693K89764H2540J54900Q0040A14094J41835o8453J52085L6915l2202
13296C44274D8316k0871R2582J46254K11214a41845B06690J29252J62710a28148
13285f4596A63330h733C54830D2522J99188h1463A14716g207C45536a06976C746
$$ plain form
13273 206245 249076 287821 84691 97399 -76680 -67741 562379 289278 888 254043 8460 -11569
13260 181499 209282 129004 189751 261322 85053 -44418 45057 98095 -344566 313465 27113
13248 23424 26841 107781 -42853 -62383 105235 -196017 349879 273932 43538 -151861 10220
13236 8725 116953 130185 281025 -16362 366926 -844 234026 -386728 21370 -87857 135974
13224 18686 287181 38016 135141 23541 378008 -17505 -63250 249824 195832 -22863 -48435
13213 -48435 78841 -94528 -185748 265009 -27813 1953 38135 -48241 -74698 322128 -111551
13201 -243280 -95755 124969 239439 32391 64716 103160 80738 278883 275707 143987 87014
13190 87014 228914 61510 349705 106635 -141933 280504 307779 -24520 160305 143800
$$ packed form
13273B06245M2831L8745H4691J2708g6680Q939E62379k73101H88K53155H460a1569
13260A81499K7783q0278O0747P1571H5053d4418D5057N3038c44566C13465B7113
13248B3424L417Q0940d2853j9530A05235a96017C49879p5947D3538a51861A0220
13236H725J08228J3232J50840a6362C66926h44B34026c86728B1370h7857A35974
13224A8686K68495C8016R7125B3541L54467a7505m5745B49824n3992b2863k5572
13213d8435G8841i4528r1220B65009b7813A953L6182d8241k6457C22128a11551
13201b43280i5755A24969J14470C2391L2325L8444k2422J98145l176j31720n6973
13190H7014J41900F1510K88195A06635a41933B80504K7275b4520A60305j6505
$$ plain form
13180 143800 140678 -234546 -113461 167044 -90537 -84486 266654 46894 64403 -2865 -49975
13169 -49975 169253 40287 211943 119948 152240 332690 -107816 128827 103981 -103058
13158 35156 -1752 -17662 -98252 120336 240217 153310 240211 61427 270517 168711 -528293
13146 -121632 206785 -24112 81380 69040 94276 160768 -35680 550585 40997 18623 43871
13135 43871 78488 -119169 37993 -49394 138589 188431 101987 311398 -44693 11208 -14051
13123 295781 411663 -62199 18888 -233580 -88929 -74002 16747 134462 -44260 174163 -211156
13111 -140302 154786 62756 68492 94365 95200 131063 267713 -123513 185717 107526 58027
13100 58027 -83563 -47970 -51819 168897 354334 285454 -251731 289770 14767 -29782 261426
$$ packed form
13180A43800l122b34546a13461A67044i0537O051B66654D6894J7509b865m7110
13169d9975A69253D0287J71656r1995L2292J80450a07816A28827k4846a03058
13158C5156a752j5910q0590A20336J19881q6907Q6901F1427K09090j01806e28293
13146a21632B06785b4112H1380j2340K5236O6492c5680E50585D0997A8623K5248
13135D3871L4617a19169C7993d9394A38589M9842q6444K09411d4693A1208a4051
13123B95781J15882f2199A8888b33580h8929J4927A6747J17715d4260A74163b11156
13111a40302A54786F2756N736K5873Q35L5863J36650a23513A85717p8191m9499
13100E8027h3563L5593l849A68897J85437o8880b51731B89770A4767b9782B61426
$$ plain form
13088 1819 52672 -108618 32648 81812 -37493 82127 37903 202295 -96943 -231798 146462
13076 -69064 122013 116351 114186 -32097 145202 228207 45429 4314 46972 30060 255685 147651
13064 147651 -137717 -39315 188484 -39868 -163333 416461 33016 24049 4416 211259 -90339
13052 -237057 238105 20263 -16747 296236 178818 158220 80292 -39828 592513 -13473 82053
13040 69315 55280 275074 175021 168029 15371 75464 301144 -244424 367896 317268 234996
13029 234996 100077 -144635 -76700 151316 18915 34278 148705 -94414 -27151 155597
13018 66900 -150517 66581 330048 41010 411870 -104402 164732 237928 128273 103773
13008 103773 -38360 166646 100204 173846 9532 -66921 67334 227279 25224 -117265 29841
$$ packed form
13088A819N0853a08618C2648M9164c7493H2127C7903J64392i6943j34855A46462
13076f9064A22013n662k165c2097A45202Q3005D5429D314M2658j6912K25625j08034
13064A47651a37717c9315A88484c9868j23465D16461C3016q967D416K06843i0339
13052b37057B38105B0263a6747B96236j17418k0598p7928c9828E92513a3473H2053
13040F9315j4035K19794j00053o992A5371O0093K25680b44424C67896n0628q2272
13029B34996A00077a44635O7935A51316A8915J5363J14427i4414b7151A55597
13018F6900a50517F6581K63467D1010L70860a04402A64732P3196j09655k4500
13008A03773c8360A66646o6442P3642I532f6921F7334J59945B5224a17265B9841
$$ plain form
12996 65524 -249515 -191083 189266 -261330 133561 58120 55359 233617 156601 172582 -300772
12984 295639 -161865 -244137 -61888 104546 -70773 -255835 -143016 -12970 223648 215112 -90892
12972 -129208 190673 -121087 -78177 67973 1573 167178 216735 -188956 1042 35098 86149
12961 86149 -100698 24036 -97459 197420 -209257 -158284 54499 -183221 106044 144313 102079
12950 102079 113768 -85610 47807 -181777 -359183 183712 305024 -52633 -72874 160112
12939 -228480 28896 425799 61929 4478 517755 357752 -52005 274528 12126 16540 54286
12928 54286 -160862 -154621 47938 39487 -102291 -134828 245658 61700 -96385 195859 289756
12917 289756 -62495 -1439 230324 -78874 -181624 12200 -54202 13073 -199766 -106818 -75059
$$ packed form
12996F5524b49515N8432A89266b61330A33561E8120k761J78258p7016J5981c00772
12984B95639a61865q2272f1888A04546g0773j85062J12819a2970B23648q536i0892
12972a29208A90673a21087M2910F7973A573J65605M9557a88956A042L4056N1051
12961H6149a00698B4036i7459A97420b09257N0973E4499a83221A06044L8269m2234
12950A02079J1689h5610D7807a81777j77406A83712J21312e2633k0241A60112
12939b28480B8896L96903F1929D478N13277j60003e2005B74528A2126M414L7746
12928E4286a60862O241D7938q451a02291l2537B45658F1700i6385A95859R3897
12917B89756f2495a439B30324g8874j02750A2200e4202A3073a99766R2948L1759
$$ plain form
12906 -75059 -71310 161075 94051 -254627 52746 -150806 5048 380542 29772 114326 -185185
12894 96443 -138635 374125 -151938 46216 -234130 59849 79579 -78002 -119447 140789 -103891
12882 13707 211803 164329 36592 -81697 -327391 202659 -111402 -195953 429297 17922 -102999
12870 46798 -29694 -106020 210725 298697 -188697 38060 -64051 -161989 -145437 -62136 187835
12858 -40114 128603 569 198690 65776 -132899 117442 143072 393095 -307070 -164612 14022
12846 -81818 73859 235621 283540 52965 314793 90230 77560 -61588 19846 351645 172726
12834 48007 -279892 -79930 154553 -204558 -50718 -201363 131619 196855 -31006 137775
12823 123997 79660 61751 247006 108802 194206 42918 -223974 210602 182044 -129542
$$ packed form
12906g5059L749A61075o7024b54627E2746a50806E048L75494B9772Q4554a85185
12894I6443a38635C74125a51938D6216b34130E9849J9730g8002m1445A40789a03891
12882A3707J98096m7474C6592h1697k45694B02659a11402q4551D29297A7922a02999
12870D6798b9694p6326B10725Q7972a88697C8060f4051r7938J6552f2136A87835
12858d0114A28603E69J98121F5776a32899A17442K5630K50023c07070J42458A4022
12846h1818G3859J61762M7919E2965K61828I0230j2670f1588A9846L31799A72726
12834D8007b79892g9930A54553b04558e0718j50645A31619O5236c1006A37775
12823A23997m4337j7909J85255A08802Q5404D2918b23974B10602k8558a29542
$$ plain form
12812 -82560 209999 74213 -41285 -33531 91166 116775 -53540 -180145 200712 158965 115986
12801 115986 -38895 -210973 345357 189393 219470 -71887 -4132 -37754 331030 -4953 -168805
12790 -168805 283028 -190107 -418173 -183998 153067 -32610 -186343 126609 300030 -61452
12779 -89241 75818 359644 345382 168557 -384695 226777 -576 113436 -17120 -266098 53021
12767 288475 -444498 -146721 188440 -402196 -173748 122026 141329 68574 26470 150267
12757 150267 -114681 -250049 75508 -225322 -216894 -2373 -135773 -8469 113363 -113933 143481
12745 -233261 -176506 -122805 -356828 42834 -40810 184294 381755 -163152 143642 -48345
12734 -28653 194770 45565 -87836 5344 -70509 101725 -78913 40127 112303 -132931 8035
$$ packed form
12812h2560B09999G4213d1285P754I1166K5609e3540j26605B00712m1747m2979
12801A15986c8895j72078C45357j55964L0077g1887d132l3622C31030d953j63852
12790a68805B83028a90107k28066a83998A53067c2610j53733A26609J73421f1452
12779h9241G5818K83826j4262A68557c84695B26777e76A13436a7120k48978E3021
12767B88475d44498a46721A88440d02196a73748A22026J9303F8574B6470J23797
12757A50267a14681j35368G5508b25322Q428b373j33400h469A13363a13933A43481
12745b33261N6755N3701k34023D2834d0810A84294J97461a63152A43642d8345
12734b8653A94770D5565h7836E344g0509A01725g8913D0127P2176a32931H035
$$ plain form
12722 196797 39662 -109101 307982 -67057 29442 -148761 -207948 292813 192228 491901
12712 491901 -41323 356166 91650 -103936 421792 359816 47988 266735 228880 -290937
12701 111192 -172836 107504 230357 -51713 -108712 18793 328177 99192 -29229 259565
12690 -58443 138557 19494 -46337 201743 106268 173097 -203982 23323 87188 283313 41124
12678 -91081 19688 36469 78968 235071 133518 281616 -76183 219041 30482 336184 -7305
12666 167229 27398 -199893 358487 291998 286789 37043 103766 192205 337702 -248925 203259
12654 250412 4541 92902 -17871 -10937 245901 189681 -55983 -89943 215018 -106011 577527
12642 -31780 -89082 257599 97807 172859 62581 26780 -96427 16930 -147790 221398 242571
$$ packed form
12722A96797C9662a09101C07982f7057B9442a48761n9187B92813j00585K99673
12712D91901d1323C56166I1650a03936D21792o1976D7988K18747l7855b90937
12701A11192a72836A07504J22853e1713n6999A8793L09384I9192b9229B59565
12690e8443A38557A9494d6337B01743r5475O6829b03982B3323O3865J96125D1124
12678i1081A9688J6781M2499J56103j01553J48098g6183B19041C0482L05702g305
12666A67229B7398a99893C58487o6489n209C7043O6723Q8439J45497b48925B03259
12654B50412D541Q8361a7871O934B45901n6220e5983l3960B15018a06011E77527
12642c1780n7302B57599I7807P5052F2581B6780i6427A6930a47790B21398K1173
$$ plain form
12631 242571 129709 -244805 90181 547717 181973 208788 146472 176268 17421 -314255
12620 -276173 5961 363771 480473 -138059 155926 129903 304921 -206244 280269 -308559
12609 57595 -7216 -37941 -72092 -41291 406064 326471 -35137 408378 -99249 155422 233459
12598 233459 -63855 33798 -67953 -34490 329556 -206927 12894 -278847 -61551 -11381 -8559
12587 -8559 310692 -73504 -248524 177382 -194064 -83435 31506 42138 128953 -359061 -107847
12575 13684 -18528 -15175 -33859 -11245 33744 347921 -91620 70182 372573 -23150 -88293
12564 -88293 255932 417456 -248235 249678 -113398 69592 -71445 43821 388243 17979
12553 185662 -248586 -290459 103399 -1912 246530 -24443 -175310 1785 156627 -458986 63209
$$ packed form
12631B42571j12862b44805I0181M57536A81973K6815o2316K9796A7421c14255
12620b76173E961L57810J16702a38059A55926k6023J75018b06244B80269c08559
12609E7595g216l0725l4151L0801D06064p9593c5137D08378i9249A55422P8037
12598B33459f3855C3798f7953L3463C29556b06927A2894b78847f1551a1381K822
12587h559C10692g3504j75020A77382a94064h3435C1506J0632Q6815c59061a07847
12575A3684a8528L353j8684a1245C3744L14177i1620G0182L02391b3150o5143
12564h8293B55932J61524b48235B49678a13398F9592g1445D3821L44422A7979
12553A85662b48586m1873A03399a912B46530b4443j50867A785J54842d58986F3209
$$ plain form
12541 38185 83882 -186193 2492 -181097 25691 37830 -301326 198182 42542 -212492 142641
12529 158504 -32540 -206738 -8830 5249 45468 88552 50210 168411 -49456 241787 12293
12517 -30508 135901 51385 -109179 -119395 -331590 152661 234552 -115830 -204432 -192081 -248136
12506 -248136 80798 135052 -153717 130340 -36630 140944 306550 166727 201166 78598
12495 -7242 -31227 132757 358234 246592 272933 45419 114056 299100 -169960 -110953 144660
12483 109364 111742 9452 178286 -216072 172286 -217138 -86457 -139916 48290 203083 -254228
12471 -231150 -36989 324607 305948 -61561 -200220 -49929 -55803 -179828 -58626 -101505 379078
12459 140106 -128600 -88989 20861 36475 -5188 59435 301812 97351 -179507 -175210 -67017
$$ packed form
12541C8185M5697a86193B492a81097B5691J2139c01326A98182D2542b12492A42641
12529A58504c2540j74198h830E249M0219M3084l8342J18201d9456B41787A2293
12517c0508A35901E1385a09179j0216k12195A52661Q1891a15830q8602J2351n6055
12506b48136H0798N4254a53717A30340c6630A40944J65606j39823L4439G8598
12495g242k3985A32757K25477j11642K6341D5419O8637J85044a69960N9007A44660
12483A09364K378I452J68834b16072A72286b17138h6457n3459D8290J54793b54228
12471b31150c6989C24607j8659f1561j38659d9929n874j24025e8626m2879C79078
12459A40106a28600L9611B0861J5614e188E9435K42377I7351a79507M297f7017
$$ plain form
12447 -141755 212190 -115150 -198689 -78408 -278818 -187795 30512 -229929 -52987 -113653 -211343
12436 -211343 47705 -55057 105663 153578 -74594 -242919 -101971 198243 22608 96809 267974
12425 267974 -329889 -269966 82088 5728 -159612 -131117 -73499 61828 -261763 -538747 36640
12413 100159 70073 -208673 -6845 125643 12584 115439 -98448 119183 -413077 -61058 -4044
12401 -106625 -260264 -89914 126104 96108 50563 -179869 -82953 7006 66503 232471 -45829
12389 345667 -185540 171390 -3909 119676 -8701 95626 10925 233197 -7209 -84798 -85786 -52101
12377 -52101 98715 -74311 365215 -7856 283447 13104 51010 314624 -246268 -289704 -154177
12366 -154177 104700 198380 -100662 211799 -317570 -53391 231512 32902 -322155 -445261
$$ packed form
12447a41755B12190a15150q3539g8408k00410R1023C0512b29929e2987o0666r7690
12436b11343D7705e5057A05663M7915g4594j68325a01971A98243B2608P4201J71165
12425B67974c29889N9923H2088E728a59612K8495N7618F1828b61763k76984C6640
12413A00159l0086b08673f845A25643A2584J02855i8448A19183d13077f1058d044
12401a06625j53639h9914A26104k9996m5545a79869h2953G006N9497J65968d5829
12389C45667a85540A71390c909A19676h701I5626A0925K22272g209p7589r88L3685
12377e2101I8715g4311C65215g856B83447A3104L7906K63614b46268m3436J35527
12366a54177A04700R3680a00662B11799c17570e3391B31512C2902c22155j23106
$$ plain form
12356 -445261 -104935 -260138 143091 -247258 -56191 -38089 142581 -62255 111647 -27858
12345 60219 426066 -155543 16147 -115310 369146 335987 76299 -315295 -53182 -376305
12335 -376305 -217298 -319847 -170460 61926 -40996 14449 -122263 122626 -221134 -84212
12324 139181 313671 289794 56638 -31479 190739 -102725 240004 430830 139232 155483
12314 155483 -410811 -338523 -17180 -49463 -56409 -185704 52955 -219482 -229899 71931 33416
12302 -123588 -241069 145080 -218480 -118438 -98193 -92846 261675 124905 89756 268640
12292 268640 238936 -117969 327483 88983 156438 98659 132015 65636 103693 93510 -53613
12280 278316 -250713 60498 -173249 -114046 46768 -10368 498723 -93463 11377 -69291 346935
$$ packed form
12356d45261a04935j55203A43091b47258e6191J8102A42581f2255A11647b7858
12345F0219L65847a55543A6147a15310C69146l3159G6299c15295e3182l23123
12335c76305J59007j02549J49387F1926d0996A4449a22263A22626b21134h4212
12324A39181J74490k3877E6638c1479A90739a02725B40004J90826A39232J6251
12314A55483d10811P2288a7180l2283o946j29295E2955b19482j0417G1931C3416
12302a23588j17481A45080b18480J00042K0245N347B61675A24905l5149J78884
12292B68640k9704a17969C27483H8983O7455n7779L3356F5636L8057j0183e3613
12280B78316b50713F0498a73249N9203D6768a0368D98723i3463A1377f9291C46935
$$ plain form
12268 123492 21485 -60780 26208 -178267 -83568 -86055 118903 -169335 183617 -110874 135127
12256 26896 168787 37108 -11736 131142 138763 -133811 69644 341920 77323 -48814 2880
12244 -227676 -75754 187332 320421 -191356 -110024 388552 -6181 -24490 -300104 337159
12233 25482 64206 275440 426873 55008 49289 177110 -12510 169728 564202 -149757 137132
12221 112784 35432 171253 227802 161929 99312 290248 -58940 12448 594054 38765 65222
12210 65222 290138 137952 -304380 173270 -60087 -137972 405810 35654 206950 427634
12200 427634 257171 331036 297139 229578 17390 286185 287295 422415 410914 484164 139548
12188 261896 138304 360143 124536 142161 4184 -198837 122391 -116853 -190449 251084
$$ packed form
12268A23492B1485f0780B6208a78267h3568k487A18903a69335A83617a10874A35127
12256B6896J41891C7108a1736A31142P621a33811F9644K72276G7323d8814B880
12244b27676g5754A87332J33089a91356Q1332C88552f181j8309k75614C37159
12233B5482L8724K11234J51433E5008n719J27821a2510A69728L94474a49757A37132
12221A12784C5432J35821N6549o5873o2617J90936e8940A2448N81606C8765K6457
12210F5222K24916A37952c04380A73270f0087p7885D05810C5654J71296K20684
12200D27634j70463P3865l3897o7561A7390K68795J110J35120j1501P3250A39548
12188B61896j23592K21839A24536J7625D184a98837A22391a16853p3596B51084
$$ plain form
12177 77717 251120 266488 149978 78537 114685 -154356 10901 -67109 -108950 25980 -165426
12165 7423 -201404 534509 -43250 -4138 -342237 104485 -83125 -223897 -377436 -124979 85834
12153 -70594 201055 -170423 -133656 -309800 -324141 -148243 342619 79131 240439 -234021
12142 -14338 -150730 16250 182901 175163 -190613 25778 34202 -156217 -115069 -46995 219713
12130 -124028 -82346 -77946 -197724 -271082 16982 33116 314993 177628 74525 -281515 -44194
12118 -257219 154556 46615 173838 -136410 72596 30997 -151232 178047 346595 93349
12107 -286620 92605 -9433 113226 -129446 139224 14158 -252659 -35642 288865 30242 -33494
12095 -47528 -37570 27916 -77714 -143468 92128 15225 83587 -20846 401770 -83061 -108414 108393
$$ packed form
12177G7717J73403J5368j16510p1441L6148a54356A0901f7109m1841B5980a65426
12165G423b01404E34509d3250d138l38099A04485h3125j40772j53539a24979H5834
12153g0594B01055a70423L6767j76144j4341a48243C42619G9131J61308b34021
12142a4338j36392A6250J66651p738a90613B5778Q424a56217M1148d6995B19713
12130a24028M1682M400j19778p3358A6982J6134K81877j37365G4525b81515d4194
12118b57219A54556D6615J27223a36410G2596C0997a51232A78047J68548I3349
12107b86620I2605i433A13226a29446A39224A4158b52659c5642B88865C0242c3494
12095d7528R958B7916g7714o5754I2128A5225O8362b0846D01770h3061k5353A08393
$$ plain form
12082 238649 125355 -117992 -86853 -340861 261665 -97241 107282 173013 -27796 398455
12071 -55430 435256 -67886 310844 83463 99207 1101396 1754402 398528 305987 102914
12060 -101866 -47105 -175884 89309 178248 -153785 148113 54236 -241337 -70151 100767
12049 -338505 -50673 -16839 -75183 113320 -78101 477533 -300109 4008 -142788 -18537 357789
12037 29781 313792 -358590 -54933 -140820 -76194 1024 36108 -120579 38324 -275143 113794
12025 -290338 -406756 -177303 57413 -20065 -56048 -393718 -142629 -75515 176427 58107
12014 16476 85515 96107 87394 220589 -23345 -142211 -80467 25897 -209968 -503867 -336239
12003 -336239 -8719 -14343 -229863 150499 114362 81120 -208506 -30601 -117052 143707 118391
$$ packed form
12082B38649j13294a17992L1139k54008B61665i7241A07282O5731b7796C98455
12071e5430D35256f7886C10844H3463J5744J002189O53006C98528r2541A02914
12060a01866d7105j28779H9309Q8939a53785A48113E4236b41337g0151A00767
12049c38505e0673a6839n8344A13320g8101D77533c00109D008a42788a8537C57789
12037B9781K84011c58590e4933q5887O4626A024L5084a20579C8324b75143A13794
12025b90338j16418a77303E7413b0065l5983l37670a42629O7114A76427E8107
12014A6476O9039J0592q713J33195b3345j18866O1744B5897b09968k93899J67628
12003c36239h719n624k15520A50499l6137l3242b08506c0601q6451A43707k5316
$$ plain form
11992 118391 -288842 -83272 12088 -138712 265229 82763 -12164 -133662 13831 92059 -641
11980 129265 64492 -122953 -43714 257074 20 -312762 38262 136538 -8667 103150 -46937
11968 -240174 254697 -67051 95809 94645 -108427 -261408 226807 -82644 -271420 -139246
11958 -139246 -206371 30292 31128 83112 -180228 -38537 -42189 208163 -162625 120448 -17104
11946 -234176 83755 154373 151481 238453 -58104 232115 148385 -10659 -181905 68758 437051
11935 437051 -406718 59498 -5512 118648 59936 -198327 97437 34925 217675 -56967 -178508
11924 -178508 -53057 -3154 114122 78620 -25068 10806 -144758 -142810 328393 -118212 358506
11912 -78521 -192294 -193224 -120513 6338 -30801 -120220 -202240 54901 243983 97477 136339 57581
$$ packed form
11992A18391b88842h3272A2088a38712B65229H2763a2164j21498A3831P8228f41
11980A29265F4492a22953d3714B57074B0c12762C8262R8276h667A03150d6937
11968b40174B54697f7051I5809j164a08427j52981B26807h2644j88776J32174
11958a39246o7125C0292Q36N1984a80228c8537l652B08163a62625A20448a7104
11946b34176H3755P0618k892Q6972e8104B32115q3730a0659j71246F8758L68293
11935D37051d06718E9498e512A18648n8712a98327I7437C4925J82750e6967j21541
11924a78508e3057c154A14122l5502b5068A0806a44758J948C28393a18212C58506
11912g8521j13773r30P2711F338c0801q9419q2020E4901J89082I7477L8862E7581
$$ plain form
11899 -152757 -50377 71960 -146907 -179177 -340510 -137069 102734 -196958 -56334 45781
11888 -221700 -29946 85374 -300722 -238565 -133572 -231484 -411500 222617 104959 -300711
11877 -158852 70567 -42964 -264514 -16094 -102730 192530 -265142 -147349 354460 -148539
11866 -331604 23197 80703 -177882 177483 157997 -82846 352854 -133677 63665 -174916
11855 248488 -157670 -41456 -70983 122229 52155 223051 312108 -117404 -41053 201255
11844 64529 44087 -45428 42694 -94608 -61733 47880 -343235 125482 -378026 -188466 -57863
11832 -137464 -108987 -172196 178615 231093 -214806 -25308 50744 -38096 -508691 -188077 -186124
11821 -186124 -103821 17856 201006 117235 -103914 71093 17002 -121418 223778 24527 -85393
$$ packed form
11899a52757e0377G1960a46907l2270j61333a37069A02734a96958e6334D5781
11888b21700b9946H5374c00722O2157J04993r7912j80016B22617A04959c00711
11877a58852G0567d2964k21550a6094q6636A92530b65142J17793C54460a48539
11866c31604B3197N7506a77882A77483j9486h2846C52854a33677F3665a74916
11855B48488a57670d1456k9527A22229E2155J70896Q9057a17404d1053B01255
11844F4529k0442d5428D2694i4608L2875D7880c43235A25482c78026a88466e7863
11832a37464K8477o3209A78615N2478b14806b5308E0744c8096m70595a88077J953
11821a86124Q2303A7856J83150q3771a03914G1093A7002a21418B23778B4527h5393
$$ plain form
11809 291550 -102656 -47845 354456 69996 61273 9045 14047 64612 -55378 -118192 -149802 -43488
11796 94717 116459 -155026 -188191 431047 -38349 23350 -87382 460434 376789 -60101 263026
11784 -84596 -232054 -315315 -130015 -84115 65372 -98891 42356 -194090 -17775 -125448 -408203
11773 -408203 -355232 113827 170638 -116276 240201 -42480 63855 466668 19754 23500 -271534
11761 -114587 -7346 21995 -390585 -220284 -173627 -380430 108358 295619 -252777 -39969
11750 165781 136260 -280409 -5789 13919 36087 28257 -123317 191324 109813 -19459 -74631
11739 -74631 -339957 -80428 227364 174917 -58205 67709 -375487 -159578 -24416 322665 -233049
11727 93981 -44947 -161525 98942 -11050 -13713 122453 16696 15667 224651 183720 -117011
$$ packed form
11809B91550a02656d7845C54456F9996q723I045N002N0565e5378o2814l1610d3488
11796I4717K1742a55026l3165D31047c8349B3350h7382D60434q3645f0101B63026
11784h4596j47458q3261a30015M5900F5372i8891D2356a94090a7775j07673k82755
11773d08203N2971A13827N6811a16276B40201d2480F3855M02813A9754L746b71534
11761a14587g346B1995c90585J70301M6657k06803A08358J87261b52777c9969
11750A65781k9521b80409e789A3919K2168p830a23317A91324q1511a9459n5172
11739g4631k65326h0428B27364n2447e8205F7709c75487a59578b4416C22665b33049
11727I3981d4947j16578I8942a1050k663A22453A6696j029K08984m0931a17011
$$ plain form
11715 -42158 -391855 39194 42870 -243731 84368 59328 255348 159666 -175724 -130705 234283
11703 256574 -46314 40565 -248257 -33575 -67191 -76286 84404 181683 325357 296152 -49540
11691 180868 -245553 118868 -80468 -15162 256352 -124139 208732 -130498 113303 50481
11680 101429 -122650 164840 164139 375525 210335 115359 -289070 10992 132337 61499 316796
11669 316796 -14080 92150 4776 327086 -192182 -34760 110342 226109 56452 -36712 135646
11657 92735 -101311 504764 23065 207614 137653 -20676 173635 -15510 -324219 69003 -318175
11645 -31139 48034 116335 -97053 -121065 109085 295755 -59364 1839 -312043 -79402 36654
11633 -263911 117553 -183688 179422 209828 194777 321515 -21013 105730 -161598 204713
$$ packed form
11715d2158l49697C9194L676b43731H4368k5040J96020r5682a75724M5019B34283
11703B56574d6314D0565b48257c3575l3616r095H4404R7279J43674k9205d9540
11691A80868b45553A18868h0468a5162B56352a24139B08732a30498A13303E0481
11680A01429a22650A64840p01K11386j65190r4976b89070A0992J21345F1499K55297
11669C16796a4080I2150D776L22310a92182c4760A10342J15767E6452c6712A35646
11657I2735a01311E04764B3065J84549o9961b0676A73635a5510l08709F9003c18175
11645c1139D8034O8301i7053k4012A09085J86670e9364A839c12043g9402C6654
11633b63911A17553a83688A79422L0406j5051J26738b1013A05730a61598B04713
$$ plain form
11622 86901 -158121 -30587 -70345 -339181 -31065 -50661 156281 38683 70596 111897 66951
11611 66951 227123 -83561 62496 17931 -299635 -58510 215926 31268 178253 27298 146851
11600 146851 -24213 284032 727 -398470 -218427 -37243 -237167 -64476 26255 -66038 25177
11588 -193791 225399 127199 130941 294249 293919 -26825 236305 342224 -3112 75464 128865
11577 128865 -211391 135419 105180 -9876 -111201 -8260 562173 -13784 101551 64357 -118878
11565 44135 256620 226411 -296654 209897 116520 124895 -21975 123010 141371 218509 -144342
11553 97454 51221 138906 32143 188664 5602 375460 62636 343951 19322 68294 193693
11542 193693 -207402 -73438 151437 239131 23079 -41415 139800 528042 21293 -14707 204492
$$ packed form
11622H6901a58121c0587l9758k68836c1065j9596A56281C8683L1913M1301m4946
11611F6951J60172h3561F2496A7931b99635e8510B15926C1268J46985B7298J19553
11600A46851b4213B84032G27c98470J80043c7243j99924f4476B6255f6038B5177
11588a93791B25399r8200L742J63308l30b6825B36305J05919c112G5464N3401
11577A28865b11391A35419l0239i876j01325h260E62173a3784A01551l7194a18878
11565D4135K12485l0209b96654B09897r3377Q375b1975A23010J8361P7138a44342
11553I7454m6233Q7685C2143J56521E602L69858F2636K81315A9322M8972J25399
11542A93693b07402g3438A51437Q7694B3079d1415A39800L88242B1293a4707B04492
$$ plain form
11530 231110 125256 36968 76547 105631 -100948 -56125 105655 9281 -60785 174617 -66396
11518 219239 362052 337978 -17662 327858 240547 237801 -112404 151191 79352 11287 -195181
11506 320351 72336 7107 200600 -58999 -231851 198332 68103 -108739 -18864 50077 272347
11495 272347 -50235 19509 22941 -112049 31858 465960 111089 192263 154661 72768 53642
11484 53642 -50857 208745 243786 442122 -54803 178203 266711 170472 185443 103695 -219131
11472 50869 143840 58881 352939 -71456 173136 -123351 -179260 237913 -61688 134620 143977
11461 143977 130 74152 125264 -53924 84649 229096 147242 233247 38511 -7832 49143 50299
11449 50299 363024 39754 -41656 90197 85687 146394 13606 -134961 177931 214817 29135
$$ packed form
11530B31110j05854C6968L9579K9084a00948M4823A05655I281f0785A74617f6396
11518B19239J42813k4074a7662C27858q7311k746a12404A51191p1839A1287a95181
11506C20351G2336G107J93493e8999j72852A98332F8103a08739a8864E0077K22270
11495B72347e0235A9509L432a12049C1858M34102A11089Q1174l7602G2768j9126
11484E3642e0857B08745L5041J98336e4803A78203Q8508r6239J4971q1748b19131
11472E0869R2971E8881K94058g1456A73136a23351n5909B37913f1688A34620R357
11461A43977A30P4022N1112e3924H4649J44447q1854Q6005C8511g832D9143J156
11449E0299L12725C9754d1656I0197m510O0707A3606a34961A77931L6886B9135
$$ plain form
11437 76139 -22117 -38077 68332 113483 -32232 62031 361194 -197992 165711 127374 181827
11426 181827 201725 141191 171176 -213048 85336 -17929 160977 -41078 -111808 -79728 17461
11414 11250 -206595 -8162 -88857 -136930 44001 -42726 77276 -131715 -155271 127790 -49719
11402 -136604 307401 245929 -128909 -285170 -122352 265450 -227748 -216267 99980 90323
11392 90323 14360 86899 5461 88474 239986 -111649 -224445 88582 25021 -161492 335249
11380 3932 76136 369950 192794 1882 -12664 218419 157933 -81106 72102 -105351 81903
11368 -36057 -136361 212430 -95085 -152648 144481 -289574 -340916 -46492 238697 -139222
11357 -253541 105914 118542 186502 -156434 167457 -51104 14148 88979 -171146 -83955 35788
$$ packed form
11437G6139b2117j5960F8332M5151c2232F2031K99163a97992A65711l8337N4453
11426A81827J9898o0534K9985b13048H5336a7929A60977d1078p0730L2080A7461
11414A1250b06595h162q0695m8073D4001d2726G7276a31715k3556A27790d9719
11402a36604C07401o1472a28909j56261a22352B65450b27748J1481I9980r657
11392I0323A4360P2539E461Q3013J51512a11649j12796H8582B5021a61492C35249
11380C932P2204K93814j77156A882a2664B18419o0486h1106G2102a05351H1903
11368c6057j00304B12430i5085n7563A44481b89574n1342d6492B38697a39222
11357b53541A05914J2628O7960a56434A67457e1104A4148P4831a71146h3955C5788
$$ plain form
11345 54905 50887 230779 -150474 166952 62582 -92209 279580 306422 74715 136207 -122432
11333 137829 -2692 -117753 -98249 -59479 293197 -86868 260066 -39578 -26877 -231290 -351733
11322 -351733 -39197 -256728 -103801 -19537 -125822 246203 151123 -161166 -38420 139274
11311 44445 -83901 -102659 23459 172399 36351 -101438 -183633 -297594 -229408 127786 -320175
11299 336983 324849 -27675 87237 -26136 -10970 292760 -70914 16452 21567 -11929 -144212
11288 -144212 -391508 50565 3271 -6190 -258762 154778 -61711 402867 112736 -326022 50235
11276 -12676 89653 282010 189547 194973 -225557 -7229 -179751 -257682 -135330 -296376 -106662
11264 115146 -85109 -217811 151207 -125037 -4284 -192464 -280293 -258588 -66987 -297505 16375
$$ packed form
11345E4905m018J79892a50474A66952F2582i2209B79580K6842G4715O1492a22432
11333A37829b692j15061J9504L8770B93197h6868B60066c9578J2701k04413j20443
11322c51733c9197k17531a03801a9537j06285B46203r5080a61166c8420A39274
11311D4445h3901j8758B3459J48940C6351a01438q2195j13961O8186A27786c20175
11299C36983j2134b7675H7237b6136a0970B92760g0914A6452N115a1929j32283
11288a44212k47296E0565C271f190k52572A54778f1711D02867A12736c26022E0235
11276a2676H9653J92357r2463N426b25557g229j72522p7931J22352j61046a06662
11264A15146h5109j32702A51207a25037d284j88180q7829K1705f6987k30518A6375
$$ plain form
11252 -319891 -45858 -41383 -59560 -180215 99173 165618 -142866 96522 349824 -71969 -143944
11241 -143944 -133735 60804 52757 -211859 -303626 250478 119755 -124336 51538 -108077 38898
11229 44912 60306 167624 -152543 -35512 -17387 182998 -306889 122489 -24699 -366443
11219 -366443 62337 189803 -272462 350045 229643 157206 -35986 -131432 -430822 -92747
11208 -148071 -273777 209335 49950 -219006 -109261 -76986 191509 18435 104627 -185169
11197 106502 199524 19009 30964 -225106 -32937 -253064 9305 -249910 -81184 -205159 233534
11185 -17435 -214200 54037 -34029 -388191 -197729 113262 -206754 -356919 -259995 -362640
11175 -362640 52990 -169757 -333293 -197321 -57237 -70805 97625 -109647 -136655 -117944 -85130
$$ packed form
11252c19891d5858M475j8177j20655I9173O6445a42866I6522K53302g1969p1975
11241a43944J0209F0804q047b11859r1767B50478A19755a24336E1538a08077C8898
11229D4912J5394J07318a52543c5512a7387A82998c06889A22489b4699l41744
11219c66443F2337J27466b72462C50045j20402p2437c5986r5446k99390i2747
11208a48071j25706B09335D9950b19006a09261L2275A91509A8435Q6192a85169
11197A06502R3022A9009J1955b25106c2937k20127I305b49910h1184j23975B33534
11185a7435j96765E4037c4029l54162J90462A13262b06754j50165R6924j02645
11175c62640E2990a69757j63536J35972e7237j3568I7625a09647k7008J8711L2814
$$ plain form
11164 -85130 144055 -50081 -250265 -76742 26439 140588 -51798 222695 -134068 90524 -407779
11152 389018 194169 -55084 -78779 109740 -177004 34552 102579 -102055 16262 -183663
11141 5154 233008 195501 -92614 -15706 84979 -141962 153080 -404115 249018 7742 79029
11130 79029 177126 71675 -2759 -122428 278139 98088 146577 291488 60155 423919 135254
11118 -92467 -243083 -80433 151824 -272016 -24846 37569 35952 254131 -64779 26783 -144800
11106 77454 102187 252488 246153 191290 318654 131926 399845 47769 110629 240706 58559
11094 395756 82329 130359 399345 221216 387775 130653 267974 194081 307309 445169
11084 445169 98861 -68283 299463 283169 163623 283193 10023 613630 38305 162979
$$ packed form
11164h5130A44055e0081k00184g6742B6439J14149e1798B22695a34068I0524d07779
11152C89018A94169e5084k3695A09740a77004C4552O8027a02055A6262a83663
11141E154K27854l7507i2614a5706H4979a41962A53080d04115B49018G742P1287
11130G9029R8097G1675b759j19669B78139I8088M8489J44911F0155L63764A35254
11118i2467j50616h0433A51824b72016b4846C7569j617K18179f4779B6783a44800
11106G7454K4733J50301o335n4863J27364A31926K67919D7769O2860J30077E8559
11094C95756H2329M8030K68986j78129J66559A30653J37321p3893J13228J37860
11084D45169I8861f8283B99463j6294j19546J19570A0023O03607C8305J24674
$$ plain form
11074 162979 255233 226345 132545 369505 566699 299370 370011 374120 578425 467542 483332
11063 483332 126289 334541 495042 254185 461023 515265 1079394 553758 433297 401104
11053 401104 695514 821735 773842 427675 783968 738143 905252 640218 449463 743882
11043 743882 447395 650963 830390 767511 622420 713920 656638 878480 391106 706317
11033 706317 733378 335174 922171 705164 420144 655785 632432 413440 823677 927211
11023 927211 578810 567346 696353 600330 389689 245625 611403 780937 491905 382012
11013 382012 628129 821808 498262 176019 931688 541901 783198 531121 570209 621295
11003 621295 696583 520157 699843 779330 860038 770817 736886 561053 734611 511342
$$ packed form
11074A62979R2254k8888r3800K36960J97194k67329P0641M109K04305j10883J5790
11063D83332A26289K08252J60501k40857K06838N4242N64129n25636j20461l2193
11053D01104K94410J26221m7893l46167L56293m5825J67109k65034j90755K94419
11043G43882k96487K03568J79427o2879j45091R1500n7282K21842C91106L15211
11033G06317K7061C35174N86997k17007k85020K35641k3353k18992M10237J03534
11023I27211l48401j1464J29007r6023k10641j44064L65778J69534k89032j09893
11013C82012K46117J93679l23546A76019P55669l89787K41297k52077L9088N1086
11003F21295P5288j76426J79686P9487Q0708q9221l3931j75833J73558k23269
$$ plain form
10993 511342 296589 251362 821102 852825 421412 962979 601533 644186 404229 1094330
10983 1094330 917503 1251224 964946 1236570 995379 1527104 1770546 1750160 1654198 2164164
10973 2164164 2252693 2525783 2460628 2668637 2412448 2159581 2523254 2013520 1564291 1546685
10963 1546685 1506136 1317242 1651788 1605177 1571777 1442736 1385700 1539019 1603978 1497362
10953 1497362 978107 1597959 924549 928579 640729 732201 431304 330247 129991 540207
10943 540207 210381 218395 333778 394841 286824 2584 -58303 -33027 -48691 -327721 -170792
10932 -170792 291709 70658 88672 141843 -17291 409683 -151845 63742 72619 320443 384621
10921 384621 -40797 17357 165616 -165303 176056 6492 -278311 -64929 83379 42934 -109140
$$ packed form
10993E11342k14753m5227N69740L1723D21412N41567l61446M2653k39957O90101
10983A094330j76827L33721k86278K71624k41191N31725K43442k0386r5962N09966
10973B164164Q8529K73090o5155K08009k56189k52867L63673n09734m49229j7606
10963A546685m0549j88894L34546m6611l3400j29041n7036J53319O4959j06616
10953A497362n19255O19852o73410M030k87850R1472l00897j01057A29991M10216
10943E40207B10381Q014J15383O1063j08017B584e8303K5276j5664k79030J56929
10932a70792B91709G0658J8014N3171a7291D09683a51845F3742Q877K47824O4178
10921C84621d0797A7357J48259a65303A76056F492b78311f4929H3379m0445a09140
$$ plain form
10909 163983 -32456 41375 131811 -85918 -74391 -304561 -57420 16076 121749 -345446 136825
10897 322416 77873 -18029 161933 1416 -289029 155313 62641 -140354 -250739 151371
10886 34865 -234579 45045 13388 -100401 29027 142101 93481 -259094 112545 90212 37693
10874 -14778 100152 160939 225792 -23297 9720 -96531 -67707 -339025 304150 -22718 64892
10862 -90543 -73304 -41100 -147995 -96795 -177839 -38889 -15043 -100702 -18233 -108131 -59928
10851 -59928 57246 -11181 179649 -258500 -93764 -135905 91638 -118434 -167217 -117626 196339
10839 301327 -28076 286740 131425 -599191 -154889 -349557 -66869 -160286 91779 159551
10829 159551 200761 -274413 -23524 -163474 -123003 45891 -111902 -62519 -121936 -177438 287461
$$ packed form
10909A63983c2456D1375R0436h5918J1527k30170e7420A6076J05673c45446A36825
10897C22416G7873a8029A61933A416b89029A55313F2641a40354j10385A51371
10886C4865b34579D5045A3388a00401B9027J13074m8620b59094A12545k2333C7693
10874a4778A00152O0787O4853b3297I720i6531K8824k71318C04150b2718F4892
10862i0543J7239L2204j06895N1200q1044c8889a5043q5659a8233q9898M8203
10851e9928E7246a1181A79649b58500i3764m2141I1638a18434m8783M9591A96339
10839C01327b8076B86740A31425e99191a54889j94668f6869r3417I1779O7772
10829A59551M1210b74413b3524j39950M0471D5891a11902M9383n9417n5502B87461
$$ plain form
10817 -69867 84458 89579 23036 -93433 -22315 397611 -115703 -247250 -199498 129059 -127454
10805 -1890 200878 184307 -252210 -17690 63502 -119372 -36484 49341 -68716 -178282 -69944
10793 -25063 -333768 50727 -231038 269719 160667 236664 44048 -198176 -101107 -295826
10783 -295826 47203 -115929 -125053 -32055 63777 -187444 71904 132818 -153149 -248023 -252898
10772 -252898 267017 141859 -123949 350679 -38145 -215591 68119 -107479 -143092 -306785
10762 -306785 -18717 -270919 177282 -37320 -7219 215830 -227395 -265272 178978 -175327
10751 181611 118583 72654 -30510 -11850 -22062 38676 309354 -45891 -317791 194915 -34268
10739 -101210 -165060 -349488 -355907 -352617 -181957 93473 64551 -57524 -85833 341013 -137432
$$ packed form
10817f9867H4458N121B3036i3433b2315C97611a15703j31547M7752A29059a27454
10805a890B00878j6571b52210a7690F3502a19372c6484D9341f8716j09566f9944
10793b5063l08705E0727b31038B69719j09052P5997D4048a98176R7069j94719
10783b95826D7203a15929r124c2055F3777a87444G1904O0914a53149r4874m875
10772b52898B67017j25158a23949C50679c8145j77446F8119a07479l5613j63693
10762c06785a8717k52202A77282c7320g219B15830b27395l7877A78978a75327
10751A81611o3028m5929c0510a1850j0212C8676K70678d5891k71900A94915c4268
10739a01210o3850j84428o419L290J70660I3473k8922e7524k8309C41013a37432
$$ plain form
10727 62151 105590 -120759 -93539 -20380 -100709 179903 -131800 -125817 -191982 200361 -174147
10715 -100115 157789 34541 -147928 -355302 460811 -291657 -16084 144988 -163158 -518219
10705 -518219 -211736 -393412 -80078 -266357 23322 -307524 114086 475727 -244890 -59813
10694 -195578 89276 225705 -102856 -101844 68702 -389306 108759 529412 -102606 -22977
10683 -157048 -81238 -212083 -233765 -158772 2063 -79736 148973 197042 204183 211385 77075 -207953
10670 49243 -164871 -180481 20258 63508 -403114 39270 -264485 -298555 131484 235998 119597
10659 119597 -35572 19072 -136740 237480 -221233 19520 -114541 -160646 112618 199450
10649 199450 -32239 -288735 -123082 -102728 40239 1162 -405554 -222820 -64114 -5548 -16433
$$ packed form
10727F2151M3439a20759K7220b0380q0329A79903a31800N983o6165B00361a74147
10715a00115A57789C4541a47928k07374D60811b91657a6084A44988a63158l55061
10705e18219b11736j81676h0078j86279B3322c07524A14086L61641b44890e9813
10694a95578H9276J36429a02856J012F8702c89306A08759M20653a02606b2977
10683a57048P5810j30845k1682P4993B063g9736A48973M8069P141P202G7075b07953
10670D9243a64871j5610B0258M3250d03114C9270b64485l4070A31484J04514j16401
10659A19597c5572A9072a36740B37480b21233A9520a14541m6105A12618Q6832
10649A99450c2239k56496a23082K0354D0239A162d05554J82734f4114e548j0885
$$ plain form
10638 -16433 -47261 370270 125033 -107069 -84858 -212207 -31231 336562 -243776 103727
10627 286220 -149887 12107 23724 -130228 -283700 -156913 79511 -426266 -41655 -75125
10617 -75125 64495 -113384 92649 -88536 86405 -10364 -97830 -5683 8524 267710 -199684
10605 -152457 -38969 -280238 -32977 154074 22835 -135728 -240684 -128956 -78056 -73016 149770
10593 156731 -95850 152457 -58756 247923 63770 142572 -300155 -65019 49241 228842 76545
10581 -11184 -525 -53196 126776 440709 -133681 -341183 90387 47419 203153 -27656 -203739
10570 -203739 -135750 -299609 175696 413852 -148651 -86348 45664 60900 -345388 -269575
10560 -269575 147632 116076 27439 -70780 258887 -6235 407863 -264372 -73143 217551 460127
$$ packed form
10638a6433l0828C70270A25033a07069K2211j27349c1231C36562b43776A03727
10627B86220a49887A2107J1617a30228j53472J26787G9511d26266d1655l3470
10617g5125F4495a13384I2649h8536H6405a0364q7466e683H524K59186a99684
10605a52457c8969k41269c2977A54074B2835a35728j04956J11728N0900N040A49770
10593A56731i5850A52457e8756B47923F3770P8802c00155f5019D9241J79601G6545
10581a1184e25n2671A26776L13933a33681k07502I0387m2968J55734b7656j76083
10570b03739O7989j63859A75696K38156a48651O2303D5664J5236c45388P5813
10560b69575A47632l1556B7439g0780B58887f235D07863b64372g3143B17551K42576
$$ plain form
10549 460127 -300641 30081 -215247 -295348 148150 152682 92420 -41381 -70387 285799 -234343
10537 -65485 -324896 -318812 -58240 -370230 -202674 -28764 -210841 -127669 51673 -55937 389391
10525 -214283 -20996 -104558 328623 -55339 -303722 301422 72216 -165399 -114040 -141441 56807
10513 -280370 274248 373457 -69613 300853 -102095 313023 453346 -14897 69290 -136364
10502 -217986 -184260 -80702 -168745 152713 180177 19168 233628 -91386 -50526 154309 -309643
10490 27210 71077 208538 93107 -16575 -60269 163874 132744 21733 193248 566502 879045
10479 879045 333497 208506 219530 107698 42041 -71247 66076 20037 -322412 -159396
10468 47141 -26198 -59637 91320 8962 -133371 -230808 -343126 -31315 -29679 73340 29949 253817
$$ packed form
10549D60127c00641C0081b15247q0101A48150M532o0262d1381k9006B85799b34343
10537f5485k59411O084e8240l11990J67556b8764j82077Q3172E1673e5937C89391
10525b14283b0996q3562C28623e5339k48383C01422G2216a65399N1359k7401E6807
10513b80370B74248R9209f9613C00853a02095C13023J40323a4897F9290a36364
10502b17986L3726h0702q8043A52713K7464A9168K14460i1386M0860A54309c09643
10490B7210M3867J37461I3107a6575m3694A63874l1130B1733J71515L73254L12543
10479H79045C33497j24991J1024A07698D2041g1247F6076B0037c22412a59396
10468D7141b6198l3439I1320H962a33371r7437j12318c1315J636G3340B9949K23868
$$ plain form
10456 253817 137368 50716 -291190 -169088 197709 -8802 -2744 -88946 109235 -121073 -39997
10444 -51473 48556 295763 -25865 -130356 -39962 238767 -130506 -237075 -209715 49568 38041
10433 38041 218946 336055 -99169 155950 -48729 -120333 37800 -75121 346038 142697 -196764
10421 58986 -413954 -311807 -73624 1373 304512 192351 -142800 -22204 18499 -46917 -25339
10410 -25339 249500 5984 -166982 -21301 -55603 230740 -10666 26646 -125483 206213 -177095
10398 -132842 -13804 -18595 -109664 140751 435497 9863 -228480 -109653 264665 249878 381926
10387 381926 38865 112889 125724 377014 -56096 117318 79130 127352 -134807 453443 -52420
10375 348187 385479 114813 295272 188226 95421 633653 348888 388996 443457 440476 636376
$$ packed form
10456B53817j16449E0716b91190J22102A97709h802b744q6202A09235a21073c9997
10444e1473D8556K47207b5865j04491c9962B38767a30506j06569K7360D9568j1527
10433C8041J80905J17109i9169A55950d8729p1604C7800g5121C46038A42697a96764
10421E8986d13954J02147g3624A373L03139j12161a42800b2204A8499d6917K1578
10410b5339B49500E984a66982b1301l4302B30740a0666B6646a25483B06213a77095
10398a32842a3804m791r1069A40751K94746I863b28480a09653B64665j4787J32048
10387C81926C8865P4024J2835K51290e6096A17318l8188M8222a34807D53443e2420
10375C48187L7292A14813J80459j07046r2805N38232k84765M0108N4461k981J95900
$$ plain form
10364 636376 386409 399421 240292 374988 134469 208019 29022 524090 54636 455815
10354 455815 258509 237861 257245 387068 550385 382702 189898 135071 161965 269312
10344 269312 376989 331776 17254 80348 254603 182395 279731 172757 143784 94744 -47232
10332 138857 -322854 210389 203857 73520 249648 65828 217277 172368 -94023 -130671 256583
10320 475626 264269 84867 3797 -63343 39872 -125548 91552 235875 140739 243411 -51647
10308 208029 -184355 40967 63195 235410 74987 17502 412650 14362 144579 -25349 -20723
10297 -20723 -167166 193345 -196635 -47916 44449 -229125 -7817 -190142 -75311 -230987 -414476
10286 -414476 -225268 -412329 -13304 -241381 111901 -312744 -25135 -211457 208358 17173
$$ packed form
10364F36376k49967J3012j59129J34696A34469P3550B9022M95068E4636M01179
10354D55815j97306k0648J9384J29823J63317j67683A89898n4827K6894J07347
10344B69312J07677m5213A7254O3094J74255p2208R7336j06974k8973m9040d7232
10332A38857c22854B10389o532G3520J76128F5828J51449m4909i4023l6648B56583
10320D75626k11357H4867C797f3343C9872a25548I1552J44323r5136J02672e1647
10308B08029a84355D0967K2228J72215G4987A7502L95148A4362J30217b5349M626
10297b0723j46443A93345a96635d7916D4449b29125g817j82325g5311j55676j83489
10286d14476J89208j87061a3304k28077A11901c12744b5135j86322B08358A7173
$$ plain form
10275 -84740 169287 -67377 173347 -240018 -267434 8058 -12355 -27887 82810 -33714 -258095
10264 -258095 -18174 324366 198277 362842 -145420 75084 254634 114679 58533 38532
10254 38532 41604 11288 3006 -305518 -194152 -102691 98028 236749 -304967 -198159 -405484
10243 -405484 389697 32011 42586 -87916 88770 4361 -56829 133662 -80369 27176 -124672
10231 160955 -367 -149766 -183984 -45365 -252345 -330399 10762 -3846 6280 305728 -47980 312916
10218 -235376 68742 -197163 -119915 -112700 98394 -230798 -124026 -367565 -87638 179659 7200
10206 -34115 -46912 -128493 -6012 -329620 -195684 87045 -281358 58005 -108694 -207410 -88307
10194 -212178 -14196 -284390 175777 -228001 -247882 95496 5666 177221 -275793 -341561 -29094
$$ packed form
10275h4740A69287f7377A73347b40018k7416H058a2355j5532H2810c3714k24381
10264b58095a8174C24366j26089J64565a45420G5084J79550A14679n6146k0001
10254C8532L072A1288C006c05518J11366R1461I8028J38721c04967J06808k07325
10243d05484C89697C2011J0575h7916H8770D361e6829A33662h0369B7176a24672
10231A60955c67j49399l4218d5365k06980p8054A0762c846F280K99448d7980C12916
10218b35376F8742a97163P7248P215I8394b30798J06772k43539h7638A79659G200
10206c4115j2797q1581f012l23608J33936H7045b81358E8005a08694r8716h8307
10194b12178a4196k70194A75777b28001j9881I5496E666J71555b75793o5768b9094
$$ plain form
10182 117649 423114 -294914 -99376 59958 -142351 -5380 -69486 22703 -267085 -199347 -144237
10171 -144237 146998 -22746 -203107 10333 -314049 -131418 248614 -308734 -139534 -242546
10161 -242546 185489 90938 328564 -149912 291627 -127754 -29963 -55481 9494 185390
10151 185390 -42037 -193827 10615 -205370 12003 321984 -255118 -40144 225247 -228880
10140 31115 -299473 116890 -370032 251393 -152333 -72506 164950 -175711 381414 -301557
10129 131902 -67673 -117454 -168855 -45390 -38298 -101127 -181491 -199107 -101937 -174811 -64912 -347192
10117 -347192 68159 46396 46549 -237526 -86361 -218293 -917 155296 -276738 65903 20318
10105 93415 100894 -222437 -214944 -164891 -178877 -153976 -52766 -19336 -48339 88354 -61641 37243
$$ packed form
10182A17649L05465b94914i9376E9958a42351e380o4106B2703b67085O7738N5110
10171a44237A46998b2746j80361A0333c14049a31418B48614c08734a39534j03012
10161b42546A85489I0938K37626a49912B91627a27754b9963k5518I494J75896
10151A85390d2037j51790A0615b05370A2003L09981b55118d0144B25247b28880
10140C1115b99473A16890c70032B51393a52333g2506A64950a75711C81414c01557
10129A31902f7673m9781n1401d5390P092o2829q0364j7616R7170p2874f4912k82280
10117c47192F8159k1763J53b37526h6361j31932i17A55296b76738F5903B0318
10105I3415P479b22437P493N0053j3986K4901e2766a9336k9003H8354f1641C7243
$$ plain form
10092 386870 -63526 -237342 -513 146860 -182282 -44972 -173778 242003 -139408 176090
10081 92272 -124823 -69470 27953 -464134 106801 -260823 -524 33392 -50179 62583 19966
10069 367868 -106262 31408 -145914 -8068 117147 48267 -26199 -107670 -289014 134331 -43725
10057 114356 148656 81697 -269640 -177392 61035 66935 -231729 -8594 -272680 -95728 -281558
10046 -281558 177547 -319099 -90528 -140426 174990 -252818 7029 59454 -87638 -88296 188096
10034 -341677 -212346 -106898 -194840 -113494 -244295 -225880 -89816 310726 -212759 -142261
10024 -142261 330072 -262858 -102083 209098 -89290 -237010 -30465 67105 71896 -42939 -141027
10013 -141027 19189 -171738 -333783 -80763 -77366 69200 26307 -58937 310927 -43724 3038
$$ packed form
10092C86870f3526j73816e13A46860a82282d4972j28806B42003a39408A76090
10081I2272a24823N5353B7953d64134A06801b60823e24C3392e0179F2583A9966
10069C67868a06262C1408a45914h068A17147D8267b6199q1471j81344A34331d3725
10057A14356L4300o6959b69640R2248F1035N900b31729h594k64086i5728j85830
10046b81558A77547c19099i0528m9898A74990b52818G029N2425h7638o58A88096
10034c41677J29331J05448q7942Q1346j30801J8415h9816C10726b12759P0498
10024a42261C30072b62858a02083B09098h9290j47720c0465F7105M791d2939r8088
10013a41027A9189a71738j62045h0763L397F9200B6307e8937C10927d3724C038
$$ plain form
10001 -307293 -474534 198954 -78136 -168434 -90681 -310875 -197341 38115 -189078 106338
9990 -234508 -221797 108013 -230203 213722 62890 61434 -149434 -3593 -20914 -96652 75874
9978 461216 68642 -41898 -224285 -396220 -106287 -3531 -159107 -174750 183350 -22803 -118180
9967 -118180 289606 18044 110160 33193 283992 -123333 -258237 -190044 -127933 -136271 -73319
9956 -73319 -40550 -27744 -209213 -112166 -89724 147134 -143887 -151888 -401354 -328528 6986
9944 -281857 -171228 21791 -257624 69095 -158749 -143290 -202155 -88474 -221537 215227 111752
9933 111752 68996 87481 -48011 -167766 1436 -10108 -410012 -36808 -165517 39513 -67461
9921 -56828 253633 118736 -157735 -375729 -114388 -171592 -106024 278207 -188745 47619
$$ packed form
10001c07293j67241A98954g8136r0298P7753k20194J13534C8115a89078A06338
9990b34508J2711A08013b30203B13722F2890j456a49434c593j7321p5738G5874
9978D61216F8642d1898j82387j71935a06287c531j55576j5643A83350b2803r5377
9967a18180B89606A8044R2116C3193K50799a23333j34904O8193O2111q338O2952
9956g3319L2769J2806j81469R7047K2442A47134a43887q001k49466P2826F986
9944b81857J10629B1791b57624F9095a58749J5459n8865h8474j33063B15227j03475
9933A11752m2756J8485d8011j19755A436a0108l99904c6808j28709C9513f7461
9921e6828B53633A18736a57735k17994a14388n7204O5568B78207a88745D7619
$$ plain form
9910 -57635 125905 72526 98930 -129640 -369603 19079 108810 -109316 -48429 -277246 -114613
9898 -279737 -273554 -30761 -23850 -205529 117460 61662 23962 -28256 -180344 -160410 129366
9886 69243 -64439 89521 162699 -149919 90910 -231279 70278 68355 -7618 -67231 -214988 -445885
9874 -445885 -278077 95536 -215765 -393007 -271827 -229808 -293883 -300841 -29115 110082 -201380
9862 176237 -221129 -81966 101140 -321841 -400559 -131705 -138665 65904 -375523 186768 -362283
9850 134498 244434 -59125 91778 24103 -193189 13812 12243 -319687 -10803 -94470 -59511
9839 -59511 -185375 143636 -167298 60380 -208835 -161518 -63456 11130 -158792 -142019 -51038
9827 -88672 -18941 131196 -78445 -142264 -89296 -62891 -5166 -138279 -102731 217073 -130 -85564
$$ packed form
9910e7635A25905n3379K6404a29640k39963A9079Q9731a09316d8429k28817a14613
9898b79737O183c0761O911j81679A17460n5798B3962b8256j52088J9934A29366
9886F9243f4439H9521P3178a49919I0910b31279G0278j923g618n9613j47757k30897
9874d45885J67808I5536b15765j77242J21180M2019o4075o958b9115A10082b01380
9862A76237b21129h1966A01140c21841p8718a31705o960F5904c75523A86768c62283
9850A34498J09936e9125I1778B4103a93189A3812j569c19687a0803q3667L4959
9839e9511j25864A43636a67298F0380b08835M7317f3456A1130a58792J6773e1038
9827h8672a8941A31196g8445o3819N2968K6405e166j33113L5548B17073a30q5434
$$ plain form
9815 -85564 -71034 -266359 190807 -107062 -61581 -121403 -188055 73232 -127600 -115809 -40506
9803 65861 -34329 -105305 -8953 220614 -5673 -253077 -106270 -337162 -48073 -74209 100462
9791 -29772 -172483 -338834 -123382 -143841 89152 69997 -307268 -4095 -82399 -57164 81742
9779 154083 165400 -134705 -174882 105864 -92408 39743 -27748 -213265 90327 -280123 120185
9767 236422 -172823 48858 -214517 9774 -246134 -350215 -71801 79384 -28757 -46905 -83987
9756 -83987 -399086 -75195 -143195 -35655 -213303 -86693 -463359 -63539 -4639 69572 -71013
9744 -38003 327614 -111410 -119188 75695 215906 -80557 16716 -312657 127306 -264483 48440
9732 -213581 -145510 94011 -112425 37391 -215538 126623 102835 164497 -227506 17947 8572
$$ packed form
9815h5564J4530j95325A90807a07062M5481n9822o6652G3232a27600J1791d0506
9803F5861c4329p0976h953B20614e673k47404a06270k30892d8073k6136A00462
9791b9772j42711j66351a23382k0459H9152j9155c07268d095p8304K5235H1742
9779A54083J1317a34705m0177A05864i2408C9743b7748j85517I0327b80123A20185
9767B36422a72823D8858b14517I774b46134j04081g1801G9384b8757j8148l7082
9756h3987l15099g5195o8000c5655j77648h6693l76666f3539d639F9572g1013
9744c8003C27614a11410p778G5695J40211h0557A6716c12657A27306b64483D8440
9732b13581O8071I4011a12425C7391b15538A26623k3788O1662b27506A7947H572
$$ plain form
9720 -194793 49232 211298 -245276 -424421 176912 -65559 -40764 340800 -5944 -34279 -341099
9709 -341099 284015 -171805 -17132 91885 -166798 282810 111153 228340 9234 -123829
9698 309880 -75993 -112710 -89363 -180722 126338 -82634 20226 -46289 65247 -157002 -310648
9687 -310648 188052 -182093 -66579 4570 -372704 -182082 -211853 -64131 -305891 -78358 -12583
9675 223371 48744 -78899 -1380 -127262 -258128 -36896 -179139 136936 112083 -287981 -15882
9663 456095 23498 -260029 -137823 103878 -376968 165817 70751 -122458 -116249 -173737 -240476
9652 -240476 172898 321452 -49734 -34330 -192712 -84866 53563 274027 10528 -118418 201229
9640 -203373 147309 -49856 -135694 -78444 -79954 -318523 -150217 126845 -99344 -306133 76431
$$ packed form
9720a94793D9232J62066b45276j79145A76912f5559K4795C40800e944k8335l06820
9709c41099B84015a71805a7132I1885a66798B82810A11153J17187I234a23829
9698C09880g5993l6717K3347r1359A26338h2634B0226d6289F5247a57002j53646
9687c10648A88052a82093f6579D570c72704a82082k9771f4131k41760g8358a2583
9675B23371D8744g8899a380j25882j30866c6896j42243A36936k4853b87981a5882
9663D56095B3498b60029J22206A03878c76968A65817G0751a22458O209n7488o6739
9652b40476A72898J48554d9734J5404j58382h4866E3563K20464A0528a18418B01229
9640b03373A47309d9856q5838N7250j510k38569a50217A26845i9344k06789G6431
$$ plain form
9628 -259793 -280127 -332022 206604 88287 -330705 -230547 -481716 151869 -165215 -310364
9618 -310364 -362981 -32726 55503 -58171 -284795 103400 -50216 197284 -79297 -121465 -49147
9606 -83946 88702 352892 -156372 -124986 -161387 -209715 113387 131047 118059 177674 296684
9595 296684 -124912 -459774 -212937 286579 -15400 -271715 -55827 -185188 170225 -211166
9584 -2691 -100665 109859 -118118 159608 -123369 15758 -105384 -169323 -369290 -253610 3565
9572 -208144 -17034 -55808 -137046 -179052 82203 -96440 136060 -169623 14443 -136867 -8338
9560 55741 189256 63459 -113979 -199935 -240415 -190696 -364493 -101221 -96724 -29021 219265
9548 -38534 9305 -38884 -121910 -487507 -295901 -206770 52636 -65328 -287162 118456 -161041
$$ packed form
9628b59793k0334n1895B06604H8287c30705J00158k51169A51869a65215j45149
9618c10364n2617c2726E5503e8171k26624A03400e0216A97284g9297m2168d9147
9606h3946H8702K64190a56372L1386l6401m8328A13387J7660j2988N9615J19010
9595B96684a24912l34862b12937B86579a5400k56315e5827j29361A70225b11166
9584b691r7974A09859a18118A59608a23369A5758a05384o3939j99967J15680C565
9572b08144a7034l8774q1238m2006H2203i6440A36060a69623A4443a36867h338
9560E5741J33515F3459a13979q5956m0480M9719j73797a01221M497b9021B19265
9548c8534I305c8884q3026l65597J91606Q9131E2636f5328k21834A18456a61041
$$ plain form
9536 -78692 -339122 -61128 10043 322703 -174306 26715 143496 -278096 107813 -19457 -282654
9525 -282654 -205239 -94486 -93738 -187569 -95920 -176369 -136307 101980 -28959 106726 -276669
9513 -333239 83172 42313 -21376 228676 -208827 64258 -69313 -37721 -305041 -159371 -227135
9502 -227135 -711 7707 67870 -41261 -117160 -33686 -146230 122731 210464 61255 -108218 316613
9489 250868 -393237 -44045 70638 -379862 -222222 201582 -57487 -207696 118327 -297017
9478 -487753 -181075 -317126 225438 -151111 -6008 -209545 -30261 -259197 -236502 -266420 -359823
9467 -359823 -420085 -71295 92355 -26642 -123262 345854 43349 -90142 -84373 74382 -271605
9455 2321 -99568 -406704 -219864 148714 -97040 -44945 104845 91724 -24468 -289800 40083
$$ packed form
9536g8692k60430f1128A0043L12660a74306B6715J16781b78096A07813a9457k63197
9525b82654P7415i4486P48r3831R1649q0449M0062A01980b8959A06726b76669
9513c33239H3172m0859b1376B28676b08827F4258f9313L1592k67320J45670o7764
9502b27135g11G707O0163d1261p5899c3686j12544A22731Q7733F1255a08218C16613
9489B50868c93237d4045G0638c79862J57640B01582e7487j50209A18327b97017
9478d87753a81075j36051B25438a51111f008k03537c0261k28936K2695k9918r3403
9467c59823o0262g1295I2355b6642r6620C45854D3349i0142N769G4382b71605
9455B321i9568l07136J86840A48714i7040d4945A04845j3121b4468k65332D0083
$$ plain form
9443 201300 -149853 131720 -86685 -97112 -82760 -41895 -90466 -13122 -74075 176533 -177526
9431 -35301 -81935 -54609 -152130 -249311 -213440 -367695 -160760 124050 -280996 -12605 98982
9419 -41880 88458 -244588 51264 -266943 2911 198662 -311277 -53008 -110486 -49997 -110252
9408 -110252 -4199 976 -11162 -472080 470221 60355 238048 -29306 -192168 -11902 -56118
9397 -56118 -163836 77260 -252801 -110874 169882 69268 12455 5419 -188305 -61390 -138304
9386 -138304 -229112 -39285 291555 25768 173480 224150 140419 22402 118021 -175912 112393
9374 59777 110129 120969 -212793 -136907 154201 -268886 -248280 151676 -123876 -59458 -146969
9363 -146969 353577 -334605 135569 59453 47720 -295367 87435 -40544 -349610 -72208 -63931
$$ packed form
9443B01300a49853A31720h6685j0427J4352M0865m8571a3122o0953A76533a77526
9431c5301m6634K7326r7521r7181L5871j54255a60760A24050b80996a2605I8982
9419d1880H8458b44588E1264b66943B911J95751c11277e3008n7478d9997o0255
9408a10252d199I76a1162m60918D70221F0355J77693b9306j62862a1902m4216
9397e6118j07718G7260b52801a10874A69882F9268A2455E419a88305f1390p6914
9386a38304r0808c9285B91555B5768J47712N0670q3731B2402R5619a75912A12393
9374E9777N0352J0840b12793P5886A54201b68886K0606A51676a23876e9458q7511
9363a46969C53577c34605A35569E9453j1733b95367H7435d0544l09066g2208Q277
$$ plain form
9352 -63931 -233820 -242124 -115865 181129 313770 -44897 -263252 -285544 -89047 -406211 75827
9340 -267331 -86045 -14261 -112442 -40504 169383 -90973 -71760 -198216 -241117 -143246 106675
9328 126404 -78597 -66629 235325 -84349 -280573 2397 84496 147497 -68443 -363314 -136442
9316 90015 -78982 136644 -21753 -111824 -334103 -197910 33723 -438682 81640 245277 -37680
9304 -246106 -185902 190092 136881 -159739 -321228 152057 -201605 -50428 -88761 -38436 -2238
9292 -264176 -399218 -95806 -132833 -417693 6134 -3995 -206400 143486 -216782 181390 -107057
9280 -146385 629917 -285645 -66942 -15360 -1793 -152431 -117137 44391 -80400 105290 76740
9269 76740 144840 81724 -257230 -153176 -224388 -10755 -111786 -234016 74802 -134733 -62786
$$ packed form
9352f3931j69889q304a15865A81129J32641d4897k18355k2292h9047l17164G5827
9340b67331h6045a4261r8181d0504A69383i0973J9213j26456m2901R7871A06675
9328A26404g8597J1968B35325h4349j96224B397Q2099O3001f8443k94871a36442
9316I0015g8982A36644b1753r0071k22279J36193C3723d38682H1640J63637c7680
9304b46106O0204A90092n3211a59739j61489A52057b01605e0428l8333c8436b238
9292b64176j35042i5806l7027k84860F134c995k02405A43486b16782A81390a07057
9280a46385F29917b85645f6942a5360a793j50638L5294D4391h0400A05290k8550
9269G6740O8100o3116b57230J04054p1212a0755j01031j22230G4802a34733f2786
$$ plain form
9257 -478994 -33036 -223868 -206387 -127808 75939 -55532 257740 -286916 -191484 30298 -154739
9245 -318940 155241 -220497 -169395 -304081 -256515 -31343 -79133 -273201 -166246 231820
9234 37461 30728 -294335 -92548 20121 -170001 -88365 -73628 362752 129259 -52660 -103411
9223 -103411 -230369 -172357 -233752 -65353 -1930 -92144 91346 101159 100872 155218 18630 -322117
9210 -59361 19515 -78358 -158155 93349 -87889 175195 175949 173443 132631 323337 -91686 -179084
9198 -179084 -150585 -222431 -153159 -47912 252527 -223552 163491 -76204 79819 134457 47883
9186 -377584 -280481 -339642 191679 -43240 -37867 -378863 -316859 -118145 -84824 -391323 -237051
9175 -237051 -207463 137215 19740 -63638 144960 -20260 146553 -156556 42262 -83339 -77179
$$ packed form
9257d78994c3036j90832J7481P8579G5939e5532B57740b86916R5432C0298a54739
9245c18940A55241b20497N1102j34686M7566c1343m7790j94068J06955B31820
9234C7461o733b94335i2548B0121a70001Q1636J4737C62752A29259e2660n0751
9223a03411j26958N8012o1395f5353a930r0214I1346R813k87N4346A8630c22117
9210e9361A9515g8358p9797I3349h7889A75195P54k506m0812J90706i1686q7398
9198a79084K8499p1846O9272d7912B52527b23552A63491g6204G9819N4638D7883
9186c77584R7103n9161A91679d3240N373l40996O2004a18145L3321l06499J54272
9175b37051K9588A37215A9740f3638A44960b0260A46553a56556D2262h3339O160
$$ plain form
9164 -77179 44083 -72554 -168972 -101403 27938 -111685 -103066 -117169 48313 -71144 -258583 71183
9151 -13331 146422 169228 50417 -96833 -82891 -78457 196998 62514 -103630 -539878 -160524
9139 -208555 -103410 -181384 -2091 213102 -29626 -127592 -180760 -97468 150931 -23308 -151672
9128 -151672 -153805 -166617 -265561 -45288 -110275 -324427 -111812 -766346 -144500 54837 82996
9117 82996 126355 -385600 -143980 -96601 -43515 106992 11600 -216492 -203825 -153148 90979
9105 -73296 -230140 -136644 -7136 -77692 88712 -19429 -36084 -18863 50036 291743 -3252 -259070
9093 -259070 148864 -191523 50974 -575374 -313984 -268581 -211250 74090 127144 -28187 -196940
9082 -196940 -162357 -215208 -144072 -273505 292771 -93732 67259 -119527 328646 -161985 51528
$$ packed form
9164g7179D4083g2554r6418O7569B7938a11685Q619j4103D8313g1144j87439G1183
9151a3331A46422K2806E0417i6833J3942M434A96998F2514a03630m36248a60524
9139b08555a03410p7974b091B13102b9626r7966n3168Q3292A50931b3308j28364
9128a51672k133j2812r8944d5288o4987k14152a11812o54534a44500E4837K8159
9117H2996M3359c85600a43980M7379d3515A06992A1600b16492J2667N0677I0979
9105g3296j56844R3496g136p0556H8712a9429j6655J7221E0036K41707c252k55818
9093b59070A48864a91523E0974e75374K61390M5403N7331G4090N3054b8187j68753
9082a96940L4583n2851P1136j29433B92771i3732F7259a19527C28646a61985E1528
$$ plain form
9070 230231 -23790 233503 -107057 -119002 24417 -203968 -183225 -283391 -33784 80624 -336620
9058 241085 280672 -35140 -106014 64411 -287052 -364526 112618 169352 60253 40646 343652
9047 343652 134346 -80167 67910 179473 51657 -350428 -407142 -5225 87082 -232110 -333081
9036 -333081 -289953 15375 -145890 87160 -172767 -115294 -159625 -100739 -161431 85524 -12168
9024 -307327 250934 -169768 -153593 -339558 -182583 -38507 45842 -142126 109769 -144678
9013 -17124 43435 -67735 171744 94869 181778 -149095 56569 121504 -183483 200958 106261
9002 106261 -91094 81735 -234902 -310548 -144897 76237 -212713 -105600 -143302 -156769 181324
8990 -91548 115238 -225296 -101728 -124253 130377 199164 171646 -17530 -17020 -100103 72547
$$ packed form
9070B30231b3790B33503a07057j1945B4417b03968K0743j00166c3784H0624c36620
9058B41085L9587c5140p0874F4411b87052p7474A12618N6734F0253j9607L03006
9047C43652A34346h0167F7910J11563E1657c50428n6714e225H7082b32110j00971
9036c33081M3128A5375a45890H7160a72767N7473m4331N8886o0692H5524a2168
9024c07327B50934a69768J6175j85965J56975c8507D5842a42126A09769a44678
9013a7124D3435f7735A71744p6875Q6909a49095E6569O4935a83483B00958r4697
9002A06261i1094H1735b34902p5646a44897G6237b12713a05600l7702j3467A81324
8990i1548A15238b25296a01728k2525A30377O8787k7518a7530N10q3083G2547
$$ plain form
8978 55281 -152746 -380959 145254 -68245 -170388 -41031 -102759 150652 255365 -303812
8967 136429 29329 -241057 -162070 -210335 -95188 234494 52586 28745 -30324 121661 -296575
8955 141130 104706 -403170 -31304 1124 -83971 256683 -283743 -114814 -98689 -154927 -160209
8944 -160209 113486 -205135 223359 86953 141362 26947 -83669 -88917 -211729 -135716 112641
8932 -122654 -203643 15601 -26565 318528 131070 -200642 278350 330359 591324 1533964
8922 1533964 4517588 6957045 2096184 401750 517930 -45215 -202624 296571 -17052
8912 135802 -238812 -157787 103883 433379 182727 100931 94350 45830 -285207 494586 -34986
8900 -146187 -88344 -36242 117417 54911 -91175 41624 -3640 26004 4618 52040 -69389 -128025
$$ packed form
8978E5281a52746k28213A45254f8245j02143d1031o1728A50652J04713c03812
8967A36429B9329b41057P8987m8265i5188B34494E2586k3841c0324A21661b96575
8955A41130l6424d03170c1304A124h3971B56683b83743a14814J6125n6238n282
8944a60209A13486b05135B23359H6953N4409B6947h3669n248j22812P6013A12641
8932a22654q0989A5601b6565C18528A31070b00642B78350N2009K60965R42640
8922A533964K983624K439457B096184D01750J16180d5215j57409B96571a7052
8912A35802b38812Q1025A03883L29496A82727q1796o581D5830b85207D94586c4986
8900a46187N7843c6242A17417E4911i1175D1624c640B6004D618M7422f9389n8636
$$ plain form
8888 -128025 151644 -141987 -144204 -138712 125937 64192 39216 -338179 -104973 -128938 -87410
8877 -87410 -54324 -147027 -144968 -129777 92209 -66755 116171 -59401 308063 -289121 -40149
8865 11940 255719 43087 229063 99935 136086 -300760 229632 72096 22908 -33464 -179043
8854 -179043 -284548 -93949 -57874 332010 -163913 -266088 -242027 -130085 -25148 -61793 -48777
$$ packed form
8888a28025A51644a41987k217N492A25937o1745k4976c38179a04973k3965M1528
8877h7410L3086r2703K059J5191I2209f6755A16171e9401C08063b89121d0149
8865A1940K43779D3087J85976I9935L6151c00760B29632G2096B2908c3464j45579
8854a79043j05505i3949L6075C32010a63913j02175K4061J11942b5148l6645J3016
$$ [...]
##END NTUPLES=NMR SPECTRUM
##END=
