##TITLE=AC1689_PANAH14370_8637644_dT1z0TakX9
##JCAMPDX= 6.0         $$ Bruker NMR JCAMP-DX V2.0
##DATA TYPE= NMR SPECTRUM
##DATA CLASS= NTUPLES
##ORIGIN= BRUKER
##OWNER= Administrator
$$ 1.72 TOPSPIN		Version 2.1
$$ 2014-05-30 19:16:23.571 -0700  Administrator@X
$$ Compression mode = diff/dup
##.OBSERVE FREQUENCY= 400.02188249412
##.OBSERVE NUCLEUS= ^1H
##.ACQUISITION MODE= SIMULTANEOUS (DQD)
##.ACQUISITION SCHEME= undefined
##.AVERAGES= 64
##.DIGITISER RES= 22
##SPECTROMETER/DATA SYSTEM= spect
##.PULSE SEQUENCE= noesygpps1d.comp
##.SOLVENT NAME= COFFEE_meoh
##.SHIFT REFERENCE= INTERNAL, COFFEE_meoh, 1, 14.961
##AUDIT TRAIL= $$ (NUMBER, WHEN, WHO, WHERE, PROCESS, VERSION, WHAT)
$$ ##TITLE= Audit trail, TOPSPIN		Version 2.1
$$ ##JCAMPDX= 5.01
$$ ##ORIGIN= Bruker BioSpin GmbH
$$ ##OWNER= Administrator
$$ $$ E:\/data/COFFEE/nmr/AC1689_PANAH14370_8637644_dT1z0TakX9/22/pdata/1/auditp.txt
$$ ##AUDIT TRAIL=  $$ (NUMBER, WHEN, WHO, WHERE, PROCESS, VERSION, WHAT)
(   1,<2014-05-30 19:16:18.306 -0700>,<Administrator>,<X>,<go>,<TOPSPIN 2.1>,
      <created by zg
	started at 2014-05-30 19:04:48.696 -0700,
	POWCHK enabled, PULCHK disabled,
       configuration hash MD5:
       C8 4E 4E 5D D3 5C D8 9E 9F 52 82 E0 59 8A DE 15
       data hash MD5: 64K
       36 65 F4 D1 FC BC 15 BF 24 15 63 C8 40 51 FE EF>)
(   2,<2014-05-30 19:16:21.415 -0700>,<Administrator>,<X>,<proc1d>,<TOPSPIN 2.1>,
      <Start of raw data processing
       efp LB = 0.3 FT_mod = 6 PKNL = 1 PHC0 = 0 PHC1 = 0 SI = 128K 
       data hash MD5: 128K
       C4 2C 48 1B AC C9 F5 A8 1D E7 CB ED AA FB FC 88>)
(   3,<2014-05-30 19:16:22.431 -0700>,<Administrator>,<X>,<proc1d>,<TOPSPIN 2.1>,
      <pk PHC0 = -86.48438 PHC1 = 0 
       data hash MD5: 128K
       20 E8 87 FA 21 88 B1 14 26 4C 84 C1 23 75 91 24>)
(   4,<2014-05-30 19:16:22.915 -0700>,<Administrator>,<X>,<proc1d>,<TOPSPIN 2.1>,
      <abs ABSG = 1 
       data hash MD5: 128K
       DA 43 F9 C3 15 7B 88 8C 3A 25 E3 DC 8B A3 11 B3>)
(   5,<2014-05-30 19:16:23.040 -0700>,<Administrator>,<X>,<proc1d>,<TOPSPIN 2.1>,
      <abs ABSG = 2 
       data hash MD5: 128K
       F9 1D EB 6C 57 18 DA BB 61 3E D5 36 A6 4C AB 41>)
(   6,<2014-05-30 19:16:23.149 -0700>,<Administrator>,<X>,<proc1d>,<TOPSPIN 2.1>,
      <abs ABSG = 3 
       data hash MD5: 128K
       B3 76 E1 3E BB 1C 9C 0F 93 6F 82 8A 67 4C 8C 9D>)
(   7,<2014-05-30 19:16:23.259 -0700>,<Administrator>,<X>,<proc1d>,<TOPSPIN 2.1>,
      <abs ABSG = 4 
       data hash MD5: 128K
       B8 CA B3 A3 FA FE 6B 21 EB 3B FE C2 60 F6 A0 BC>)
(   8,<2014-05-30 19:16:23.368 -0700>,<Administrator>,<X>,<proc1d>,<TOPSPIN 2.1>,
      <abs ABSG = 5 
       data hash MD5: 128K
       C2 66 2C 2C B5 4A B8 4B 15 C3 A3 2E 3F F5 34 3C>)
$$ ##END=
$$ 
$$ $$ hash MD5
$$ $$ 86 B0 E8 28 F2 E4 05 94 95 3B 8D 21 1A D0 EE A4
##$RELAX= 
##$RELAX= 
##$RELAX= 
##$RELAX= 
##$RELAX= 
##$RELAX= 
##$RELAX= 
##$RELAX= 
$$ Bruker specific parameters
$$ --------------------------
##$DU= <E:\>
##$EXPNO= 22
$$ [...]
150 150 150 150 150 150 150 150
##$TP07= 0
##$TPNAME0= <>
##$TPNAME1= <>
##$TPNAME2= <>
##$TPNAME3= <>
##$TPNAME4= <>
##$TPNAME5= <>
##$TPNAME6= <>
##$TPNAME7= <>
##$TPOAL= (0..7)
0.5 0.5 0.5 0.5 0.5 0.5 0.5 0.5
##$TPOFFS= (0..7)
0 0 0 0 0 0 0 0
##$TUNHIN= 0
##$TUNHOUT= 0
##$TUNXOUT= 0
##$USERA1= <user>
##$USERA2= <user>
##$USERA3= <user>
##$USERA4= <user>
##$USERA5= <user>
##$V9= 5
##$VALIST= <valist>
##$VCLIST= <CCCCCCCCCCCCCCC>
##$VD= 0
##$VDLIST= <DDDDDDDDDDDDDDD>
##$VPLIST= <PPPPPPPPPPPPPPP>
##$VTLIST= <TTTTTTTTTTTTTTT>
##$WBST= 2048
##$WBSW= 25
##$XGAIN= (0..3)
0 0 0 0
##$XL= 0
##$YL= 0
##$YMAX_a= 6147726
##$YMIN_a= -11851797
##$ZGOPTNS= <>
##$ZL1= 120
##$ZL2= 120
##$ZL3= 120
##$ZL4= 120
##$ABSF1= 14.961
##$ABSF2= -5.597181
##$ABSG= 5
##$ABSL= 3
##$ALPHA= 0
##$AQORDER= 0
##$ASSFAC= 0
##$ASSFACI= 0
##$ASSFACX= 0
##$ASSWID= 0
##$AUNMP= <proc_prof1d_extract.lims>
##$AXLEFT= 0
##$AXNAME= <>
##$AXNUC= <1H>
##$AXRIGHT= 0
##$AXTYPE= 0
##$AXUNIT= <>
##$AZFE= 0.1
##$AZFW= 0.1
##$BCFW= 0
##$BC_mod= 0
##$BYTORDP= 0
##$COROFFS= 0
##$CY= 15
##$DATMOD= 1
##$DC= 0
##$DFILT= <>
##$DTYPP= 0
##$F1P= 0
##$F2P= 0
##$FCOR= 0.5
##$FTSIZE= 131072
##$FT_mod= 6
##$GAMMA= 0
##$GB= 0
##$INTBC= 1
##$INTSCL= 1
##$ISEN= 128
##$LB= 0.3
##$LEV0= 0
##$LPBIN= 0
##$MAXI= 10000
##$MC2= 0
##$MEAN= 0
##$ME_mod= 0
##$MI= 0
##$NCOEF= 0
##$NC_proc= -2
##$NLEV= 6
##$NOISF1= 0
##$NOISF2= 0
##$NSP= 0
##$NTH_PI= 0
##$NZP= 0
##$OFFSET= 14.961
##$PC= 1
##$PHC0= -86.48438
##$PHC1= 0
##$PH_mod= 1
##$PKNL= yes
##$PPARMOD= 0
##$PPDIAG= 0
##$PPIPTYP= 0
##$PPMPNUM= 2147483647
##$PPRESOL= 1
##$PSCAL= 4
##$PSIGN= 0
##$PYNMP= <proc.py>
##$REVERSE= no
##$SF= 400.020009637224
##$SI= 131072
##$SIGF1= 0
##$SIGF2= 0
##$SINO= 400
##$SIOLD= 131072
##$SPECTYP= <>
##$SREGLST= <1H.CDCl3>
##$SSB= 0
##$STSI= 131072
##$STSR= 0
##$SW_p= 8223.68421052631
##$SYMM= 0
##$S_DEV= 0
##$TDeff= 65536
##$TDoff= 0
##$TI= <>
##$TILT= no
##$TM1= 0
##$TM2= 0
##$TOPLEV= 0
##$USERP1= <user>
##$USERP2= <user>
##$USERP3= <user>
##$USERP4= <user>
##$USERP5= <user>
##$WDW= 1
##$XDIM= 131072
##$YMAX_p= 423270583
##$YMIN_p= -11567
##$CURPLOT= <Network HP LaserJet P1505>
##$CURPRIN= <$Network HP LaserJet P1505>
##$DFORMAT= <normdp>
##$LAYOUT= <+/1D_H.xwp>
##$LFORMAT= <normlp>
##$PFORMAT= <normpl>
##$SURQMSG= 1
$$ End of Bruker specific parameters
$$ ---------------------------------
##NTUPLES= NMR SPECTRUM
##VAR_NAME=  FREQUENCY,     SPECTRUM/REAL,   SPECTRUM/IMAG
##SYMBOL=    X,             R,               I
##VAR_TYPE=  INDEPENDENT,   DEPENDENT,       DEPENDENT
##VAR_FORM=  AFFN,          ASDF,            ASDF
##VAR_DIM=   131072,        131072,          131072
##UNITS=     HZ,            ARBITRARY UNITS, ARBITRARY UNITS
##FACTOR=    0.0627417313425164, 1,          1
##FIRST=     8223.62146879497, 2455,         -56389
##LAST=      0,             3467,            -55587
##MIN=       0,             -11567,          0
##MAX=       8223.62146879497, 423270583,    0
$$ Real data points
##PAGE= N=1
##DATA TABLE= (X++(R..R)), XYDATA
$$ [...]
67862 87112 86039 84899 84454 85090 86148 86398 85244 83158 80987 79238 78080 77528 77324 77025 76534 76276
67846 76276 76516 76726 76097 74590 73054 72218 71942 71626 71011 70340 69916 69882 70361 71416 72746 73753 74242 74878
67828 74878 76560 79334 82283 84610 86447 88379 90548 92642 94560 96577 98819 101023 102885 104283
67814 104283 105058 104985 104131 102929 101638 100009 97737 94981 92156 89458 86908 84691 83009 81682 80215
67799 80215 78287 75902 73144 70127 67234 64986 63569 62730 62275 62334 62960 63735 64067 63779 63160 62560 62200
67782 62200 62252 62731 63241 63158 62323 61365 61131 61866 63132 64424 65603 66737 67828 68853 69818 70607 70949 70772
67764 70772 70401 70151 69891 69425 69166 69899 71731 73815 75422 76847 78805 81224 83165 83852 83321 82110
67748 82110 80778 79792 79354 79121 78411 77001 75522 74886 75449 76828 78306 79238 79306 78648 77644 76426 74768
67731 74768 72563 70172 68049 66300 64959 64420 65084 66618 68084 68880 69052 68613 67136 64440 61234 58543
67715 58543 56719 55468 54708 54761 55687 57004 58323 59823 61740 63666 64755 64591 63585 62541 62009 62031
67699 62031 62317 62619 62989 63659 64690 65820 66710 67182 67186 66770 66263 66243 66973 67981 68529 68477 68306 68246 67881 66914
67679 66914 65980 66155 67614 69253 69914 69758 70031 71461 73345 74455 74496 74173 74053 74037 74038 74409 75235 75790 75396
67660 75396 74490 74095 74411 74733 74759 75104 76273 77829 79028 79774 80416 81011 81225 80804 79767 78354 77026
67643 77026 76263 76063 75918 75544 75323 75667 76278 76467 75986 75070 73943 72773 71976 71921 72366 72672 72698 72991 73956
67624 73956 75263 76296 76930 77541 78357 78965 78631 77190 75538 74944 75832 77513 79192 80677 81890 82412
67608 82412 82180 82039 82685 83392 82877 81332 80471 81282 82784 83506 83324 83093 83135 82938 82080 80691 79056 77311
67590 77311 75571 74041 72952 72469 72514 72565 71938 70480 68751 67313 66158 65045 64033 63363 63068 63036 63198
67573 63198 63381 63289 62976 63009 63764 64826 65477 65545 65307 64838 64020 63056 62422 62268 62323 62369 62499 62895 63672 64810
67553 64810 65920 66263 65494 64254 63546 63596 63850 63965 64094 64135 63483 61923 60272 59653 60409 61969 63476 64259
67535 64259 64012 62958 61779 61107 61063 61351 61619 61624 61270 60686 60156 59831 59589 59244 58726 58050 57346 56995 57463
67516 57463 58723 60021 60468 59832 58614 57431 56504 55695 54836 53916 52998 52132 51462 51342 52050 53329 54489
67499 54489 55200 55866 56891 57905 58230 57907 57580 57428 56937 55885 54830 54284 54054 53821 53833 54506 55715 57045
67481 57045 58392 59748 60656 60516 59396 58083 57305 57256 57736 58331 58595 58455 58349 58567 58639 57921 56649 55718
67463 55718 55418 55098 54296 53542 53596 54441 55468 56327 57089 57779 58194 58203 57924 57639 57629 57986 58413 58428 57925 57342
67443 57342 57071 56999 56878 56871 57275 57875 58101 57889 57846 58418 59308 59944 60209 60349 60398 60111 59458 58872 58824 59272 59655
67422 59655 59411 58495 57373 56557 56179 56083 56251 56868 57872 58684 58723 58121 57585 57467 57355 56798 56122 56107 56960
67403 56960 58031 58636 58822 59152 59988 61208 62431 63231 63216 62145 60087 57399 54608 52277 50784 50029
67387 50029 49525 49040 49005 50024 52029 54267 56174 57869 59638 61276 62251 62371 61936 61306 60589 59842 59320
67370 59320 59329 59866 60531 60854 60706 60391 60308 60544 60798 60664 59969 58932 58075 57890 58407 59100 59367 59113 58697 58334
67350 58334 57833 57065 56419 56496 57358 58292 58415 57522 56347 55964 56811 58301 59495 60020 60139 60061 59664 59024 58608
67331 58608 58589 58393 57506 56474 56461 57919 60165 62241 63592 63985 63508 62909 63234 64689 66315 67175 67394
67314 67394 67618 67943 68009 67827 67795 67993 68067 67804 67346 66878 66630 67064 68400 69924 70483 69914 69351 69805 71005
67295 71005 72030 72484 72534 72271 71761 71445 71718 72165 71845 70431 68578 67054 65979 65073 64184 63331 62525 61834
67277 61834 61449 61468 61766 62226 62953 64095 65516 66763 67403 67465 67594 68538 70267 71758 72022 71243 70471 70322
67259 70322 70549 70921 71728 73007 73920 73637 72519 71742 71891 72422 72536 72053 71405 71168 71652 72566 73084 72625
67241 72625 71655 71291 72041 73264 73983 73846 73192 72588 72545 73323 74655 75852 76407 76338 75851 75028 74100 73642 74055
67222 74055 75030 75937 76620 77437 78582 79810 80804 81451 81658 81269 80320 79101 77838 76544 75310 74471 74280
67205 74280 74591 75087 75664 76389 77198 77902 78481 79108 79863 80628 81308 81912 82347 82352 81856 81203 80775 80514 80136 79725
67185 79725 79707 80140 80524 80541 80542 80835 80841 79653 77398 75390 74769 75488 76796 78137 79224 79783 79861 80125 81229
67166 81229 82882 84028 84018 83267 82715 82931 83777 84636 84839 84091 82658 81177 80303 80520 81977 84288 86661
67149 86661 88544 90055 91582 93136 94420 95281 95680 95411 94420 93329 93057 93817 94965 95889 96482 96717 96501
67132 96501 96229 96756 98315 99973 100687 100486 100103 99881 99702 99680 100153 101046 101903 102578 103338 104253 105025 105594 106393
67113 106393 107784 109552 111145 112181 112564 112380 111889 111468 111436 112018 113354 115325 117380 118885 119713 120246
67097 120246 120723 120956 120821 120701 121153 122269 123627 124748 125439 125783 126049 126607 127723 129322 131030 132527
67081 132527 133856 135284 136855 138227 139118 139746 140525 141344 141617 141181 140695 140797 141309 141731 142182 143226 144926
67064 144926 146734 148268 149532 150394 150677 150988 152637 156186 160553 164146 166475 168156 169708 171105 172386
67049 172386 173946 175963 177984 179411 180199 180842 181697 182552 182980 183088 183615 185095 187093 188692 189728 191034
67033 191034 193268 196011 198404 200314 202382 205070 208148 211067 213427 215078 216151 217121 218559 220704
67019 220704 223389 226363 229508 232791 236240 240009 244264 248910 253555 257771 261316 264125 266254 267935
67005 267935 269584 271623 274243 277313 280590 284030 287787 291853 295887 299698 303686 308320 313225 317404
66991 317404 320501 323306 326646 330292 333491 336143 338852 342066 345756 349817 354220 358737 363020 366997
66977 366997 370890 374901 379185 383959 389267 394780 400287 406164 412815 419814 426312 432253 438436 445258
66963 445258 452138 458446 464411 470732 477836 485812 494540 503494 511943 519794 527880 536951 546708 556264
66949 556264 565234 573908 582585 591278 599982 608853 618134 628159 639238 651265 663605 675693 687620
66936 687620 699840 712568 725821 739806 754762 770483 786453 802508 818979 836127 853786
66925 853786 871618 889438 907258 925284 943946 963666 984432 1005717 1026886 1047651 1068233
66914 1068233 1089223 1111165 1134084 1157482 1180996 1204910 1229771 1255643 1282135 1309085 1336786
66903 1336786 1365437 1394759 1424372 1454298 1484874 1516300 1548479 1581194 1614328 1647856 1681684
66892 1681684 1715546 1749185 1782710 1816539 1850815 1885040 1918636 1951733 1984965 2018466 2051531
66881 2051531 2083513 2114639 2145583 2176415 2206310 2234253 2259806 2283213 2304979 2325398 2344408
66870 2344408 2361858 2377839 2392631 2406236 2418095 2427419 2433728 2437004 2437442 2435265 2430757 2424312 2416360
66857 2416360 2407251 2397095 2385623 2372274 2356576 2338462 2318106 2295536 2270700 2243991 2216362
66846 2216362 2188591 2160589 2131722 2101772 2071203 2040396 2009032 1976503 1942734 1908302 1873901
66835 1873901 1839884 1806205 1772522 1738432 1703879 1669322 1635312 1602030 1569410 1537413 1505760
66824 1505760 1473701 1440801 1407913 1376564 1347123 1318312 1288974 1259631 1231715 1205798 1181298
66813 1181298 1157522 1134135 1110764 1087028 1063139 1039880 1017789 996758 976426 956477 936537
66802 936537 916365 896319 877115 858920 841087 823059 805148 788163 772523 757897 743446
66791 743446 728347 712435 696523 681763 668477 655938 643424 631033 619237 608102 597419
66780 597419 587245 577782 568849 559898 550539 540814 531094 521965 513979 507116 500599 493574 485963 478304
66766 478304 470875 463367 455500 447526 439942 432988 426574 420554 414828 409230 403478 397345 390898 384490
66752 384490 378427 372663 366946 361269 355948 351161 346573 341587 335830 329378 322697 316532 311590 308059
66738 308059 305466 303105 300443 297113 292920 288146 283548 279655 276299 273216 270774 269509 269009 268004
66724 268004 265648 262205 258297 254085 249566 245232 241905 239989 239156 238598 237504 235514 233013 230805 229231
66709 229231 227762 225633 222730 219617 216881 214717 212951 211120 208635 205317 201784 198918 196871 194933
66695 194933 192550 190102 188430 187793 187602 187070 185882 184275 182689 181354 180052 178337 176105 173860 172146
66680 172146 170788 169068 166748 164512 163150 162589 162089 161169 159913 158489 156912 155351 154137 153227 152067
66665 152067 150333 148490 147249 146680 146237 145494 144450 143195 141733 140190 138795 137531 136110 134456 132933
66650 132933 131948 131509 131309 131056 130605 129940 129132 128224 127103 125681 124246 123399 123486 124275 125218 125804 125572 124268
66632 124268 122295 120707 120272 120616 120677 119913 118725 117712 117031 116550 116245 116125 116044 115859 115659 115558 115316 114408
66614 114408 112543 110009 107486 105558 104415 103918 103829 103939 104045 103908 103343 102412 101472 100967 101086 101562 101846
66597 101846 101570 100824 99964 99227 98731 98723 99455 100644 101411 101107 100050 99090 98569 98118 97446 96853 96726 96887 96724
66578 96724 95823 94307 92753 91896 92152 93151 93901 93725 92954 92389 92208 91806 90790 89725 89609 90747 92386
66561 92386 93415 93309 92365 91201 90138 89089 87961 86983 86555 86832 87557 88289 88713 88793 88747 88934 89572 90410
66543 90410 90728 89843 87820 85657 84584 84960 85892 86129 85315 84153 83317 82597 81377 79636 78041 77093 76645
66526 76645 76319 76010 75827 75864 76239 77129 78465 79709 80148 79430 77814 76075 75203 75814 77576 79355 80233
66509 80233 80277 80114 79916 79228 77779 76051 74847 74529 74828 75223 75285 74801 73819 72651 71665 71030 70704 70639 70841
66490 70841 71120 70978 70033 68606 67592 67516 67908 67914 67444 67295 68068 69420 70637 71566 72564 73709 74545 74657
66472 74657 74131 73301 72315 71131 69894 69154 69537 71048 72727 73296 72396 70983 70273 70446 70689 70339 69611
66455 69611 69246 69854 71570 73941 76032 77016 76880 76333 75941 75625 75093 74465 74203 74575 75301 75675 75086 73672
66437 73672 72400 72175 72838 73412 73343 73008 72932 73106 73319 73563 73666 73049 71490 69770 68987 69394 70397 71446
66419 71446 72356 72960 73133 73106 73185 73213 72886 72502 72705 73410 73733 73156 72090 71050 70020 68989 68421 68594 69006
66400 69006 69089 69137 69786 70787 71035 69895 67948 66322 65645 65752 66082 66207 66175 66378 66912 67202 66561 65088
66382 65088 63648 62934 62878 63048 63294 63801 64747 66048 67305 67928 67541 66418 65387 65172 65906 67269 68866
66365 68866 70377 71602 72536 73219 73438 72845 71593 70524 70355 70790 70881 70216 69341 68952 69094 69355 69523 69691
66347 69691 69951 70293 70725 71166 71309 70930 70368 70336 71049 71809 71757 70881 69988 69704 69839 69845 69604 69439 69450 69217 68370
66326 68370 67271 66792 67350 68379 69004 69049 69067 69408 69659 69256 68328 67556 67272 67096 66582 65909 65709 66340 67485
66307 67485 68449 68796 68755 68991 69898 71102 71824 71724 71172 70669 70270 69716 68896 67950 67149 66830 67207 67900 67941
66288 67941 66762 65111 64480 65531 67499 69208 70162 70452 70147 69294 68219 67307 66604 65995 65638 65812 66416
66271 66416 67065 67637 68314 69065 69595 69850 70136 70532 70651 70242 69674 69476 69730 70205 70748 71131 70822 69485 67658
66252 67658 66378 66090 66332 66542 66690 66956 67244 67362 67454 67896 68857 70168 71540 72708 73374 73268 72363 71061
66234 71061 70080 70060 71091 72657 74113 75188 75937 76373 76442 76322 76410 76884 77484 77816 77659 77001 76081 75441 75548
66215 75548 76206 76674 76509 75947 75300 74514 73707 73568 74626 76389 77825 78514 78682 78311 77091 75333 74085
66198 74085 73945 74330 74343 73862 73271 72581 71461 69990 68740 68055 67762 67714 68200 69513 71318 72824 73549 73724
66180 73724 73906 74376 75076 75922 76867 77650 77858 77478 77149 77517 78453 79273 79592 79628 79661 79684 79704 79934 80449 80954
66160 80954 81222 81509 82282 83651 85260 86562 87033 86427 85124 84033 83804 84185 84428 84185 83743 83481 83481 83618
66142 83618 83714 83587 83223 82906 82895 83018 82963 83002 83955 86131 88601 89922 89480 87942 86458 85744 85872 86542 87315
66123 87315 87715 87420 86495 85429 84872 85261 86495 87852 88365 87570 86053 85021 85175 86117 87055 87827 88849
66106 88849 90214 91424 92143 92635 93166 93424 93033 92311 91982 92265 92771 93228 93804 94685 95775 96968 98271
66089 98271 99496 100221 100330 100288 100579 101057 101091 100213 98473 96363 94598 93782 94027 94904 95925 96940 97917 98592
66071 98592 98665 98239 97738 97403 97136 96849 96612 96356 95785 94769 93648 92928 92802 93120 93660 94224 94558 94526 94364
66052 94364 94498 94990 95340 95044 94210 93460 93260 93505 93746 93641 93154 92503 92018 91946 92287 92881 93643 94589 95566
66033 95566 96127 95891 94949 93832 93174 93492 95057 97581 100143 101866 102858 104090 106133 108331 109619 109903
66017 109903 110151 111123 112564 113739 114280 114161 113299 111800 110465 110401 111817 113653 114720 115008 115485 116794
66001 116794 118613 120398 122303 124966 128534 132336 135670 138678 142135 146364 150650 153965 156092 157711
65987 157711 159393 160923 161821 162163 162451 162865 163096 162925 162481 161827 160684 158756 156046 152688 148812 144815
65971 144815 141415 139082 137585 136378 135179 133858 132099 129759 127481 126291 126357 126662 126191 125156 124638
65956 124638 125237 126452 127373 127619 127414 126985 126249 125244 124618 125331 127774 131338 135030 138369 141538 144830
65940 144830 148178 151210 153538 155002 155780 156300 156948 157870 159041 160345 161507 162232 162670 163497 165149 167095
65924 167095 168331 168589 168658 169464 171187 173426 175843 178430 181370 184793 188574 192365 196000 199768 203956
65909 203956 208209 211797 214592 217237 220147 222853 224603 225203 224987 224408 224041 224556 226090 227855 228836 228699
65893 228699 227631 225620 222515 218653 214744 211057 207279 203256 199313 195629 191823 187534 183050 178985
65879 178985 175466 172019 168227 164269 160735 157998 155857 153821 151720 149859 148470 147313 146091 145108
65865 145108 145022 145905 146986 147509 147496 147446 147566 147599 147300 146788 146413 146371 146450 146160 145266 144212 143781 144226 144949 145183
65845 145183 144864 144626 145164 146715 148966 151138 152297 151981 150657 149385 148953 149401 150337 151431 152560 153755
65829 153755 155202 157200 159851 162832 165632 168117 170752 174196 178753 184233 190231 196306 201955 206715
65815 206715 210512 213753 216820 219521 221249 221700 221178 220126 218620 216563 214145 211776 209587 207292 204720
65800 204720 202229 200345 199082 197836 195990 193451 190582 187862 185759 184729 184968 186143 187593 188903
65786 188903 190123 191405 192682 193910 195470 198080 202260 207933 214457 221082 227580 234554 242892 252645
65772 252645 262572 271069 277461 282178 285818 288392 289419 288327 284684 278420 270110 260823 251550 242834
65758 242834 234924 227996 222073 217054 213054 210610 210338 212452 216719 222769 230385 239620 250700 263634
65744 263634 277829 292373 306805 321385 336375 351320 365283 377579 387927 396007 401274 403303
65732 403303 402037 397634 390256 380101 367545 353144 337522 321273 304929 289085 274441 261453
65720 261453 249851 238756 227559 216543 206454 197621 189753 182484 175800 169966 165271 161759 158976
65707 158976 156121 152774 149420 146867 145215 143828 142360 141237 140898 141045 141072 140933 141086 141674 142200 142118 141509
65690 141509 141011 141188 142029 143041 143801 144375 145218 146721 148952 151762 154988 158542 162435 166767 171585 176851
65674 176851 182716 189677 198121 207773 218014 228837 241010 255061 270550 286680 303259 320627
65662 320627 338929 357948 377368 396624 414543 429816 442029 451816 459829 465926 469585 470805
65650 470805 470344 469263 468378 467967 467864 467928 468448 469847 471925 473712 474184 472908 469889 465102 458381 449439
65634 449439 437792 423004 405436 386479 367583 349083 330350 311035 291706 273254 256106
65623 256106 240230 225588 212367 200911 191554 184290 178469 173041 167364 161743 157003 153593 151193
65610 151193 149070 146686 144007 141452 139556 138528 138062 137602 136808 135804 134976 134604 134659 134892 135094 135252 135495
65593 135495 135950 136682 137662 138687 139427 139724 139849 140288 141285 142809 144914 147865 151774 156379 161396 166919
65577 166919 173304 180874 189913 200761 213562 227983 243408 259359 275544 291689 307663 323630
65565 323630 339662 355244 369587 382406 393777 403083 408750 409553 405787 398684 388990 376744 362271
65552 362271 346616 330760 314914 298858 282635 266607 251076 236173 222044 208972 197356
65541 197356 187670 180266 174960 170869 166942 162857 159384 157766 158559 161027 163711 165658 167002 168234
65527 168234 169189 169148 167870 166033 164362 162701 160257 156640 152345 148347 145379 143446 141755 139318 135984
65512 135984 132803 131038 130876 131415 131804 131872 131649 130988 130019 129524 130259 132025 133798 134766 134928 134797 134880 135463
65494 135463 136558 137829 138727 138880 138407 137988 138641 141180 145586 150934 156215 161190 166178 171121 175323
65479 175323 178252 180191 181760 183091 183817 183725 183018 181929 180404 178286 175572 172376 168760 164755 160517
65464 160517 156427 152998 150594 149114 147964 146467 144323 141652 138719 135796 133266 131557 130815 130730 130804
65449 130804 130723 130443 130048 129689 129599 130002 130892 131948 132705 132933 132947 133493 135123 137614 140105 141953 143375 145147
65431 145147 147785 151095 154452 157300 159435 160959 162067 162805 163049 162767 162238 161848 161610 161025 159471 156696
65415 156696 153030 149283 146450 145255 145742 147242 148821 149835 150164 150075 149949 150065 150540 151367 152408 153354
65399 153354 153926 154319 155318 157614 160964 164310 166847 168713 170533 172585 174657 176477 177904 178780 178923
65384 178923 178295 176996 175105 172766 170366 168409 167179 166601 166397 166202 165675 164816 164150 164303 165342 166783
65368 166783 168259 169874 171892 174390 177369 180865 184733 188610 192286 195948 199919 204374 209459 215358
65354 215358 222007 229025 236253 244076 252831 262058 270690 277905 283438 287303 289679 290981 291505 290947 288760
65339 288760 285061 280660 276063 270957 264966 258450 252081 245945 239499 232261 224236 215859 207935 201407
65325 201407 196657 193009 189410 185726 182948 181911 182126 182153 180981 178763 176352 174392 172879 171390 169555
65310 169555 167374 165128 163041 161033 158896 156691 154885 153983 154009 154466 154904 155414 156386 157809 159152 160027
65294 160027 160726 161839 163537 165586 167961 170955 174551 178111 180966 183065 184673 185613 185270 183433 180786
65279 180786 178408 176907 176121 175456 174388 172779 170925 169257 167898 166575 165043 163481 162272 161487 160791
65264 160791 159932 159111 158757 159011 159554 159929 159966 159892 159988 160204 160213 159929 159807 160431 161810 163271 164087 164013 163258 162179
65244 162179 161130 160298 159488 158268 156576 155032 154389 154687 155168 154983 153893 152380 151299 151277 152175 153170 153548
65227 153548 153330 152887 152141 150599 148224 145774 144073 143224 142750 142299 141933 141925 142477 143548 144773 145611 145772
65210 145772 145487 145332 145811 147029 148577 149712 149910 149366 148747 148413 148116 147536 146769 146068 145457 144874 144499 144545
65192 144545 144921 145366 145801 146238 146544 146639 146854 147690 149228 151085 152912 154614 156110 157296 158307 159450
65176 159450 160768 161939 162722 163174 163298 162839 161691 160250 159073 158283 157611 156911 156384 156277 156549 156999 157651
65159 157651 158904 161190 164385 167707 170309 171964 173027 173883 174640 175341 176151 177224 178613 180387 182617
65144 182617 185203 187998 191236 195495 201013 207333 213840 220367 226872 232884 237823 241855 245864 250416
65130 250416 255124 259209 262346 264749 266761 268661 270641 272637 274268 275202 275500 275357 274675 273256 271353
65115 271353 269561 267994 265963 262704 258214 253129 248036 243168 238567 234094 229360 224042 218350 212866
65101 212866 207798 202741 197312 191785 186808 182699 179231 176075 173195 170783 168941 167503 166208 165015
65087 165015 164139 163674 163336 162850 162459 162657 163378 163917 163834 163487 163391 163469 163411 163393 163858 164693 165195 164937 164207 163524
65067 163524 163128 163079 163526 164612 166228 167942 169134 169297 168480 167411 166973 167526 168819 170413 171934 173057
65051 173057 173615 173740 173677 173543 173484 173793 174364 174231 172369 169044 165790 163789 162845 162125 161332 160681 160182 159530
65033 159530 158587 157488 156375 155330 154553 154268 154360 154208 153047 150665 147825 145791 145177 145415 145626 145698 145980
65016 145980 146221 145716 144586 143961 144541 145763 146862 147982 149577 151401 152983 154592 156834 159529 161952
65001 161952 164103 166911 170976 175769 180226 183619 185731 186718 187116 187616 188552 189680 190493 190589 189862 188606
64985 188606 187400 186698 186555 186894 187802 189306 191132 193057 195234 197806 200447 202667 204298 205183 204783 202760
64969 202760 199700 196533 193381 189768 185789 182158 179111 176222 173493 171645 170949 170638 170018 169375 169194
64954 169194 169152 168608 167615 166762 166295 166000 165700 165289 164524 163308 162070 161338 161081 160882 160612 160408 160083 159104
64936 159104 157277 155121 153381 152381 151955 151932 152554 154341 157364 160797 163481 164979 165690 165930 165427 163941
64920 163941 161858 159756 157845 156267 155495 155795 156620 157143 157220 157225 157192 156879 156636 157381 159463 162175 164741 167271
64902 167271 170354 174139 178285 182575 187074 191710 196177 200442 205139 211091 218408 226235 233594 240397
64888 240397 247356 254835 262155 268282 273002 277083 281327 285746 289622 292119 292773 291598 288882 284908
64874 284908 279984 274661 269686 265487 261862 258386 254931 251619 248465 245451 242917 241479 241411 242255 243079
64859 243079 243060 241884 239758 237046 233830 229945 225463 220915 216847 213308 209923 206265 202005 197042 191812
64844 191812 187231 183928 181652 179703 177725 175753 173801 171932 170528 169871 169540 168805 167559 166335 165450
64829 165450 164779 164345 164358 164572 164390 163948 164335 166244 168970 171283 172841 174207 175897 178034 180689 183881
64813 183881 187330 190706 194178 198354 203681 210135 217309 224523 231097 236921 242665 249003 255759 262174
64799 262174 267727 272124 274695 274619 272009 268078 263831 259079 253196 246488 240208 235284 231520 228136 224728
64784 224728 221535 218983 217163 215788 214593 213773 213860 215052 216781 218215 219187 220335 222211 224550 226726
64769 226726 228711 231161 234573 238780 243385 248257 253393 258770 264732 272120 281336 291379 300494 307908
64755 307908 314397 320954 327517 333386 338388 342990 347439 351392 354404 356431 357664 358117 357499 355441 351892
64740 351892 347320 342358 337087 330887 323190 314258 304983 296076 287776 280225 273741 268643 265031 262734
64726 262734 261284 260005 258469 256898 255884 255737 256324 257462 259042 260769 262268 263609 265351 267828 270732
64711 270732 273687 276856 280603 284745 288566 291469 293303 294105 293861 292487 289789 285468 279508 272524 265409
64696 265409 258562 251790 245039 238794 233533 229117 225056 221187 217783 215113 213218 212057 211534 211361 211235
64681 211235 211223 211693 212716 213796 214446 214909 216082 218774 223135 228746 235069 241812 249035 256927 265425
64666 265425 274024 282028 288906 294344 298079 299857 299590 297374 293379 287891 281557 275337 269946 265345
64652 265345 260960 256508 252462 249545 247829 246608 245282 244180 244209 245726 248086 250415 252547 254978 258166
64637 258166 262241 267369 273968 282397 292504 303620 314937 325948 336607 347075 357249 366568
64625 366568 374319 379998 383273 383870 381797 377556 371727 364358 355207 344659 333974 324278 315503 306623
64611 306623 296930 286925 277984 271178 266397 262635 259147 256115 253929 252102 249463 245459 240804 236661
64597 236661 233618 231576 230118 228722 227114 225748 225514 226572 227988 228976 230044 232256 235786 240007 244723
64582 244723 250353 256946 263980 271342 279609 288947 298526 307634 316738 326678 337124 346592 353946 359297
64568 359297 363336 366247 367455 366186 362111 355608 347524 338585 328975 318508 307199 295605 284580
64555 284580 274637 265574 256824 248289 240674 234729 230316 226563 222978 219943 217968 216910 216234 215704 215450
64540 215450 215657 216554 218482 221444 224731 227457 229392 230730 231129 229718 226420 222597 219785 218049 216225
64525 216225 213664 211065 209353 208388 207291 205758 204414 203855 203895 204046 204305 205035 206249 207500 208519 209585
64509 209585 211147 213345 216013 218933 221894 224713 227413 230320 233827 238143 243337 249433 256326 263691
64495 263691 271161 278528 285689 292483 298713 304214 308745 311871 313097 312174 309279 305015 300193 295434
64481 295434 290884 286495 282595 279901 278848 279160 280209 281428 282162 281541 279079 275284 271252 267691 264626
64466 264626 261882 259408 257199 255422 254622 255314 257268 259654 262004 264545 267417 270090 271929 272952 273583
64451 273583 273922 273706 272892 271873 271134 270958 271488 272798 274835 277408 280299 283424 287002 291533 297391 304376
64435 304376 311971 320173 329740 341348 354786 369362 384938 402187 421939 444727 471000 501342
64423 501342 536310 576308 621779 673390 732045 798848 874932 960851 1055781 1157361 1262406
64412 1262406 1367690 1470287 1567711 1658178 1740658 1814289 1877637 1928523 1964605 1984140 1986502
64401 1986502 1972329 1943312 1901620 1849124 1786765 1714453 1631725 1538877 1437817 1331955 1225251
64390 1225251 1121232 1022541 930980 847687 773225 707572 650131 600022 556537 519257 487579
64379 487579 460380 436548 415814 398582 384806 373435 363336 354388 347224 342015 337932 333802
64367 333802 328931 323284 317263 311469 306348 301804 297274 292359 287250 282452 278247 274566 271193 267851
64353 267851 264176 259944 255461 251584 249244 248908 250452 253379 257126 261224 265274 268812 271298 272347
64339 272347 271961 270411 267889 264393 260032 255285 250780 246778 243013 239113 235192 231883 229738 228618
64325 228618 227861 227134 226833 227392 228389 228885 228720 228897 230260 232269 233698 234320 235186 237164 239924 242616 244923
64308 244923 247007 248819 250038 250473 250023 248353 245100 240387 234836 229082 223561 218613 214371 210595 207100
64293 207100 204357 203131 203416 204219 204649 204769 205088 205665 206252 207084 208868 211914 215671 219345 222731 226259
64277 226259 230349 234986 239996 245487 251752 258670 265537 271725 277291 282605 287582 291793 295179 298000
64263 298000 299976 300215 298438 295719 293484 292175 291426 291095 291359 292009 292432 292301 291600 289981 286804 282000
64247 282000 276210 269855 262730 254903 247376 241231 236473 232273 228095 224069 220454 217381 215141 214146
64233 214146 214408 215412 216660 218057 219597 220998 221883 222196 222192 222097 221918 221510 220693 219381 217828 216686 216532
64216 216532 217211 217862 217703 216659 215115 213344 211511 210001 209169 208721 207898 206505 205294 205006 205476 206125
64200 206125 206905 208129 209644 210963 212206 214144 217101 220503 223762 227041 230834 235304 240499 246713
64186 246713 254115 262415 271452 281804 294084 307707 320928 332156 340729 346414 348804 347574 343012
64173 343012 335978 327424 318072 308412 298844 289751 281340 273380 265341 257060 249116 242235 236516 231621
64159 231621 227608 224924 223500 222452 221020 219362 218079 217361 217081 217416 218744 220918 223203 225149 227178
64144 227178 230039 233840 237839 241118 243375 245073 246889 249033 251061 252354 252656 252083 250813 249030 247136
64129 247136 245605 244463 243206 241527 239913 239116 239111 239020 238241 237311 237452 239487 243415 248758 254971 261586
64113 261586 268359 275337 282647 290294 298399 307399 317573 328330 338435 347068 354289 360341 365008
64100 365008 368038 369891 371676 374495 379050 385579 393711 402492 410954 418685 425664 431755 436711 440464
64086 440464 442895 443352 440946 435469 427694 418679 409102 399314 389557 379868 370108 360332 350845 341745
64072 341745 332783 323987 316089 309853 305121 301027 297211 294359 293357 294149 295680 296832 297206 297085 296906
64057 296906 296923 297225 297849 298895 300610 303330 307122 311488 315655 319301 322861 327011 332096 338198 345456
64042 345456 353990 363690 374369 385954 398128 409984 420601 429943 438646 446800 453392 457191 457750
64029 457750 455360 450503 443767 436033 428267 421124 414899 409742 405771 403114 401896 401975 402592 402652 401562
64014 401562 399474 396532 392288 386299 378998 371437 364291 357542 351085 345137 339975 335603 331818 328365
64000 328365 325021 321700 318578 315896 313667 311777 310356 309805 310345 311693 313299 314870 316669 319318 323226
63985 323226 328138 333314 338209 342923 347988 353893 360826 368514 376174 382975 388949 395191 402814 411855
63971 411855 421523 431280 441270 451799 462935 474629 486919 499941 513984 529411 546273 564228
63959 564228 583344 604791 630176 660176 694382 732472 774992 822918 877197 938919 1009338
63948 1009338 1089377 1179609 1281002 1395101 1523047 1664821 1819746 1987108 2165751 2353642
63938 2353642 2548600 2749132 2953748 3159502 3361753 3555233 3734868 3895961 4034634
63929 4034634 4148433 4235955 4295789 4326322 4326569 4296453 4236068 4145581 4026510 3882670 3719246
63918 3719246 3541162 3352669 3157960 2961149 2765510 2573308 2386642 2208043 2039942
63909 2039942 1883749 1739774 1608038 1488999 1383399 1291394 1211927 1143062 1082976 1030518
63899 1030518 984904 945279 910920 881629 857404 837649 821056 806396 793136 781156 770115
63888 770115 759394 748554 737720 727555 718897 712168 707016 702711 699051 696763 696904 700183 707013
63875 707013 717742 732256 749605 768728 789676 813575 841261 872462 906485 943055 982032
63864 982032 1022756 1064309 1106194 1148205 1189642 1229112 1265081 1296295 1321851 1341408 1355433
63853 1355433 1364809 1370006 1370912 1367479 1360079 1349000 1334013 1314747 1291331 1264339 1234227 1201106
63841 1201106 1165028 1126299 1085530 1043492 1000955 958475 916234 874126 832124 790699 750788
63830 750788 713135 677649 643704 611186 580930 553860 530042 508879 489829 472393 455797
63819 455797 439539 424185 410745 399162 388242 377312 367048 358247 350652 343664 337429 332267
63807 332267 327555 322236 316267 310627 305881 301618 297431 293638 290706 288481 286322 283649 280246 276365
63793 276365 272650 269627 267207 265014 263066 261601 260333 258603 256399 254493 253310 252326 251004 249689
63779 249689 248962 248628 248003 246955 245987 245380 244773 243650 241923 239983 238432 237665 237505 237341 236846 236360 236350
63762 236350 236755 237172 237406 237435 237134 236551 236278 236870 237928 238376 237792 236841 236173 235489 234145 232236 230557 229640
63744 229640 229390 229592 230322 231705 233574 235576 237478 239267 241036 242888 244916 247097 249266 251313 253469
63729 253469 256141 259305 262225 264170 265390 266983 269663 273065 276514 280054 284162 288730 292959 296325
63715 296325 299067 301585 303869 305745 307243 308369 308827 308347 307123 305597 303974 302260 300605 299246 298131
63700 298131 296926 295441 293811 292280 291129 290856 292119 295222 299660 304331 308323 311597 314926 319101
63686 319101 324107 329070 333000 335478 336757 337488 338402 339877 341516 342369 341868 340367 338572 336732 334839
63671 334839 333285 332631 332782 333061 333248 333806 334846 335558 335207 334163 333322 332864 332259 331293 330322 329493 328358
63654 328358 326448 323742 320456 316840 313322 310353 307808 304974 301506 298086 295773 294921 295080 295737 296734
63639 296734 298075 299734 301717 304120 307092 310850 315555 320947 326311 331188 336048 341815 348778 356361
63625 356361 363970 371540 379154 386674 394155 402202 411431 421720 432505 443753 456220 470619 486897
63612 486897 504467 522960 542579 563899 587438 613346 641381 671195 702541 735018 767563
63601 767563 798413 825720 848135 864772 874975 878595 876555 870772 863233 855119 846815 838453 830191
63588 830191 822022 813540 803905 791883 776091 755791 731708 705821 680013 655031 630891 607925
63576 607925 586851 567909 550650 534888 521359 510936 503464 497942 493776 491295 490871 492014 493828
63563 493828 496193 500048 506329 514842 524395 533949 543409 553242 563649 574442 585725 598352 613436
63550 613436 631496 652275 675445 701405 731334 766402 806783 851274 897615 942853 983359
63539 983359 1015133 1035117 1042718 1039926 1029868 1015479 999422 984205 971420 960977 951709 942665
63527 942665 933381 923133 910801 895598 877281 855450 829403 799190 766307 732736 699541 666870
63515 666870 635019 604856 577166 552004 528872 507356 487567 470082 455342 442983 431895
63504 431895 421163 410775 401253 392853 385463 379020 373507 368600 363813 359073 354793 351289 348483 346156
63490 346156 344093 341934 339410 336948 335548 335695 336783 337991 339424 341839 345409 349322 352689 355396
63476 355396 357941 360799 364127 367814 371515 374747 377203 378950 380193 380898 380783 379704 377900 375811 373701
63461 373701 371533 369184 366790 364849 363924 364140 364948 365554 365714 366036 367378 369965 373217 376449 379522 382803
63445 382803 386720 391550 397458 404508 412745 422431 434118 448144 464128 481363 499935 521173 546735
63432 546735 577246 611723 647835 682404 712099 734575 749394 757707 761060 760823 758809 757663 759913
63419 759913 766710 778023 793943 815114 841748 872930 907347 944113 982200 1019402 1052740 1080009
63407 1080009 1100381 1113582 1119407 1118406 1112344 1103347 1092901 1081961 1071336 1061132 1050126 1036545
63395 1036545 1019446 998747 974131 944935 911393 875177 838194 801361 764957 729621 696401
63384 696401 666057 638795 614534 593010 573795 556629 541737 529494 519880 512562 507385 504340
63372 504340 503148 503367 505031 508816 515315 524341 535140 547148 560423 575464 592758 612487 634569
63359 634569 658935 685744 715211 747263 781472 817409 854950 894043 934059 973395 1009862
63348 1009862 1041538 1067300 1086585 1098984 1104393 1103475 1097614 1088308 1076826 1064384 1052110 1040441
63336 1040441 1028759 1015929 1001040 983434 962344 937122 907988 876227 843510 811048 779370
63325 779370 748652 719259 692141 668721 650254 637178 629092 625113 623958 623670 621627 615206 602801
63312 602801 584608 562605 539487 517131 495935 475646 456568 439605 425344 413637 404108 396497
63300 396497 390259 384367 378093 371815 366581 362794 359671 356147 352074 348237 345286 342929 340403 337530
63286 337530 334947 333192 331926 330344 328164 325869 323973 322439 320928 319436 318422 318281 318737 318876 318007
63271 318007 316530 315768 316702 319064 321797 324153 326035 327557 328823 330147 331981 334416 337026 339332 341266
63256 341266 343186 345678 349252 353921 359067 364049 368885 374056 379776 385955 392767 400570 409234 418228
63242 418228 427605 438117 449985 462288 474245 486541 500698 517422 536290 556764 578723 602057
63230 602057 626533 652188 679193 707070 734537 760499 784980 808866 832966 857391 881540
63219 881540 904545 925985 946442 967232 989315 1012398 1035048 1055582 1072880 1086559 1096565
63208 1096565 1102648 1104145 1100221 1090283 1074281 1052838 1027110 998291 967106 933957 899568 865162
63196 865162 831864 800293 771010 744920 722692 704010 687996 674352 663634 656439 652838 652661
63184 652661 655732 661615 669538 678897 689616 701848 715527 730350 745817 761090 775201 787748
63172 787748 799243 810467 821637 832401 842447 851705 859991 866831 871724 874370 874520 871796 865796
63159 865796 856311 843277 826622 806397 783137 757923 731859 705569 679396 653989 630302 608871
63147 608871 589447 571546 555068 540107 526497 514049 503047 494019 487006 481437 476688 472393
63135 472393 468281 464237 460583 457797 455878 454433 453431 453300 454132 455404 456748 458430 460662 463078 465423
63120 465423 468235 472103 476582 480610 483862 486971 490429 494020 497482 501075 505111 509366 513284 516587
63106 516587 519434 522165 525006 527883 530464 532527 534234 535800 537021 537582 537861 538830 540886 543221 544795
63091 544795 545637 546698 548554 550759 552488 553410 553729 553693 553383 552995 553057 554201 556684 560282 564712 570021
63075 570021 576346 583437 590794 598271 606234 614987 624446 634547 645569 657717 670715 684286 698802
63062 698802 714994 733150 753094 774818 798570 824362 852147 882633 917193 956503 999793
63051 999793 1045918 1094720 1146843 1202597 1261576 1323068 1386146 1449579 1512421 1574731 1637059
63040 1637059 1699186 1760104 1819293 1877244 1934387 1990294 2044508 2097560 2150380 2202890 2253747
63029 2253747 2301265 2343980 2380359 2408542 2426575 2432732 2425709 2404960 2370872 2324469 2266979 2199992
63017 2199992 2125849 2047400 1967215 1887180 1808741 1733159 1661545 1594972 1534596 1481390 1435753
63006 1435753 1397617 1366913 1343624 1327486 1318067 1315126 1318412 1327039 1339539 1354706 1371996 1390942
62994 1390942 1410705 1430539 1450330 1470211 1489901 1508797 1526637 1543709 1560413 1576761 1592224
62983 1592224 1605959 1617231 1625644 1630738 1631358 1625856 1613169 1593458 1567524 1536016 1499528 1459019
62971 1459019 1415552 1369773 1322204 1273989 1226741 1181542 1138455 1097196 1057977 1021467 988218
62960 988218 958294 931384 907081 885083 865180 847095 830375 814511 799108 783911 768787
62949 768787 753685 738484 722897 706902 691300 677308 665139 653489 641024 628149 616523
62938 616523 606951 598621 590545 582852 576098 570079 564149 558381 553582 550178 547766 545818 544248 543081
62924 543081 542082 541043 540098 539371 538575 537364 535966 535035 534864 535092 535287 535468 535828 536251 536344 535822 534614 532748
62906 532748 530420 528004 525642 522888 519174 514623 509996 505761 501740 497865 494789 493247 493140 493684 494210
62891 494210 494437 494155 493279 492218 491662 491840 492354 492851 493493 494584 496041 497505 498763 499845 500818 501614 502091
62874 502091 502207 502197 502508 503379 504501 505301 505552 505487 505284 504728 503504 501656 499640 498030 497124 496655 495938 494574
62856 494574 493043 492316 492839 494242 496046 498168 500548 502758 504445 505848 507436 509215 510736 511678 511993
62841 511993 511608 510427 508695 506968 505634 504691 504013 503520 503030 502257 501113 499830 498688 497832 497414 497642
62825 497642 498485 499552 500526 501562 503061 505120 507429 509681 511843 514019 516309 518887 522060 526024 530627
62810 530627 535463 540233 544922 549700 554850 560795 567947 576257 584986 593243 600886 608728 617639 627580
62796 627580 637810 647983 658720 670942 684994 700781 718598 739289 763399 790600 820345
62785 820345 852906 889399 930822 977465 1029296 1086518 1149533 1218613 1293870 1375341 1462813
62774 1462813 1555636 1652797 1752935 1854022 1953308 2048019 2136079 2215803 2285006 2340985 2381559
62763 2381559 2405757 2413365 2404287 2378657 2337315 2281781 2213917 2135830 2049896 1958491 1863734 1767623
62751 1767623 1672188 1579071 1488995 1402031 1318499 1239369 1165733 1098126 1036436 980264 929199
62740 929199 882903 841070 803348 769332 738742 711538 687688 666801 648215 631502 616692
62729 616692 603911 593007 583690 575818 569328 563901 558970 554168 549713 546319 544727 545150 547066 549601
62715 549601 552276 555401 559682 565529 572853 581457 591361 602754 615901 631200 649102 669764 692925
62702 692925 718425 746718 778551 814064 852548 893270 936328 982378 1031630 1083439 1136930
62691 1136930 1191679 1247446 1303342 1357628 1408452 1454458 1494429 1526641 1549178 1561026 1562427
62680 1562427 1553868 1535195 1506274 1468234 1423332 1373490 1319625 1262591 1204092 1146046 1089403
62669 1089403 1034195 980572 929286 881238 837035 797032 761355 729714 701443 675773 651970
62658 651970 629388 607825 587803 570047 554588 540757 528072 516700 506846 498160 490080 482494
62646 482494 475709 469904 464814 459915 454821 449649 445028 441473 438692 435818 432515 429562 428116 428568
62632 428568 430318 432388 434037 435020 435453 435421 434724 433302 431839 431348 431938 432584 432477 432033 432094 432708 433495 434785
62614 434785 437493 441906 447407 453406 459865 466831 474201 482179 491323 501849 513376 525622 538894
62601 538894 553665 570039 587942 607483 628961 652840 679870 710821 745817 784172 825036
62590 825036 867914 912568 958851 1006659 1055337 1102890 1146438 1183907 1214805 1238985 1255388
62579 1255388 1262645 1260411 1249415 1230554 1204690 1172991 1136651 1096377 1052840 1007486 962100 917635
62567 917635 874207 832258 792819 756425 722607 690841 661347 634498 610070 587638 567364
62556 567364 549778 534943 522242 510914 500553 491212 483276 477059 472279 468052 463595 458833 454196
62543 454196 450045 446497 443600 441438 440101 439650 439966 440631 441197 441631 442170 442664 442517 441529 440363 439897 440473
62526 440473 442144 445224 450012 456289 463643 472126 482022 493108 504860 517460 531988 549384 569714
62513 569714 592604 617953 645832 675953 707535 739682 771807 803804 835782 867432 897633
62502 897633 924888 948162 967132 981735 991766 996880 996666 990811 979651 964616 947684 930237
62490 930237 912783 895816 880381 867561 857848 851341 848180 848448 852038 859002 869775 884597 902857
62477 902857 923300 944710 966105 986491 1004850 1020287 1031962 1039052 1041131 1038452 1031437 1019917
62465 1019917 1003129 980488 952197 919293 883374 846135 808762 771669 734965 699109 665013
62454 665013 633658 605804 581869 561778 545073 531331 520257 511265 503502 496807 492202 490727
62442 490727 491930 494295 497113 501110 506994 514122 521105 527293 533200 539665 546889 554151 560211 564065
62428 564065 565371 564131 560174 553399 544445 534540 524511 514349 503935 493700 484278 475900 468475
62415 468475 461873 455775 449512 442609 435449 429023 424006 420193 416836 413410 410071 407413 405680 404316
62401 404316 402518 400112 397541 395090 392657 390380 388816 388228 388244 388634 389845 392269 395360 398144 400396
62386 400396 402712 405569 408813 412069 415208 418387 421937 426155 431013 436243 441967 448887 457429 466985
62372 466985 476579 486044 495948 506581 517828 529986 543775 559286 575734 592757 611345 632967
62360 632967 658216 686870 718915 754791 794711 838385 885466 935773 988831 1043543 1098513
62349 1098513 1152437 1203881 1250862 1291132 1323073 1346216 1360902 1367680 1367168 1360154 1347372 1329062
62337 1329062 1305015 1275115 1239766 1199909 1157037 1113184 1070466 1030259 992964 958586 927185
62326 927185 898723 872989 850026 830189 813308 798157 783242 767870 751916 734909 716166
62315 716166 695843 675066 654769 634907 615083 595496 576905 559888 544429 530155 516846
62304 516846 504765 494452 486119 479380 473727 469019 465225 461980 458925 456308 454662 453927 453491 453097
62290 453097 453081 453571 454158 454669 455706 457986 461488 465579 469688 473616 477445 481406 485590 489700 493368
62275 493368 496733 500249 503957 507578 511538 517099 524965 534395 544290 554656 566353 579945 595602
62262 595602 613790 635100 659426 686207 715628 748859 786912 829870 877465 929688 986327
62251 986327 1046262 1107748 1169190 1229187 1285887 1336808 1379594 1412882 1436444 1450700 1456308 1454008
62239 1454008 1444302 1426940 1400983 1365946 1322951 1274342 1222028 1166625 1108432 1048803 990080
62228 990080 934381 882809 835614 792631 753582 718390 687280 660334 636954 616049 596793
62217 596793 579063 563161 549325 537486 527257 518090 509572 501572 494095 487092 480499 474258 468268
62204 468268 462571 457742 454720 453958 454943 456785 458947 461139 463078 464957 467760 472368 478510 485327 492782
62189 492782 501644 512076 523219 534438 546082 558620 571878 585697 600598 616958 634032 650639
62177 650639 666568 682504 698841 715429 732439 750570 770135 790713 812074 834922 860296
62166 860296 888729 920380 955507 994109 1035292 1077614 1120094 1162315 1203416 1241470 1274132
62155 1274132 1299653 1317115 1326223 1327413 1321923 1311157 1295795 1275818 1251355 1223045 1191480 1156782
62143 1156782 1119133 1079444 1039152 999553 961703 926808 896133 870326 849070 831580 817322
62132 817322 806171 798018 792350 788265 784962 782283 780632 780249 780802 781961 784180 788346 794601 802038
62118 802038 809816 818116 827454 837279 845863 851689 854566 855165 853870 850550 845390 839437 833947 829213
62104 829213 824243 817633 808716 797890 786108 774257 763018 753090 745319 740473 738847 740080 743380
62091 743380 747962 753355 759411 766128 773445 781050 788464 795428 802170 809084 816112 822731 828670 834454
62077 834454 841034 849095 858932 870792 884939 901272 919167 937858 956940 976490 996802 1018042
62065 1018042 1040099 1062772 1086104 1110530 1136623 1164606 1194011 1223731 1252414 1278884 1302131
62054 1302131 1320968 1334099 1340966 1342315 1339391 1332539 1321132 1304863 1284357 1260147 1231831 1198944
62042 1198944 1162181 1123030 1082454 1040715 998290 956114 914874 874835 836591 801279 769706
62031 769706 741696 716501 693466 672116 652197 634044 618494 605972 595797 586735 578122 570176
62019 570176 563370 557764 552902 548175 543255 538282 533585 529292 525320 521656 518419 515681 513509 512128
62005 512128 511746 512212 513184 514655 516951 520215 524262 528896 533865 538402 541457 542679 542715 542237 541131 538970
61989 538970 535755 531707 526711 520574 513640 506578 499618 492450 484866 477165 469862 463185 456840 450167
61975 450167 442727 434948 427960 422590 418708 415687 413123 410775 408241 405284 402271 399778 397817 395960
61961 395960 394097 392560 391541 390896 390546 390612 391034 391503 391907 392513 393613 395357 397960 401649 406236 411177
61945 411177 416321 422306 429946 439415 450256 461967 474331 487328 501000 515455 530851 547364
61933 547364 565057 583601 602120 619640 635883 651416 666811 681792 695423 706944 716131 722894
61921 722894 727006 728466 727860 726003 723166 718912 712876 705560 698209 691945 687240 684168 682916 683827 687100
61906 687100 692595 699950 708791 718824 729748 740996 751625 760594 767297 771676 773825 773603 770737
61893 770737 765191 757280 747513 736345 724018 710612 696389 682074 668623 656684 646411 637756
61881 637756 630580 624426 618571 612530 606331 600229 594437 589160 584443 579833 574714 569232 564373 560777
61867 560777 558023 555549 553676 552964 553076 553220 553523 554999 558085 562093 566368 571214 577404 585352 595141
61852 595141 606901 620813 637023 655655 676578 699078 722237 745689 769514 793322 816131
61841 816131 837317 856902 874497 888650 897957 902357 902757 899773 893559 884608 873951 862539 850980
61828 850980 839995 830653 823962 820502 820504 823971 830612 839808 850665 861999 872399 880626 886025 888387
61814 888387 887401 882412 872821 858665 840759 820189 797614 773131 746989 720348 694903 671625
61802 671625 650155 629678 610148 592389 577163 564428 553543 544019 536057 530328 527102 525666
61790 525666 524821 523938 523191 522761 522354 521723 521118 520790 520406 519491 518221 517289 517015 517024 516774 516037 514856 513351
61772 513351 511675 510011 508548 507426 506560 505597 504312 503074 502485 502511 502592 502809 504161 507136 510696 513484
61756 513484 515485 517555 519684 520906 520864 520340 519940 519251 517729 515592 513305 510812 507844 504536 501263
61741 501263 498161 495203 492429 489771 486979 484029 481345 479317 477897 476879 476253 476029 476142 476828 478648
61726 478648 481650 484783 486637 486659 485412 483947 483301 484231 486867 490629 494844 499288 503848 507964 510969
61711 510969 512835 514033 514684 514417 513128 511285 509241 506626 502776 497594 491781 486323 481838 478289 475139
61696 475139 471813 468116 464293 460767 457810 455357 453053 450589 448012 445590 443357 441084 438782 436878
61682 436878 435628 434656 433448 432073 431015 430436 429999 429392 428624 427819 427055 426440 426087 425984 426064 426273 426416 426168
61664 426168 425573 425237 425583 426119 425961 424979 423837 423038 422563 422435 422837 423575 424164 424699 425865 427736 429345
61647 429345 429946 430054 430568 431502 432360 433315 435106 437941 441283 444595 447572 449750 450733 450907 451128 451494 451107
61630 451107 449302 446466 443310 439939 436128 431992 427811 423569 419260 415416 412715 411161 410189 409543 409491
61615 409491 410107 410917 411524 412112 412912 413426 412693 410315 406823 402968 398949 394498 389507 384280 379212 374448
61599 374448 369901 365431 360903 356177 351187 346076 341155 336692 332766 329366 326595 324566 323004 321108
61585 321108 318103 314071 310043 307111 305514 304677 303942 302986 301675 299961 298055 296422 295334 294547 293508
61570 293508 291839 289588 287246 285514 284825 284865 284768 283965 282724 281735 281369 281533 281986 282480 282711 282532 282215 282245
61552 282245 282775 283541 284326 285284 286662 288369 289970 291117 291896 292680 293588 294204 294069 293437 293222 293988 295341
61535 295341 296562 297522 298606 300006 301608 303424 305484 307304 308087 307644 306666 305826 305029 303812 302103 300247
61519 300247 298567 297173 295953 294526 292514 290194 288558 288285 288812 288918 288129 287088 286578 286704 287113 287509
61503 287509 287637 287184 286134 285017 284400 284189 283881 283476 283617 284549 285464 285383 284440 283664 283502 283271 282301 280964
61485 280964 280123 279997 280193 280570 281401 282784 284449 286161 287800 289066 289700 290071 290971 292635 294424 295652
61469 295652 296268 296524 296536 296452 296583 296994 297312 297237 296861 296220 295019 293250 291647 290998 291278 291939 292773 294000
61451 294000 295663 297404 298743 299312 299018 298331 298046 298347 298455 297720 296727 296662 297851 299660 301684 304171 307222
61434 307222 310385 313265 315986 318843 321986 325555 329503 333129 335423 336192 336352 336802 337484 337863 337817 337650
61418 337650 337585 337712 338181 339086 340293 341683 343360 345386 347538 349549 351383 352961 353797 353252 351160 348098
61402 348098 345039 342710 341102 339582 337695 335798 334639 334371 334422 334348 334270 334321 334249 333885 333500 333293 332972 332292
61384 332292 331660 331656 332229 332803 333013 332944 332890 333257 334441 336260 337823 338521 338985 340398 342947 345668 347848 349829
61366 349829 352203 354886 357411 359656 361775 363706 365256 366603 368270 370542 373173 375778 378370 381382
61352 381382 385227 389929 395234 400995 407294 414183 421471 428775 435638 441525 446061 449508 452734 456353
61338 456353 460073 463235 465864 468712 472292 476316 480154 483360 485596 486503 486066 484870 483644 482594 481368
61323 481368 479575 477183 474541 472181 470573 469945 470377 472047 475172 479572 484545 489416 494131 499114 504741
61308 504741 511268 519124 528820 540412 553396 567296 582077 597692 613431 628160 641241 652877
61296 652877 663369 672323 678858 682507 683645 682969 680818 677089 671688 664854 657048 648640 639762 630432
61282 630432 620682 610593 600370 590566 582075 575490 570386 565634 560737 556584 554496 554692 556124 557716
61268 557716 559195 560666 562016 563094 564074 565228 566525 567866 569514 571997 575635 580377 585993 592192
61254 592192 598658 605131 611366 616890 621087 623847 625902 628093 630343 631725 631546 630028 627864 625492
61240 625492 623004 620488 618108 615846 613388 610412 606961 603405 600043 596950 594351 592890 593127 594810
61226 594810 597146 599878 603620 608907 615384 622318 629505 637217 645562 654427 663818 673784 684109 694526
61212 694526 705144 716188 727386 738035 747617 755953 762952 768780 774177 780012 786440 792999 799554
61199 799554 806593 814529 823341 833068 844102 856735 870883 886504 903747 922343 941184 958839
61187 958839 974267 986982 997010 1004889 1011253 1016098 1018829 1019257 1018050 1015931 1012860 1008385 1002246 994251
61173 994251 984105 972045 959272 947106 935911 925298 914971 904638 893416 880283 865198
61162 865198 849069 832495 815210 796915 777983 759054 740497 722622 706008 691226 678490
61151 678490 667819 659249 652602 647370 643168 640110 638391 637565 636488 634004 629584 623466 616386 609097
61137 609097 601968 595024 588390 582526 577950 574880 573255 572944 573811 575753 578943 583886 591035 600377 611567
61122 611567 624364 638752 654752 672475 692305 714622 739172 765098 791857 819827 849644
61111 849644 881102 913185 945160 977083 1009014 1040190 1069473 1096412 1121398 1144765 1166148
61100 1166148 1184789 1200082 1211595 1218850 1221442 1219344 1212873 1202365 1188067 1170364 1149978 1127755
61088 1127755 1104177 1079056 1051890 1022678 992337 962168 932922 904612 877151 850837 826070
61077 826070 802980 781569 761979 744284 728155 713138 699253 687034 676968 669122 663336 659412
61065 659412 656939 655170 653440 651735 650731 651142 653076 656009 659367 663044 667354 672585 678771 685908
61051 685908 694190 703896 715138 727868 742125 758113 776038 795901 817496 840556 864882 890378
61039 890378 917031 944964 974505 1006092 1039971 1076066 1114293 1154921 1198333 1244443 1292583
61028 1292583 1342123 1393016 1445589 1499887 1555377 1611306 1667484 1724954 1786029 1853543 1930047
61017 1930047 2017673 2118375 2233784 2364902 2512648 2679034 2867681 3083436 3332277 3621865
61007 3621865 3961416 4360600 4829416 5380195 6029897 6800642 7719450 8818865 10136166
60998 10136166 11705467 13538432 15595365 17757773 19824182 21551420 22739720 23320992
60990 23320992 23393137 23175465 22916091 22806536 22933232 23259519 23629099 23802693 23538611
60981 23538611 22691598 21273506 19436988 17398079 15352400 13429951 11694075 10162343
60973 10162343 8827909 7673982 6682258 5836355 5121223 4521341 4020423 3602580 3253271
60964 3253271 2959497 2709903 2495147 2308107 2143695 1998402 1869634 1755089 1652687
60955 1652687 1561142 1480178 1409743 1348999 1296213 1249365 1206555 1166030 1126531 1087822 1050547
60944 1050547 1015382 982514 951951 923900 898487 875301 853525 832467 811836 791625 771940
60933 771940 752890 734482 716641 699463 683354 668680 655269 642503 630004 618140 607667
60922 607667 598895 591313 584106 576984 570433 565126 561132 557770 554231 550285 546375 543144 540949 539764
60908 539764 539324 539206 538894 538024 536717 535483 534653 533938 532829 531352 530120 529541 529285 528839 528271 527948 527615
60891 527615 526359 523708 520293 517103 514481 512227 510312 508816 507310 505049 501936 498721 495983 493464
60877 493464 490791 488377 487020 486886 487566 488995 491643 495670 500524 505622 510976 516853 523261 530177 537943
60862 537943 546890 556689 566520 575901 584976 593978 602789 611179 619142 626775 634069 641082 648218 656031
60848 656031 664668 673677 682436 690667 698473 705984 713210 720239 727304 734469 741487 748268 755334 763376
60834 763376 772358 781596 790927 801304 813882 828886 845847 864548 885024 906812 928964 950984
60822 950984 973062 995086 1015979 1034426 1049907 1062568 1072421 1079115 1082262 1081506 1076359 1066478 1052183
60809 1052183 1034380 1013963 991482 967341 941936 915631 888933 862737 837994 815037 793558
60798 793558 773357 754712 737811 722199 707237 692866 679553 667515 656409 645757 635386
60787 635386 625408 616093 607808 600727 594405 587926 580738 573253 566406 560628 555432 549992 543983 537811
60773 537811 532138 527209 522646 517871 512704 507550 503058 499659 497301 495356 492787 488749 483251 477106
60759 477106 471140 465602 460412 455582 451049 446389 441207 435760 430759 426517 422718 419141 416145 414187
60745 414187 413136 412442 411866 411794 412727 414526 416157 416336 414598 411681 408673 405945 403180 400308 397880 396443
60729 396443 396037 396461 397533 398896 400022 400691 401080 401203 400760 399836 399124 398912 398427 396798 394236 391465 388407
60712 388407 384390 379528 374888 371128 367825 364346 360650 356942 353241 349686 346663 344151 341461 338115
60698 338115 334664 332160 331058 330964 331192 331164 330555 329497 328602 328461 329073 329889 330265 329866 328880 328040 328217 329778
60680 329778 332453 335834 339673 343573 346919 349484 351878 355004 359174 363964 368759 373245 377488 381671
60666 381671 385597 388469 389503 388867 387585 386453 385612 385317 386349 389072 392746 396504 400564 405627 411425
60651 411425 416750 420906 424322 427698 431296 435151 439288 443425 447005 449640 451124 451063 449129 445797 442046
60636 442046 438108 433172 426786 419926 414094 409774 406308 403016 399817 396886 394248 391848 389658 387645
60622 387645 385800 384206 382915 381793 380630 379370 378101 376873 375604 374144 372386 370358 368227 366144
60608 366144 364150 362380 361229 360960 361181 361073 360313 359467 359340 360197 361763 363616 365353 366657 367558 368503
60592 368503 369927 371834 373906 375804 377203 377806 377592 376887 375999 375012 374129 373786 374029 374083 373158 371581 370564
60575 370564 370810 371868 373061 374568 377270 381763 387790 394567 401442 408300 415507 423558 432717 442819
60561 442819 453211 462894 471026 477449 482507 486148 487526 485883 481658 476298 471050 466356 462351 459367
60547 459367 457712 457360 458081 459634 461709 464045 466871 470937 476829 484447 493308 503077 513496 524045
60533 524045 534066 543128 551028 557545 562463 565726 567246 566710 563991 559731 555124 551012 547449 544215
60519 544215 541346 538963 536903 534967 533443 533025 534035 535926 537680 538702 539280 540229 542202 545325 549342
60504 549342 554000 559358 565849 574077 584448 597062 612051 629942 651411 676634 705193 736720
60492 736720 771255 808576 847399 885661 921439 953183 979149 997288 1005959 1004456 992762 971346
60480 971346 941563 905809 866733 826353 786171 747647 711895 679069 648790 621259 597287
60469 597287 576988 559101 542140 525864 511129 498611 488229 479675 472813 467382 462817 458663
60457 458663 454864 451374 447752 443432 438292 432699 427145 422029 417638 414010 410838 407783 404886 402412
60443 402412 400327 398283 396195 394459 393427 393005 393002 393485 394394 395081 394787 393507 391899 390303 388393 385967
60427 385967 383552 381856 380948 380354 379732 379127 378711 378709 379485 381308 383969 386874 389567 391920 393868 395260
60411 395260 396111 396763 397642 398898 400349 401664 402616 403280 404013 405123 406564 408059 409527 411134 412932 414661
60395 414661 416024 416980 417721 418510 419622 421235 423217 425182 426926 428706 430908 433555 436285 438798 441144
60380 441144 443509 445835 447806 449321 450889 453317 456811 460598 463721 466154 468731 471992 475495 478483
60366 478483 480835 483049 485501 488135 490758 493313 495759 497987 499958 501880 504219 507505 511982 517393
60352 517393 523267 529522 536619 545080 555171 567238 581850 598987 617185 634149 648362 659632
60340 659632 667944 672420 671925 666444 657331 646215 634040 621167 607961 594970 582678 571353 561146
60327 561146 552194 544542 538045 532417 527345 522529 517696 512740 507897 503651 500336 497874 496026 494767
60313 494767 494223 494271 494523 494925 496179 499173 503942 509504 515021 521005 529076 540580 555755 574161 595351
60298 595351 618630 642480 664850 684086 699252 709624 714385 713026 705642 692723 675121 654459
60286 654459 633012 612578 593688 576317 561000 548538 538738 530259 521999 514024 506839 500321 493916
60273 493916 487565 481752 476630 471629 466162 460375 454916 450161 446023 442430 439629 437840 436831 436048
60259 436048 435039 433598 431711 429656 428064 427494 427866 428580 429206 429761 430301 430719 431081 431766 433013 434708
60243 434708 436819 439560 442706 445199 446043 445360 444088 442862 441768 440955 440755 441184 441880 442640 443531 444531
60227 444531 445591 447040 449292 452107 454755 457023 459377 462002 464478 466693 469255 472484 475754 478503
60213 478503 481289 485040 489697 494522 499475 505297 512241 519573 526561 533217 539770 546073 552010 558031
60199 558031 564656 571640 578114 583574 588401 593265 598211 602486 605188 605965 605111 603184 600647 597752 594495
60184 594495 590661 586137 581262 576572 572041 566873 560405 553138 546483 541446 537741 534322 530564 526839
60170 526839 523982 522368 521551 520788 519752 518672 517868 517368 516912 516131 514765 512944 511211 509941 508781 507120
60154 507120 505218 504275 505037 506767 508072 508440 508555 509365 511358 514505 518338 522118 525447 528683 532409
60139 532409 536619 540941 545484 550795 556960 563441 569967 576840 583988 590389 595130 598619 602038 605735
60125 605735 608794 610339 610697 610992 611859 612926 613499 613443 613264 613438 613972 614685 615733 617578 620431 623878 627046
60108 627046 629056 629443 628440 626831 625265 623636 621367 618299 614959 611803 608613 604955 600964 597154
60094 597154 593596 589800 585631 581879 579536 578657 578405 578228 578601 580324 583320 586583 589276 591500 593868
60079 593868 596670 599685 602579 605152 607305 608982 610082 610235 608822 605525 600782 595395 589724 583551
60065 583551 576705 569489 562394 555667 549247 542979 536792 530864 525592 521259 517764 514844 512411 510365
60051 510365 508245 505613 502823 500901 500497 501386 503165 505819 509269 512894 516162 519503 523878 529479 535318
60036 535318 540247 543998 547100 550078 552982 555504 557310 558177 557955 556543 553993 550507 546169 540762 534086
60021 534086 526427 518356 510016 501048 491436 482013 473728 466618 460002 453527 447598 442792 439264 436816
60007 436816 435181 434090 433305 432817 432918 433957 435973 438480 440581 441523 441370 441021 441290 442104 442886 443546 444593
59990 444593 446240 447993 449480 451262 454353 459045 464555 469755 473951 477005 479090 480529 481635 482439
59976 482439 482565 481569 479381 476400 473127 469868 466759 463902 461344 459102 457408 456722 457223 458403 459552
59961 459552 460623 462173 464395 466777 468955 471312 474202 477070 479064 480281 481617 483395 484957 485745
59947 485745 486066 486451 486895 487212 487649 488504 489369 489333 487886 485251 481876 478051 474027 470167 466742 463709
59931 463709 460752 457546 454027 450502 447409 444920 442947 441601 441349 442497 444694 447245 449729 452077
59917 452077 454201 455996 457645 459564 462017 465077 468928 473797 479488 485381 491096 496889 503174 509845
59903 509845 516313 522122 527292 532029 536177 539017 539767 538415 535960 533601 531690 529787 527692 525998
59889 525998 525445 526163 527843 530376 533876 538193 542804 547199 551116 554412 557029 559144 561100 563130 565333
59874 565333 567926 571155 574739 577627 578645 577453 574725 571434 568071 564618 561057 557694 554871 552498
59860 552498 550094 547338 544476 542071 540442 539480 538994 539078 540084 542344 546014 551146 557811 566054 575624
59845 575624 585719 595089 602542 607448 609776 609831 608161 605693 603652 602946 603520 604314 603991 601715 597387
59830 597387 591358 584089 576110 568090 560769 554728 550154 546674 543420 539498 534749 529986 526193 523371
59816 523371 520371 516081 510600 505105 500713 497741 496008 495474 496242 497989 499727 500433 500006 499384 499534 500367
59800 500367 500873 500277 498749 496896 494908 492486 489401 485813 482047 478258 474324 469962 465045 459900 455153
59785 455153 451159 447748 444693 442150 440339 438993 437541 435832 434281 433308 432936 432999 433384 433968 434617 435402
59769 435402 436613 438425 440700 443162 445560 447620 449121 450200 451403 453229 455690 458324 460578 462185
59755 462185 463339 464540 466189 468382 471147 474683 479076 483987 488988 494078 499423 504703 509300 513143
59741 513143 516706 520034 522482 523868 525175 527511 530766 533927 536408 538387 539997 540974 541277 541488 542263
59726 542263 543671 545320 546924 548512 550132 551570 552525 553032 553542 554397 555371 555981 556149 556170 556076 555610 554933
59709 554933 554723 555247 555899 556123 556300 557135 558556 559855 560649 561033 561008 560475 559734 559370 559629 560473 562115 564774
59691 564774 567890 570367 571819 572910 574213 575421 576036 576188 576234 576033 575300 574374 574034 574470 574877 574187 571992
59674 571992 568703 564950 560972 556631 551947 547330 543112 539083 534851 530524 526625 523381 520577 518097
59660 518097 516076 514426 512789 511170 510101 509924 510370 511190 512708 515305 518765 522608 526792 531475 536272
59645 536272 540257 542745 543743 543697 543076 542095 540480 537596 533147 527794 522780 518901 515987 513354 510579
59630 510579 507937 506231 506111 507399 509193 510748 511945 512706 512459 510772 508303 506362 505434 504770 503572
59615 503572 501926 500191 498044 494920 491150 487915 485864 484380 482529 480411 479025 478990 479934 481262 482979
59600 482979 485335 487956 489876 490506 490157 489506 488914 488427 488116 488039 488004 487695 487072 486411 485930 485515 484913 484051
59582 484051 483109 482293 481601 480816 479723 478306 476740 475203 473675 471910 469646 467030 464736 463395 462842
59567 462842 462316 461616 461603 463090 465540 467504 468239 468201 467946 467327 466036 464337 462777 461610 460941 461055 462138
59550 462138 463885 465793 467683 469686 471923 474547 477906 482307 487745 494116 501487 509884 519118 529299
59536 529299 541380 556653 575369 595856 614834 628661 634883 633403 626362 616750 606975 598504 592198
59523 592198 588430 587049 587661 589931 593372 597132 600422 602974 604751 605426 604599 602331 598904 594161 587644
59508 587644 579379 570039 560337 550754 541886 534418 528463 523291 517969 512075 505836 499896 494970 491281
59494 491281 488274 485269 482411 480526 480001 480372 481190 482578 484624 486794 488539 490093 492093 494641 497314
59479 497314 500016 503262 507583 513077 519587 526882 534513 541840 548517 554793 561076 567235 572545 576393
59465 576393 578919 580859 582833 584898 586739 588122 589133 590214 592107 595540 600722 607219 614551 622842
59451 622842 632596 643855 655856 667594 678578 688977 699180 709147 717990 724247 726741 725186 719833
59438 719833 710805 698372 683809 669291 656517 645683 636027 627021 618645 610837 603342 596232 590176
59425 590176 585909 583529 582556 582735 584621 589205 596923 607292 619608 633767 650092 668637 689141
59412 689141 711621 736371 763120 790469 816213 837665 851650 855197 847424 830812 810043 789416
59400 789416 771416 757229 747651 743194 743665 747691 752240 752841 745411 728819 705559 679629 653927
59387 653927 629771 608000 589411 574121 561396 550467 541082 533123 526293 520491 516031 513137 511602
59374 511602 511235 512126 514012 515881 516893 517475 518779 521287 524636 528660 533660 539509 545415 550903 556326
59359 556326 562047 567894 573915 580952 589777 600172 611490 623670 636944 651021 665405 680335
59347 680335 696549 714098 732136 749916 767422 784963 802704 820584 838150 854445 868522
59336 868522 880036 888873 894432 896039 893993 889302 882238 872052 858509 842914 827042 811526 795794
59323 795794 779178 761618 743658 726247 710312 696147 683300 671234 659836 649230 639585 631351
59311 631351 625144 620958 617932 615319 613367 612859 614170 617297 622414 629735 639044 650039 663056 678706
59297 678706 696504 714217 728708 737315 738718 733232 722605 709199 694891 680666 667063 654642
59285 654642 643910 635060 628081 622980 619748 618130 617672 618046 619249 621402 624453 628217 632724 638349
59271 638349 645494 654264 664528 676029 688214 700144 710964 720378 728356 734603 738808 741335 742859
59258 742859 743106 740630 734336 724760 713433 701422 689086 676868 665467 655157 645552 636269 627443
59245 627443 619450 612467 606530 601785 598435 596506 595822 596249 597919 601101 605765 611237 616539 621206 625652
59230 625652 630505 635670 640230 643248 644415 643852 641529 637160 630747 623024 615081 607425 599632 591100
59216 591100 581967 572992 564706 557068 549983 543757 538891 535716 534313 534508 535755 537263 538445 539162 539533
59201 539533 539800 540395 541796 544123 547139 550694 554836 559329 563514 566932 569812 572640 575532 578285 580830
59186 580830 583311 585850 588491 591292 594325 597636 601192 604692 607602 609766 611928 615055 619032 622688
59172 622688 625354 627733 630814 634525 638148 641610 645658 650927 657441 664892 672867 680856 688416 695304
59158 695304 701190 705493 707883 708702 708420 706817 703260 697691 690886 683668 676241 668330 659735 650699 641881
59143 641881 633876 626686 619849 613126 606740 600892 595562 591009 587751 585631 583569 580868 578219 576632
59129 576632 575894 575028 573946 573586 574483 576128 577835 579396 580797 582097 583780 586470 590090 593883 597519
59114 597519 601583 606763 613059 619980 627005 633667 639723 645418 651192 656983 662230 666683 670722 674799
59100 674799 679008 683233 687086 689627 689858 687826 684713 681587 678576 675489 672621 670429 668843 667380
59086 667380 665717 663852 661921 660114 658481 656650 653999 650242 645563 640090 633730 626695 619700 613266
59072 613266 607176 600879 594122 587047 580087 573970 569318 565869 562517 558535 554431 551282 549536 548827
59058 548827 548569 548217 547227 545359 543043 541041 539719 538852 538088 537341 536726 536329 536116 536027 536123 536508 537026 537280
59040 537280 537216 537397 538183 538862 538341 536728 535426 535437 536349 537322 538283 539507 540765 541719 542806 544927 548453
59023 548453 553162 558978 566095 574440 583584 593159 602903 612365 621069 628918 635972 641845 645838 647668
59009 647668 647702 646499 644566 642538 641047 640264 639925 639965 640737 642534 645296 648946 653667 659556 666258 673158
58993 673158 679814 686062 691840 697074 701651 705441 708438 710860 712883 714209 714191 712586 710067 707737 706200
58978 706200 705245 704408 703720 703931 706097 710885 718104 726911 736595 747170 759082 772374 786443 800722
58964 800722 815332 830674 846503 861833 875858 888621 900556 911617 921050 927811 931070 930555
58952 930555 926682 920188 911426 900299 887016 872497 857593 842258 826103 809553 793748 779291
58940 779291 765811 752966 741297 731737 724634 719556 715756 712536 709384 706027 702391 698510 694592
58927 694592 691031 688062 685499 683123 681185 680070 679576 679065 678316 677604 676922 675847 674410 673419 673486 674265
58911 674265 675077 675880 677197 679431 682640 686704 691389 696600 702852 711149 722035 735063 749435 764722
58897 764722 780637 796637 812284 827601 842562 856611 869354 881479 894388 908987 925419
58886 925419 943778 964346 986949 1010570 1033830 1055607 1075097 1091615 1104542 1113462 1118279 1119183
58874 1119183 1116310 1109397 1098053 1082585 1064300 1044773 1025031 1005631 987123 969954 954122 939356
58862 939356 925621 913088 901694 891074 880883 870944 861051 850932 840418 829517 818349 807083
58850 807083 795823 784536 773284 762562 753085 744991 737537 729763 721314 712518 703977 696210 689290
58837 689290 682582 675195 666961 658622 650883 643728 636959 630864 625851 621891 618823 616809 615914 615582 615216
58822 615216 615090 616062 618547 622307 627100 632884 639468 646520 653936 661693 669380 676388 682580 688237 693301
58807 693301 697170 699370 700086 699902 699275 698291 696714 694235 690832 686810 682357 677311 671532 665167 658234
58792 658234 650355 641393 632072 623407 615753 608972 603309 599385 597380 596798 597079 597943 599155 600525 602208
58777 602208 604521 607382 610266 612699 614446 615356 615461 615103 614396 612670 609013 603404 596786 590032 583399
58762 583399 576985 571030 565535 560135 554664 549489 545082 541613 539158 537981 538343 540182 543044 546241
58748 546241 549157 551639 554037 556685 559514 562448 565839 570081 575005 580182 585583 591358 597146 602321
58734 602321 606937 611766 617300 623287 629302 635229 641070 646836 652721 658893 665067 670741 675869 680759
58720 680759 685363 689367 693051 697318 702604 708429 714263 720276 726921 734314 742303 750635 758687 765487
58706 765487 770415 773554 775134 774952 772612 767958 761030 751859 740447 726753 710750 692940 674673
58693 674673 657358 641231 625568 610263 596407 584978 575653 567452 559960 553311 547438 542001 536843
58680 536843 531967 527186 522240 517251 512688 508922 505941 503457 501215 499396 498745 499977 502924 506586
58666 506586 510215 514046 518878 525276 533364 542927 553291 563288 571701 577774 581318 582537 581774 579223
58652 579223 574901 569165 563057 557668 553194 549118 545233 541881 539118 536415 533348 529960 526243 522012
58638 522012 517655 514336 512901 513162 514627 517350 521424 526193 530683 534562 538063 541235 543793 545540
58624 545540 546422 546361 545505 544478 543958 544138 544978 546731 549707 553725 558379 563785 570477 578503 587061 595203
58608 595203 602459 608612 613279 616148 617551 618365 619177 619715 619345 617974 616135 614204 612013 609414 606741
58593 606741 604252 601546 598222 594892 592845 592752 594318 597216 601568 607319 613880 620798 628325 637023 647087
58578 647087 658215 669748 680819 690785 699673 707849 715304 721767 727561 733728 741139 750036 760553
58565 760553 773033 787577 803890 821786 841322 862325 884384 907462 931746 956660 980691
58554 980691 1002323 1020410 1033606 1040686 1042008 1039631 1035321 1029286 1021472 1013005 1005282 998390 991491
58541 991491 984222 976663 968361 958457 946534 932485 915876 896458 875194 853836 833488 814322
58529 814322 796589 780995 767905 756839 747023 738199 730917 726214 724683 725411 726248 725701 724327 723742
58515 723742 724626 726319 727940 729014 729233 728569 727659 727295 727480 727651 727759 728271 728985 728798 727066 724519 722282
58498 722282 720458 718186 714803 710480 705848 701472 697791 695266 694263 694695 695959 697456 699184 701606
58484 701606 704957 708978 713427 718530 724753 732424 741764 752998 766135 780713 795868 810614 824119
58471 824119 835962 845996 853655 857693 857256 853119 847065 840057 831918 822953 814699 808516 804368 801690
58457 801690 800566 801215 803081 805553 809209 815314 824157 834630 845288 855123 863361 869214 872052 871614
58443 871614 868115 862320 855197 847305 838779 830041 821926 814905 808794 803586 799894 798156 798079 799323 802042
58428 802042 806208 811208 816793 823747 832866 843848 855870 868515 881320 893135 902909 910622 916523
58415 916523 920052 920549 918515 915094 910585 904507 896898 888578 880233 872085 864310 856988 849843 842733
58401 842733 836153 830602 825801 821231 817108 814109 812563 812554 814288 817492 820970 823701 826008 828849 832396
58386 832396 836160 839884 843338 845843 847186 848533 851264 855288 859584 863909 868682 873602 877841 881502
58372 881502 885570 890459 895711 901085 906842 913071 919770 927466 936655 946857 957273 968185 980525
58359 980525 994306 1008634 1023087 1037787 1052290 1065702 1077853 1089069 1098815 1105844 1109827 1111729
58347 1111729 1112552 1112804 1113176 1114528 1117085 1120610 1125261 1131327 1138345 1145637 1153519 1162827 1173496 1184920
58333 1184920 1197451 1212109 1228812 1246248 1263490 1280549 1297455 1314050 1330502 1346701 1361305
58322 1361305 1372761 1381127 1387529 1392230 1394845 1396237 1398304 1401843 1406224 1411214 1417433 1424964 1433234 1442399
58308 1442399 1453151 1465060 1476867 1488603 1501624 1516322 1531548 1546548 1561737 1577236 1592385
58297 1592385 1607059 1621850 1636724 1651153 1665697 1681607 1698731 1715766 1732840 1751711 1773020
58286 1773020 1795503 1818527 1843294 1870682 1899884 1930206 1962598 1998422 2037995 2080833 2125980
58275 2125980 2171847 2217386 2263768 2313311 2366602 2422405 2480262 2540864 2603675 2666732 2729460
58264 2729460 2793450 2859781 2927724 2996653 3067083 3139227 3212751 3288456 3367869 3450567 3534156
58253 3534156 3617352 3700761 3784393 3867334 3950524 4037018 4128645 4225003 4326313 4434238 4549188
58242 4549188 4669944 4796866 4932422 5077634 5231252 5393271 5565827 5749582 5942897
58233 5942897 6145846 6361366 6591113 6834019 7090516 7364259 7657935 7971321 8305366
58224 8305366 8664326 9051993 9469858 9920884 10410851 10943958 11521523 12147278 12829650
58215 12829650 13576992 14395712 15295570 16291742 17399515 18633125 20013245 21570434 23339025
58206 23339025 25355079 27664833 30328746 33412935 36982875 41109296 45873174 51362534
58198 51362534 57676597 64943165 73327814 83026580 94269740 107352450 122660854 140664019
58190 140664019 161888106 186882076 216110819 249685950 286933373 325941935 363363713
58183 363363713 394778257 415753073 423270583 416760875 398096462 370618786 337919754
58176 337919754 303061343 268348782 235369599 205077564 177912578 153969180 133144073
58169 133144073 115214801 99886034 86840272 75773850 66401576 58456358 51703610
58162 51703610 45950996 41038428 36826947 33200966 30069190 27353773 24983032 22897458
58154 22897458 21053647 19415847 17949047 16624089 15422496 14330841 13335078 12423951
58146 12423951 11592077 10834776 10143831 9511672 8935189 8411756 7935297 7499351 7099990
58137 7099990 6732700 6390293 6067213 5762716 5477284 5209268 4957410 4722882 4505980
58128 4505980 4303980 4114679 3938771 3776327 3624308 3480197 3344857 3219186 3101112
58119 3101112 2988690 2883114 2785655 2694275 2606350 2522395 2444089 2370625 2299947 2231895 2167465
58108 2167465 2106404 2047873 1992088 1939234 1888205 1838347 1790943 1747105 1705821 1665888 1628039
58097 1628039 1593253 1560592 1528762 1498322 1470381 1444480 1419731 1396755 1376590 1358763 1342169
58086 1342169 1326684 1312270 1297687 1281781 1265031 1248283 1231048 1212479 1192913 1173068 1152835
58075 1152835 1132175 1111912 1092305 1072127 1050565 1028704 1007718 987011 965745 944805 925585
58064 925585 908102 891956 877837 866179 855527 844188 832556 821846 811436 799591 786184
58053 786184 772727 760069 747838 735857 724426 713410 702550 692440 683871 676461 669160 661799
58041 661799 654926 648495 641971 635355 628948 622421 615257 607754 600507 593300 585599 577709 570271 562979
58027 562979 554927 545956 536644 527261 517776 508587 500253 492708 485600 479079 473426 468335 463404 458925
58013 458925 455342 452390 449618 447198 445324 443363 440636 437543 434872 432485 429758 426833 424277 421877
57999 421877 418993 415861 413375 411708 410276 409032 408681 409501 410798 411723 411916 411364 410274 409189 408688 408912
57983 408912 409599 410353 410616 409841 408166 406485 405412 404569 403272 401299 398617 395140 391359 388390 386623
57968 386623 385120 383106 381296 380736 381069 381069 380403 379734 379508 379674 380249 381148 381759 381555 380865 380254 379631 378813
57950 378813 378354 378753 379388 379408 379336 380562 383498 387336 391377 395489 399491 403334 407804 413865 421256 428753
57934 428753 435806 442872 450143 457025 462999 467963 471603 473380 473395 472402 470688 467741 463217 457544 451268
57919 451268 444436 436825 428313 418892 408786 398628 389075 380241 371882 364084 357383 352290 348996 347298
57905 347298 346497 345793 345182 345436 346690 347709 347253 345593 343837 342382 341038 340166 340455 341816 343545 345385
57889 345385 347425 349164 349886 349876 350154 350977 351634 351755 351736 351728 351211 349780 347546 344606 340896 336616 332058
57872 332058 327066 321478 316011 311685 308315 304555 299612 294075 288948 284758 281763 280136 279671 279958 280935
57857 280935 282600 284346 285537 286703 289172 293377 298459 303596 308634 313219 316449 317901 318211 318283 318581
57842 318581 319282 320241 320662 319751 317914 316354 315273 313587 310736 307690 305634 304625 304176 304232 304924 306082
57826 306082 307650 309998 313326 317349 321874 326994 332388 337278 341548 346028 351174 356366 361075 365734
57812 365734 370553 374232 374925 372095 366656 359668 351725 343319 334975 326958 319266 311824 304494 297238
57798 297238 290480 284915 280659 277095 273801 271022 268925 267105 265339 264132 263865 263988 263796 263529 263942
57783 263942 265139 266600 268148 270190 273067 276713 280902 285455 290295 295611 301691 308269 314307 318863
57769 318863 321995 324509 327067 329743 332055 333127 332222 329524 326071 322540 318506 313272 306968 300400
57755 300400 294243 288875 284561 281136 277741 273536 268606 263799 259870 257114 255494 254607 253784 252701 251712
57740 251712 251176 250727 249726 248159 246560 245207 243943 242671 241488 240448 239651 239512 240430 242150 243816
57725 243816 244748 244921 244747 244661 244825 244996 244750 244043 243388 243251 243440 243357 242699 241734 241010 240935 241393 241587 240580
57706 240580 238196 235130 232087 229321 227087 225813 225319 224628 223242 222041 222054 222875 223312 223319 224059 225871 227372
57689 227372 227081 225182 223062 221636 220783 220120 219646 219572 220023 221156 223408 227335 233209 240898 250254 261508
57673 261508 275093 291241 310094 332275 359065 391901 431832 479137 532658 588939 642249
57662 642249 685829 713409 720510 705937 672920 628127 578472 528575 481006 437717 400095 368106
57650 368106 340612 316741 296336 279285 265247 254058 245637 239348 234148 229537 225729 222746 220006
57637 220006 217094 214324 212134 210383 208697 207173 206290 206244 206702 207143 207261 207043 206592 205939 205038 203951 202860
57620 202860 201763 200405 198697 196974 195546 194250 192877 191725 191118 190500 188843 186137 183760 182951 183425
57605 183425 183911 183642 182835 182004 181380 180956 180611 180112 179275 178205 177186 176334 175573 174965 174749 174894 174871 174136
57587 174136 172754 171203 169573 167447 164781 162519 161723 162227 162706 162187 160962 159868 159218 158786 158326 157571
57571 157571 156076 153699 151108 149308 148606 148425 148044 147162 145864 144545 143883 144357 145632 146813 147448 147881
57555 147881 148481 148947 148727 147856 146983 146657 146921 147652 148962 151032 153554 155619 156353 155612 153911 151855 149923
57538 149923 148733 148897 150324 152081 153349 154203 155046 155636 155318 154115 152894 152327 152201 151966 151540 151367 151943
57521 151943 153446 155522 157307 157976 157518 156754 156445 156537 156439 155779 154713 153686 153161 153472 154661 156421 158306
57504 158306 160050 161594 162819 163394 163039 161959 160865 160366 160348 160166 159434 158364 157228 155834 153824 151287
57488 151287 148754 146685 145238 144427 144171 144199 144207 144108 143985 143894 143923 144277 144975 145597 145710 145512 145608 146120 146414 145878
57468 145878 144632 143285 142256 141493 140695 139636 138382 137280 136653 136489 136584 136910 137557 138274 138446 137743 136567
57451 136567 135631 135182 134858 134249 133382 132628 132265 132246 132371 132575 132972 133597 134218 134493 134303 133921 133799 134104 134475
57432 134475 134394 133972 134097 135443 137498 139086 139803 140280 140926 141214 140708 140076 140267 141068 141381 140804 140148 140293
57414 140293 141230 142485 143928 145761 147939 149894 150857 150531 149543 149009 149443 150309 150844 150926 150712 149938 148402
57397 148402 146846 146359 146866 147131 146534 145965 146503 147980 149466 150608 151749 153032 154140 154934 155832 157386
57381 157386 159734 162525 165214 167343 168627 168924 168326 167405 167049 167710 168803 169239 168560 167275 166150 165521
57365 165521 165274 165063 164515 163609 162853 162682 162778 162506 161993 162025 162813 163675 164207 164937 166331 167920 169136 170354
57347 170354 172252 174542 176283 177264 178173 179320 180114 180095 179816 180170 181230 182250 182667 182639 182558 182428 182001 181322
57329 181322 180744 180338 179728 178758 177944 177772 177842 177381 176537 176380 177388 178688 179156 178669 177752 176607 175248 174237
57311 174237 174454 176108 178495 180785 182611 183981 185047 186056 187162 188236 189118 190024 191341 193020 194471
57296 194471 195204 195418 195902 197460 200304 203893 207426 210642 214017 218046 222567 227010 231077 234916 238835
57281 238835 243117 247872 252737 256981 260356 263645 267896 273226 278871 284247 289375 294283 298760 302872
57267 302872 307088 311548 315714 319163 322338 326069 330594 335466 340279 345108 350360 356498 363796 371977
57253 371977 380207 387874 395401 403886 413832 424634 435472 446289 457490 469037 480490 491950
57241 491950 504337 518437 534025 550336 567103 584716 603457 622975 642541 661537 679737
57230 679737 697513 715791 735393 756220 777364 798147 818817 840162 862828 887224 913708
57219 913708 942471 973413 1006382 1041387 1078334 1116795 1156303 1196711 1238032 1280166 1323123
57208 1323123 1367228 1412654 1458850 1504834 1549950 1593908 1636155 1675765 1712109 1745248 1775491
57197 1775491 1802898 1827394 1849161 1868727 1886891 1904592 1922557 1940843 1958953 1976561 1993935
57186 1993935 2011499 2029238 2046775 2063898 2080742 2097597 2114812 2132846 2152084 2172531 2193857
57175 2193857 2215748 2238074 2260742 2283743 2307483 2332699 2359781 2388274 2417359 2446753 2476789
57164 2476789 2507618 2538670 2569031 2598058 2625446 2650980 2674579 2696466 2717032 2736500 2754891
57153 2754891 2772156 2788101 2802257 2814150 2823734 2831344 2837223 2841276 2843304 2843327 2841760 2839485 2837509
57140 2837509 2836220 2834962 2832832 2829934 2827505 2826726 2827785 2830217 2833673 2838078 2843359 2849434 2856390 2864469
57126 2864469 2874010 2885469 2899262 2915419 2933553 2953278 2974413 2996664 3019356 3041684 3063071
57115 3063071 3083278 3102678 3122876 3146879 3178258 3219904 3273447 3339444 3417873 3508805 3613234
57104 3613234 3733688 3874323 4040739 4239829 4479481 4767957 5113121 5521797 5999335
57095 5999335 6549504 7174943 7877820 8660160 9523685 10469427 11497207 12604919 13787044
57086 13787044 15030557 16307125 17566432 18740530 19763127 20592272 21218632 21654997
57078 21654997 21920651 22034331 22014176 21875375 21624692 21259524 20774271 20167605 19444713
57069 19444713 18615878 17695265 16700435 15651490 14570153 13479149 12400842 11354870
57061 11354870 10356640 9417760 8546881 7749485 7027428 6379459 5802224 5290863 4839575
57052 4839575 4442506 4094155 3788938 3520951 3284609 3075190 2888413 2719927 2565699
57043 2565699 2422632 2288434 2161126 2039111 1921480 1807925 1698472 1593681 1494982 1404418
57033 1404418 1323835 1254212 1195521 1147210 1109218 1082848 1070455 1073761 1091834 1119921 1149580
57022 1149580 1170306 1172596 1151237 1106868 1044949 973213 899076 827754 761603 700966 645716
57011 645716 595987 551819 512909 479025 450127 425761 404795 386228 369924 356167 344736
57000 344736 334821 325687 317078 309072 301787 295061 288309 280976 273369 266699 261871 258434 255132 251389
56986 251389 247953 246214 247178 250938 256641 262805 267872 270605 270098 265786 257814 247276 235749 224478
56972 224478 214071 204811 196927 190492 185277 180919 177308 174802 173979 175168 178386 183828 192120 203775
56958 203775 218515 235494 254005 273353 291887 306807 315447 316696 311202 300645 287047 272273
56946 272273 257586 243592 230671 219262 209720 202221 196983 194192 193623 194843 198074 204393 214701
56933 214701 228882 246342 266867 290221 315037 338626 357826 369795 372496 365332 349626 328104
56921 328104 303666 278593 254506 232409 212619 194998 179360 165561 153396 142758 133786 126533
56909 126533 120608 115521 111276 108176 106078 104300 102357 100370 98731 97742 97704 98844 100879 102979 104596
56894 104596 106243 109162 114225 121301 129722 139140 149823 162178 176215 191519 207498 223234 237127
56881 237127 247189 252150 252215 248599 242533 234937 226801 219336 213562 209894 208172 207981 209098 211836 216923
56866 216923 224893 235684 249043 265286 285389 310292 340161 374200 410826 447732 481729 508741
56854 508741 524656 527098 516865 497447 472927 446456 420516 397571 379490 366501 357529 351737
56842 351737 349450 351671 359287 372786 392282 417641 448995 487233 533545 588025 648562 710712
56830 710712 768117 813323 839507 842895 824271 788323 741488 689885 638182 589344 544957 505836
56818 505836 472474 445170 424081 409341 401050 399102 403212 413237 429418 452264 482286 519642
56806 519642 563416 610614 655801 692171 713683 716966 702091 672142 631946 586544 540022 495218
56794 495218 454089 418005 387551 362325 341452 324536 312008 304405 301567 302879 308191 318085
56782 318085 333112 352962 376406 401562 425878 446086 458681 460969 452074 433349 407863 379127
56770 379127 349928 322043 296533 273731 253075 233732 215788 200351 188113 178242 169190 160308
56758 160308 152083 144982 138751 132965 127770 123766 121278 119891 118640 116726 114149 111570 109565 108176
56744 108176 107237 106708 106420 105826 104450 102474 100537 99106 98292 98077 98310 98627 98787 99015 99656 100593 101335
56727 101335 101624 101566 101287 100860 100484 100290 100049 99498 98941 99034 99968 101317 102732 104334 106276 108397 110480
56710 110480 112514 114430 115880 116560 116564 116298 116161 116397 117059 117937 118644 118895 118777 118757 119313 120346 120974 120296
56692 120296 118563 117189 117256 118410 119588 120316 120689 120513 119460 117963 117034 116985 117108 116864 116655 117088 118121
56675 118121 119381 120776 122293 123585 124220 124126 123500 122562 121722 121590 122341 123256 123361 122483 121427 121132 121976
56658 121976 123808 126322 129163 131779 133463 133835 133307 132805 132838 133129 133333 133777 134996 136838 138620 140096
56642 140096 141687 143724 145998 148106 149698 150395 150069 149298 148943 149149 149365 149482 150173 151777 153555 154557
56626 154557 154681 154442 154179 153990 153976 154046 153795 153093 152478 152518 153051 153425 153123 151851 149440 146217 143165 141132
56608 141132 140073 139452 139078 139058 139260 139435 139641 139997 140231 140061 139788 139821 139777 138848 137117 135728 135486 135952 136215
56589 136215 136053 135927 136190 136764 137416 138038 138687 139561 140876 142627 144500 146096 147202 147867 148375 149132 150370
56572 150370 151858 153090 153932 154918 156685 159173 161730 164092 166964 171260 176888 182791 188317 194123 201386
56557 201386 210445 220603 230893 240462 248399 254038 257616 260089 262063 263391 264029 264608 265700 266895
56543 266895 267152 265887 263334 260074 256568 253081 249778 246869 244645 243145 241750 239570 236392 232863
56529 232863 229537 226214 222555 218877 215809 213454 211400 209336 207178 204761 201918 198818 195869 193318
56515 193318 191239 189734 188718 187626 185788 183213 180707 179146 178730 178921 178974 178630 178360 178769 179760 180546
56499 180546 180527 179834 178862 177804 176891 176579 177024 177716 178067 178041 177820 177215 176010 174592 173648 173348 173353 173518 174048
56480 174048 174958 175872 176406 176472 176244 176052 176125 176270 176044 175504 175377 176134 177372 178578 180015 182116 184451 186177
56462 186177 187270 188361 189427 189699 189004 188203 187959 187938 187768 188019 189494 191944 194229 195579 196142 196323 196115
56445 196115 195299 194072 193165 193287 194508 196248 197858 199076 199988 200818 201831 203156 204470 205163 205047 204652
56429 204652 204547 204631 204418 203766 202983 202449 202490 203306 204589 205456 205309 204553 204001 203797 203560 203358 203778 204986 206362
56410 206362 207259 207622 207759 207921 208280 208942 209804 210655 211375 211891 212031 211810 211697 212232 213421 214802 215963 216699
56392 216699 216966 217070 217620 218835 220215 221416 222964 225368 227910 229302 229389 229203 229433 229840 230259 231106 232537
56375 232537 233993 234982 235633 236208 236796 237755 239594 242001 243775 244299 244422 245266 246705 247684 247692 247261 247182 247737
56357 247737 248654 249536 250343 251509 253418 255748 257686 258808 259376 259827 260447 261597 263601 266192 268634 270602
56341 270602 272422 274224 275516 275999 276343 277632 280273 283720 287069 289751 291922 294323 297454 300828 303441
56326 303441 305041 306488 308757 312008 315735 319337 322426 325024 327562 330215 332333 333126 332896 332859 333644
56311 333644 334773 335743 336785 338226 339906 341624 343481 345450 347327 349408 352468 356627 361071 365313
56297 365313 369876 375139 380344 384589 388162 392133 397081 402890 409257 415596 420925 424784 428148 432722
56283 432722 439389 447743 456903 466265 475615 485005 494540 504239 514336 525683 539227 554939 571859
56270 571859 589405 607915 627695 648540 670678 695144 722422 751624 782002 814590 851320
56259 851320 892981 939102 989507 1045014 1106765 1175711 1252709 1338466 1433534 1538778 1655445
56248 1655445 1784202 1924576 2075896 2238144 2410997 2592516 2779730 2970060 3161163
56239 3161163 3349654 3531018 3700624 3853864 3985576 4090668 4165744 4209515 4221667 4202200
56229 4202200 4151940 4072950 3968192 3841322 3696781 3539334 3373220 3201981 3028823 2856482
56219 2856482 2686898 2521718 2362987 2212578 2071008 1937653 1812250 1695525 1588271
56210 1588271 1490590 1402205 1322779 1251548 1187218 1128649 1075351 1027043 983059 942551 905204
56199 905204 871510 842162 817059 795040 774803 756013 739043 723760 709380 695632 683155
56188 683155 672243 662101 652087 642832 635207 628852 622820 617161 612713 609534 606720 603685 600644
56175 600644 597824 595108 592586 590677 589629 589484 590431 592499 595060 597394 599708 602873 607255 612501 618402
56160 618402 625129 632642 640644 649174 658572 668806 679454 690432 702260 715561 730720 747886
56148 747886 766948 787807 811073 838043 869508 905146 944851 990051 1042791 1103914 1173050
56137 1173050 1249823 1333831 1423466 1515731 1607039 1693538 1771399 1838359 1895134 1944413 1988581
56126 1988581 2029098 2067268 2103801 2137471 2165509 2185641 2196956 2199223 2192798 2179183 2160149 2135801
56114 2135801 2104388 2063969 2013260 1951230 1877715 1795018 1707679 1620135 1535343 1455486 1382565
56103 1382565 1317781 1261401 1213585 1174372 1142769 1117050 1096242 1080259 1068495 1059547 1052627 1047932
56091 1047932 1045263 1043478 1041771 1040416 1039881 1040318 1042123 1045739 1050483 1054766 1057955 1060945 1064640 1069117
56077 1069117 1074625 1081933 1091005 1100564 1109740 1119101 1129409 1140397 1151426 1162515 1174030 1186094
56065 1186094 1198727 1211904 1225327 1238931 1253577 1270122 1287768 1304618 1320095 1335502 1351935
56054 1351935 1369000 1385871 1402330 1418390 1434182 1450526 1468343 1487264 1506199 1525376 1546257
56043 1546257 1569360 1593999 1620478 1650576 1685253 1723578 1764386 1807060 1850125 1891250 1929787
56032 1929787 1967548 2006284 2046108 2087194 2130853 2177676 2226374 2275685 2325917 2377561 2430142
56021 2430142 2483544 2538799 2596477 2655949 2717219 2781706 2850062 2921005 2993464 3068165 3146001
56010 3146001 3226718 3310374 3398217 3490911 3587661 3688172 3793490 3903898 4018308 4136998
56000 4136998 4262639 4397098 4539461 4688655 4845721 5011949 5187178 5371661 5567239
55991 5567239 5775030 5994292 6225221 6470501 6732647 7012574 7312265 7635647 7985028
55982 7985028 8360110 8762648 9198592 9673354 10188774 10747517 11356601 12023543 12753097
55973 12753097 13551611 14431239 15406576 16491316 17702531 19064982 20608055 22363516
55965 22363516 24371613 26685882 29367608 32479689 36090025 40275598 45118970 50709241
55957 50709241 57156694 64605096 73228239 83229276 94863142 108464135 124449334
55950 124449334 143302181 165546600 191666695 221887559 255784270 291811448 326993088
55943 326993088 357111884 377631695 385156280 378705724 360018897 332697362 300795815
55936 300795815 267699886 235690198 206034993 179278870 155532604 134698809 116600643
55929 116600643 101018846 87696113 76357004 66733645 58574272 51645086 45741535
55922 45741535 40697167 36375814 32659609 29448589 26663605 24240121 22120413 20254933
55914 20254933 18605671 17141986 15835442 14661919 13604461 12649340 11781941 10989612
55906 10989612 10264929 9602327 8994292 8433945 7918163 7444652 7008553 6605012 6232448
55897 6232448 5890197 5575239 5284033 5015219 4767827 4539122 4326807 4131022 3951585
55888 3951585 3785485 3629663 3484187 3350225 3227054 3113434 3009638 2915260 2826762 2739867
55878 2739867 2652969 2566134 2478785 2390886 2304677 2222575 2144542 2069544 1997930 1930156 1864918
55867 1864918 1801083 1740085 1683934 1632174 1583167 1537097 1495219 1457311 1422461 1391425 1365603
55856 1365603 1344295 1325263 1307526 1291453 1276696 1262209 1247896 1234169 1220118 1203996 1185289
55845 1185289 1164728 1142646 1118971 1094481 1070469 1047291 1024580 1002527 981708 962056 943143
55834 943143 924907 907049 888481 868696 848867 830313 812784 795698 780100 767569 757744 748618
55822 748618 738791 727978 715890 702351 688222 674685 661850 649248 637121 625888 614968 603636
55810 603636 592470 582492 573483 564783 557096 551728 548417 545694 543158 541725 541907 543494 546681 551739
55796 551739 557678 562866 566901 570305 572658 572843 571060 568757 566431 563217 558780 553831 548611 542586
55782 542586 535919 529350 522198 512355 499016 483758 468212 452341 435992 420545 407674 397514
55770 397514 389189 382272 376699 372023 367838 364407 362029 360269 358587 357186 356429 355773 354102 350975 347015
55755 347015 343142 339756 336575 333035 328988 324997 321640 318617 315049 310635 305949 301547 297413 293411
55741 293411 289639 286063 282351 278253 273776 268957 263946 259264 255341 251873 248351 245166 243271 242625
55727 242625 241936 240274 238024 235786 233279 230015 226418 223454 221478 220067 218757 217464 216273 215162
55713 215162 213874 211961 209164 205848 202807 200562 199154 198541 198770 199660 200797 201932 202946 203416 202778
55698 202778 201017 198675 196054 193049 189922 187449 185880 184357 182017 179257 177332 176808 176993 176871 176236
55683 176236 175780 176244 177636 179356 181042 183017 185696 188825 191624 193539 194524 194755 194505 194168 193915 193435
55667 193435 192407 191107 190076 189365 188702 188231 188374 189010 189531 189800 190374 191634 193372 195330 197408 199136
55651 199136 199741 199220 198765 199653 202049 205211 208323 210734 211843 211352 209628 207495 205594 203890 201622
55636 201622 197858 192480 186505 181085 176354 171751 167185 163074 159321 155331 151254 148237 146909 146355
55622 146355 145190 143100 140825 139155 138450 138672 139262 139276 138151 136198 134135 132411 131202 130577 130321 130007
55606 130007 129537 129213 128978 128178 126510 124686 123556 123019 122394 121494 120677 120067 119396 118561 117779 117190 116756 116509
55588 116509 116521 116611 116447 116001 115652 115842 116722 118070 119405 120382 121171 122263 123803 125387 126695 128005 129882
55571 129882 132659 136460 141332 146993 152738 157994 162680 166750 169742 171230 171432 170817 169324 166547 162541
55556 162541 157899 152985 147722 142208 137020 132603 128769 125182 122120 120367 120254 121095 121693 121303 119980
55541 119980 118138 116067 113985 112244 111219 111103 111938 113589 115445 116492 116221 115238 114438 113746 112374 110278
55525 110278 108506 107839 107841 107633 107005 106294 105683 105129 104612 103947 102689 100684 98544 97173 96946 97550 98315 98521
55507 98521 97766 96386 95200 94609 94236 93651 92936 92262 91511 90709 90246 90183 89900 89008 88037 87555 87182 86284 85179
55488 85179 84716 84978 85403 85968 87169 88831 89962 90044 89569 89110 88667 88227 88126 88422 88588 88301 87980 88096
55470 88096 88447 88629 88760 89126 89368 88644 86644 84081 82134 81510 81950 82557 82720 82770 83469 84826 85831 85551
55452 85551 84208 82890 82492 83179 84580 86051 86954 87096 86917 86871 86673 85548 83356 81070 79886 80057 80820
55435 80820 81366 81542 81666 81950 82346 82736 83041 83225 83391 83857 84845 86087 86962 87128 86847 86579 86530 86766 87480
55416 87480 88787 90288 91147 90745 89260 87611 86763 86909 87272 86875 85546 84023 83076 82835 83057 83584 84259
55399 84259 84759 84906 84973 85335 85974 86627 87161 87469 87263 86513 85914 86346 87828 89495 90631 91283 91810 92339
55381 92339 92844 93326 93689 93728 93418 92946 92313 91258 89768 88360 87562 87260 86830 85830 84462 83411 83265
55364 83265 83939 84641 84559 83660 82668 82259 82537 83276 84308 85502 86614 87429 87965 88402 88871 89364 89747 89777 89303
55345 89303 88447 87459 86428 85418 84886 85486 87242 89185 90142 89713 88316 86576 85020 84136 84210 84959 85635
55328 85635 85663 85081 84373 83985 84043 84357 84634 84706 84598 84361 83986 83550 83324 83528 83961 84077 83467 82266 81039
55309 81039 80355 80445 81146 82098 82964 83465 83329 82419 81013 79736 79023 78743 78568 78572 79090 79941 80250 79369 77706
55290 77706 76333 75874 76148 76826 77946 79561 81243 82372 82859 83265 84122 85282 86053 85930 85125 84373 84271
55273 84271 84852 85769 86742 87717 88734 89829 90992 91986 92286 91600 90446 89778 89905 90206 90176 90220 90971 92281
55255 92281 93480 94320 94925 95066 94288 92856 91752 91508 91658 91622 91499 91600 91711 91351 90450 89374 88446 87775
55237 87775 87329 86973 86582 86292 86420 86999 87704 88279 88693 88787 88316 87549 87269 87839 88704 89165 89144 88884 88462 88061
55217 88061 88094 88484 88425 87548 86791 87265 88741 90148 91192 92393 93713 94322 93842 92811 91730 90576 89511
55200 89511 89110 89468 89878 89912 90127 91166 92697 93832 94163 93821 92911 91464 89791 88381 87490 87077 87043 87283
55182 87283 87671 88168 88803 89449 89864 90066 90371 90903 91391 91659 91989 92691 93599 94276 94546 94512 94172 93333 91932
55163 91932 90319 89206 89238 90452 92146 93544 94516 95393 96205 96623 96677 96912 97529 97899 97406 96431 96014 96646
55145 96646 97744 98302 97802 96593 95566 95387 95914 96435 96467 96082 95443 94450 93093 91837 91328 91808 92981
55128 92981 94336 95464 96285 97076 98060 98888 98851 97808 96559 96050 96390 96920 97031 96668 96212 96059 96233 96358
55110 96358 96157 95953 96310 97218 98066 98557 99019 99632 99913 99396 98344 97376 96831 96914 97951 99914 102056 103614
55092 103614 104547 105097 105070 104303 103432 103305 103789 104050 104000 104503 105942 107505 108272 108334 108379 108678 108991 109136 109230 109564
55072 109564 110459 111992 113662 114578 114268 113060 111579 110176 109029 108357 108179 108135 107928 107733 107857 108192 108389
55055 108389 108393 108438 108586 108694 108815 109159 109499 109011 107089 104164 101410 99605 98534 97568 96604 96200 96832 98297
55037 98297 99923 101167 101839 101933 101585 101190 101239 101826 102453 102544 102089 101676 101880 102741 103813 104586 104796 104491 103955
55018 103955 103577 103606 103916 104078 103799 103269 102922 102882 102871 102686 102532 102712 103170 103592 103861 104151 104568 104956 105172 105351
54998 105351 105737 106379 107109 107767 108248 108385 108003 107246 106709 106990 108113 109556 110873 112055 113186 114004 114117
54981 114117 113552 112796 112285 112101 112184 112560 113204 113890 114308 114315 114056 113903 114173 114694 114788 113996 112851 112514 113510 115134
54961 115134 116272 116495 116179 115836 115668 115624 115592 115555 115680 116178 117044 118111 119311 120572 121457 121364 120276 118907
54943 118907 117852 117062 116470 116548 117595 118910 119453 119239 119284 120135 121142 121409 120898 120256 119975 120086 120473 121169
54925 121169 122415 124500 127356 130306 132529 133989 135643 138507 142664 147366 151939 156303 160691 165120
54911 165120 169244 172568 174659 175203 173992 170969 166328 160605 154646 149366 145241 141892 138373 134257
54897 134257 130336 127817 126826 126217 125033 123598 122749 122558 122434 122213 122357 123097 124072 125009 126212 128009 130053
54880 130053 131537 132042 132036 132635 134880 139045 144429 149863 154528 158425 162185 166406 170905 174533 175963
54865 175963 174890 172303 169382 166371 162710 158004 152536 147077 142516 139417 137505 135790 133607 131342
54851 131342 129753 128886 128156 127178 125861 123925 121135 117997 115411 113617 112205 111192 111145 112087 113173 113813
54835 113813 114283 114829 115054 114796 114786 115622 116660 116768 115794 114508 113403 112410 111565 111110 110923 110541 109864 109270
54817 109270 109023 109050 109324 109912 110546 110647 109995 109041 108433 108446 108936 109578 110128 110652 111444 112560 113633 114485 115607
54798 115607 117532 119814 121239 121120 119885 118401 117208 116488 116174 115839 115007 113891 113366 113897 114929 115731
54782 115731 116428 117684 119657 121760 123370 124304 124685 124775 124980 125637 126750 128183 130068 132649 135713 138623
54766 138623 141125 143808 147487 152367 158026 164014 170115 176100 181580 186226 189893 192375 193134 191517
54752 191517 187341 181297 174719 168839 164105 160137 156365 152653 149288 146466 144021 141685 139396 137184
54738 137184 134907 132406 129937 128168 127564 127821 128163 128183 128264 129068 130749 132843 134908 136985 139325 141875
54722 141875 144327 146642 149259 152665 156959 161871 166905 171349 174425 175847 176103 175867 175138 173290 170067
54707 170067 166177 162618 159620 156528 152785 148767 145482 143524 142516 141624 140412 138992 137454 135556
54693 135556 133146 130590 128487 127072 126129 125458 125129 125270 125801 126451 126898 126916 126526 126000 125519 124847 123540
54676 123540 121552 119448 117925 117206 116903 116378 115246 113677 112263 111471 111144 110663 109607 108204 107162 107133
54660 107133 108283 110171 112032 113345 114164 114866 115612 116169 116197 115589 114587 113678 113321 113567 114089 114681 115532
54643 115532 116800 118163 119238 120221 121625 123398 124798 125241 124791 123787 122502 121388 121051 121562 122103 121781
54627 121781 120620 119502 119254 120004 121223 122156 122356 122076 121999 122452 123013 123055 122446 121548 120749 120249 120180 120627 121542
54608 121542 122734 123915 124747 125019 124818 124334 123565 122518 121641 121528 122077 122504 122434 122385 122782 123118 122723 121888
54590 121888 121459 121567 121578 121221 120988 121244 121618 121567 121123 120786 120933 121556 122346 122868 122763 121924 120532 119005 118000
54571 118000 118084 119105 120061 120033 119148 118318 118178 118732 119812 121250 122588 123311 123570 124083 125051 125733 125445 124557
54553 124557 124046 124439 125602 127224 128983 130362 130933 130900 130945 131416 131969 132162 132160 132553 133580 134774 135466 135490
54535 135490 135259 135239 135612 136458 137887 139700 141165 141616 141259 140965 141139 141175 140239 138238 135765 133385 131332
54518 131332 129749 128829 128631 128951 129452 129839 130027 130218 130675 131242 131317 130580 129625 129465 130414 131806 132832 133267
54500 133267 133229 132664 131484 129987 128709 127884 127345 126912 126567 126253 125882 125612 125792 126457 127198 127756 128466 129733
54482 129733 131287 132339 132418 131760 130959 130559 130939 132128 133638 134782 135333 135633 136026 136527 137095 137814 138563
54465 138563 138926 138708 138335 138393 138967 139687 140272 140761 141325 142121 143220 144425 145274 145453 145096 144489 143630 142385
54447 142385 140885 139444 138177 137023 136048 135341 134696 133857 133101 133130 134145 135349 135691 134961 133959 133646 134277
54430 134277 135306 136006 136111 135915 135800 135798 135694 135417 135209 135462 136505 138413 140821 142978 144268 144723 144856
54413 144856 144961 144808 144133 143250 142866 143242 143743 143427 142090 140508 139546 139281 139276 139508 140447 142179 143997 145181
54395 145181 145858 146719 148102 149685 150902 151354 150979 150154 149522 149446 149697 149888 150034 150449 151198 151962 152367 152262
54377 152262 151809 151424 151449 151709 151688 151280 150993 151143 151354 151294 151380 152087 152930 152980 152215 151542 151539 151993 152716 153890 155312
54356 155312 156069 155498 154074 152988 153102 154420 156185 157384 157615 157646 158629 160627 162476 163309 163652 164683
54340 164683 166954 170268 174283 178673 182965 186768 190115 193289 196431 199471 202136 203842 203917 202282 199598
54325 199598 196463 192853 188687 184543 181218 178734 176355 173553 170554 167976 166290 165609 165547 165194 163613
54310 163613 160661 157226 154531 153176 152798 152523 151700 150294 148684 147262 146320 146097 146645 147590 148305 148381 147809
54293 147809 146721 145307 144009 143426 143754 144509 145014 145101 145276 146272 148382 151026 153065 153830 153777 153835 154183 154176
54275 154176 153428 152372 151571 151042 150588 150324 150464 150980 151829 153197 155160 157291 158965 159890 160194 160169 160127 160235
54257 160235 160361 160270 160032 159948 160092 160412 161217 162848 164734 165619 165139 164390 164358 164547 163906 162441 161025 160033
54239 160033 159172 158433 158211 158423 158352 157538 156246 154972 154007 153542 153675 154209 154743 154995 154755 153777 152137 150499
54221 150499 149508 149068 148738 148613 149123 150116 150870 151085 151210 151705 152558 153553 154387 154488 153448 151845 151002 151607
54203 151607 153052 154386 155371 156352 157550 158863 159972 160387 159779 158600 158021 158908 160981 163142 164365 164164
54187 164164 162653 160496 158627 157635 157431 157471 157162 156067 154142 151874 149967 148751 148130 148048 148557 149351 149791
54170 149791 149660 149499 149847 150522 151010 151233 151494 151812 151820 151324 150647 150265 150273 150339 150126 149674 149308 149239 149402 149719 150212
54149 150212 150732 150865 150415 149707 149072 148307 147146 146026 145699 146146 146565 146525 146456 146792 147307 147650 147973 148607 149512
54130 149512 150400 151079 151404 151267 150924 150956 151553 152216 152462 152398 152292 152057 151672 151641 152386 153476 154211 154837 156357
54111 156357 158958 161315 161915 160749 159299 158940 159656 160407 160464 160120 160055 160341 160458 160124 159641 159336 159096 158717
54093 158717 158323 158169 158248 158402 158596 158832 159006 159104 159335 159857 160566 161401 162545 164042 165467 166301 166421 165978
54075 165978 165074 163983 163405 163938 165323 166619 167160 166981 166441 165814 165299 165056 165106 165394 165932 166675 167389 167916
54057 167916 168448 169248 170255 171352 172844 175122 177810 179865 180694 180807 181146 182203 184032 186707 190306
54042 190306 194643 199403 204516 210122 216194 222475 228886 235814 243890 253495 264483 276330 288513
54029 288513 300687 312501 323272 331969 337544 339369 337521 332813 326506 319724 312978 306265 299586
54016 299586 293265 287662 282739 278059 273250 268349 263635 259148 254531 249388 243746 238121 233206 229524
54002 229524 227125 225433 223449 220554 217182 214421 212811 211741 210194 207826 205055 202294 199525 196683
53988 196683 194145 192603 192419 193162 193881 193918 193407 192916 192715 192664 192629 192648 192660 192538 192530 193123 194169 194663 193863 192277
53968 192277 190962 190149 189272 188200 187624 188009 188840 189234 188925 188317 187864 187702 187691 187648 187628 188073 189439 191624
53950 191624 194052 196340 198489 200342 201463 201965 202950 205484 209340 213346 216871 220337 224248 228380 232269
53935 232269 236033 240259 245288 250908 256592 261714 265716 268416 270172 271452 272363 272846 273230 274161 275905
53920 275905 278139 280560 283297 286509 289929 293186 296304 299525 302885 306382 310389 315260 320547 325190
53906 325190 328690 331594 334563 337423 339595 341073 342443 344022 345537 346728 347845 349318 351185 353075
53892 353075 354627 355677 355995 355085 352467 348250 343242 338374 334030 330093 326582 323970 322781 323084 324579
53877 324579 327170 331176 336924 344178 352027 359384 365437 369408 369975 365504 355421 341214 325620 310730
53863 310730 297160 284802 273690 263911 255342 247909 241765 236847 232578 228377 224256 220526 217227
53850 217227 214212 211576 209510 207856 206271 204712 203363 202111 200593 198827 197368 196712 196782 197128 197416
53835 197416 197639 198039 198857 199976 200778 200567 199237 197438 196062 195613 195987 196706 197316 197621 197502 196753 195426
53818 195426 194340 194640 196543 198943 200669 201726 202764 203821 204407 204690 205637 207793 210622 213343 215793
53803 215793 218173 220558 223063 225978 229266 232333 234783 237053 239752 242659 245050 246943 249249 252490
53789 252490 255938 258430 259695 260404 261131 261820 262370 263145 264455 265743 265856 264260 261636 259112 257181 255610
53773 255610 254077 252510 250881 249045 246867 244334 241538 238630 235683 232516 228853 224867 221308 218707
53759 218707 216669 214400 211868 209902 209093 209072 209012 208450 207393 206027 204625 203497 202736 202122 201458 200891 200751
53742 200751 201196 202112 203204 204135 204734 205178 205768 206472 206939 207075 207331 208169 209464 210686 211516 212026 212376 212698
53724 212698 213261 214408 216171 218156 220014 221857 223964 226153 227850 228934 230150 232242 234838 236810
53710 236810 237771 238632 240360 242760 245002 246941 249243 252329 255892 259467 262876 266006 268676 270940 273130
53695 273130 275371 277414 279130 280810 282619 284066 284409 283605 282615 282585 283695 284890 284958 283875 282806 282685
53679 282685 283253 283752 283974 284064 283817 283080 282507 282807 283269 282227 279382 276514 275307 275374 275236 274473 273934 274253
53661 274253 275203 276417 277856 279437 280806 281661 281943 281601 280529 278883 277235 276286 276392 277249 278068 278273
53645 278273 278066 278032 278234 278231 278070 278574 280268 282574 284557 285956 286957 287481 287377 286995 286843 286880 286828 286933 287717
53626 287717 289087 290460 291738 293421 295671 297965 299877 301638 303680 306150 308994 312118 315269 318246
53612 318246 321350 325198 329916 334933 339794 344698 349938 355195 359802 363493 366557 369349 371924 374169
53598 374169 376100 377970 380065 382401 384730 386879 388861 390476 391152 390561 389171 387756 386491 385061 383566
53583 383566 382712 382986 384191 385898 387843 389748 391291 392561 394019 395772 397399 398797 400596 403114 405356
53568 405356 405815 404125 401280 398203 394765 390405 385216 380031 375659 372398 370205 368986 368551 368498 368422 368281
53552 368281 368329 368634 368944 369194 369843 371279 373108 374524 375373 376315 377854 379798 381925 384628 388437 393216
53536 393216 398348 403463 408574 413665 418683 423931 430038 437450 446221 456250 467353 479070 490784
53523 490784 502247 513763 525802 538655 552520 567548 583578 600140 617057 634910 654493
53512 654493 675790 697853 719885 742213 765929 791633 818696 845739 871664 896213 919789
53501 919789 942989 966294 989989 1014131 1038446 1062292 1084943 1106116 1126241 1146089 1166098
53490 1166098 1186108 1205740 1224886 1243828 1263044 1282858 1303106 1323073 1341964 1359595 1376490
53479 1376490 1393299 1410294 1427399 1444322 1460463 1475015 1487465 1497787 1505897 1511248 1513315 1512332
53467 1512332 1509135 1504355 1498052 1490020 1480055 1468045 1454137 1438820 1422570 1405571 1388068 1370691
53455 1370691 1353823 1336798 1318390 1298155 1276748 1254886 1232717 1210364 1188382 1167268 1147057
53444 1147057 1127783 1109854 1093490 1078273 1063816 1050564 1039398 1030631 1023909 1018925 1015651 1013818
53432 1013818 1012676 1011517 1010268 1009528 1010146 1012686 1017128 1023034 1030042 1038133 1047468 1058195 1070516 1084591
53418 1084591 1100211 1116873 1134395 1153138 1173381 1194871 1217353 1241172 1266855 1294385 1323430
53407 1323430 1354093 1386806 1421545 1457761 1495141 1533879 1574105 1615654 1658669 1703881 1751813
53396 1751813 1802015 1853523 1905966 1959841 2015690 2073262 2131583 2189734 2247431 2304821 2361862
53385 2361862 2418075 2472952 2526220 2577431 2625645 2670064 2710968 2749379 2785610 2818645 2847219
53374 2847219 2870996 2890217 2904645 2913635 2917246 2916526 2912311 2904077 2890255 2869418 2840893 2804665
53362 2804665 2761412 2712746 2660848 2607420 2553101 2498017 2442492 2386914 2331297 2275622 2220545
53351 2220545 2167137 2115810 2066087 2017624 1970868 1926264 1883322 1841019 1798855 1756996 1715660
53340 1715660 1675093 1636063 1599676 1566457 1536026 1507736 1481210 1456213 1432635 1410944 1392104
53329 1392104 1376578 1363587 1351753 1340269 1329081 1318074 1306601 1293941 1279957 1265184 1250404
53318 1250404 1236252 1223183 1211618 1201874 1193771 1186498 1179290 1172391 1167056 1164349 1164084 1165128 1166569
53305 1166569 1168310 1170732 1174205 1179031 1185532 1193917 1204175 1216245 1230315 1246795 1265899 1287258
53293 1287258 1310069 1333791 1358665 1385376 1414064 1443776 1473034 1500909 1527450 1553021 1577374
53282 1577374 1599533 1618685 1635088 1649799 1663416 1675283 1684220 1689806 1692537 1692810 1690353 1684761 1676028
53269 1676028 1664164 1648873 1630232 1609389 1587796 1565723 1542128 1516163 1488291 1459760 1431427
53258 1431427 1403369 1375198 1346336 1316290 1285122 1253554 1222333 1191646 1161513 1132494 1105400
53247 1105400 1080145 1055450 1030055 1003966 978176 953308 928973 904539 880146 856730 835193
53236 835193 815823 798424 782678 768277 754928 742537 731253 721132 711828 702918 694478 686901
53224 686901 680013 672738 664055 654059 643631 633159 622119 610005 597122 584118 571115 557819
53212 557819 544311 531226 519056 507717 496952 486758 477164 467885 458653 449722 441688 434698 428133
53199 428133 421127 413180 404315 394953 385788 377396 369748 362347 355080 348586 343339 338726 333635 327887
53185 327887 322380 317659 313149 308232 303483 300076 298282 297258 296237 295206 294342 293486 292509 291680 291287
53170 291287 291166 290989 290713 290385 289701 288271 286346 284826 284375 284704 284856 284073 282304 280049 277932 276384
53154 276384 275481 274871 273916 272180 269859 267615 265878 264437 262863 261083 259310 257617 256008 254801 254422
53139 254422 254719 254927 254506 253636 252746 251999 251509 251551 252135 252713 252770 252469 252248 252050 251513 250739 250285 250426 250942
53120 250942 251624 252413 253008 252895 251985 250821 249946 249436 249156 249052 248958 248537 247654 246577 245563 244602 243736 243298
53102 243298 243456 243775 243558 242543 241063 239720 239072 239358 240229 240916 240976 240721 240730 241115 241529 241690 241540 241024 240176
53083 240176 239415 239386 240358 241964 243623 245021 246170 247154 247944 248376 248290 247791 247372 247638 248808 250436 251655
53066 251655 251729 250547 248693 246997 245935 245470 245353 245406 245473 245381 245167 245211 245884 247093 248270 248794 248379 247206
53048 247206 245899 245260 245739 247012 248214 248711 248624 248577 248915 249304 249169 248449 247644 247051 246258 244705 242521 240423
53030 240423 238867 237787 237135 237108 237633 238147 238208 238042 238139 238639 239351 240083 240619 240651 240105 239356 238803 238441 238137
53011 238137 238015 238127 238072 237522 236977 237358 238792 240342 241106 241177 241252 241697 242283 242681 242877 243046 243162 242979 242523
52992 242523 242430 243345 244907 245859 245542 244868 245246 246858 248619 249730 250493 251454 252470 252979 252807 252307 251931
52975 251931 251981 252637 253931 255636 257325 258612 259495 260512 262283 264680 266700 267562 267745 268429 270001 271715
52959 271715 272878 273748 274888 276136 276622 275593 272956 269255 265443 262484 260761 259793 258694 256935 254705
52944 254705 252617 251129 250183 249364 248465 247787 247719 248210 248883 249560 250255 250729 250550 249706 248772 248232 247936 247405
52926 247405 246449 245286 244232 243465 242971 242668 242663 243299 244721 246462 247753 248230 248023 247331 246385 245786 246174 247390
52908 247390 248520 249024 249330 250019 250917 251465 251551 251490 251425 251146 250399 249117 247552 246363 246258 247175 248076 247840
52890 247840 246220 243788 241338 239608 239162 239990 241389 242606 243465 244115 244460 244276 243655 242917 242198 241513 241115
52873 241115 241410 242547 244292 246253 248023 249340 250303 251245 252195 252825 253149 253861 255546 257894 260145 262030
52857 262030 263731 265156 265836 265441 263959 261536 258551 255688 253416 251534 249637 247812 246370 245134 243596
52842 243596 241554 239062 235988 232389 229109 227154 226474 226175 225859 225856 226071 225686 224385 222968 222261 222138 222173
52825 222173 222552 223657 225229 226599 227432 227764 227633 227195 226911 227113 227529 227607 227143 226353 225636 225567 226722 229075
52807 229075 231844 234276 236338 238288 239964 240950 241107 240405 238621 235856 233120 231616 231357 231121 229920
52792 229920 227994 226239 225123 224402 223576 222414 221246 220809 221570 223069 224172 224105 223118 222103 221735 222041
52776 222041 222585 222947 223096 223359 223980 224803 225465 225801 225880 225772 225499 225126 224688 224035 222968 221572 220278 219628
52758 219628 219987 221266 222792 223700 223726 223426 223355 223294 222733 221866 221500 221923 222504 222587 222327 222352 222956 223913 224835 225467
52738 225467 225833 226312 227406 229223 231352 233369 235286 237337 239518 241595 243404 244964 246370 247722 249027
52723 249027 250035 250286 249463 247656 245240 242670 240435 238914 238091 237615 237302 237288 237505 237333 236232 234517
52707 234517 233061 232281 231782 231017 229909 228811 228170 228278 229017 229793 230034 229853 229928 230643 231689 232547 233010 233128
52689 233128 233142 233724 235721 239129 242638 244823 245614 246049 246727 247187 246902 246147 245493 245001 244405 243805 243616 243954
52671 243954 244474 244852 245074 245282 245586 246069 246710 247262 247428 247236 246993 246866 246754 246660 246935 247987 249864 252275
52653 252275 254851 257238 259154 260598 261876 263214 264353 264811 264476 263652 262521 260925 258797 256537 254694
52638 254694 253477 252797 252626 253011 253811 254776 255894 257349 259070 260676 261997 263413 265443 268205 271417
52623 271417 274656 277326 278623 278019 275791 272743 269420 265875 262211 258899 256393 254685 253424 252314
52609 252314 251252 250344 249894 250152 250908 251547 251690 251571 251626 251983 252564 253403 254532 255730 256697 257324 257536 257160
52591 257160 256365 255979 256722 258165 259085 259023 258860 259568 260896 261797 261793 261401 261348 261834 262611 263406 264123 264795 265464
52572 265464 266002 266131 265724 265096 264825 265212 265997 266648 266854 266710 266409 265902 264971 263655 262407 261637 261183 260476
52554 260476 259248 257896 257081 257119 257782 258528 258914 258942 259015 259375 259656 259334 258590 258240 258606 258939 258349 256964 255673
52535 255673 254970 254605 254302 254212 254525 255050 255425 255542 255578 255792 256292 256908 257301 257474 258058 259718 262179 264272
52517 264272 265191 265387 265964 267448 269463 271386 272963 274354 275954 278150 281011 284176 287242 290179 293058
52502 293058 295411 296337 295383 293001 289950 286563 282887 279229 276064 273524 271430 269816 268948 268637 268054
52487 268054 266566 264488 262655 261441 260630 260140 260376 261744 264129 267013 269848 272159 273580 274088 274117 274240
52471 274240 274742 275603 276761 278211 279885 281591 283139 284428 285468 286392 287467 289024 291298 294212 297261
52456 297261 299616 300565 299956 298238 296035 293765 291564 289299 286549 282902 278527 274361 271412 269816 268763
52441 268763 267402 265659 264101 263179 262806 262645 262556 262550 262421 261813 260850 260360 261079 262711 264202 264907 265011 264771
52423 264771 263991 262629 261416 261208 261957 262845 263383 263875 264815 266302 268146 270177 272293 274580 277456 281410
52407 281410 286465 292222 298572 306035 315106 325474 336032 345494 352813 357247 358398 356260 351210 343963
52393 343963 335586 327275 319908 313797 308948 305406 303187 301984 301200 300371 299504 298952 298998 299534 300174 300670
52377 300670 301156 301931 303098 304569 306412 308929 312330 316469 321019 325794 330787 335882 340600 344239 346434
52362 346434 347627 348744 350186 351357 351452 350493 349193 347970 346736 345624 345223 345811 346981 348387 350359
52347 350359 353190 356223 358302 359017 358995 359077 359774 361456 364460 368726 373717 378871 383954 388924 393876 399256
52331 399256 405830 414185 424384 436194 449434 463904 479182 494779 510582 527075 545040 564887
52319 564887 586134 607623 628351 648062 666931 684950 701971 718234 734389 750908 767801
52308 767801 784988 802582 820582 838595 856108 872850 888754 903781 918014 931741 945188
52297 945188 958190 970257 980877 989686 996477 1001165 1003652 1003682 1001038 995960 989134 981169 972361 963060
52283 963060 953886 945272 937096 929180 921953 916190 912171 909510 907843 907272 908031 910082 913236 917499 923170
52268 923170 930633 940141 951629 964731 979008 994061 1009309 1023939 1037458 1050258 1063222 1076623
52256 1076623 1089763 1101857 1112998 1124008 1135510 1147391 1159013 1169672 1178795 1185916 1190669 1192882
52244 1192882 1192609 1189944 1184769 1176888 1166495 1154317 1141062 1126910 1111838 1096209 1080564 1064934
52232 1064934 1048917 1032566 1016658 1001827 987864 974228 960881 948265 936729 926316 916931
52221 916931 908436 900798 894360 889650 886591 884271 881952 879967 879104 879412 880297 881606 883724 886569 889373
52206 889373 891792 894476 897997 901787 904775 906694 908166 909770 911685 914141 917497 921670 926038 930161
52192 930161 934273 938760 943450 947769 951466 954831 958175 961402 964178 966198 967042 966034 962700 957489
52178 957489 951562 945664 939443 932239 924297 916703 910156 904348 898719 893406 889094 886173 884407 883343
52164 883343 882761 882730 883449 885090 887729 891357 895906 901148 906561 911446 915263 917844 919332 920148 920965 922335
52148 922335 924127 925604 926325 926765 927746 929487 931617 933974 936830 940158 943204 945190 946280 947492 949660
52133 949660 952807 956633 961324 967546 975668 985334 996031 1007946 1021956 1038799 1058468 1080479 1104455
52120 1104455 1130301 1157959 1187190 1217431 1247741 1277046 1304726 1331018 1356664 1382083 1406895
52109 1406895 1430231 1451401 1470257 1486961 1501494 1513542 1522913 1529928 1535221 1539300 1542434 1544790
52097 1544790 1546304 1546539 1545171 1542581 1539404 1535375 1529200 1519900 1507734 1493453 1477195 1458695 1438192
52084 1438192 1416522 1394617 1373486 1354403 1338347 1325273 1314510 1305776 1299251 1294791 1291877 1290413
52072 1290413 1290963 1294092 1299971 1308581 1319579 1331897 1344328 1356808 1370393 1385681 1401963 1418305
52060 1418305 1434596 1450925 1466672 1481076 1494224 1506570 1517800 1527050 1534179 1540004 1545216 1549633
52048 1549633 1552591 1553485 1551848 1547429 1540386 1531052 1519449 1505321 1488662 1469828 1449224 1427309 1404916
52035 1404916 1383056 1362266 1342539 1323883 1306474 1290103 1274076 1258017 1242396 1227935 1214707
52024 1214707 1202093 1189347 1175967 1161806 1147203 1132893 1119485 1107078 1095489 1084646 1074451
52013 1074451 1064505 1054406 1044295 1034761 1026079 1017792 1009119 999580 989166 978118 966706 955017
52001 955017 942737 929222 914044 897554 880766 864569 849152 834270 819942 806674 795021
51990 795021 785144 776794 769459 762418 754914 746679 738184 730098 722460 714596 705848 696029 685101 672816
51976 672816 659082 644520 630277 617185 605309 594371 584371 575657 568572 563250 559761 558205
51964 558205 558599 560759 564388 569207 574959 581374 588173 594945 600930 605184 607277 607687 607114 605425 601778
51949 601778 595950 589048 582562 577073 572278 567974 564458 562160 561468 562883 566695 572378 578905 585951
51935 585951 594325 604809 616856 628772 638992 646835 652257 655262 655583 652753 646507 637246 625941
51922 625941 613427 600028 586043 572218 559218 546856 534459 522063 510676 501147 493234 486134
51910 486134 479558 473972 469971 467808 467341 468087 469475 471426 474655 479998 487389 495929 504991 514767 525422
51895 525422 536141 545472 552403 556691 558383 557656 555211 552354 550377 550027 551557 554780 558844 562300
51881 562300 563807 562739 559138 553556 547257 542114 539568 539627 541176 543168 545187 547117 548913 550721 552667
51866 552667 554274 554478 552445 548123 541992 534682 526917 519315 511994 504778 498058 493018 490635 490780 492588
51851 492588 495244 497989 499883 500349 499799 499047 498141 496356 493300 489354 484939 480024 474645 469316 464491
51836 464491 459995 455417 450826 446726 443515 441342 440337 440618 442077 444366 447036 449506 451071 451243 450088
51821 450088 448053 445490 442536 439360 436287 433610 431484 429953 428960 428311 427859 427749 428311 429663 431560
51806 431560 433643 435619 437076 437287 435555 431870 427161 422717 419243 416488 413876 411434 409895 409790 410646
51791 410646 411316 411052 410020 408797 407677 406638 405740 405234 405266 405700 406284 406839 407197 407090 406418 405585 405301 405788
51773 405788 406443 406588 406519 407374 409867 413573 417732 422418 428427 436165 445117 454394 463316 471368 478032
51758 478032 482904 485668 485832 482885 477048 469489 461382 452924 443736 434047 424901 417186 410925 405740
51744 405740 401573 398673 397189 397108 398453 401207 405117 409863 415469 422293 430534 439825 449427 458730 467451
51729 467451 475393 482175 487402 491113 493936 496655 499643 502748 505528 507337 507333 504848 499965 493571 486672
51714 486672 479897 473717 468714 465196 462695 460255 457283 453825 450139 446442 443233 441461 442008 445007
51700 445007 449717 454855 459006 461081 460809 458826 456188 453814 452425 452640 454726 458211 462046 465221 467111
51685 467111 467300 465403 461276 455301 448311 441258 434948 429934 426504 424718 424503 425694 427986 430933 434058
51670 434058 437010 439628 441900 443843 445483 447096 449485 453686 460022 467451 474209 479134 482066 482995
51656 482995 481441 477137 471032 465023 460761 459025 460112 464171 470953 479643 489150 498276 505441 508761
51642 508761 506978 500349 490405 478890 467055 455660 445104 435422 426509 418509 411902 407082 403923
51629 403923 401776 399861 397739 395595 394062 393682 394527 396378 399083 402482 406065 409086 411147 412461 413407
51614 413407 413961 413702 412247 409627 406300 402849 399551 396252 392788 389477 386946 385446 384683 384464 385188
51599 385188 387379 390912 395117 399621 404858 411679 420602 431414 443252 454940 465337 473539 478926
51586 478926 481260 480883 478736 476003 473644 472174 471739 472317 473997 477200 482607 490777 501876 515684
51572 515684 531599 548547 565278 581188 596809 613229 631019 649828 668805 687105 704153
51561 704153 719962 735491 752540 773212 799337 831993 870934 914364 959562 1003781 1044371
51550 1044371 1078330 1102731 1116144 1119265 1113613 1099856 1077841 1048002 1012073 972279 930236 886807
51538 886807 842684 798861 756675 717518 682386 651567 624778 601569 581490 563997 548564
51527 548564 534989 523322 513302 504163 495338 487211 480742 476238 472864 469484 465728 461935 458321
51514 458321 454683 450877 447145 443744 440569 437386 434225 431274 428531 425806 423001 420034 416627 412594
51500 412594 408396 404997 402930 401778 400798 399830 399282 399470 400365 401966 404497 408028 412140 416187 419896
51485 419896 423568 427675 432260 436753 440299 442283 442594 441571 439785 437769 435670 433048 429201 423903
51471 423903 417775 411821 406584 401862 397159 392261 387351 382724 378517 374655 370982 367395 363929 360832
51457 360832 358581 357655 358099 359343 360638 361751 363094 365110 367803 370969 374693 379335 385168 392323 401103
51442 401103 412048 425549 441459 459062 477180 494242 508497 518543 523906 525234 523973 521761
51430 521761 519810 518504 517274 514879 510097 502561 493091 483090 473534 464624 456392 449200 443325 438294
51416 438294 433184 427632 422233 417877 415043 413824 414165 415696 417571 418938 419594 419957 420460 421204 422173 423511
51400 423511 425437 428063 431358 435152 439111 442832 446118 449189 452549 456630 461580 467438 474594 483917
51386 483917 496234 511630 529520 549578 572356 598736 628981 662786 700226 742075 788960
51375 788960 840607 896176 954904 1015765 1076482 1133379 1182460 1220720 1246672 1260195 1262117 1253612
51363 1253612 1235500 1207955 1171015 1125446 1073159 1016761 958645 900426 843126 787772 735697
51352 735697 688285 646534 610824 580846 555662 534113 515423 499322 485497 473344 462584
51341 462584 453718 447236 442525 438277 433980 430260 427518 425033 421962 418577 415833 414059 412783 411619
51327 411619 410557 409423 407759 405475 403161 401491 400669 400521 400777 401076 400953 400056 398262 395615 392318 388858
51311 388858 385836 383641 382381 382023 382279 382453 381887 380713 379831 379970 381017 382300 383225 383476 382975 381910
51295 381910 380654 379494 378518 377773 377348 377320 377858 379287 381718 384700 387726 391073 395545 401273 407383 413100
51279 413100 418501 423778 428347 431331 432516 432244 430699 427950 424569 421520 419341 417812 416392 414682
51265 414682 412622 410645 409520 409696 410806 412053 412810 412594 410925 407895 404581 402115 400393 398352 395498
51250 395498 392417 389706 387202 384590 382146 380431 379669 379678 380034 380160 379778 379501 380418 382641 384827 385638 385286
51233 385286 385059 385614 386418 386747 386563 386279 386151 386168 386330 386821 387951 389899 392401 394781 396460 397438 398180
51216 398180 399034 399849 400070 399151 397051 394491 392569 391854 391878 391701 390916 389973 389575 389975 390899 392011 393374
51199 393374 395420 398406 401888 404989 407279 409098 410771 411765 411173 409037 406700 405572 405890 406900 408009
51184 408009 409276 410856 412489 413776 414713 415619 416579 417256 417296 416689 415624 414142 412122 409584 406860 404448
51168 404448 402637 401219 399569 397292 394881 393533 394070 396174 398859 401470 403898 406040 407639 408772
51154 408772 410033 411910 414230 416424 418113 419223 419773 419891 419936 420232 420609 420421 419203 417194 415083 413259
51138 413259 411494 409515 407678 406752 406918 407357 407073 405967 404807 404337 404795 406108 408102 410477 413014 415847
51122 415847 419156 422512 424979 426041 426124 426074 426397 427045 427541 427249 425996 424616 424365 425574 427316 428628
51106 428628 429460 430069 430191 429564 428854 429253 431232 434248 437550 440743 443650 446219 448567 450720 452410 453591
51090 453591 454924 457080 459683 461658 462718 463726 465309 466775 466890 465260 462533 459588 456996 455058
51076 455058 453863 453177 452529 451557 450363 449572 449862 451201 452705 453617 454304 455854 458785 462783 467738 474262
51060 474262 482778 492831 503851 516094 530002 544832 558604 569537 577238 582724 587841 594590
51048 594590 604319 617145 632236 648588 665387 681896 697585 712326 725864 737030 744139 746610
51036 746610 745770 743634 741157 737940 733076 725568 714165 697856 677067 653945 631007 609623 590042
51023 590042 572497 557675 546074 537438 531174 527070 525208 525266 526367 527814 529811 533125 538070 544076
51009 544076 550337 556665 563447 570859 578512 585997 593470 601385 609804 618400 627203 636941 648403 661687
50995 661687 676348 692151 709274 727768 747091 766336 784797 802190 818484 833663 847661
50984 847661 860489 872463 884329 897043 911169 926376 941588 955711 968281 979428 989430
50973 989430 998614 1007762 1018337 1032006 1049956 1072808 1101003 1134890 1174390 1218998 1268251 1321947
50961 1321947 1379746 1440922 1504678 1570337 1636954 1703172 1767956 1831094 1892297 1949917 2001371
50950 2001371 2045030 2081109 2110492 2133322 2149140 2157943 2160470 2157707 2150731 2141010 2130236 2119420
50938 2119420 2108090 2094418 2076213 2052188 2022729 1989609 1954902 1920015 1885604 1851933 1818920
50927 1818920 1785966 1752124 1716617 1679150 1639817 1598909 1556745 1513475 1469033 1423516 1377670
50916 1377670 1332705 1289482 1247964 1207632 1168358 1130832 1096197 1065367 1038577 1015412 995141
50905 995141 977048 960585 945435 931549 919032 907828 897563 887806 878448 869704 861860 855182
50893 855182 849942 846148 843234 840405 837474 835113 834064 834387 835663 837542 839762 841930 843928 846437
50879 846437 850440 856066 862415 868706 875153 882457 890876 900220 910450 921767 934215 947621 961986
50866 961986 977707 995376 1015478 1038156 1063130 1090095 1119433 1152266 1189487 1231015 1276486
50855 1276486 1326445 1382228 1444743 1514053 1590332 1674566 1767989 1871210 1984117 2106209 2236730
50844 2236730 2374848 2519937 2671341 2827626 2986494 3145642 3303148 3456606 3602364
50835 3602364 3736192 3854392 3953906 4031958 4086549 4117348 4125525 4112776 4081024 4032879 3971600
50824 3971600 3900483 3822741 3742020 3662366 3587318 3519254 3459491 3408383 3365014 3327215 3292251
50813 3292251 3257399 3219958 3177300 3127369 3069088 3002195 2926863 2843474 2752496 2654478 2550441
50802 2550441 2442298 2332673 2224166 2118927 2018767 1925220 1839320 1761479 1691627 1629343
50792 1629343 1574099 1525792 1484896 1451632 1425106 1403840 1387098 1375041 1367556 1363643 1362119 1362166
50780 1362166 1362898 1363128 1362101 1359959 1357066 1353264 1348174 1341719 1333925 1324701 1314287 1303449 1292670 1281466
50766 1281466 1268997 1255021 1239811 1223600 1206690 1189712 1173116 1156627 1139878 1123316 1107852
50755 1107852 1093875 1081340 1070604 1062350 1056668 1053067 1051551 1052978 1058117 1066859 1078658 1093325 1111154
50742 1111154 1132617 1158028 1187289 1220006 1256242 1297049 1343673 1396200 1453565 1515008 1580970
50731 1580970 1652328 1729285 1811151 1896676 1984245 2072199 2159395 2245261 2329166 2410079 2486968
50720 2486968 2559023 2625154 2683632 2732533 2770184 2794896 2804729 2798210 2775334 2737732 2688091 2629670
50708 2629670 2565971 2500282 2435368 2373647 2317329 2267924 2225711 2190100 2160513 2136598 2117667
50697 2117667 2102330 2088758 2074971 2058739 2037664 2009916 1975054 1933972 1887904 1837599 1783532
50686 1783532 1726794 1669361 1613350 1560201 1510806 1466118 1427147 1394402 1367809 1347313 1333207
50675 1333207 1325708 1324532 1329117 1339070 1354212 1374313 1398854 1426876 1456987 1487769 1518251 1547853
50663 1547853 1575913 1601706 1624989 1646091 1665225 1682194 1697034 1710582 1723970 1737852 1752446
50652 1752446 1767997 1784661 1802109 1819831 1837915 1857154 1878351 1901808 1927496 1955466 1986047
50641 1986047 2019854 2057522 2099304 2144988 2194324 2247200 2303072 2360511 2417836 2474094 2529076
50630 2529076 2582613 2634524 2685240 2735844 2787374 2840405 2894892 2948886 2996504 3028115 3034370
50619 3034370 3011330 2962392 2896031 2822038 2748818 2682133 2624780 2577207 2538825 2509031 2487235
50608 2487235 2472375 2462800 2456639 2452094 2447377 2440514 2429220 2410966 2383398 2345112 2296319 2238631
50596 2238631 2174067 2104247 2030536 1954573 1878162 1802672 1729025 1658430 1592615 1532877 1479188
50585 1479188 1430758 1387380 1349672 1317974 1291626 1269639 1251632 1237699 1227585 1220379 1214991 1210645
50573 1210645 1207030 1204296 1202892 1203179 1205122 1208427 1212887 1218415 1224925 1232474 1241489 1252526 1265699 1280654
50559 1280654 1297178 1315625 1336559 1360160 1386176 1414314 1444436 1476377 1509785 1544214 1579312
50548 1579312 1614728 1649651 1682483 1711345 1735363 1755508 1773974 1792685 1812667 1834697 1859971
50537 1859971 1889843 1925293 1966939 2015169 2069915 2130681 2197352 2270730 2351717 2440208 2535503
50526 2535503 2637670 2747548 2865144 2988782 3116150 3245494 3375302 3503530 3627909
50517 3627909 3746592 3857686 3958305 4044891 4114588 4165893 4198107 4210753 4203553 4176456 4129678
50506 4129678 4064308 3982982 3889459 3787363 3679856 3570576 3464065 3364708 3275601 3198821
50496 3198821 3136319 3089951 3060756 3048636 3052591 3070841 3100786 3139219 3182502 3226232 3264863
50485 3264863 3292174 3302446 3291431 3256816 3198542 3118852 3021566 2910909 2790863 2665254 2537728
50474 2537728 2411248 2287816 2168925 2056074 1950577 1853071 1763580 1682063 1608588 1542908
50464 1542908 1484244 1431799 1385373 1345238 1311432 1283381 1260264 1241502 1226846 1216215 1209632
50453 1209632 1207106 1208283 1212268 1218034 1224965 1232886 1241757 1251575 1262487 1274591 1287669 1301448 1316199
50440 1316199 1332639 1351055 1370746 1390350 1408458 1423901 1436037 1445024 1451481 1455590 1456956 1455612
50428 1455612 1452674 1449490 1446594 1444096 1442723 1443572 1446917 1452170 1459255 1469255 1483335 1501703 1524139
50415 1524139 1551087 1583581 1622382 1667705 1719578 1777733 1841136 1908158 1977407 2047982 2118821
50404 2118821 2188339 2254988 2317785 2375892 2428058 2473070 2510572 2540701 2562818 2575217 2576398
50393 2576398 2566036 2544259 2510545 2464265 2406294 2339400 2266897 2191399 2115018 2040031 1968810
50382 1968810 1903299 1844928 1794862 1754062 1723229 1702878 1693181 1693524 1702393 1717854 1737889 1760113
50370 1760113 1781650 1799752 1812242 1817048 1811803 1794782 1766184 1727943 1682207 1630572 1574707 1516885
50358 1516885 1459371 1403610 1350307 1299962 1252946 1209217 1168283 1129539 1092689 1058023 1026249
50347 1026249 997785 972200 948625 926778 907197 890397 876270 864553 855454 849320 845887 844346
50335 844346 844105 845183 847854 852287 858519 866444 875532 884824 893495 901578 909985 919753 931259 944199
50321 944199 958127 972849 988313 1004464 1021331 1039002 1057226 1075096 1091308 1104610 1113849 1117779
50309 1117779 1115337 1106323 1091718 1073385 1053506 1034006 1016076 1000096 986092 974123 964063 955371
50297 955371 947590 941024 936435 934161 933902 935216 937583 940052 941662 942456 943439 945233 947438 949645 952390
50282 952390 956561 962570 970826 982477 998562 1018331 1038880 1056397 1067503 1070001 1063545 1049976
50270 1049976 1032461 1013922 996263 980665 967779 957460 948945 941597 935258 929834 925040 920757
50258 920757 917239 914729 913187 912522 912731 913605 914644 915557 916537 917784 918993 919652 919631 919206 918634 918051 917727
50241 917727 918020 919062 920705 922890 925817 929570 933801 938088 942674 948545 956648 967120 979445 993138
50227 993138 1007930 1023481 1039434 1055900 1073348 1091672 1109802 1126603 1141802 1155642 1168063
50216 1168063 1178960 1189015 1199473 1210985 1223207 1235434 1246786 1255627 1259715 1257505 1248913 1234520
50204 1234520 1214653 1189738 1160982 1130023 1098253 1067078 1038423 1014170 995068 980766 970780
50193 970780 964678 961227 958035 952427 942486 927377 907336 883626 858014 831896 806097 781487
50181 781487 759149 739586 722248 706364 691986 679681 669465 660658 652794 646121 641011 637274
50169 637274 634252 631357 628468 626018 624701 624703 625106 624502 622529 620448 619918 621436 624335 627996 632449 637849
50153 637849 643998 650611 657631 665054 672715 680454 688158 695425 701455 705567 707657 707928 706440 703282
50139 703282 699055 694762 691163 688448 686595 685797 686480 689003 693347 699037 705404 712002 718615 724955 730742
50124 730742 736293 742639 750596 759978 770172 781257 793991 808783 825341 843457 863583 886480
50112 886480 912777 943043 977728 1016716 1059274 1104667 1152394 1201586 1250670 1298078 1343069
50101 1343069 1385720 1426599 1466817 1507760 1550004 1592588 1633812 1672434 1707463 1737013 1758192
50090 1758192 1768425 1766555 1752827 1728419 1695140 1655026 1609851 1561172 1510766 1460487 1411487
50079 1411487 1363974 1318048 1274543 1234828 1199951 1170147 1144872 1123076 1103502 1084990 1066650
50068 1066650 1047953 1028957 1010374 993036 977053 961670 946147 930614 915936 902875 891490
50057 891490 881231 871496 862088 853178 844851 836911 829342 822771 817969 814887 812586 810317 808356 807613
50043 807613 808713 811612 815807 820665 825806 831434 838147 846245 855320 864560 873247 881001 888002 895087
50029 895087 903126 911947 920280 927065 932334 936356 938552 938118 935428 931817 927890 922958 916468 909220
50015 909220 902550 896794 891123 884667 877184 868769 859521 849807 840534 832784 827111 823228 820456 818471
50001 818471 817601 818533 821908 828277 838211 852176 870318 892440 918059 946195 975265 1003700 1031000
49988 1031000 1058074 1086384 1116627 1148031 1178659 1206362 1229748 1248489 1262897 1273465 1280995
49977 1280995 1286868 1292610 1299029 1305903 1312345 1316991 1317870 1312744 1300076 1279517 1251390 1216177 1174888
49964 1174888 1129625 1083222 1038234 996319 958276 924340 894486 868725 847097 829344 814911
49953 814911 803510 795443 791076 790199 792253 796955 804196 813363 823243 832657 840910 847612 852514 855646
49939 855646 857259 857459 856093 853080 848529 842361 834069 823031 808897 791690 771896 750694 729792
49926 729792 710557 693314 677717 663674 651595 641793 634096 628316 624753 623790 624987 627016 628739
49913 628739 630150 631945 634368 636916 639232 641785 645384 650340 656427 663448 671452 680527 690746 702301
49899 702301 715416 730080 745961 762359 778081 791776 802898 812139 820317 826984 830849 831486 829765
49886 829765 826401 820963 812750 801928 789152 774653 758450 741079 723399 705884 688758 672600
49874 672600 658100 645275 633670 623284 614566 607454 601174 595294 590326 586947 585183 584822 586106
49861 586106 589394 594375 600210 606449 613461 621943 632256 644203 657188 670591 684212 698344 713283
49848 713283 728727 743717 757090 767905 775681 780521 783030 783868 783269 781051 776979 770930 762759 752313
49834 752313 739794 726022 712186 699310 687938 678219 670106 663465 658108 653916 650994 649618 649984
49821 649984 652025 655537 660413 666673 674363 683500 694069 705909 718627 731727 744781 757354 768869
49808 768869 778819 787069 793782 799063 802959 805762 807814 808815 807718 803658 796818 788079 778076 766990
49794 766990 755134 743131 731285 719129 705930 691620 677120 663818 652770 644260 637842 632669
49782 632669 627912 623179 618775 615478 613768 613191 612689 611657 610482 609936 610378 611764 614154 617841 623078
49767 623078 630016 638765 649090 660072 670459 679448 686900 692918 697708 701842 706049 710400 714065
49754 714065 716120 716215 714216 709678 702251 692356 680952 668800 656415 644598 634354 626107 619465
49741 619465 613910 609325 605698 602757 600183 597887 595754 593453 590888 588611 587321 587067 587364 588014 589321
49726 589321 591454 594182 597481 601886 607830 614977 622718 631106 640724 651674 663323 675149 687235
49713 687235 699567 711235 720741 726944 729508 728841 726037 722525 719075 715111 709500 702024 693588 685007
49699 685007 676294 667396 658976 651881 646188 641256 636557 632019 627790 624158 621626 620489 620291 620155 619871
49684 619871 620344 622726 627314 633408 640144 647271 655188 664371 674825 686239 698624 712461 727898
49671 727898 743988 759108 772056 782345 789613 793461 794143 792863 790925 788947 787202 786330 787068 789343
49657 789343 792054 793731 793062 788882 780288 767124 750241 731164 711543 692785 675759 660676 647379
49644 647379 635851 626293 618680 612534 607369 603252 600726 600146 601148 602719 603754 603686 602745 601617 600781
49629 600781 600076 598824 596364 592523 587697 582478 577146 571591 565717 559734 553879 548060 542183 536765
49615 536765 532695 530210 528574 527134 526250 526648 528093 529469 530271 531321 533603 536882 540049 542512 544607
49600 544607 546657 548270 548862 548411 547369 546162 545185 544964 545745 546949 547644 547722 548105 549526 551573 553400
49584 553400 554999 557068 559711 562050 563413 564360 566011 568711 571929 575307 579142 583644 588322 592577
49570 592577 596654 601465 607515 614531 622267 631168 641821 653973 666598 678881 690603 701420 710226
49557 710226 715718 717480 716283 713369 709646 705415 700524 694743 688269 681977 677018 674017 672676 672128
49543 672128 671623 671000 670718 671364 672936 674634 675603 675838 676081 676857 678040 679493 681608 684864 689210 694410
49527 694410 700848 709450 720677 734012 748581 763967 780131 796754 812966 827777 840555 851077
49515 851077 859288 865252 869383 872575 875886 880015 885135 891198 898223 906176 914675 922900 929600 933108
49501 933108 931606 923892 910171 892109 872134 852533 834763 819015 804432 790185 776622 765111
49489 765111 756560 750353 745029 739714 734525 729793 725527 721762 718846 717073 716305 716291 717042 718449 719813
49474 719813 720357 720246 720527 721818 723560 724959 726275 728581 732372 736939 741274 745156 749127 753683 758759
49459 758759 763885 768557 772393 775093 776433 776357 775019 772553 768754 763241 756127 748334 740926 734210 727799
49444 727799 721424 715200 709121 702947 696922 692070 689255 688161 687749 687554 688077 689952 693282 697950 704092
49429 704092 711930 721416 732388 744990 759650 776730 796516 819613 847055 879695 917351 958257
49417 958257 998791 1033478 1055949 1061438 1049559 1024920 994656 965117 940307 922205 911215 906248
49405 906248 905408 907314 911609 918187 926493 935824 945764 955922 965759 975190 985038 996334 1009300 1023313
49391 1023313 1037534 1051218 1063726 1074626 1083454 1089027 1089633 1084668 1075656 1064801 1052821 1039127
49379 1039127 1023822 1008222 993211 978307 962945 947786 934148 922854 914241 908633 906037 905767
49367 905767 907094 909953 914454 919926 925129 929221 931993 933294 932887 930884 927858 924318 920367 915857
49353 915857 910640 904671 898149 891525 885201 879301 873919 869438 866331 864733 864438 865162 866512 867856 868608
49338 868608 868658 868317 867865 867364 866783 866036 864949 863441 861736 860206 859033 858135 857322 856463 855715 855722 857246 860338
49320 860338 864136 867775 871221 874884 878735 882337 885551 888693 892107 895999 900507 905438 910082 913844
49306 913844 916981 920196 923662 927142 930921 935703 941385 946901 951743 956925 963822 972658 982754 993838
49292 993838 1006272 1020199 1035132 1050462 1065818 1080836 1094964 1107727 1119020 1129095 1138328 1146990
49280 1146990 1155099 1162584 1169534 1175967 1181080 1183047 1180041 1171504 1158361 1142250 1124945 1108268 1093754
49267 1093754 1082006 1072621 1064932 1058655 1053791 1050290 1048153 1047629 1048929 1051793 1055719 1060772 1067908 1078349
49253 1078349 1092698 1110620 1131114 1152856 1174547 1195274 1214464 1231060 1242766 1246742 1241541 1228237
49241 1228237 1209411 1187340 1163476 1139211 1116285 1096177 1079580 1066655 1057389 1051449 1048054 1046383
49229 1046383 1045978 1046537 1047536 1048365 1048775 1049032 1049639 1051038 1053451 1056838 1061006 1065778 1070901 1075828 1079892 1082926
49213 1082926 1085534 1088524 1092173 1096212 1100376 1104689 1109326 1114483 1120508 1127983 1137486 1149197 1162704
49200 1162704 1177303 1192590 1208685 1225652 1242860 1259301 1274689 1289818 1305552 1321693 1337134
49189 1337134 1350917 1362861 1373343 1382852 1391725 1399968 1407311 1413623 1419287 1425017 1431427 1438941 1447980
49176 1447980 1458939 1472034 1487532 1506218 1529423 1558506 1594383 1637286 1686391 1739181 1791171
49165 1791171 1836661 1870377 1889225 1893201 1885058 1869138 1850244 1832821 1820028 1812846 1810184 1810380
49153 1810380 1812639 1816929 1822878 1829467 1835863 1842027 1848252 1854495 1860485 1866271 1872376 1879493 1888186 1898744
49139 1898744 1911077 1924696 1938897 1953058 1966882 1980433 1993913 2007334 2020595 2033900 2047791
49128 2047791 2062443 2077156 2091003 2103855 2116238 2128269 2139452 2149757 2160310 2172472 2186623
49117 2186623 2202244 2218839 2236334 2254883 2274961 2297655 2324296 2355691 2392133 2434293 2483802
49106 2483802 2542660 2612034 2691218 2777069 2864423 2948116 3025865 3099480 3172419 3244944 3310788
49095 3310788 3358557 3377513 3363889 3323198 3266645 3204271 3140045 3072250 2997810 2916318 2831026
49084 2831026 2747410 2671117 2606209 2553903 2512562 2479377 2452404 2431002 2414686 2402294 2392479
49073 2392479 2384379 2377254 2369929 2361274 2351184 2340544 2330164 2320199 2310647 2301872 2294286 2287806 2281945
49060 2281945 2276342 2271031 2266289 2262331 2258997 2255663 2251667 2247020 2242588 2239417 2237873 2237522 2237639 2237745 2237761
49045 2237761 2237897 2238398 2239348 2240789 2243051 2246781 2252465 2259938 2268576 2278010 2288625 2301338 2316838 2334907
49031 2334907 2354335 2373400 2390405 2403819 2412388 2415619 2414233 2409771 2403552 2396232 2388394 2381004 2374864
49018 2374864 2369867 2365325 2360998 2357440 2355373 2355119 2356666 2359860 2364357 2369715 2375780 2382807 2390970 2399939
49004 2399939 2409168 2418516 2428229 2438274 2447999 2456646 2464092 2470824 2477196 2482974 2487734 2491416 2494163 2495708
48990 2495708 2495385 2492915 2488835 2483919 2478426 2472195 2465232 2457787 2449939 2441590 2432946 2424652 2417255 2410772
48976 2410772 2404984 2399905 2395734 2392466 2389830 2387526 2385306 2382826 2379683 2375780 2371597 2367911 2365121 2362898
48962 2362898 2360676 2358605 2357861 2359733 2364404 2370885 2378228 2386498 2396385 2408159 2421410 2435743 2451326
48949 2451326 2468548 2487451 2507686 2528897 2550975 2574049 2598426 2624451 2652194 2681244 2711032
48938 2711032 2741362 2772512 2804801 2838359 2873397 2910473 2950205 2992804 3038051 3085564 3134904
48927 3134904 3185519 3236901 3288882 3341593 3395149 3449560 3504889 3561179 3618171 3675344 3732350
48916 3732350 3789154 3845553 3900778 3953755 4003717 4050537 4094717 4137162 4178644 4219271 4258612
48905 4258612 4296533 4333543 4370074 4405774 4439953 4472509 4503790 4533585 4560894 4584932 4605931
48894 4605931 4624722 4641819 4657129 4670284 4680946 4688955 4694489 4698030 4699981 4700242 4698157 4692805 4683436
48881 4683436 4669845 4652395 4631540 4607373 4579879 4549559 4517218 4482837 4445098 4402538 4355035
48870 4355035 4303748 4249732 4193076 4133507 4071378 4007789 3944015 3881014 3819378 3759525 3701889
48859 3701889 3647032 3595525 3547736 3503767 3463657 3427473 3395098 3366021 3339609 3315661 3294587
48848 3294587 3276830 3262198 3249900 3239317 3230573 3224279 3220899 3220507 3223004 3228210 3235745 3245121 3256138
48835 3256138 3269000 3283912 3300726 3319130 3338938 3359924 3381532 3403145 3424683 3446568 3469007
48824 3469007 3491625 3514035 3536475 3559475 3582987 3606309 3628971 3651348 3674140 3697457 3720727
48813 3720727 3743358 3765173 3786282 3806944 3827587 3848600 3869975 3891491 3913370 3936316 3960666
48802 3960666 3985940 4011608 4037919 4065426 4094051 4123306 4153287 4184585 4217040 4249284 4279825
48791 4279825 4308091 4334168 4358158 4380233 4400803 4420103 4437840 4453580 4467104 4477993 4485284
48780 4485284 4488073 4486141 4479456 4467383 4449127 4424807 4395395 4361610 4323580 4281660 4236777 4189617
48768 4189617 4140085 4088037 4034170 3979721 3925458 3871279 3816695 3761438 3705714 3650146 3595473
48757 3595473 3542231 3490713 3441174 3393891 3349025 3306684 3267193 3231047 3198397 3168767 3141383
48746 3141383 3115651 3091269 3068126 3046326 3026178 3008083 2992481 2979958 2971074 2965897 2963770 2963701
48734 2963701 2964907 2966964 2969630 2972653 2975611 2977848 2978754 2978337 2977456 2977332 2978738 2981549 2984903 2987739 2989446
48719 2989446 2990235 2990816 2991631 2992377 2992277 2990802 2988267 2985830 2984724 2985214 2986328 2986852 2986470 2985623 2984523 2982948
48703 2982948 2981083 2979811 2979725 2980325 2980592 2980102 2979178 2978311 2977934 2978628 2981035 2985434 2991554 2998736 3006163 3013129
$$ [...]
##END NTUPLES=NMR SPECTRUM
##END=
