##TITLE=AC1690_COLAH14371_8650466_UnUn4dWAeb
##JCAMPDX= 6.0         $$ Bruker NMR JCAMP-DX V2.0
##DATA TYPE= NMR SPECTRUM
##DATA CLASS= NTUPLES
##ORIGIN= BRUKER
##OWNER= Administrator
$$ 1.72 TOPSPIN		Version 2.1
$$ 2014-05-30 19:40:04.074 -0700  Administrator@X
$$ Compression mode = diff/dup
##.OBSERVE FREQUENCY= 400.02188249412
##.OBSERVE NUCLEUS= ^1H
##.ACQUISITION MODE= SIMULTANEOUS (DQD)
##.ACQUISITION SCHEME= undefined
##.AVERAGES= 8
##.DIGITISER RES= 22
##SPECTROMETER/DATA SYSTEM= spect
##.PULSE SEQUENCE= zg30
##.SOLVENT NAME= COFFEE_meoh
##.SHIFT REFERENCE= INTERNAL, COFFEE_meoh, 1, 14.98509
##AUDIT TRAIL= $$ (NUMBER, WHEN, WHO, WHERE, PROCESS, VERSION, WHAT)
$$ ##TITLE= Audit trail, TOPSPIN		Version 2.1
$$ ##JCAMPDX= 5.01
$$ ##ORIGIN= Bruker BioSpin GmbH
$$ ##OWNER= Administrator
$$ $$ E:\/data/COFFEE/nmr/AC1690_COLAH14371_8650466_UnUn4dWAeb/10/pdata/1/auditp.txt
$$ ##AUDIT TRAIL=  $$ (NUMBER, WHEN, WHO, WHERE, PROCESS, VERSION, WHAT)
(   1,<2014-05-30 19:39:56.746 -0700>,<Administrator>,<X>,<go>,<TOPSPIN 2.1>,
      <created by zg
	started at 2014-05-30 19:38:50.402 -0700,
	POWCHK enabled, PULCHK disabled,
       configuration hash MD5:
       C8 4E 4E 5D D3 5C D8 9E 9F 52 82 E0 59 8A DE 15
       data hash MD5: 64K
       A8 EF 9A DB 00 4C 31 13 9D E1 6C 00 8A 9D 03 7C>)
(   2,<2014-05-30 19:39:59.980 -0700>,<Administrator>,<X>,<proc1d>,<TOPSPIN 2.1>,
      <Start of raw data processing
       efp LB = 0 FT_mod = 6 PKNL = 1 PHC0 = 0 PHC1 = 0 SI = 32K 
       data hash MD5: 32K
       53 2E 4E 56 10 1C 87 26 DC 8B 15 91 CA A8 AA D3>)
(   3,<2014-05-30 19:40:00.309 -0700>,<Administrator>,<X>,<proc1d>,<TOPSPIN 2.1>,
      <pk PHC0 = 92.20276 PHC1 = 0 
       data hash MD5: 32K
       1A CC D2 00 1A 1E FD 2B E5 67 47 CD C2 E5 06 CA>)
(   4,<2014-05-30 19:40:00.512 -0700>,<Administrator>,<X>,<proc1d>,<TOPSPIN 2.1>,
      <abs ABSG = 1 
       data hash MD5: 32K
       FD 13 99 E3 99 19 A3 2D CC E5 6D 01 F5 1D 60 D9>)
(   5,<2014-05-30 19:40:00.590 -0700>,<Administrator>,<X>,<proc1d>,<TOPSPIN 2.1>,
      <abs ABSG = 2 
       data hash MD5: 32K
       98 68 9B 2E 04 21 4C F2 01 04 D8 88 A0 74 1A 34>)
(   6,<2014-05-30 19:40:00.637 -0700>,<Administrator>,<X>,<proc1d>,<TOPSPIN 2.1>,
      <abs ABSG = 3 
       data hash MD5: 32K
       A4 53 99 42 C2 4E 0F EC 71 D0 64 FE 80 B2 EE 26>)
(   7,<2014-05-30 19:40:00.699 -0700>,<Administrator>,<X>,<proc1d>,<TOPSPIN 2.1>,
      <abs ABSG = 4 
       data hash MD5: 32K
       AA 0D CC 41 48 06 16 CC DB DE 17 5C DC AA AE DD>)
(   8,<2014-05-30 19:40:00.746 -0700>,<Administrator>,<X>,<proc1d>,<TOPSPIN 2.1>,
      <abs ABSG = 5 
       data hash MD5: 32K
       FD 5B 87 0B CD 71 DD 4E 00 14 FD 93 27 C9 97 1E>)
$$ ##END=
$$ 
$$ $$ hash MD5
$$ $$ 1F 69 F1 2B 83 D4 C0 5C FA 2F 76 F5 F3 7C C5 27
##$RELAX= 
##$RELAX= 
##$RELAX= 
##$RELAX= 
##$RELAX= 
##$RELAX= 
##$RELAX= 
$$ Bruker specific parameters
$$ --------------------------
##$DU= <E:\>
##$EXPNO= 10
##$NAME= <AC1690_COLAH14371_8650466_UnUn4dWAeb>
$$ [...]
150 150 150 150 150 150 150 150
##$TP07= 0
##$TPNAME0= <>
##$TPNAME1= <>
##$TPNAME2= <>
##$TPNAME3= <>
##$TPNAME4= <>
##$TPNAME5= <>
##$TPNAME6= <>
##$TPNAME7= <>
##$TPOAL= (0..7)
0.5 0.5 0.5 0.5 0.5 0.5 0.5 0.5
##$TPOFFS= (0..7)
0 0 0 0 0 0 0 0
##$TUNHIN= 0
##$TUNHOUT= 0
##$TUNXOUT= 0
##$USERA1= <user>
##$USERA2= <user>
##$USERA3= <user>
##$USERA4= <user>
##$USERA5= <user>
##$V9= 5
##$VALIST= <valist>
##$VCLIST= <CCCCCCCCCCCCCCC>
##$VD= 0
##$VDLIST= <DDDDDDDDDDDDDDD>
##$VPLIST= <PPPPPPPPPPPPPPP>
##$VTLIST= <TTTTTTTTTTTTTTT>
##$WBST= 2048
##$WBSW= 25
##$XGAIN= (0..3)
0 0 0 0
##$XL= 0
##$YL= 0
##$YMAX_a= 637417
##$YMIN_a= -542312
##$ZGOPTNS= <>
##$ZL1= 120
##$ZL2= 120
##$ZL3= 120
##$ZL4= 120
##$ABSF1= 14.98509
##$ABSF2= -5.573092
##$ABSG= 5
##$ABSL= 3
##$ALPHA= 0
##$AQORDER= 0
##$ASSFAC= 0
##$ASSFACI= 0
##$ASSFACX= 0
##$ASSWID= 0
##$AUNMP= <proc_prof1d_extract_pilot.lims>
##$AXLEFT= 0
##$AXNAME= <>
##$AXNUC= <1H>
##$AXRIGHT= 0
##$AXTYPE= 0
##$AXUNIT= <>
##$AZFE= 0.1
##$AZFW= 0.1
##$BCFW= 0
##$BC_mod= 0
##$BYTORDP= 0
##$COROFFS= 0
##$CY= 15
##$DATMOD= 1
##$DC= 0
##$DFILT= <>
##$DTYPP= 0
##$F1P= 0
##$F2P= 0
##$FCOR= 0.5
##$FTSIZE= 32768
##$FT_mod= 6
##$GAMMA= 0
##$GB= 0
##$INTBC= 1
##$INTSCL= 1
##$ISEN= 128
##$LB= 0
##$LEV0= 0
##$LPBIN= 0
##$MAXI= 10000
##$MC2= 0
##$MEAN= 0
##$ME_mod= 0
##$MI= 0
##$NCOEF= 0
##$NC_proc= -8
##$NLEV= 6
##$NOISF1= 0
##$NOISF2= 0
##$NSP= 0
##$NTH_PI= 0
##$NZP= 0
##$OFFSET= 14.98509
##$PC= 1
##$PHC0= 92.20276
##$PHC1= 0
##$PH_mod= 1
##$PKNL= yes
##$PPARMOD= 0
##$PPDIAG= 0
##$PPIPTYP= 0
##$PPMPNUM= 2147483647
##$PPRESOL= 1
##$PSCAL= 4
##$PSIGN= 0
##$PYNMP= <proc.py>
##$REVERSE= no
##$SF= 400.02
##$SI= 32768
##$SIGF1= 0
##$SIGF2= 0
##$SINO= 400
##$SIOLD= 32768
##$SPECTYP= <>
##$SREGLST= <1H.CDCl3>
##$SSB= 0
##$STSI= 32768
##$STSR= 0
##$SW_p= 8223.68421052631
##$SYMM= 0
##$S_DEV= 0
##$TDeff= 65536
##$TDoff= 0
##$TI= <>
##$TILT= no
##$TM1= 0
##$TM2= 0
##$TOPLEV= 0
##$USERP1= <user>
##$USERP2= <user>
##$USERP3= <user>
##$USERP4= <user>
##$USERP5= <user>
##$WDW= 1
##$XDIM= 32768
##$YMAX_p= 461708097
##$YMIN_p= -687121
##$CURPLOT= <Network HP LaserJet P1505>
##$CURPRIN= <$Network HP LaserJet P1505>
##$DFORMAT= <normdp>
##$LAYOUT= <+/1D_H.xwp>
##$LFORMAT= <normlp>
##$PFORMAT= <normpl>
##$SURQMSG= 1
$$ End of Bruker specific parameters
$$ ---------------------------------
##NTUPLES= NMR SPECTRUM
##VAR_NAME=  FREQUENCY,     SPECTRUM/REAL,   SPECTRUM/IMAG
##SYMBOL=    X,             R,               I
##VAR_TYPE=  INDEPENDENT,   DEPENDENT,       DEPENDENT
##VAR_FORM=  AFFN,          ASDF,            ASDF
##VAR_DIM=   32768,         32768,           32768
##UNITS=     HZ,            ARBITRARY UNITS, ARBITRARY UNITS
##FACTOR=    0.250966925370066, 1,           1
##FIRST=     8223.43324360094, -92012,       128409
##LAST=      0,             -3270,           -183527
##MIN=       0,             -687121,         0
##MAX=       8223.43324360094, 461708097,    0
$$ Real data points
##PAGE= N=1
##DATA TABLE= (X++(R..R)), XYDATA
$$ [...]
19568B63534B0244K10766e31902b9408j23659A15489e1184q6962j2829B6796a61189
$$ 263534 20244 231010 -531902 -29408 -153067 115489 -51184 -138146 -150975 26796 -161189
19556g9950C0554r126b88287d5121p263P947C20065a44539p0776Q7574e7676l3922
$$ -79950 30554 21428 -288287 -45121 -52384 -44437 320065 -144539 -215315 -127741 -57676 -91598
19544i1598A71553O1688b0597C7967a07196j16547I6426b55352o5978C84565c70607
$$ -91598 171553 233241 -20597 37967 -107196 -223743 96426 -255352 -321330 384565 -370607
19532D180b2363b34q1612B40236E3419P715J32875F3610k5837I60O5802b76769
$$ 4180 -22363 -234 -81846 240236 53419 61134 194009 63610 37773 960 66762 -276769
19519C0758M4950c05632a34259j85461F9358M5786b37423A50062b34839p8726
$$ 30758 75708 -305632 -134259 -319720 69358 115144 -237423 150062 -234839 -313565
19509c13565a26028K8132E7484J09846c70822J4772B22280c0248n09346a17607
$$ -313565 -126028 -97896 57484 167330 -370822 -356050 222280 -30248 -539594 -117607
19498i9547G5476L03067a41186f967C8485b73208a17123l4335a4053J336j50089
$$ -99547 75476 378543 -141186 -6967 38485 -273208 -117123 -151458 -14053 -12717 -162806
19487a62806A01320D867J74804J35404B7918a34293C2343h5006B39818b37251
$$ -162806 101320 4867 179671 315075 27918 -134293 32343 -85006 239818 -237251
19476b38133A36097g4580p6022p6446j72606d4064j3568B6547J32105d585E4724
$$ -238133 136097 -74580 -150602 -227048 -399654 -44064 -57632 26547 158652 -4585 54724
19464e9582K0928G9567b27487h0618G2715d2081l78990C3851Q4030l9966a17824
$$ -59582 -38654 79567 -227487 -80618 72715 -42081 -421071 33851 117881 77915 -117824
19452A68320a85833j18306R7189A6181c0769D871b45614M7643j0728k46152A82438
$$ 168320 -185833 -304139 -206950 16181 -30769 4871 -245614 -197971 -208699 -454851 182438
19440c43363L6889g5140l18449h1143n1587b0063j64151A13012b62482A32626
$$ -343363 -306474 -75140 -393589 -81143 -132730 -20063 -184214 113012 -262482 132626
19429g5051j19971Q2074A6780a12722j572k69034J69191j64752i2744A38715a35301
$$ -75051 -195022 -112948 16780 -112722 -114294 -383328 -214137 -378889 -92744 138715 -135301
19417a97629h9375I669a84144Q2012k43361a12661b4612k32016E4243D160K6173
$$ -197629 -89375 9669 -184144 -102132 -345493 -112661 -24612 -256628 54243 4160 30333
19406C0333c26725A92804q5914c48350J41367r573c3530j27392E4555b5798A23990
$$ 30333 -326725 192804 106890 -348350 -206983 -216556 -33530 -160922 54555 -25798 123990
19394A0127K36042D3613a22215J536B2263d0908p8611B5671g2767A61848c8966
$$ 10127 246169 43613 -122215 -120679 22263 -40908 -119519 25671 -72767 161848 -38966
19382B15631i0677B75708B6196M59639c5766l741C94082H2001b25763L3022B7101
$$ 215631 -90677 275708 26196 485835 -35766 -39507 394082 82001 -225763 -192741 27101
19370d9100B39215l7342D140d1831n7009M5048A38721R2831l2374c48815a01554
$$ -49100 239215 201873 4140 -41831 -98840 -53792 138721 231552 199178 -348815 -101554
19358b13474R4065j62892J12381e008j09124A18592i82m6431l35385A64650b19305
$$ -213474 -119409 -282301 -169920 -5008 -114132 118592 -982 -47413 -382798 164650 -219305
19346D4526e3438b5892j86630B87942d7166j34418L084q9022a03435l78119K19236
$$ 44526 -53438 -25892 -212522 287942 -47166 -181584 -178500 -267522 -103435 -481554 -262318
19335b62318a4824j93385b5666H1625J08484D3999c17244P700c8878A25532b36496
$$ -262318 -14824 -208209 -25666 81625 190109 43999 -317244 -309544 -38878 125532 -236496
19323C3338a35497k65890J73148f7788J2155E1516L0817a20684C5750a82056q424
$$ 33338 -135497 -401387 -228239 -67788 -55633 51516 82333 -120684 35750 -182056 -190480
19312a90480h1810j3571l09054D0950K52152A21558C300a73266N3521E5234b13556
$$ -190480 -81810 -95381 -404435 40950 293102 121558 3300 -173266 -119745 55234 -213556
19300e527B47681n0882a57610C084c81676H7827C0088P80L51437a95957D0989
$$ -5527 247681 196799 -157610 3084 -381676 87827 30088 30868 382305 -195957 40989
19288b92417J09591O097a1901o7507k07736P2346D5048c73074a23075j45937A89103
$$ -292417 -182826 -176729 -11901 -79408 -287144 -214798 45048 -373074 -123075 -269012 189103
19276b65331a9550j14085q929G4919A3617J4390J08513c6035A1398a27754A82802
$$ -265331 -19550 -133635 -142564 74919 13617 28007 136520 -36035 11398 -127754 182802
19264A2018A633J32174d8692A4868a97160d4735k12712B89936g2689L3077D9571
$$ 12018 1633 133807 -48692 14868 -197160 -44735 -257447 289936 -72689 -39612 49571
19252F1295a62563j2471f4605m61607A47827b61730B4793O9206f8416A27795e0570
$$ 61295 -162563 -175034 -64605 -526212 147827 -261730 24793 93999 -68416 127795 -50570
19240a2159k87141A10780b3133k23099Q0016j12260i4528r032k6208o0716C2241
$$ -12159 -299300 110780 -23133 -246232 -166216 -278476 -94528 -103560 -129768 -190484 32241
19228b5819j59358j90998d0720j64448A37186a26067D8636N3399b29711C4054
$$ -25819 -185177 -376175 -40720 -205168 137186 -126067 48636 102035 -229711 34054
19217G2711c17814A577J34407A4243M3087g1849c5893A29481e42531a64942B96390
$$ 72711 -317814 1577 135984 14243 57330 -71849 -35893 129481 -542531 -164942 296390
19205I6305a74402M3687I5808d17056B00798a13881B03797D0164a09775m02918
$$ 96305 -174402 -130715 95808 -417056 200798 -113881 203797 40164 -109775 -512693
19195e12693g4858A33150a00635g414j20756C9934c7864b903j81486A50223a49355
$$ -512693 -74858 133150 -100635 -7414 -128170 39934 -37864 -2903 -184389 150223 -149355
19183a34903b0456A66777H0443i6703j65610c5004o9863I6812A869a74286a5011
$$ -134903 -20456 166777 80443 -96703 -262313 -35004 -104867 96812 1869 -174286 -15011
19171a41630i863A8573e8591c515q2847k19856L9957J05186H299b99838Q8605
$$ -141630 -9863 18573 -58591 -3515 -86362 -306218 -266261 -161075 8299 -299838 -211233
19160b11233c1685B2010c57805D2965R6585f6016c1787j28476g7732k15870Q8927
$$ -211233 -31685 22010 -357805 42965 139550 -66016 -31787 -160263 -77732 -293602 -204675
19149b04675B367a45265L2447B53173R3916B5836K8930L47683A58794f850A23438
$$ -204675 2367 -145265 -112818 253173 347089 25836 54766 402449 158794 -6850 123438
19137a30581A10245a59092g6320j45941j0072A16587J49146c24546B22168g6989
$$ -130581 110245 -159092 -76320 -222261 -232333 116587 265733 -324546 222168 -76989
19126I481c02146A29761n9294R9381J11745E6949c39602A84103A9912K6458j3323
$$ 9481 -302146 129761 70467 169848 281593 56949 -339602 184103 19912 46370 33047
19115C3047j512i9485b8340E4153a68848A35334J67E7527a81725C6671h5995C02028
$$ 33047 31535 -99485 -28340 54153 -168848 135334 135501 57527 -181725 36671 -85995 302028
19102a15396a7225n8982L7366p8760j52941B73389a50198A90209E4588a68202
$$ -115396 -17225 -76207 -38841 -117601 -270542 273389 -150198 190209 54588 -168202
19091b26723h8267B24985g7317I3966a34004C0885R9054D625c6292J8109l1869
$$ -226723 -88267 224985 -77317 93966 -134004 30885 129939 4625 -36292 -18183 -50052
19080e0052C145a38660k9628l8654C9571a2301j20717c7303l889j01575j02285
$$ -50052 3145 -138660 -168288 -206942 39571 -12301 -133018 -37303 -41192 -142767 -245052
19069b45052M2754A62816a4938m36685c6320j04973B87164b88956P7199D6904
$$ -245052 -202298 162816 -14938 -451623 -36320 -141293 287164 -288956 -211757 46904
19058A94108a76665A73826P2785i7307K15F6882C2978a9976A6920R2423a9623
$$ 194108 -176665 173826 246611 -97307 -97092 66882 32978 -19976 16920 109343 -19623
19046A57791c58811J76901l01421G2892a73506b254H8147a15666j35587j40528
$$ 157791 -358811 -181910 -483331 72892 -173506 -2254 88147 -115666 -251253 -391781
19036c91781a71169M8199M0518a1516F0236J72324B3968a17308b3358j44820H2052
$$ -391781 -171169 -122970 -82452 -11516 60236 232560 23968 -117308 -23358 -168178 82052
19024i2483F0672L81292b73090L59A22255L6465c7525B66c7362j00886D7251b6069
$$ -92483 60672 441964 -273090 -272731 122255 158720 -37525 266 -37362 -138248 47251 -26069
19011c28123a709A90342a55962I109h4280r4504b358q188j01532o4838J43B05537
$$ -328123 -1709 190342 -155962 9109 -84280 -178784 -2358 -10546 -112078 -176916 -176773 205537
18998G4978b9094j38414Q439A20717b3181q1769G3311d4415k27538j74067B61514
$$ 74978 -29094 -167508 -159069 120717 -23181 -104950 73311 -44415 -271953 -446020 261514
18986A27747g5430D9978a01988j04853g9715A28529a2624r9813C46596b81377
$$ 127747 -75430 49978 -101988 -206841 -79715 128529 -12624 -112437 346596 -281377
18975F215J59622c1871l91389b10896k941j28119g0461A07915K51237j17343b99212
$$ 6215 165837 -31871 -423260 -210896 -213837 -341956 -70461 107915 359152 241809 -299212
18963F4872a21688r9093A2862m474c24703Q1909J17521e2197j97411A91082a76028
$$ 64872 -121688 -220781 12862 8388 -324703 -242794 -125273 -52197 -249608 191082 -176028
18951a04207F5030e0817B19797c5125j08870l384c1002I4462M8861p645D2731
$$ -104207 65030 -50817 219797 -35125 -143995 -147379 -31002 94462 143323 135678 42731
18939A14264k9570d8418j23327r6577j81258a87422M5753B8614b01023j26037
$$ 114264 84694 -48418 -171745 -268322 -449580 -187422 -141669 28614 -201023 -327060
18929c27060c122E1683a73641O9986E8985a73237A1493L21394a20144k3139m1170
$$ -327060 -3122 51683 -173641 -103655 58985 -173237 11493 332887 -120144 -143283 -184453
18918a84453O0514D2391J86323e0239j08257e5718j97197A27653a694j2203j82798
$$ -184453 -123939 42391 228714 -50239 -158496 -55718 -252915 127653 -1694 -13897 -196695
18907a96695d8701j49275n0713A26437B9503c83538A19242d6082k4821b0873B8104
$$ -196695 -48701 -197976 -248689 126437 29503 -383538 119242 -46082 -70903 -20873 28104
18895f3280A94465b59950a11582R374A80960B302a58157P3119q1629M5073j24964
$$ -63280 194465 -259950 -111582 -102208 180960 2302 -158157 -85038 -166667 -121594 -246558
18884b46558A8548h732j38460c5214m8666b369l2668k63349B23348l531q4159
$$ -246558 18548 -8732 -147192 -35214 -83880 -2369 -35037 -298386 223348 219817 135658
18873A35658a88929d1947C7833J28797h742j89070L3785O6548A54367E7519c36445
$$ 135658 -188929 -41947 37833 166630 -8742 -197812 -164027 -97479 154367 57519 -336445
18861g590A54630b51319J08591J6813A47607f8605m4230A01233m9410J26691J24672
$$ -7590 154630 -251319 -142728 -125915 147607 -68605 -112835 101233 51823 178514 303186
18850C03186h8576j25994Q8132j41529I7275b61509a02113J724c7685A38993P2677
$$ 303186 -88576 -214570 -126438 -267967 97275 -261509 -102113 -100389 -37685 138993 211670
18839B11670N3817D4927a58903r9804G7518P1839O190c90993a54210q915G1805
$$ 211670 265487 44927 -158903 -258707 77518 149357 155547 -390993 -154210 -163125 71805
18827A16766C8679N0255a03935D8661f0091A92414I567J12605J44560J14904i5813
$$ 116766 38679 88934 -103935 48661 -60091 192414 9567 122172 266732 381636 -95813
18815a47728A0245M0686b9290B17798H9718J9277g8854K8482b2564j57734j3550
$$ -147728 10245 50931 -29290 217798 89718 108995 -78854 -50372 -22564 -180298 -193848
18804a93848Q4034D7553J10931a33750p6360B43577b14444C1688e4642k01101
$$ -193848 -109814 47553 158484 -133750 -210110 243577 -214444 31688 -54642 -255743
18794b55743A21128m4875a80372M2541D10234b92046J29905d2312m58977B62703
$$ -255743 121128 76253 -180372 -137831 410234 -292046 -162141 -42312 -501289 262703
18783i3902p7948Q205f5700A06277b08054k7196B3871n91e6392b7580j15821L3805
$$ -93902 -171850 -163645 -65700 106277 -208054 -235250 23871 23280 -56392 -27580 -143401 -109596
18771a09596A35233e1794e972F0875a85654Q3930J4325A44626Q309a29525D2529
$$ -109596 135233 -51794 -5972 60875 -185654 -101724 -87399 144626 152935 -129525 42529
18759A45842c36350a4944m1343A4887c02173F3340E529i0346B17594r3309a53787
$$ 145842 -336350 -14944 -56287 14887 -302173 63340 5529 -90346 217594 124285 -153787
18747a05995D2112a11133A89811F2648J61723d27793a79806L8944M7680B83501
$$ -105995 42112 -111133 189811 62648 224371 -427793 -179806 -140862 -93182 283501
18736F8665B7184M96941i811k9172j88552G1378h0577m424l0768B5584J31687
$$ 68665 27184 524125 -9811 -38983 -227535 71378 -80577 -85001 -115769 25584 157271
18725A57271g3307e9C1480a52463j70783j9840C3493A5796a33044B0558c27073
$$ 157271 -73307 -59 31480 -152463 -323246 -343086 33493 15796 -133044 20558 -327073
18713B11309G9124b75414f1844m43348J84015e5736k72290a50646j20786B24629
$$ 211309 79124 -275414 -61844 -505192 -321177 -55736 -328026 -150646 -271432 224629
18702A3014c18960A58563a90169A15306O9165p5226N8833n4189J26597a70926
$$ 13014 -318960 158563 -190169 115306 184471 109245 168078 113889 240486 -170926
18691a11657l5278H6247a22270G9086C3008b91167a19275A80682d867m5616j41414
$$ -111657 -146935 86247 -122270 79086 33008 -291167 -119275 180682 -4867 -50483 -191897
18680a91897E2611N023a07412J1257o6371A03905a43359k50582C7531K18286g4849
$$ -191897 52611 57634 -107412 -96155 -162526 103905 -143359 -393941 37531 255817 -74849
18668A82633B155b1632r5246j85881e1943j4655J3097K2484l3517K9559E3330
$$ 182633 2155 -21632 -116878 -302759 -51943 -66598 -53501 -31017 -64534 -34975 53330
18656H5452b7135k79673k670D7690a98557L918i0631l02901A86100H0808a80018
$$ 85452 -27135 -306808 -309478 47690 -198557 -194639 -90631 -393532 186100 80808 -180018
18644d69363A5772e805P2k20706m6922P5630A9665J12795a61341j30543A5367
$$ -469363 15772 -5805 -5733 -226439 -273361 -197731 19665 132460 -161341 -291884 15367
18632d15049A14053b06994C45819c08886J15878b2524k49682I5683R7696a97575
$$ -415049 114053 -206994 345819 -308886 -193008 -22524 -272206 95683 193379 -197575
18621d97203e5670A28638a51190A16013b66758a18825m5516j07595M9817A98487
$$ -497203 -55670 128638 -151190 116013 -266758 -118825 -164341 -271936 -222119 198487
18610c10413G8214c59376C00211e03675A07081l0844c7910j47659j18893K822
$$ -310413 78214 -359376 300211 -503675 107081 76237 -37910 -185569 -304462 -301640
18600c01640J40552l7130K2702l26486I0549b20407C626a12920C2521F337k830
$$ -301640 -161088 -198218 -175516 -502002 90549 -220407 3626 -112920 32521 6337 3507
18589C507d6077l45292i8045k23163J7928I6620R6563K7651h6657r5232e8759
$$ 3507 -46077 -391369 -98045 -321208 -303280 96620 193183 220834 -86657 -181889 -58759
18577A30302k9657f0000j03537k02838D48620a00695o4443F6000M6553B1873O375
$$ 130302 100645 -60000 -163537 -366375 448620 -100695 -165138 66000 112553 21873 28248
18566B8248a64061a3685j04425j70729A15751J19967b73374q1093g5077j88489
$$ 28248 -164061 -13685 -118110 -288839 115751 235718 -273374 -354467 -75077 -263566
18556b63566a11901D9476M2225a26116a0971B6464f2328e533p8951q7660I8539
$$ -263566 -111901 49476 91701 -126116 -10971 26464 -62328 -5533 -84484 -172144 98539
18544C185a17455l0056n600m9457j9838A49227c37594A73451F9729J40655E8511
$$ 3185 -117455 -147511 -153111 -202568 -222406 149227 -337594 173451 69729 210384 58511
18532A28885c03703a3622l19503I3065a25355A766g2334j03121n3798D4050a88674
$$ 128885 -303703 -13622 -333125 93065 -125355 1766 -72334 -175455 -229253 44050 -188674
18520a32076G0443R0910a05576j53715h3025A82909H7955a47988j86825H0601
$$ -132076 70443 161353 -105576 -259291 -83025 182909 87955 -147988 -334813 80601
18509C3492J69606a97521D4304b00192c742j65614d3876k7338k56899A38875n7574
$$ 33492 203098 -197521 44304 -200192 -3742 -169356 -43876 -71214 -328113 138875 81301
18498H1301c28177C54990a27158A03496a28310k663a2849k37172G3765j0813J47048
$$ 81301 -328177 354990 -127158 103496 -128310 -130973 -12849 -250021 73765 62952 210000
18487B10000c0306j85476n3697m0382a17710A88317N6467g9003B22842D6007c50843
$$ 210000 -30306 -215782 -269479 -309861 -117710 188317 244784 -79003 222842 46007 -350843
18475f5696l70662I6843b04969A39111h5989j06900B6604a1692j7907A24585E3058
$$ -65696 -436358 96843 -204969 139111 -85989 -192889 26604 -11692 -29599 124585 53058
18463g1216A73912g7883B0743b20060C0234a90903j55488a11344L6626i1p9294
$$ -71216 173912 -77883 20743 -220060 30234 -190903 -346391 -111344 -74718 -91 -79385
18452g9385I0989d4725k96620d1209A75829n3226J31053I6057b1156C15646n9024
$$ -79385 90989 -44725 -341345 -41209 175829 122603 253656 96057 -21156 315646 256622
18441B56622f5011D2437e4280A09070a2184A18090Q3356b28692e4607A32802e5664
$$ 256622 -65011 42437 -54280 109070 -12184 118090 201446 -228692 -54607 132802 -55664
18429C4033a23423b5617l26831a73083g0604C35809d7963A34403J4883F1550a19940
$$ 34033 -123423 -25617 -352448 -173083 -70604 335809 -47963 134403 149286 61550 -119940
18417D77582A0035J22182a26809a8674k74192B38851A7317G330K1517D145g7663
$$ 477582 10035 132217 -126809 -18674 -292866 238851 17317 7330 28847 4145 -77663
18405D5362h1303G4766a36223N4823G4107a62486c6520B5048e0949E3732N8956
$$ 45362 -81303 74766 -136223 -81400 74107 -162486 -36520 25048 -50949 53732 112688
18394A12688M8022a0945A15324C5675h6878l447p2491C1840b33598J04330J7850
$$ 112688 160710 -10945 115324 35675 -86878 -90325 -162816 31840 -233598 -129268 -111418
18383a11418A71252H1028a00948D263b6354A16683M5479e3525B50745D5576c1095
$$ -111418 171252 81028 -100948 4263 -26354 116683 162162 -53525 250745 45576 -31095
18371D5268E503b8806H4180a31937B82125D9307K8357b75356K3617d9212J1197
$$ 45268 5503 -28806 84180 -131937 282125 49307 77664 -275356 -251739 -49212 -38015
18360c8015a4390B46852d76083a50576l4148I8483b07972B43929b42778A77197
$$ -38015 -14390 246852 -476083 -150576 -184724 98483 -207972 243929 -242778 177197
18349A1565a82884E8077a11731r3159P7750m6243p224B04019c60245B6569a80498
$$ 11565 -182884 58077 -111731 -204890 -127140 -173383 -180607 204019 -360245 26569 -180498
18337A39939i0233j19838C00270a11471E0187b57575j35379P5359A7747c6956
$$ 139939 -90233 -210071 300270 -111471 50187 -257575 -392954 -317595 17747 -36956
18326B48897h6408A03268a98533K6714H7548J22365q651q4101b98377i9382B67666
$$ 248897 -86408 103268 -198533 -171819 87548 209913 201262 117161 -298377 -99382 267666
18314b42276G4939g8098D2939O7307b60479O0774B4479J0387b29138P2862n3760
$$ -242276 74939 -78098 42939 110246 -260479 -199705 24479 34866 -229138 -156276 -210036
18303b10036f0339k04075a28463e0576e286q3185n3742K3334A28715a3461G886
$$ -210036 -60339 -264414 -128463 -50576 -5286 -88471 -142213 -118879 128715 -13461 7886
18291b05887B3902c48093d9847B29067c3611r9656m4729k94897a53891G3547b66767
$$ -205887 23902 -348093 -49847 229067 -33611 -133267 -177996 -472893 -153891 73547 -266767
18279A03368b92621m6023D9696b3794C67828a78982A76618c32024a24765A7326
$$ 103368 -292621 -338644 49696 -23794 367828 -178982 176618 -332024 -124765 17326
18268F922a51729O3019F0152K2686H210L8017M6563H520P8534A6042b66878E914
$$ 6922 -151729 -88710 60152 82838 8210 46227 92790 8520 87054 16042 -266878 5914
18255a45735r0631P6823D9015L64574b98364e7304B55979A01518D630O9429c46085
$$ -145735 -236366 -159543 49015 413589 -298364 -57304 255979 101518 4630 74059 -346085
18243a05205l60595a08806j82364A49752J48203a35843K2006q6235I1059g0212
$$ -105205 -465800 -108806 -291170 149752 297955 -135843 -113837 -200072 91059 -70212
18232a03370l8564j41460d4776a321A07495b6309j29936E8389b912m3399j23793
$$ -103370 -141934 -283394 -44776 -1321 107495 -26309 -156245 58389 -2912 -46311 -170104
18221a70104k57668A74180F2586e19B26345a2857j49220E363a53877k0049I5642
$$ -170104 -427772 174180 62586 -519 226345 -12857 -162077 5363 -153877 -173926 95642
18209g871G2777O6224g8277k10084B62940f9202j18156G8554a90558d6010A00593
$$ -7871 72777 139001 -78277 -288361 262940 -69202 -187358 78554 -190558 -46010 100593
18197a25991J505J4785p023J350D2032a46076d4474o7694n8687B39652a33873
$$ -125991 -124486 -109701 -116724 -115374 42032 -146076 -44474 -112168 -170855 239652 -133873
18185g6743F1917h468A39359b07256b0405l74665g9940j16470j68042j29195b9801
$$ -76743 61917 -8468 139359 -207256 -20405 -395070 -79940 -196410 -364452 -493647 -29801
18173a13705A17523d7637H9282k3193J24799J3462c74285G2169A5831Q7721a78206
$$ -113705 117523 -47637 89282 66089 190888 204350 -374285 72169 15831 103552 -178206
18161b92082A75865D8364J90686j02061a00153l67828d353H5816b71835J6284
$$ -292082 175865 48364 239050 136989 -100153 -467981 -4353 85816 -271835 -255551
18151b55551A35123b3425A58988a57064K6666H3241J17123R6124c39301E3508
$$ -255551 135123 -23425 158988 -157064 -130398 83241 200364 296488 -339301 53508
18140b25073L9449A5397a0128k2335k17472A7592L41378a14622c3624A96886C5997
$$ -225073 -185624 15397 -10128 -32463 -249935 17592 358970 -114622 -33624 196886 35997
18128B19792b01724k9969b5703B75385d34510I7832J96588A04295g7669A14719
$$ 219792 -201724 -231693 -25703 275385 -434510 97832 294420 104295 -77669 114719
18117A29725l3999c00909B53594e6214k16933a9210H4839L1800a81966A39569
$$ 129725 95726 -300909 253594 -56214 -273147 -19210 84839 116639 -181966 139569
18106a94199R304j74298A13472K2054a70183I5287a88390G8543J08219d11081
$$ -194199 -184895 -359193 113472 135526 -170183 95287 -188390 78543 186762 -411081
18095B68684A16235a33122A64370d26873K11744A34047a23224d5059k3575A04501
$$ 268684 116235 -133122 164370 -426873 -215129 134047 -123224 -45059 -68634 104501
18084i3185A96458a11575G0271K850A9869a3710r8220b0059k02097g2068k11658
$$ -93185 196458 -111575 70271 73121 19869 -13710 -111930 -20059 -222156 -72068 -283726
18073b83726K5125c0368A43390J02429A03302j1475b98139A46770a26689e7675
$$ -283726 -258601 -30368 143390 245819 103302 91827 -298139 146770 -126689 -57675
18062C38108A08899g2437A17792a06900B09939E4519b84630i8700K3984B34740
$$ 338108 108899 -72437 117792 -106900 209939 54519 -284630 -98700 -74716 234740
18051A37894a43818B03533J97923G6823g7339J2782j97282B3458b03139H4053
$$ 137894 -143818 203533 401456 76823 -77339 -64557 -261839 23458 -203139 84053
18040A26373b56017H9963J65064a08223B9997A418c61194I0495B7407A0384a10017
$$ 126373 -256017 89963 255027 -108223 29997 1418 -361194 90495 27407 10384 -110017
18028c04359H2267K11429a72066L1767p9811B85677L383e8899o6463C9808a69491
$$ -304359 82267 293696 -172066 -140299 -220110 285677 289060 -58899 -125362 39808 -169491
18016A5177c43904A03268R0480b20951j2295d6492l71238B29239a25105m3756
$$ 15177 -343904 103268 193748 -220951 -233246 -46492 -417730 229239 -125105 -168861
18006a68861A13015f109q10p5220E7099b27757D169a32101G5822b6457k5112L100
$$ -168861 113015 -6109 -6919 -82139 57099 -227757 4169 -132101 75822 -26457 -51569 -48469
17994d8469k47761a48056j6599A25226b82514K8235A66915J25045b72732B40965
$$ -48469 -296230 -148056 -164655 125226 -282514 -254279 166915 291960 -272732 240965
17983a53060B70585D1838j6880J45145B0202a65812B8203J0493a6895k3498D11425
$$ -153060 270585 41838 24958 170103 20202 -165812 28203 38696 -16895 -40393 411425
17971a47111r653p4666J13416K2712d1697m10696A41843E2057h8911j13939j064
$$ -147111 -156764 -231430 -118014 -95302 -41697 -452393 141843 52057 -88911 -202850 -203914
17960b03914r9307a47483A24315a70296F5868K35716D6382P7078J16873c712m0120
$$ -203914 -303221 -147483 124315 -170296 65868 301584 46382 123460 240333 -3712 -43832
17949d3832r4508k88459C7387J07328b9229C2105g3724A38079d6322n4674l18004
$$ -43832 -138340 -426799 37387 144715 -29229 32105 -73724 138079 -46322 -100996 -419000
17938d19000i0833A71176i7288K5827E4657O4720d3752k5040A70204c16689J04474
$$ -419000 -90833 171176 -97288 -71461 54657 119377 -43752 -68792 170204 -316689 -212215
17927b12215B04456q6840c07228C8879P9991b34389H3825J73727I2012K55044
$$ -212215 204456 117616 -307228 38879 118870 -234389 83825 257552 92012 347056
17917C47056b32369E3286c18354a23549j4349f4351K0289I1668J79849j15624
$$ 347056 -232369 53286 -318354 -123549 -137898 -64351 -44062 91668 271517 155893
17907A55893c11393B08707A886J42673f6742A26667C7682f7024C53063h1282r2300
$$ 155893 -311393 208707 1886 144559 -66742 126667 37682 -67024 353063 -81282 -173582
17896a73582l93485a32637r6320j14440G7551J65917D4408a36025l831B69909
$$ -173582 -567067 -132637 -228957 -343397 77551 243468 44408 -136025 -139856 269909
17885B95677I9702B1435b08951g4555C34879G5885b68922p3397c4169a1896j34550
$$ 295677 99702 21435 -208951 -74555 334879 75885 -268922 -342319 -34169 -11896 -146446
17874a46446f642j34782L5675r8798G9942J76386f0285k00682J28435f0702A11896
$$ -146446 -6642 -141424 -105749 -204547 79942 256328 -60285 -260967 -132532 -60702 111896
17862e5596A76127e7290j04910A73176J79002A23581L3759d1534j26445l8943
$$ -55596 176127 -57290 -162200 173176 352178 123581 157340 -41534 -167979 -206922
17852b06922N3237A35092a58102k266j50654a52667k12136h617A20385C9751a24167
$$ -206922 -153685 135092 -158102 -160368 -311022 -152667 -364803 -8617 120385 39751 -124167
17840a98295K3755J247H4814M9032d2732C99429b56494J4005E3603A4230L9016
$$ -198295 -174540 -173293 84814 133846 -42732 399429 -256494 -242489 53603 14230 53246
17829E3246K2054K7794b18184j81969D0053a89107D2709h1083j95298A90362f7842
$$ 53246 75300 103094 -218184 -400153 40053 -189107 42709 -81083 -276381 190362 -67842
17817C20487A21670A5518J58912C3606a73272A01054a27945A28278q40i2273o9355
$$ 320487 121670 15518 174430 33606 -173272 101054 -127945 128278 127438 -92273 -161628
17806a61628A54868E8617i0386A83860d0855l8903J4081B85200A18808N6802a41402
$$ -161628 154868 58617 -90386 183860 -40855 -79758 -65677 285200 118808 175610 -141402
17794a52351E8988a16222D5436K13250b63728A28271J03590D2264a61623A52503
$$ -152351 58988 -116222 45436 258686 -263728 128271 231861 42264 -161623 152503
17783B21066d0991A67384a82960h5800C26862j46584J5628p6337F986a52975I026
$$ 221066 -40991 167384 -182960 -85800 326862 180278 195906 119569 6986 -152975 9026
17771a55159M6101A43284a86759d8673G2560b03480A4760c06610A01240J09993
$$ -155159 -109058 143284 -186759 -48673 72560 -203480 14760 -306610 101240 211233
17761B11233H1865h6133p2313b6580k61489B30458h2683B21699m1036a31771M3336
$$ 211233 81865 -86133 -158446 -26580 -288069 230458 -82683 221699 180663 -131771 -88435
17750h8435m7239B31818b14176j7318P9595B7999N4433i3322J6828m0921G9925
$$ -88435 -135674 231818 -214176 -231494 -151899 27999 82432 -93322 -76494 -117415 79925
17738B62284A26710C2028j5940a27120A24369h775K207D2630b9662A50016a90236
$$ 262284 126710 32028 16088 -127120 124369 -8775 -6568 42630 -29662 150016 -190236
17726H3065K00554i2540A91402C4968i605B09147G67a87079Q9928C3770f9986
$$ 83065 283619 -92540 191402 34968 -9605 209147 767 -187079 -97151 33770 -69986
17714D7853d6193D944a52678f1486F5424J69086a08851A47389D3994J18722d3966
$$ 47853 -46193 4944 -152678 -61486 65424 234510 -108851 147389 43994 162716 -43966
17702A67209a2687A24385c49710A49042c51947g2056r9263b550k89395d0891B10813
$$ 167209 -12687 124385 -349710 149042 -351947 -72056 -171319 -2550 -291945 -40891 210813
17690b20762A349b92110A00554j0096a24888D8846R1679J0472b68095J04679B9795
$$ -220762 1349 -292110 100554 90458 -124888 48846 140525 150997 -268095 -163416 29795
17678C2741J9078F771f0596D6336J96359B3498Q5349m640J98331C1545J68504
$$ 32741 51819 6771 -60596 46336 242695 23498 108847 104207 302538 31545 200049
17667B00049a6234l30182a13508A40096b03526E7526Q1860b58947e4970A6244
$$ 200049 -16234 -346416 -113508 140096 -203526 57526 139386 -258947 -54970 16244
17656B61894q3850G7513b24427B24618f1801j2007A38177Q2726B8527K37847l2786
$$ 261894 178044 77513 -224427 224618 -61801 -73808 138177 220903 28527 266374 233588
17645B33588d3591A7426M27580a85902M6711B33445b04263A21825O2804n9173
$$ 233588 -43591 17426 445006 -185902 -139191 233445 -204263 121825 184629 125456
17635A25456J23613H289J06893h609G6303e6380D7758P2379J31319I9474O5448
$$ 125456 249069 8289 115182 -8609 76303 -56380 47758 120137 251456 99474 164922
17624A64922h2890A54663M3673P113a76987J3063H568J77512J03799J35758b60437
$$ 164922 -82890 154663 198336 205449 -176987 -163924 8568 186080 289879 425637 -260437
17612h9925A8116K32607j0692e9542j01644B32605I8789P9514D139a6942o970
$$ -89925 18116 250723 240031 -59542 -161186 232605 98789 178303 4139 -16942 -23912
17601b3912k09311a1001k81646J9782I4200l0375P2700b22906A2621N8146b66397
$$ -23912 -233223 -11001 -292647 -272865 94200 63825 136525 -222906 12621 70767 -266397
17589A24254d4752j62430b2352D0892K7033B246g2916A44984n6959J22024d04176
$$ 124254 -44752 -207182 -22352 40892 67925 2246 -72916 144984 88025 210049 -404176
17577a81673D53623A64630p6407R739e0482A28687a9851H3954O412N66I758b07417
$$ -181673 453623 164630 88223 97962 -50482 128687 -19851 83954 90366 90932 9758 -207417
17564G6899D820Q3144a71694E5402a61380j85509B36518a54569e4794j97627a23802
$$ 76899 4820 87964 -171694 55402 -161380 -346889 236518 -154569 -54794 -252421 -123802
17552A87779a7063D0435N7706B5846J25335n6490h8141c7829A40914a59156O1854
$$ 187779 -17063 40435 98141 25846 151181 94691 -88141 -37829 140914 -159156 -97302
17541i7302J5841I8924R4718k8751l2112b27131H5283J0266m0125m147c9753B38461
$$ -97302 -81461 98924 193642 164891 132779 -227131 85283 95549 55424 51277 -39753 238461
17528A86749n1991A4900c05738E8040j9464j130a11621A15383a05777A84654E1198
$$ 186749 134758 14900 -305738 58040 38576 37446 -111621 115383 -105777 184654 51198
17516A87709b98026F34473G2559P0193A9223b0815q7494I4687J61296g720A99832
$$ 187709 -298026 634473 72559 142752 19223 -20815 -108309 94687 255983 -7720 199832
17504b8381j5616m0458h962A27360J22421M9823B7670a89615k5639e584B80482
$$ -28381 -43997 -84455 -8962 127360 249781 299604 27670 -189615 -215254 -5584 280482
17492b4747E1404J50235G3435J05619m6906D9709J20262e960k68175a18447C87699
$$ -24747 51404 201639 73435 179054 132148 49709 169971 -5960 -274135 -118447 387699
17480I3621K2581E711K87310B4689L87381A70936a42920E4586M10287A84928b1274
$$ 93621 116202 5711 293021 24689 412070 170936 -142920 54586 464873 184928 -21274
17468c71110a59268B08155H3234o278a39243e2933B13884M11693F416O1629b12748
$$ -371110 -159268 208155 83234 76956 -139243 -52933 213884 625577 6416 68045 -212748
17456C9788K1487R0035L87231A01678a8094C89182A38594L99096A18695M14069
$$ 39788 61275 151310 538541 101678 -18094 389182 138594 537690 118695 532764
17446E32764B43270c7398A88212q4901C6087L81588q6441Q5995A41662d4193A58613
$$ 532764 243270 -37398 188212 103311 36087 417675 331234 417229 141662 -44193 158613
17434C51722j06741r3999J93182d035B16287p0315Q1533p0149J45997b45087B61809
$$ 351722 244981 150982 344164 -4035 216287 145972 227505 157356 303353 -245087 261809
17422D22812B06533K06134H7203J39338l7890O9907K4767j7155E6849K06046O415
$$ 422812 206533 412667 87203 226541 188651 258558 283325 266170 56849 262895 269310
17411B69310r0410j447N8130k2889I6864A3281K15577b59250B0664K24548C9835
$$ 269310 178900 177453 235583 212694 96864 13281 228858 -259250 20664 245212 39835
17399C0467O7445J83061j23101e9518D24005B1297K88019j30258J1849a29582
$$ 30467 97912 280973 157872 -59518 424005 21297 309316 179058 190907 -129582
17388C14759l5892A9496L17783a85400D1713J02291i9292D00878D8662J74401
$$ 314759 278867 19496 337279 -185400 41713 144004 -99292 400878 48662 223063
17378B23063F3245J16982L16445k09063k1149q1002I1866J95714j40654O0141
$$ 223063 63245 180227 496672 287609 266460 185458 91866 287580 146926 207067
17368B07067G2306A149J69754R2050D8623R8954a8091C0487Q0715L02270i7516
$$ 207067 72306 1149 170903 262953 48623 147577 -18091 30487 111202 413472 -97516
17356b09145a6713B54229A16966c6746C01561C4023M0383O685O2907p1937J74895
$$ -209145 -16713 254229 116966 -36746 301561 34023 74406 81091 143998 72061 246956
17345B46956r7862P560f198F4968g2293B21507M239a58304l7590D97537A44193
$$ 246956 149094 156654 -6198 64968 -72293 221507 225746 -158304 -195894 497537 144193
17333C21000J07789A14779D9626B900P9452K34999r6366H3810K04445j42153k3419
$$ 321000 428789 114779 49626 2900 82352 317351 220985 83810 288255 146102 122683
17322A22683J18157I2299A9098K24736k473m6914a06918E8055J23977a615H3456
$$ 122683 240840 92299 19098 243834 241361 194447 -106918 58055 182032 -1615 83456
17310a3424A10378N1140Q3152j18899a1461A32202J05572K68960A87215J8651
$$ -13424 110378 161518 244670 125771 -11461 132202 237774 506734 187215 205866
17300B05866R5552K6010m750a12238d7908A84012D4603K22772J14539j72640L9971
$$ 205866 301418 327428 322678 -112238 -47908 184012 44603 267375 381914 209274 249245
17289B49245a59005A07103O4518J09928d1516B55360m5409D0625a0307C24456
$$ 249245 -159005 107103 171621 281549 -41516 255360 209951 40625 -10307 324456
17278B53443J81552A60504a73042F6161K04174I3882K82672a92885d0266O290
$$ 253443 434995 160504 -173042 66161 270335 93882 376554 -192885 -40266 -33976
17268c3976C26637K6330G6310J15384R4270G7228P8311k5153F4767K92043A4799
$$ -33976 326637 352967 76310 191694 285964 77228 155539 130386 64767 356810 14799
17256B25974h7819A87256Q4027D3506b4937A63219c1772n5096b078E2500K02370
$$ 225974 -87819 187256 271283 43506 -24937 163219 -31772 -86868 -2078 52500 254870
17245B54870C2615a7750A32269j1907i0484C29860p8460A24530N397J18346r1286
$$ 254870 32615 -17750 132269 120362 -90484 329860 251400 124530 129927 248273 156987
17234A56987K2318c8429D37271A39639o2395J26335L1014J55300q2406e9240A69274
$$ 156987 179305 -38429 437271 139639 77244 203579 234593 389893 307487 -59240 169274
17222B44515L1971O819J10686j46485N0283H2118L82901j48972j14470l9885Q6337
$$ 244515 276486 283305 393991 247506 297789 82118 465019 316047 201577 161692 248029
17211B48029J8167K67825A03590L93071m0371A13876n4473J12483J47618m4989
$$ 248029 266196 534021 103590 496661 456290 113876 59403 171886 319504 274515
17201B74515p9096J59526p4001A2153K29052k4580k0646O1594J60215e2679B04663
$$ 274515 195419 354945 280944 12153 241205 216625 195979 257573 417788 -52679 204663
17189B82195C2221A0636J77831b836B33325j05364k5322c4755D14658r2765b9622
$$ 282195 32221 10636 188467 -2836 233325 127961 102639 -34755 414658 321893 -29622
17177B26118J01594G0494J79515J66036n8033l3808K70477I4029J74638J12270
$$ 226118 327712 70494 250009 416045 358012 324204 594681 94029 268667 380937
17167C80937i5069A40307Q4569J77344A36550O5355m8697A7265J96289K05081
$$ 380937 -95069 140307 224876 402220 136550 201905 153208 17265 213554 418635
17157D18635A49705J3715J24078d9457B84340j3766N6707A43354J39287m8824
$$ 418635 149705 163420 287498 -49457 284340 270574 327281 143354 282641 233817
17147B33817k9178E5276M92258j00320p4915m1148M6680C0970J85402K44750Q5339
$$ 233817 204639 55276 547534 447214 372299 331151 377831 30970 216372 461122 546461
17136E46461B07946n06J28582j1782r4727r5813Q8379A3579L36444j58695L84869
$$ 546461 207946 207440 336022 324240 229513 133700 222079 13579 350023 191328 576197
17125E76197j76448A88376o4716J66193R512R4908a50714C54302L5015A70357
$$ 576197 399749 188376 123660 289853 299365 394273 -150714 354302 389317 170357
17114A30203n6937J29461M2449K04927m8839K3208A98728L80623j06270j09098
$$ 130203 73266 202727 245176 450103 401264 424472 198728 579351 473081 363983
17104C63983O3800J69058r3464N3249O8640B77879J27476J06167k24383N13070
$$ 363983 427783 596841 503377 556626 625266 277879 405355 511522 287139 800209
17094H00209B20158J13001L9689j0400K33551J00748n269J8450j65262e140D35424
$$ 800209 220158 333159 372848 362448 595999 696747 691478 709928 544666 -5140 435424
17082B48093M94168l4208l46333J202A70675K63367J12914n2172j46718l4504
$$ 248093 742261 708053 361720 362922 170675 434042 546956 494784 348066 313562
17072C13562A49977L77273M4393j03155K78630E80J55193M12324k26238j4511
$$ 313562 149977 527250 571643 468488 747118 580 155773 568097 341859 327348
17062C27348o8730L29267R4731k60535J26175j10381k02554J57091M27245j25292
$$ 327348 258618 587885 682616 422081 548256 437875 235321 392412 819657 694365
17052F94365n1225j97878L3660M9992l866k11809K12259J4096j26033N4177J38084
$$ 694365 643140 445262 478922 528914 525048 313239 525498 539594 413561 467738 605822
17041F05822p2355J52688J42427J24301C80444m6155J18106L7547j28369J95915
$$ 605822 533467 686155 828582 952883 380444 334289 452395 489942 361573 557488
17031E57488j13118M5658j04875J37151L13817j79357k20061A25210N64174p5117
$$ 557488 444370 490028 385153 522304 836121 656764 436703 125210 689384 614267
17021F14267J97962k40712l2149K41116l58459M01996j67749j12095P1704J02335
$$ 614267 812229 571517 539368 780484 422025 824021 656272 544177 615881 718216
17011G18216l03578O8549R9099K30689Q4042k50568L88118D62965k13174N98668
$$ 718216 414638 483187 582286 812975 897017 646449 1034567 462965 249791 848459
17001H48459j41550q080p3388r3245L34804k80473K21917k489k30979L98625r2590
$$ 848459 706909 698829 625441 532196 867000 586527 808444 805955 574976 973601 881011
16990H81011Q238P8792k1210J17710l65696q773P384J24506L88361n70755j12938
$$ 881011 889249 968041 946831 1064541 698845 690072 697456 821962 1210323 639568 526630
16979E26630n339L1524O49441m1934j75495k27395m1080R5213K23466m6070L70898
$$ 526630 521291 552815 1202256 1160322 984827 757432 716352 811565 1035031 988961 1359859
16968A359859m92404M5208n4312Q9681k5195Q9704k54331J06435K05411R2225
$$ 1359859 867455 912663 858351 948032 922837 1012541 758210 864645 1070056 1162281
16958A162281r7353j586p8691k64874K10355j11291K63354K86329m56690J21283
$$ 1162281 1064928 1063342 984651 719777 930132 818841 1082195 1368524 911834 1033117
16948A033117O6331N0829l7438L66544n79892K76541J40127p3938k60082j8442
$$ 1033117 1099448 1150277 1112839 1479383 899491 1176032 1316159 1242221 982139 963697
16938I63697r1697N74025k04281L5492P0166j03358K0067j72049J98790k03437
$$ 963697 872000 1446025 1241744 1277236 1347402 1244044 1264111 1092062 1290852 1087415
16928A087415m6703k08345N76741j56164k28220L48562K00796l50120j29568K30073
$$ 1087415 1040712 832367 1409108 1252944 1024724 1373286 1574082 1223962 1094394 1324467
16918A324467M5109J03220l6920j32158M016K25587P6279j22404j18163L70714
$$ 1324467 1369576 1472796 1435876 1303718 1307734 1533321 1609600 1487196 1369033 1739747
16908A739747j778j07420J51412j14993M7827j02972l8322K08779k1728j9719
$$ 1739747 1737969 1630549 1781961 1666968 1714795 1611823 1573501 1782280 1760552 1740833
16898A740833J4287K35963l85626L33910l66515K89434m67030N89431j44257J76789
$$ 1740833 1755120 1991083 1605457 1939367 1572852 1862286 1395256 1984687 1840430 2017219
16888B017219J67890l89174N25740j81781l69366L41040K7688m4584j37552L33900
$$ 2017219 2185109 1795935 2321675 2139894 1770528 2111568 2139256 2094672 1957120 2291020
16878B291020j15382J33108l21712O48M91276l15448L53356J44603p3320k78578
$$ 2291020 2175638 2308746 1987034 1987682 2478958 2163510 2516866 2661469 2588149 2309571
16868B309571J15870J73664j55426R5938j55836K41413K25622J37435j79153M89816
$$ 2309571 2425441 2599105 2443679 2539617 2383781 2625194 2850816 2988251 2809098 3298914
16858C298914l52212j18771o8614L28305k69378N99271j21493K67161l06760R0142
$$ 3298914 2946702 2827931 2759317 3087622 2818244 3417515 3296022 3563183 3256423 3346565
16848C346565L51157l19774k19875N47091O6027k48146R4199j5219K32987o3181
$$ 3346565 3697722 3377948 3158073 3705164 3771191 3523045 3617244 3602025 3835012 3771831
16838C771831J44342r8388L59828o668o7467L00810O7147l59391M57860J07409
$$ 3771831 3916173 3817785 4177613 4170945 4103478 4404288 4471435 4112044 4569904 4677313
16828D677313J1533k41240M54768K2163J7951K0077M77407p0142o8108M16477
$$ 4677313 4688846 4447606 4902374 4924537 4942488 4962565 5439972 5369830 5301722 5718199
16818E718199k21569K06816Q44728n46372K03766M9616L07621o0877K31664L10110
$$ 5718199 5496630 5703446 6548174 6001802 6205568 6255184 6562805 6501928 6733592 7043702
16808G043702q5980L2445L51361K51947M7240L24436N3796K46518M0094J24424
$$ 7043702 6957722 6990167 7341528 7593475 7640715 7965151 8018947 8265465 8305559 8429983
16798H429983L76741Q4039K31461N69559n43699J097404K27470J78090L09764
$$ 8429983 8806724 8890763 9122224 9691783 9148084 10245488 10472958 10651048 10960812
16789A0960812l9845L42422L04695P41624J76704K06449J71899N20186L89469
$$ 10960812 10920967 11263389 11568084 12309708 12486412 12692861 12864760 13384946 13774415
16780A3774415K62565J096644M74164J81597N08650P90033K65847N83650O69381
$$ 13774415 14036980 15133624 15607788 15789385 16298035 17088068 17353915 17937565 18606946
16771A8606946O15168R03946M05922P07276R13816R38432R98479M55866J012729
$$ 18606946 19222114 20126060 20531982 21239258 22153074 23091506 24089985 24545851 25558580
16762B5558580J163342R80113J444077J012959J550374J577415J170338J401376
$$ 25558580 26721922 27702035 29146112 30159071 31709445 33286860 34457198 35858574
16754C5858574J596868K061902K087510J767275J977587K535470K071200K739451
$$ 35858574 37455442 39517344 41604854 43372129 45349716 47885186 49956386 52695837
16746E2695837K809002L104201L043546L265404L855805L858941L901752M499029
$$ 52695837 55504839 58609040 61652586 64917990 68773795 72632736 76534488 81033517
16738H1033517M975668N021710N112995N542345N625408O451071O186520O514576
$$ 81033517 86009185 91030895 96143890 101686235 107311643 113762714 119949234 126463810
16730A26463810O792381O781978O746976P185029O303823O106631N727745M741141
$$ 126463810 133256191 140038169 146785145 153970174 160273997 166380628 172108373 176849514
16722A76849514M409068L241341K194065P56212m72484q68529k684287l391212
$$ 176849514 181258582 184499923 186693988 187450200 186977716 186109187 183424900 180033688
16714A80033688m492477n317020o058027o387863o812616o788594p274922o575711
$$ 180033688 175541211 170224191 164166164 157778301 150965685 144177091 136902169 130326458
16706A30326458p056386o725422o626958o114806n958297n377249n284163m756846
$$ 130326458 123270072 116544650 109917692 103802886 97844589 92467340 87183177 82426331
16698H2426331m573358m492230m117935l680400l640349l278735l234135k713207
$$ 82426331 77852973 73360743 69242808 65562408 61922059 58643324 55409189 52695982
16690E2695982k861888k587662k381936j893818k098068j813595k142721j745326
$$ 52695982 49834094 47246432 44864496 42970678 40872610 39059015 36916294 35170968
16682C5170968j482128q44163k032717j326624j336228r85726j280145p34660
$$ 35170968 33688840 32844677 30811960 29485336 28149108 27163382 25883237 25148577
16674B5148577j032044j018280n94819j174861o51175r82315m50894p83667n61581
$$ 25148577 24116533 23098253 22503434 21328573 20677398 19695083 19244189 18460522 17898941
16665A7898941o63526l42618r49342k63015o70411m35187m56462n48963J70559
$$ 17898941 17235415 16892797 15943455 15680440 15010029 14574842 14118380 13569417 13739976
16656A3739976o51659n66104k57651n90931l3n14552j85935l55723l45161n98757
$$ 13739976 13088317 12522213 12264562 11673631 11673598 11159046 10973111 10617388 10272227 9673470
16646I673470l3098o66660M87966p72491O749j57668k93794k81280j0704j00100
$$ 9673470 9640372 8973712 9461678 8689187 8695936 8538268 8244474 7963194 7952490 7852390
16636G852390l10492j54422l65939O6596l45162j70978K4355j08436k35629L04946
$$ 7852390 7541898 7387476 7021537 7088133 6742971 6571993 6596348 6487912 6252283 6557229
16626F557229n85057M3561j94294l00872J67416k93500o5516M3118j07713l73398
$$ 6557229 5972172 6015733 5821439 5520567 5687983 5394483 5328967 5372085 5264372 4890974
16616D890974j22050M01835l67807R8698m41659l113j91683n1695K02198l65172
$$ 4890974 4768924 5170759 4802952 4901650 4459991 4456878 4265195 4213500 4415698 4050526
16606D050526j37572j97257J28169l88424K82904L48075m65260K95947k03068
$$ 4050526 3912954 3715697 3843866 3455442 3738346 4086421 3621161 3917108 3714040
16597C714040k93791j22526n0688K64503k29784j6091Q5456j37809J12438o12408
$$ 3714040 3420249 3297723 3247035 3511538 3281754 3265663 3351119 3213310 3325748 2713340
16587B713340K82701q591k43933M4360K82200l41957o0676p0931J23496q7769
$$ 2713340 2996041 2987450 2743517 2787877 3070077 2728120 2667444 2596513 2720009 2632240
16577B632240m9442j50751j88200J33301j31666K63156k18097P8781k85092J89740
$$ 2632240 2582798 2432047 2243847 2377148 2245482 2508638 2290541 2369322 2084230 2273970
16567B273970j57879j57672K21783J53784k35363Q1504j77092q8660l8609n2328
$$ 2273970 2116091 1958419 2180202 2333986 2098623 2180127 2003035 1914375 1875766 1823438
16557A823438k15186L10137J32588j29852m7310L65252l23418k1391l67727J61907
$$ 1823438 1608252 1918389 2050977 1921125 1873815 2239067 1915649 1894258 1526531 1688438
16547A688438O5192J1055k34648J94842L4582j15738j74445l02008J51012r84
$$ 1688438 1753630 1764685 1530037 1724879 1759461 1643723 1469278 1167270 1318282 1317298
16537A317298j85P1863L04128q0187m02344k4737J64877J21644p8443l56390J86043
$$ 1317298 1317113 1388976 1693104 1612917 1210573 1185836 1350713 1472357 1393914 1037524 1223567
16526A223567k59531N6922L43528k5191L5183k60044L18969m08221K56781o0630
$$ 1223567 964036 1020958 1364486 1339295 1374478 1114434 1433403 1025182 1281963 1221333
16516A221333o408J63982l06549J20830k77803J70656l182K2976J29240l12812
$$ 1221333 1214925 1378907 1072358 1193188 915385 1086041 1082859 1105835 1235075 922263
16506I22263K10767r6509j58951K98917j71589j27905p496j12626K19624L1813
$$ 922263 1133030 1036521 877570 1176487 1004898 876993 869497 756871 976495 1008308
16496A008308J1252J74689j71316l47548J65388J25815r4338J26306J61448j96419
$$ 1008308 1019560 1194249 1022933 675385 840773 966588 872250 998556 1160004 963585
16486I63585n1293J29686j59225k19749J25709L66407l33832o7297J6907N252
$$ 963585 912292 1041978 882753 663004 788713 1155120 821288 753991 770898 776150
16476G76150K90476l94044P5322K53195j44439o9926J16071j80981K08443J48850
$$ 776150 1066626 672582 747904 1001099 856660 786734 902805 721824 930267 1079117
16466A079117l53495J68788k07010k6003B66943L58447r1351L98761m62104N18901
$$ 1079117 725622 894410 687400 661397 266943 625390 534039 932800 470696 989597
16456I89597R0746n14535O4341j96512n4252N56813R2581l46026M3839Q204L7728
$$ 989597 1080343 565808 630149 433637 379385 936198 1028779 682753 726592 734796 772524
16445G72524k19761J44572n1777J1122j81869J98572K08219k12846j90114L88163
$$ 772524 552763 697335 645558 656680 474811 673383 881602 668756 478642 866805
16435H66805j65316k56513L75063l67092q6269N22799l28842J43383k72252K76105
$$ 866805 701489 444976 820039 452947 366678 889477 560635 704018 431766 707871
16425G07871L7167j62302m3142j517K37969j55687k33901J13464J54132q7839
$$ 707871 745038 582736 539594 538077 776046 620359 386458 499922 654054 566215
16415E66215m8952R5954j02630K48250K15144l50614j02035j25671K12472B48924
$$ 566215 517263 613217 510587 758837 973981 623367 521332 395661 608133 248924
16404D73116J21109A94528K46379o7071Q8043N4969K6146A61817K52514J62247
$$ 473116 594225 194528 440907 373836 461879 516848 542994 161817 414331 576578
16394E76578B68191K49444k17223N7586N4696L4218K6287L6289k49331J65126
$$ 576578 268191 517635 300412 357998 412694 446912 473199 509488 260157 425283
16384D25283A13266L77982j78912J45691B28187N03394l14644j43469L09529q4679
$$ 425283 113266 491248 312336 458027 228187 731581 416937 273468 582997 498318
16374D98318B28806Q4395p7796j00218J4165b9082C32756p0682J99308k10971
$$ 498318 228806 313201 235405 135187 149352 -29082 332756 262074 461382 250411
16364B50411l7321J96356K8791A96286L80199k76864M4578G0054M02072r0440
$$ 250411 213090 409446 438237 196286 576485 299621 344199 70054 472126 381686
16354C81686R4346j17759p274N1004A53215B8898K29307O9252j07519K33926f6188
$$ 381686 476032 358273 350999 402003 153215 28898 258205 327457 219938 453864 -66188
16342E23157E1146L27234k5922K2174I28M42769A94064K64181A63734J25182J37380
$$ 523157 51146 378380 352458 374632 928 443697 194064 458245 163734 288916 426296
16331D26296A16634K59204j34928i323A95837m0483m6580N73945B80937A21528
$$ 426296 116634 375838 240910 -9323 195837 155354 108774 682719 280937 121528
16320E15670l9911A69592c5870A11905K86001N2991A62136L07650m2624j95064
$$ 515670 475759 169592 -35870 111905 397906 450897 162136 469786 427162 232098
16310B32098M7657J52097m2142a01208D6501J3483K08374m9941J32996J25003
$$ 232098 279755 431852 389710 -101208 46501 59984 268358 218417 351413 476416
16300D76416B12665B3899M74934A70249J00964K491d5769q4338E2846N73469A14344
$$ 476416 212665 23899 498833 170249 271213 273704 -45769 -130107 52846 626315 114344
16288C97426A88200F6096J98308j1919M9316C765K72983q5821N2395H2732M0909
$$ 397426 188200 66096 264404 252485 301801 3765 276748 190927 243322 82732 123641
16277A23641K09101a1253j48079I879R1923M46741F1998i1535A74878O8129J2180
$$ 123641 332742 -11253 -159332 9879 101802 548543 61998 -91535 174878 243007 255187
16266B55187Q2445A19003J34342A17704K64766j66123J78418d677A41411a8945
$$ 255187 337632 119003 253345 117704 382470 216347 394765 -4677 141411 -18945
16255A78519E891i184k33667D48387g7155B9647f1706D79060A85602j1878o7113
$$ 178519 5891 -9184 -242851 448387 -77155 29647 -61706 479060 185602 173724 106611
16244A06611D4094a24706B25072J53440A36690J37776a9379C99958a2384G3522
$$ 106611 44094 -124706 225072 378512 136690 274466 -19379 399958 -12384 73522
16233B54571j22034m7883A3982P0417O2828l7147i8241b2634r6871C08864f0795
$$ 254571 132537 84654 13982 84399 147227 110080 -98241 -22634 -119505 308864 -60795
16221a44899K2103k06232E1633i8987D14265A75263O0774K162i6820D10917A20466
$$ -144899 -122796 -329028 51633 -98987 414265 175263 236037 238199 -96820 410917 120466
16209F6305q878M6347R8929a625k2534k13105j0554A46719G2158K31192Q5313
$$ 66305 57427 103774 202703 -1625 -24159 -237264 -247818 146719 72158 303350 388663
16198C88663A23843g7014B64200i4567B22029k2590G5864B8017K1543c2411A33548
$$ 388663 123843 -77014 264200 -94567 222029 199439 75864 28017 49560 -32411 133548
16186B4006P0915K85733g8918E0389J34738M3841a50440C85272A69601P6454d38954
$$ 24006 94921 380654 -78918 50389 185127 228968 -150440 385272 169601 246055 -438954
16174B78388b00622A21372C7528J24965C9324a08351C3475f2348F1220a46948
$$ 278388 -200622 121372 37528 162493 39324 -108351 33475 -62348 61220 -146948
16163c0356A21455p342J33185a18717d4637B23920a35039C1096P9877j6454a96405
$$ -30356 121455 114113 247298 -118717 -44637 223920 -135039 31096 110973 94519 -196405
16151B35520A03266g2493n7013O3248F3900a88137Q9052a7629D59103a21429B66071
$$ 235520 103266 -72493 -129506 -66258 63900 -188137 -99085 -17629 459103 -121429 266071
16139b24858J03267J3821j34310a06713m0253A75429G7434J31958e4618B23688
$$ -224858 -121591 -107770 -242080 -106713 -146966 175429 77434 209392 -54618 223688
16128A29944M1506j2481J48934a64093D5638O8322B5719b06686A13108A5893J6441
$$ 129944 171450 158969 307903 -164093 45638 113960 25719 -206686 113108 15893 32334
16117C2334K09590q5700G8043A4835J3023c5931A24990L8439k7313a0235j293
$$ 32334 241924 156224 78043 14835 27858 -35931 124990 163429 136116 -10235 -11528
16106a1528k71761B4895r146K23243J9615B3873I396c35279B1408J06541K6563
$$ -11528 -283289 24895 15749 238992 258607 23873 9396 -335279 21408 127949 154512
16095A54512J07143l7729Q7699r2144h127j21852I1338a69190l4335A69995n4804
$$ 154512 261655 223926 311625 219481 -8127 -129979 91338 -169190 -203525 169995 115191
16084A15191n3752a97848g4247A84362f380j03192e2441A50232L4582b50230B32385
$$ 115191 61439 -197848 -74247 184362 -6380 -109572 -52441 150232 184814 -250230 232385
16072B54889C8756K8363C240e45o1571k4912M355c0301j3360j19568e0614C2569
$$ 254889 38756 67119 3240 -545 -62116 -87028 -82673 -30301 -43661 -163229 -50614 32569
16059a27520I5425J85962a48733e0063r342j67746J02020A771J19731n6966a32572
$$ -127520 95425 281387 -148733 -50063 -59405 -227151 -125131 1771 121502 64536 -132572
16047a8956g949A38234A818a43782I7657a45422e4026j68445A7655a06770k18151
$$ -18956 -7949 138234 1818 -143782 97657 -145422 -54026 -222471 17655 -106770 -324921
16036c24921i2038e320l5012A39032J5758D3088g1303A2575b64677F9884b79224
$$ -324921 -92038 -5320 -40332 139032 154790 43088 -71303 12575 -264677 69884 -279224
16024B50673c9284E0290K14161b32107P8694l12515a44341c250o5023C13212d5667
$$ 250673 -39284 50290 264451 -232107 -153413 -465928 -144341 -3250 -68273 313212 -45667
16012A07566a37116A11543l0853N23345a77667A55104f6621K5494r1880B76552
$$ 107566 -137116 111543 80690 604035 -177667 155104 -66621 -41127 -133007 276552
16001B04345a60486j5519D0804P421a22854A11367J30500k5251b49812M6692N7190
$$ 204345 -160486 -176005 40804 48225 -122854 111367 241867 216616 -249812 -203120 -145930
15990a45930A19335k2780m8043J7409J48947i4089A56093M8055Q0623B9074K84701
$$ -145930 119335 96555 48512 65921 214868 -94089 156093 204148 284771 29074 313775
15979C13775A24718m5740d2072H2334A8586L9235L17760d2527j20709e1686I9959
$$ 313775 124718 78978 -42072 82334 18586 57821 375581 -42527 -163236 -51686 99959
15967b46515R4596B28653l913C4113a33339j8932C26073A20917d3902C1295g9510
$$ -246515 -151919 228653 224740 34113 -133339 -152271 326073 120917 -43902 31295 -79510
15955C2018d0414A453a63144B18179b39862p170j05415a01701j07831r5576a44383
$$ 32018 -40414 1453 -163144 218179 -239862 -247032 -352447 -101701 -209532 -305108 -144383
15943A11979d8128k94047B0799c19867I7301b76772j9891R0061B70361k3940m8120
$$ 111979 -48128 -342175 20799 -319867 97301 -276772 -296663 -206602 270361 246421 198301
15932A98301d0058J3903j40358G8868J53780b11681h6144c634A09530b80124H1764
$$ 198301 -40058 -26155 -166513 78868 232648 -211681 -86144 -3634 109530 -280124 81764
15920D9330e383A15999a02965d8847B20910b01514f2754k61849m0015J43826l58877
$$ 49330 -5383 115999 -102965 -48847 220910 -201514 -62754 -324603 -364618 -220792 -579669
15909e79669K78198F0789k7036c39975B69976J23963A11813k8913L6984g2195
$$ -579669 -301471 60789 33753 -339975 269976 393939 111813 82900 119884 -72195
15898c38609a25531m0479g6633A03565B2132d1672A92836b13788E7989K9588P9709
$$ -338609 -125531 -166010 -76633 103565 22132 -41672 192836 -213788 57989 87577 167286
15887A67286I978J20401F2688J04743L4049b83531A65615f1369m6371l5389E1704
$$ 167286 9978 130379 62688 167431 201480 -283531 165615 -61369 -107740 -143129 51704
15875f7981A03027a17829A03555A5263d16969a39284f1955F3045h780G7149A3228
$$ -67981 103027 -117829 103555 15263 -416969 -139284 -61955 63045 -8780 77149 13228
15863B13620a39321C1011L18671c97522a39615m64589K91959P869E7462a35875
$$ 213620 -139321 31011 349682 -397522 -139615 -604204 -312245 -304376 57462 -135875
15852A25970P0549a56635B62046f2980q8116C2295b93631J33346C5065a75157
$$ 125970 196519 -156635 262046 -62980 -151096 32295 -293631 -160285 35065 -175157
15841D41807a48320H1403c26625e5405k30313A31131B879J1817P2353A8625b2309
$$ 441807 -148320 81403 -326625 -55405 -285718 131131 2879 14696 87049 18625 -22309
15829g5420q2483I9695d04755F5700j43c405l76523o5913R6861a20566A12727
$$ -75420 -157903 99695 -404755 65700 65557 -3405 -379928 -445841 -348980 -120566 112727
15817f0313I1297e6422j02060e0625m0789q2368B98322b8278G6755J28239H5564
$$ -60313 91297 -56422 -158482 -50625 -91414 -173782 298322 -28278 76755 204994 85564
15805b72652D4805J29508b65099B2302J64101J46746j35073a35556B48452a67175
$$ -272652 44805 174313 -265099 22302 186403 333149 198076 -135556 248452 -167175
15794A09349J02640B382L60994b63073F9123F765b19407H0164c1870A82006d3777
$$ 109349 211989 2382 363376 -263073 69123 6765 -219407 80164 -31870 182006 -43777
15782b28755H846g4111j18373A20152e01641d1646j66309e2140A99690c8455A40060
$$ -228755 8846 -74111 -192484 120152 -501641 -41646 -207955 -52140 199690 -38455 140060
15770A9394b11910K7878H1117M907O074a45264N6687B59769a60808B58086E7106
$$ 19394 -211910 -184032 81117 86024 92098 -145264 -88577 259769 -160808 258086 57106
15758f2505j85965Q7765C1589K63806a54933E7965a99874N1486j37383C12537
$$ -62505 -248470 -160705 31589 295395 -154933 57965 -199874 -148388 -285771 312537
15747E3319J44061d3026G9847O4490d59519A85136I45b31996K7996B57497A5866
$$ 53319 197380 -43026 79847 144337 -459519 185136 945 -231996 -204000 257497 15866
15735e2516o1989d3950j23019C2148J10546G0256J22921j7274q2356a05036r0225
$$ -52516 -114505 -43950 -166969 32148 142694 70256 193177 175903 93547 -105036 -195261
15724a95261C00183j33265b04338G5925a76928a7327A61793h9880D13856h8358
$$ -195261 300183 166918 -204338 75925 -176928 -17327 161793 -89880 413856 -88358
15713c1159a1437A22168b1731l5286m704j65755L4431L0627c4618j3702l88672
$$ -31159 -11437 122168 -21731 -57017 -61721 -227476 -193045 -162418 -34618 -48320 -436992
15702d36992B43100a10632m2k30306A64823n1686j9007A4420J92414b6179j54705
$$ -436992 243100 -110632 -110674 -340980 164823 113137 94130 14420 206834 -26179 -180884
15691a80884c8195m0610A3829J89395c13298A97066l4014b61265a23468a0963
$$ -180884 -38195 -78805 13829 203224 -313298 197066 163052 -261265 -123468 -10963
15680C1451K1867Q1829J08073j677b53110B8511f4210B66210E8950i9590k88897
$$ 31451 53318 135147 243220 241543 -253110 28511 -64210 266210 58950 -99590 -388487
15669c88487A87292O095C7357a3804E5742b90275F056J75153a72368f5541k3746
$$ -388487 187292 193387 37357 -13804 55742 -290275 6056 181209 -172368 -65541 -89287
15658h9287A56539c37568D9428J76840f1928q6536g3463j89130q108J33243F6474
$$ -89287 156539 -337568 49428 226268 -61928 -148464 -73463 -262593 -270701 -137458 66474
15646b9448P412n0889C6189a52876b1357B96551g1901E6518B5459b78768e9880
$$ -29448 -22036 -72925 36189 -152876 -21357 296551 -71901 56518 25459 -278768 -59880
15634c1689j9285N952k3522a2128q2362j9499A6181M8710A7059L5529c1260H4049
$$ -31689 -50974 -45022 -68544 -12128 -94490 -113989 16181 64891 17059 52588 -31260 84049
15621a88260j63145B03595o3981a92163A57967e0964H2510g3297A32396L5552
$$ -188260 -351405 203595 139614 -192163 157967 -50964 82510 -73297 132396 167948
15611A67948M4114l4155p4130b03682c2778q8070A13890M3136d1466a0049A17894
$$ 167948 212062 177907 103777 -203682 -32778 -120848 113890 157026 -41466 -10049 117894
15599C09937b43811A82467a34149j24274J07781I4692k8499A3340a6472r4036
$$ 309937 -243811 182467 -134149 -258423 -150642 94692 66193 13340 -16472 -110508
15589a10508B17O1898K7333b48992G8969l6611a13212G8482c179F9159B3117a82713
$$ -110508 217 62115 89448 -248992 78969 42358 -113212 78482 -3179 69159 23117 -182713
15576G8520a30827B19506G4198b16680f4813K1179k6331B045a71984P8685A90264
$$ 78520 -130827 219506 74198 -216680 -64813 -43634 -69965 2045 -171984 -93299 190264
15564F9563J18259C20a50044C19168a83625F6764a23350C8936L6304A2212K07575
$$ 69563 187822 320 -150044 319168 -183625 66764 -123350 38936 75240 12212 219787
15553B19787a53027G8954i4532f710p4655k98309a65167j6069a5759j55526A40251
$$ 219787 -153027 78954 -94532 -6710 -81365 -379674 -165167 -181236 -15759 -171285 140251
15541B4735a56774k33884J29559D5769d0359A64591g8752k7997G0181c19670a05644
$$ 24735 -156774 -390658 -261099 45769 -40359 164591 -78752 -106749 70181 -319670 -105644
15529i5444L8339r4204A53919j884J86983a19068a6987A62238J96906I4098N5523
$$ -95444 -57105 -151309 153919 152035 339018 -119068 -16987 162238 359144 94098 149621
15518A49621b20957B9298J76386b52191A65878a65699A14856E2324Q9465a00099
$$ 149621 -220957 29298 205684 -252191 165878 -165699 114856 52324 141789 -100099
15507b68820a09374J3979g302A1549J673J27927f801o7102J8110k87926A29977
$$ -268820 -109374 -95395 -7302 11549 13222 141149 -6801 -73903 -55793 -343719 129977
15495B43975F1681a56064E1525J76735c9235G7577J0241a66523E0419g6589A35133
$$ 243975 61681 -156064 51525 228260 -39235 77577 87818 -166523 50419 -76589 135133
15483B8233b37070a3238I6311O6080c55651A04289k8507a24363a653D2459K71139
$$ 28233 -237070 -13238 96311 162391 -355651 104289 75782 -124363 -1653 42459 313598
15472C13598c2928a2073q142H291b06020C0703J25443j7084C0940K12990a48262
$$ 313598 -32928 -12073 -20215 8291 -206020 30703 156146 139062 30940 243930 -148262
15460A7566J11203F2870M5489K3909b94906A12917J4715C847b86480B2942P3633
$$ 17566 128769 62870 108359 132268 -294906 112917 127632 3847 -286480 22942 96575
15449I6575b43915g1807H9001J33522h5545c8518H7612N0768a75469j4029B41043
$$ 96575 -243915 -71807 89001 222523 -85545 -38518 87612 138380 -175469 -189498 241043
15437a96089B958a38026j60096A50561M6966i6043j1938C79213e7712A64585K11794
$$ -196089 2958 -138026 -298122 150561 197527 -96043 -107981 379213 -57712 164585 376379
15426C76379d02488B6346G996J7531b38604O1424m5194e421B42217a6461E9849
$$ 376379 -402488 26346 7996 25527 -238604 -177180 -222374 -5421 242217 -16461 59849
15414E3689a88992h1433A29082P7984D0734K4582b17371p1040a33299j6615k56110
$$ 53689 -188992 -81433 129082 207066 40734 65316 -217371 -288411 -133299 -149914 -406024
15403d06024A41790q268d96482A43517K02061j49822h356o4024p9381H0565i9721
$$ -406024 141790 133522 -496482 143517 345578 195756 -8356 -72380 -151761 80565 -99721
15391d8289p8219j54468a13935J6379Q224p3759g5952K0649q0279m9050M0090
$$ -48289 -126508 -280976 -113935 -97556 -89332 -163091 -75952 -55303 -135582 -184632 -144542
15380a44542c8291D3103K6541c3777m77o8523F6146L44950a33353A10983J4810
$$ -144542 -38291 43103 69644 -33777 -34254 -102777 66146 411096 -133353 110983 125793
15369A25793e6076g547o1379j29381M8062f3277B6007J2762a58376l2509f4910
$$ 125793 -56076 -7547 -68926 -198307 -150245 -63277 26007 38769 -158376 -190885 -64910
15357b4113C41424A7777O589P201l325M15602a47027A1244b38539h6655B23497
$$ -24113 341424 17777 24366 31567 28242 443844 -147027 11244 -238539 -86655 223497
15345A89817d7443A53720c3320j45824E27151E4458J12335C6552f8011E0047R6343
$$ 189817 -47443 153720 -33320 -179144 527151 54458 166793 36552 -68011 50047 146390
15334A46390b59004a6454p5811J2179A99948b7908D6192P578j9718K81452A06841
$$ 146390 -259004 -16454 -92265 -80086 199948 -27908 46192 53770 34052 315504 106841
15322B01271b75327I2463b32228A60998a59308M8205m4319A95356k2924m0223
$$ 201271 -275327 92463 -232228 160998 -159308 -111103 -155422 195356 172432 132209
15312A32209h0744A2128h9521R088m3106B4762a93648O4408A53755g5378m8563
$$ 132209 -80744 12128 -89521 -80433 -123539 24762 -193648 -129240 153755 -75378 -123941
15301a23941A56367d0024F0142K79574G7538a57832C8917L40776j11166J38819
$$ -123941 156367 -40024 60142 339716 77538 -157832 38917 379693 268527 407346
15291D07346a6700F4110J67171q9421a57572D1104c18030a5807k17196a932j76915
$$ 407346 -16700 64110 231281 141860 -157572 41104 -318030 -15807 -233003 -1932 -178847
15280a78847A16410q731e7400B17799G2840K37026J46492a86039B7213a47672
$$ -178847 116410 107679 -57400 217799 72840 309866 456358 -186039 27213 -147672
15269A61999p138a12141k03057a27084d7026I0305l3697a76155I5364J7239a44527
$$ 161999 154861 -112141 -315198 -127084 -47026 90305 56608 -176155 95364 112603 -144527
15257G4506b79020b2021B02927N5010j05668k9106J03182J08551A24285e5451
$$ 74506 -279020 -22021 202927 257937 152269 123163 226345 334896 124285 -55451
15246A40504d6796k1576j09011D3513a10217N4126b0916A09549a23037b6773A68781
$$ 140504 -46796 -68372 -177383 43513 -110217 -56091 -20916 109549 -123037 -26773 168781
15234A63564j5541i2818A69731J34882a50494J6030j84724H1677b12369A59593
$$ 163564 148023 -92818 169731 304613 -150494 -134464 -319188 81677 -212369 159593
15223E5488K04641j29915b0786j12781B16614b37893q6343B06619a2591F9194
$$ 55488 260129 130214 -20786 -133567 216614 -237893 -324236 206619 -12591 69194
15212a01161B63736a1921D50462a2790o2697B85897a00005l15406E8291L9575
$$ -101161 263736 -11921 450462 -12790 -75487 285897 -100005 -415411 58291 97866
15202I7866f1127D70480a27493C2103P0601i8463F5064K15835c77189B02312b63699
$$ 97866 -61127 470480 -127493 32103 102704 -98463 65064 280899 -377189 202312 -263699
15190A07883h2688B23007O477D7706e6342E0472a0609E0717R6670o0891b7858
$$ 107883 -82688 223007 229484 47706 -56342 50472 -10609 50717 147387 86496 -27858
15178c58816A14235N3324a57600C82505A53816O6470a9774G5499a36298F56c4329
$$ -358816 114235 167559 -157600 382505 153816 220286 -19774 75499 -136298 656 -34329
15166a99607A19852B8597K3313d241C56041l1419E7288J30641G6630f2775A43404
$$ -199607 119852 28597 51910 -4241 356041 324622 57288 187929 76630 -62775 143404
15154b55673A57914K2865M0590G6858M5160e3647A24886K52708B2254L60407I067
$$ -255673 157914 180779 221369 76858 122018 -53647 124886 377594 22254 382661 9067
15142f335A6889b38956B49963a70137A46214P4799J55104A65673o1726B6663J08120
$$ -6335 16889 -238956 249963 -170137 146214 221013 376117 165673 103947 26663 134783
15131A34783J51492A41976B0052N6054B6567Q7804I564J04082d1291A5487N82249
$$ 134783 286275 141976 20052 76106 26567 114371 9564 113646 -41291 15487 597736
15120E97736A89617b88944B49639E5642P8277M0757e0049q6618H3028K94287m2421
$$ 597736 189617 -288944 249639 55642 133919 174676 -50049 -136667 83028 377315 334894
15109C34894n8490q8534L7841J04938l6686j11896L7267D8689J13141Q421K9115
$$ 334894 276404 187870 225711 330649 293963 182067 219334 48689 161830 170251 199366
15098A99366q2664J08005C6085K19723K10428B480K73563K1668r743N5153i9810
$$ 199366 116702 224707 36085 255808 466236 2480 276043 297711 287968 343121 -99810
15086i2893A66915N5565I2732a65929o445G7301J54006p3896d0409B18993F924
$$ -92893 166915 222480 92732 -165929 -172374 77301 231307 157411 -40409 218993 6924
15074I6622J39279m4462l6217J48161N8599A72865J72583e8585k74639I1894b58123
$$ 96622 235901 191439 155222 303383 361982 172865 345448 -58585 -333224 91894 -258123
15062g6426H821M44080r2115A26501J51021a4536A68419N7018b98947B18137e9393
$$ -76426 8821 452901 360786 126501 277522 -14536 168419 225437 -298947 218137 -59393
15050A65445J56694p2290i3094F4972J74583L5125k195O8647c2779A55946E1536
$$ 165445 322139 249849 -93094 64972 239555 274680 272485 341132 -32779 155946 51536
15038B07999j5830H926a26166B26751H3640K33697C7643F682a8719j42946I6067
$$ 207999 192169 8926 -126166 226751 83640 317337 37643 6682 -18719 -161665 96067
15026e735E55432A08213L6026R7372k2484G658J00120L41174p4001A79115m6288
$$ -5735 555432 108213 144239 241611 219127 7658 107778 448952 374951 179115 132827
15015A32827D2824M43456j68598b176C45554G6752K22562j05065m1966M3726A0343
$$ 132827 42824 486280 317682 -2176 345554 76752 299314 194249 152283 196009 10343
15003C80598G5709b35649B47196A03129Q2238F8678K01378M2345e5092D16970
$$ 380598 75709 -235649 247196 103129 185367 68678 270056 312401 -55092 416970
14992F50236B77345E6460J74654l0719N4480M5363M8983Q5641K4664O4394b2003
$$ 650236 277345 56460 231114 200395 254875 300238 349221 434862 459526 523920 -22003
14980D8562L02598a08974I8520K75871I4125G321M47425j17837f8157A30059N8849
$$ 48562 351160 -108974 98520 374391 94125 7321 454746 336909 -68157 130059 188908
14969A88908C4263a33290j0234A66615N08993H6315K52153j62854R8049K7671
$$ 188908 34263 -133290 -143524 166615 675608 86315 338468 175614 273663 301334
14959C01334j03509K89729k01659a1894I6301L59392A89114J28213A15203L6766
$$ 301334 197825 487554 285895 -11894 96301 455693 189114 317327 115203 151969
14949A51969J01504M0580l9817B5774c0845B46948D3657K49777N0948A27906K04555
$$ 151969 253473 294053 254236 25774 -30845 246948 43657 293434 344382 127906 332461
14938C32461n7929K15128A27546q388O06686A97067N04452A09233L31566G8536
$$ 332461 274532 489660 127546 119158 725844 197067 701519 109233 440799 78536
14927C59402j54725l2984N4826j08923E7742J93820B6486L68551B0965K20320
$$ 359402 204677 171693 226519 117596 57742 251562 26486 395037 20965 241285
14917B41285N9813J08431N9350A73541K73042R445A02116K10896m662j46162L31271
$$ 241285 301098 409529 468879 173541 446583 456028 102116 313012 308350 162188 493459
14906D93459m8341q3070F2158L89157M9742J0966A22915P1434K22404j7249J80401
$$ 493459 445118 362048 62158 451315 501057 512023 122915 194349 416753 399504 579905
14895E79905A46195K18848j78256K83544j82110R223N6551J65281j30140J49135
$$ 579905 146195 365043 186787 470331 288221 297444 353995 519276 389136 538271
14885E38271A06971M00024j26491r2476O6785j15435K32788L8847m2669k01969
$$ 538271 106971 506995 380504 288028 354813 239378 472166 511013 468344 266375
14875B66375j6916n6199K22469J67666B52001j7037k6629I4151L82144K797J34523
$$ 266375 249459 193260 415729 583395 252001 234964 208335 94151 476295 479092 613615
14864F13615j67551b1745C10090A9067J94715P9836C3482M76257J34767B86443
$$ 613615 446064 -21745 310090 19067 213782 293618 33482 509739 644506 286443
14853E49589r9917j67407J24209j24126l0604K132n5064E9867K03171O1698A6610
$$ 549589 449672 282265 406474 282348 251744 253876 198812 59867 263038 324736 16610
14841E90836k71953M60307B83081j20862L18296L4528j80630q5359G7049J76564
$$ 590836 318883 779190 283081 162219 480515 515043 334413 249054 77049 253613
14831B53613K83255A70425N4519K97475J34161j10645j02752o3663I6057M56656
$$ 253613 536868 170425 224944 522419 656580 545935 443183 379520 96057 552713
14821E52713j42277K80323R7103C52128J13774J49476A59919L93595r6900o2075
$$ 552713 410436 690759 787862 352128 465902 615378 159919 553514 456614 394539
14811C94539n5048K06253k21947L51977O0245k17138B44500K83356J71037j98407
$$ 394539 339491 545744 323797 675774 736019 518881 244500 527856 698893 500486
14801E00486j87382J24067j95475J59382K39976B13766K01538p2336L37395B80203
$$ 500486 313104 437171 241696 401078 641054 213766 415304 342968 680363 280203
14790E35033k00820K25280j66355N9291J10141J829k71747J36040L07073K35469
$$ 535033 334213 559493 393138 452429 562570 564399 292652 428692 735765 971234
14780I71234m20713J99217K51380D15925K12183J54184J5018k60532J52082k87634
$$ 971234 550521 749738 1001118 415925 628108 782292 797310 536778 688860 401226
14770D01226K63769j07752J38556j70571M9725J75724O7901k79053Q792J45564
$$ 401226 664995 557243 695799 525228 574953 750677 818578 539525 548317 693881
14760F93881l06303J61767B55206P8626Q7729q2047L09289K97624k59470p828
$$ 693881 387578 549345 255206 333832 421561 339514 648803 946427 686957 679129
14750F79129j1281K12615J89299m70457K28110l35726l0129J99592k78775M92878
$$ 679129 667848 880463 1069762 599305 827415 491689 461560 661152 382377 875255
14740H75255l52893J4491L81384k49487J23350j15311J62224o3157j96746n3981
$$ 875255 522362 536853 918237 668750 792100 676789 839013 775856 579110 525129
14730E25129M3108O1524J5067L82808k35317j83428q8444M6066K12999M65718
$$ 525129 568237 629761 644828 1027636 792319 608891 520447 566513 779512 1245230
14720A245230l57895q5939J1116k91978L0302L33617j44628J56588k94782J31114
$$ 1245230 887335 801396 812512 520534 550836 884453 739825 896413 601631 732745
14710G32745M7831J53542l63431K22636Q9220O7372j34470J37645o4819k74247
$$ 732745 780576 934118 570687 793323 882543 949915 815445 953090 888271 614024
14700F14024N79726l03176J10812k03757O2162L6338K4634j43390k63687O45467
$$ 614024 1193750 890574 1001386 797629 859791 896129 920763 777373 513686 1159153
14690A159153L2933k85478O424Q2417k71331K62546L53159n33720r5977M58413
$$ 1159153 1192086 906608 913032 995449 724118 986664 1339823 806103 710126 1168539
14680A168539j89284L8038n0069j04735J37268J6424m5194J36967j28465r0477
$$ 1168539 979255 1017293 967224 862489 999757 1016181 970987 1107954 979489 889012
14670H89012M7753j0056J75582q7943L47582o08893O2808R656M27914j88844J30714
$$ 889012 936765 926709 1102291 1014348 1361930 753037 815845 825501 1253415 1064571 1195285
14659A195285r6770j77206K96845j79723Q2341j28082J03404K99529k42370k26992
$$ 1195285 1098515 921309 1218154 1038431 1120772 992690 1096094 1395623 1153253 926261
14649I26261O6449M06657n23667L61863m25537M28196p0123K61492l32586L74351
$$ 926261 992710 1399367 875700 1237563 812026 1240222 1170099 1431591 1099005 1473356
14639A473356k50891K70340L5811O0972n91731J78221K43183l12720J98951P7902
$$ 1473356 1222465 1492805 1528616 1589588 997857 1176078 1419261 1106541 1305492 1383394
14629A383394K8865k49259o2586O49089k26352n94006M35071k38027N09508q9970
$$ 1383394 1412259 1163000 1100414 1749503 1523151 929145 1364216 1126189 1635697 1545727
14619A545727k04811J98671P3330k76163N6191L9580n8502K97635m3465m55699
$$ 1545727 1340916 1539587 1612917 1336754 1392945 1432525 1374023 1671658 1628193 1172494
14609A172494K37613J94248k41028L35442l78558M17284k2138k08064j46875K91849
$$ 1172494 1410107 1604355 1363327 1698769 1320211 1737495 1715357 1507293 1360418 1652267
14599A652267k16661K17924n7329J18057j69626J76779P6985j59060l6462M8287
$$ 1652267 1435606 1653530 1596201 1714258 1544632 1721411 1798396 1639336 1602874 1651161
14589A651161L7691k74982K47442L62959k91327j01335L17234J61168m74785l2061
$$ 1651161 1688852 1413870 1661312 2024271 1732944 1631609 1948843 2110011 1635226 1603165
14579A603165j19393M88448J43231O3295n62044M27616j29957k4257K58986j47761
$$ 1603165 1483772 1972220 2115451 2178746 1616702 2044318 1914361 1890104 2149090 2001329
14569B001329J36538J93895K41846n26807O85396l59127P4595J16330R8882j86201
$$ 2001329 2137867 2331762 2573608 2046801 2732197 2373070 2447665 2563995 2662877 2476676
14559B476676O19169l16351M28500l51638P05428J70501j32640M08416O18253
$$ 2476676 3095845 2779494 3207994 2856356 3561784 3732285 3599645 4008061 4626314
14550D626314J019402K054763M373120Q703839J8156462L774092A8256458H296216
$$ 4626314 5645716 7700479 12073599 20777438 38933900 42707992 18256458 8296216
14541D299688j220618l30111p40092K81392n27907L40954n2236l55912L48392
$$ 4299688 3079070 2748959 2008867 2290259 1762352 2103306 2051070 1695158 2043550
14532B043550k8402K32186l46028K03351K16010m4474k37187M39155L4035k70753
$$ 2043550 2015148 2247334 1901306 2104657 2320667 2276193 2039006 2478161 2512196 2241443
14522B241443j24942M20664J24627k32462q2129K84071R3360P8646k40700P4538
$$ 2241443 2116501 2537165 2661792 2429330 2347201 2631272 2724632 2803278 2562578 2637116
14512B637116Q1252J11632K32364j12050m27995K74097j28951K92013o307K1552
$$ 2637116 2718368 2830000 3062364 2950314 2522319 2796416 2667465 2959478 2953171 2974723
14502B974723j15499L17395k28766j40793L16628j28027K57137K4419j34712J82067
$$ 2974723 2859224 3176619 2947853 2807060 3123688 2995661 3252798 3277217 3142505 3324572
14492C324572j70119N97928l91272q4281M69198j46912K37413k26468K16825j03952
$$ 3324572 3154453 3752381 3361109 3276828 3746026 3599114 3836527 3610059 3826884 3722932
14482C722932L0508M6135M8014j24812n8077K90606k00778L61367j47543k68593
$$ 3722932 3753440 3799575 3847589 3722777 3664700 3955306 3754528 4115895 3968352 3699759
14472C699759K58238K19904p6118K56801q3167M4367k29141P43115m43778R1217
$$ 3699759 3957997 4177901 4101783 4358584 4275417 4319784 4090643 4833758 4389980 4481197
14462D481197L52164m82388M34776L1529K72357k85622K79885n3539J72016k01383
$$ 4481197 4833361 4350973 4785749 4817278 5089635 4804013 5083898 5030359 5202375 5000992
14452E000992J22004K44196j98308N1670J76069L05304K4895j01704J89435J05876
$$ 5000992 5122996 5367192 5168884 5220554 5396623 5701927 5726822 5625118 5814553 5920429
14442E920429K6261J33912M4857k25463Q1830K57208k9849M43190j30648n0666
$$ 5920429 5946690 6080602 6125459 5899996 5981826 6239034 6209185 6652375 6521727 6471061
14432F471061J31295k50972K43490M82041m711J77017P1701k34832N6657K95107
$$ 6471061 6602356 6351384 6594874 7076915 7072204 7249221 7320922 7086090 7142747 7437854
14422G437854j4396J33096o1135L02924J87215o4302O45428Q6302k96863N02210
$$ 7437854 7423458 7556554 7495419 7798343 7985558 7921256 8566684 8652986 8356123 8858333
14412H858333j05457L53169m80226N89741P2699J36311K97437j76074R140M70027
$$ 8858333 8752876 9106045 8625819 9215560 9288259 9424570 9722007 9545933 9555073 10025100
14402A0025100K20538K19486j07026L84131k25562P22511Q782k2986O0119N81597
$$ 10025100 10245638 10465124 10358098 10742229 10516667 11239178 11247960 11224974 11285093 11866690
14392A1866690J50866J98273J88310L27030K49089K38705K55690m7287K77189
$$ 11866690 12017556 12215829 12404139 12731169 12980258 13218963 13474653 13427366 13704555
14383A3704555K45005M06423j30483P31281L8266M0466N99664K36366M77544M6622
$$ 13704555 13949560 14355983 14225500 14956781 14995047 15035513 15635177 15871543 16349087 16395709
14373A6395709K55691M08407M83347M94799J36738N2062L45998Q42772N35045
$$ 16395709 16651400 17059807 17543154 18037953 18174691 18226753 18572751 19415523 19950568
14364A9950568j92030Q36463L61731O07815O04951K16423O64185L62132M80267
$$ 19950568 19758538 20595001 20956732 21564547 22169498 22385921 23050106 23412238 23892505
14355B3892505M66558R27447N15285M80111N69587N73001Q13838N49778R24259
$$ 23892505 24359063 25286510 25801795 26281906 26851493 27424494 28238332 28788110 29712369
14346B9712369P16458N56423J118650O87392J039263Q64125R09919J157011O09932
$$ 29712369 30428827 30985250 32103900 32791292 33830555 34694680 35604599 36761610 37371542
14337C7371542J153996J094816R72756J500790J398052J572737J002848J554288
$$ 37371542 38525538 39620354 40593110 42093900 43491952 45064689 46067537 47621825
14329D7621825J404845J448433J541983K051432J472064K384251J555956J930954
$$ 47621825 49026670 50475103 52017086 54068518 55540582 57924833 59480789 61411743
14321F1411743K438423K394289K644604K155037K726721K624662K889967L449401
$$ 61411743 63850166 66244455 68889059 71044096 73770817 76395479 79285446 82734847
14313H2734847K798173L460254L899153L993227L739750M685980M276953N394349
$$ 82734847 85533020 88993274 92892427 96885654 100625404 105311384 109588337 114982686
14305A14982686M953216N246496N798113O162281O958171O384515P559427P728267
$$ 114982686 119935902 125182398 130980511 137142792 144100963 150485478 158044905 165773172
14297A65773172P981021Q699336Q921553R727118R919851J0792611J1136483J1454990
$$ 165773172 173754193 182453529 191375082 201102200 211022051 221814662 232951145 244406135
14289B44406135J2235181J2710992J3337922J3797317J4075230J5032800J4263677
$$ 244406135 256641316 269352308 282690230 296487547 310562777 325595577 339859254
14282C39859254J5047448J4593574J4774321J4090862J3597646J2779490J1755457
$$ 339859254 354906702 369500276 384274597 398365459 411963105 424742595 436498052
14275D36498052J0255631Q105744M310227J154360O28759P55324j082868m484575
$$ 436498052 446753683 454859427 459169654 460324014 460952773 461708097 460625229 456140654
14267D56140654n813340o926154q418071j0172306j2303339j3796380j4545514
$$ 456140654 450327314 443401160 434983089 424810783 412507444 398711064 384165550
14260C84165550j5314357j5846692j5545019j5469770j5423870j4632123j4110730
$$ 384165550 368851193 353004501 337459482 321989712 306565842 291933719 277822989
14253B77822989j3656288j3147834j2653165j1554918j1565133j0429629j0241838
$$ 277822989 264166701 251018867 238365702 226810784 215245651 204816022 194574184
14246A94574184r337267q752296q015014q194169p490196p410699o782780o138886
$$ 194574184 185236917 176484621 168469607 160275438 152785242 145374543 138591763 132452877
14238A32452877n583369n288158n226609n128655n001625m065603m143760l533616
$$ 132452877 126869508 121581350 116354741 111226086 106224461 102158858 98015098 94481482
14230I4481482l561152l847066l294185l558591k791071k840153k729278k527918
$$ 94481482 90920330 87073264 83779079 80220488 77429417 74589264 71859986 69332068
14222F9332068k517033k327678j772211k629320j659566k423556j387447k004382
$$ 69332068 66815035 64487357 62715146 60085826 58426260 56002704 54615257 52610875
14214E2610875j034494j757703j522409j783585j192652j592029q93810j070050
$$ 52610875 51576381 49818678 48296269 46512684 45320032 43728003 42834193 41764143
14206D1764143j192106j207745j265267p81137j243009o01864o90757j267347
$$ 41764143 40572037 39364292 38099025 37317888 36074879 35473015 34782258 33514911
14198C3514911o65184q72138j039870p47383o94613n29265j024561n01823r19858
$$ 33514911 32849727 31977589 30937719 30190336 29495723 28966458 27941897 27440074 26520216
14189B6520216k21902r14374n97589n07270j95900n66083j122848q1087n13449
$$ 26520216 26298314 25383940 24786351 24279081 24083181 23517098 22394250 22313163 21799714
14180B1799714m97076m57163n10363k15973k80681n10779l14346m99937m50737
$$ 21799714 21302638 20845475 20335112 20119139 19838458 19327679 19013333 18513396 18062659
14171A8062659m54587j1862l99485m01310p21644J80776l59837l66055k84283
$$ 18062659 17608072 17596210 17196725 16795415 16073771 16254547 15894710 15528655 15244372
14162A5244372k05775l9364o81277J55464m99347j22546k01721k25356j30441
$$ 15244372 15038597 14999233 14317956 14473420 13974073 13851527 13649806 13424450 13294009
14153A3294009j99153o73379J57929m28012o7126j07531k32441l93433r8926k95938
$$ 13294009 13094856 12421477 12579406 12151394 12084268 11976737 11744296 11350863 11251937 10955999
14143A0955999K28241l27513m5651l69080p2295Q0537l32656l24088j2733k6962
$$ 10955999 11184240 10856727 10811076 10441996 10369701 10450238 10117582 9793494 9780761 9753799
14133I753799k6536m53565K41806n14452k92887O6751J01153l07552l99846L74571
$$ 9753799 9727263 9273698 9515504 9001052 8708165 8774916 8876069 8568517 8168671 8543242
14123H543242k30318j11689r3693j14737l35451k10012J90363n83060L01899n4804
$$ 8543242 8312924 8201235 8107542 7992805 7657354 7447342 7637705 7054645 7356544 7301740
14113G301740j65034K10820j78736m64394L50811l35497Q071q4847P0469l97752
$$ 7301740 7136706 7347526 7168790 6704396 7055207 6719710 6727781 6642934 6713403 6315651
14103F315651j26865K13177O3260j3628k18517j94974j68863k32105J78070k4017
$$ 6315651 6188786 6401963 6465223 6451595 6233078 6038104 5869241 5637136 5815206 5791189
14093E791189m6238j11839j41475R6039l17544O6689M5536R6379j46264m41784
$$ 5791189 5744951 5633112 5491637 5587676 5270132 5336821 5382357 5478736 5332472 4890688
14083D890688L179L65468m25362J42192q7313j66772J1998j95605K42516k11463
$$ 4890688 4893867 5259335 4833973 4976165 4888852 4722080 4734078 4538473 4780989 4569526
14073D569526K1614j4573K2398L2159l20555k2854j37508r2117K69728R2073k67328
$$ 4569526 4591140 4576567 4598965 4631124 4310569 4287715 4150207 4058090 4327818 4419891 4152563
14062D152563K38808j56426j00191r6208p0677k7834j90539j25176M46050k28495
$$ 4152563 4391371 4234945 4134754 4038546 3967869 3940035 3749496 3624320 4070370 3841875
14052C841875k78687j96315L87857P4112m04365j40683j47487Q7458J21462k0492
$$ 3841875 3563188 3366873 3754730 3828842 3424477 3283794 3136307 3223765 3345227 3324735
14042C324735K39621l70105J93248r7107J70651k82129R0503P325k25675K74773
$$ 3324735 3564356 3194251 3387499 3290392 3461043 3178914 3269417 3276742 3051067 3325840
14032C325840j4261r2114k64503J36931J09723j5975l49257N9157j43985L1423
$$ 3325840 3311579 3219465 2954962 3091893 3201616 3185641 2836384 2895541 2751556 2782979
14022B782979J10816L5659m11032J05150L23002l62861O4672j05341J69019l8517
$$ 2782979 2893795 2929454 2518422 2623572 2946574 2583713 2648385 2543044 2712063 2673546
14012B673546r4451l2899p4411K51650k57317N9827k53467L30948k22326j1951
$$ 2673546 2579095 2546196 2471785 2723435 2466118 2525945 2272478 2603426 2381100 2369149
14002B369149k32473L95862N2187l88731R168K96340r3755O1696l08956J06327
$$ 2369149 2136676 2532538 2584725 2195994 2205162 2501502 2407747 2469443 2160487 2266814
13992B266814j10103L22049N57679J312769K868032O847652J7868167J4259235
$$ 2266814 2156711 2478760 3036439 4349208 7217240 14064892 31933059 46192294
13984D6192294k1321852j1684208m886387k103031j339972m24534l63082p81284
$$ 46192294 24870442 13186234 8299847 6196816 4856844 4432310 4069228 3287944
13976C287944n57149L42642r0024j56211q7854k95135k9381j0530K47894p2571
$$ 3287944 2730795 3073437 2983413 2827202 2739348 2444213 2414832 2404302 2652196 2579625
13966B579625J11093J39374n63962l6167L2339p0400l4445L96761n81094k16321
$$ 2579625 2690718 2830092 2266130 2229963 2262302 2191902 2157457 2554218 1973124 1756803
13956A756803N20815j43220K82700k54232r2561q8685K55392l07696j23293K23015
$$ 1756803 2277618 2134398 2417098 2162866 2070305 1981620 2237012 1929316 1806023 2029038
13946B029038L2470k90904J11881l02220K11600J46857j67487J20128k4701l06940
$$ 2029038 2061508 1770604 1882485 1580265 1791865 1938722 1771235 1891363 1866662 1559722
13936A559722K71445j32843j30300J66647o8001k8524J40304L17953n94129K49295
$$ 1559722 1831167 1698324 1568024 1734671 1666670 1638146 1778450 2096403 1502274 1751569
13926A751569j92694K02680k58013J16008K6266j68440R1113k22750K34601J5761
$$ 1751569 1558875 1761555 1503542 1619550 1645816 1477376 1568489 1345739 1580340 1596101
13916A596101J25052j38415L19982n10173K41695j9444j86620m6612M39434l75928
$$ 1596101 1721153 1582738 1902720 1392547 1634242 1614798 1428178 1381566 1821000 1445072
13906A445072k06382K69216l45804R1180K04662k39612J99372j27184j56610L16169
$$ 1445072 1238690 1507906 1162102 1253282 1457944 1218332 1417704 1290520 1133910 1450079
13896A450079j76824n0495q3777M0928o660K67984l01909M9772o1671M538j28250
$$ 1450079 1273255 1222760 1138983 1179911 1173251 1441235 1139326 1189098 1127427 1131965 1003715
13885A003715J21442k18768J91405L12529n11253L95739n151K38657l06545P8984
$$ 1003715 1125157 906389 1097794 1410323 899070 1294809 1289658 1528315 1221770 1300754
13875A300754l18591J25405J30222J6664k71980K34281j84893K54969M4570j18983
$$ 1300754 982163 1107568 1237790 1254454 982474 1216755 1031862 1286831 1331401 1212418
13865A212418l1055o3442j53522L3302O6656l2147J13148R5272m3831k7098N5334
$$ 1212418 1181363 1117921 964399 997701 1064357 1032210 1145358 1240630 1196799 1169701 1225035
13854A225035l50594M72070j96841j91459K452j01434K14313q6789j32564j08068
$$ 1225035 874441 1346511 1149670 958211 960663 859229 1073542 986753 854189 746121
13844G46121J01124L65948k91118J93228Q6930j77520n6586n9308R7319j1445
$$ 746121 847245 1213193 922075 1115303 1202233 1024713 968127 908819 1006138 994693
13834I94693K05863m4709k04879m607j5587J60241J16927k56345L57451l60191
$$ 994693 1200556 1155847 950968 946361 930774 1091015 1207942 951597 1309048 948857
13824I48857R2033j42276j33767K57612k58249J80508J03475k23754J8059k43635
$$ 948857 1040890 898614 764847 1022459 764210 944718 1048193 824439 842498 598863
13814E98863M67788j67287K11929j35477D78023M34714K24141j93894k69003J81055
$$ 598863 1066651 899364 1111293 975816 478023 912737 1136878 942984 673981 855036
13804H55036p4418Q9825o7233j36948K98163j75685P2834k85723J78586L01375
$$ 855036 780618 870443 803210 666262 964425 788740 861574 575851 754437 1055812
13794A055812k60904m2713L76683j30668J03664m08682L1364L38143p1627k7073
$$ 1055812 794908 752195 1128878 998210 1101874 693192 724556 1062699 991072 963999
13784I63999J43826m54349M3023K49526m07970L05412l78185J27565J74667j65137
$$ 963999 1107825 653476 696499 946025 538055 843467 465282 592847 767514 602377
13774F02377n9543L28396k50068L35431k57952k0526M13982m42733K00155k46365
$$ 602377 542834 871230 621162 956593 698641 678115 1092097 649364 849519 603154
13764F03154J63366j97635N2057B88506M57235j62881K33318l03080K53363j76446
$$ 603154 766520 568885 620942 288506 745741 582860 816178 513098 766461 590015
13754E90015R4283K93950m46494K25128L3169l63800M38329J39295k48159l74534
$$ 590015 684298 978248 531754 756882 790051 426251 864580 1003875 755716 381182
13744C81182L45048p6116J23691O8870l8827j18291q4508k06732L16407N5091
$$ 381182 726230 650114 773805 842675 803848 685557 601049 394317 710724 765815
13734G65815q4177O7265K56286m22620R9146l8247J2943J88620j99633K57507
$$ 765815 681638 748903 1005189 582569 681715 643468 656411 845031 645398 902905
13724I02905l67856j19679n1366K67462l00083N44995m06611j04678K32511j53619
$$ 902905 535049 415370 364004 631466 331383 876378 469767 365089 597600 443981
13714D43981j06292M7167K3024K12716J59669C76696K47123j77148M93981D10475
$$ 443981 337689 384856 407880 620596 780265 376696 623819 446671 940652 410475
13703I74435l81981j19108L15015k89161M23644j86238k4634o7391J58786D01633
$$ 974435 592454 473346 788361 499200 922844 736606 711972 644581 803367 401633
13692A92551L23382J13265J62275m8175C41707J10768J34414M4494j4834J21066
$$ 192551 515933 629198 791473 743298 341707 452475 586889 631383 616549 737615
13682G37615j90469n8564J15743j3471k79721K58065J82159B49485K96521J35149
$$ 737615 547146 488582 604325 590854 311133 569198 751357 249485 546006 681155
13672F81155B92216K30388k3781q6494j72225N40920C56637L98077C1711O15598
$$ 681155 292216 522604 498823 412329 240104 781024 356637 754714 31711 647309
13662F47309j74607j8657J26330k46182Q4724k2433K71146l32495L07705j76339
$$ 647309 472702 454045 580375 334193 418917 396484 667630 335135 642840 466501
13652D66501J5158n3813J18638o9714J5699A70695J74560L16850A65916L87694
$$ 466501 481659 427846 546484 476770 492469 170695 345255 662105 165916 553610
13642E53610o6768N6299b28B28269o6528L25652M26A37148N75664j71603j40502
$$ 553610 486842 543141 -228 228269 161741 487393 487819 137148 712812 541209 400707
13631D00707L63376k01456j10000j94870A16869L26424j82012J46330Q5738q8100
$$ 400707 764083 562627 452627 257757 116869 443293 261281 407611 493349 405249
13621D05249L40670j17361R8847j01582k90345D7993K74661J32090J4521k22254
$$ 405249 745919 628558 727405 625823 335478 47993 322654 454744 469265 247011
13611B47011N6919K60049K78832l46679l6829L4041j0588j66296L18504k70521
$$ 247011 303930 563979 842811 496132 459303 493344 482756 316460 634964 364443
13601C64443J78933j36324J28358B03980O9025M25149C13182r9123J06440J85143
$$ 364443 543376 407052 535410 203980 273005 698154 313182 214059 320499 505642
13591E05642I2495B6089K55747I9603K91446j39680r1878d0404C45640J46696
$$ 505642 92495 26089 281836 99603 391049 251369 159491 -40404 345640 492336
13581D92336J69713B19250K94732E5894M15419j37529q2408J5867l6766J94439
$$ 492336 662049 219250 513982 55894 471313 333784 251376 267243 230477 424916
13571D24916A81198E5542M82027B63404A27016M27072B09336K38606A190K35715
$$ 424916 181198 55542 537569 263404 127016 554088 209336 447942 1190 236905
13561B36905J06952o6739j30854O19998k68768j01724j74622J03267l3317R0682
$$ 236905 343857 277118 146264 766262 497494 395770 221148 324415 291098 381780
13551C81780B6100M75246j28387J17217k12031h1037C05968A48478J31091J53033
$$ 381780 26100 501346 372959 490176 278145 -81037 305968 148478 279569 432602
13541D32602n0310j03032A16104J20618C259Q8996L21123A46077J48200j2616
$$ 432602 382292 279260 116104 236722 3259 92255 413378 146077 294277 281661
13531B81661L79248B15129k2298L41836k39652A11403J88325j34850J84216J33260
$$ 281661 660909 215129 192831 534667 295015 111403 299728 164878 349094 482354
13521D82354p4812a80506G8717L29427j91717K10879H7018J96730j11776J66151
$$ 482354 407542 -180506 78717 408144 216427 427306 87018 283748 171972 338123
13511C38123k7966n3347J62140P1974E9579M07859j45623k9530R1349k9575O9421
$$ 338123 310157 256810 418950 490924 59579 467438 321815 292285 383634 354059 423480
13500D23480j62618R4379e366B05441p1312L34977j05761A71804d5497D65071
$$ 423480 260862 355241 -5366 205441 134129 469106 363345 171804 -45497 465071
13489F2779M68494K4557b6978A7926Q2056K46455J27310l4629j9935j15061J90942
$$ 62779 531273 555830 -26978 17926 99982 346437 473747 439118 419183 304122 495064
13478D95064A98522L62119d3203C24569F6190O29123A23984m0193J04690a52221
$$ 495064 198522 560641 -43203 324569 66190 695313 123984 83791 188481 -152221
13467B77300k7623L2018o7836K82207o6215o6365j29251J82574j70110J44650
$$ 277300 249677 281695 213859 496066 429851 363486 234235 416809 246699 391349
13457C91349A62400O0668J45929j65432P9749A17034M22694j59807J36407g83
$$ 391349 162400 223068 368997 203565 283314 117034 539728 379921 516328 -783
13446C03713j15376K83934A2769M46099k12511A09249O0734k4657O5838J76622
$$ 303713 188337 472271 12769 458868 246357 109249 169983 145326 211164 387786
13436C87786A15000J3161J17680I2921g1273A87671M00169C611J51426a08809
$$ 387786 115000 128161 245841 92921 -71273 187671 587840 3611 155037 -108809
13425C87710a5353B53820O6630j58996H923J52802b2636B12199C1892J81061N0501
$$ 387710 -15353 253820 320450 161454 8923 161725 -22636 212199 31892 212953 263454
13414B63454o4187M2646P0871j26192D8633K05952d0204A51167J6712j9267E569
$$ 263454 199267 241913 312784 186592 48633 254585 -40204 151167 167879 148612 5569
13402d6790D13338r6016b1638B93976h3445A07286L57969a09848A53633N1967
$$ -46790 413338 317322 -21638 293976 -83445 107286 465255 -109848 153633 205600
13392B05600L40673k01793J32131o3512A54368O673N2658K46704B10385R1865
$$ 205600 546273 344480 476611 413099 154368 161041 213699 460403 210385 302250
13382C02250g7088C90337g3531B67755K6340K13122B08975K11545C9741L72533
$$ 302250 -77088 390337 -73531 267755 294095 507217 208975 420520 39741 412274
13372D12274G7088J99934j27274O2628J33835A06079L72577A9155J49860J63459
$$ 412274 77088 277022 149748 212376 346211 106079 478656 19155 169015 332474
13362C32474j51645P5260L2742J44106b4986A14523R6289K2828D1565J91439l0163
$$ 332474 180829 256089 288831 432937 -24986 114523 210812 233640 41565 233004 202841
13351B02841k7197M72468f3021A76243a51232A02761k4910j5221N98158q3611
$$ 202841 175644 648112 -63021 176243 -151232 102761 77851 62630 660788 577177
13341E77177k12261J27559k10222k5238J75481I2847k1098K5809K49004A46762
$$ 577177 364916 492475 282253 257015 432496 92847 71749 97558 346562 146762
13330A56415K97760A25827J10624H7149L42090A24748M9432J17425j12319J13248
$$ 156415 454175 125827 236451 87149 429239 124748 174180 291605 179286 292534
13320B92534j17428o7766e9315B35193C3274L43495j50280k8946N6968J27728
$$ 292534 175106 107340 -59315 235193 33274 376769 226489 197543 254511 382239
13310C82239c01367E5542a7157G0690K03475J18328j31870L8318d5877J0365B13219
$$ 382239 -301367 55542 -17157 70690 274165 392493 260623 298941 -45877 -35512 213219
13298E45872A71663J51994A37024N4603H6464J85634A03714J037J54692b11798
$$ 545872 171663 323657 137024 191627 86464 272098 103714 104751 259443 -211798
13287g399k4946B21732a70517B30868J15925G4904d2465A04582J25679F0175M4092
$$ -7399 -32345 221732 -170517 230868 346793 74904 -42465 104582 230261 60175 104267
13276A04267j9088J20891a05922A02690j9167K28962H7651a43182A03426K10468
$$ 104267 85179 206070 -105922 102690 83523 312485 87651 -143182 103426 313894
13266C13894j07315m3125g7950a2492i23A55176J8094J07965h5626A47987K95341
$$ 313894 206579 163454 -77950 -12492 -923 155176 173270 281235 -85626 147987 443328
13255D43328A7503K14738F392O6152a10281I2642J95568b8149C6657Q4377L3753
$$ 443328 17503 232241 6392 72544 -110281 92642 288210 -28149 36657 121034 154787
13244A54787D665b56809B41799a28986r0169A69910i4262B7010j2269a2323C26930
$$ 154787 4665 -256809 241799 -128986 -219155 169910 -94262 27010 14741 -12323 326930
13232D13557j27486f3026A11806i6358f223G7482g24E66179g1113A81990a13096
$$ 413557 286071 -63026 111806 -96358 -6223 77482 -724 566179 -71113 181990 -113096
13220D73806A81727J27323j01258a83714h1418E6458K36923m7344b4440B74862
$$ 473806 181727 309050 207792 -183714 -81418 56458 293381 246037 -24440 274862
13209h7354A60498J4024h5442D38887E3266B1742c1446F38J86138J53092n4363
$$ -87354 160498 174522 -85442 438887 53266 21742 -31446 638 186776 339868 285505
13198B85505I7423K68592a5074C70078E1156M38495j60611L9382c06614I5183
$$ 285505 97423 366015 -15074 370078 51156 489651 329040 368422 -306614 95183
13187g6189B23799F6650a46639C63637A13611R6652o0007b43706B12517k9403
$$ -76189 223799 66650 -146639 363637 113611 210263 150256 -243706 212517 183114
13177A83114A1782R1395C9085b54025F31217B01984r1783J1015g202B75644a01302
$$ 183114 11782 103177 39085 -254025 631217 201984 110201 121216 -7202 275644 -101302
13165E8336K14965J21892A95718G2414b6232a3020F8005q549Q5139N0303J47814
$$ 58336 273301 395193 195718 72414 -26232 -13020 68005 59456 144595 194898 342712
13154C42712j18871d2009P015C56803g561j60909B15694i2446a2091A57892G6181
$$ 342712 223841 -42009 -34994 356803 -7561 -168470 215694 -92446 -12091 157892 76181
13142C18078e4380m4258B82120A16665R4519h4282C39847a46201f5177j42429
$$ 318078 -54380 -98638 282120 116665 211184 -84282 339847 -146201 -65177 -207606
13132b07606B35596q1627i5367B4374N2252J12861l1283F5647J62750g3271C05933
$$ -207606 235596 153969 -95367 24374 76626 189487 158204 65647 228397 -73271 305933
13120i216A4096O0327a88571A55595h2043B42382d8330G0208K4604C6680h9047
$$ -9216 14096 74423 -188571 155595 -82043 242382 -48330 70208 94812 36680 -89047
13108a75875B34675n3880E4314j7562O6315A8974d1958r7092J2408A60144e1428
$$ -175875 234675 180795 54314 36752 103067 18974 -41958 -139050 -126642 160144 -51428
13096B67127j31471J02761P6699H0698d6092C23662A07292a07381p6543C91875
$$ 267127 135656 238417 315116 80698 -46092 323662 107292 -107381 -183924 391875
13085E82494c3667B83586e6316B73534d5477D9289J72360h2694b4307B04371K170
$$ 582494 -33667 283586 -56316 273534 -45477 49289 221649 -82694 -24307 204371 206541
13074B06541K1753F5222N1472C2279i1759c5353A01356J41305a97807B70273q6841
$$ 206541 228294 65222 116694 32279 -91759 -35353 101356 242661 -197807 270273 183432
13063A83432l0904J67984a99438l5603L2479d6989D39131A93366B0537K3815P9954
$$ 183432 152528 320512 -199438 -235041 -202562 -46989 439131 193366 20537 44352 124306
13052A24306K4721n1557B4082L48077o2648F2319J62397b53795A47769l2460k1521
$$ 124306 149027 97470 24082 372159 309511 62319 224716 -253795 147769 115309 93788
13041I3788L71697a27332A75650k1408C070J69412J94016a82389A48205B731J08096
$$ 93788 465485 -127332 175650 154242 3070 172482 366498 -182389 148205 2731 110827
13030A10827M6262C811e1704B75345j23719G891K76381n3101a19121C68651A07464
$$ 110827 157089 3811 -51704 275345 151626 7891 284272 231171 -119121 368651 107464
13018A39992k2260O8804K85164a8597k38139A5784N676O0131Q4673J24344j39867
$$ 139992 117732 186536 471700 -18597 -256736 15784 21460 81591 166264 290608 150741
13007A50741G0335J55797g4485E7203a84101O7668A18533a0368A80096l4863M3849
$$ 150741 70335 226132 -74485 57203 -184101 -116433 118533 -10368 180096 145233 189082
12996A89082H0427J59032m1853a7756B01496j9363b15249g0506D18462j95555
$$ 189082 80427 239459 197606 -17756 201496 182133 -215249 -70506 418462 222907
12986B22907e5418J1447B54713G391N6872N5363n4044a08738K1957A14682K246
$$ 222907 -55418 -43971 254713 7391 64263 119626 65582 -108738 -86781 114682 116928
12975A16928m5243J86629D9856i1403B74010b4245m0860D9618a81154A32031i8491
$$ 116928 71685 258314 49856 -91403 274010 -24245 -65105 49618 -181154 132031 -98491
12963A8731O0937J41932J53913C3931g0716m7146b6260D3427K05711K66800A30750
$$ 18731 79668 221600 375513 33931 -70716 -117862 -26260 43427 249138 515938 130750
12951c97861B010i0573A72350a01271F2182b78750d9525A41111a3374B43284a66053
$$ -397861 2010 -90573 172350 -101271 62182 -278750 -49525 141111 -13374 243284 -166053
12939C25416H0886j3897A8810L87017f6976E7488J8844J3626L60836a01663B49737
$$ 325416 80886 66989 18810 405827 -66976 57488 76332 89958 450794 -101663 249737
12927A61919J50845j54605J8421F5220M12298b66149b1710A27899a90787A22781
$$ 161919 312764 158159 176580 65220 477518 -266149 -21710 127899 -190787 122781
12916A0368J08286L13051e263l97570A64419B3272c9043A86553B0913m903O9994
$$ 10368 118654 431705 -5263 -402833 164419 23272 -39043 186553 20913 16010 86004
12905H6004K24157A392b84559O9211C18607l6164A18499c07475I7369K2822c37569
$$ 86004 310161 1392 -284559 -215348 318607 282443 118499 -307475 97369 120191 -337569
12893B7913b4015H4985d5870k10887g6095A84727k0726J4200B4036a8490C6925
$$ 27913 -24015 84985 -45870 -256757 -76095 184727 164001 178201 24036 -18490 36925
12881b11652E1708B3915a75234A91199a00776q4968A10694f1090A41043g4566
$$ -211652 51708 23915 -175234 191199 -100776 -185744 110694 -61090 141043 -74566
12870a51592m0366B04988a82287L0656j49533I8196K5182E7521b61647A06432
$$ -151592 -191958 204988 -182287 -151631 -301164 98196 123378 57521 -261647 106432
12859A95060b4952C7034J10786J05430e42947a27011A28287b81745A52961d2997
$$ 195060 -24952 37034 147820 253250 -542947 -127011 128287 -281745 152961 -42997
12848B7956K00876a62304A04215g6710A09208Q4942D2653J87614F6090N51b03316
$$ 27956 228832 -162304 104215 -76710 109208 194150 42653 230267 66090 66641 -203316
12836B51367c00902O5785c1658o9335b8273k18381a22199k8121E6772J92518e6490
$$ 251367 -300902 -235117 -31658 -100993 -28273 -246654 -122199 -150320 56772 249290 -56490
12824a62565C32961B1219J90868J56904A32887A2509K72728a49865C48340E1700
$$ -162565 332961 21219 212087 368991 132887 12509 285237 -149865 348340 51700
12813a47624d3687A11955r577d7550C7576Q1989a83266A21888l4505a03965l38164
$$ -147624 -43687 111955 102378 -47550 37576 119565 -183266 121888 87383 -103965 -442129
12802d42129A99215d3282j86672d0120o0998C68550F630J19174E7897a35950C09275
$$ -442129 199215 -43282 -229954 -40120 -101118 368550 6630 125804 57897 -135950 309275
12790I9860J19680a4539j45692B40543c9512n04286J36476B49733j18898K4551
$$ 99860 219540 -14539 -160231 240543 -39512 -543798 -407322 249733 130835 155386
12780A55386c05729i7234a9328B2545a61481B31221B5148K8582d4975I1405K08950
$$ 155386 -305729 -97234 -19328 22545 -161481 231221 25148 53730 -44975 91405 300355
12769C00355a24125B45221D3256L4663a55896f902C33580e9938A08398J37377
$$ 300355 -124125 245221 43256 77919 -155896 -6902 333580 -59938 108398 245775
12759B45775b9252n61749a39424c8717J3993F4918b65851A66108J9512f9271l2608
$$ 245775 -29252 -591001 -139424 -38717 -24724 64918 -265851 166108 185620 -69271 -101879
12748a01879I2595J85830m0801a63117B61230d1034C73724j45411Q9906A09626
$$ -101879 92595 278425 237624 -163117 261230 -41034 373724 228313 318219 109626
12737B76507J6706A36743K49669A27500A4532J54120c6835D8299J35383J5475
$$ 276507 293213 136743 386412 127500 14532 168652 -36835 48299 183682 199157
12727A99157F8891i976A27883d4876A84389a79219q3782e4953B04941h9226a1873
$$ 199157 68891 -9976 127883 -44876 184389 -179219 -263001 -54953 204941 -89226 -11873
12715B5110c7174A78799G40K15154Q3092N5040J6240A57773m6636q425J69370
$$ 25110 -37174 178799 740 215894 298986 354026 370266 157773 111137 102712 272082
12704B72082i9648B65031j00508C739j353a33934I3437i8999l35800B80230A16903
$$ 272082 -99648 265031 164523 3739 2386 -133934 93437 -98999 -434799 280230 116903
12692D81043A08738K6229E9073h8308B76386A8704c4379C55951F8318k6458K35651
$$ 481043 108738 134967 59073 -88308 276386 18704 -34379 355951 68318 41860 277511
12681B77511A05196K58598a67001H2418M44420b52282B3986J82148o1565m2562
$$ 277511 105196 363794 -167001 82418 526838 -252282 23986 206134 144569 102007
12671A02007L08014n2736g5878C10121A23440b0401C90314j16882P9693j30285
$$ 102007 410021 357285 -75878 310121 123440 -20401 390314 273432 353125 222840
12661B22840c4449C09864A35382K13637j29878Q9588P840E0941A3662K36224H8461
$$ 222840 -34449 309864 135382 349019 219141 308729 316569 50941 13662 249886 88461
12649B25421G4243P5494o9996M920B2137a709r1569B54785b63225C59207I1896
$$ 225421 74243 149737 79741 84661 22137 -1709 -93278 254785 -263225 359207 91896
12637A96805L2394A13271h9579A84762j3017A4904f2141B26875J01291O1079j54897
$$ 196805 229199 113271 -89579 184762 171745 14904 -62141 226875 328166 389245 234348
12626B34348b60224N3173A58927n5156k4562R7021i781F5919L55498d630B35388
$$ 234348 -260224 -207051 158927 103771 79209 176230 -9781 65919 421417 -4630 235388
12614A5247R5342b83140C48772h4835I2940A6353K47769a48695A61052c29094
$$ 15247 110589 -283140 348772 -84835 92940 16353 264122 -148695 161052 -329094
12603C32405G1412M0923a09702A40793J60893j068C7594K56239b29525D53285
$$ 332405 71412 112335 -109702 140793 301686 300618 37594 293833 -229525 453285
12592A32612l0531A6180h3457j7132A58799e3941C9924b45571P5605k00395A06553
$$ 132612 102081 16180 -83457 -100589 158799 -53941 39924 -245571 -169966 -370361 106553
12580d5183J7300a0220A01935i5869a0415B57631k9537r9325E4929L7482J14410
$$ -45183 -27883 -10220 101935 -95869 -10415 257631 228094 128769 54929 92411 206821
12569B06821d3979r902j300A8872L31872j66540n4232a53323I7088i2856C6314
$$ 206821 -43979 -53881 -55181 18872 350744 184204 129972 -153323 97088 -92856 36314
12557C02330F3606K24494B5007B771K48046b53576D17995a07165A95131c85393
$$ 302330 63606 288100 25007 2771 250817 -253576 417995 -107165 195131 -385393
12546e2296A36800e753C23410j36239G3429c91474a7606A32657M3819B8772A323
$$ -52296 136800 -5753 323410 187171 73429 -391474 -17606 132657 176476 28772 1323
12534f1697C91020f217C05510A44204K21323B8720J23338N077k3801J42076m878
$$ -61697 391020 -6217 305510 144204 365527 28720 152058 157135 133334 275410 270532
12523B70532o3867N39602C4373K23169A18951c36085a54090P0536B58810e9994
$$ 270532 206665 746267 34373 257542 118951 -336085 -154090 -83554 258810 -59994
12512b49946N1025a2743C11999E8547c4164B32460a65189B87988j05764M4200
$$ -249946 -198921 -12743 311999 58547 -34164 232460 -165189 287988 182224 226424
12502B26424L8790r1185M710L3094J08305R7153A4512J17979b17457d2H6659i3553
$$ 226424 265214 174029 178739 211833 320138 417291 14512 132491 -217457 -42 86659 -93553
12489A15240a47285D3957b05824d7969B87728J15488A22061Q9324a06805r1219
$$ 115240 -147285 43957 -205824 -47969 287728 403216 122061 211385 -106805 -198024
12479a98024A46841K69469f8402O451j52288A65538a67015A6359b65234c6579
$$ -198024 146841 416310 -68402 -61951 -214239 165538 -167015 16359 -265234 -36579
12468c29394c6057m7170d0303G9777K081a18591C12699G9652i210A34300a30626
$$ -329394 -36057 -83227 -40303 79777 81858 -118591 312699 79652 -9210 134300 -130626
12456B20924a74530j01656E0678g1407D5020J7629k9238h1415F829J08532d6488
$$ 220924 -174530 -276186 50678 -71407 45020 62649 33411 -81415 6829 115361 -46488
12444c94137E5347a78188a0261j71984n6382B4157O6191a18454k0181J6745A51675
$$ -394137 55347 -178188 -10261 -182245 -238627 24157 90348 -118454 -138635 -121890 151675
12432a43935A79153l9342b19227E9551J218a21750J0445j34820h5899A69290m885
$$ -143935 179153 139811 -219227 59551 60769 -121750 -111305 -246125 -85899 169290 164405
12421A64405l2175a70220B99300a6796k4012j62249P3286j49098B3600J07823
$$ 164405 132230 -170220 299300 -16796 -40808 -203057 -129771 -278869 23600 131423
12411A31423a37407m7282D0483L06406a35527B13739b15704n1173D13674j10222
$$ 131423 -137407 -184689 40483 346889 -135527 213739 -215704 -266877 413674 303452
12401C03452a71496A29830E5998b06263f9142I0882A6060e4825j76520f0884A07740
$$ 303452 -171496 129830 55998 -206263 -69142 90882 16060 -54825 -231345 -60884 107740
12389a13478e1579j74797i2288j43920e184A27511c89125e9564j40814B09802
$$ -113478 -51579 -226376 -92288 -236208 -5184 127511 -389125 -59564 -200378 209802
12378b15867E2678c9285n4982B79326b75C57719k6542I0525J31179H3766b77928
$$ -215867 52678 -39285 -94267 279326 -275 357719 331177 90525 221704 83766 -277928
12366A11679C2655h0746I823P3302B1353J34057b41083c0494j89702B95807C7816
$$ 111679 32655 -80746 9823 83125 21353 155410 -241083 -30494 -220196 295807 37816
12354H732a75119E408b43443g7566H2330e216j02710j77730G1656N7552J11029
$$ 8732 -175119 5408 -243443 -77566 82330 -5216 -107926 -285656 71656 129208 240237
12343B40237b15310J05734K6918d62j39104K1021r8896A13155f5099B16654E85
$$ 240237 -215310 -109576 -82658 -462 -139566 -118545 -217441 113155 -65099 216654 585
12331b32989A3818N7469d3118E5778j1507e7501A33712R6099a30430I9515a14795
$$ -232989 13818 71287 -43118 55778 44271 -57501 133712 229811 -130430 99515 -114795
12319A22141Q5992l3427n2697C6153J85249a08664k29443B5328J98268A9518J01615
$$ 122141 208133 174706 122009 36153 221402 -108664 -338107 25328 223596 19518 121133
12308A21133a92503A79457a85540A6739a85243A65548a0362C29986e0818A93492
$$ 121133 -192503 179457 -185540 16739 -185243 165548 -10362 329986 -50818 193492
12297B3535c9771k05807M5475j02652P3238B53341B3362h632I3503J07512a43827
$$ 23535 -39771 -245578 -200103 -302755 -229517 253341 23362 -8632 93503 201015 -143827
12285A11107g9065G9624b68604e2651A79614a13911A09750J78894A06237Q2912
$$ 111107 -79065 79624 -268604 -52651 179614 -113911 109750 288644 106237 189149
12275A89149K377R3433b88023D4469J70296b41831A59607J37480q1394H3755q346
$$ 189149 191526 284959 -288023 44469 214765 -241831 159607 297087 215693 83755 75409
12264G5409K7455a28593C39881c1095C7993R1549e3038j27239B05210m4640b93183
$$ 75409 102864 -128593 339881 -31095 37993 129542 -53038 -180277 205210 160570 -293183
12252e2853A02792M41208I3135C2224L17217b92103C62334b4054B31990R535J94623
$$ -52853 102792 544000 93135 32224 349441 -292103 362334 -24054 231990 241525 436148
12241D36148c9510A06950K8237K47825C0146e7049m6227C20653j8783A00697J43557
$$ 436148 -39510 106950 135187 383012 30146 -57049 -103276 320653 301870 100697 244254
12230B44254K9998F162K91393R9187a27219D41368o6723F046J84695M0459J71285
$$ 244254 274252 6162 297555 396742 -127219 441368 374645 6046 190741 231200 402485
12219D02485A7197M27299A71739L47965B56085Q0740E3853d822B56789E1124a80112
$$ 402485 17197 444496 171739 519704 256085 336825 53853 -4822 256789 51124 -180112
12207H7635L5571l9525L10454n6128A38948J13877J38239l1585o3163j39565K29317
$$ 87635 123206 83681 394135 338007 138948 252825 391064 359479 296316 156751 386068
12196C86068A67802B0565N63948c9320I5407j8622L22382I0748O2325K03809G2250
$$ 386068 167802 20565 584513 -39320 95407 76785 399167 90748 153073 356882 72250
12184A87961c42070A63697C6852a72282p7074C79247g5024A43575m1220L41926
$$ 187961 -342070 163697 36852 -172282 -249356 379247 -75024 143575 102355 444281
12174D44281c5666B57879O4849E5533a87549D28092I5011A3778J12043L6254f0987
$$ 444281 -35666 257879 322728 55533 -187549 428092 95011 13778 125821 162075 -60987
12162B81448e9344H8523j399K0441K36985g8868A82708J00714a91570A35551c97549
$$ 281448 -59344 88523 87124 107565 344550 -78868 182708 283422 -191570 135551 -397549
12150A60687a77895A63538a7520I9425N4662l9568a14652A32379a66731A63031
$$ 160687 -177895 163538 -17520 99425 154087 114519 -114652 132379 -166731 163031
12139D8644J02310f1122A85464a25340N9049j4791B51475H0773j6127b06611d5328
$$ 48644 150954 -61122 185464 -125340 -66291 -81082 251475 80773 64646 -206611 -45328
12127A52000a06891B46874a20276B26976n7624a66108C7006j0103Q7869J92175
$$ 152000 -106891 246874 -120276 226976 169352 -166108 37006 26903 114772 306947
12117C06947i5367A73292b41054A07582L2569l9921j8999f8616A62964J72849
$$ 306947 -95367 173292 -241054 107582 140151 100230 81231 -68616 162964 335813
12107C35813D0295j4349j827p816i3230D0294c8418a815A7339a77424B9499d1577
$$ 335813 40295 25946 24119 16303 -93230 40294 -38418 -1815 17339 -177424 29499 -41577
12094a3613m6851C08660a56957A15132n2403B251c5964a2315A73932a67279N5056
$$ -13613 -60464 308660 -156957 115132 62729 2251 -35964 -12315 173932 -167279 -112223
12083a12223A06210R302b97585d6272C8196c04145B0481c0442j31606D7456f4007
$$ -112223 106210 115512 -297585 -46272 38196 -304145 20481 -30442 -162048 47456 -64007
12071a44207C54026g6724B80547J22461N64810P69286E15852A18670P8737R161
$$ -144207 354026 -76724 280547 403008 967818 1737104 515852 118670 197407 206568
12061B06568j01907C1982R1020c7901G5015B6181E579h2216A79436J1531E3472
$$ 206568 104661 31982 123002 -37901 75015 26181 5579 -82216 179436 190967 53472
12049A1542c3528j81351g7107D0087L7921c6305j26294B06555c0615r2437o0691
$$ 11542 -33528 -214879 -77107 40087 78008 -36305 -162599 206555 -30615 -123052 -183743
12038a83743f3836j58893i7985A83784p8821a11395N1918j67383f3759A62324
$$ -183743 -63836 -222729 -97985 183784 104963 -111395 -59477 -226860 -63759 162324
12027a93411A68437L318h6452M286A77222a3021A94974C4506c3362J0173j81941
$$ -193411 168437 171755 -86452 -82166 177222 -13021 194974 34506 -33362 -23189 -205130
12016b05130h8554A81541E2294b94452A79436N8467A7292J96661d1772A7921h1430
$$ -205130 -88554 181541 52294 -294452 179436 237903 17292 213953 -41772 17921 -81430
12004f5316j87306G4581a23489j28572c8696a1897E8628j6292c60196j63244K60896
$$ -65316 -252622 74581 -123489 -252061 -38696 -11897 58628 42336 -360196 -523440 -262544
11993b62544B22776e2735G2580a40071k51841B27812a4868r1468d5077E6319K21060
$$ -262544 222776 -52735 72580 -140071 -391912 227812 -14868 -106336 -45077 56319 277379
11982B77379C6269K06877b0794j99837B2929e887H2974b9728k30162R5481G7292
$$ 277379 36269 243146 -20794 -220631 22929 -5887 82974 -29728 -259890 -164409 77292
11970b8227j30692C9882b07611c3334A88825A9534L12490F3448J21920H7732a00047
$$ -28227 -158919 39882 -207611 -33334 188825 19534 332024 63448 185368 87732 -100047
11958C61964j41668J4813c03542A7197c89595a60103A80440e5290q2075D5644
$$ 361964 220296 235109 -303542 17197 -389595 -160103 180440 -55290 -137365 45644
11947a74860P6091A06025a10743A30883A5623c17209G8028a70733A50141K07052
$$ -174860 -98769 106025 -110743 130883 15623 -317209 78028 -170733 150141 357193
11937C57193f6074j53618e1841A26167o2337M4210J82240C2188J59884c03544
$$ 357193 -66074 -219692 -51841 126167 63830 108040 290280 32188 192072 -303544
11926B16962A08333G250R390a70867d9520A27159E9246a42538A9521K68703a30909
$$ 216962 108333 7250 16640 -170867 -49520 127159 59246 -142538 19521 288224 -130909
11914G5976b53317A48812l6395a21891A80234c04105a7444k92420i2075A72638
$$ 75976 -253317 148812 112417 -121891 180234 -304105 -17444 -309864 -92075 172638
11903a96372R1879I0281a76389j80242a11560B7848d48875k5104a70303A21669
$$ -196372 -104493 90281 -176389 -356631 -111560 27848 -448875 -473979 -170303 121669
11892a77460f8144k2140o4703J1121E989R9851a75298B46265G4220e34433G7605
$$ -177460 -68144 -90284 -154987 -143866 5989 105840 -175298 246265 74220 -534433 77605
11880c05611A51980j6874a40657q8275a05999M9150B06495B9430a31970e7886
$$ -305611 151980 135106 -140657 -228932 -105999 -56849 206495 29430 -131970 -57886
11869a5829k34675N8500c0225r7080A48342d5453E6766c4704j8724l26431E3023
$$ -15829 -250504 -192004 -30225 -127305 148342 -45453 56766 -34704 -53428 -379859 53023
11857f8228I3668a85579A68760e8792k40202a04516B00118a2457H2514b23926
$$ -68228 93668 -185579 168760 -58792 -298994 -104516 200118 -12457 82514 -223926
11846A81118p5241a73265m7458I907b60157M4522G4340Q5568B0111a04858j81693
$$ 181118 105877 -173265 -220723 9907 -260157 -215635 74340 159908 20111 -104858 -286551
11835b86551A04605Q3212b12389c8947l91662A98361a24209k41762B43151e8628
$$ -286551 104605 187817 -212389 -38947 -430609 198361 -124209 -365971 243151 -58628
11824a42991A83179d4987B45770B8439a58395A55599H439k09a95761g8908F3628
$$ -142991 183179 -44987 245770 28439 -158395 155599 8439 8230 -195761 -78908 63628
11812a94038i0880j47503a0740j07679A63878g044B58990o6285J40002c9642A14159
$$ -194038 -90880 -238383 -10740 -118419 163878 -7044 258990 192705 332707 -39642 114159
11800a00680c5146k77444D1968P4865O5857a30129m6407i472G9510L6938k5059
$$ -100680 -35146 -312590 41968 116833 182690 -130129 -176536 -9472 79510 116448 91389
11789I1389a04715C152b82609h5264G6320R8382K4881D5088J48829e310o8784
$$ 91389 -104715 3152 -282609 -85264 76320 174702 199583 45088 193917 -5310 -74094
11778g4094E7570b26425g0623D8436a63224a7378k22539g0931A85749E9712P5375
$$ -74094 57570 -226425 -70623 48436 -163224 -17378 -239917 -70931 185749 59712 135087
11767A35087a39355q1147F4115a17435B41959a52334A4803K8388f7626A35070
$$ 135087 -139355 -220502 64115 -117435 241959 -152334 14803 43191 -67626 135070
11756a09408H3641c5655j57457D2497i1614j12721i8016b7879o8845E6030k0995
$$ -109408 83641 -35655 -193112 42497 -91614 -204335 -98016 -27879 -96724 56030 35035
11745C5035c16090J05624h4230G091d21112a76395A09947J11232a54524A26523
$$ 35035 -316090 -210466 -84230 7091 -421112 -176395 109947 221179 -154524 126523
11734b33084j35918J12750E9267J05735f4956B8365d8063A67439d4929B05826
$$ -233084 -369002 -256252 59267 165002 -64956 28365 -48063 167439 -44929 205826
11723B6207L57374j23541m0320D6757P3157E5575c26949A63068a02282I7953D4203
$$ 26207 383581 260040 219720 46757 119914 55575 -326949 163068 -102282 97953 44203
11711A3131J68103L6070d742B1477g7252A98233b5226G914b0479A319K19826a97469
$$ 13131 181234 217304 -4742 21477 -77252 198233 -25226 7914 -20479 1319 221145 -197469
11698E1835b14946m932A20459a43412c1782j4858B84168A32414J57634b9497E02590
$$ 51835 -214946 -219878 120459 -143412 -31782 -46640 284168 132414 290048 -29497 502590
11686C48220q3452n9421G1979M9743b8093B46423A01667b0374C05644a91171B33294
$$ 348220 264768 205347 71979 121722 -28093 246423 101667 -20374 305644 -191171 233294
11674H756Q0554c8760c047C29608c2I0690j1101b09389B05847b70948o0895a32072
$$ 8756 89310 -38760 -3047 329608 -32 90690 79589 -209389 205847 -270948 -331843 -132072
11661C83712b00954E8295R9734C5772J0942h619C26168e1323h148k41214A14851
$$ 383712 -200954 58295 158029 35772 46714 -8619 326168 -51323 -8148 -249362 114851
11649A22359b72745A17561C4793J07077n7260I660a12360B54305J60210a5240
$$ 122359 -272745 117561 34793 141870 84610 9660 -112360 254305 414515 -15240
11638A47880k1180J8174e40A41392K6939k1024J4949a1297B33286b20315A36115
$$ 147880 126700 144874 -540 141392 168331 147307 162256 -11297 233286 -220315 136115
11626b4644E2408K18535B6250d1975B48987j04276a41439A52185o0701L1064i8256
$$ -24644 52408 270943 26250 -41975 248987 144711 -141439 152185 91484 122548 -98256
11614A64233N1718a12652d1361k36911F3939a3611f477h80B92663a54593A8162
$$ 164233 215951 -112652 -41361 -278272 63939 -13611 -6477 -880 292663 -154593 18162
11602C1356d8631A23691K0906L0647m8470j2642L2570m1003f2350K6336C43706
$$ 31356 -48631 123691 144597 175244 126774 114132 146702 105699 -62350 -36014 343706
11590G195J47744D5679J54462J15251C5454J8380R5892J75988j61636a74405C53292
$$ 7195 154939 45679 200141 315392 35454 53834 149726 325714 164078 -174405 353292
11578b76310g7760B20726J63709g6104b8422C75151H9751J51578j187K83926d1613
$$ -276310 -77760 220726 384435 -76104 -28422 375151 89751 241329 240142 524068 -41613
11566a0282p9405D75220B05759J07726A01334J07420C9728A8123J19463R0535
$$ -10282 -89687 475220 205759 313485 101334 208754 39728 18123 137586 228121
11556B28121i3667I5169L47689h5056m8097I3717A963N589J39017l174a82087
$$ 228121 -93667 95169 442858 -85056 -133153 93717 1963 7552 146569 143395 -182087
11544d9208F0434b55457f07j63532B61963i5962C41528G885c1840j52733P4636
$$ -49208 60434 -255457 -607 -164139 261963 -95962 341528 7885 -31840 -184573 -109937
11533a09937A55694k562m690l1393Q1291I3379J29047n1977b11936A11412a04850
$$ -109937 155694 153132 148442 117049 198340 93379 222426 170449 -211936 111412 -104850
11521a5732l0495o9668l2354r3781k3733C42108G4021B8431R494I203a81000G4050
$$ -15732 -46227 -115895 -148249 -242030 -265763 342108 74021 28431 37925 9203 -181000 74050
11508D74209B9512P5151l832J39720A182K57512a22214A5227J54060k7823D5100
$$ 474209 29512 104663 100831 240551 1182 258694 -122214 15227 169287 141464 45100
11496B3097L77152A86606k1507k5292J29754c2231B36365J53311C2356e7700A82659
$$ 23097 400249 186606 165099 139807 269561 -32231 236365 389676 32356 -57700 182659
11484A68740L29343b69563D45034A74547b5061H9145K87940j39466o1673q3069
$$ 168740 498083 -269563 445034 174547 -25061 89145 377085 237619 175946 92877
11474I2877K03198N268e2074A0742J45662P468C204M9905J4691K31689e4749A45444
$$ 92877 296075 301343 -52074 10742 156404 163872 3204 53109 67800 299489 -54749 145444
11461C90114F5582O2918M8160L37882c2339B5191h6813E7367R931c76213C26018
$$ 390114 65582 128500 176660 514542 -32339 25191 -86813 57367 67298 -376213 326018
11449a32342C13394I442L83685a7840B68381o6741l784k2182A2026M43329A78570
$$ -132342 313394 9442 393127 -17840 268381 201640 197856 175674 12026 455355 178570
11437A47809K31706n0434j33799L4967f355k2914C8390f7615A5849L86639r4367
$$ 147809 379515 329081 195282 230249 -6355 -29269 38390 -67615 15849 402488 308121
11426C08121b1491C29402E1857Q4739f8634L2238B4159K42424h1335E267A039
$$ 308121 -21491 329402 51857 136596 -68634 -36396 24159 266583 -81335 5267 1039
11414g4915C823h4782j0718a8282k0502p9478F15474A77485E667b54701J16383
$$ -74915 3823 -84782 -95500 -18282 -38784 -118262 615474 177485 5667 -254701 -138318
11403a38318A68379l1942J63653e4061a6871I2803j2446a64090L4082L9213G0701
$$ -138318 168379 136437 300090 -54061 -16871 92803 80357 -164090 -130008 -90795 70701
11391B81273A40192a08845F5410J39270b6142A25158j5168a3894j84082c3066
$$ 281273 140192 -108845 65410 204680 -26142 125158 109990 -13894 -197976 -33066
11380E7538b88888H4015J12296B798b15844c5970B08534D124i0203j5963F1773
$$ 57538 -288888 84015 196311 2798 -215844 -35970 208534 4124 -90203 -106166 61773
11368e48478a84606o5978B18363a64393a2740C7248K00547l0721a42052p6132
$$ -548478 -184606 -250584 218363 -164393 -12740 37248 237795 207074 -142052 -218184
11358b18184f3996k49666A0281a01934A07195a77437g3274B42219b50133I2973
$$ -218184 -63996 -313662 10281 -101934 107195 -177437 -73274 242219 -250133 92973
11347D20967j69001e1081E5329P2842K5041a04023B27313e136p9425r1381g5282
$$ 420967 251966 -51081 55329 128171 153212 -104023 227313 -5136 -84561 -175942 -75282
11335a12935e58B8179l240b39013j15125J15931H5425a67434F1261f0527A38003
$$ -112935 -558 28179 24939 -239013 -354138 -238207 85425 -167434 61261 -60527 138003
11323a7958l02911A22173a97539B03099J81636i7509B25245E842b43167J21363
$$ -17958 -320869 122173 -197539 203099 384735 -97509 225245 5842 -243167 -121804
11313a21804A31141n6066O60g2867H5263J0071j5827a06985A88900H9130c11010
$$ -121804 131141 75075 75735 -72867 85263 95334 79507 -106985 188900 89130 -311010
11301a34541j6002D12132A42484A4856d13675A82264n1031i7814I2575a51442
$$ -134541 -150543 412132 142484 14856 -413675 182264 131233 -97814 92575 -151442
11290f8564j0537A76374K0710c27958N2255h1865G6224e0546A28902d41834A2818
$$ -68564 -79101 176374 197084 -327958 -275703 -81865 76224 -50546 128902 -441834 12818
11278a86115G5417L4098a85300C8950a40555P669A63780a45385l8103e239k65851
$$ -186115 75417 109515 -185300 38950 -140555 -132886 163780 -145385 -183488 -5239 -271090
11267b71090j22803i7840o463j63294h8307b866k21958j9191Q0725A51384c44140
$$ -271090 -393893 -97840 -104303 -267597 -88307 -2866 -224824 -244015 -163290 151384 -344140
11255B83018E150M3274C700a23651j83600B39695f4275C03056a06688C8890A5073
$$ 283018 5150 48424 3700 -123651 -307251 239695 -64275 303056 -106688 38890 15073
11243g1578L4937n3969E7790J02432B7730L5894G009e7928b5253J2273j26295
$$ -71578 -36641 -90610 57790 160222 27730 63624 7009 -57928 -25253 -12980 -139275
11232a39275B71862D4068g6231k25406a02207L9087k27084g8815k50415J36329
$$ -139275 271862 44068 -76231 -301637 -102207 -63120 -290204 -78815 -329230 -192901
11222a92901A7801b32905C848O7495b34274e5413p0599C7978J60514b70346a31121
$$ -192901 17801 -232905 3848 71343 -234274 -55413 -126012 37978 198492 -270346 -131121
11210a22020I5079b70616R2400B42439d46375a34688p4752C7491d3850A65093
$$ -122020 95079 -270616 -178216 242439 -446375 -134688 -209440 37491 -43850 165093
11199B83201H461b133k28458e7763A42281m3767O378i8682A52607F2925i2447
$$ 283201 8461 -2133 -230591 -57763 142281 98514 104892 -98682 152607 62925 -92447
11187a15151B30296b64952E0432P6064A411c5210j63835A44153c53912A60683
$$ -115151 230296 -264952 50432 126496 1411 -35210 -199045 144153 -353912 160683
11176b7390C0218a88079O4714A22687c30250f3326A79330g2199j06367B89718
$$ -27390 30218 -188079 -123365 122687 -330250 -63326 179330 -72199 -178566 289718
11165a39053C3342M5414j615A4137R7733f064m41487a39375E6354J00404a4845
$$ -139053 33342 78756 77141 14137 111870 -6064 -447551 -139375 56354 156758 -14845
11153a7395k02897B87144D7992a99022A7727J7134c30424b3366G9988l5450a72897
$$ -17395 -220292 287144 47992 -199022 17727 34861 -330424 -23366 79988 44538 -172897
11141A04773B1195b93791C04296J25668A98206j2459o3732N8571e5868A02853
$$ 104773 21195 -293791 304296 429964 198206 185747 122015 180586 -55868 102853
11130d7141C9562J62398n6695L7846k739B3208K38324L4657H7376c49089a42452
$$ -47141 39562 201960 145265 183111 180372 23208 261532 296189 87376 -349089 -142452
11118B01469K1834o410A2232J19239M2054e6217n3263L218A53957j7367J74318
$$ 201469 223303 216893 12232 131471 173525 -56217 -109480 -106262 153957 136590 310908
11107C10908G5429O2220K3208M8644J85351L7697I505N35853A67770L3500q0101
$$ 310908 75429 137649 160857 209501 394852 432549 9505 545358 167770 201270 121169
11096A21169L77385A58766R305J14981A26598K16645j26325E4202J37416J2346
$$ 121169 498554 158766 168071 283052 126598 343243 216918 54202 191618 203964
11086B03964F6497C883J43934J30264G615J32780K45799j58687K20172j59017
$$ 203964 66497 3883 147817 278081 7615 140395 386194 227507 447679 288662
11076B88662q252d3642E32081l2368J37540k63779N8627J51346j60042A42554
$$ 288662 280410 -43642 532081 499713 637253 373474 432101 583447 423405 142554
11065a24659B05941J21282J34733j05288K78573j3992K69113j8730k99931K16141
$$ -124659 205941 327223 461956 356668 635241 621249 890362 871632 571701 787842
11055G87842L6324R1484j8652j2074J80263j78051K1921K56407l25123L44161
$$ 787842 824166 915650 896998 884924 1065187 887136 909057 1165464 840341 1184502
11045A184502J96191m79478j78025P9723q6497O3687N1044K62668m95877L27382
$$ 1184502 1380693 901215 723190 802913 716416 780103 831147 1093815 597938 925320
11035I25320m21413L90196j28755K27489l54351M93271l47954J79632L6358K42811
$$ 925320 503907 894103 765348 992837 638486 1131757 783803 963435 999793 1242604
11025A242604k41503Q9954k985j50017k07724J0386K17821l69229L50870j18364
$$ 1242604 1001101 1091055 1088070 938053 730329 740715 958536 589307 940177 821813
11015H21813j96615j74083K56955j59799K93408j51117m522L23445l1538l89105
$$ 821813 625198 451115 708070 548271 841679 690562 686040 1009485 977947 588842
11005E88842J37714Q225J82289j77207P7883n4581R2642j54083J94952J99788
$$ 588842 726556 734781 917070 739863 817746 763165 855807 701724 896676 1096464
10995A096464m58597j18134K71036J11667J64902o4891J03411k85713J17313P3673
$$ 1096464 637867 519733 790769 902436 1067338 1002447 1105858 820145 937458 1011131
10985A011131j56933R0277M14124J04257k30864K23342K65404L40354q3686M48319
$$ 1011131 854198 944475 1358599 1462856 1231992 1455334 1720738 2061092 1977406 2425725
10975B425725N24208K92732L48875J62589K71938M1862k72492l58336n99516m92746
$$ 2425725 2949933 3242665 3591540 3754129 4026067 4067929 3795437 3437101 2837585 2344839
10965B344839o2135j73882m04564J16593k77197K55776o1783q9398m7857j27932
$$ 2344839 2282704 2108822 1704258 1820851 1543654 1799430 1737647 1648249 1600392 1472460
10955A472460J76471p14375L95037n04720l0674o0131p624j82383k3413B05523
$$ 1472460 1648931 934556 1329593 824873 794199 734068 726444 544061 520648 205523
10944G88346l06716k27237L4731l257N131o5783i5162B71966B3583Q1584J18781
$$ 788346 481630 254393 289124 285867 290998 225215 -95162 271966 23583 105167 223948
10933B23948a4411j91827C5122K20736o9397J95720I3247K7679Q5384k2547a20042
$$ 223948 -14411 -206238 35122 255858 186461 382181 93247 120926 206310 183763 -120042
10921a09543L5939A47418J45495c74156d4156G7011a09817D15633j87879G5698
$$ -109543 -73604 147418 292913 -374156 -44156 77011 -109817 415633 227754 75698
10910A00423K09171a16605j42892K6921B00040a41127A01518m418f1230J7275
$$ 100423 309594 -116605 -259497 -232576 200040 -141127 101518 97100 -61230 -43955
10900d3955j23059d5491B24577C2807K77750b20209L8857A16055a36803A36532
$$ -43955 -167014 -45491 224577 32807 310557 -220209 -181352 116055 -136803 136532
10889a87237A92678a99820I5353a87090H1063b41406A04747a25161d5032A10216
$$ -187237 192678 -199820 95353 -187090 81063 -241406 104747 -125161 -45032 110216
10878A9127a38501j236A34648a89291R873I3419j7179k4888b2186F838M956J27817
$$ 19127 -138501 -139737 134648 -189291 -179418 93419 76240 51352 -22186 6838 11794 139611
10866A39611K7331a47769F01553A93424b9922A31008b3159B6552J75989E9382
$$ 139611 166942 -147769 601553 193424 -29922 131008 -23159 26552 202541 59382
10855A63771a05692I168K44435c403k7741k0500A63914a88104j20331a01926A00133
$$ 163771 -105692 9168 253603 -3403 -31144 -51644 163914 -188104 -308435 -101926 100133
10843E571L43838A51734J3543a70172A24477b54916D2125a59663p258m7339R7148
$$ 5571 349409 151734 165277 -170172 124477 -254916 42125 -159663 -166921 -214260 -117112
10832a17112l0813j19812F2258N0247L5519b22100A54259b32166H3299a41150
$$ -117112 -147925 -267737 62258 112505 148024 -222100 154259 -232166 83299 -141150
10821a81897a4541m46957B53744b14769A30664c31732C2743d0585J9277D06628
$$ -181897 -14541 -461498 253744 -214769 130664 -331732 32743 -40585 -21308 406628
10810b48843J19820e2648I4682a18065J6198A16817c81978i5022n5246N1909k22093
$$ -248843 -129023 -52648 94682 -118065 -101867 116817 -381978 -95022 -150268 -98359 -320452
10799c20452J04239O6706A01502b21823q7960A84858C2146a30184d770A5876Q9468
$$ -320452 -216213 -149507 101502 -221823 -309783 184858 32146 -130184 -4770 15876 105344
10788A05344g3799L2246p0948J9329H31c46822l2142h7700a3280C97076A28874
$$ 105344 -73799 -41553 -112501 -93172 831 -346822 -378964 -87700 -13280 397076 128874
10776a98753g5433C676a23602k54335a46619k8191I6230D540J67342e8183j1507
$$ -198753 -75433 3676 -123602 -377937 -146619 -174810 96230 4540 171882 -58183 -69690
10765f9690H9059J08282b49776a6347l28806A27214a66147A58476a26658j1328
$$ -69690 89059 197341 -249776 -16347 -345153 127214 -166147 158476 -126658 -137986
10755a37986m1046A30041j5855a2266m5341n3651q7841f3970D00176i7415G0002
$$ -137986 -179032 130041 114186 -12266 -57607 -111258 -199099 -63970 400176 -97415 70002
10743a31583N5832h863A3743P3669e8075l10357C3719b03043h0315k4443J4150
$$ -131583 -75751 -8863 13743 87412 -58075 -368432 33719 -203043 -80315 -104758 -90608
10732i0608D3496d4911D5482k0069L0332J72765h5470o4859K2764A46707J1964
$$ -90608 43496 -44911 45482 25413 55745 228510 -85470 -150329 -127565 146707 158671
10721A58671C8449a352j65369B4039M2043P103i437A16570b75371J05705P0910
$$ 158671 38449 -1352 -166721 24039 66082 73185 -9437 116570 -275371 -169666 -98756
10710i8756D0599H843a44485o1957m2312e8601k54549g0100j07283P2333o427
$$ -98756 40599 8843 -144485 -206442 -248754 -58601 -313150 -70100 -177383 -105050 -111477
10699a11477j87919d6653A32804a26478A13733c9442k93944h1441A8686K31219
$$ -111477 -299396 -46653 132804 -126478 113733 -39442 -333386 -81441 18686 249905
10689B49905j16852b21771f5934l3499k28161a35841A62293a28194b709B52729
$$ 249905 133053 -221771 -65934 -99433 -327594 -135841 162293 -128194 -2709 252729
10678b22598a07117l03614a42261p2897B4195M6681i3687a9731G4454D168c75053
$$ -222598 -107117 -410731 -142261 -215158 24195 70876 -93687 -19731 74454 4168 -375053
10666a84924K1270r2517a0998k49096J5445J0214A20590b30096i8655m8830j36095
$$ -184924 -163654 -256171 -10998 -260094 -244649 -234435 120590 -230096 -98655 -147485 -283580
10655b83580i1247A59575a78336g7342M724k50114P2024B4273J58573Q4505n6031
$$ -283580 -91247 159575 -178336 -77342 -72618 -322732 -250708 24273 182846 267351 211320
10644B11320N6350I186b12635N4391a1165F7953b46218A95730b75378A90788a48121
$$ 211320 267670 9186 -212635 -158244 -11165 67953 -246218 195730 -275378 190788 -148121
10632a09088k02263C26277j53302e9524A77170i3405B73367a8639j21769p7487
$$ -109088 -311351 326277 172975 -59524 177170 -93405 273367 -18639 -140408 -217895
10622b17895f4408k01092D8669d4175l307L659k07524A10862c09817b8236C63076
$$ -217895 -64408 -265500 48669 -44175 -47482 -43823 -251347 110862 -309817 -28236 363076
10610B2121K73436b56637D69432A93516b17516A09127m8925P5422m8521b46258
$$ 22121 295557 -256637 469432 193516 -217516 109127 60202 135624 87103 -246258
10599b53698i8529B98483c57794g5293F8547f9761j34224P1558n4695f8923j20246
$$ -253698 -98529 298483 -357794 -75293 68547 -69761 -203985 -132427 -187122 -68923 -189169
10588a89169P7834m4611j68740M3478A83589a3800k34362A78229a87952L5623
$$ -189169 -111335 -155946 -324686 -281208 183589 -13800 -248162 178229 -187952 -152329
10578a52329l07517c5432p676A58077B9715a02332L8866D4311N4509l4466c26036
$$ -152329 -459846 -35432 -43108 158077 29715 -102332 -63466 44311 98820 64354 -326036
10566C290b1728C82900g5664A37600a94730H8085N7967a68700L4159P291A77819
$$ 3290 -21728 382900 -75664 137600 -194730 88085 146052 -168700 -134541 -127250 177819
10554i2747j52933J12852c9430m4255j23288g3233D7884N5554J6933a4975A04391
$$ -92747 -245680 -132828 -39430 -83685 -206973 -73233 47884 103438 120371 -14975 104391
10542a33364N1242j71574B09751p3817n0800a71166e7017q5519k11680a37644
$$ -133364 -82122 -253696 209751 135934 85134 -171166 -57017 -142536 -354216 -137644
10531C9606i5361A3152J91641a20226k77912C1310c05695A51456E8479J55496
$$ 39606 -95361 13152 204793 -120226 -398138 31310 -305695 151456 58479 213975
10521B13975E2574J36407N5195B8473J48757L9215b31442A12061b34271a06813
$$ 213975 52574 188981 244176 28473 177230 216445 -231442 112061 -234271 -106813
10510a68513A50039b74035C1625a10526c3260P351k54586k40533B7870a1454B47957
$$ -168513 150039 -274035 31625 -110526 -33260 -25909 -280495 -521028 27870 -11454 247957
10498b3466k11399I0390a05749B02902c3185A03388a84089A06927K7238K33873
$$ -23466 -234865 90390 -105749 202902 -33185 103388 -184089 106927 134165 368038
10488C68038B7277J82441c008A64613M73750N2834A28703K43024q2974L5412n3487
$$ 368038 27277 209718 -3008 164613 638363 691197 128703 371727 288753 324165 270678
10477B70678b15128R2351D8645b44757j90139b5409B39012A4510J50110c03809
$$ 270678 -215128 -122777 48645 -244757 -434896 -25409 239012 14510 164620 -303809
10466B28880A4799a53735M475j8220B82444i1312m3531M5185g229C9116J65949
$$ 228880 14799 -153735 -149260 -167480 282444 -91312 -134843 -89658 -7229 39116 205065
10455B05065F2428N0069C0731J21218a1236j18344C31231e0366C7569b09009D4002
$$ 205065 62428 112497 30731 151949 -11236 -129580 331231 -50366 37569 -209009 44002
10443b48741A92058c00035h0888D2398g1743j9181l1508A24613b5493I180N5941
$$ -248741 192058 -300035 -80888 42398 -71743 -90924 -122432 124613 -25493 9180 65121
10432F5121d8430a4306o2688B39603a11329B59669g5068j37227R8699e665A07925
$$ 65121 -48430 -14306 -76994 239603 -111329 259669 -75068 -212295 -113596 -5665 107925
10420B05435c3752A70740e3487j6968j09218j2621B8448J2443b53604E9306K04666
$$ 205435 -33752 170740 -53487 -70455 -179673 -192294 28448 40891 -253604 59306 263972
10409B63972a26490j52643E876d96068a05070B53344F7370Q6230N1637B2963K39603
$$ 263972 -126490 -279133 5876 -496068 -105070 253344 67370 153600 205237 22963 262566
10398B62566a74546P1686C06968f6737C14324G0145n97h4243B41683b4227F453
$$ 262566 -174546 -102860 306968 -66737 314324 70145 69548 -84243 241683 -24227 6453
10386f9844A04915g6211A3041P9991a47296H1728Q6173a50160B17707q4804j1109
$$ -69844 104915 -76211 13041 93032 -147296 81728 167901 -150160 217707 132903 121794
10375A21794J72071J38178J51040N9704A94963M02592j48912p4840n4606O7251
$$ 121794 293865 432043 583083 642787 194963 597555 448643 373803 319197 386448
10365C86448J98654J18437B38823J57201J79029B82111K24778i097A43656E0340
$$ 386448 585102 703539 238823 396024 575053 282111 506889 -9097 143656 50340
10354B57619J3270L14024K50987O0832j86797A63040O6693M12765k59952E1187
$$ 257619 270889 584913 835900 896732 709935 163040 229733 642498 382546 51187
10343B94760m8302h654C6760K44424J84094A72222n4939A3295M22191C0717K29594
$$ 294760 246458 -8654 36760 281184 465278 172222 117283 13295 435486 30717 260311
10332B60311a21007C78401h3866B4666p196L78469O357A78555o5777D0665M44654
$$ 260311 -121007 378401 -83866 24666 17470 395939 402296 178555 112778 40665 485319
10321D85319h5217B54348A07913m9584J18205C4731K43007F7076k9799g8801C9731
$$ 485319 -85217 254348 107913 58329 176534 34731 277738 67076 37277 -78801 39731
10309A72493d5743A43569J60559A19525a30707M8094D7116B3216M31364e2302
$$ 172493 -45743 143569 304128 119525 -130707 -82613 47116 23216 454580 -52302
10298A72452b32156D6405O8043K47178c7074B59184a59207H0768n978d08426h0234
$$ 172452 -232156 46405 114448 361626 -37074 259184 -159207 80768 74790 -408426 -80234
10286e770k78621d1815k0960k37272G9086a54037C2891a34380B24606b24414b7732
$$ -5770 -284391 -41815 -62775 -300047 79086 -154037 32891 -134380 224606 -224414 -27732
10274B40756g1589F1496L6517a86232A05825a12780B40059g7565F6155P2822i2994
$$ 240756 -71589 61496 98013 -186232 105825 -112780 240059 -77565 66155 138977 -92994
10262B58195J47043l7860j71416N5024j0612L65600B44665c81248i3021c3234
$$ 258195 405238 367378 195962 250986 240374 605974 244665 -381248 -93021 -33234
10251b30778A79414d2111G8981A3080a70267j96014C0279I484K68270a58580n2475
$$ -230778 179414 -42111 78981 13080 -170267 -366281 30279 9484 277754 -158580 -211055
10240b11055a9175k82275E180d3262k40227J26288O7290l6582k71383i7293b7504
$$ -211055 -19175 -301450 5180 -43262 -283489 -157201 -89911 -126493 -397876 -97293 -27504
10228D7200J8036L03163b04079f0858B9290K4900B4283r964b12667j9222E9924
$$ 47200 65236 368399 -204079 -60858 29290 54190 24283 14319 -212667 -231889 59924
10216A31147a42930e6788j99985k38432a185F6556K08680b27334e9310J0241B92818
$$ 131147 -142930 -56788 -256773 -495205 -1185 66556 275236 -227334 -59310 -49069 292818
10204b0555p3104c6417E9710F197J1365a91759r9842O7031i0782r1218M8502L4907
$$ -20555 -93659 -36417 59710 6197 17562 -191759 -291601 -224570 -90782 -182000 -133498 -98591
10192i8591D8495a18636k0405m28782E3179Q6821a01660B971O8438e4759m94204
$$ -98591 48495 -118636 -139041 -567823 53179 140000 -101660 2971 71409 -54759 -548963
10181e48963a12075B64841a56578A69686c22761a12599B15432j00797k5421L4601
$$ -548963 -112075 264841 -156578 169686 -322761 -112599 215432 114635 89214 123815
10171A23815d0069j38592H151c2550k53913B1451J5568L9174a53088m4010A776
$$ 123815 -40069 -178661 8151 -32550 -286463 21451 37019 76193 -153088 -197098 1776
10159A92303b20650a7219q7664j5552C10630H7825b16493Q9446b0550o9611E6017
$$ 192303 -220650 -17219 -104883 -120435 310630 87825 -216493 -127047 -20550 -90161 56017
10147i4198B20996b02058P115e2058J2525j0247j98390D6881a84936L0491f1506
$$ -94198 220996 -202058 -194943 -52058 -39533 -49780 -248170 46881 -184936 -154445 -61506
10135c41231H9730A6134a7562A02475a39126K7026B38969a11640G7173B4338i1158
$$ -341231 89730 16134 -17562 102475 -139126 -112100 238969 -111640 77173 24338 -91158
10123A93070c22215B1742a52326A4790J48134A1322R7823b15719n8533g559A22307
$$ 193070 -322215 21742 -152326 14790 162924 11322 109145 -215719 -274252 -7559 122307
10111b21035A25042b55173d7557n0049A37107a48387a208B8736a3394A02905a07212
$$ -221035 125042 -255173 -47557 -97606 137107 -148387 -1208 28736 -13394 102905 -107212
10099C3570a23162H2162B285a12337M2490E0451b47325n4979A2575h4090H108
$$ 33570 -123162 82162 2285 -112337 -69847 50451 -247325 -302304 12575 -84090 8108
10087d4993k4214A37935D3744J3601K77409d39609d5821A68203n2749J14749a19325
$$ -44993 -69207 137935 43744 57345 334754 -439609 -45821 168203 115454 230203 -119325
10075a86150H7020c22061A70656R7040a47388e1803p8164c8390E8339K0400e04274
$$ -186150 87020 -322061 170656 267696 -147388 -51803 -129967 -38390 58339 78739 -504274
10063a04523M706B0748h9375A84730F654h8544k03754A3579i0109j20721A55502
$$ -104523 -99817 20748 -89375 184730 6654 -88544 -292298 13579 -90109 -210830 155502
10051b693q0038B59239c6023k24164a27117r1470o1857A39626i2420A8966M9771
$$ -2693 -82731 259239 -36023 -260187 -127117 -218587 -280444 139626 -92420 18966 68737
10040F8737a47918I5458e9395J7508r0939j36431O4418M4378K4591C7083i4672
$$ 68737 -147918 95458 -59395 -41887 -132826 -269257 -204839 -160461 -135870 37083 -94672
10028a92171l1705P2305L6499C7139e7113p3355G7692L59a2681G0372f0859m11182
$$ -192171 -223876 -151571 -115072 37139 -57113 -130468 77692 78051 -12681 70372 -60859 -472041
10016d72041H4861f910n16821H7478a93943j0941k04554J41181N5100k13136a17896
$$ -472041 84861 -6910 -523731 87478 -193943 -204884 -409438 -268257 -213157 -426293 -117896
10004a80542k35297Q047a13889k19849A2922a97j72506F259a0863C94540a96544
$$ -180542 -415839 -407792 -113889 -333738 12922 -197 -172703 6259 -10863 394540 -196544
9992A30549d82466B7100A1166b78901R9692p9889R0055D4901a10317k9961B6267
$$ 130549 -482466 27100 11166 -278901 -179209 -259098 -169043 44901 -110317 -140278 26267
9980b19697i2050j71969A63474k4400m1504e4042r662A41494a11334j7801A41868
$$ -219697 -92050 -264019 163474 139074 97570 -54042 -63704 141494 -111334 -129135 141868
9968c37414f593m17594F1498c35209e0219j61526I4895a97464h378j33052N1293
$$ -337414 -6593 -424187 61498 -335209 -50219 -211745 94895 -197464 -8378 -141430 -90137
9957i0137B55135n6596a49555K0306b2427A74721C5333d178A34901a36502k04423
$$ -90137 255135 198539 -149555 -129249 -22427 174721 35333 -4178 134901 -136502 -340925
9946c40925g8056K7863F3535e8562b1612C69510D7433b04769c9694l43583i303
$$ -340925 -78056 -50193 63535 -58562 -21612 369510 47433 -204769 -39694 -383277 -9303
9934d6477F6978j446l2054b00555A56727b24850d2648A67290a16352H7464k0870
$$ -46477 66978 65532 33478 -200555 156727 -224850 -42648 167290 -116352 87464 66594
9923F6594J31690a81384j50919H8056f1865A86735G2178k9965a49887G9372c07930
$$ 66594 198284 -181384 -332303 88056 -61865 186735 72178 42213 -149887 79372 -307930
9911F7851a23189j07320D6810a50708B64084f4604m1103j58459A84085a17285
$$ 67851 -123189 -230509 46810 -150708 264084 -64604 -105707 -264166 184085 -117285
9900a7998k08804o8213f1642E5986b69116h8863C7951L1781k2812Q137a65440
$$ -17998 -226802 -295015 -61642 55986 -269116 -88863 37951 69732 46920 55057 -165440
9888i3794k7810A28015O0148q0422b40629f1602k51905F8953g0969j02726f5273
$$ -93794 -121604 128015 188163 107741 -240629 -61602 -313507 68953 -70969 -173695 -65273
9876f9994D01232j41860E6207b9175A5787a98515E122J23674a2616k84876P1503
$$ -69994 401232 259372 56207 -29175 15787 -198515 5122 128796 -12616 -297492 -225989
9865b25989j73406a31509M7940a2442A96950a76510M677J595B77116O0059D4824
$$ -225989 -399395 -131509 -83569 -12442 196950 -176510 -171833 -170238 277116 337175 44824
9853a46973m4396k38462A20127i9925k8197C8389J20315J26215b89584O0993B82012
$$ -146973 -191369 -429831 120127 -99925 -128122 38389 158704 284919 -289584 -228591 282012
9841e1226D6351h5849j8580M5660C68339h7513l16982a81848H6105P009b10552
$$ -51226 46351 -85849 -104429 -58769 368339 -87513 -404495 -181848 86105 93114 -210552
9829A92125l9424J47352a36188k88227C12566g4822A82733e2425j54553m7819
$$ 192125 152701 300053 -136188 -424415 312566 -74822 182733 -52425 -206978 -254797
9819b54797j14065K9460Q9217P9865d7103m3678j20899A72522C9269b39187B23518
$$ -254797 -368862 -339402 -250185 -170320 -47103 -90781 -211680 172522 39269 -239187 223518
9807b02706B17622m0424a7187C3451K56163p2034a27735A69491a76122A13125
$$ -202706 217622 177198 -17187 33451 289614 217580 -127735 169491 -176122 113125
9796A75093f1739B23873h9901k21593e3764l54419D4570b78158Q4491b021k5811
$$ 175093 -61739 223873 -89901 -311494 -53764 -408183 44570 -278158 -193667 -2021 -27832
9785b7832H3489k075a7985k17832j01381J68269A4355J62663C9377a04932A01984
$$ -27832 83489 81414 -17985 -235817 -337198 -168929 14355 177018 39377 -104932 101984
9773B11136h4223A17337A7261d00739J50890j5950q8866A20779m4577J6164c59010
$$ 211136 -84223 117337 17261 -400739 -249849 -265799 -354665 120779 76202 92366 -359010
9761d70416H4251g3298a7138j10985d1380G1396i6569m5349O2360q288B92335
$$ -470416 84251 -73298 -17138 -128123 -41380 71396 -96569 -141918 -79558 -87846 292335
9749b14645a7601A19083a21487B07042a30175q4779d166j00280a4060m47884F4248
$$ -214645 -17601 119083 -121487 207042 -130175 -214954 -4166 -104446 -14060 -461944 64248
9737c87718G1429b60847J0914J01513c4853n5645j60382i3608d6160B58110I2174
$$ -387718 71429 -260847 -249933 -148420 -34853 -90498 -250880 -93608 -46160 258110 92174
9725i2138M5504I3039h3222A33184L8254a30572F0029A0923a5604j58704A58301
$$ -92138 -46634 93039 -83222 133184 171438 -130572 60029 10923 -15604 -174308 158301
9713B03122h9594j79843e3814j88209A41968a37398A8375g2957p0592N9113D4197
$$ 203122 -89594 -269437 -53814 -242023 141968 -137398 18375 -72957 -143549 -84436 44197
9701a98164C0141a2094A23140b68863J31991a3002l98199C25951a07926L9410
$$ -198164 30141 -12094 123140 -268863 -136872 -13002 -411201 325951 -107926 -68516
9691f8516j77057A2985b8133j80927L1707j61842J00676L7628G2052j4796c42509
$$ -68516 -245573 12985 -28133 -209060 -177353 -339195 -238519 -200891 72052 57256 -342509
9679A99933o7875g1792Q701F8459a82684O7088K7605l8283k57371f5921N335E125
$$ 199933 132058 -71792 -63091 68459 -182684 -115596 -87991 -126274 -383645 -65921 -60586 5125
9666B89524G7932L12373B8980c65936J72470f5874l9247M9046A91036j2556b73716
$$ 289524 77932 390305 28980 -365936 -193466 -65874 -105121 -56075 191036 178480 -273716
9654a59391d2376p0742A59078C4885J7747i5533k9903C35298b71753b2691G3663
$$ -159391 -42376 -113118 159078 34885 52632 -95533 -125436 335298 -271753 -22691 73663
9642E5845J99882d86706E0212N6287a5439j47643f4056k02585A49823D6156a25933
$$ 55845 255727 -486706 50212 106499 -15439 -163082 -64056 -266641 149823 46156 -125933
9630e7106A35026a7343F058c99523J60103j73003a57282A62669J86154a20997
$$ -57106 135026 -17343 6058 -399523 -239420 -412423 -157282 162669 348823 -120997
9619a60624A18587g4972j0767A90539e2833k1928k63289C7017J09494a77855C7660
$$ -160624 118587 -74972 -85739 190539 -52833 -74761 -338050 37017 146511 -177855 37660
9607b30348n3614A3757b10916c4276I8375c9107A38852a51410e9071n36094K52272
$$ -230348 -283962 13757 -210916 -34276 98375 -39107 138852 -151410 -59071 -595165 -342893
9596c42893E3079a19605k9753A77428b1880E4932a09010Da34156H435c7985j51963
$$ -342893 53079 -119605 -149358 177428 -21880 54932 -109010 4 -134156 8435 -37985 -189948
9584a89948c5765j3896A04912B1027a57529A68550b62983C01248a84664b6582
$$ -189948 -35765 -49661 104912 21027 -157529 168550 -262983 301248 -184664 -26582
9573F0570a90968e186F3141b79737j51170F89P1495P7122j2121k8871B9311J07499
$$ 60570 -190968 -5186 63141 -279737 -430907 689 72184 149306 137185 108314 29311 136810
9561A36810F1501P7383C5567N3054b75877h7616A0079J53752c05911a12806k21862
$$ 136810 61501 138884 35567 88621 -275877 -87616 10079 163831 -305911 -112806 -334668
9550c34668A18192h0026A23714J4930P3409b66830B91858h379A67530b36608j05099
$$ -334668 118192 -80026 123714 138644 212053 -266830 291858 -8379 167530 -236608 -341707
9539c41707f8676B40714a58473A50548a28844A82471L3C8533N6901b4648A00997
$$ -341707 -68676 240714 -158473 150548 -128844 182471 182504 38533 95434 -24648 100997
9527b67379C5756i438j94747j81112a78031j5488O7188c680j77954A17090K47189
$$ -267379 35756 -9438 -204185 -385297 -178031 -193519 -126331 -3680 -181634 117090 364279
9516C64279e9481K5702j07528A48723d8495A6065L5849e2560k15501q020L0461
$$ 364279 -59481 -33779 -141307 148723 -48495 16065 51914 -52560 -268061 -276081 -245620
9505b45620l5363I9220a51114K6562C29646c8516r4654j46920J29328K8155l0621
$$ -245620 -280983 99220 -151114 -124552 329646 -38516 -133170 -280090 -150762 -122607 -153228
9494a53228F8806N7327d24738A74490b5782B986J2962a26454e3337j11334J0737
$$ -153228 68806 126133 -424738 174490 -25782 2986 15948 -126454 -53337 -164671 -153934
9483a53934D8125b14888g3799k05774d070A1038a17154G080N9287j7745N7687
$$ -153934 48125 -214888 -73799 -279573 -4070 11038 -117154 7080 66367 48622 106309
9472A06309c18433b2536A17498P8761a66665p0919Q0946L4722M0512B09929f5319
$$ 106309 -318433 -22536 117498 196259 -166665 -237584 -156638 -121916 -81404 209929 -65319
9460E7487a10369j452d8701j54106d3710C7861b59406l7420a13142a4595B0761
$$ 57487 -110369 -111821 -48701 -202807 -43710 37861 -259406 -296826 -113142 -14595 20761
9448i7188j04501M330B0563a60089d4842D2417b91191A66145c37293a2005l14651
$$ -97188 -201689 -197359 20563 -160089 -44842 42417 -291191 166145 -337293 -12005 -326656
9437c26656K0482K7735H5487d9921D3153h0044o2080j73315a03886B35536I7856
$$ -326656 -306174 -278439 85487 -49921 43153 -80044 -142124 -315439 -103886 235536 97856
9425c2271j3285j35591K3618e3048k12892B61943j19058b56949a12520j92394
$$ -32271 -45556 -181147 -157529 -53048 -265940 261943 142885 -256949 -112520 -304914
9415c04914E6560O2450b1301o3850A19064a2363k40801b2850A16103c13957f2888
$$ -304914 56560 119010 -21301 -85151 119064 -12363 -253164 -22850 116103 -313957 -62888
9403A60504a88654h8057l8608A51152c33610B30044b38038I7963a34638M9307
$$ 160504 -188654 -88057 -126665 151152 -333610 230044 -238038 97963 -134638 -85331
9393h5331A58275b70361d3678m14413b13562k456K696D6168A5207K30968a95585
$$ -85331 158275 -270361 -43678 -458091 -213562 -216018 -213322 46168 15207 246175 -195585
9381a18416r2118e1318j39871A45763a3411A2569R0773c52262J61521j24898B5283
$$ -118416 -210534 -51318 -191189 145763 -13411 12569 103342 -352262 -190741 -315639 25283
9369A93832i6353n592A1469M2306c19749R201J43117L8848B26166a49793c2632
$$ 193832 -96353 -101945 11469 53775 -319749 -310548 -167431 -128583 226166 -149793 -32632
9357b48526i146l36399F2501b57765a23430B65356a3871j8781j14348b3222I2832
$$ -248526 -9146 -345545 62501 -257765 -123430 265356 -13871 -32652 -147000 -23222 92832
9345A78679a03672j71406a2946p2611k91078G6792a16871A8870a95395N2141j85420
$$ 178679 -103672 -275078 -12946 -85557 -376635 76792 -116871 18870 -195395 -143254 -328674
9334c28674H6911K8262a00679r3149d8816J0806C5762P557i4340N67j12158i5006
$$ -328674 86911 115173 -100679 -193828 -48816 -38010 35762 43319 -94340 -93773 -205931 -95006
9321a197j52191A77071G8220O1191b442j03760K7071h673r1286B4959c2397l40437
$$ -1197 -153388 177071 78220 139411 -2442 -106202 -79131 -8673 -99959 24959 -32397 -372834
9309c72834G2487b82627C677N7005c82570a45973L4484G322O3146c05045A44228
$$ -372834 72487 -282627 3677 60682 -382570 -145973 -111489 7322 70468 -305045 144228
9297A87336g8033A81872E262L55901d4389A0329a62104J843o3409h4335k40716
$$ 187336 -78033 181872 5262 361163 -44389 10329 -162104 -160261 -223670 -84335 -325051
9286c25051N0300a28922B45091a12431A83843a67405q6772G8949j4006a85993
$$ -325051 -274751 -128922 245091 -112431 183843 -167405 -254177 78949 64943 -185993
9275G5458c4130B8686c97708b2125j73783J1653k4199F3847a03115n6217N1092
$$ 75458 -34130 28686 -397708 -22125 -195908 -184255 -208454 63847 -103115 -159332 -108240
9264a08240I6508e6113F4431f9179o4904A47576b15794g5380A18149a5015n3049
$$ -108240 96508 -56113 64431 -69179 -134083 147576 -215794 -75380 118149 -15015 -68064
9253f8064I7135P8833J24034b17718B67915q6068a85815j26012H7223a55784A67278
$$ -68064 97135 175968 300002 -217718 267915 181847 -185815 -311827 87223 -155784 167278
9241B32760r8945a31834j48473D670N5058J54871H2007c85811O8380a14865B71968
$$ 232760 133815 -131834 -280307 4670 59728 214599 82007 -385811 -317431 -114865 271968
9229B43870C1851J8236b37706K9817G236K1141H259K30292h7683A43477h9901
$$ 243870 31851 50087 -237706 -207889 7236 28377 8259 238551 -87683 143477 -89901
9217D81189a51844a2331o767A91566A7702c34178J63416r7015j3063F9162J60857
$$ 481189 -151844 -12331 -19098 191566 17702 -334178 -170762 -267777 -280840 69162 230019
9206B30019A7146N7245c6375C8836o204i6619a1664l41280A46264C9706a35321
$$ 230019 17146 74391 -36375 38836 32632 -96619 -11664 -352944 146264 39706 -135321
9194A38462c0436k05918D0028c20558f8635r8579a2751G3554f9908j28252j2719
$$ 138462 -30436 -236354 40028 -320558 -68635 -167214 -12751 73554 -69908 -198160 -210879
9183b10879P0873A31661C7782a01948k3355A33125b20187A95526c5180j0338o602
$$ -210879 -140006 131661 37782 -101948 -125303 133125 -220187 195526 -35180 -45518 -52120
9172e2120p2451A00838J94646a59944d3799r4410o6843H5685J8285B266J23073
$$ -52120 -124571 100838 295484 -159944 -43799 -138209 -205052 85685 103970 2266 125339
9161A25339C7635c89257F6796f8734F8952h4266k50134F5586b35314q9490c5864
$$ 125339 37635 -389257 66796 -68734 68952 -84266 -334400 65586 -235314 -324804 -35864
9149a41887A90978h0246F4730A5168J94780b33925J16478a7098j54333k9580g0065
$$ -141887 190978 -80246 64730 15168 209948 -233925 -117447 -17098 -171431 -201011 -70065
9137A82070C7636A4116c36964A51115e0688K5081A97860a32479K7113k57206A89619
$$ 182070 37636 14116 -336964 151115 -50688 -25607 197860 -132479 -105366 -362572 189619
9125a11408A53043I075e2590I3787n599l4081j9048b29129B71950c34999D7465
$$ -111408 153043 9075 -52590 93787 88188 54107 35059 -229129 271950 -334999 47465
9113c78948f6894C607h7382M1153j21576k44717a12094D13839A24240l7795c93987
$$ -378948 -66894 3607 -87382 -46229 -167805 -412522 -112094 413839 124240 86445 -393987
9101c12442A4878h2647j62182J8643A1642Q9733a41382c8204j30721A65009h2940
$$ -312442 14878 -82647 -244829 -226186 11642 101375 -141382 -38204 -168925 165009 -82940
9089f0079b3214k2735p8386e2239B1517L7751R4555b70501a04282m8530o0039
$$ -60079 -23214 -45949 -124335 -52239 21517 59268 153823 -270501 -104282 -152812 -212851
9078b12851E4666a54173k532L6748j01526O823k06074a06589M3342G72J34648
$$ -212851 54666 -154173 -156705 -119957 -221483 -214660 -420734 -106589 -63247 772 135420
9067A35420a60858O1533j968A01081D8419O5643g0068K5157B57117a19682r7847
$$ 135420 -160858 -99325 -101293 101081 48419 114062 -70068 -44911 257117 -119682 -217529
9056b17529a07525j5441B11911i9980j21797B86544a12282m2759C58488I9105
$$ -217529 -107525 -122966 211911 -99980 -221777 286544 -112282 -155041 358488 99105
9045b76871C8776a62503R505f4401E192N8066a85698h1005a2189o0138j5163B24689
$$ -276871 38776 -162503 -152998 -64401 5192 63258 -185698 -81005 -12189 -72327 -87490 224689
9032c58034a6297I8445b29370A58379c76999A41294D4984N8697R1843a13159A25588
$$ -358034 -16297 98445 -229370 158379 -376999 141294 44984 103681 195524 -113159 125588
9020A59534c16146F9269J13381r0792B0156d7391k07553e7796k07541G7152J38946
$$ 159534 -316146 69269 182650 91858 20156 -47391 -254944 -57796 -265337 77152 216098
9009B16098D7134A8253a67945C5160b18169n1948A36414b04602P0786L5877j00107
$$ 216098 47134 18253 -167945 35160 -218169 -270117 136414 -204602 -133816 -97939 -198046
8998a98046B56934A14450Q8689E6305c11207E3601c5411m2320A83580G470K76361
$$ -198046 256934 114450 203139 56305 -311207 53601 -35411 -77731 183580 7470 283831
8987B83831a10902b4422k0690L848A14021c17277b7328j81206j6240j58863a5082
$$ 283831 -110902 -24422 -45112 -41264 114021 -317277 -27328 -208534 -224774 -383637 -15082
8975A45129f7852c921C04804O2807a81914K6140q0318A85608D8429R9987a15031
$$ 145129 -67852 -3921 304804 367611 -181914 -155774 -236092 185608 48429 148416 -115031
8963b32987J06398j8089a7038H1707a9084p8105E2197b19348g0306k12715D38579
$$ -232987 -126589 -144678 -17038 81707 -19084 -97189 52197 -219348 -70306 -283021 438579
8951b74726B7817e8824j35099o7028a0402q692l2335k924B03488a8646A2306c10894
$$ -274726 27817 -58824 -193923 -260951 -10402 -19094 -51429 -54353 203488 -18646 12306 -310894
8938G8510P7192d9796I8473M8562k7419K6520L7839b4945p9670A26766J75493
$$ 78510 155702 -49796 98473 147035 119616 146136 183975 -24945 -104615 126766 302259
8927C02259b30629A74953M13886N91099J672397O751868C010856A054352D72078
$$ 302259 -230629 174953 588839 1179938 2852335 9604203 3010856 1054352 472078
8917B56182n5517L47145A15440a02274L5292A77235b25442j6699D16080H3142
$$ 256182 200665 547810 115440 -102274 -66982 177235 -225442 -242141 416080 83142
8906i9261K4694j57036j58556A73054b16420l2952H601b00101d3184A40633c03974
$$ -99261 -74567 -231603 -390159 173054 -216420 -249372 8601 -200101 -43184 140633 -303974
8894D6398b90198g4564B52769b14814g9718p1214a2275p9126C7240P0981M1306
$$ 46398 -290198 -74564 252769 -214814 -79718 -150932 -12275 -91401 37240 108221 149527
8883A49527b8265A60552c14791B218b05672A27276d1918D6090b65142D2479a364
$$ 149527 -28265 160552 -314791 2218 -205672 127276 -41918 46090 -265142 42479 -1364
$$ [...]
##END NTUPLES=NMR SPECTRUM
##END=
