##TITLE=AC1690_COLAH14371_8650466_UnUn4dWAeb
##JCAMPDX= 6.0         $$ Bruker NMR JCAMP-DX V2.0
##DATA TYPE= NMR SPECTRUM
##DATA CLASS= NTUPLES
##ORIGIN= BRUKER
##OWNER= Administrator
$$ 1.72 TOPSPIN		Version 2.1
$$ 2014-05-30 19:53:03.152 -0700  Administrator@X
$$ Compression mode = diff/dup
##.OBSERVE FREQUENCY= 400.02188249412
##.OBSERVE NUCLEUS= ^1H
##.ACQUISITION MODE= SIMULTANEOUS (DQD)
##.ACQUISITION SCHEME= undefined
##.AVERAGES= 64
##.DIGITISER RES= 22
##SPECTROMETER/DATA SYSTEM= spect
##.PULSE SEQUENCE= noesygpps1d.comp
##.SOLVENT NAME= COFFEE_meoh
##.SHIFT REFERENCE= INTERNAL, COFFEE_meoh, 1, 14.96059
##AUDIT TRAIL= $$ (NUMBER, WHEN, WHO, WHERE, PROCESS, VERSION, WHAT)
$$ ##TITLE= Audit trail, TOPSPIN		Version 2.1
$$ ##JCAMPDX= 5.01
$$ ##ORIGIN= Bruker BioSpin GmbH
$$ ##OWNER= Administrator
$$ $$ E:\/data/COFFEE/nmr/AC1690_COLAH14371_8650466_UnUn4dWAeb/12/pdata/1/auditp.txt
$$ ##AUDIT TRAIL=  $$ (NUMBER, WHEN, WHO, WHERE, PROCESS, VERSION, WHAT)
(   1,<2014-05-30 19:52:57.809 -0700>,<Administrator>,<X>,<go>,<TOPSPIN 2.1>,
      <created by zg
	started at 2014-05-30 19:41:28.465 -0700,
	POWCHK enabled, PULCHK disabled,
       configuration hash MD5:
       C8 4E 4E 5D D3 5C D8 9E 9F 52 82 E0 59 8A DE 15
       data hash MD5: 64K
       2E 55 3C 44 1C BF A6 D6 AC 74 0D E0 31 6D 11 9F>)
(   2,<2014-05-30 19:53:00.996 -0700>,<Administrator>,<X>,<proc1d>,<TOPSPIN 2.1>,
      <Start of raw data processing
       efp LB = 0.3 FT_mod = 6 PKNL = 1 PHC0 = 0 PHC1 = 0 SI = 128K 
       data hash MD5: 128K
       EE 11 45 BA D6 AF E6 5B 7E 60 25 89 AD 92 99 E3>)
(   3,<2014-05-30 19:53:02.043 -0700>,<Administrator>,<X>,<proc1d>,<TOPSPIN 2.1>,
      <pk PHC0 = -63.14392 PHC1 = 0 
       data hash MD5: 128K
       5C F3 76 EA D4 23 D2 07 A2 78 4A 40 BB 5C 60 FA>)
(   4,<2014-05-30 19:53:02.480 -0700>,<Administrator>,<X>,<proc1d>,<TOPSPIN 2.1>,
      <abs ABSG = 1 
       data hash MD5: 128K
       D0 41 A9 7F 9F A8 E1 AF E4 A7 73 7C 95 8E 44 F5>)
(   5,<2014-05-30 19:53:02.605 -0700>,<Administrator>,<X>,<proc1d>,<TOPSPIN 2.1>,
      <abs ABSG = 2 
       data hash MD5: 128K
       58 84 23 DD 27 D5 27 FF DE F2 61 13 A3 22 E6 5E>)
(   6,<2014-05-30 19:53:02.715 -0700>,<Administrator>,<X>,<proc1d>,<TOPSPIN 2.1>,
      <abs ABSG = 3 
       data hash MD5: 128K
       E8 00 C2 FF A9 AB 11 CD D4 DA 81 43 06 A6 67 2E>)
(   7,<2014-05-30 19:53:02.824 -0700>,<Administrator>,<X>,<proc1d>,<TOPSPIN 2.1>,
      <abs ABSG = 4 
       data hash MD5: 128K
       7B 66 D1 24 7E 26 C3 04 78 9B 24 2C 7A 73 24 55>)
(   8,<2014-05-30 19:53:02.918 -0700>,<Administrator>,<X>,<proc1d>,<TOPSPIN 2.1>,
      <abs ABSG = 5 
       data hash MD5: 128K
       E9 88 7E ED DE 59 2A 8D C8 0E 79 D7 6D 81 E3 10>)
$$ ##END=
$$ 
$$ $$ hash MD5
$$ $$ 0C E1 F0 43 25 18 34 4E B9 A5 F4 E7 1D 67 13 31
##$RELAX= 
##$RELAX= 
##$RELAX= 
##$RELAX= 
##$RELAX= 
##$RELAX= 
##$RELAX= 
##$RELAX= 
$$ Bruker specific parameters
$$ --------------------------
##$DU= <E:\>
##$EXPNO= 12
$$ [...]
##$TP07= 0
##$TPNAME0= <>
##$TPNAME1= <>
##$TPNAME2= <>
##$TPNAME3= <>
##$TPNAME4= <>
##$TPNAME5= <>
##$TPNAME6= <>
##$TPNAME7= <>
##$TPOAL= (0..7)
0.5 0.5 0.5 0.5 0.5 0.5 0.5 0.5
##$TPOFFS= (0..7)
0 0 0 0 0 0 0 0
##$TUNHIN= 0
##$TUNHOUT= 0
##$TUNXOUT= 0
##$USERA1= <user>
##$USERA2= <user>
##$USERA3= <user>
##$USERA4= <user>
##$USERA5= <user>
##$V9= 5
##$VALIST= <valist>
##$VCLIST= <CCCCCCCCCCCCCCC>
##$VD= 0
##$VDLIST= <DDDDDDDDDDDDDDD>
##$VPLIST= <PPPPPPPPPPPPPPP>
##$VTLIST= <TTTTTTTTTTTTTTT>
##$WBST= 2048
##$WBSW= 25
##$XGAIN= (0..3)
0 0 0 0
##$XL= 0
##$YL= 0
##$YMAX_a= 6974380
##$YMIN_a= -14409037
##$ZGOPTNS= <>
##$ZL1= 120
##$ZL2= 120
##$ZL3= 120
##$ZL4= 120
##$ABSF1= 14.96059
##$ABSF2= -5.597591
##$ABSG= 5
##$ABSL= 3
##$ALPHA= 0
##$AQORDER= 0
##$ASSFAC= 0
##$ASSFACI= 0
##$ASSFACX= 0
##$ASSWID= 0
##$AUNMP= <proc_prof1d_extract.lims>
##$AXLEFT= 0
##$AXNAME= <>
##$AXNUC= <1H>
##$AXRIGHT= 0
##$AXTYPE= 0
##$AXUNIT= <>
##$AZFE= 0.1
##$AZFW= 0.1
##$BCFW= 0
##$BC_mod= 0
##$BYTORDP= 0
##$COROFFS= 0
##$CY= 15
##$DATMOD= 1
##$DC= 0
##$DFILT= <>
##$DTYPP= 0
##$F1P= 0
##$F2P= 0
##$FCOR= 0.5
##$FTSIZE= 131072
##$FT_mod= 6
##$GAMMA= 0
##$GB= 0
##$INTBC= 1
##$INTSCL= 1
##$ISEN= 128
##$LB= 0.3
##$LEV0= 0
##$LPBIN= 0
##$MAXI= 10000
##$MC2= 0
##$MEAN= 0
##$ME_mod= 0
##$MI= 0
##$NCOEF= 0
##$NC_proc= -2
##$NLEV= 6
##$NOISF1= 0
##$NOISF2= 0
##$NSP= 0
##$NTH_PI= 0
##$NZP= 0
##$OFFSET= 14.96059
##$PC= 1
##$PHC0= -63.14392
##$PHC1= 0
##$PH_mod= 1
##$PKNL= yes
##$PPARMOD= 0
##$PPDIAG= 0
##$PPIPTYP= 0
##$PPMPNUM= 2147483647
##$PPRESOL= 1
##$PSCAL= 4
##$PSIGN= 0
##$PYNMP= <proc.py>
##$REVERSE= no
##$SF= 400.020009800451
##$SI= 131072
##$SIGF1= 0
##$SIGF2= 0
##$SINO= 400
##$SIOLD= 131072
##$SPECTYP= <>
##$SREGLST= <1H.CDCl3>
##$SSB= 0
##$STSI= 131072
##$STSR= 0
##$SW_p= 8223.68421052631
##$SYMM= 0
##$S_DEV= 0
##$TDeff= 65536
##$TDoff= 0
##$TI= <>
##$TILT= no
##$TM1= 0
##$TM2= 0
##$TOPLEV= 0
##$USERP1= <user>
##$USERP2= <user>
##$USERP3= <user>
##$USERP4= <user>
##$USERP5= <user>
##$WDW= 1
##$XDIM= 131072
##$YMAX_p= 438034608
##$YMIN_p= -11319
##$CURPLOT= <Network HP LaserJet P1505>
##$CURPRIN= <$Network HP LaserJet P1505>
##$DFORMAT= <normdp>
##$LAYOUT= <+/1D_H.xwp>
##$LFORMAT= <normlp>
##$PFORMAT= <normpl>
##$SURQMSG= 1
$$ End of Bruker specific parameters
$$ ---------------------------------
##NTUPLES= NMR SPECTRUM
##VAR_NAME=  FREQUENCY,     SPECTRUM/REAL,   SPECTRUM/IMAG
##SYMBOL=    X,             R,               I
##VAR_TYPE=  INDEPENDENT,   DEPENDENT,       DEPENDENT
##VAR_FORM=  AFFN,          ASDF,            ASDF
##VAR_DIM=   131072,        131072,          131072
##UNITS=     HZ,            ARBITRARY UNITS, ARBITRARY UNITS
##FACTOR=    0.0627417313425164, 1,          1
##FIRST=     8223.62146879497, 4646,         -68278
##LAST=      0,             7093,            -67671
##MIN=       0,             -11319,          0
##MAX=       8223.62146879497, 438034608,    0
$$ Real data points
##PAGE= N=1
##DATA TABLE= (X++(R..R)), XYDATA
$$ [...]
65269 136447 136740 137294 138323 139409 139872 139508 138527 136976 134882 132847 131809 132093 133209 134619 136160 137715
65253 137715 139073 140299 141609 142733 142987 142220 141100 140162 139172 137821 136386 135130 133626 131357 128711
65238 128711 126675 125681 125356 125329 125696 126619 127909 129171 130078 130485 130463 130201 129773 129207 128862 129308 130402 130948
65220 130948 129964 128067 126839 126877 127342 127539 127949 129153 130537 130893 129957 128557 127417 126590 126081 126208 126993
65203 126993 127807 128136 128374 129306 130928 132336 132799 132435 131686 130587 129000 127240 126015 125759 126394 127716
65187 127716 129576 131605 133167 133867 133895 133689 133485 133426 133908 135367 137657 139894 141132 141216 140897 141044 141769
65170 141769 142449 142591 142412 142356 142337 141889 140987 140179 139866 139981 140538 141950 144420 147367 149885 151539 152490 153185
65152 153185 154282 156450 159720 163260 166318 169238 173104 178567 185532 193732 202964 212754 222457 231828
65138 231828 240975 249683 257386 264025 270398 277292 284588 291390 296756 300132 301475 301259 300130 298356
65124 298356 295834 292771 289923 287783 285763 282587 277513 270986 264059 257321 250462 242909 234838 227246
65110 227246 220837 215106 209038 202510 196440 191521 187449 183570 179610 175451 170758 165429 160070 155483
65096 155483 151802 148503 145141 141810 138995 137268 136944 137761 139045 140334 141673 143187 144750 146214 147521
65081 147521 148272 147773 146043 144302 143784 144322 144847 145018 145473 146543 147619 148096 148171 148352 148768 149388 150342 151486
65063 151486 152088 151539 150175 148839 147792 146649 145381 144705 145170 146262 146928 146832 146604 146795 147050 146670 145738
65046 145738 145126 145331 145756 145427 144137 142536 141287 140445 139605 138360 136614 134661 132940 131548 130091 128222
65030 128222 126169 124430 123080 121771 120380 119240 118651 118526 118659 119013 119586 120266 121015 121997 123388 125207
65014 125207 127378 129646 131395 131964 131438 130781 130855 131585 132420 133353 134857 136917 138766 139925 141014 143094
64998 143094 146346 149854 152692 154812 156661 158290 159336 159798 160312 161375 162640 163418 163740 164422 165970
64983 165970 167894 169388 170415 171675 173578 175633 176995 177329 176947 176216 175137 173513 171314 168723 165927
64968 165927 163058 160287 157719 155169 152282 149036 145951 143623 142196 141405 140958 140601 139999 138929 137573
64953 137573 136316 135269 134273 133369 132924 133127 133653 133952 133700 132904 131829 130915 130527 130585 130671 130589 130603 130994 131663
64934 131663 132408 133308 134498 135752 136651 137100 137343 137476 137287 136659 135825 135101 134577 134177 133840 133456 132746 131521
64916 131521 130096 129243 129494 130530 131445 131685 131582 131824 132605 133541 134352 135318 136929 139268 141896 144281 146335
64899 146335 148628 151952 156470 161390 165839 169986 174841 180848 187243 193116 198522 203985 209397 214213
64885 214213 218594 223441 229130 234854 239566 242959 245153 245903 244794 241990 238224 234039 229450 224371
64871 224371 218923 213280 207669 202806 199869 199468 200651 201400 200332 197701 194678 191982 189533 187126 184833
64856 184833 182617 180034 176690 172835 169103 165736 162384 158738 155073 151949 149478 147129 144310 141026
64842 141026 137909 135637 134414 134004 134128 134688 135644 136807 137830 138328 138111 137415 136843 136815 137071 137027 136714 136993
64824 136993 138606 141274 144063 146402 148331 149973 151330 152658 154502 157062 159879 162424 164773 167424
64810 167424 170650 174332 178275 182365 186478 190559 194846 199724 205135 210249 213889 215313 214619 212478
64796 212478 209568 206192 202365 198184 194033 190353 187224 184303 181251 178156 175443 173487 172495 172690 174233
64781 174233 176762 179225 180574 180687 180342 180268 180463 180552 180482 180630 181410 183076 185833 189798 194748 200133 205392
64764 205392 210202 214493 218395 222177 226061 230003 233796 237389 240916 244415 247745 250915 254282 258218
64750 258218 262648 267115 271311 275335 279372 283226 286259 287812 287566 285517 281727 276309 269604 262119
64736 262119 254178 245829 237324 229470 223184 218697 215483 213022 211338 210661 210840 211313 211528 211215 210408 209424
64720 209424 208786 208937 209936 211472 213226 215158 217518 220626 224601 229225 234040 238590 242491 245328 246696
64705 246696 246461 244849 242072 237980 232369 225671 219023 213420 208880 204624 200033 195214 190683 186760
64691 186760 183459 180730 178515 176655 175087 174172 174463 175915 177571 178318 177911 177136 177112 178497 181077 183811
64675 183811 185563 186298 187465 190702 196110 202236 207809 212940 218420 224336 229841 233931 236069 236281 235054
64660 235054 232983 230214 226425 221652 216870 213228 210867 208998 207115 205556 204754 204480 204122 203371 202325
64645 202325 201254 200571 200813 202258 204580 207198 209965 213350 217890 223639 230216 237255 244711 252641 260801
64630 260801 268628 275755 282392 288865 294798 299031 300537 299196 295542 290064 283101 275205 267128 259299
64616 259299 251616 243941 236637 230389 225509 221602 217980 214384 211221 209028 207704 206406 204328 201511
64602 201511 198789 196961 196126 195778 195301 194349 192947 191473 190471 190323 191076 192627 194966 198097 201800 205703
64586 205703 209707 214211 219839 226937 235372 244740 254702 265180 276221 287670 298998 309558 319071
64573 319071 327723 335730 342862 348484 351978 353122 352178 349642 345704 339822 331087 319349 305809 292173
64559 292173 279351 267351 256302 246846 239293 233006 227114 221472 216409 211882 207572 203702 201022
64546 201022 199753 199122 198307 197461 197458 198868 201571 205131 209044 212602 214973 215695 214966 213294 211001 208133
64530 208133 204741 201035 197292 193738 190574 188021 186261 185342 185147 185385 185569 185134 183790 181864 180176
64515 180176 179439 179749 180639 181562 182295 182973 183818 184850 185912 187056 188797 191670 195480 199367 202834 206383
64499 206383 210761 215861 221014 226182 232102 238961 245615 250630 253718 255604 256803 257189 256676 255630 254394
64484 254394 252924 251239 249865 249414 249895 250744 251435 251718 251290 249712 246903 243505 240414 237946 235700 233253
64468 233253 230755 228719 227479 227128 227812 229663 232375 235208 237678 240045 242760 245581 247608 248249 247796
64453 247796 246941 245993 244849 243570 242655 242665 243742 245543 247587 249610 251712 254204 257307 261030 265402
64438 265402 270716 277337 285256 294080 303596 314157 326312 340285 356096 374083 394897 418943
64426 418943 446247 477036 512151 552712 599752 654415 718122 791905 875563 967611 1065778
64415 1065778 1167071 1267669 1363755 1452936 1534537 1608257 1672840 1726166 1766120 1790936 1799260
64404 1799260 1790774 1767016 1731114 1686200 1633748 1573125 1502620 1421226 1329987 1231930 1130824
64393 1130824 1030086 932751 841784 759679 687597 625152 571141 524441 484370 450550 422539
64382 422539 399530 380482 364613 351518 340621 330873 321458 312621 305231 299531 294824 290446 286416
64369 286416 282846 279258 274919 269610 263703 257640 251619 245625 239559 233497 227977 223724 220891 218802
64355 218802 216769 214876 213613 213053 212915 213288 214649 217087 220036 222917 225621 228146 230203 231471 231914
64340 231914 231516 230036 227471 224560 222296 220855 219432 217297 214725 212663 211715 211736 212334 213400 215051
64325 215051 217232 219534 221444 222716 223513 224172 224843 225389 225691 225939 226467 227289 227999 228219 227974 227519 226908
64308 226908 225897 224203 221631 218028 213382 208023 202536 197358 192540 187975 183725 180045 177151 175068
64294 175068 173641 172685 172164 172185 172710 173344 173611 173523 173678 174696 176645 179061 181374 183269 184847 186560 188881
64277 188881 191934 195556 199696 204459 209698 214883 219619 223998 228192 231971 234944 236988 238045 237798
64263 237798 236183 234095 232886 233011 233777 234625 236003 238427 241146 242433 241159 237616 232829 227544 222004
64248 222004 216321 210699 205347 200328 195593 191237 187712 185591 184943 185079 185184 185135 185420 186249 187080 187225
64232 187225 186680 186115 186153 186880 187967 189002 189705 190042 190288 190857 191903 193062 193665 193223 191812 190051 188659
64215 188659 187862 187168 185865 183802 181537 179691 178414 177681 177797 179057 180982 182418 182611 181822 180682 179380
64199 179380 177889 176633 176407 177665 180265 183848 188048 192375 196420 200272 204396 209012 214041 219743
64185 219743 226856 235725 245633 255312 263815 270541 274864 276354 275273 272265 267535 260830 252368 243278
64171 243278 234860 227632 221335 215618 210402 205718 201485 197526 193712 190076 186779 183933 181423 179048
64157 179048 176851 175255 174802 175774 178065 181217 184607 187711 190359 192693 194916 197180 199647 202500 205796
64142 205796 209407 213126 216651 219519 221271 221828 221502 220550 218930 216628 214002 211518 209287 207126 204984
64127 204984 203129 201943 201718 202491 203843 204938 205145 204685 204455 205221 207170 210188 214083 218420 222621 226632
64111 226632 231258 237374 244817 252411 259081 264597 269100 272302 273562 272788 271002 269852 270583 273460 277959
64096 277959 283261 288555 293213 296983 299986 302227 303102 301688 297687 291904 285543 279138 272360 264846
64082 264846 256912 249414 243103 238229 234637 231970 229720 227288 224293 220994 218300 217118 217606 219088
64068 219088 220674 221858 222644 223365 224506 226420 228905 231143 232277 232162 231568 231720 233562 237175 241683
64053 241683 245861 249065 251549 253885 256346 259089 262559 267223 272944 279061 285152 291405 298239 305855
64039 305855 314107 322416 329716 334985 338055 339598 340136 339395 336887 332791 327899 322905 318095 313617 309672
64024 309672 306416 303909 302243 301613 302168 303746 305682 307018 307116 306048 304160 301394 297519 292998 288960
64009 288960 285998 283587 281118 278922 277637 276982 275991 274370 272849 272128 272162 272651 273636 275279 277462 279864
63993 279864 282196 284217 285839 287341 289185 291481 293971 296684 300199 304962 310660 316612 322602 329015
63979 329015 336271 344395 353104 362142 371476 381203 391221 401083 410415 419539 429451 441025 454376
63966 454376 468995 484319 500136 516741 534800 554845 576836 600507 626223 655154 688384
63955 688384 726280 769020 817446 873046 937333 1011653 1097483 1196532 1310520 1441029 1589245
63944 1589245 1755340 1938107 2135538 2345814 2567477 2798811 3037523 3280932 3525670
63935 3525670 3766587 3996254 4206313 4389832 4542608 4662687 4749197 4801703 4820012 4803803
63925 4803803 4752206 4664240 4540195 4382800 4197098 3989365 3766177 3533937 3298374 3063963
63915 3063963 2833830 2610271 2395325 2190998 1999342 1822358 1661456 1516773 1387325
63906 1387325 1272042 1170420 1082016 1005653 939545 882030 831904 788203 750096 717001 688472
63895 688472 663814 641987 621974 603220 585745 569907 555963 543742 532818 523008 514593 507947
63883 507947 503168 500174 498965 499642 502268 506911 513692 522669 533771 546862 561751 578117 595713
63870 595713 614672 635283 657364 680242 703457 726895 749904 770865 788259 801840 812273
63859 812273 819910 824531 825986 824389 819775 812236 802313 790614 777007 760828 741944 721068 698950
63846 698950 675856 651980 627764 603607 579753 556628 534736 513917 493256 472092 450840
63835 450840 430562 412062 395538 380688 366879 353626 341139 330090 320653 312224 304311 297140
63823 297140 291006 285511 279984 274339 269009 264242 259905 255808 251827 247851 243957 240467 237549 234976
63809 234976 232601 230784 229926 229828 229900 229799 229435 228598 227157 225507 224260 223527 222902 222037 220715 218563 215443
63792 215443 212185 210124 209611 209559 208831 207472 206137 204871 203218 201270 199772 199102 198732 197990 196991 196453
63776 196453 196793 197713 198616 199138 199274 199218 199233 199548 200157 200768 201075 201117 201187 201352 201222 200317 198636 196773 195511
63757 195511 195314 196042 197036 197555 197305 196600 195986 195762 195924 196427 197326 198642 200216 201789 203225 204670 206470
63740 206470 208882 211831 214999 218179 221482 225124 229054 232865 236213 239348 243118 248156 254088 259866
63726 259866 265078 270564 277384 285496 293952 302125 309972 317177 322951 327043 330137 332709 334057 333178
63712 333178 330136 325881 320956 315181 308520 301542 294850 288631 282929 277974 274067 271452 270299 270504
63698 270504 271514 272730 274127 276017 278192 279805 280364 280429 281046 282778 285582 289318 293913 299064 304115
63683 304115 308389 311590 313900 315752 317538 319448 321462 323365 324787 325544 326087 327387 330072 333817 337834
63668 337834 341761 345731 349807 353816 357600 360832 362626 361994 358913 354355 349045 342767 335265 327177
63654 327177 319464 312305 305246 298284 292086 287078 282877 278854 274873 271324 268717 267458 267719 269241
63640 269241 271353 273449 275412 277413 279398 281137 282898 285714 290483 296832 303305 308875 313878 319242
63626 319242 325306 331942 339510 348761 359690 371277 382796 394831 408537 424273 441501 459720
63614 459720 478935 499366 521275 545096 571228 599579 629553 660492 691708 721999 749547
63603 749547 772602 790140 801780 807395 807171 802088 794090 785547 778240 772580 767673 762234 755496 747211
63589 747211 736960 723841 707132 687155 665260 642840 620458 597957 575328 553304 533107
63578 533107 515730 501463 489971 480590 472675 465934 460615 457270 456217 457265 459926 463754 468462
63565 468462 473957 480414 488211 497627 508611 520845 533926 547423 561019 574803 589372 605538
63553 605538 623906 644752 668106 693955 722605 755031 792461 835138 881194 926645 966406
63542 966406 995679 1011497 1013964 1006114 992109 975423 958637 944163 934008 928671 926953 927115 927687
63529 927687 927067 923221 914434 900003 879801 853756 822384 787424 751038 714450 678031 642626
63517 642626 609836 580659 554575 530462 507983 487610 469709 454143 440571 428584 417594
63506 417594 407143 397418 389116 382653 377769 373931 370769 367990 365236 362386 359823 358077 357191 356664
63492 356664 356024 355308 354940 355229 356060 357071 358154 359745 362519 366756 372089 377940 384025 390355 396934
63477 396934 403693 410599 417528 424041 429491 433410 435581 435760 433604 429031 422461 414638 406322 398150
63463 398150 390493 383261 376047 368657 361372 354524 348123 342180 337255 334199 333321 334065 335619 337598 340077
63448 340077 343249 347285 352403 358879 366896 376385 387005 398427 410845 425156 442483 463587 488874
63435 488874 518700 552900 589687 625438 656205 679581 695144 703645 706417 705498 703605 703424 706847
63422 706847 714808 727555 745050 767404 795030 828068 865439 904715 943088 978206 1007936 1030002
63410 1030002 1042739 1046387 1043090 1035336 1024731 1012431 1000139 989784 982001 975341 967299 956035
63398 956035 940902 921641 897690 868659 835296 799545 763560 728784 695878 665200 637100
63387 637100 611904 589774 570524 553526 538059 523931 511655 501890 494926 490828 489650 491036
63375 491036 493924 497313 501312 506872 514429 523461 533518 545033 558614 574101 590930 609162 629538
63362 629538 652601 678235 706060 735889 767748 801735 837791 875297 912917 948992 981898
63351 981898 1009733 1030163 1041465 1043932 1039723 1031229 1020076 1007693 995868 985994 978035 970771 962771
63338 962771 952668 938913 920156 896168 867996 837101 804661 771672 739184 708104 679105
63327 679105 652912 630350 611788 596907 585524 578431 576711 579913 585168 588307 585832 576133 559703
63314 559703 538760 516314 494782 475118 457272 441253 427424 415946 406433 398264 390945 384187
63302 384187 377992 372682 368422 364678 360588 356059 351946 348889 346443 343760 340733 337943 335705 333651
63288 333651 331213 328148 324725 321621 319453 318108 316791 315025 313281 312211 311616 310784 309559 308423 307608
63273 307608 306871 306148 305763 305869 306234 306718 307455 308475 309737 311604 314659 318764 322868 326116 328787 331889
63257 331889 336171 341615 347471 352707 356963 361240 367061 374703 382911 390641 398416 407485 418344 430699
63243 430699 444345 459264 475223 492116 510574 531554 555233 580759 607078 633624 660315
63232 660315 687323 714796 742459 769545 795457 820356 844850 869323 894006 919467 946416
63221 946416 974936 1004231 1033150 1060647 1085803 1107731 1125526 1138184 1144779 1144950 1138902 1126587
63209 1126587 1107264 1080434 1047040 1009234 969131 928313 888287 850543 815959 784655 756604
63198 756604 731977 710908 693491 680088 671078 666133 664302 665108 669037 676585 687225 699769 713499
63185 713499 728510 745087 763111 782104 801578 821284 841232 861573 882451 903883 925658
63174 925658 947269 968063 987481 1004998 1019723 1030435 1036309 1037463 1034453 1027323 1015394 997820
63162 997820 974149 944631 910410 873267 834812 796077 758067 722149 689217 658847 630177
63151 630177 603423 579596 558771 539800 522044 506333 493564 483161 473764 464914 457234 451182
63139 451182 446338 441941 437668 433791 430846 429113 428254 427590 426833 426299 426328 426830 427611 428771 430458 432480
63123 432480 434469 436264 437896 439430 441058 443148 445995 449647 454023 458870 463551 467370 470328 473103
63109 473103 476033 478666 480677 482625 485224 488269 490918 492728 493869 494621 495308 496439 498215 500048 501295
63094 501295 502319 504067 506652 509169 510973 512294 513413 514124 514472 515274 517238 520054 522936 525684 528641
63079 528641 531951 535611 540091 546186 554127 563358 573342 584132 596027 609053 623046 637921 653617
63066 653617 670089 687615 706935 728736 753180 780226 810203 843645 880624 920771 964001
63055 964001 1010758 1061300 1115241 1172113 1231942 1294739 1359649 1425147 1490077 1554134 1617444
63044 1617444 1680200 1742724 1805394 1868278 1931218 1994421 2058535 2123804 2189298 2253140 2313282
63033 2313282 2367851 2414857 2451805 2475786 2484255 2476122 2452058 2413470 2361277 2296165 2219930 2135850
63021 2135850 2047421 1957267 1867545 1780707 1699122 1624234 1556702 1497253 1446745 1405367 1372320
63010 1372320 1346535 1327550 1315598 1311057 1313909 1323589 1339295 1360282 1385719 1414357 1444833 1476491
62998 1476491 1509585 1544366 1580319 1616589 1652826 1689121 1725287 1760623 1794310 1825590 1853642
62987 1853642 1877600 1896628 1909555 1914533 1909522 1893249 1865543 1826928 1778372 1721374 1657792 1589286
62975 1589286 1517219 1443180 1369280 1297608 1229483 1165397 1105588 1050484 1000570 955942 916153
62964 916153 880565 848681 819979 793625 768847 745613 724496 705680 688524 672323 656992
62953 656992 642646 629038 615877 603295 591342 579413 566874 554037 541811 530509 519742
62942 519742 509329 499466 490001 480482 471183 463171 456906 451430 445489 438981 432727 427260 422425 417960
62928 417960 413878 410312 407331 404913 402874 400889 398747 396457 394004 391196 387954 384609 381708 379636
62914 379636 378457 377929 377505 376566 374961 373218 372107 371954 372366 372443 371325 368884 366048 364153 363776 364273
62898 364273 364557 364061 362976 361937 361706 362796 365042 367663 369960 371822 373408 374582 374951 374359 373158
62883 373158 372071 371837 372706 374159 375362 376083 376842 377991 379043 379351 379098 379069 379553 380032 380030 379752 379702 380016
62865 380016 380415 380613 380514 380095 379314 378232 377208 376855 377590 379148 380719 381714 382284 382912 383703 384428 385127 386213
62847 386213 387872 389743 391351 392553 393320 393436 392847 392101 391936 392390 392829 392993 393480 394845 396645 397975
62831 397975 398734 399706 401427 403690 406278 409363 412740 415404 416673 417381 419130 422524 426827 431180 435324
62816 435324 439100 442250 445102 448701 453656 459319 464664 469646 475212 482201 490694 500267 510462 521125
62802 521125 532610 545582 560338 576428 593190 610487 628732 648404 669889 693665 720306
62791 720306 750342 784245 822377 864773 911321 962485 1019571 1083794 1155325 1233705 1319026
62780 1319026 1412019 1512843 1620191 1731654 1844542 1956281 2064440 2166545 2259659 2340190
62770 2340190 2404568 2450228 2475719 2480119 2463157 2426150 2372042 2303924 2223884 2133715 2036171
62759 2036171 1934702 1832061 1729884 1629513 1532429 1439657 1351437 1267905 1189648 1117247
62749 1117247 1050694 989690 934188 884136 838974 797992 761077 728513 700008 674554 651373
62738 651373 630395 611622 594688 579525 566817 557072 549568 542968 536861 532003 529095 527979 528082
62725 528082 528892 529823 530370 530913 532829 537264 544062 552319 561629 572277 584500 598250 613706 631513
62711 631513 652282 676139 702911 732584 765530 802449 844109 891039 943410 1001200 1064330
62700 1064330 1132569 1205455 1282408 1362710 1445156 1527972 1609305 1687552 1760912 1826778 1882089
62689 1882089 1924337 1952013 1964162 1960012 1939293 1902794 1852476 1791034 1721170 1644976 1564010
62678 1564010 1480109 1395954 1314350 1236838 1163353 1093473 1027678 967110 912313 862609 816779
62667 816779 774140 734876 699499 668179 640572 616089 594181 574457 556723 540929 526945
62656 526945 514434 503128 493161 484789 477678 470868 463696 456453 449835 444011 438624 433483 428768 424627
62642 424627 421037 418088 416001 414832 414533 415278 417195 419709 421696 422583 422891 423363 423938 424005 423350 422404 421686
62625 421686 421430 421676 422307 422956 423299 423543 424360 426248 429250 433350 438782 445646 453483 461623 469992 479255
62609 479255 490059 502285 515213 528402 542322 558146 576991 599323 625007 653772 685627
62598 685627 720895 760003 803259 850674 901808 955749 1011249 1066753 1120288 1169555 1212536
62587 1212536 1248017 1275248 1293155 1300384 1296297 1281492 1257061 1223890 1183211 1137390 1089186 1040164
62575 1040164 990546 940735 892146 846142 802841 761575 722142 685056 650882 619999 592824
62564 592824 569609 549919 532736 517223 503130 490553 479598 470276 462383 455393 448763 442372
62552 442372 436467 431176 426378 422052 418456 415858 414212 413173 412311 411412 410707 410755 411901 413903 416242
62537 416242 418647 421078 423429 425601 427849 430731 434703 440046 447022 455707 465734 476684 488796
62524 488796 502872 519369 538071 558813 582119 608797 639189 673030 709873 749368 791292
62513 791292 835464 881528 928651 975511 1020588 1062253 1098646 1127903 1148822 1161181 1165286 1161411
62501 1161411 1149850 1131290 1106915 1078211 1046742 1013924 980840 948377 917648 890054 866797
62490 866797 848393 834747 825632 821091 821525 827402 838692 854681 874606 898425 926561 958804
62478 958804 993921 1030481 1067513 1103890 1137416 1165158 1184919 1196299 1200363 1198271 1189969 1174028
62466 1174028 1148939 1114736 1073251 1026889 977528 926649 875771 826187 778499 732898 689770
62455 689770 649703 613155 580471 551977 527575 506424 487583 470925 456960 445801 436787 429129
62443 429129 422428 416532 411398 407293 404678 403604 403464 403505 403381 403138 402928 402833 402708 402051 400301 397390 393772
62426 393772 389899 385952 382194 379096 376844 375036 373156 371069 368793 366184 363297 360747 359115 358038
62412 358038 356535 354334 352341 351489 351574 351557 350722 349095 346947 344440 341835 339614 338094 337219 336899 337404
62396 337404 339106 341939 345378 348951 352555 356311 360367 364804 369466 373807 377291 380061 382923 386434
62382 386434 390435 394851 400505 408367 418071 427980 437048 446026 456365 468394 481200 494049 507199
62369 507199 521211 536097 551474 567257 583929 602306 623255 647461 675170 706246 740731
62358 740731 779254 822584 870715 922622 977053 1033284 1090835 1148439 1203499 1252740 1293437
62347 1293437 1324191 1344804 1355736 1357796 1352115 1339919 1321987 1298391 1269038 1234480 1195940 1154591
62335 1154591 1111124 1066225 1021186 977686 937060 899980 866625 836753 809634 784386 760612
62324 760612 738465 717946 698382 678838 658871 638726 618953 600089 582481 566092 550419
62313 550419 534887 519384 504311 490141 477159 465606 455747 447575 440632 434391 428822 424363 421323
62300 421323 419456 418218 417329 416936 417208 417971 418841 419687 420858 422914 426204 430670 435909 441352 446520 451265
62284 451265 455811 460441 465184 469797 474056 477970 481726 485531 489529 493743 498012 502110 506102 510591
62270 510591 516356 523672 532177 541593 552469 565903 582595 602503 625529 652114 682834 717683
62258 717683 756290 798845 846341 899643 958555 1021807 1087514 1153287 1216181 1273110 1321533
62247 1321533 1359675 1386219 1400309 1402185 1393595 1377145 1354922 1327568 1294576 1255290 1209674 1158451
62235 1158451 1102998 1045300 987752 932523 880783 832580 787523 745621 707411 673366 643321
62224 643321 616577 592607 571552 553883 539492 527258 515726 504238 493223 483368 474749 466915
62212 466915 459649 453222 447799 442929 438014 433260 429785 428489 428968 429769 429761 429051 428688 429766 432850 437883
62196 437883 444382 451922 460603 470938 483154 496861 511542 527086 543623 561143 579645 599340
62184 599340 620258 641889 663631 685354 706862 726968 743900 756852 766511 773980 779899 784926
62172 784926 790353 797572 807282 819719 835401 855144 879477 908419 941593 978191 1016944 1056511
62160 1056511 1095701 1133007 1166153 1192656 1210921 1220641 1222371 1217153 1206386 1191393 1172783 1150321
62148 1150321 1123478 1092016 1056233 1016975 975461 932991 890846 850416 813000 779196 748778
62137 748778 721545 697961 678535 662921 650246 640150 632852 628323 626027 625528 626630 628891 631728
62124 631728 635277 640444 647638 655964 664135 671731 679099 686376 693197 699218 704389 708710 712108 714542
62110 714542 715905 715805 713695 709342 703099 695761 688262 681449 676019 672607 671768 673665 677834 683636 691013
62095 691013 700444 711986 724760 737733 750644 763740 776872 789489 801542 813854 827323 842021
62083 842021 857233 872313 887389 903343 921095 940892 962349 985226 1009879 1036666 1065038
62072 1065038 1093590 1121013 1146703 1170482 1192152 1211570 1228976 1245095 1260988 1277789 1296293
62061 1296293 1316529 1337682 1358456 1377448 1393346 1405120 1412225 1414596 1412470 1406377 1397160 1385477
62049 1385477 1371019 1352515 1328827 1299909 1266459 1228912 1187308 1142235 1095430 1049108 1004737
62038 1004737 962581 922323 883987 848255 816022 787723 763044 741302 722073 705489 691949
62027 691949 681593 673975 668212 663416 658983 654443 649205 642720 634951 626371 617292 607456 596663 585670
62013 585670 575992 568670 563569 560012 557756 557129 558442 561675 566693 573507 582301 593241 606156 620267
61999 620267 634332 647176 658013 666193 671031 672248 670406 666464 660788 652947 642499 629698 615305
61986 615305 600026 584359 568773 553749 539667 526698 514741 503412 492328 481583 471838 463717
61974 463717 457102 451214 445432 439990 435765 433320 432170 431138 429544 427941 427422 428203 429209 429173 427960
61959 427960 426611 426290 427424 429784 433028 437044 441934 447894 455150 463913 474358 486620 500750 516596
61945 516596 533817 552292 572655 596210 623960 655723 690478 727447 766425 807040 848374
61934 848374 889587 930346 970116 1007623 1041766 1072709 1101195 1126852 1148089 1163714 1173794
61923 1173794 1178639 1177880 1171099 1158800 1142230 1122713 1101616 1080593 1061278 1044942 1032769 1026105
61911 1026105 1026053 1033037 1046997 1067560 1093622 1123216 1154338 1185592 1215627 1242382 1263563 1277664
61899 1277664 1284014 1282158 1271968 1254251 1230624 1202682 1171647 1138594 1104392 1069518 1034481 1000378
61887 1000378 968544 939719 914019 891479 871900 854236 836966 819300 801526 784172 767416
61876 767416 751396 736439 722757 710378 699463 690223 682525 676192 671693 669798 670434 672660 676003
61863 676003 681075 688595 698645 711287 727092 746463 769108 794878 824535 858955 898104 941547
61851 941547 989495 1042374 1099532 1159271 1220113 1281220 1341574 1399515 1453305 1501453 1542204
61840 1542204 1573382 1593247 1601326 1598221 1584977 1562984 1534303 1501723 1468458 1437731 1412341 1394194
61828 1394194 1384126 1382245 1388455 1402612 1424178 1451700 1482600 1513548 1541096 1562156 1574143 1575057
61816 1575057 1563671 1539618 1503357 1456190 1400263 1338191 1272443 1205178 1138624 1075129 1016397
61805 1016397 962752 913496 867986 826211 788446 754729 724780 698208 674710 654151 636508
61794 636508 621645 609073 598038 587913 578515 570049 562751 556527 550919 545463 540098 535202 531194
61781 531194 528118 525520 522678 519047 514671 510162 506175 502929 500333 498383 497138 496343 495471 494326 493419
61766 493419 493580 495251 498161 501582 504947 508291 512096 516581 521302 525691 529805 534160 538897 543516
61752 543516 547416 550359 552379 553658 554507 555062 554972 553766 551578 549004 546253 543007 539270 535726 532946
61737 532946 530731 528535 526070 523207 519828 516206 513081 510972 509766 509305 509856 511609 514249 517545 521843
61722 521843 527352 533388 539079 544560 550775 558214 566447 574661 582044 587796 591494 593477 594262 593571 590504
61707 590504 584692 576809 567899 558652 549350 540024 530559 521003 511811 503570 496549 490770 486242 482748
61693 482748 479656 476457 473277 470381 467487 464164 460616 457325 454114 450472 446745 444052 442907 442764
61679 442764 443099 444025 445501 446837 447555 448035 448739 449338 449205 448337 447296 446556 446346 446766 447555 448109 448186 448338
61661 448338 449243 450949 453194 456107 459944 464378 468691 472612 476400 480118 483410 486181 488972 492330
61647 492330 496124 499908 503835 508757 515184 522380 528868 533870 537883 541601 544667 545966 544975 542213
61633 542213 538362 533521 527590 520849 513798 506722 499751 493132 487150 481999 477928 475263 474084 474128 475285
61618 475285 477863 482025 487204 492465 497233 501281 504107 504848 502900 498298 491395 482508 472030 460709
61604 460709 449483 438977 429216 419837 410551 401363 392493 384303 377301 371894 367840 364158 359961 355317
61590 355317 350978 347351 344140 340932 337656 334334 330874 327299 323840 320617 317478 314271 310951 307433
61576 307433 303778 300561 298447 297232 295882 293812 291500 289463 287368 284742 281937 279609 277691 275725
61562 275725 273970 273257 273828 275098 276594 278353 280306 282001 283168 283962 284499 284725 284934 285760 287298 288778
61546 288778 289466 289457 289259 289163 289514 291081 294365 298724 302890 306348 309674 313476 317606 321610 325364 328841
61530 328841 331568 332848 332482 330860 328331 324887 320642 316245 312417 309144 305755 301885 298068 295121
61516 295121 293198 291731 290264 288941 288007 287111 285514 283016 280372 278527 277564 276739 275568 274453 274008
61501 274008 274091 273989 273403 272692 272038 270974 269126 267076 266042 266774 268990 271689 273706 274239 273366 272070
61485 272070 271400 271508 271798 271962 272405 273495 274837 275643 275646 275284 275077 275141 275359 275728 276340 277159 278023 278853 279750
61466 279750 280804 281912 282825 283300 283171 282402 281251 280286 279982 280286 280734 281046 281404 282114 283211 284519 285855
61449 285855 287071 288127 289268 290866 292904 294927 296853 299549 304051 310226 316763 322652 328258 334627
61435 334627 342028 349618 356424 362244 367359 371625 374285 374854 373936 372812 372203 371762 370931 369978 369829 371083
61419 371083 373573 376878 380811 385281 389963 394377 398094 400743 401980 401649 399897 396985 393078 388318
61405 388318 382986 377382 371660 365973 360746 356501 353307 350577 347601 344197 340737 337611 334852 332290
61391 332290 329903 327894 326536 325955 326027 326418 326831 327298 328132 329530 331290 333014 334528 335996 337708 339869
61375 339869 342497 345334 347910 349919 351517 353179 355295 358047 361468 365301 368894 371618 373487 375064
61361 375064 376769 378653 380890 383960 388086 392853 397785 403033 409215 416799 425987 436891 449340 462594
61347 462594 475625 487718 498547 507845 515485 521904 527997 534402 541092 547733 554161 560409 566542
61334 566542 572596 578433 583453 586597 586946 584372 579551 573316 566033 557584 547929 537683 528103 520406
61320 520406 515005 511346 508359 505116 501275 497162 493495 490895 489550 489234 489566 490270 491401 493420 497020
61305 497020 502686 510403 519691 529735 539468 547673 553211 555223 553294 547766 539934 531600 524126 517936
61291 517936 512878 508758 505369 502363 499420 496417 493361 490396 487990 486668 486252 485880 485252 485502 488209
61276 488209 493725 501057 509162 517659 526295 534610 542420 550029 557589 564658 570704 575787 580545 585853
61262 585853 592645 601623 612803 625624 639686 654979 671168 687125 701699 714657 726390 736895
61250 736895 745601 752168 756926 760338 762294 762115 759058 752762 743435 731755 718533 704384 689782
61237 689782 675353 661861 649742 638711 628047 617335 606941 597754 590481 585199 581460 578661
61225 578661 576317 574126 571887 569327 566038 561772 556894 552327 548891 546868 546340 547605 550821 555372
61211 555372 560013 563676 565870 566430 565448 563476 561380 559800 559072 559663 562189 566812 573144 581019 590942
61196 590942 603462 618533 635910 655708 677915 701473 724421 744967 762135 775544 785224 791855
61184 791855 796775 801374 806460 812060 817620 822402 826038 828806 831264 833532 835092 835264 833698 830399
61170 830399 825475 819019 811187 802337 792979 783393 773273 762031 749547 736313 722553 707680 691154
61157 691154 673656 656777 641621 628343 617015 608140 602033 598367 596793 597400 599981 603150 604795
61144 604795 603285 597909 588555 575692 560617 545075 530403 517309 506267 497519 490673 484892 479789
61131 479789 475746 473244 472334 472990 475443 479795 485724 493021 502089 513435 526890 541829 557959 575352
61117 575352 593850 613082 633096 654262 676349 698312 719448 740290 761843 784210 806463
61106 806463 827702 847677 866349 883406 898425 911075 920823 926672 927612 923382 914591 902154 886794
61093 886794 869048 849389 828139 805463 781649 757259 732822 708454 684081 660001 636898
61082 636898 615275 595165 576487 559313 543539 528604 513920 499498 485839 473363 462231
61071 462231 452546 444311 437214 430826 425063 420116 415957 412288 408982 406149 403715 401409 399321 398012
61057 398012 397792 398334 399270 400796 403283 406650 410584 415147 420665 427172 434420 442433 451598 462154 473922
61042 473922 486570 499847 513503 527239 540888 554397 567585 580104 591771 602797 613524
61031 613524 623936 633483 641487 647797 653049 658090 663143 667755 671609 675065 678711 682728 687115 692360
61017 692360 699518 709651 723647 742641 768257 802344 846869 904074 975569 1059388 1146773 1222731
61005 1222731 1272318 1288975 1278036 1252586 1226300 1209718 1210249 1230844 1265881 1299892 1314068 1296647
60993 1296647 1248284 1178846 1100378 1022268 950054 886021 830291 782045 740427 704703 674042
60982 674042 647437 623798 602195 582169 563770 547018 531450 516457 502024 488765 477252
60971 477252 467593 459530 452587 446226 440339 435496 432165 429811 427462 425200 424235 425177 427004 428261 428725
60956 428725 429298 430701 432959 435948 439759 444452 449898 455950 462506 469382 476369 483406 490521 497639
60942 497639 504570 511026 516466 520084 521344 520515 518392 515351 510985 504836 497343 489691 482682 476053
60928 476053 469148 462003 455380 449817 445212 441464 438934 437840 437645 437561 437434 437621 438212 438960 439837 441104
60912 441104 442835 444801 446769 448518 449749 450496 451387 452860 454335 455001 455276 456477 458938 461494 463141
60897 463141 464237 465599 467357 469269 471327 473230 473989 472905 470521 467782 464701 460660 455694 450562
60883 450562 445733 441186 437193 434471 433321 433195 433369 433705 434635 436714 440292 445309 451308 457809 464660
60868 464660 471951 479678 487613 495311 502172 507848 512804 518158 524613 531794 538874 545517 551867 558024
60854 558024 563970 569787 575482 580856 585949 591320 597433 604040 610654 617361 624592 632315 640082 647758
60840 647758 655572 663504 671158 678301 685081 691817 699075 707798 718790 732021 746938 763306 781188
60827 781188 800155 819263 837973 856486 875046 893391 910953 926948 940108 948985 952921 952343
60815 952343 947847 939554 927653 912985 896477 878282 858025 835745 812188 788284 764791 742415
60803 742415 721756 702951 685664 669655 655222 642815 632293 622834 613748 605090 597274 590270
60791 590270 583669 577504 572401 568629 565445 561799 557431 552828 548361 543961 539509 535018 530429 525587
60777 525587 520487 515318 510343 505988 502811 500885 499326 496948 493466 489577 485801 481708 476498 469964
60763 469964 462661 455377 448635 442504 436688 430833 424824 418763 412824 407250 402315 398038 394069 390123
60749 390123 386449 383683 382357 382714 384656 387513 390105 391556 391915 391638 390740 388958 386530 384104 381929
60734 381929 379768 377665 376183 375819 376678 378723 381755 385098 387997 390502 393396 397029 400782 403845 405934
60719 405934 406989 406747 405032 402026 397960 392919 387201 381415 375942 370730 365807 361419 357326 352623
60705 352623 346871 340957 336221 332930 330219 327329 324315 321580 319308 317475 316120 315362 315300 315858 316665
60690 316665 317183 317138 316802 316752 317406 318807 320750 322970 325310 327672 329791 331195 331625 331381 330979 330634 330507
60673 330507 331205 333327 336416 339142 340806 342038 343620 345330 346554 347496 348973 351163 353340 354921 356226
60658 356226 358034 360759 364261 368277 372814 378139 384417 391430 398779 406225 413593 420405 426058 430491
60644 430491 434195 437246 438696 437376 433153 427018 420029 412539 404487 396086 388008 380912 374961 369905
60630 369905 365602 362128 359278 356374 353072 350070 348398 348048 347975 347437 346592 345673 344469 343042 342175 342444
60614 342444 343365 344077 344449 344913 345566 346020 345912 345054 343373 341225 339494 338773 338597 338011 336701 335109 333633
60597 333633 332385 331586 331518 331974 332289 332110 331783 331908 332752 334099 335434 336330 336913 337778 339259 340993 342589
60580 342589 344398 347104 350723 354648 358714 363603 369984 377736 386286 395475 405779 417683 430849
60567 430849 443888 455066 463374 468804 471535 471245 467554 460919 452666 444266 436796 430856 426576 423832
60553 423832 422771 423904 427410 432702 439183 447115 457175 469431 483380 498687 515049 531424 546307
60540 546307 558835 568793 575460 577490 574394 567432 558467 548605 538440 528940 521139 515191 510420 506274
60526 506274 502691 499578 496526 493234 489906 487046 485052 484039 483953 484789 486716 489913 494243 499251 504652
60511 504652 510780 518420 528229 540468 555270 573034 594397 619838 649379 682817 720189 761709
60499 761709 807082 855032 903713 951327 996006 1035233 1065894 1085075 1090706 1081622 1057711 1020413
60487 1020413 972866 919141 863138 807973 755861 708145 665346 627443 594233 565509 540946
60476 540946 519915 501543 485136 470605 458272 448109 439443 431563 424392 418195 412855 407885 403054
60463 403054 398509 394243 389887 385233 380647 376752 373897 372013 370803 369978 369409 369020 368431 366950 364268
60448 364268 360985 357994 355512 353200 351125 349876 349644 349921 350352 351183 352488 353635 354085 354184 354480 354632
60432 354632 353745 351620 348991 346549 344365 342400 341020 340720 341587 343217 345011 346574 347990 349707 352046
60417 352046 354846 357727 360463 362849 364473 365059 364945 364757 364655 364324 363715 363280 363363 363853 364610 365720 367019
60400 367019 367895 368091 368365 369760 372311 375010 377011 378341 379382 380260 381089 382320 384358 386984 389562
60385 389562 391797 393925 396145 398235 399859 401062 402247 403801 405826 408162 410515 412594 414259 415578
60371 415578 416789 418205 420068 422320 424564 426420 427953 429511 431112 432293 432773 433007 433760 435204 436860
60356 436860 438442 440441 443622 448148 453356 458320 462476 465808 468573 470870 472362 472474 470968 468251
60342 468251 465009 461552 457789 453886 450636 448836 448358 448198 447543 446550 445864 445690 445633 445305 444635 443505 441528
60325 441528 438490 434849 431487 428983 427321 426290 425951 426610 428416 431189 434630 438579 442961 447722 453067
60310 453067 459789 469001 481478 497422 516724 538762 561624 582276 598355 609555 616541 618778
60298 618778 614495 602954 585816 565906 545449 525916 508592 494256 482710 473435 466507 462180
60286 462180 459819 458032 455855 453162 450028 446462 442922 440330 439111 438551 437460 435279 432379 429519
60272 429519 427170 425157 422756 419296 414863 410422 407168 405681 405602 406024 406259 406350 406807 407862 409150 410120
60256 410120 410509 410316 409690 409065 409082 409969 411152 411813 411668 410989 410122 409360 409030 409201 409450 409337 409032 409057 409476
60237 409476 409790 409629 409225 409228 410299 412744 416209 419828 422968 425675 428178 430382 432277 434355 436913 439289
60221 439289 440628 441219 442160 443734 445123 445854 446589 448177 450773 454283 458834 464265 469842 475058 480179
60206 480179 485486 490521 494686 498137 501503 505023 508522 511892 515151 518294 521542 525363 529729 533733
60192 533733 536550 538471 540314 542058 542862 542316 540844 538810 535998 532310 528272 524441 520812 517318 514480
60177 514480 512987 512787 513099 513312 513392 513403 513071 512079 510454 508405 506045 503617 501765 501069 501287 501524 501281
60160 501281 500984 501293 502296 503608 504932 506177 507355 508785 511087 514451 518058 520757 522288 523450 525117
60145 525117 527528 530482 533740 537213 541120 545950 551915 558585 565487 572851 581074 589512 596688 601935
60131 601935 606135 610454 614922 618580 620521 620430 618595 615846 613082 610485 607516 603921 600263 597100 594181
60116 594181 590980 587608 584583 581960 579332 576550 573870 571404 568945 566444 564258 562739 561800 560994 559945
60101 559945 558689 557651 557188 557143 556949 556266 555403 555052 555763 557656 560450 563698 567234 571353 576319 581703
60085 581703 586594 590518 593795 596980 600375 604200 608730 613989 619619 625237 630586 635250 638623 640286
60071 640286 640044 637511 632236 624417 614956 604659 593942 583442 574052 565912 558101 549872 541545 533715
60057 533715 526406 519722 514504 511260 508998 506195 502714 499727 497898 496765 496008 496276 498335 502017 506362
60042 506362 510419 513800 516845 520270 524230 527784 529750 530019 529494 528835 527924 526573 524970 523149 520622
60027 520622 516832 511620 505033 497175 488531 480039 472465 465845 459676 453452 446936 440281 434101 429178
60013 429178 425845 423762 422309 421025 419689 418307 417206 416885 417571 418932 420243 420823 420492 419811 419706 420518
59997 420518 421541 421825 421373 421131 421816 423209 424682 426027 427575 429859 433331 438070 443500 448603 452711
59982 452711 456038 459267 462747 466254 469458 472352 475139 477838 480153 481775 482691 483121 483289 483386 483640 484178
59966 484178 484876 485649 486847 488993 492108 495705 499474 503444 507294 510189 511825 513145 515440 518867 522383
59951 522383 524905 526119 526303 525827 524795 522908 519836 515928 512215 509345 506871 504004 500665 497254 493797
59936 493797 490052 486159 482386 478405 473701 468701 464639 462111 460491 459040 457908 457705 458597 460193 462001
59921 462001 463713 465353 467359 470283 474243 478903 483975 489398 495015 500611 506493 513650 522958 534315
59907 534315 546665 558772 569944 580148 589474 597465 603154 605800 605396 602413 597571 592106 587511
59894 587511 584250 581177 577063 572416 568870 566996 565765 564250 562803 562253 562860 564512 567196 570776 574871
59879 574871 579351 584431 589976 595228 599591 603134 605996 607792 608018 606610 603807 599972 595855 592499
59865 592499 590396 589165 588347 587934 587740 586932 584877 582016 579167 576299 572649 567911 562620 557467 552753
59850 552753 548485 544547 540773 537178 534044 531479 529051 526220 522993 519760 516616 513277 509599 505810
59836 505810 502269 499364 497607 497381 498471 500099 501539 502584 503462 504516 505942 507579 508853 509088 507969
59821 507969 505755 503143 500957 499720 499266 498815 497677 495890 494100 492884 492337 492246 492440 492906 493702 494880
59805 494880 496484 498584 501189 504071 506723 508543 509072 508061 505460 501509 496727 491637 486565 481772
59791 481772 477601 474219 471384 468771 466413 464560 463215 462144 461167 460056 458327 455751 453043 451421
59777 451421 451332 452096 452920 453761 455000 456809 459151 461946 464915 467644 470094 472734 475869 479171 482186
59762 482186 484946 487759 490684 493659 496904 500772 505270 510086 515079 520534 526872 534189 542043 549721
59748 549721 556900 563975 571504 579383 586948 593887 600572 607368 614057 620162 625425 629757 633066 635415
59734 635415 636991 637679 637014 634870 631867 628814 626016 623325 620572 617603 614228 610460 606682 603370 600815
59719 600815 599087 597930 596616 594438 591579 589039 587469 586604 586062 586020 586616 587389 588014 589097 591408 594653
59703 594653 597698 599841 601155 601815 601920 601905 602364 603341 604458 605781 607828 610541 612908 613958 613611 612273
59687 612273 610100 607131 603781 600727 598449 597182 597088 598026 599195 599435 598071 595280 591634 587460 582802
59672 582802 577758 572529 567138 561374 555204 549054 543504 538800 534847 531574 529010 527039 525376 523943
59658 523943 523040 523049 524062 525856 528100 530496 532877 535216 537580 540100 543006 546436 549949 552424 552742
59643 552742 550595 546471 541059 534923 528562 522335 516397 511067 507013 504629 503387 502348 501199 500216
59629 500216 499360 498151 496445 494543 492477 489914 486942 484116 481535 478677 475408 472259 469313 465791
59615 465791 461349 456995 453983 452416 451648 451463 452073 453435 455371 457956 461072 463979 466067 467698 469530
59600 469530 471356 472459 472880 473385 474238 474851 474747 474159 473535 473093 472982 473340 473980 474491 474815 475304 476059 476485
59582 476485 475754 473554 470282 466608 462869 458945 454809 450983 448056 445799 443375 440565 438061 436273
59568 436273 434598 432488 430540 429701 429839 429975 429677 429451 429888 431102 432925 435021 436927 438498 440177 442297
59552 442297 444420 445978 447301 449271 452195 455755 459922 465087 471351 478485 486621 496279 507839 521874
59538 521874 539828 562913 589438 614021 630505 635986 632122 623137 612954 603822 596722 592403 591610
59525 591610 594384 599589 605594 611263 616059 619525 621216 620985 618823 614517 607920 599428 589712 579070
59511 579070 567477 555153 542571 530135 518416 508446 501062 495917 491794 487865 484077 480406 476616
59498 476616 472825 469639 467481 466307 466004 466408 466916 466871 466504 466760 467927 469158 469749 470175 471349 473383
59482 473383 475683 477944 480496 483784 487891 492547 497401 502324 507492 513035 518662 523796 528052 531292
59468 531292 533309 533934 533544 533096 533476 534976 537345 540132 543119 546727 551803 558693 566750 575198 584103
59453 584103 593801 603698 612591 620155 627166 634087 640385 645507 649553 652380 652763 649232 641422 630202
59439 630202 616889 602832 589341 577382 567301 559008 552180 546166 540298 534751 530679 528970 529106
59426 529106 529843 530883 533319 538413 546394 556603 568419 581744 596794 613670 632102 651463 671291
59413 671291 692181 715908 743445 771944 794275 803138 796349 777796 753524 728069 704536 686029
59401 686029 675105 672486 677584 689490 705597 719679 723819 713671 691329 662869 633980 607910
59389 607910 585776 567275 551455 537703 526113 516810 509419 503488 498884 495439 492670 490237 488332
59376 488332 487316 487277 488094 489550 491239 492798 494375 496442 499094 502014 505104 508572 512331 516048 519929
59361 519929 524712 530660 537253 544163 551852 560799 570791 581425 592827 605516 619928 636316 654598
59348 654598 674093 693912 713836 734206 754812 774578 792614 808785 822865 833948 841361 845572
59336 845572 847573 847762 845876 841603 834721 825101 813043 799358 784799 769793 754914 740979 728265
59323 728265 716216 704396 693151 682838 673084 663516 654743 647703 642261 637171 631393 624895 618224
59310 618224 611848 605957 600529 595449 590715 586547 583251 581072 580139 580364 581421 583046 585226 587672 589321
59295 589321 589071 587119 584907 583573 583061 582905 583133 584048 585670 587824 590382 593206 596266 599945 604700
59280 604700 610375 616456 623037 630757 639710 649334 659547 670993 683751 696839 709502 722051 734743
59267 734743 746720 756819 764745 770722 774591 775936 774581 770465 763694 755133 746094 736850 726367
59254 726367 714181 701595 690104 679623 669360 659641 651533 645250 640173 636131 633405 631696 630270
59241 630270 629140 629133 630763 633771 637577 641381 644029 644772 644150 643332 642542 640819 637254 631785 624815 616665
59225 616665 607509 597399 586489 575509 565558 556983 548998 541040 533857 528385 524116 519768 515247
59212 515247 511748 509951 509266 509033 509417 510739 512653 514398 515499 516111 517010 519104 522417 525714 527683
59197 527683 528374 528924 530137 532043 534687 538428 543380 549221 555683 562610 569549 575927 581803 587899 594753
59182 594753 602235 609883 617288 624184 630589 636845 643170 649263 654726 659645 664387 669084 673773 678763
59168 678763 684263 689901 695198 700285 705573 710926 715740 719569 722070 722611 720720 716818 711836 706203
59154 706203 699733 692311 684053 675083 665824 657246 649994 643453 636491 629064 622247 616745 612184 607941
59140 607941 603892 600183 596887 594083 591850 590171 589217 589585 591747 595412 599897 604861 610189 615535 620652
59125 620652 625939 631995 638923 646749 656102 667551 680552 693985 707520 721520 735858 749941
59113 749941 763872 778455 793884 809387 824288 838540 852132 864866 876948 888887 900559
59102 900559 911089 919869 927001 932587 936376 938292 938642 937565 934875 930609 925238 919292 913298 907899
59088 907899 903359 899088 894406 889559 884997 879831 872164 861182 847942 833859 819348 804220 788466
59075 788466 772235 755765 739636 724454 710098 695994 682260 669821 659209 650055 641921 634802
59063 634802 628571 622769 617256 612372 608212 604436 600915 597717 594354 590014 584866 580199 576864 574443
59049 574443 572352 570882 570567 571293 572581 574136 575615 576540 576983 577785 579633 582363 585567 589277 593610
59034 593610 598301 603101 608259 614180 620942 628456 636807 646200 656937 669582 684750 702586 722798
59021 722798 745188 769676 795823 822866 850092 876483 900134 918865 931575 938309 939141 934021
59009 934021 923803 910409 895641 880645 866628 855022 846536 840963 838260 838875 842619 848211 854396
58996 854396 860635 866234 869903 870902 869739 866963 862060 854423 844784 834681 824765 814321 802306 788362
58982 788362 773085 757733 743528 730944 719826 710170 702385 696777 693332 691979 692502 694272 696805
58969 696805 700546 706201 713299 720511 727522 735412 744822 754907 764626 773961 783157 791754 799177 805499
58955 805499 810820 814438 815287 812679 806266 796076 783128 769293 755985 743521 732023 722018 713734
58942 713734 706820 701450 698647 698729 700224 701177 700792 699097 695939 691381 686455 682434 679671 677838 676726
58927 676726 675990 674648 671784 667528 662617 657298 651311 644649 637742 631110 625234 620375 616193 612104
58913 612104 608321 605902 605338 605847 606608 607923 610493 614262 618747 623964 630277 637756 646230 655541 665285
58898 665285 674850 684114 693434 702640 710974 718559 726934 737420 749853 763709 779469 797920 818965
58885 818965 842058 866910 892613 916867 937324 953310 965266 973283 977282 977890 975660 969871 959471
58872 959471 944969 928127 910037 890770 870860 851831 835084 821153 810043 801330 793908 786639
58860 786639 779475 773256 768275 763676 758327 751698 743879 735328 726656 718283 710328 703120 697449 693852
58846 693852 692009 691263 691241 691383 690366 686827 680487 672006 662085 651331 640577 630527 621241 612507
58832 612507 604483 597438 591232 585598 580586 576177 571888 567328 562766 558642 554993 551854 549601 548207
58818 548207 546813 544828 542920 542149 542621 543725 545106 546560 547602 548151 549162 551496 554512 556806 558007
58803 558007 558863 559800 560487 560745 560903 561176 561393 561357 560856 559447 556848 553505 550341 548097 547159 547599 549041
58786 549041 551008 553809 558346 564572 570997 576459 581587 587656 594752 602005 608911 615366 620959 625255
58772 625255 628302 629985 629455 626144 620807 614672 608216 601633 595669 590805 586379 581757 577700 575267
58758 575267 574001 572712 571583 571993 574572 578828 584403 591182 598266 604254 608644 611920 614364 615928
58744 615928 617115 618852 621515 625046 629758 636020 643523 651942 661896 674046 687660 701448 715447
58731 715447 730618 746852 762965 778609 794527 810583 824856 835063 840027 839834 835694 829685
58719 829685 823520 817438 811125 805467 802283 802455 805419 810344 816708 823836 830972 837695 843367 846591
58705 846591 846352 843221 838160 830625 819299 804254 786775 767357 745690 722511 699678 678199
58693 678199 657748 638234 620325 604258 589659 576730 566210 557980 551076 545105 540210 535736
58681 535736 530580 524954 520075 515967 511345 505993 501410 498596 496967 496072 496653 499143 502597 506078 509976
58666 509976 515206 522123 530815 541353 553107 564737 575357 584844 592862 598644 602046 603651 603603 601541
58652 601541 597919 594077 590631 586986 582818 578762 575263 571903 568279 564464 560407 556016 551933 548898
58638 548898 546247 542606 538279 535310 534765 535559 536470 537632 539293 540691 541113 540826 540148 538754 536688 534913
58622 534913 534143 534090 534506 535925 538814 542935 548015 554120 561014 568163 575579 583534 591273 597300 601172
58607 601172 603688 605172 605095 603673 602158 601100 599885 598393 597420 596971 595874 593763 591741 590356 588664
58592 588664 586190 584140 583680 584575 586513 590255 596370 604241 613395 624422 637468 651137 664071 676412
58578 676412 688662 700283 710555 719726 728246 735852 742457 748930 755997 763292 770444 778225 787790
58565 787790 799622 813929 831115 851197 873677 898545 926276 956225 986184 1014206 1039807
58554 1039807 1062896 1082918 1099738 1114026 1125879 1134115 1137598 1136146 1129682 1117886 1101343 1081634
58542 1081634 1059551 1034508 1006300 976128 945348 914678 885165 858300 834449 812667 792635
58531 792635 775143 760151 746361 733480 722971 715598 710192 705783 702990 702137 702030 701852 702439 704285
58517 704285 706119 706786 706823 706918 706655 706074 706468 708131 709266 708685 707632 707264 706427 703919 701056 699743 699570
58500 699570 698988 697908 697022 695854 693735 691560 690511 690083 689294 688707 689310 690500 691251 692370 695527 700822
58484 700822 707141 714259 722870 733267 745575 760530 778516 798441 818798 838840 857639 873334
58472 873334 884744 892475 897113 897791 894015 887292 879169 869209 856777 843347 830974 819778 808945
58459 808945 799032 791184 785289 780945 779207 781244 786188 792213 798714 805609 811621 815298 816730 816418
58445 816418 813582 807546 799683 791929 784410 776496 769097 763814 760856 759737 760951 764833 769829 774033
58431 774033 777631 781925 787042 792541 799152 807820 818081 829377 842800 859425 877974 896150 913090
58418 913090 928434 940411 947254 949465 948540 944622 937602 929133 921021 912771 903119 892764 883196 874048
58404 874048 864303 855020 848266 844304 842255 842365 845103 849226 853489 859177 868199 879600 890662 900439
58390 900439 909509 917202 921959 923717 923388 920826 915783 909865 904960 900678 895749 890710 886721 883240
58376 883240 879583 877251 877722 879488 880406 881466 884900 890007 894424 898223 903136 908922 914228 919986 928165
58361 928165 938083 947654 957374 969187 982274 993898 1003730 1013392 1022363 1028407 1031716 1034711 1038014
58348 1038014 1040422 1042582 1046820 1053462 1060864 1068842 1078595 1089633 1100374 1111351 1124385 1139181 1154261
58335 1154261 1170369 1189156 1209352 1228206 1245857 1264177 1282160 1296876 1308330 1318924 1328668
58324 1328668 1335418 1339374 1342809 1345788 1346681 1346496 1348035 1351204 1353811 1356538 1362209 1370509 1378495 1386146
58310 1386146 1396370 1409618 1423597 1438214 1455659 1475527 1495066 1514325 1535873 1559330 1581459
58299 1581459 1601757 1622609 1643747 1662035 1677013 1691297 1705320 1717148 1727673 1740341 1755526
58288 1755526 1770748 1786457 1805649 1827714 1848832 1868765 1891045 1916333 1942192 1969795 2003880
58277 2003880 2045134 2089171 2133805 2180659 2228967 2274917 2318271 2362783 2409156 2454550 2499874
58266 2499874 2550145 2606555 2665559 2726812 2794241 2868065 2943760 3020331 3101442 3186623 3269549
58255 3269549 3347016 3421634 3493998 3560685 3622138 3684274 3750098 3817701 3888066 3966216 4053044
58244 4053044 4144887 4242670 4352160 4473747 4601744 4735244 4879447 5034890 5196409 5364372
58234 5364372 5545425 5740342 5943301 6155165 6384694 6634313 6898110 7176367 7477805
58225 7477805 7804617 8150413 8516464 8914242 9347947 9810986 10304261 10840900 11428230
58216 11428230 12063259 12751445 13511030 14352964 15276399 16290373 17419244 18680865 20082952
58207 20082952 21648874 23423461 25446820 27750536 30389981 33453921 37035800 41228192
58199 41228192 46152425 51954948 58767659 66724121 76039035 87035254 100096417 115673613
58191 115673613 134368391 156932768 184143164 216671782 254805651 297570613 341441096
58184 341441096 379976191 405639273 413129767 401804233 375412832 339763866 300345638
58177 300345638 261183773 224752389 192268437 164064582 139980958 119653219 102625690
58170 102625690 88397016 76495851 66533587 58182258 51145003 45175903 40096834 35766379
58162 35766379 32050860 28839093 26056584 23642707 21531466 19667967 18022194 16569989
58154 16569989 15277069 14114009 13069075 12132981 11286349 10513450 9812805 9182653 8609690
58145 8609690 8082256 7600914 7165931 6767223 6396150 6054803 5744440 5456604 5184550
58136 5184550 4932006 4701939 4487555 4282877 4091631 3917337 3754624 3598571 3452978
58127 3452978 3321303 3198471 3079482 2967406 2865184 2767914 2670809 2576921 2489739 2405892
58117 2405892 2322224 2242578 2170494 2102359 2034682 1971144 1915492 1864119 1812507 1762670 1717534
58106 1717534 1674093 1628884 1584502 1544196 1505522 1465687 1427768 1395261 1365472 1334536 1304334
58095 1304334 1278477 1255980 1234693 1216591 1203933 1194219 1184291 1175349 1168851 1161713 1150774 1137968
58083 1137968 1126040 1113189 1097014 1079673 1063885 1047554 1027472 1004819 982092 958185 931461
58072 931461 904276 879605 856422 833040 811632 794599 779745 763887 748194 735235 723854
58061 723854 711850 700858 693520 688267 681569 673122 664442 654784 642918 630770 620921 612532 603744
58048 603744 595758 590423 586030 579798 572523 566702 561993 556540 550829 546272 541757 535506 528621 523122
58034 523122 518368 512980 508181 505301 501991 495040 485341 476142 467999 459384 450779 444022 438711 433068
58020 433068 427428 423378 420389 416667 412359 408689 405045 400081 394629 390412 387030 383171 379514 377289
58006 377289 375350 371919 368103 366394 366699 366994 366918 367598 368876 369844 371314 374803 379742 384365 388423 392479
57990 392479 395656 396949 397674 399837 403052 405718 408014 410754 412473 410880 406476 401842 397961 393914
57976 393914 389372 384689 379355 372993 367055 362949 359477 354791 349769 346615 345149 343495 341600 340994
57962 340994 341689 342283 342659 343757 345138 345448 344925 344900 345343 345338 345321 346299 347586 347917 348114 349973 353210 356252
57944 356252 359409 364499 371829 380212 389436 400044 411183 421459 431477 442913 455523 467683
57932 467683 479188 490652 500766 507222 510105 511393 511337 508293 501961 493793 484221 472511 459435
57919 459435 447048 435456 422702 408328 394323 382058 370873 360269 351017 343448 336877 331302
57907 331302 327594 325530 323673 321645 320539 320763 321380 321825 322449 323206 323694 324520 326732 329980 333207 336887
57891 336887 342259 348548 353497 356823 360570 365631 370426 373540 375371 376443 376286 374829 373028 371290
57877 371290 368817 364982 359898 353441 345394 336727 329030 322562 316484 310859 306485 302872 298601 293837
57863 293837 290335 288779 288153 287872 288359 289446 290547 292603 297352 304230 310499 315056 319626 325414 331066
57848 331066 335069 337843 340133 341265 340358 337654 333534 327746 320652 313770 308039 302829 297522 292699
57834 292699 288994 286098 283676 282110 281681 282196 283911 287563 293053 299300 305705 312414 319009 324490 328804
57819 328804 332793 336428 338756 339755 340414 340687 339355 336314 332988 329989 326394 321889 317479 313348 308203
57804 308203 301736 295619 290950 286734 282058 277812 274827 272107 268562 265027 263000 262485 262409 262111 261316
57789 261316 259800 258173 257907 259541 261962 264309 267301 271735 277046 282565 288893 296754 305513 314025
57775 314025 322027 329655 336549 342526 348155 353582 357654 359211 358459 356240 352866 348547 343948 339282
57761 339282 333661 326369 318097 310112 302903 296363 290514 285304 280428 275949 272342 269455 266378 262784
57747 262784 259284 256017 252195 247749 244046 241992 240578 238315 235106 231716 228392 225059 222032 219593
57733 219593 217501 215612 214231 213295 212151 210705 209697 209236 208300 206447 204790 204343 204569 204580 204684 205663
57717 205663 207387 209188 210818 212176 212931 213206 213714 214533 214735 214001 213427 213865 214602 214714 214619 215151 216171
57700 216171 217259 218877 221607 224950 227940 230290 232040 232803 232294 230919 229127 226966 224890 223934 224304
57685 224304 224976 225504 227013 230505 235562 241787 250095 261211 274298 288640 305522 326833 353036
57672 353036 384376 423052 472208 533607 608124 697130 799559 906225 998999 1057855 1070258
57661 1070258 1036104 966279 876797 782114 691488 609681 539073 480086 430973 389299 353922
57650 353922 324812 301481 282792 267921 256346 247094 239078 231999 226048 221071 216852 213685 211623
57637 211623 209676 206863 203606 200917 198700 196175 193572 191965 191510 191138 190037 188294 186098 183473 180944
57622 180944 179422 179119 179291 179088 178142 176486 174536 172952 171876 170613 168686 166755 165708 165350 164902 164341
57606 164341 164217 164501 164673 164695 164916 165246 165344 165373 165657 165851 165437 164773 164704 165319 166048 166707 167442 167919 167582 166641
57586 166641 165870 165585 165594 165902 166577 167230 167573 168116 169323 170456 170431 169498 168914 169106 169411 169471 169609 169740 169172
57567 169172 167694 165819 163849 161681 159700 158842 159437 160748 161872 162452 162544 162507 163013 164431 166251 167792
57551 167792 169279 171403 174035 176312 177877 179065 179966 180317 180324 180606 181243 181706 181774 181697 181494 180952 180238 179595
57533 179595 178488 176069 172540 169140 166682 164956 163579 162522 161744 161120 160789 160791 160508 159404 158145 157923
57517 157923 158778 159746 160615 162190 164615 166769 167819 168233 168746 169331 169763 170301 171153 172001 172655 173566 175138
57500 175138 177012 178437 178984 178670 177795 176874 176276 175777 174900 173698 172713 172244 172255 172883 174275 175990 177326
57483 177326 178261 179299 180480 181466 182590 184713 187776 190518 192035 192688 193062 192894 191652 189531 187291
57468 187291 185504 184384 183908 183773 183523 182999 182411 181971 181815 182191 183239 184666 186196 188137 190772 193354
57452 193354 194651 194555 194226 194529 195201 195828 196710 198268 200288 202186 203596 204437 204846 205202 205781 206368 206671
57435 206671 206972 207727 208726 209512 210405 212054 213991 214837 214237 213401 213338 213674 213757 213885 214603 215640 216366 216776
57417 216776 217231 217689 217842 217734 217665 217717 217825 218092 218700 219673 220989 222621 224293 225425 225538 224558 222787 220895
57399 220895 219820 220131 221445 222853 223877 224624 225200 225655 226380 227852 229979 232345 235038 238560 242958
57384 242958 247802 252846 257895 262124 264551 265315 265551 265820 265619 264597 263274 262251 261546 261031 260702 260343
57368 260343 259767 259553 260489 262065 262638 261614 260365 260389 261540 262835 264157 266193 269211 272711 276030 278779
57352 278779 280932 282867 285065 287607 290272 293053 295960 298413 299680 300032 300578 301817 303279 304734 306620
57337 306620 308941 310876 312015 312986 314272 315483 316437 317847 320041 321938 322369 321785 321671 322776 324767
57322 324767 327131 329487 331327 332372 333117 334437 336669 339423 342089 344318 346302 348769 352247 356189
57308 356189 359414 361521 363228 365227 367599 370512 374315 378426 381240 381991 381966 383058 385855 389820 394551
57293 394551 399914 405512 410953 416351 421934 427603 433437 440008 447455 454820 461106 466583 472309 478762
57279 478762 485608 492407 498809 504379 508995 513288 518151 523953 530524 537565 544758 551888 559209 567208
57265 567208 575768 584166 592186 600455 609326 618236 626709 635171 644108 653254 662270 671495 681254 691165
57251 691165 700947 711238 722774 735295 748073 760989 774272 787727 801097 814742 829256 844759
57239 844759 861118 878250 895668 912517 928853 946090 965308 985830 1006438 1027206 1049037
57228 1049037 1072042 1095639 1119775 1144837 1170714 1197189 1225055 1255604 1289026 1324246 1360225
57217 1360225 1396538 1432901 1469208 1506068 1544393 1584389 1625570 1667649 1710710 1754691 1799410
57206 1799410 1845044 1892000 1940501 1990833 2043536 2098571 2154590 2209762 2263128 2314681 2364651
57195 2364651 2413572 2462639 2513054 2565116 2618444 2672618 2726951 2780288 2831926 2882266 2931746
57184 2931746 2979719 3025295 3068609 3110224 3149973 3187743 3224895 3263476 3304340 3347353 3393045
57173 3393045 3442405 3495068 3549358 3604420 3660950 3719436 3778875 3837701 3894987 3950315 4003369
57162 4003369 4054140 4102953 4149911 4194726 4237082 4276679 4313084 4346281 4377337 4407825 4438643
57151 4438643 4469892 4501481 4532977 4563136 4590622 4615147 4637165 4656782 4673954 4689501 4704769
57140 4704769 4720293 4735818 4751501 4768003 4785403 4803021 4820400 4837576 4854516 4871305 4888808
57129 4888808 4907992 4928539 4949081 4968776 4987631 5005381 5021320 5035443 5048812 5062840 5079321
57118 5079321 5101092 5131283 5171506 5221536 5280558 5347350 5419295 5493126 5567959 5647379 5738688
57107 5738688 5851077 5994340 6177597 6408208 6692423 7037559 7453424 7952603 8551429
57098 8551429 9271578 10140019 11187105 12445095 13947574 15727748 17815350 20234113
57090 20234113 22999873 26117238 29575009 33342539 37366806 41568740 45841879 50058831
57082 50058831 54084377 57787076 61044606 63746209 65796174 67117522 67655407 67382863
57074 67382863 66308371 64478513 61971574 58887114 55338618 51449195 47346188 43154181
57066 43154181 38988820 34951590 31124608 27567044 24315414 21386529 18780617 16484782
57058 16484782 14477713 12733951 11225827 9924510 8802183 7834080 6998376 6275142
57050 6275142 5646625 5098057 4617057 4192636 3815705 3479981 3181064 2914616 2676192
57041 2676192 2462294 2270376 2097800 1941716 1799944 1671171 1554278 1448135 1351933 1264995
57031 1264995 1186271 1114470 1048538 987535 930421 876625 826604 781134 740087 702412 667188
57020 667188 634232 603734 575660 549448 524109 498931 474270 451239 430360 411059 392739
57009 392739 375656 360229 346071 332390 318958 306134 294254 283500 274060 266031 259464 254713
56997 254713 252215 251762 252702 255158 260177 268148 277970 288480 299841 312737 326988 342052 358361
56984 358361 377002 398131 420213 440455 455336 461460 457216 443850 424422 401760 377675 353486
56972 353486 330405 309426 291330 276642 265231 256402 249755 245609 244302 245741 250035 257863 269614
56959 269614 284913 303606 326291 352716 379935 402884 416705 418487 407992 387928 362941 337066
56947 337066 311988 288071 266240 247881 233536 222842 215549 211667 210905 212900 217834 226142 237910
56934 237910 253336 273389 299160 330560 365913 401917 433244 453309 457387 445480 421626 390696
56922 390696 356453 321662 288273 257144 228535 203011 181207 162887 147113 133302 121510
56911 121510 111887 104490 99278 95659 92541 89565 87669 87510 88027 87742 86893 86938 88400 90627 93349 96958
56895 96958 101345 106002 111306 118280 127018 136758 147739 161518 179037 199601 221984 245053 266662
56882 266662 283315 292086 292458 285945 274723 261041 247048 234278 223500 215180 209609 206560 205623
56869 205623 207079 211774 219985 231223 245346 263184 285928 314671 350616 394595 445505 499323
56857 499323 549685 589313 611855 614280 598442 569817 534350 496598 460110 427804 401281 380664
56845 380664 365665 356335 352712 354710 362690 377381 399037 427642 464218 510949 569557 640140
56833 640140 721257 809050 894955 965659 1007774 1014073 986123 932167 862989 788391 715246 647448
56821 647448 587091 535387 492699 458641 432804 415144 405443 402945 406993 417795 436232 463249
56809 463249 499663 546124 602415 666034 730769 786633 822464 830631 810510 767756 710540 646545
56797 646545 582183 522392 470012 425786 389342 359932 336533 318246 304909 296681 293076 293336
56785 293336 297846 308111 325015 347999 376176 408834 443732 475596 497550 504434 494972 471544
56773 471544 438490 400285 360528 322077 287271 257281 231519 208627 188167 170706 156470
56762 156470 144956 135785 128779 123052 117359 111747 107591 105363 103457 100030 95118 90140 86176 83505
56748 83505 82176 82003 82322 82447 82152 81433 80284 79044 78332 78259 78286 78235 78673 79809 80745 80477 79147 77716
56730 77716 76823 76419 76123 75583 74895 74827 76081 78201 79954 80912 81798 83102 84476 85807 87637 89902 91430
56713 91430 91571 91301 91830 93029 94177 95392 97242 99600 101935 104139 106103 107071 106525 105301 104874 105768
56697 105768 107426 109144 110352 110516 109702 108853 108617 108337 107072 105176 103819 103325 103029 102568 102231 102144 102111
56680 102111 102338 103359 105083 106609 107151 106663 105538 104208 102995 101925 100709 99230 97886 97172 97235 98120
56664 98120 99955 102461 104789 106443 107868 109565 111140 111950 112216 112704 113694 115042 116897 119493 122491
56649 122491 125361 128215 131452 134802 137545 139537 141246 142895 144327 145628 147016 148144 148324 147574 146812
56634 146812 146847 147720 149019 150274 150997 150936 150503 150498 151260 152371 153207 153477 153219 152566 151538 149886 147284 143835
56616 143835 140199 136986 134282 131922 129898 128212 126671 125146 123731 122461 121239 120278 120066 120619 121228
56601 121228 121284 120823 120010 118766 117310 116326 116024 115739 115116 114967 116147 118120 119550 119932 119861 119983 120438 121126
56583 121126 121888 122538 123122 123869 124684 125235 125803 127215 129484 131442 132410 133320 135361 138404 141758 145559
56567 145559 150201 155146 159703 164472 170691 178525 187366 197510 210017 224781 239933 253236 263207
56554 263207 269073 270957 270261 268842 267483 265847 263827 262034 260947 260437 260243 260185 259894 259013 257677 256198
56538 256198 254418 251953 248853 245381 241493 237230 233209 229834 226426 222125 217338 213272 210300 207802
56524 207802 205319 202778 199808 196073 192190 189156 186862 184269 181038 177911 175473 173625 172303 171571
56510 171571 170899 169456 167375 165760 165200 165149 164878 164183 163043 161500 160043 159225 158800 158004 156747 155680
56494 155680 155146 154985 155303 156390 157781 158431 158044 157381 157164 157487 158328 159624 160812 161282 161359 161931 163062
56477 163062 163972 164416 164962 165914 167054 168544 170840 173492 175325 176151 177089 178749 180311 181042 181587 182883
56461 182883 184604 185570 185228 184113 183182 183079 183716 184284 184012 183019 182054 181513 181297 181451 182151 183067 183541 183451
56443 183451 183262 183217 183188 183226 183477 183661 183474 183413 184261 185816 187068 187595 187850 188106 188074 187658 187160 186729 186367 186335
56423 186335 186662 186576 185494 184255 184141 184907 185181 184718 184750 185975 187630 188745 189044 188464 187098 185834 185778
56406 185778 186832 188011 189098 190628 192257 192861 192446 192355 193246 194397 195366 196652 198274 199342 199653 200142
56390 200142 201142 201756 201671 202008 203507 205277 206250 206613 206976 207384 207981 209446 211877 214230 215649 216381 216873
56373 216873 217075 217193 217940 219435 220921 222090 223472 225166 226547 227667 229350 231383 232276 231554 230667 230794
56357 230794 231413 231943 233021 234982 236673 237132 237055 237312 237391 236660 235892 236051 236679 236875 236945 237760 239330 241209
56339 241209 243444 245978 248039 249240 250485 252691 255464 257974 260288 262767 265054 266683 267962 269459
56325 269459 271377 274033 277861 282207 285334 286405 286313 285878 284657 282455 280431 279558 279354 279215 279550 280449
56309 280449 280759 279929 279339 280400 282628 285022 287957 292148 297017 301683 306339 311114 314780 316336 316732
56294 316732 317398 318138 318147 317912 318323 318934 318954 319013 320126 321834 323203 324756 327562 331216 334706 338463 343492
56277 343492 349053 353304 355939 358313 361205 364249 367381 371120 375432 379773 384210 389313 395129 401376
56263 401376 408251 415986 424077 432019 440272 449519 459674 470598 482947 497232 513073 530458 550609
56250 550609 574277 600400 627881 657516 690582 726698 764776 804828 846960 889764 931714
56239 931714 973198 1015047 1055852 1092797 1124437 1150682 1170830 1183872 1190219 1191075 1186489 1175943
56227 1175943 1160359 1141581 1120292 1096237 1070000 1042629 1013978 983389 951709 920800 891397
56216 891397 863087 835951 810432 786040 761947 738551 716875 696877 677853 659914 643499
56205 643499 628138 613323 599866 588786 579607 571330 564143 558510 553631 548551 543709 539667 535659
56192 535659 531307 528258 527816 528382 527790 526780 527422 529395 530837 531739 533362 535160 535612 535536 537378 541486
56176 541486 546103 550674 556051 561678 565737 568215 570997 574894 579191 583950 589972 596611 602445 608107
56162 608107 615745 625829 637084 649296 663311 678490 693160 707604 723836 742487 762677 784749
56150 784749 810210 839140 870668 905980 948037 998450 1057475 1126700 1208604 1303731 1411450
56139 1411450 1533010 1670087 1819947 1975009 2126860 2267736 2389521 2486774 2561998 2624288
56129 2624288 2681882 2738563 2795970 2853693 2905800 2942194 2956136 2948312 2923481 2887168 2846094
56118 2846094 2806523 2768843 2726062 2669207 2592182 2491776 2367750 2225291 2074398 1924767
56108 1924767 1782869 1653752 1541642 1447285 1367883 1301100 1246636 1203403 1168614 1140717 1120095
56097 1120095 1105935 1095655 1088222 1084711 1084653 1085232 1084962 1084866 1085272 1084986 1084322 1085262 1087777 1089675 1090831 1093697
56081 1093697 1098851 1104074 1108678 1114540 1121866 1128376 1133918 1141514 1152410 1164336 1176018 1189075 1203951
56068 1203951 1218435 1231935 1246971 1264821 1283827 1303466 1325681 1350665 1375732 1399894 1425079
56057 1425079 1451405 1475974 1497830 1519237 1540527 1558844 1573747 1588840 1605910 1622631 1637949
56046 1637949 1654332 1672604 1690048 1705942 1723580 1744686 1767407 1791980 1822351 1859604 1899632
56035 1899632 1939836 1982116 2026793 2070152 2111073 2153666 2200087 2247075 2292745 2340207 2391067
56024 2391067 2442136 2492198 2545278 2603461 2663360 2723470 2787820 2858231 2930308 3001427 3075333
56013 3075333 3154345 3234676 3314359 3398094 3489110 3583850 3679895 3781289 3890667 4004180 4119834
56002 4119834 4242780 4376568 4517374 4662603 4816574 4981791 5153740 5330618 5518877
55993 5518877 5722593 5937118 6160065 6398272 6656586 6930484 7217585 7525438 7859728
55984 7859728 8216254 8593229 8999552 9441830 9915847 10420593 10967667 11566731 12215795
55975 12215795 12916795 13685957 14537276 15471688 16495179 17630908 18900622 20313206 21886862
55966 21886862 23663333 25685372 27983617 30605267 33633920 37164203 41286476 46120720
55958 46120720 51836251 58613743 66624947 76085182 87297331 100627457 116505265 135507148
55950 135507148 158390692 185991250 219086516 258163688 302655004 349599533 392879256
55943 392879256 424533536 438034608 431300866 407200073 371519796 330319365 288340928
55936 288340928 248658592 212911129 181680623 154912594 132263653 113268734 97399319
55929 97399319 84136960 73042577 63751367 55936843 49320252 43694944 38903857 34801894
55921 34801894 31261499 28194110 25535115 23216938 21177083 19377773 17794044 16392080
55913 16392080 15137762 14014674 13014183 12117131 11302258 10562666 9896894 9292380 8733467
55904 8733467 8217298 7746517 7313969 6909053 6531783 6186394 5867646 5566726 5284409
55895 5284409 5025557 4786430 4559618 4345995 4150082 3968832 3796191 3633647 3485364
55886 3485364 3347747 3214447 3087024 2970360 2861926 2755773 2653069 2558791 2471712 2387165
55876 2387165 2306105 2232134 2162729 2092406 2021706 1954715 1890776 1826821 1764787 1708512 1656069
55865 1656069 1603127 1551186 1504683 1462562 1420392 1378463 1340389 1305906 1272218 1240309 1213077
55854 1213077 1189400 1166796 1147505 1134993 1126543 1116022 1102042 1086903 1069825 1048123 1023284
55843 1023284 999069 975093 948713 921667 898305 878513 858651 838300 819976 803359 785873
55832 785873 768019 752338 738039 722392 706456 693779 684307 675032 665655 658086 651181 641638 629529
55819 629529 617652 606051 592525 577913 565503 555491 545171 534277 525090 517572 509496 501281
55807 501281 495762 493162 491059 489347 490478 494672 499480 504367 511328 520638 530221 539483 549618 559830
55793 559830 567278 571276 573826 575718 575758 574077 572544 571403 568682 563057 554280 541098 522298 499813
55779 499813 477482 456739 436575 417275 400705 387102 375067 364618 356951 351374 345882 340590
55767 340590 337295 335871 334475 333104 333469 335422 336916 337444 338215 339080 338625 337164 336180 334930 331046 324485
55751 324485 317380 309988 300402 288519 276774 266522 256976 248076 241149 236248 231860 227553 224005
55738 224005 220430 215209 209165 204957 203001 201255 199170 198390 199179 199594 198807 197966 197203 195054 191504 188397
55722 188397 186105 182943 178617 175070 173051 170927 167868 165250 163922 162915 161866 161952 163419 164803 165541
55707 165541 166846 169155 171278 172852 175009 177715 179065 178191 176409 174632 172121 168618 165234 162314
55693 162314 158875 154991 152275 151119 149915 147857 146003 144731 142805 140092 138611 139626 142027 144787
55679 144787 148688 154271 160283 165507 170212 174532 177335 177934 177242 176219 174818 173225 172318 172112 171585
55664 171585 170669 170477 171000 170803 169721 169554 171195 173331 174952 176914 179916 183069 185647 188203 190886
55649 190886 192773 193997 196401 200724 205063 207410 207874 207194 205021 201056 196154 190967 185011 178213 171700
55634 171700 165960 159899 152884 145990 140109 134511 128530 123032 118993 116151 114194 113651 114494 115393 115567
55619 115567 115811 116619 116892 115676 113614 111540 109157 106188 103272 100627 97429 93652 90819 89714 88990
55604 88990 87353 85522 84623 84244 83586 83099 83388 83719 83129 81970 81024 80129 78932 77946 77689 77756 77766 78172
55586 78172 79152 79875 79814 79647 79982 80515 81324 83473 87287 91475 95141 99232 104855 111545 118438 125640
55570 125640 133005 138882 141696 141768 140310 137685 133962 129974 126334 122333 117166 111446 106356 102135 98473
55555 98473 95423 92864 90043 86773 84100 82779 82112 81299 80775 81088 81559 81312 80654 80280 80078 79878 80340
55538 80340 81925 83917 85543 87140 89128 90887 91831 92598 93979 95550 96496 96966 97520 98071 98313 98346 97973
55521 97973 96401 93545 90569 88180 85561 81941 78026 74754 71885 69027 66848 65966 65667 64983 64102
55506 64102 63567 63183 62820 63139 64186 64500 63033 60896 59778 59606 59236 58543 58241 58359 58310 57949 57444 56733
55488 56733 56044 56040 56555 56271 54709 53322 53453 54466 55160 55676 56535 57125 56845 56603 57446 58721 59284 59501
55470 59501 60254 61019 60835 60287 60499 60908 60065 58121 56505 55588 54616 53662 53643 54458 54871 54386 53789 53779 54315
55451 54315 55191 56101 56336 55511 54318 53589 53127 52492 52160 52593 52959 52268 51190 51150 52117 52857 52957 53040 53330
55432 53330 53476 53531 53719 53583 52695 51789 51829 52502 53069 54052 56356 59218 60854 60924 60605 60419 59760 58515 57432
55413 57432 56701 55738 54526 53768 53508 52965 51906 51013 50742 50903 51410 52327 53202 53397 53073 52927 53138 53437
55395 53437 53861 54392 54341 53289 52221 52426 53656 54654 55073 55512 56069 56345 56621 57519 58629 58907 58315 57793
55377 57793 57765 58002 58617 59765 60607 60068 58547 57430 57090 56754 56163 55817 55705 55329 54956 55346 56230 56518
55359 56518 55989 55403 55007 54423 53936 54338 55460 56290 56640 57207 58022 58387 58391 58910 59962 60602 60574 60535 60510 59711
55339 59711 58169 56971 56542 56168 55488 55045 55024 54920 54764 55224 56140 56373 55517 54491 54072 54186 54862 56425
55321 56425 58359 59423 59327 59002 58850 58210 56939 56018 55987 56166 56065 56244 57056 57765 57609 56772 55725 54646
55303 54646 53946 54289 55630 57214 58855 61047 63498 64891 64628 63628 62831 62121 61262 60708 60783 61044 61080
55286 61080 61086 61191 61132 60992 61241 61711 61581 60752 60125 60073 59812 58787 57679 57427 58164 59537 61163 62462 62981
55267 62981 63208 64121 65684 66843 67081 66848 66373 65435 64496 64529 65366 65732 65348 65336 65986 65859 64009 61598
55249 61598 60221 59919 59846 59760 59811 59903 60151 61078 62598 63713 63889 63674 63468 62903 62076 61991 62931 63760 63815 64123
55229 64123 65620 67420 68114 67666 66801 65535 63701 62079 61625 62112 62697 63250 64069 64868 65097 64841 64498
55212 64498 64050 63401 62885 62708 62471 61876 61262 60875 60479 60231 60859 62204 62766 61768 60613 61102 63082 65122
55194 65122 66630 67889 68709 68569 67792 67231 66942 66299 65275 64580 64632 65232 66071 66807 66847 65827 64187 62713
55176 62713 61799 61629 62531 64456 66586 68166 69347 70630 71938 72878 73405 73591 73257 72502 72057 72428 73133
55159 73133 73404 73101 72419 71379 70222 69641 69874 70211 70108 70019 70427 70878 70959 71383 72909 74788 75492 74684
55141 74684 73350 72263 71349 70434 69682 69235 69101 69267 69483 69229 68433 67798 67973 68832 70027 71527 73053
55124 73053 73768 73347 72721 72860 73411 73382 72614 71682 70865 70132 69686 69677 69776 69790 70139 70948 71372 70827 70209 70777 72304
55103 72304 73525 74019 74461 75261 76174 77119 78332 79677 80753 81640 82709 83702 83839 82870 81368 79993 79058
55086 79058 78669 78740 78958 79144 79418 79681 79430 78514 77537 77013 76710 76371 76360 76894 77382 77310 77124 77378 77708 77484
55066 77484 76835 76146 75283 74259 73858 74520 75395 75663 75961 77165 78588 78941 78427 78187 78188 77492 76396 76359 77686
55047 77686 78996 79278 79023 78923 78872 78654 78436 78157 77517 76856 77023 78084 79134 79607 79769 79798 79452 78902 78767
55028 78767 79032 78985 78525 78472 79129 79588 79013 77736 76560 75767 75393 75736 76942 78568 80016 81037 81557 81473
55010 81473 80918 80303 79875 79610 79595 80062 80903 81649 82053 82321 82759 83555 84804 86316 87537 88127 88427 88883
54992 88883 89343 89539 89862 90852 92136 92761 92428 91553 90343 88781 87383 86914 87297 87746 88045 88757 90068
54975 90068 91378 92237 92867 93589 94432 95404 96373 96742 96108 95261 95505 96886 98094 98335 98232 98552 99060 99180
54957 99180 99033 99196 99905 100903 101694 101773 101043 100064 99381 98671 97237 95293 93953 93866 94628 95647 96767 97835
54939 97835 98485 98647 98708 98937 99284 99771 100459 101095 101444 101904 103037 104630 106121 107775 110343 113592 116436
54922 116436 118735 121767 126528 132704 139746 147810 157028 166827 176575 185992 194280 199778 201349 199509
54908 199509 195469 189675 182046 173108 164041 155765 148506 142118 136411 131321 127047 123857 121646 119903
54894 119903 118156 116169 113880 111576 110018 109789 110573 111577 112500 113463 114332 115003 116138 118579 122112 125873
54878 125873 129868 134850 140726 146557 152404 159627 168776 178506 187217 194418 199790 202272 201220 197377
54864 197377 191645 183866 173926 163169 153379 144957 137256 130226 124541 120356 117085 114265 111831 109637
54850 109637 107478 105456 103746 102156 100450 98801 97395 95961 94318 92949 92324 92064 91483 90708 90439
54835 90439 90851 91550 92439 93800 95433 96493 96440 95606 94621 93710 92814 92081 91868 92239 92689 92556 91795 91117
54817 91117 91169 91781 92352 92711 93015 93019 92281 91184 90910 92075 94115 96228 98191 99867 100782 100781 100477 100397 100221
54798 100221 99452 98353 97573 97235 96968 96516 95838 94960 94244 94386 95631 97288 98555 99504 100729 102364 104004
54781 104004 105324 106300 107006 107721 108980 111029 113354 115217 116575 118068 120149 122555 124653 126265 128208
54766 128208 131918 138120 146005 154224 162574 171858 182014 191470 198847 204280 208207 209744 207432 201275
54752 201275 192997 184377 176087 168078 160286 152805 145870 139823 134785 130434 126400 122802 120106 118576
54738 118576 118044 118046 117992 117505 116858 116767 117490 118433 118948 119174 119776 121185 123423 126352 129742 133409 137592 142960
54720 142960 149905 158040 166575 174874 182540 189356 195307 200210 203171 203024 199592 193933 187096 179308
54706 179308 170711 162080 154162 146971 140398 134913 130983 128287 126265 124931 124337 123668 121892 119187 116840
54691 116840 115623 114936 113687 111489 108905 106899 106123 106389 106738 106221 104678 102808 101670 102018 103671 105424
54675 105424 105984 105110 103445 101354 98767 96241 95104 95894 97447 98236 98025 97611 97608 98219 99572 101396 102746
54658 102746 102921 102351 101916 101715 101244 100464 99907 99893 100312 101030 101959 102846 103498 103952 104086 103476 102175 101116
54640 101116 101083 101703 102090 102079 102077 102100 101865 101572 101758 102437 103087 103407 103446 103129 102340 101386 100805 100758 101057 101572 102140
54619 102140 102353 101990 101487 101427 101802 102249 102693 103222 103675 103877 103930 103780 103005 101666 100801 101244 102390 103028 103051
54600 103051 103376 104425 105656 106510 106935 106964 106565 105945 105407 104973 104668 104857 105684 106555 106922 107215 108131 109381
54582 109381 110129 110362 110736 111241 111231 110815 111025 112318 113914 114985 115685 116628 117956 119222 119729 118937 117024
54565 117024 115065 114158 114415 115296 116620 118451 120174 120718 119820 118342 117206 116668 116646 117023 117465 117526 117089
54548 117089 116370 115617 115235 115835 117554 119699 121694 123844 126380 128468 129326 129767 131236 133664 135786 137239
54532 137239 138622 139621 139067 137199 135910 136049 136234 135278 134051 133810 134143 134048 133851 134429 135261 134884 132989
54515 132989 130716 129027 127895 127061 126497 126004 125174 123982 122912 122417 122588 123345 124581 126170 128047 130128
54499 130128 131994 132963 132803 132058 131395 130914 130443 130165 130459 131278 132115 132596 132831 133183 133840 134573 134982 135018 135175
54480 135175 135906 137043 138125 139112 140290 141652 142925 144096 145244 145940 145677 144915 144829 145756 146729 146883 146562
54463 146562 146597 147234 148263 149597 151137 152526 153517 154239 154760 154841 154446 154011 153822 153592 152981 152097 151144 150130
54445 150130 149210 148739 148567 147883 146259 144304 142807 141804 141065 140908 141752 143172 144133 144021 142948 141318
54429 141318 139615 138401 138011 138390 139493 141479 144105 146376 147453 147625 147762 148050 147880 146877 145377 143933
54413 143933 142914 142548 142792 143052 142579 141383 140448 140808 142572 144895 146721 147504 147428 147104 147057 147392 147941 148602
54395 148602 149537 151019 153039 154994 155945 155492 154289 153406 153236 153322 153150 152666 151977 151067 149966 148761 147287
54378 147287 145256 142945 141322 141169 142297 143855 145157 146031 146684 147452 148491 149534 150173 150457 150861 151570
54362 151570 152147 152180 151923 152005 152671 153555 154140 154264 154207 154284 154390 154157 153622 153320 153410 153149 151852 150059 148972
54343 148972 148873 148938 148587 148141 147971 147820 147372 146856 146741 147255 148437 150145 151865 152965 153265 152938 151925 150124
54325 150124 148091 146676 145848 144724 142977 141350 140507 140256 140181 140179 140024 139376 138640 138809 139912 140597 139924 138535
54307 138535 137359 136193 134626 133373 133331 133907 133688 132550 131882 132712 134648 136742 138478 139682 140186 139916
54291 139916 138941 137361 135419 133664 132621 132288 132169 131760 130942 130150 130148 131222 132611 133324 133537 134329 135838
54274 135838 136819 136557 136102 136662 137743 138026 137436 137053 137346 137764 137938 138240 139097 140568 142530 144551 145804
54257 145804 145918 145736 146304 147333 147592 146752 145817 145613 145836 145836 145514 145132 144852 144740 144746 144519 143709 142491 141284
54238 141284 140046 138458 136804 135888 135889 136019 135662 135232 135495 136346 136704 135549 132911 129919 127845 127009 126777
54221 126777 126722 127337 129227 131970 134426 135930 136605 136736 136544 136465 136870 137448 137514 137019 136617 136644 136734 136603 136581
54202 136581 137072 138067 139452 141290 143390 145006 145392 144513 142963 141365 140045 139019 138036 136693 134761
54187 134761 132386 129943 127741 125909 124531 123827 124068 125153 126400 127086 127225 127452 128055 128613 128780 128823 128986
54170 128986 128874 128029 126721 125530 124443 123089 121656 120842 120912 121435 122010 122639 123279 123517 122967 121749 120444
54153 120444 119692 119735 120192 120429 120396 120832 122369 124662 126732 127916 128139 127642 126948 126836 127734 129167 130215
54136 130215 130439 130080 129617 129518 130076 130962 131239 130387 129144 128782 129740 131503 133544 135680 137640 138994 139587
54119 139587 139556 138972 137872 136572 135495 134821 134633 135146 136347 137723 138838 139810 140675 140805 139712 137988
54103 137988 136620 135701 134758 133998 134077 134795 135206 135124 135394 136415 137437 137645 137092 136213 135227 134376 133971 133806
54085 133806 133172 131829 130447 129799 130032 130937 132325 133913 135384 136820 138581 140588 142196 142888 142583 141301
54069 141301 139222 137094 135803 135412 135382 135748 137077 139021 140107 139559 138413 138105 138753 139605 140496 141828
54053 141828 143505 144834 145444 145621 145719 145862 146321 147710 150519 154545 158941 162940 166638 170941 176564 183333
54037 183333 190734 198834 207904 217237 225020 229582 230292 227269 221053 212874 204491 197188 191201 186253
54023 186253 182129 178520 174940 171254 167887 165189 162987 160979 159122 157336 155309 152995 150958 149810
54009 149810 149529 149559 149363 148721 147766 146862 146196 145532 144702 144224 144806 146182 147158 147039 146343 145871 145676 145339 144720
53990 144720 144035 143586 143708 144589 145886 146959 147643 148352 149304 150184 150707 150839 150321 148757 146506 144715 143999
53973 143999 143755 143257 142735 142812 143564 144757 146423 148451 150106 150749 150725 150884 151443 151946 152129 152221 152498 153022
53955 153022 153747 154559 155380 156450 158134 160204 161756 162289 162452 163230 164771 166503 168076 169609 171299 173406
53939 173406 176452 180841 186272 191916 197149 201809 205925 209522 212625 215162 216921 217759 217650 216492 214214
53924 214214 211303 208770 207280 206585 206061 205453 204917 204755 205318 206657 208045 208471 208042 208210 210062 212944
53908 212944 215397 216868 217750 218196 217835 216503 214426 211709 208296 204391 200381 196395 192454 188933 186339
53893 186339 184699 183734 183558 184601 186839 189692 192856 196811 202333 209840 219496 231698 247020 265196
53879 265196 283852 298511 304742 301018 289536 274205 258109 242801 229034 217238 207410 199200
53867 199200 192285 186506 181830 178370 176192 174916 173843 172633 171418 170066 168000 165181 162625 161309
53853 161309 161061 161140 161356 161856 162233 161853 160912 160252 160133 159931 159124 157911 156829 156307 156631 157742 159058 159953
53835 159953 160415 160750 160797 160104 158862 157968 158035 158888 160153 161704 163324 164467 164764 164450 164045 163833 163792 163822
53817 163822 163930 164328 165349 167016 168762 169872 170150 169946 169657 169532 169801 170533 171405 172077 172744 173816 175050
53800 175050 175602 175191 174642 174872 175729 176347 176481 176904 178338 180445 182257 183409 184453 185893 187398 188268
53784 188268 188278 187608 186302 184456 182761 182028 182156 182317 182239 182451 183062 183239 182405 181034 179686 178144 176327
53767 176327 175215 175720 177126 177831 177380 176715 176478 176204 175344 174145 173193 172710 172615 172758 172905 172886 172909 173429 174674
53748 174674 176535 178750 180875 182349 183109 183898 185380 187175 188446 189222 190330 192041 193654 194536 194796
53733 194796 194701 194225 193599 193681 195163 197678 200184 202113 203846 206082 208940 211803 214056 215827 217768 220166
53717 220166 222723 225320 228367 231970 235343 237688 239251 240844 242676 244421 246141 248309 251027 254010
53703 254010 257224 260787 264390 267672 271115 275642 281266 287038 292374 297467 302189 305653 307358 307934
53689 307934 308277 308647 309074 309857 311003 311809 311673 310923 310252 309772 309209 308624 308236 307823 306951 305721 304687 304085
53671 304085 303652 303218 302957 302921 302754 302133 301226 300461 299870 298951 297278 295118 293274 292257 291789 291155 289920
53654 289920 288214 286525 285360 284927 284985 285120 285288 285839 286920 288219 289541 291204 293404 295541 296734 296790
53638 296790 296218 295517 295003 295123 296227 297990 299578 300482 300863 301232 302240 304572 308434 313154 317792 322035
53622 322035 326059 329804 333139 336513 340547 344940 348669 351483 354369 358274 363135 368528 374457 380933
53608 380933 387318 392776 397181 401148 405337 409960 414756 419177 422737 425359 427339 429008 430586 432200
53594 432200 433746 434843 435285 435371 435376 434992 433803 432105 430568 429288 427922 426674 426257 426783 427572 428195 428898
53577 428898 429738 430137 429639 428397 426593 424052 420818 417464 414436 411631 408918 406430 404059 401388 398522
53562 398522 396292 395164 394534 393618 392486 391709 391547 392013 393255 395266 397590 399878 402385 405409 408561
53547 408561 411045 412502 413258 414048 415749 418947 423438 428494 433860 439978 447038 454482 461956 470045 479411
53532 479411 489753 500368 511352 523463 536991 551460 566352 581536 597069 613090 629916
53521 629916 647851 666917 687068 708577 731994 757783 786032 816146 846818 876847 906285
53510 906285 936264 967417 999123 1030709 1062594 1095425 1128737 1161474 1193595 1226157 1259819
53499 1259819 1294074 1328041 1361268 1393540 1424581 1454290 1482876 1510485 1536854 1561477 1583983
53488 1583983 1604427 1623474 1642289 1662005 1683185 1705801 1729540 1753928 1778307 1801937 1824123
53477 1824123 1844221 1861764 1876733 1889457 1900098 1908368 1913767 1915656 1913043 1904970 1891590 1874541
53465 1874541 1855824 1836549 1817027 1797511 1778175 1758587 1737750 1714675 1688667 1659440 1627525
53454 1627525 1594433 1561926 1531016 1501768 1473675 1445854 1417279 1387508 1357165 1327315 1298544
53443 1298544 1271100 1245700 1223484 1205014 1189759 1176731 1165375 1155768 1148247 1142939 1139624 1138086
53431 1138086 1138630 1141902 1148041 1156366 1166236 1177824 1191616 1207396 1224382 1242281 1261670 1283208
53419 1283208 1306893 1332135 1358267 1384940 1412383 1441442 1473156 1508133 1546279 1587026 1629736
53408 1629736 1674116 1720425 1769215 1820813 1875220 1932578 1993334 2057647 2124890 2194053 2264492
53397 2264492 2336135 2409248 2484276 2561575 2640822 2720816 2800243 2878494 2955445 3030604 3102962
53386 3102962 3171706 3236773 3298631 3357729 3414253 3468243 3519807 3569059 3615786 3659348 3699247
53375 3699247 3735736 3769378 3799742 3824697 3841027 3845577 3836037 3811446 3772475 3721060 3659580 3590456
53363 3590456 3516200 3439098 3360550 3281156 3201424 3121827 3042255 2962422 2883110 2806088 2732317
53352 2732317 2661002 2590915 2521691 2453143 2384318 2314344 2243695 2173635 2104876 2037762 1973324
53341 1973324 1912976 1857206 1805519 1757609 1713768 1674234 1638986 1608228 1582200 1560317 1541074
53330 1541074 1522982 1505192 1487277 1468998 1450359 1431518 1412726 1394634 1378330 1364467 1352553
53319 1352553 1341612 1331358 1322201 1314490 1308466 1304643 1303338 1303918 1305300 1307151 1309934 1313978 1319433 1327004
53305 1327004 1337652 1351370 1367141 1384387 1403595 1425230 1448867 1473923 1500566 1529370 1560566
53294 1560566 1594144 1630289 1669059 1709692 1750631 1790333 1827982 1863507 1897038 1928522 1958066
53283 1958066 1986563 2015295 2044390 2071975 2095413 2113237 2125565 2133105 2136552 2136672 2134046 2128449
53271 2128449 2118971 2104802 2085488 2060710 2030546 1995968 1958349 1918383 1876068 1831704 1786238
53260 1786238 1740477 1694634 1648796 1603316 1558669 1515480 1474692 1436981 1401831 1367769 1333688
53249 1333688 1299342 1264531 1228587 1190978 1151853 1111725 1071246 1031460 993583 958083 924480
53238 924480 892385 862215 834614 809768 787739 768929 753623 741301 730834 721135 711399 700982
53226 700982 689546 677175 664107 650390 635955 620838 605174 589102 572782 556430 540314
53215 540314 524817 510330 496886 484087 471726 460282 450371 441836 433842 425809 417744 409714 401555
53202 401555 393120 384354 375056 365039 354538 344049 333896 324435 316485 310746 306731 303001 298659
53189 298659 294064 290013 286913 284882 283879 283424 282786 281764 280721 279635 277806 274901 271714 269352 268000
53174 268000 266878 265187 262814 260319 258435 257407 256835 256316 256073 256477 257132 257112 256084 254571 253109 251837
53158 251837 250992 250945 251492 251799 251291 250038 248183 245829 243670 242733 243028 243241 242366 240929 240075 240119 240630 241332
53140 241332 242125 242647 242590 242259 242236 242606 242933 242863 242411 241768 241139 240652 240326 240240 240664 241710 242962 243989 245092
53121 245092 246887 249186 251130 252449 253635 254689 254774 253571 251936 250661 249511 248159 247077 246603 245980
53106 245980 244354 242088 240068 238216 235855 233176 231206 230354 229935 229250 228375 227825 228050 229241 231072 232623
53090 232623 233060 232456 231651 231463 232305 234183 236513 238223 238646 238232 237881 237807 237571 237043 236671 236824 237392 238062
53072 238062 238585 238751 238395 237437 235800 233561 231316 229965 229776 230071 230245 230565 231438 232373 232509 231934 231670
53055 231670 232298 233281 233769 233606 233347 233618 234507 235381 235343 234032 231898 229669 227811 226540 225810 225001 223218
53038 223218 220405 217757 216534 216781 217643 218460 219020 219134 218649 217694 216470 215022 213603 212750 212552 212370 211902
53021 211902 211947 213262 215224 216541 216922 217031 217133 216928 216640 217058 218293 219510 220169 220633 221273 221812 221976
53004 221976 222065 222410 222746 222540 221627 220244 218740 217470 216687 216406 216558 217192 218256 219403 220423 221649 223350
52987 223350 224974 225694 225590 225520 225894 226470 227377 229262 232054 234543 235770 236174 236781 237866 239049 240184
52971 240184 241460 242872 244250 245707 247549 249822 252320 254962 257781 260518 262542 263246 262427 260354 257624
52956 257624 254885 252494 250428 248532 246793 245305 244075 242934 241621 239941 237924 235885 234268 233373
52942 233373 233220 233556 234030 234448 234951 235741 236657 237233 237253 236930 236459 235788 235104 234981 235617 236249 235938 234719 233415
52923 233415 232459 231497 230171 228686 227445 226547 225791 224933 223869 222764 221931 221358 220535 219131 217646 216945
52907 216945 217188 217682 217715 217083 215864 214209 212454 211094 210505 210856 212115 213796 214993 215220 215106 215679 217028
52890 217028 218283 218875 219160 219694 220623 221905 223503 224953 225351 224198 222020 219839 218316 217570 217415 217497
52874 217497 217470 217368 217640 218635 220226 222054 223934 225923 228189 230878 233900 236821 239188 240917 242098
52859 242098 242530 241844 240122 237955 235778 233513 230917 227959 224832 221974 220038 219322 219183 218513 216981
52844 216981 215339 214305 213622 212488 210550 208147 205926 204407 203687 203395 203159 203167 203824 204829 205158 204281 202858
52827 202858 201858 201398 200906 200068 199140 198523 198474 199086 200126 200971 201035 200267 199024 197642 196438 195946 196685 198619
52809 198619 201180 203849 206451 208804 210417 210832 210158 209057 208125 207393 206415 204821 202677 200390 198333
52794 198333 196627 195195 193950 192937 192246 191776 191228 190494 189999 190435 192067 194514 197142 199452 201100 201926
52778 201926 202131 202086 201846 201190 200236 199538 199355 199317 199176 199332 200122 201016 201192 200618 199977 199746 199880 200173 200343
52759 200343 199946 198859 197714 197230 197247 197066 196637 196638 197347 198245 198881 199464 200337 201420 202492 203588 204845 206272
52741 206272 207900 209874 212263 214950 217690 220090 221727 222669 223703 225571 228057 230275 231704 232431 232594
52726 232594 232183 231401 230569 229704 228660 227612 226805 225989 224779 223418 222436 221710 220738 219729 219399 219635 219458
52709 219458 218562 217785 217712 217894 217971 218527 220045 221882 223111 223725 224204 224450 224028 223138 222528 222563 222960 223329 223489
52690 223489 223428 223361 223692 224569 225666 226567 227111 227188 226611 225432 224013 222581 221076 219627 218636 218126 217607 216894
52672 216894 216529 216971 217940 219005 220210 221585 222584 222710 222319 222174 222537 223302 224721 227241 230691 234223
52656 234223 237156 239476 241514 243374 244643 244542 242580 239190 235441 232041 228999 226386 224776 224531 225198
52641 225198 226044 226832 227626 228288 228660 228889 229123 229254 229367 230011 231487 233203 234299 234655 234818 235201 235825 236565
52623 236565 237161 237204 236536 235448 234208 232770 231291 230414 230486 230882 230637 229435 227574 225461 223720 223270 224524
52606 224524 226789 229056 231000 232558 233131 232286 230956 230781 232226 234224 235770 236889 237933 238878 239719
52591 239719 240774 242114 243267 243846 244010 243972 243589 242897 242572 243202 244295 244591 243496 241829 240955 241363 242318
52574 242318 242813 242579 241986 241296 240380 239148 237812 236648 235800 235409 235556 235988 236273 236317 236305 236102 235335 234267
52556 234267 233877 234654 235873 236504 236308 235617 234670 233763 233448 233870 234339 234292 234194 234704 235422 235422 234711 234177 234213 234433
52536 234433 234765 235797 237704 239646 240577 240156 238652 236538 234412 232853 232017 231589 231208 230690 229917 228919
52520 228919 228009 227470 227174 226894 226833 227326 228144 228687 228906 229494 231114 233854 237393 241171 244394 246421 247256
52503 247256 247326 246826 245792 244631 243957 243775 243400 242312 240636 238738 236873 235306 234262 233614 233069 232712
52487 232712 232923 233728 234752 235877 237368 239248 241143 242949 245006 247325 249181 249975 250146 250750 252255
52472 252255 254072 255241 255427 255233 255587 256757 258116 259001 259557 260409 261685 262910 263775 264497 265298 265979 266180
52455 266180 265708 264525 262775 260882 259257 257806 256086 254056 252341 251568 251675 252012 251951 251367 250650 250277
52439 250277 250243 250051 249383 248568 248132 248158 248418 248885 249693 250796 252123 253853 256022 258035 259172 259491 259684
52422 259684 260112 260563 260872 261148 261440 261847 263027 265893 270652 276734 283830 292330 302434 313276 323274
52407 323274 330984 335480 336321 333590 327862 320115 311691 304039 297962 293201 289160 285876 283725 282408
52393 282408 281073 279498 278374 278167 278459 278737 279199 280349 282241 284575 287177 290026 293006 295883 298409
52378 298409 300384 301880 303490 305998 309686 314152 318835 323533 328474 334139 340822 348029 354498 359230
52364 359230 362374 364782 367079 369625 372865 376859 380775 383782 386320 389629 394170 399490 405421 412261
52350 412261 419745 427153 434723 443764 454900 467324 480236 493973 509108 525450 542617 560684
52338 560684 579574 598700 618024 638666 661515 685875 710326 734359 758317 782251 805842
52327 805842 829138 852460 875720 898471 920443 941441 960927 978292 993280 1005689 1014992 1020971
52315 1020971 1024434 1026631 1027968 1027780 1025334 1020640 1014401 1007489 1000369 992829 984512 975814 967819 961111
52301 961111 955207 949531 944372 940433 937947 936736 936647 937383 938463 939946 942752 947614 954170 961713 970353
52286 970353 980697 992818 1006370 1021408 1038218 1056488 1075315 1093909 1111689 1128036 1142770
52275 1142770 1156659 1170584 1184267 1196519 1206547 1214183 1218923 1219815 1216605 1210275 1202142 1192929 1182845
52262 1182845 1171926 1159995 1146719 1132045 1116444 1100678 1085526 1071560 1058759 1046454 1034110
52251 1034110 1022093 1011210 1001611 992674 983909 975405 967359 959735 952498 945761 939599 934182 930095
52238 930095 928013 927906 928944 930279 931531 932562 933307 934008 935191 937210 940087 943788 948261 953200 958241
52223 958241 963452 969164 975260 981185 986810 992678 999056 1005381 1011126 1016807 1023468 1031349 1039660 1047633
52209 1047633 1055155 1062144 1067913 1071736 1073924 1075735 1078014 1080284 1081524 1081631 1081688 1082846 1085297 1088335 1091011
52194 1091011 1092675 1093340 1093706 1094461 1095522 1096356 1097065 1098439 1100576 1102187 1101820 1099333 1095548 1090960 1085485
52179 1085485 1079152 1072270 1065099 1058067 1052102 1047987 1045472 1043714 1042476 1042086 1042341 1042506 1042568 1043472 1045628
52164 1045628 1048129 1050171 1052573 1056980 1063903 1072297 1080941 1089380 1097479 1104856 1111261 1117151 1123394 1130427
52150 1130427 1138014 1145912 1154512 1164666 1176923 1191040 1206229 1221827 1237771 1254480 1272228 1290600
52138 1290600 1308694 1326004 1342880 1359938 1377253 1394563 1412068 1430385 1449641 1469194 1488451
52127 1488451 1507424 1526283 1544918 1563282 1581526 1599348 1615727 1629853 1641860 1652036 1659751
52116 1659751 1663902 1664172 1661153 1655371 1646970 1636289 1624026 1610675 1596225 1580553 1563739 1546087
52104 1546087 1528270 1511415 1496617 1484390 1474857 1468223 1464561 1463393 1464175 1467098 1472694 1480625 1489572
52091 1489572 1498458 1507220 1516238 1525642 1535485 1546027 1557576 1570396 1584872 1601293 1619244 1637738
52079 1637738 1656229 1675013 1694273 1713133 1730148 1744567 1756721 1767261 1776282 1783186 1787203 1788025
52067 1788025 1785883 1781017 1773240 1762299 1748468 1732305 1713795 1692281 1667512 1640446 1612735 1585576
52055 1585576 1559202 1533163 1506803 1479628 1451596 1423253 1395498 1369093 1344267 1320664 1297752
52044 1297752 1275308 1253620 1233265 1214866 1198959 1185758 1174954 1166072 1159154 1154720 1152806 1152501
52032 1152501 1152787 1153415 1154479 1155512 1155665 1154546 1152259 1148786 1143945 1137896 1130993 1123145 1113935 1103388
52018 1103388 1092048 1080268 1068057 1055650 1043468 1031239 1017861 1002537 985623 968018 950162
52007 950162 932018 913722 895768 878608 862270 846304 829972 812677 794382 775665 757465
51996 757465 740860 726776 715468 706318 698422 691246 684489 677651 670409 663289 657244 652425 647909
51983 647909 642703 636487 629306 621161 612147 602499 592248 581241 569730 558505 548239 539006 530601
51970 530601 523046 516713 512318 510742 512334 516287 521204 526395 532141 538611 545181 551027 555829 559553
51956 559553 562012 562931 562077 559200 554357 548449 542799 537959 533474 529120 525677 524133 524725 527288 531915
51941 531915 538712 547374 557649 569794 583904 599056 613675 626540 636928 644103 647389 646708 642565
51928 642565 635494 625828 613832 599696 583614 566291 549070 533058 518263 504056 490359 477818
51916 477818 466885 457313 448605 440548 433188 426742 421677 418583 417725 418835 421418 425172 430125 436516
51902 436516 444544 454124 464951 476787 489518 502759 515687 527498 537919 547147 555584 563965
51890 563965 573372 584416 596182 606281 612135 612210 606316 595342 580941 565176 550032 537120 527644
51877 527644 522286 520886 522463 525851 530345 535576 540857 545104 547589 548450 547991 545652 540260 531448 520302
51862 520302 508346 496325 484386 472970 462884 454692 448611 444849 443404 443619 444547 445764 447211
51849 447211 448305 448049 446238 443740 441208 438258 434419 430214 426549 423440 420141 416413 412970 410659
51835 410659 409707 409892 410977 412748 414865 416895 418489 419494 419929 419887 419396 418325 416356 413190 408993 404720
51819 404720 401557 399770 398406 396572 394707 394049 395134 397493 400674 404698 409381 414021 418041 421226
51805 421226 423068 422710 419996 415969 411779 407610 403152 398542 394269 390560 387437 385007 383102 380979
51791 380979 378062 374772 372138 370675 370132 370106 370377 370696 370758 370477 370033 369665 369512 369465 369056 367870 366304 365568
51773 365568 366556 369069 372380 376203 380701 386082 392709 401226 411870 423728 435186 444992 452507 457198
51759 457198 458520 456374 451299 444212 436137 427908 419768 411447 402970 395065 388431 382926 377973 373473
51745 373473 369726 366792 364649 363884 365477 369851 376692 385668 396647 408960 421045 431249 438892
51732 438892 444420 448718 452401 455667 458823 462693 468010 474113 478681 479292 475197 467365 457307 446460
51718 446460 436330 428235 422541 418512 415053 411334 406849 401448 395542 390000 385735 383388 383277 385382
51704 385382 389453 395219 402216 409228 414435 416664 416316 414693 412833 411495 411722 414335 418852 423635 427155
51689 427155 428591 427410 423393 417269 410499 404012 397680 391311 385557 381434 379386 379136 380128 381902 384409
51674 384409 388171 393753 400911 408693 416549 424816 433851 443237 452261 460538 467502 471708 471609 467217 460475
51659 460475 453894 449263 447572 449200 453278 457178 457672 453243 445187 436322 428792 423113 418728 414832
51645 414832 410814 406520 402279 398305 394085 388834 382580 376257 370547 365252 360075 355385 351767 349338
51631 349338 348020 347924 348843 349785 349844 349306 349187 349812 350594 351170 351981 353534 355625 357457 358166 357212 354702 351423
51613 351423 348303 345826 344150 343449 343638 343992 343720 343002 342893 344197 346913 350815 356069 363121 372324 383511
51597 383511 395401 405478 411256 412076 409437 405535 401864 399070 397273 396122 395008 393693 392613 392418
51583 392418 393506 396005 399865 404881 411052 419046 429836 443564 459050 474607 489194 502819 516379
51570 516379 531340 549041 569584 591301 611585 628639 642766 656308 672315 692998 719284
51559 719284 751578 790368 835487 884760 933726 976902 1009639 1029490 1036546 1032498 1019057 997188
51547 997188 967754 932161 891912 848107 802155 756491 713572 674233 637873 604204 573872
51536 573872 547343 524205 503851 486084 470749 457507 446301 437409 430660 425214 420378 416088
51524 416088 412282 408482 404385 400309 396635 393305 390214 387542 385283 382926 380067 377000 374316 372277
51510 372277 370885 370113 369692 369030 367721 365870 363712 361383 359322 358376 358981 360663 362754 365236 368338
51495 368338 371626 374194 375732 377008 379181 382850 387668 392660 396940 400213 402536 403710 403213 400744
51481 400744 396498 390924 384572 378178 372357 366998 361463 355590 350063 345589 342136 339166 336160 332735
51467 332735 328815 324975 322118 320525 319615 318914 318667 319187 320196 321346 322892 325222 327985 330203 331142
51452 331142 330814 329854 329181 329527 331076 333804 338160 344879 354043 365020 377455 391407 405999 418859
51438 418859 427796 432553 434321 434274 433477 433457 435320 438190 439578 437588 432242 424775 416582 408979 402973
51423 402973 398563 394686 390275 385264 380369 376201 372838 370075 367795 366068 364917 364076 363114 361857 360515
51408 360515 359314 358225 357227 356575 356573 357260 358515 360284 362488 365008 367899 371430 375655 380245 384982 390261
51392 390261 396840 405305 415908 428672 443485 460366 479764 502268 527960 556624 588685 625311
51380 625311 667230 714184 765768 821825 881072 940028 994357 1041119 1079074 1107443 1125476
51369 1125476 1132986 1130129 1116578 1091860 1056699 1013156 963304 908584 850729 792360 736005 683027
51357 683027 633984 589626 550910 518139 490594 467180 447317 431086 418494 408706 400309 392422
51345 392422 385254 379366 374736 370907 367727 365357 363625 361907 359632 356607 352936 349057 345727 343547
51331 343547 342421 341823 341454 341296 341143 340586 339477 338065 336610 335120 333389 331122 328221 325174 322785
51316 322785 321118 319176 316269 313249 311577 311394 311501 311168 310897 311178 311570 311611 311840 313168 315663 318600
51300 318600 321364 323738 325515 326448 326543 326031 325050 323752 322721 322851 324553 327314 330313 333449 337492 343075
51284 343075 349770 356393 362035 366399 369262 370236 369291 367033 364164 361084 358257 356293 355141 353753 351301
51269 351301 348452 346693 346599 347482 348603 349870 351288 352463 352866 352138 350093 346971 343706 341314 339876
51254 339876 338656 337259 336062 335373 334798 333769 332220 330503 329094 328539 329192 330691 332124 333023 333808 334974
51238 334974 336188 336548 335577 333697 331867 330868 330787 331155 331652 332536 334130 336181 338195 340239 342690 345226
51222 345226 346864 347221 347085 347362 348017 348427 348265 347657 346818 345947 345263 344839 344622 344753 345508 346753 347875 348488
51204 348488 348837 349218 349459 349361 349324 350048 351670 353504 354548 354214 352779 351209 350296 349942 349651 349652 350859 353505
51186 353505 356524 358725 360059 361239 362538 363578 363926 363313 361504 358634 355574 353356 352127 351067 349398
51171 349398 347134 344828 342945 341628 340892 340890 341962 344293 347514 350862 353859 356558 358954 360509 360668
51156 360668 359606 358107 356802 355892 355477 355743 356713 358101 359489 360556 361184 361467 361506 361089 359775 357494
51140 357494 354892 352769 351323 350233 349332 348833 348931 349565 350627 352107 354004 356312 359157 362635 366434
51125 366434 369831 372258 373743 374726 375567 376302 376786 376889 376653 376307 376187 376565 377565 379188 381329 383692
51109 383692 385823 387444 388834 390726 393612 397211 400806 404021 406936 409430 410973 411446 411770 413157 415851
51094 415851 419121 422382 425704 429145 432260 434599 436230 437372 437861 437399 436045 434102 431718 429064 426722
51079 426722 425377 424957 424495 423055 420694 418365 416966 416616 416815 417187 417909 419453 422166 426274 432118 440003
51063 440003 449828 461251 474235 488893 504427 518580 528829 534300 536467 538137 542039 550066 562892
51050 562892 579538 597468 613905 627655 639573 650938 661348 668572 670554 667299 660662 652771
51038 652771 645045 638266 632495 626510 617915 604636 586499 565302 543527 523166 505467 491086
51026 491086 480037 471632 464978 459773 456536 455810 457243 459724 462436 465472 469350 474331 480461 487801
51012 487801 496121 504588 512393 519680 527395 536135 545568 555066 564527 574412 585312 597668 611685
50999 611685 627331 644486 663113 683116 704031 725018 745109 763341 778936 791749 802608
50988 802608 812818 823282 834159 845068 855174 863226 868204 870128 869954 868776 867686 868257 872364
50975 872364 881103 894352 911723 933572 960856 994348 1034231 1080084 1131015 1186126 1245244 1308992
50963 1308992 1377972 1452029 1530313 1611684 1694895 1778693 1861796 1942470 2018164 2086221 2145262
50952 2145262 2195511 2237686 2272077 2298870 2318696 2332404 2340743 2344583 2344822 2341407 2332852 2317479
50940 2317479 2295234 2268092 2238992 2210625 2184746 2161773 2140810 2120256 2098493 2074160 2046345
50929 2046345 2014885 1980128 1942020 1899738 1852568 1800826 1745473 1687206 1626506 1564417 1502590
50918 1502590 1442483 1384931 1330494 1279803 1233363 1191267 1153233 1118856 1087869 1060255 1035997
50907 1035997 1014697 995619 978244 962653 949226 938147 929147 921471 914077 906307 898490 891499
50895 891499 885583 880146 874783 869897 865953 862767 860043 858101 857462 858128 859840 862656 866586 870996 875112
50880 875112 879014 883519 889209 896157 904434 914204 925274 937197 949908 963846 979322 996147 1013947
50867 1013947 1032583 1052342 1073987 1098480 1126282 1157122 1190804 1228095 1270370 1318639 1373366
50856 1373366 1435021 1504253 1581649 1667932 1764231 1871474 1989581 2117868 2256191 2404867
50846 2404867 2563376 2729950 2902830 3081205 3264404 3450497 3635977 3816255 3985986
50837 3985986 4139433 4271414 4378414 4458897 4512793 4540892 4544592 4526014 4488289 4435596 4372674
50826 4372674 4304194 4234652 4168574 4110172 4062442 4026646 4002612 3989041 3983195 3980582 3975495 3962299
50814 3962299 3936592 3895744 3838823 3766003 3677783 3574563 3456937 3326416 3185844 3039042
50804 3039042 2889996 2742299 2599234 2463986 2339376 2227284 2128558 2043527 1972359 1914881
50794 1914881 1870408 1838006 1816784 1805814 1803954 1809878 1822067 1838674 1857641 1877089 1895388 1910931
50782 1910931 1922424 1929600 1933141 1933537 1930383 1923104 1911847 1897164 1879266 1858137 1834050 1807339
50770 1807339 1777817 1744981 1708651 1668995 1626213 1580723 1533436 1485328 1436945 1388969 1343040
50759 1343040 1301293 1264954 1233867 1207210 1184173 1164102 1146839 1133035 1123546 1118380 1116628 1117409
50747 1117409 1120428 1125805 1134061 1146252 1163375 1185407 1211526 1241376 1275571 1314954 1360121 1411911
50735 1411911 1471547 1539725 1615937 1699032 1788040 1882200 1980606 2082198 2185815 2290043 2393329
50724 2393329 2494497 2592799 2687133 2775414 2854786 2922111 2974121 3007659 3020456 3012002 2983912
50713 2983912 2939770 2884494 2823201 2760174 2698863 2642558 2594387 2556308 2528490 2509959 2499657
50702 2499657 2496729 2500040 2507575 2516184 2521885 2520725 2509549 2486100 2448991 2398319 2336215 2266033
50690 2266033 2190770 2112678 2034279 1958816 1889262 1827454 1774514 1731468 1698951 1676903 1665296
50679 1665296 1664967 1677124 1702121 1739154 1787114 1845336 1913487 1990857 2075658 2164797 2254412 2340881
50667 2340881 2421433 2494005 2556978 2609344 2650999 2682727 2706017 2722879 2735360 2744756 2751143 2753720
50655 2753720 2751563 2744119 2731200 2712672 2688387 2658747 2625509 2591603 2559671 2530967 2505954 2485531
50643 2485531 2470977 2462973 2461605 2467281 2480678 2501458 2527800 2557515 2589001 2620948 2652016 2681458
50631 2681458 2709689 2737885 2767170 2797520 2825668 2843310 2839172 2805428 2743149 2661508 2572098
50620 2572098 2484155 2403534 2333581 2275822 2230581 2197775 2177134 2167705 2167664 2174889 2187483 2203773
50608 2203773 2222159 2240989 2258258 2271401 2277767 2275359 2262817 2238860 2202379 2153461 2093990 2026959
50596 2026959 1955243 1881003 1805849 1731267 1658895 1590449 1527222 1469576 1417120 1369467 1326736
50585 1326736 1289281 1257215 1230392 1208582 1191333 1177766 1166882 1158206 1151794 1147485 1144500 1142024
50573 1142024 1139939 1138548 1137823 1137538 1138175 1141025 1147140 1156659 1169399 1185494 1205028 1227707 1253615
50560 1253615 1283910 1319990 1362225 1410250 1464257 1524991 1592337 1664690 1739850 1815787 1890334
50549 1890334 1960989 2025721 2083689 2134986 2180143 2220200 2256885 2292346 2328780 2368164 2411769
50538 2411769 2459722 2511321 2565844 2622759 2681447 2741490 2803347 2868127 2936751 3010047 3089519
50527 3089519 3176803 3271940 3373082 3478297 3586674 3697093 3806934 3912877 4012187 4102320
50517 4102320 4179925 4241409 4284342 4307500 4309817 4290103 4247754 4183174 4097748 3993998 3875621
50506 3875621 3746778 3611429 3473649 3338199 3210143 3093973 2993258 2910608 2847466 2804330
50496 2804330 2781667 2780078 2798980 2835613 2885954 2945953 3011089 3075300 3131511 3173167 3194727
50485 3194727 3191575 3161060 3103905 3023636 2924600 2811172 2688368 2561410 2434053 2308136
50475 2308136 2185070 2066823 1955116 1850633 1753608 1664416 1583042 1508600 1440084 1377243
50465 1377243 1320304 1269274 1223968 1184321 1150141 1120777 1095480 1073953 1056225 1042081 1030825
50454 1030825 1021534 1013434 1006283 1000470 996534 994578 994350 995869 999522 1005422 1012970 1021174 1029176 1036501
50440 1036501 1043250 1050175 1058227 1067865 1079050 1091823 1106385 1122623 1140111 1158875 1179674 1203221
50428 1203221 1229463 1257860 1288016 1319681 1352449 1385877 1419845 1454653 1490836 1529028 1569774
50417 1569774 1613389 1660169 1710683 1765599 1825088 1888742 1956079 2026682 2099596 2172981 2244732
50406 2244732 2313259 2377481 2436387 2488952 2534278 2571523 2599838 2618639 2627724 2626729 2614505 2589367
50394 2589367 2550100 2496697 2430372 2353291 2268396 2179191 2089369 2002445 1921523 1849002 1786185
50383 1786185 1733203 1689671 1655689 1632120 1619688 1617931 1625294 1640169 1661332 1687203 1715174 1742047
50371 1742047 1764787 1780507 1786279 1779846 1760676 1729867 1689107 1640280 1585995 1529549 1473677 1419477
50359 1419477 1366710 1314871 1263835 1213930 1165861 1120475 1078356 1039716 1004700 973514 946085
50348 946085 921908 900524 881959 866419 853718 843310 834790 828098 823274 820307 819159 819600 820948
50335 820948 822284 823095 823519 823783 823726 823218 822862 823699 826068 829299 832905 837644 844846 854858 866880 880318
50319 880318 895598 913281 932797 952312 969515 982413 990100 993438 994780 996509 999820 1005042 1012576
50306 1012576 1022805 1035228 1048389 1060881 1072183 1082569 1092644 1103066 1114353 1126629 1139509
50295 1139509 1152210 1163805 1173595 1181271 1186624 1189187 1188668 1185798 1182166 1179006 1176679 1175598 1176990 1182412
50281 1182412 1193520 1212653 1241729 1278126 1311950 1330027 1324385 1296916 1256150 1210927 1167229
50270 1167229 1128608 1096892 1072112 1053010 1038373 1027761 1021119 1018236 1018731 1022304 1028803 1038062 1049572
50257 1049572 1062306 1075040 1086970 1097988 1108403 1118610 1128899 1139264 1149257 1158357 1166522 1174238
50245 1174238 1181991 1190005 1198407 1207378 1217232 1228770 1243517 1263121 1288485 1319976 1358503 1405768
50233 1405768 1463201 1531149 1609366 1697770 1796152 1903112 2015302 2127463 2233429 2328013
50223 2328013 2408727 2476036 2532304 2580960 2626267 2672432 2721675 2772800 2821454 2861192 2884368
50212 2884368 2883319 2852400 2789717 2697244 2579857 2444519 2299536 2153114 2011671 1879189
50202 1879189 1757904 1649212 1553920 1472024 1402626 1344229 1295000 1252575 1213636 1174357 1132062
50191 1132062 1086690 1040408 995790 954514 917323 884309 855005 828790 805497 785237 767633
50180 767633 751856 737607 725374 715443 707298 700429 695058 691547 689578 688523 688184 688640 689683 691058
50166 691058 693004 696075 700573 706604 714343 723681 733824 743894 753912 764744 777137 791164 806481
50153 806481 822642 839190 855841 872559 889139 904842 918814 930781 941009 949763 957239 963940
50141 963940 970612 977799 985872 995476 1007490 1022370 1039869 1059481 1080870 1103791 1127963 1153291
50129 1153291 1180045 1208665 1239500 1272808 1308923 1348364 1391918 1440775 1496582 1561284 1636804
50118 1636804 1724754 1826462 1943389 2077529 2231125 2405603 2600347 2811886 3033710 3256905
50108 3256905 3471890 3670853 3849849 4009626 4155089 4293533 4431939 4574318 4720235
50099 4720235 4864689 4998566 5109586 5184632 5213157 5189715 5114128 4990214 4824670 4626252
50089 4626252 4404479 4168066 3924179 3678768 3437171 3204204 2983735 2778166 2588469
50080 2588469 2414996 2258316 2119043 1996820 1889876 1795786 1712382 1637907 1570902 1510440
50070 1510440 1456233 1408145 1365797 1328850 1297245 1270717 1248372 1229256 1213100 1200009 1189604
50059 1189604 1181031 1173704 1167456 1161934 1156400 1150345 1143924 1137594 1131531 1125558 1119382 1112762 1105576 1097920
50045 1097920 1090088 1082394 1074944 1067529 1059752 1051414 1042801 1034425 1026423 1018509 1010648 1003473 997728 993467
50031 993467 990106 987182 984749 983076 982178 981702 981194 980539 980111 980328 981092 982009 983263 985764 990060 995415
50015 995415 1000382 1004112 1006754 1008897 1011239 1014739 1020385 1028497 1038542 1049912 1062822 1078438 1098362
50002 1098362 1124100 1156899 1197848 1247947 1308004 1378508 1459765 1552217 1656364 1772126 1898234
49991 1898234 2032147 2170336 2308386 2440908 2561772 2665259 2748054 2811020 2859234 2899878
49981 2899878 2939509 2982345 3029559 3078518 3122278 3150650 3152874 3120346 3048466 2937818 2794366
49970 2794366 2627764 2448416 2265502 2086754 1918418 1764479 1626416 1504302 1397899
49961 1397899 1306544 1228818 1163137 1108339 1063257 1026236 995759 971235 952583 939302 930449
49950 930449 925131 922340 920593 918359 914828 909855 903484 896055 888398 881194 874169 866414 857246 846180
49936 846180 832360 814876 793800 770412 746350 722834 700591 680003 661322 644967 631450
49925 631450 620777 612285 605466 600553 597807 596695 596477 597157 599018 601445 603179 603727 603790 604243 605482
49910 605482 607762 611399 616367 622294 629058 636920 645951 655849 666431 677903 690543 704397 719126
49897 719126 733699 746431 755981 762296 766079 767507 766157 762061 755896 747972 737758 724742 709260
49884 709260 692264 674751 657488 640787 624441 608313 592984 579345 567630 557504 548998 542548
49872 542548 537958 534244 530873 528465 527853 528988 531158 533872 537146 541268 546589 553283 561132 569814
49858 569814 579364 590022 601691 614058 627170 641226 655690 669243 680742 689705 695966 699652
49846 699652 701583 702796 703372 702491 699809 695770 690274 682162 670852 657629 644522 632539 621874
49833 621874 613109 607041 603554 601660 600644 600417 600833 601537 602672 605081 609397 615314 621978 628930 636498
49818 636498 645426 656247 668901 682816 697209 711233 724035 734993 743987 751216 756831 760967
49806 760967 763899 765674 765624 762834 757126 749112 739362 728335 717185 707469 699380 691031 680289 666912
49792 666912 652286 637662 623526 610304 598601 588627 580084 572801 566956 562572 559176 556122 553002
49779 553002 549742 546623 544208 543033 543308 545079 548478 553635 560494 569002 579279 591186 603811 615710
49765 615710 625755 633645 639795 645017 650125 655392 660350 664331 667148 668918 669270 667096 661349 651924
49751 651924 639735 626153 612531 600080 589796 582168 576932 573276 570400 567869 565495 563211 561201
49738 561201 559878 559441 559662 560398 562004 564756 567994 570432 571380 571254 570941 571156 572395 574940 578732 583689
49722 583689 590262 599244 611004 625357 642080 660666 679297 694842 704585 707844 705896 700839 694635
49709 694635 688423 682204 675475 668362 661609 655423 649230 642998 637912 634981 633526 631729 628182 622352
49695 622352 614256 604666 595232 587510 581909 578183 576536 577450 580681 585315 590671 596433 602217 607981
49681 607981 614878 624673 638020 654068 671986 692112 715003 739712 763337 782194 793587 797092
49669 797092 794506 788386 780519 771890 763731 757804 755494 757176 762656 771470 782072 790994 793644 786623
49655 786623 769617 745344 717775 690204 664569 641929 622939 607637 595260 584793 575791 568508
49643 568508 563383 560542 559595 559674 559868 559906 560146 560676 560743 559558 557367 555106 553093 550661 547169 542836 538368
49626 538368 534121 529855 525055 519395 513114 507000 501826 497780 494644 492393 491312 491528 492758 494524
49612 494524 496271 497315 497144 496032 495115 495593 497861 501349 505037 508077 510225 511774 513095 514225 514995
49597 514995 515400 515635 515840 516014 516182 516448 516914 517725 519085 521018 523193 525218 527041 528836 530554 531947
49581 531947 533031 534197 535721 537441 539054 540575 542323 544572 547355 550649 554670 559937 566921 575600
49567 575600 585347 595313 604873 613790 622080 629789 636749 642539 646732 649072 649290 646933 641880 635037
49553 635037 628050 622137 617511 614034 611864 611140 611443 612097 612805 613660 614763 616124 617674 619044 619644 619403
49537 619403 619157 619854 621545 623613 625834 628691 632728 638148 645101 653830 664323 676158 688996 703007
49523 703007 718444 734675 749777 761373 768052 769950 768003 763148 756638 750649 747518 748206 752292
49510 752292 759605 770830 785850 802343 816882 826945 831195 828555 818395 801704 781115 759403
49498 759403 738371 718984 701822 687148 675033 665527 658386 652754 647678 643021 639452 637429 636576
49485 636576 636136 635686 635286 635135 635167 635009 634485 634128 634760 636441 638322 639754 640965 642327 643715 645142 647275
49468 647275 650555 654469 658547 663383 669530 675918 680715 683505 685285 686491 686491 685127 683238 681183 678139
49453 678139 673488 667799 661845 655653 649250 643407 638725 634656 630245 625398 620729 616611 613057 610153
49439 610153 607919 606024 604225 602953 602998 604737 607997 612491 618109 624930 633184 643029 654420 667457
49425 667457 682645 700358 720474 743565 772014 807628 846804 879444 894879 889407 867783 838278
49413 838278 807530 779355 755840 737897 725268 716970 712006 709648 709492 711430 715292 720348 725485
49400 725485 730137 734863 740753 748331 757086 765927 774012 781224 787983 794632 800988 806399 810080 811444
49386 811444 810347 807150 802372 796225 788689 780078 771139 762402 753808 745355 737750 731894 727881 725073
49372 725073 723243 723148 725765 731229 738700 747056 755509 763735 771618 778884 784937 789195 791669 793063 794111
49357 794111 794874 794835 793663 791664 789486 787575 786096 785151 784870 785420 787146 790567 795847 802270 808636 814368
49341 814368 819868 825622 831242 835687 838177 838648 837589 835756 833826 831990 829916 827353 824597 822152
49327 822152 820162 818525 817354 816969 817474 818637 820119 821616 822993 824525 826731 829628 832410 834264 835213
49312 835213 835753 836004 835800 835408 835472 836287 837618 839176 840857 842663 844876 848100 852552 857569 862471 867716
49296 867716 874403 882695 891490 899617 906631 912539 917670 922909 929136 936154 942958 949217 955747 963388
49282 963388 972227 981973 991814 999415 1001260 995136 981942 964537 945504 926574 909281 894857 883507
49269 883507 874593 867624 862726 860372 861068 865047 871865 880498 890113 900408 910918 920775 929987 940603
49255 940603 955534 975952 1000432 1026831 1054371 1083195 1111931 1136428 1151692 1155425 1149373 1137059
49243 1137059 1120763 1101300 1080061 1059815 1043076 1030461 1020991 1013282 1006178 999199 993049 989191
49231 989191 988309 989603 991894 994806 998350 1002131 1005771 1009684 1014673 1021010 1028461 1036812 1045699 1054240
49217 1054240 1061654 1068214 1075047 1082997 1092047 1101561 1110663 1118660 1125700 1132974 1141858 1152952 1166229
49204 1166229 1181775 1199801 1220069 1241739 1263794 1285398 1306177 1326465 1347000 1367956 1388540
49193 1388540 1407858 1425892 1443154 1459777 1475433 1489842 1502791 1513859 1522841 1530391 1537814 1546155
49181 1546155 1555816 1566885 1579481 1593881 1610664 1630663 1654647 1683294 1717770 1759764 1810084
49170 1810084 1866790 1924605 1976050 2013631 2032442 2032128 2016840 1993055 1967180 1944361 1927929 1918849
49158 1918849 1916048 1918043 1924089 1933514 1944776 1956135 1966935 1977498 1988081 1998716 2009743 2021602
49146 2021602 2034183 2047125 2060690 2075643 2092366 2110659 2130154 2150234 2169826 2188198 2205960
49135 2205960 2224468 2244235 2264589 2284716 2304191 2322529 2339287 2354909 2370600 2386921 2403065
49124 2403065 2417881 2431114 2443396 2455525 2468087 2481415 2495616 2510854 2527716 2547076 2569720
49113 2569720 2596538 2629074 2669440 2719828 2782941 2862954 2964605 3089071 3229309 3370020
49103 3370020 3495245 3600063 3696292 3803541 3929270 4055024 4144189 4167271 4123050 4037358
49093 4037358 3942199 3854386 3770049 3675436 3561767 3432077 3297629 3170218 3057410 2962207
49083 2962207 2884507 2822340 2772989 2733985 2703322 2679155 2659952 2644908 2633457 2624235 2615139 2604630
49071 2604630 2592499 2579286 2565599 2552188 2539972 2529495 2520665 2513224 2507010 2501539 2495977 2489953
49059 2489953 2483982 2478585 2473411 2467803 2462010 2457218 2454357 2453220 2452854 2452503 2452024 2451575 2451121 2450395 2449313
49044 2449313 2448245 2447763 2448249 2449904 2452902 2457211 2462417 2468194 2475044 2484164 2496285 2510732 2525668 2539174
49030 2539174 2550210 2558878 2565898 2571762 2576423 2579855 2582662 2585743 2589419 2593249 2596765 2600128 2604021 2609151
49016 2609151 2615950 2624586 2635153 2647833 2662744 2679568 2697554 2716105 2735215 2755132 2775722 2796350
49004 2796350 2816180 2834423 2850592 2864824 2877748 2889773 2900661 2909934 2917362 2922897 2926658 2929335
48992 2929335 2932010 2934954 2936986 2936703 2934018 2929913 2925046 2919434 2913269 2907165 2901518 2896258 2891260 2886424
48978 2886424 2881519 2876570 2872266 2869280 2867213 2864950 2862055 2859075 2856407 2853624 2850180 2846132 2841925 2837897
48964 2837897 2834264 2831204 2828864 2827542 2827731 2829572 2832470 2835820 2839881 2845316 2852148 2860127 2870010 2883421
48950 2883421 2901214 2922819 2947485 2975271 3006368 3040169 3075577 3111846 3148815 3186822 3226765
48939 3226765 3269842 3316865 3367968 3422978 3481616 3543345 3607526 3673859 3742237 3812139 3882713
48928 3882713 3953437 4024214 4094898 4165416 4236314 4308299 4381139 4453861 4526225 4599043 4672620
48917 4672620 4745642 4816210 4883421 4947615 5009703 5070773 5131769 5192865 5253242 5311705 5367345
48906 5367345 5419632 5468543 5514813 5559491 5602887 5644377 5683438 5720317 5755460 5788774 5819760
48895 5819760 5847926 5872804 5893912 5910841 5923079 5929900 5931058 5927460 5920268 5909235 5892759 5869649
48883 5869649 5839920 5803730 5760838 5711665 5657855 5600934 5541116 5477967 5411402 5341356 5267309
48872 5267309 5189056 5107478 5023934 4939457 4855130 4772443 4692373 4614641 4538687 4464906 4394149
48861 4394149 4326580 4262000 4200890 4144178 4092241 4045020 4002804 3965869 3933461 3904163 3877351
48850 3877351 3853468 3832825 3815019 3799739 3787335 3778219 3772293 3769330 3769417 3772636 3778688 3787263 3798494
48837 3798494 3812612 3829248 3847509 3866848 3887480 3909721 3933125 3956711 3980020 4003545 4027964
48826 4027964 4053385 4079672 4107104 4136226 4167258 4200107 4234699 4270704 4307240 4343515 4379679
48815 4379679 4416409 4453839 4491672 4530261 4570680 4613547 4658499 4704834 4751851 4798475 4843535
48804 4843535 4886863 4929494 4972582 5016714 5062190 5108905 5155702 5200830 5243470 5283969 5322295
48793 5322295 5357353 5388269 5415377 5439395 5460657 5479752 5497812 5515152 5530332 5541309 5546803
48782 5546803 5545925 5537513 5521039 5497706 5469693 5438589 5405075 5369333 5330909 5288756 5242356 5192427
48770 5192427 5139841 5084320 5024931 4961312 4893680 4822255 4747603 4671111 4594258 4517871 4442820
48759 4442820 4370828 4303492 4240876 4182036 4126707 4075543 4028896 3986229 3946633 3909214 3873203
48748 3873203 3838362 3805133 3773885 3744327 3716239 3690232 3667106 3646831 3628833 3612790 3598410
48737 3598410 3585000 3572123 3560254 3549885 3540378 3530610 3520399 3510418 3501071 3492391 3484738 3478656 3474175
48724 3474175 3470875 3468298 3465672 3461940 3457025 3452484 3449774 3448364 3446754 3444863 3444001 3444772 3446518 3448883
48710 3448883 3452497 3457840 3464480 3471686 3478834 3485136 3489932 3493503 3496754 3499989 3502769 3504910 3506798 3508811
48696 3508811 3511399 3515575 3522173 3530457 3538421 3544611 3548734 3550666 3550223 3548229 3546570 3546580 3548171 3550886 3554914
48681 3554914 3560627 3567883 3576253 3585161 3593383 3599058 3600793 3598474 3592868 3584928 3575565 3565363 3554209
48668 3554209 3541574 3527162 3510682 3491096 3467013 3438195 3406022 3372193 3337502 3301929 3265159
48657 3265159 3226620 3185607 3141910 3096094 3049084 3001758 2954975 2909574 2866268 2825716 2788404
48646 2788404 2754012 2721181 2688507 2655512 2622135 2587812 2552094 2515906 2480990 2448001 2416064
48635 2416064 2384306 2352893 2322398 2292989 2264469 2236371 2207812 2178039 2147370 2117032 2088020
48624 2088020 2060669 2035270 2012248 1991697 1973482 1957870 1945395 1936066 1929464 1925499 1924334 1925690
48612 1925690 1929069 1934447 1941671 1949233 1954845 1957374 1957234 1954975 1950815 1945739 1941587 1939457 1939024 1939826 1942037
48597 1942037 1945451 1948759 1950562 1950307 1947759 1942489 1934498 1924517 1913145 1900381 1886461 1872252 1858256
48584 1858256 1844062 1829415 1815124 1802238 1790970 1780991 1772186 1764536 1757857 1752216 1748155 1746023 1745540
48571 1745540 1746361 1748623 1752688 1758913 1767795 1779492 1792861 1805666 1816111 1823505 1827253 1826182 1819436
48558 1819436 1807365 1791274 1773072 1755375 1740659 1729531 1720640 1712786 1706118 1700624 1694675 1686265
48546 1686265 1674945 1661453 1646117 1628913 1610679 1592954 1576509 1560922 1545717 1531213 1518117
48535 1518117 1506790 1497076 1488609 1481347 1475896 1473093 1473100 1475378 1479845 1487638 1500244 1517854 1538372 1557438
48521 1557438 1569420 1569630 1556911 1534359 1507273 1480235 1455766 1434746 1417374 1403891 1394799 1390431
48509 1390431 1390402 1393906 1400635 1411017 1425388 1443258 1463447 1484710 1506295 1528102 1549748 1568758
48497 1568758 1580236 1579734 1566864 1545373 1519763 1492819 1466230 1441774 1420666 1402424 1385340 1367905
48485 1367905 1349599 1330902 1312954 1296810 1282677 1270201 1259368 1250517 1243569 1237994 1233557 1230211
48473 1230211 1227332 1224116 1220841 1218653 1217855 1217493 1216907 1216655 1217564 1219917 1223882 1229682 1236904 1244698 1253068
48458 1253068 1262880 1274125 1285248 1294694 1302119 1307564 1310665 1311392 1310694 1309677 1308904 1308848 1309984 1311846 1313029
48443 1313029 1312661 1310945 1307830 1302381 1294174 1284246 1273975 1263972 1254650 1246698 1240231 1234488 1229125 1224765
48429 1224765 1221593 1218562 1214788 1210623 1206485 1201752 1195801 1189149 1182495 1175460 1167191 1157520 1146754 1135149
48415 1135149 1123334 1112412 1102807 1093759 1084518 1075219 1066116 1057044 1048233 1040507 1033990 1027739 1021279
48402 1021279 1015244 1009864 1004212 997831 991642 986230 980655 974055 967152 960969 955305 949682 944660 940903
48388 940903 937941 934983 932005 929141 926134 923360 922078 922550 923155 922486 921080 920036 919321 918680 918712 919625
48372 919625 920190 919371 917864 916712 915647 914024 912110 910141 907515 904254 901823 900998 900367 898415 895694
48357 895694 893395 891285 888632 885700 882682 878670 873434 868738 866130 864813 863368 862001 861301 860456 858751
48342 858751 857411 857908 859744 861698 863736 865982 867484 867951 868999 871841 875575 879467 884630 891397 897619
48327 897619 902145 907540 916535 928180 940475 954422 972157 993304 1016497 1042156 1069915 1095278
48315 1095278 1112828 1121437 1123185 1119391 1111461 1103396 1099066 1098357 1099607 1103859 1112928 1125635 1140184
48302 1140184 1158078 1181426 1208840 1238395 1271968 1311915 1356391 1403045 1454252 1513246 1578525
48291 1578525 1648104 1725686 1816119 1918639 2031712 2160395 2311356 2485691 2685686 2923355
48281 2923355 3212239 3556749 3961269 4443403 5025800 5724903 6566235 7602840 8901025
48272 8901025 10525554 12564947 15122661 18163725 21305050 23828478 25032993 24654118
48264 24654118 22968769 20535391 17866049 15287389 12970270 10984295 9327228 7959212
48256 7959212 6838685 5930308 5195096 4594139 4100934 3698554 3368147 3090613 2855799
48247 2855799 2659743 2494976 2351663 2225516 2116524 2021785 1936478 1859855 1793711 1736397
48237 1736397 1683936 1635326 1591536 1550995 1511120 1472707 1438118 1406656 1376050 1346838 1320928
48226 1320928 1297337 1273557 1249779 1227752 1206816 1185092 1163426 1144274 1127680 1112026 1097961
48215 1097961 1087950 1082349 1078827 1074843 1067907 1054633 1033075 1005669 977128 949829 923521 898385
48203 898385 875419 854436 834471 815789 799158 783838 768605 754083 741754 731360 721516 712052
48191 712052 703539 695474 687381 680696 676913 674594 670977 665949 661743 659167 656879 654190 651844 650004
48177 650004 647974 646065 645415 645795 645756 645058 644881 645497 645837 645523 645330 645432 645207 644972 645957 648200 650343 651872
48159 651872 653766 656542 659454 662065 664913 668107 670829 672826 674946 677609 680140 682128 684198 686845
48145 686845 689749 692750 696333 700572 704639 707880 710490 712746 714552 716175 718405 721496 724789 727817
48131 727817 731027 735070 740134 746234 753362 761079 768759 776495 784963 794112 802928 810795 818311 826351
48117 826351 835151 844792 855860 868970 884055 900552 917933 935717 953380 970700 988018 1005934
48105 1005934 1024809 1044532 1064510 1083945 1102468 1120432 1138328 1156021 1172938 1188809 1203801
48094 1203801 1218078 1231675 1244699 1257217 1269001 1279708 1289262 1297839 1305718 1313329 1320974 1328305
48082 1328305 1334636 1340173 1346111 1352944 1359508 1364584 1368668 1373016 1377627 1381581 1385030 1389239 1394573 1399882
48068 1399882 1404248 1408208 1412767 1418143 1423998 1430078 1436057 1441271 1445026 1446830 1446088 1442110 1434706 1424510
48054 1424510 1412520 1399498 1385636 1370348 1352515 1331441 1307621 1282254 1256269 1230294 1205125
48043 1205125 1181329 1158491 1135656 1112462 1089067 1065115 1039873 1013656 988188 965145 944899
48032 944899 926922 910718 895954 882300 869554 857683 846462 835404 824136 812578 800812
48021 800812 789140 778199 768489 759775 751500 743711 736984 731460 726658 722320 718742 716115 714118 712444
48007 712444 711154 710322 709744 709180 708454 707265 705428 703367 701860 701142 700780 700429 700140 699816 699071 697792 696230
47990 696230 694299 691474 687709 683900 680973 678936 677151 675139 672746 669940 666854 663861 661294 659265
47976 659265 657865 657280 657569 658589 660227 662467 665202 668262 671530 674693 677017 678016 678384 679584 682329
47961 682329 686032 689904 693913 698406 703499 709303 716227 724501 733757 743544 753916 765028 776443
47948 776443 787395 797650 807642 817690 827380 835812 842328 847039 850637 853677 856104 857578 858114 858001
47934 858001 857176 855077 851157 845215 837237 827415 816443 805351 794861 785209 776525 768809 761480 753697
47920 753697 745464 737806 731474 726086 721057 716733 713837 712227 711082 710167 709993 710682 711574 712382 714070
47905 714070 717924 724023 731159 738256 745404 753429 762828 773433 784845 796806 809085 821324 833166
47892 833166 844408 854903 864505 873225 881241 888569 894869 899775 903266 905482 906307 905416 902666 898218
47878 898218 892292 884933 876001 865276 852813 839285 825691 812457 799092 785050 770666 756840
47866 756840 744069 732264 721317 711361 702514 694828 688379 683023 678207 673561 669526 666853 665600
47853 665600 665192 665376 666428 668453 671205 674691 679223 684707 690504 696238 702060 707954 713464 718458 723389
47838 723389 728376 732633 735369 736754 737466 737694 737225 736198 735132 734320 733640 732904 731975 730693 729057 727476
47822 727476 726556 726614 727500 728839 730437 732710 736779 743781 753902 766438 780928 797808 817628 840123
47808 840123 864532 890544 918335 947729 977806 1007393 1035586 1061714 1085044 1104707 1119935
47797 1119935 1130345 1135957 1136861 1133008 1124611 1112633 1098424 1082692 1065238 1045898 1025405 1005109
47785 1005109 986093 968855 953539 940120 928343 917679 907418 897021 886649 877235 869594 863510
47773 863510 858184 853569 850523 849413 849315 849150 849030 849883 852152 855554 859814 865002 871227 878651 887775
47758 887775 899083 912270 926190 939733 952559 964993 977594 990922 1005450 1021366 1038348
47747 1038348 1055549 1071997 1087256 1101716 1116062 1130446 1144412 1157512 1169491 1179877 1188013
47736 1188013 1193814 1197941 1200876 1202194 1201108 1197295 1190822 1181736 1170223 1156776 1141695 1124759 1105895
47723 1105895 1085772 1065113 1043785 1021327 998130 975347 953768 933546 914952 898597 884777
47712 884777 873284 864012 857118 852440 849391 847660 847450 848762 851011 853735 857274 862334 869148 877402
47698 877402 886813 897476 909723 923806 939600 956548 974039 991855 1010054 1028427 1046312 1062995
47686 1062995 1078050 1091234 1102316 1111143 1117734 1122243 1124912 1125933 1125136 1121964 1116031 1107562 1096995
47673 1096995 1084349 1069491 1052849 1035249 1017072 998182 978724 959381 940671 922606 905266
47662 905266 888999 873833 859415 846005 834766 826335 819662 813128 806581 801371 798452 797283 796734
47649 796734 796285 796025 796090 796638 798063 800666 804123 807550 810258 812304 814295 816691 819406 822138 825025
47634 825025 828783 834142 841383 850668 862584 877929 896931 919008 943529 970571 1000681 1033976
47622 1033976 1069748 1106968 1144878 1182792 1219407 1252656 1280507 1301769 1315994 1322827 1321882 1313313
47610 1313313 1298070 1277294 1251585 1221008 1185706 1146330 1104030 1060204 1016248 973357 932492
47599 932492 894397 859417 827313 797604 770293 745968 725006 706967 691021 676671 663692
47588 663692 651659 640139 629291 619715 611629 604623 598272 592553 587485 582822 578370 574253 570603
47575 570603 567270 564109 561310 559167 557695 556727 556173 555898 555542 554766 553563 552120 550545 549005 547931
47560 547931 547770 548600 550200 552307 554541 556423 557963 559968 563151 567046 570467 573033 575512 578500 581610
47545 581610 584354 587032 590101 593224 595731 597722 599900 602411 604541 605667 605875 605535 604814 603868 603100
47530 603100 602901 603281 603913 604401 604491 604214 603838 603425 602502 600498 597525 594381 591717 589605 587990 587005 586560
47513 586560 586032 584818 582985 580985 578931 576607 574050 571656 569554 567296 564425 561193 558443 556758
47499 556758 555820 554761 553147 551518 550850 551553 553111 554633 555560 555925 556209 557074 558954 561684 564576 566968
47483 566968 568628 569733 570650 571741 573022 573977 574018 573262 572540 572450 572771 572997 573039 573094 573226 573508 574218 575307
47465 575307 575893 574941 572464 569554 567235 565839 565524 566643 569206 572451 575489 578253 581519 586166 592628
47450 592628 600855 610442 620827 631719 643434 656644 671719 688383 706089 724683 744701 766994
47438 766994 791965 819137 847380 875576 903065 929596 954920 978398 998922 1015309 1026888
47427 1026888 1033636 1035672 1032833 1024986 1012633 996896 978908 959454 939132 918465 897759 877209
47415 877209 857332 839005 822792 808452 795425 783719 774024 766930 762263 759289 757464 756821 757685
47402 757685 760186 764160 769364 775511 782085 788589 795164 802621 811511 821406 831545 841864 852703
47389 852703 863621 873403 881425 888199 894154 898613 900594 900066 897677 893647 887743 880105 871241 861243
47375 861243 849748 836772 822928 808681 794070 779289 764860 750854 736579 721467 705914
47364 705914 690802 676611 663366 651105 639856 629362 619370 610057 601762 594370 587397 580679 574582
47351 574582 569498 565420 562114 559475 557643 556901 557377 558746 560348 561779 563203 564860 566516 567780 568845
47336 568845 570478 573253 577104 581541 585905 589471 591827 593292 594647 596365 598446 600844 603458 605604
47322 605604 606233 605044 602838 600384 597499 593876 590290 588086 587527 587440 586673 585325 584358 584517 586040 589026
47306 589026 593544 599333 605731 612089 618258 624643 631838 640242 649970 660910 672606 684190 694862
47293 694862 704691 714700 725824 737833 749506 759767 768441 776040 783178 790183 796982 803155 808220
47280 808220 811970 814614 816644 818565 820501 821976 822281 821210 819176 816450 812680 807546 801563 795668
47266 795668 790095 784220 777462 769855 761674 753097 744494 736645 730309 725671 722322 719627 717126 714889
47252 714889 713517 713524 714679 716282 718166 721017 725550 731705 738854 746594 755193 765437 778116 793540
47238 793540 811604 832359 856066 881967 907131 927450 940219 945459 944903 940616 934746 929327 925170
47225 925170 921395 916848 911667 906748 902089 896623 889589 881287 872421 863422 854466 845572 836531 827270
47211 827270 818326 810459 803820 798044 793111 789421 786935 785040 783549 783132 784373 787090 791068 796741
47197 796741 804454 813605 823376 834065 846740 861640 877950 895308 914535 936200 959155 981396
47185 981396 1002154 1022367 1043108 1064286 1085063 1104794 1123077 1139344 1153026 1164027 1172632 1179065
47173 1179065 1183453 1185974 1186561 1184631 1179772 1172760 1165216 1158047 1150732 1142456 1133358 1124248 1115539 1107026
47159 1107026 1098421 1089608 1080548 1071451 1062982 1055896 1050549 1046971 1045181 1045057 1046165 1048228 1051555 1056526
47145 1056526 1062815 1069723 1077061 1085049 1093344 1100953 1107255 1112416 1116583 1119282 1119955 1118523 1115019 1109199
47131 1109199 1101014 1091066 1080084 1068263 1055609 1042568 1029672 1016650 1002616 987250 971327 955865
47119 955865 941167 926929 913018 899776 887623 876583 866297 856392 846767 837530 828744 820368
47107 820368 812472 805397 799605 795340 792436 790431 788911 787876 787734 788840 791051 793910 797267 801491
47093 801491 806897 813127 819293 824701 829389 834025 839354 845613 852309 858605 863926 868162 871360 873442
47079 873442 874379 874410 873818 872554 870368 867369 864259 861883 860612 860246 860464 861236 862776 865206 868330 871758
47063 871758 875187 878624 882433 887178 893321 901031 910229 920706 932005 943316 953852 963500 972855
47050 972855 982421 991988 1001012 1009415 1017721 1026524 1036075 1046297 1056945 1067783 1078769 1089996 1101287
47037 1101287 1112064 1121865 1130806 1139193 1146876 1153357 1158291 1161460 1162458 1161051 1157794 1153617 1148717 1142496
47023 1142496 1134770 1126352 1118157 1110296 1102479 1094777 1087541 1080945 1075058 1070133 1066411 1063858 1062380 1061987
47009 1061987 1062472 1063311 1064249 1065617 1067693 1070211 1073020 1076817 1082453 1089713 1097528 1105395 1113924 1123852 1135089
46994 1135089 1146883 1158527 1169773 1180965 1192881 1206077 1220296 1234768 1249052 1263169 1277076
46983 1277076 1290600 1304037 1318139 1333150 1348253 1362308 1374822 1385918 1395703 1404010 1410625 1415411
46971 1415411 1418382 1419863 1420412 1420388 1419747 1418421 1416718 1415170 1414154 1413876 1414527 1416272 1419181 1423321 1428670
46956 1428670 1434846 1441242 1447722 1454878 1463300 1472783 1482620 1492471 1502528 1513025 1524089 1536010 1549102
46943 1549102 1563125 1577232 1590707 1603426 1615440 1626461 1636038 1644060 1650686 1655729 1658258 1656960
46931 1656960 1651028 1640792 1627401 1611802 1594174 1574559 1553746 1533016 1512955 1493071 1472861
46920 1472861 1452860 1434307 1418044 1404059 1391886 1381080 1371449 1363187 1356850 1353042 1352218 1354855 1361440
46907 1361440 1371901 1385306 1400672 1418048 1438385 1462308 1489423 1518803 1549630 1581241 1613042
46896 1613042 1644745 1676362 1707647 1737769 1765762 1791158 1814011 1834499 1852673 1868377 1881192
46885 1881192 1890658 1896788 1900227 1901780 1902008 1901447 1900937 1901412 1903464 1907323 1913065 1920598 1929701 1940415 1953225
46870 1953225 1968438 1985580 2003845 2023092 2043839 2066183 2089108 2111142 2131433 2149908 2166535
46859 2166535 2180680 2191265 2197558 2199781 2198926 2195941 2191197 2184723 2176644 2167194 2156552 2144997 2133081
46846 2133081 2121344 2109982 2099142 2089402 2081600 2076235 2073378 2073074 2075377 2080044 2086708 2095394 2106310
46833 2106310 2118969 2132059 2144535 2156457 2168370 2180054 2190291 2197844 2202470 2205001 2206458 2206991
46821 2206991 2205659 2201390 2194108 2184702 2174035 2162464 2150357 2138395 2126935 2115430 2102945 2089175
46809 2089175 2074685 2060287 2046429 2033096 2020087 2007400 1995410 1984584 1975025 1966582 1959389 1953959
46797 1953959 1950581 1948973 1948720 1949687 1951751 1954503 1957556 1960900 1964622 1968502 1972252 1975907 1979648 1983468
46783 1983468 1987451 1992118 1997943 2004538 2010853 2016254 2021060 2025950 2031187 2036591 2042044 2047817 2054498 2062598
46769 2062598 2072177 2082873 2094385 2106800 2120388 2135248 2151355 2168710 2187152 2206144 2224997
46758 2224997 2243310 2260965 2277845 2293751 2308404 2321332 2331993 2340373 2347248 2353430 2358882 2363008
46746 2363008 2365741 2367794 2369760 2371485 2372493 2372688 2372438 2372242 2372508 2373442 2374974 2376860 2378921 2381112 2383477
46731 2383477 2386225 2389700 2393950 2398407 2402354 2405635 2408485 2410670 2411365 2410066 2407080 2402796 2396903 2388761
46717 2388761 2378279 2365948 2352080 2336413 2318550 2298552 2277037 2254719 2231792 2207708 2181699
46706 2181699 2153683 2124577 2095579 2067267 2039512 2012097 1985134 1958935 1933771 1909890 1887569
46695 1887569 1866942 1847767 1829520 1811820 1794751 1778759 1764318 1751773 1741339 1732919 1725821 1719034
46683 1719034 1712129 1705813 1701237 1698771 1697697 1697112 1696807 1697241 1698990 1702466 1707983 1715761 1725808 1737836
46669 1737836 1751367 1765960 1781443 1797890 1815280 1833178 1850806 1867349 1882172 1894914 1905597
46658 1905597 1914498 1921712 1926977 1930164 1931743 1932364 1932115 1930787 1928887 1927779 1928541 1931175 1935302 1941182 1949600
46643 1949600 1961062 1975625 1993291 2013942 2036879 2060948 2085321 2109740 2133911 2157071 2178451
46632 2178451 2197785 2214961 2229326 2239791 2245633 2246879 2243849 2236680 2225482 2210671 2192825 2172343
46620 2172343 2149475 2124542 2097826 2069406 2039570 2009292 1979781 1951403 1923617 1896180 1869924
46609 1869924 1845900 1824288 1804647 1786850 1771060 1757034 1744208 1732395 1721739 1712004 1702652 1693706
46597 1693706 1685727 1678635 1671345 1662988 1653876 1644702 1635401 1625449 1614890 1604226 1593501 1582280 1570631
46584 1570631 1559535 1550133 1542957 1537944 1534764 1532944 1532006 1531759 1532303 1533645 1535539 1537780 1540405 1543405
46570 1543405 1546388 1548748 1550185 1550977 1551705 1552716 1553822 1554592 1555008 1555805 1558012 1562110 1567684 1573881 1580104
46555 1580104 1586298 1592737 1599733 1607560 1616512 1626770 1638127 1649955 1661670 1673240 1685147 1697929
46543 1697929 1711983 1727743 1745645 1765695 1787370 1810225 1834404 1860270 1887710 1916155 1945236
46532 1945236 1975013 2005502 2036322 2067021 2097495 2127817 2157771 2186840 2214701 2241446 2267131
46521 2267131 2291189 2312555 2330461 2344918 2356377 2365126 2371241 2374918 2376500 2376175 2373949 2369906 2364207
46508 2364207 2356850 2347904 2338040 2328258 2318720 2308329 2296037 2282352 2268965 2256838 2245186 2232438
46496 2232438 2217831 2201840 2185293 2168339 2150206 2129860 2106863 2081580 2054569 2026004 1995800
46485 1995800 1964104 1931364 1898106 1864915 1832433 1800924 1769958 1739132 1709206 1681974 1658694
46474 1658694 1639093 1622222 1607841 1596487 1588515 1583766 1582198 1584192 1589946 1598896 1610037 1622669
46462 1622669 1636649 1652055 1668822 1686657 1705063 1723379 1740843 1756723 1770460 1781841 1791104
$$ [...]
##END NTUPLES=NMR SPECTRUM
##END=
