##TITLE=AC1691_COLAH14372_8650510_jDf0gVVFdt
##JCAMPDX= 6.0         $$ Bruker NMR JCAMP-DX V2.0
##DATA TYPE= NMR SPECTRUM
##DATA CLASS= NTUPLES
##ORIGIN= BRUKER
##OWNER= Administrator
$$ 1.72 TOPSPIN		Version 2.1
$$ 2014-05-30 17:33:10.222 -0700  Administrator@X
$$ Compression mode = diff/dup
##.OBSERVE FREQUENCY= 400.02188249412
##.OBSERVE NUCLEUS= ^1H
##.ACQUISITION MODE= SIMULTANEOUS (DQD)
##.ACQUISITION SCHEME= undefined
##.AVERAGES= 8
##.DIGITISER RES= 22
##SPECTROMETER/DATA SYSTEM= spect
##.PULSE SEQUENCE= zg30
##.SOLVENT NAME= COFFEE_meoh
##.SHIFT REFERENCE= INTERNAL, COFFEE_meoh, 1, 14.98509
##AUDIT TRAIL= $$ (NUMBER, WHEN, WHO, WHERE, PROCESS, VERSION, WHAT)
$$ ##TITLE= Audit trail, TOPSPIN		Version 2.1
$$ ##JCAMPDX= 5.01
$$ ##ORIGIN= Bruker BioSpin GmbH
$$ ##OWNER= Administrator
$$ $$ E:\/data/COFFEE/nmr/AC1691_COLAH14372_8650510_jDf0gVVFdt/10/pdata/1/auditp.txt
$$ ##AUDIT TRAIL=  $$ (NUMBER, WHEN, WHO, WHERE, PROCESS, VERSION, WHAT)
(   1,<2014-05-30 17:33:03.441 -0700>,<Administrator>,<X>,<go>,<TOPSPIN 2.1>,
      <created by zg
	started at 2014-05-30 17:31:57.019 -0700,
	POWCHK enabled, PULCHK disabled,
       configuration hash MD5:
       C8 4E 4E 5D D3 5C D8 9E 9F 52 82 E0 59 8A DE 15
       data hash MD5: 64K
       A2 E9 1E F8 67 1D 51 42 2F FA 63 30 BF 32 7D 72>)
(   2,<2014-05-30 17:33:06.503 -0700>,<Administrator>,<X>,<proc1d>,<TOPSPIN 2.1>,
      <Start of raw data processing
       efp LB = 0 FT_mod = 6 PKNL = 1 PHC0 = 0 PHC1 = 0 SI = 32K 
       data hash MD5: 32K
       C0 47 7D 32 18 88 29 54 4F 5D 10 56 03 CB C8 93>)
(   3,<2014-05-30 17:33:06.847 -0700>,<Administrator>,<X>,<proc1d>,<TOPSPIN 2.1>,
      <pk PHC0 = 91.24146 PHC1 = 0 
       data hash MD5: 32K
       08 E6 27 F4 AF 3A D0 49 78 7E 02 2C F3 2E 90 2C>)
(   4,<2014-05-30 17:33:06.941 -0700>,<Administrator>,<X>,<proc1d>,<TOPSPIN 2.1>,
      <abs ABSG = 1 
       data hash MD5: 32K
       F1 A4 89 1C B3 B3 23 E8 50 6B E0 34 53 19 50 BE>)
(   5,<2014-05-30 17:33:06.988 -0700>,<Administrator>,<X>,<proc1d>,<TOPSPIN 2.1>,
      <abs ABSG = 2 
       data hash MD5: 32K
       33 15 31 C2 37 59 40 58 F6 FA 86 5A 2C 85 EE BD>)
(   6,<2014-05-30 17:33:07.066 -0700>,<Administrator>,<X>,<proc1d>,<TOPSPIN 2.1>,
      <abs ABSG = 3 
       data hash MD5: 32K
       CD D5 5B 3A 4B 0A BE 23 A5 23 A2 38 88 0C BF 4C>)
(   7,<2014-05-30 17:33:07.128 -0700>,<Administrator>,<X>,<proc1d>,<TOPSPIN 2.1>,
      <abs ABSG = 4 
       data hash MD5: 32K
       C1 10 15 89 DE B4 DF AA 12 92 E2 7C F3 C7 70 A9>)
(   8,<2014-05-30 17:33:07.175 -0700>,<Administrator>,<X>,<proc1d>,<TOPSPIN 2.1>,
      <abs ABSG = 5 
       data hash MD5: 32K
       30 0B 50 71 C9 BE D5 19 40 48 49 4C 29 2D 0A 9C>)
$$ ##END=
$$ 
$$ $$ hash MD5
$$ $$ 9F 5E 81 2D 14 25 7D CF C5 9E 9D E5 94 8F 4A 05
##$RELAX= 
##$RELAX= 
##$RELAX= 
##$RELAX= 
##$RELAX= 
##$RELAX= 
##$RELAX= 
$$ Bruker specific parameters
$$ --------------------------
##$DU= <E:\>
##$EXPNO= 10
##$NAME= <AC1691_COLAH14372_8650510_jDf0gVVFdt>
$$ [...]
150 150 150 150 150 150 150 150
##$TP07= 0
##$TPNAME0= <>
##$TPNAME1= <>
##$TPNAME2= <>
##$TPNAME3= <>
##$TPNAME4= <>
##$TPNAME5= <>
##$TPNAME6= <>
##$TPNAME7= <>
##$TPOAL= (0..7)
0.5 0.5 0.5 0.5 0.5 0.5 0.5 0.5
##$TPOFFS= (0..7)
0 0 0 0 0 0 0 0
##$TUNHIN= 0
##$TUNHOUT= 0
##$TUNXOUT= 0
##$USERA1= <user>
##$USERA2= <user>
##$USERA3= <user>
##$USERA4= <user>
##$USERA5= <user>
##$V9= 5
##$VALIST= <valist>
##$VCLIST= <CCCCCCCCCCCCCCC>
##$VD= 0
##$VDLIST= <DDDDDDDDDDDDDDD>
##$VPLIST= <PPPPPPPPPPPPPPP>
##$VTLIST= <TTTTTTTTTTTTTTT>
##$WBST= 2048
##$WBSW= 25
##$XGAIN= (0..3)
0 0 0 0
##$XL= 0
##$YL= 0
##$YMAX_a= 634109
##$YMIN_a= -542723
##$ZGOPTNS= <>
##$ZL1= 120
##$ZL2= 120
##$ZL3= 120
##$ZL4= 120
##$ABSF1= 14.98509
##$ABSF2= -5.573092
##$ABSG= 5
##$ABSL= 3
##$ALPHA= 0
##$AQORDER= 0
##$ASSFAC= 0
##$ASSFACI= 0
##$ASSFACX= 0
##$ASSWID= 0
##$AUNMP= <proc_prof1d_extract_pilot.lims>
##$AXLEFT= 0
##$AXNAME= <>
##$AXNUC= <1H>
##$AXRIGHT= 0
##$AXTYPE= 0
##$AXUNIT= <>
##$AZFE= 0.1
##$AZFW= 0.1
##$BCFW= 0
##$BC_mod= 0
##$BYTORDP= 0
##$COROFFS= 0
##$CY= 15
##$DATMOD= 1
##$DC= 0
##$DFILT= <>
##$DTYPP= 0
##$F1P= 0
##$F2P= 0
##$FCOR= 0.5
##$FTSIZE= 32768
##$FT_mod= 6
##$GAMMA= 0
##$GB= 0
##$INTBC= 1
##$INTSCL= 1
##$ISEN= 128
##$LB= 0
##$LEV0= 0
##$LPBIN= 0
##$MAXI= 10000
##$MC2= 0
##$MEAN= 0
##$ME_mod= 0
##$MI= 0
##$NCOEF= 0
##$NC_proc= -8
##$NLEV= 6
##$NOISF1= 0
##$NOISF2= 0
##$NSP= 0
##$NTH_PI= 0
##$NZP= 0
##$OFFSET= 14.98509
##$PC= 1
##$PHC0= 91.24146
##$PHC1= 0
##$PH_mod= 1
##$PKNL= yes
##$PPARMOD= 0
##$PPDIAG= 0
##$PPIPTYP= 0
##$PPMPNUM= 2147483647
##$PPRESOL= 1
##$PSCAL= 4
##$PSIGN= 0
##$PYNMP= <proc.py>
##$REVERSE= no
##$SF= 400.02
##$SI= 32768
##$SIGF1= 0
##$SIGF2= 0
##$SINO= 400
##$SIOLD= 32768
##$SPECTYP= <>
##$SREGLST= <1H.CDCl3>
##$SSB= 0
##$STSI= 32768
##$STSR= 0
##$SW_p= 8223.68421052631
##$SYMM= 0
##$S_DEV= 0
##$TDeff= 65536
##$TDoff= 0
##$TI= <>
##$TILT= no
##$TM1= 0
##$TM2= 0
##$TOPLEV= 0
##$USERP1= <user>
##$USERP2= <user>
##$USERP3= <user>
##$USERP4= <user>
##$USERP5= <user>
##$WDW= 1
##$XDIM= 32768
##$YMAX_p= 458711735
##$YMIN_p= -760724
##$CURPLOT= <Network HP LaserJet P1505>
##$CURPRIN= <$Network HP LaserJet P1505>
##$DFORMAT= <normdp>
##$LAYOUT= <+/1D_H.xwp>
##$LFORMAT= <normlp>
##$PFORMAT= <normpl>
##$SURQMSG= 1
$$ End of Bruker specific parameters
$$ ---------------------------------
##NTUPLES= NMR SPECTRUM
##VAR_NAME=  FREQUENCY,     SPECTRUM/REAL,   SPECTRUM/IMAG
##SYMBOL=    X,             R,               I
##VAR_TYPE=  INDEPENDENT,   DEPENDENT,       DEPENDENT
##VAR_FORM=  AFFN,          ASDF,            ASDF
##VAR_DIM=   32768,         32768,           32768
##UNITS=     HZ,            ARBITRARY UNITS, ARBITRARY UNITS
##FACTOR=    0.250966925370066, 1,           1
##FIRST=     8223.43324360094, 130511,       -177999
##LAST=      0,             -31248,          -107113
##MIN=       0,             -760724,         0
##MAX=       8223.43324360094, 458711735,    0
$$ Real data points
##PAGE= N=1
##DATA TABLE= (X++(R..R)), XYDATA
$$ [...]
19542b45761D2025M2976J5957b576k83300A84752b16506a4475o1193q1015o571
19531a63254p645A32089R9372i1025k93343A05587j5359c58207J46328B28099
19520a29107L1956k46807d5881G1887l81c06091H7988a41047D2083L26579c10270
19508i7016B5481J01126b41436c6560r4650A23161b17368k9321J1130g928j75601
19497a83529f4607a7504A78480e711C14469C8051a22631k82053A25098a40825
19486a04687G9775i2885j03021b3773o0231j86246J23603j15728B6695R7083d44958
19474e20030a24649j93796a31193o5327e0962q493E2849a93184c1696j70623h3478
19462b29178H0660a44808D8044c63103H809P0894e6201A34944L654a90911f8629
$$ y = [-245761, 42025, 85001, 100958, -2576, -285876, 184752, -216506, -14475, -75668, -156683, -163254, -170899, 132089, 231461, -91025, -384368, 105587, 90228, -358207, -211879, 228099, -129107, -97151, -343958, -45881, 71887, 71506, -306091, 87988, -141047, 42083, 368662, -310270, -97016, 25481, 126607, -241436, -36560, -131210, 123161, -217368, -246689, -235559, -7928, -183529, -64607, -17504, 178480, -5711, 314469, 38051, -122631, -404684, 125098, -140825, -104687, 79775, -92885, -195906, -23773, -84004, -270250, -146647, -262375, 26695, 123778, -444958, -520030, -124649, -318445, -131193, -196520, -50962, -59455, 52849, -193184, -31696, -202319, -83478, -229178, 80660, -144808, 48044, -363103, 8809, 79703, -56201, 134944, 138598, -190911, -68629]
19450a00060A4790a27910j11409A26839J09763q1330D8220c7989J2582j88703
19440b14110i351D4052a42765l7083b2675Q16k11076l7709G8403J33925b68660
19428B585a85178f4134k62115A63665E5092a06120j99796H6342O5358c06937L5092
19417b71845d9965A30489K74574j73735a7936b9E7640a6518B76177F7296b21962
19405a0479k47839A82848G4108h245l5892j73235i2617j03336J3348h4354a7564
19393A64046c6093F1421P0740a04586L70r6550A92577c24870P3179e246B1335
19381B27202i7601I0020l6179i9641J1360F8708M4336J33551I6607m3334b34194
19369a30371b484j3112l6583j58431M2120k1962J8589r6535k2517I109J30385
$$ y = [-100060, 14790, -127910, -239319, 126839, 236602, 155272, 48220, -37989, -25407, -214110, -9351, 44052, -142765, -179848, -22675, -21859, -232935, -270644, 78403, 212328, -268660, 2585, -185178, -64134, -326249, 163665, 55092, -106120, -305916, 86342, 151700, -306937, -271845, -49965, 130489, 405063, 231328, -17936, -29, 57640, -16518, 276177, 67296, -221962, -10479, -258318, 182848, 74108, -8245, -44137, -217372, -92617, -195953, -182605, -84354, -17564, 164046, -36093, 61421, 132161, -104586, -104216, -200766, 192577, -324870, -251691, -5246, 21335, 227202, -97601, 90020, 53841, -99641, -88281, 68708, 113044, 246595, 96607, 53273, -234194, -130371, -2484, -15596, -52179, -210610, -168490, -190452, -171863, -268398, -290915, 9109, 139494]
19358A39494b26208d8569j26512A31921a3954k39116J2203H1471b45666A57592
19347B6428g5148l24n5941A58533A1142L8472K6928P8716a90727P7702C5979e7899
19334f1643a6111B10549P3232a48089A08460c90301I3993a62475j22693a12973
19323B0375C039a58520C58556d22737A9668L7584Q5802a09225k01978a44538H6000
19311b93840A22858k7821g3124n6852A16319a30644I1965a69726C0605Q6232b39527
19299d01387A42490k4411b92370B0247K27241i1659K49A16458b66002a29664A48459
19287i7390a7549k7927B3225a35288H1667a04637A0644Q094a43966j29080A45446
19275c49457R1118J19158b5608p7597F4479b75236a9133k39379O7953j80571b5310
$$ y = [139494, -226208, -48569, -175081, 131921, -13954, -253070, -240867, 81471, -245666, 157592, 26428, -75148, -75472, -131413, 158533, 11142, 49614, 76542, 155258, -190727, -113025, 35979, -57899, -61643, -16111, 210549, 283781, -148089, 108460, -390301, 93993, -162475, -285168, -112973, 20375, 3039, -158520, 358556, -422737, 19668, 57252, 143054, -109225, -311203, -144538, 86000, -293840, 122858, 95037, -73124, -129976, 116319, -130644, 91965, -169726, 30605, 116837, -239527, -401387, 142490, 118079, -292370, 20247, 247488, -91659, -91410, 116458, -266002, -129664, 148459, -97390, -17549, -45476, 23225, -135288, 81667, -104637, 10644, 18738, -143966, -273046, 145446, -349457, -258339, -139181, -25608, -103205, 64479, -275236, -19133, -258512, -190559, -371130, -25310]
19263A52967a28400l8607P9374j17504k3569j42515d8324d107j39983O6837B8434
19251d6712n6114b7940j42098p4726a8651l0884j70903h9607A8039i8766A32201
19239a7300q553l06374n7295L5411B52070a27931d3318a0322E8906c4357r1099
19228a25456A71211o3138b85971A79724J94819A21291j9082a29405B6080a63809
19217c2878C87938A61113J20984j31578b88031N7118E3596J77046m9041b97863
19206b31202J11914j7727O0488a5498I1212k9340O0168a76227B86475a31607m14091
19195e45698b17257j77231A88379a75036A91564G4620K48887e2573B05187a36199
19184A05813a30111K3250I3813P2852B6755i082p3279A01387a51359C8286a65242
$$ y = [152967, -128400, -167007, -87633, -205137, -228706, -371221, -48324, -4107, -144090, -77253, 28434, -46712, -102826, -27940, -170038, -244764, -18651, -49535, -220438, -89607, 18039, -98766, 132201, -17300, -25853, -332227, -389522, -354111, 252070, -127931, -43318, -10322, 58906, -34357, -125456, 171211, 108073, -285971, 179724, 374543, 121291, 102209, -129405, 26080, -163809, -32878, 387938, 161113, 282097, 150519, -288031, -230913, 53596, 230642, 181601, -297863, -231202, -119288, -137015, -76527, -15498, 91212, 61872, 122040, -176227, 286475, -131607, -545698, -217257, -394488, 188379, -175036, 191564, 74620, 323507, -52573, 205187, -136199, 105813, -130111, -106861, 93813, 166665, 26755, -9082, -82361, 101387, -151359, 38286, -165242]
19172b90893C6246a45648c3973R028A82485c13766J43473f842p3363J797q2873
19161a61281H0436C7880K73515C572b61463e2054k59667C75045A50858c28975
19150b34929g4916L32c5530O256j29582P5936F1593d5917g032j04832R623m8734
19138a50975N4986L8897K6984j13977A23527K6608a29379l1648L1591d6090k06192
19127b52282B15333d7040K529E7318b79479a21721b1690k22948I2816J56603a36634
19115b618A09892J5620a73557N9145k5935C02829c01851A28451a50909k59445
19105d10354A29351b12995j19246C68569f4383C74977h3335H261M4053A0637R5993
19094A06630B056a70672O0596B34650a16573M8163B00789F161b06309f8720b8877
$$ y = [-290893, 36246, -145648, -33973, -24945, 182485, -313766, -170293, -6842, -80205, -78408, -161281, 80436, 37880, 311395, 3572, -261463, -52054, -311721, 375045, 150858, -328975, -234929, -74916, -74584, -35530, -29274, -158856, -82920, 61593, -45917, -7032, -111864, -102241, -150975, -95989, -57092, -30108, -144085, 123527, 150135, -129379, -161027, -129436, -46090, -252282, 215333, -47040, -44511, 57318, -279479, -121721, -21690, -244638, 92816, 249419, -136634, -2618, 109892, 125512, -173557, -114412, -140347, 302829, -301851, 128451, -150909, -410354, 129351, -212995, -332241, 368569, -64383, 374977, -83335, 8261, 52314, 10637, 106630, 2056, -170672, -110076, 234650, -116573, -68410, 200789, 6161, -206309, -68720, -28877]
19082a35722A20129i7964I8171b67286K9720r965O2897G7642h8512F9838a35669
19070i9461j6582A39026F4876L086b95698J17188A29220b15612l210B3507J45650
19059A69157K68276i8049L2939D10426a36435k98214I4113l4914a13325m8285
19049a61610P1239C19923A46408E0856b07057A82826a06545K5691C7287A3217
19038f9635J9142E5763a78785n4143g266j73283O1835l9742E1736a6666j09097
19027a25763B34347l770D7598j2085i5814b9910E9810b92091C19901j28670G9345
19015b35173j04069a36221O5218B68727e207n0340A92277b76893p370Q541A73432
19003i3309c8124A51662h8144n2121m86773b95683D6438J88754a3650k58134a23281
$$ y = [-135722, 120129, -97964, 98171, -267286, -237566, -247531, -184634, 77642, -88512, 69838, -135669, -99461, -116043, 139026, 64876, 67962, -295698, -178510, 129220, -215612, -218822, 23507, 169157, 437433, -98049, -65110, 410426, -136435, -434649, 94113, 59199, -113325, -161610, -90371, 319923, 146408, 50856, -207057, 182826, -106545, -80854, 37287, 13217, -69635, -50493, 55763, -178785, -232928, -7266, -180549, -118714, -158456, 51736, -16666, -125763, 234347, 230577, 47598, 35513, -95814, -29910, 59810, -292091, 319901, 191231, 79345, -235173, -339242, -136221, -71003, 268727, -5207, -55547, 192277, -276893, -284263, -275722, 173432, -93309, -38124, 151662, -88144, -140265, -627038, -295683, 46438, 235192, -13650, -271784, -123281]
18991a5876j07210C92458a66376G436c33566a34771B2190K00928b08713A32639
18980a25342A00176M0749o8084J22002E9525c15972i6166E8292P3849g7786G7822
18968D1330m716c69135a71978b738j14344p1002E8004f2157C63448c21463a0010
18956a16758k28014g5059o6344A70481a35993A04214a51519j46011A57912R6490
18946B54402j04019o3105M3760a20655B16463r7239J8658b1979m68024a64900
18935a51581A16238b21348g1418H0029e4745B85219j22857A8934J23472a97897
18924a18915j05274f9403A12538J34009a46565q0618B01991c07579c8311j04400
18914a42711A99560N9290a67928j03497C61886a3084k84245B51653D2319f5701
$$ y = [-15876, -123086, 392458, -166376, 7436, -333566, -134771, 22190, 223118, -208713, 132639, -125342, 100176, 140925, 72841, 194843, 59525, -315972, -96166, 58292, 132141, -77786, 77822, 41330, 36614, -369135, -171978, -2738, -117082, -188084, 58004, -62157, 363448, -321463, -10010, -116758, -344772, -75059, -141403, 170481, -135993, 104214, -151519, -297530, 157912, 254402, 150383, 87278, 131038, -120655, 216463, 119224, 137882, -21979, -490003, -164900, -151581, 116238, -221348, -71418, 80029, -54745, 285219, 162362, 18934, 142406, -197897, -118915, -224189, -69403, 112538, 246547, -146565, -227183, 201991, -307579, -38311, -142711, 199560, 258850, -167928, -271425, 361886, -13084, -297329, 251653, 42319, -65701]
18903c3450k59894E7145b74529D0228a37335o0523l84418G4455O274N7807b8445
18891B68147H3132a12914L0640K347k78073C05370D0851J9367a47080N879k40769
18880c81970a05109d8190j33578a049k08205j84070a91618P0485H6800e49977
18869B23771b12394f7379m3416o3064A21535O5912f1734o971B70431c50236A05205
18857b18946n3405A4541Q5263c48177a16422C5694J18065J4930a28785j73510
18847c02295a31633I4444J82332A4662J11011a39673A89398b31796m0654C0211
18836G6542a95185I8881b83992F6143j1429L6384R8701o4317b33292I8620b17867
18824B85224c38124f3432m41904A21022a41237I8078b813D3960a64161F2394B8329
$$ y = [-33450, -293344, 57145, -274529, 40228, -137335, -197858, -582276, 74455, 80729, 138536, -28445, 268147, 83132, -112914, -82274, -79927, -358000, 305370, 40851, 60218, -147080, -141201, -381970, -105109, -48190, -181768, -1049, -209254, -393324, -191618, -121133, 86800, -549977, 223771, -212394, -67379, -110795, -173859, 121535, 187447, -61734, -68705, 270431, -350236, 105205, -218946, -272351, 14541, 99804, -348177, -116422, 35694, 153759, 168689, -128785, -302295, -131633, 94444, 276776, 14662, 125673, -139673, 189398, -231796, -272450, 30211, 76542, -195185, 98881, -283992, 66143, 54714, 91098, 189799, 125482, -233292, 98620, -217867, 285224, -338124, -63432, -505336, 121022, -141237, 98078, -2813, 43960, -164161, 62394, 28329]
18812B16305o1309J26655a40058A34319F665a90349C38212C2608P5857b65358
18801e464I3836b72065b2748j01530B90183K7433e0097j40455B46892B2133J57278
18790A79411a26147o9080A32776i8773a1393o1834C9458J47819a32995B53635
18779a70783j1881g1423j17452R525Q7937A09945g0569F5332a48551j98570J56322
18768a90799Q2860d429j22194c5672D9177h8258j88794A01470M8592c02687A12263
18756a90866d9088C9132J01614C5028L4559b58023B84319G7701Q8714P3348F9199
18744E6759b30840A42231Q7879g8942F5904i8274K9533A90302p9384D6327Q431
18733E4758M6646b12373M4158B685e8564B6467c15420A46914e7453G2875a78527
$$ y = [216305, 154996, 281651, -140058, 134319, 6665, -190349, 338212, 32608, 108465, -265358, -5464, 93836, -272065, -22748, -124278, 290183, 317616, -50097, -190552, 246892, 22133, 179411, -126147, -195227, 132776, -98773, -11393, -73227, 39458, 187277, -132995, 253635, -170783, -182664, -71423, -188875, -179350, -91413, 109945, -70569, 65332, -148551, -347121, -190799, -107939, -4429, -126623, -35672, 49177, -88258, -277052, 101470, 150062, -302687, 112263, -190866, -49088, 39132, 140746, 35028, 69587, -258023, 284319, 77701, 166415, 239763, 69199, 56759, -230840, 142231, 230110, -78942, 65904, -98274, -68741, 190302, 110918, 46327, 54758, 101404, -212373, -168215, 2685, -58564, 26467, -315420, 146914, -57453, 72875, -178527]
18721a39314O6934D313a05526A55435E2525b29317Q8723G865J57830g0836o0313
18710a31149j39492O4982P8197J6150D9764A6310d55219K27117a8504j32838M6438
18699a04904C0555a27884j82739e6077D3935g3200j3149l22299a55913D31638
18688g6638n755j59251A00244b02137G8058J30609O6931a72972e1434A67499E9914
18676a61369k21742A97902l2821a08636o8754A13338J55630f4324F8870a15835
18665C2376L7163b83628F0881f7922j16591h3534j67383m8063a188k30465B77826
18653c98139J77200h3208J7549k10588i2253K2932b4852A6110d06061A00635R5604
18642A96239h2719k703B97335B5464m997a01246D0539a30886C7778a16892k8693
$$ y = [-139314, -72380, 4313, -105526, 155435, 52525, -229317, -140594, 7865, 165695, -70836, -131149, -270641, -205659, -127462, -111312, 49764, 16310, -455219, -228102, -18504, -151342, -104904, 30555, -127884, -310623, -56077, 43935, -73200, -86349, -408648, -155913, 431638, -76638, -82393, -241644, 100244, -202137, 78058, 208667, 275598, -172972, -51434, 167499, 59914, -161369, -383111, 197902, 165081, -108636, -177390, 113338, 268968, -64324, 68870, -115835, 32376, 69539, -283628, 60881, -67922, -184513, -83534, -250917, -298980, -1188, -231653, 277826, -398139, -220939, -83208, -65659, -276247, -92253, -69321, -24852, 16110, -406061, 100635, 196239, -82719, -85422, 297335, 25464, 20467, -101246, 40539, -130886, 37778, -116892, -145585]
18631a45585m9765M5901k27290C9497c78872a84217B43760n0866a13865m4737
18621a58602M9496j58504J18245j68212e2353p6303B5527b87638B3033a64824
18610B03228e0125h335j733p6199A44017a71923I3777f3962C2247a16336p8439
18599a94775B32157B2764M5783b79539N7067f1051C2266a28939D3191d19699h4313
18587a25711c1179k9178A10287c20702a13503r8836B93126A40461h8745G3771
18576B06001h4401j2503B0447f098j49534b8763C6787K16444f7536j81127A19948
18564D66359c4668A07826g0010j84305G590b68994P8177D075N2108R7509b53820
18552F4346h3482j89185k85475C51117c5628A05183b09650k10056A83852a43222
$$ y = [-145585, -195350, -149449, -376739, 39497, -378872, -184217, 243760, 192894, -113865, -158602, -109106, -267610, -149365, -317577, -52353, -128656, 25527, -287638, 23033, -164824, 203228, -50125, -8335, -10068, -86267, 144017, -171923, 93777, -63962, 32247, -116336, -194775, 232157, 22764, 68547, -279539, -222472, -61051, 32266, -128939, 43191, -419699, -84313, -125711, -31179, -60357, 110287, -320702, -113503, -212339, 293126, 140461, -88745, 73771, 206001, -84401, -96904, 20447, -6098, -155632, -28763, 36787, 253231, -67536, -248663, 119948, 466359, -34668, 107826, -70010, -254315, 7590, -268994, -190817, 4075, 56183, 153692, -253820, 64346, -83482, -272667, -558142, 351117, -35628, 105183, -209650, -419706, 183852, -143222]
18541e9747B11998Q557e7442o7409A08714a47261O3018c3026B22444b02897a8811
18529C4064J28211l8199a31662M9111k54976J16015i4657G5364a06378k26421
18519c32799A5433a24252D0551J62435n3198J452i5133l55860J83275C14139i0543
18507A01761h1385D0590P4276e4717R608A47359f2556A96091c12667A30127d30642
18495F4292b47336J07034F7418a05477J9760a7730A37626b07463g409k4233D8
18483b59652A16305a16920l7094A9604R0642b14480r4357a9596j81795b853k25147
18472b28000c1071G2755h4916C42280a60137G3858J33018b32279R6131A12006
18461a10696n2976a6777B02087f1032J8934J1728A15598d3466l0919E289K49849
$$ y = [-59747, 211998, 220555, -57442, -124851, 108714, -147261, -84243, -33026, 222444, -202897, -18811, 34064, 162275, 124076, -131662, -82551, -337527, -221512, -94657, 75364, -106378, -332799, 15433, -124252, 40551, 202986, 149788, 151240, -95133, -450993, -267718, 314139, -90543, 101761, -81385, 40590, 114866, -54717, -45109, 147359, -62556, 196091, -312667, 130127, -430642, 64292, -247336, -140302, 67418, -105477, -85717, -17730, 137626, -207463, -7409, -31642, 48, -259652, 116305, -116920, -154014, 19604, 110246, -214480, -308837, -19596, -201391, -2853, -228000, -31071, 72755, -84916, 342280, -160137, 73858, 206876, -232279, -136148, 112006, -110696, -163672, -16777, 202087, -61032, -42098, -30370, 115598, -43466, -74385, 5289, 255138]
18450B55138A02752f0718C3376N8329J3224k0564g8793B54626c7690C47582d9820
18438B4444J00908l7333K15302H3505O8120i8096k29373I6903e4152A0821a83923
18426b05882P8189A43760b87979B44078d8812o3110a234j67619c8158j06735m312
18415a49205A45818N260A2583K16586e426q3576G9443g230A49851J51864j04159
18404A97556a950B58K31906l9692r2044a20544e3056j12664A5945a54511j22061
18393b76572K5923D3650J76272a06996j27910A55414a90939l98302a24127n5760
18383a79887j22635A60907M4701a96263O3446k70439e8877n5464n2435J5952B9239
18371g2299B43247f6105N884B15665e5573A38611C0411a1372I4269b62196J08941
$$ y = [255138, 102752, -60718, 33376, 91705, 104929, 84365, -78793, 254626, -37690, 347582, -49820, 24444, 125352, 88019, 303321, 83505, 151625, -98096, -327469, 96903, -54152, 10821, -183923, -205882, -127693, 143760, -287979, 244078, -48812, -111922, -1234, -168853, -38158, -144893, -149205, 145818, 151078, 12583, 229169, -5426, -89002, 79443, -7230, 149851, 301715, 197556, -1950, 258, 232164, 192472, 100428, -120544, -53056, -165720, 15945, -154511, -276572, -250649, 43650, 219922, -106996, -234906, 155414, -190939, -589241, -124127, -179887, -302522, 160907, 205608, -196263, -132817, -403256, -58877, -114341, -166776, -150824, 29239, -72299, 243247, -66105, -60221, 215665, -55573, 138611, 30411, -11372, 94269, -262196, -153255]
18360a53255q2655B36831b80807m2636C596b3246j00005P343k71106e260l3190
18349c8450n9707I4821h5961j96282C4939a40459m0569o2023C7411a01971L3761
18338f8210j12451B03925a44189L5711j69957N8685N7503m9874F5368d6500A66312
18326D636a48341O3222j0187j2349A65715p1271B4272J35646K96089A31285d2248
18314a48009L4569a8340F2212a90739L8097N6132B22796a86838Q9899B5316P6374
18303A01690J1211A2098J12716i6073B29052A5708d4399k84884k6222J55589j64462
18292c64378J65056a9749j33875I569a89815m2370P0774e8292A01640f9625q9501
18281a59126A32666E7826b55537L1606i8327A76985J05320D7806b09199g3920
$$ y = [-153255, -235910, 236831, -280807, -323443, 3596, -23246, -123251, -115908, -387014, -5260, -38450, -98157, 94821, -85961, -282243, 34939, -140459, -181028, -243051, 37411, -101971, -68210, -180661, 203925, -144189, -108478, -278435, -219750, -162247, -212121, 65368, -46500, 166312, 4636, -148341, -85119, -95306, -107655, 165715, 94444, 24272, 159918, 456007, 131285, -42248, -148009, -113440, -18340, 62212, -190739, -152642, -96510, 222796, -186838, -96939, 25316, 101690, 112901, 12098, 124814, -96073, 229052, 15708, -44399, -329283, -355505, -199916, -364378, -199322, -19749, -153624, 9569, -189815, -232185, -161411, -58292, 101640, -69625, -159126, 132666, 57826, -255537, -223931, -98327, 176985, 282305, 47806, -209199, -73920]
18270d2629A8611a16809I9562h6907L005b5338C24788b69271J32726G4993c14120
18258D2401b0180I681b65098j14580R934C47532e0319Q871F6761c21153a19340
18246B0276I964a66797A99339a31868j58807d971j06127A23621f1881j40291C0587
18234B58842i1692k39278A81490N2396D1913b49790G4265A9757c1796k49109A53978
18222d07722B88700b26158Q2266c1141B18693a24300A80865a20379l43754I7494
18211a1322F1350d3594k39910i7505o7866k9816B8505L0337J75619J6126A09657
18199E1926i9661B4128M4347F659a31930a5494G7791i3136j03742K0440P8484
18188i7954R073A4333a8487A61404c29566h6613A38107k2331P0105B2541J01201
$$ y = [-42629, 18611, -116809, 99562, -86907, -83902, -25338, 324788, -269271, -136545, 74993, -314120, 42401, -20180, 9681, -265098, -379678, -369744, 347532, -50319, -41448, 66761, -321153, -119340, 20276, 9964, -166797, 199339, -131868, -290675, -4971, -111098, 123621, -61881, -202172, 30587, 258842, -91692, -330970, 181490, 233886, 41913, -249790, 74265, 19757, -31796, -280905, 153978, -407722, 288700, -226158, -143892, -31141, 218693, -124300, 180865, -120379, -464133, 97494, -11322, 61350, -43594, -283504, -97505, -165371, -195187, 28505, 58842, 234461, 250587, 109657, 51926, -99661, 24128, 68475, 6659, -131930, -15494, 77791, -93136, -196878, -176438, -97954, -88881, 14333, -18487, 161404, -329566, -86613, 138107, 115776, 185881, 22541, 123742]
18177A23742l5644J89126j03014a79041F8436J0295e0132A0726g076j33175F9150
18165g8707k0768m9609b8215B2950e8847C2301a51315j51717E7968M5428g0862
18153D68909a41404j0137p0134C22350E329R4397a44679B20131a01361j62809
18143b64170A10330c36431a23417M7319g635A48939K71112a18372k21703A32184
18132A9134d64646J99026R3553O5657I7117K18666a15864K3679n0450A08801b62117
18120a06311c1991j49486j0606m2197D7493J71355c8711k89630i7398r280p4612
18109a81290e1983A9934b3400k06476J07499m4456c1269e98A26968i3890A24907
18097B7188a75660H397a60209I6955a73983f7009o9869j19258f601B7212d3314
$$ y = [123742, 88098, 277224, 174210, -179041, 68436, 78731, -50132, 10726, -7076, -140251, 69150, -78707, -99475, -149084, -28215, 22950, -58847, 32301, -151315, -303032, 57968, 103396, -70862, 468909, -141404, -151541, -221675, 322350, 5329, 99726, -144679, 220131, -101361, -264170, 110330, -336431, -123417, -76098, -7635, 148939, 420051, -118372, -340075, 132184, 19134, -464646, -265620, -172067, -106410, 97117, 315783, -115864, -92185, -142635, 108801, -262117, -106311, -31991, -181477, -192083, -234280, 47493, 218848, -38711, -328341, -97398, -106678, -181290, -51983, 19934, -23400, -229876, -122377, -166833, -31269, -598, 126968, -93890, 124907, 27188, -175660, 8397, -160209, 96955, -173983, -67009, -136878, -256136, -6601, 27212, -43314]
18085h7241K9285j24093F0728f0723r9336d6606m6312l2058m7838c3370D6540
18073B05720A01244O2605L6648B6779K4885j0997a4410l6293l1469H2885A0626
18061d6801B05271d7291l0313b6049k15748a4404j40028J3598j09549j55355A92616
18049g7507b3066e573A9735J34010J6336a47811N6826A50556f0597r818A7163
18037B34014c13499e1317j3665k9493A84155k368c1009p2518k0364A16825a70112
18025a73324F7976f04p9071m739E1381g9543B73180k1065g5055A5744a37722p3051
18013b10773K5941b286r1299B6025b45924I2041b31871e8130m62741D1461e0208
18001D6818b1268A12738b9364m0162D0301n946b37106L2258b1905C09440b42461
$$ y = [-87241, -57956, -182049, 60728, -60723, -160059, -46606, -92918, -124976, -172814, -33370, 46540, 205720, 101244, 163849, 200497, 26779, 51664, 40667, -14410, -50703, -82172, 82885, 10626, -46801, 205271, -47291, -77604, -26049, -241797, -14404, -154432, -140834, -250383, -405738, 192616, -77507, -23066, -5573, 19735, 153745, 170081, -147811, -90985, 150556, -60597, -70415, 17163, 234014, -313499, -51317, -64982, -94475, 184155, 181787, -31009, -103527, -123891, 116825, -170112, -173324, 67976, -604, -79675, -84414, 51381, -79543, 273180, 252115, -75055, 15744, -137722, -210773, -184832, -2286, -93585, 26025, -245924, 92041, -231871, -58130, -520871, 41461, -50208, 46818, -21268, 112738, -29364, -69526, 40301, 34355, -237106, -204848, -21905, 309440, -242461]
17989A04759a5366m1860r476j76498h1707j1309A77774k2488D1681f1962B1418
17977i6672L7522j68255j67660h852l0175l7661A10330B9063b22942F4658b080
17965i9710b476l88359B9945d7138A6305J71531G0475b3456j68955C1764a54501
17953a02299n5908L2429B54555j26911n3275a67788B08104I9543o316M8798g7835
17941e23497E7497m605J8748a16901A44072b5248k4305n6084K9218A11568b60749
17929F7195A0997M3189K99954C5921b1987D69522b35816o6575g5183B37998r1575
17918A46423k5166K63163b31723B70066A28230c5759j35677c6802j14328f6894
17907b77147b6156A2019a465k32493a3174F6492g7221j10279Q9978D8350a6870
$$ y = [104759, -15366, -57226, -66702, -243200, -81707, -93016, 177774, 155286, 41681, -61962, 21418, -96672, -59150, -227405, -395065, -8852, -39027, -76688, 110330, 29063, -222942, 64658, -2080, -99710, -2476, -390835, 29945, -47138, 16305, 187836, 70475, -23456, -192411, 31764, -154501, -102299, -158207, -125778, 254555, 127644, 74369, -167788, 208104, 99543, 93227, 142025, -77835, -523497, 57497, 52892, 71640, -116901, 144072, -25248, -49553, -105637, -76419, 111568, -260749, 67195, 10997, 54186, 354140, 35921, -21987, 469522, -235816, -302391, -75183, 237998, 146423, 121257, 384420, -231723, 270066, 128230, -35759, -171436, -36802, -151130, -66894, -277147, -26156, 12019, -1465, -233958, -13174, 66492, -77221, -187500, -97522, 48350, -16870]
17895a36177h143j68072j94251I3209c2443j95991A71701b15342B4049N1830J3535
17884H9414K16872A45887a49103E6260h0703B00331a37224m6053B83749n5553
17874B28196c1694A14931d528B10473K3062b1504j10141G8199c53117A60789a5664
17862a22681k9411F6836B919a52535H1132f3952j52391M9009c0234b788A13365
17850d4100j31528Q0608B54236c9874a1118k42077J4874M4227l3062m4610A45918
17838E6824p758b12915E3258b6503j40990d7759a2414B4632c21941E5711N0382
17827A06093C2577e547D4193J1264M3171D8305a0288A81739f1247F7422K9025
17816I6447K23850A02242K25174A44782b6345H2394a4617p2934B81507a67466
$$ y = [-136177, -8143, -176215, -370466, 93209, -32443, -228434, 171701, -215342, 24049, 75879, 89414, 306286, 145887, -149103, 56260, -80703, 200331, -137224, -183277, 283749, 228196, -31694, 114931, -4528, 210473, 233535, -21504, -131645, 78199, -353117, 160789, -15664, -122681, -152092, 66836, 2919, -152535, 81132, -63952, -216343, -167334, -30234, -2788, 113365, -44100, -175628, -95020, 254236, -39874, -11118, -253195, -238321, -194094, -227156, -271766, 145918, 56824, 49066, -212915, 53258, -26503, -167493, -47759, -12414, 24632, -321941, 55711, 106093, 32577, -5547, 44193, 55457, 98628, 48305, -10288, 181739, -61247, 67422, 96447, 320297, 102242, 327416, 144782, -26345, 82394, -14617, -87551, 281507, -167466]
17805c2106p0324B05874a9544A4888J44128R5533d2171C83374D4284J2397E954
17793b81360L4607A12112a38350a1912A13225A6883a45958F0321i0194A62981
17782C32965j48944a49725E1219a36329E9473O2927a0045p2477n6018A12536l6831
17771G5705a79239H7903F865J27923a39490I1554c45316A6321f7160B71817D2229
17759F7072d4522A38371n0940O5337C8169a98530o2275k5280D2997a07420l4635
17748a42055J4651A07062a09560j53776J27352B18569J2327c73517B1146N2699
17738G3845j3748b36337A1643b26892E271d9815m4411j17036k1340l0110J19328
17727a43384A02470D5280e6053k61167c2112k00259l6919E9011g3348B13870a22227
$$ y = [-32106, -102430, 205874, -19544, 14888, 159016, 254549, -42171, 383374, 44284, 56681, 5954, -281360, -246753, 112112, -138350, -11912, 113225, 16883, -145958, 60321, -90194, 162981, 332965, 184021, -149725, 51219, -136329, 59473, 122400, -10045, -82522, -138540, 112536, 75705, -179239, 87903, 6865, 134788, -139490, 91554, -345316, 16321, -67160, 271817, 42229, 67072, -44522, 138371, 87431, 152768, 38169, -198530, -260805, -286085, 42997, -107420, -142055, -127404, 107062, -109560, -263336, -135984, 218569, 230896, -373517, 21146, 73845, 60097, -236337, 11643, -226892, 5271, -49815, -94226, -211262, -232602, -262712, -143384, 102470, 45280, -56053, -317220, -32112, -232371, -269290, 59011, -73348, 213870, -122227]
17715a51614C15861a36438d8231A47617e1681A47028K2794b3081G9013A563R5196
17704I6759D6033J40076e0323j84108e6442j52147F9680e1103l30107a49484A61621
17692g1568A89636R9885d2844A28935E8882a45329a1590D44740f7650B84418g798
17680f5102J9525B4049O6239a70098O762o9927A01467b36860j08438H5511J0177
17669I5688a62461C24397I2805J6520i4945A83707b18153I5102C5135e4998C39672
17657c5890A6977g0068A48471E299J0858L35018h9240F2522b44958i9415B16992
17645f3626q7124B50202b45596D6487b00241A48463L9534i2493g695B39872K05985
17634D45857G780a20183p8263A01189J35324b19631f6638j84862I9304K6136N238
$$ y = [-151614, 315861, -136438, -48231, 147617, -51681, 147028, 169822, -23081, 79013, 1563, 96759, 46033, 186109, -50323, -234431, -56442, -208589, 69680, -51103, -381210, -149484, 161621, -71568, 189636, 289521, -42844, 128935, 58882, -145329, -11590, 444740, -67650, 284418, -7798, -65102, -45577, 24049, 90288, -170098, -163336, -233263, 101467, -236860, -345298, 85511, 95688, -162461, 324397, 92805, 109325, -94945, 183707, -218153, 95102, 35135, -54998, 339672, -35890, 16977, -70068, 148471, 5299, 16157, 351175, -89240, 62522, -244958, -99415, 216992, -63626, -150750, 250202, -245596, 46487, -200241, 148463, 187997, -92493, -7695, 239872, 445857, 7780, -120183, -198446, 101189, 236513, -219631, -66638, -251500, 99304, 125440, 130678]
17623A30678k9575d4420B27762M7057E0948a33085m5533e4739A39261M9201M2022
17612B30484m0060R6714b7758k46281k1018B8785b60A03042c6678A32676b73952
17600B80767a11076j80144E4821O9154N5334L00403e7900m6095j07805B0374a81768
17588g1357G8878O4422j1223c6898B9898a1845o998B12039a94962h2802d0054
17576b4450A57344a47350i721r6864C7416M0887b6681e835j02618B04024I5155
17564e5786A31092Q909b34872D11032a13861I7932g0100B75725b34529e1360B36916
17552A30180a52392A5128O7967a56189C5623N2079J48533D1210J22683g769B6041
17540H9360h3651D54280i3059E658b80355A19933b99906C53435g4016C5732f1357
$$ y = [130678, 101103, -44420, 227762, 274819, 50948, -133085, -178618, -54739, 139261, 188462, 230484, 190424, 287138, -27758, -274039, -295057, 28785, -260, 103042, -36678, 132676, -273952, 280767, -111076, -291220, 54821, 123975, 179309, 479712, -57900, -103995, -211800, 20374, -181768, -71357, 78878, 143300, 132077, -36898, 29898, -11845, -18843, 212039, -194962, -82802, -40054, -24450, 157344, -147350, -9721, -106585, 37416, 78303, -26681, -5835, -108453, 204024, 95155, -55786, 131092, 140001, -234872, 411032, -113861, 97932, -70100, 275725, -234529, -51360, 236916, 130180, -152392, 15128, 83095, -156189, 35623, 87702, 236235, 41210, 163893, -7769, 26041, 89360, -83651, 454280, -93059, 5658, -280355, 119933, -299906, 353435, -74016, 35732, -61357]
17528B13451J2731a64230B79816a10164A93550b62401B96962A6624J31176K00337
17518C48137a49812B20358A4292f8101C35416d0359C7414J97154c04809B80003
17507a8218o9536q6529f748B17178N2545A19848K1425G0603J13576K31646A18594
17495a07196E2004L56188G4317O5414J14902J0210A17327j3583c0335E4555B446
17483c3754C56181a43962A23923a9505A3909b4586a1444A89617L79208k82871
17473B85954j27460K06507o1250a08061B98781h126I2987a06595A10272b15230
17462E8910a70492A21165O1969N2426H871a17845e2912C50166A17796Q8391m6601
17451A59586J13267r757J09275J09716q4000L3328A67661D9271K57505p7797q4814
$$ y = [213451, 226182, -164230, 279816, -110164, 193550, -262401, 296962, 16624, 147800, 348137, -149812, 220358, 14292, -68101, 335416, -40359, 37414, 234568, -304809, 280003, -18218, -87754, -174283, -6748, 217178, 269723, 119848, 141273, 70603, 184179, 415825, 118594, -107196, 52004, 408192, 74317, 139731, 254633, 264843, 117327, 103744, -30335, 54555, 2446, -33754, 356181, -143962, 123923, -19505, 13909, -24586, -11444, 189617, 568825, 285954, 158494, 365001, 303751, -108061, 298781, -8126, 92987, -106595, 110272, -215230, 58910, -170492, 121165, 183134, 235560, 8871, -117845, -52912, 350166, 117796, 206187, 159586, 272853, 263096, 372371, 482087, 398087, 431415, 167661, 49271, 306776, 228979, 144165]
17440A44165p0287O8869K41488a09041B59165M1286j18549o5635M0760R3601J10677
17429C61305J46669R0187B32899r5443K28854b0977A54079O8574M4800m8449O1385
17418B80389F1725J09992J51723m2402h1453A11442C7013a48746C45456Q0413
17408D25869j56720j02421N2600F4074K41410J5540J32094c2196A60359J32471
17398B92830b1476A32245j9870D4547K86287d3328f790j83118A23539K46837A22437
17386C8334f9100D5452i6049A57295J5444j7462d0837A64338C7150J24231K74683
17375D36064A5703c5494C17683l7564A36163J13798K9327j23913J03560J00571
17365C59506j78202D1022b0665B04070Q7667j14704a9157I5763K49337j17848
$$ y = [144165, 73878, 142747, 384235, -109041, 259165, 300451, 181902, 116267, 157027, 250628, 361305, 507974, 598161, 232899, 137456, 366310, -20977, 154079, 222653, 267453, 219004, 280389, 61725, 171717, 323440, 281038, -81453, 111442, 37013, -148746, 345456, 425869, 269149, 166728, 219328, 64074, 305484, 321024, 453118, -32196, 160359, 292830, -21476, 132245, 112375, 44547, 330834, -43328, -6790, -189908, 123539, 370376, 122437, 38334, -69100, 45452, -96049, 157295, 172739, 155277, -40837, 164338, 37150, 161381, 436064, 15703, -35494, 317683, 280119, 136163, 249961, 279288, 155375, 258935, 359506, 181304, 41022, -20665, 204070, 291737, 177033, -19157, 95763, 345100, 227252]
17355B27252g0727G0349K90770D7947R6256j2406L21908a29490M961A74232g4186
17343A53991L9281p9681J51277h9096l1931A48102K86268B06797E0111e7814B45169
17331A79902J22259E9016B7864J99004c45558D38853A25830J57082l3627n9093
17321A90192O0607A4637J08262K2937O1526P1285a8420C23830a58387c9603B21168
17309A67369K90025j87195J21847a10223D24001r5921O1779A71342J2135E6222
17298A27090L5473D4904L01142q1614k9279c69141A14838m3483K74315A71908
17287A6203J76709r4478c7722G8420a63499B56246j8038b01647D25736H9925l4258
17276E5667Q0697j6570L8831G0999M4756D7033J00926j5605e290l097j75130d8120
$$ y = [227252, -70727, 70349, 361119, 47947, 144203, 131797, 453705, -129490, -124529, 174232, -74186, 153991, 193272, 113591, 264868, -89096, -121027, 148102, 434370, 206797, 50111, -57814, 245169, 179902, 302161, 59016, 27864, 226868, -345558, 438853, 125830, 282912, 249285, 190192, 250799, 14637, 122899, 145836, 207362, 278647, -18420, 323830, -158387, -39603, 221168, 167369, 457394, 270199, 392046, -110223, 424001, 328080, 389859, 171342, 183477, 56222, 127090, 162563, 44904, 346046, 264432, 235153, -369141, 114838, 71355, 345670, 171908, 16203, 192912, 98434, -37722, 78420, -163499, 256246, 238208, -201647, 425736, 89925, 55667, 136364, 119794, 158625, 70999, 115755, 47033, 147959, 132354, -5290, -8387, -183517, -48120]
17263a15791C04067a35359C22537L2198a8094A63362K33027A94810e5120B06786
17252C8040N5100a5257B62492n0492n0981Q9799r5185J56907A07877J25150l9537
17241A93490p2759Q6632a8484C37562m9011j25502b7617A18123J01510K59302
17231D78935I0702A2747K03577C2301O0012L0487M1936O6289A04137J17209J57465
17220C78811E6629L9128A3353Q203J87107C4690d4352C07429a80542b1768G8440
17208A92231J96552I7874g0670C5780J93552J43895q8432J12744A46678d0596
17197B16595J73504A18091J47808M5410K41641B29658m7740L01680k35817R2722
17187C40503A10481K23856j33159J40084K1295Q5122p5131L67309A08088L00728
$$ y = [-115791, 304067, -135359, 322537, 354735, -18094, 163362, 396389, 194810, -55120, 206786, 38040, 93140, -15257, 262492, 212000, 161019, 250818, 155633, 312540, 107877, 233027, 193490, 120731, 207363, -18484, 337562, 288551, 163049, -27617, 118123, 219633, 478935, 90702, 12747, 216324, 32301, 92313, 122800, 164736, 231025, 104137, 221346, 378811, 56629, 95757, 13353, 21556, 208663, 34690, -44352, 307429, -180542, -21768, 78440, 192231, 388783, 97874, -70670, 35780, 229332, 373227, 284795, 397539, 146678, -40596, 216595, 390099, 118091, 265899, 311309, 552950, 229658, 181918, 483598, 247781, 340503, 110481, 334337, 201178, 341262, 362557, 447679, 372548, 739857, 108088, 408816]
17177D08816e5047l4560C78351M5814H9957L67787n1304a26790A99868m7775d3729
17165A88991F0924O8903M386J20959K21250k26534a59276A31247K14487J16263
17155D61997l8312k9638A02404a3351B89033r777J55415A89040G3169L9949B9925
17143B56896k5441m9043K27566A73467K72273Oe5922C36481J75907B33648H1638
17131E05765A00037O16028B04020a56933C29249K5282A02545K88087Q1944k8458
17121D44118n451J44680j44420F2101Q7254J82461m5299j3365L2530J89220A60703
17109E90265k65954j6661P6249N1140j37774N7565J7600J04446q780o5399r5500
17098C07197j00750r9683L63418j12055j52278J04648j05847R1564M10891k99326
$$ y = [408816, -55047, -89607, 378351, 424165, 89957, 457744, 406440, -126790, 199868, 152093, -43729, 188991, 60924, 129827, 134213, 255172, 476422, 249888, -159276, 131247, 345734, 461997, 423685, 394047, 102404, -13351, 289033, 279256, 434671, 189040, 73169, 113118, 29925, 256896, 231455, 182412, 409978, 173467, 445740, 445746, -55922, 336481, 512388, 233648, 81638, 505765, 100037, 716065, 204020, -156933, 329249, 354531, 102545, 390632, 472576, 444118, 438667, 583347, 438927, 62101, 149355, 331816, 286517, 273152, 305682, 494902, 160703, 590265, 324311, 307650, 383899, 435039, 297265, 354830, 372430, 476876, 468096, 402697, 307197, 206447, 106764, 470182, 358127, 205849, 310497, 204650, 296214, 707105, 407779]
17088D07779L11704l49981K12446m6524j19773B06449J60174j67768N4531M25537
17078F78923l12484p0656K22403q082J60169j61877l4630j2569j689j54265M52204
17067G57447j81834r9223j53464K16702j84565J49098k017K78712l81659K00j46441
17056B52956M56139l02912J00413j77011J44975R1254j30887k3851J97205K04245
17046H12526k16336j45628p7519j50276M17122B76749L02494q4310N9003J6047
17036E69983B81415J93893J05372J5534k3861K20064l26071M5701A90118K29378
17026D19496K75809l1622k32345J67459o3330L32726l00931k7289K19995B24966
17015G20364r2213L49398l50408j02404K79703p8327r3010M3351M18742l1970
$$ y = [407779, 719483, 369502, 581948, 535424, 415651, 206449, 366623, 198855, 253386, 678923, 366439, 295783, 518186, 510104, 670273, 508396, 473766, 461197, 459508, 305243, 757447, 575613, 476390, 322926, 539628, 355063, 504161, 502144, 780856, 399197, 399397, 252956, 709095, 406183, 506596, 329585, 474560, 565814, 434927, 411076, 608281, 812526, 596190, 450562, 373043, 222767, 639889, 276749, 579243, 494933, 553936, 569983, 281415, 475308, 580680, 596214, 572353, 792417, 466346, 512047, 190118, 419496, 695305, 663683, 431338, 598797, 535467, 868193, 567262, 539973, 759968, 224966, 720364, 628151, 977549, 627141, 524737, 804440, 726113, 633103, 676454, 1095196, 1063226]
17005A063226k25841j06169A83329N63512k60144j49512M03556q1991m3199J47896
16995G63447N4275O5523J8897r4941J01617k21287R218q8597J61761J48052k01399
16984G16566j28860k2015J49542M65207l55088p0276M0739l18254L30958q5855
16974G22664k61326L31411p0836N91463m79448K55121j34795K66953m37061J36951
16964I21097l54395L33493P7644K31213k11392o2175K44091j79235J60275j54590
16954A006026j33776j5860L35401n4252k28124J42785M68687n71623M28102j11698
16944A265668j67135Q0218L7545Q1600k21257L11878k13564K98027p5646m98617
16934H98717L81443J17567k01345J25695n5779J4509R9322k4748p2244J85996
$$ y = [1063226, 837385, 731216, 183329, 746841, 486697, 337185, 740741, 658750, 615551, 763447, 817722, 883245, 902142, 807201, 908818, 687531, 696749, 608152, 769913, 917965, 716566, 587706, 565691, 715233, 1180440, 825352, 755076, 795815, 477561, 808519, 722664, 461338, 792749, 721913, 1313376, 833928, 1089049, 954254, 1221207, 784146, 921097, 566702, 900195, 977839, 1209052, 997660, 935485, 1179576, 1000341, 1160616, 1006026, 872250, 856390, 1191791, 1137539, 909415, 1052200, 1520887, 949264, 1377366, 1265668, 1098533, 1178751, 1216296, 1297896, 1076639, 1388517, 1174953, 1472980, 1397334, 898717, 1280160, 1397727, 1196382, 1322077, 1266298, 1280807, 1380129, 1355381, 1283137, 1469133]
16924A469133m6381L5185J72089j40228j91203L10869R8747q7144k1018j60327
16914A439722K87505J63685k87089K90842m7940k56934L58342n78498M01331j71431
16904A599535l9767j49196l3894O18804k12621K05687n43175K56353Q5216J54183
16894A941125l12291O08553m86637l7634J65672j04119N2723J08593L25463j79886
16884B081562k00910J53760K237J74433J26149q7981J51461K23397k54501J73973
16874B543580j43538M5976n77775M79583J02287k1721K15152P6047K2242J66670
16864B908503j50976J15915k53573N3591K06462L004m506j11594n1522P2319J43394
16853B931017J84143K32970L3567K31336j36308m6157K42361p9547k09279J78290
$$ y = [1469133, 1422752, 1457937, 1630026, 1489798, 1298595, 1609464, 1708211, 1621067, 1600049, 1439722, 1727227, 1890912, 1603823, 1894665, 1846725, 1589791, 1948133, 1369635, 1770966, 1599535, 1559768, 1410572, 1376678, 1995482, 1782861, 1988548, 1445373, 1701726, 1786942, 1941125, 1628834, 2237387, 1750750, 1713116, 1878788, 1774669, 1827392, 1935985, 2261448, 2081562, 1880652, 2034412, 2036649, 2211082, 2337231, 2249250, 2400711, 2624108, 2369607, 2543580, 2400042, 2446018, 1868243, 2347826, 2450113, 2428392, 2643544, 2719591, 2741833, 2908503, 2757527, 2873442, 2619869, 2673460, 2879922, 2882926, 2878420, 2766826, 2715304, 2787623, 2931017, 3115160, 3348130, 3381697, 3613033, 3476725, 3430568, 3672929, 3593382, 3384103, 3562393]
16843C562393K96703k65043J84790K81350k17863K24489K13036j73872m5517K60775
16833D321241l5268M34483k05986j21482J62953P03873l99783Q4165K33661n8066
16823E119791K08929M3779L96389k88518N04341l3003p28r7025N87291M2581R6495
16812F580322K17470l08382K86149O05542k2935k04342M00551J94016K26082K85509
16802H259982l10538K88157M22355K32399K26210L09594o7503M95246q9118K50274
16792A0017058O27463L31906L53543M91083j7593L56612N19247K55444O36084
16783A3570847m2130J77478Q66463J44988N77586L32467M72046Q54628M59864
16774A7414237P50824M62850Q87645P36710M23423R04701P43622O36239J222080
$$ y = [3562393, 3859096, 3594053, 3778843, 4060193, 3842330, 4066819, 4279855, 4105983, 4060466, 4321241, 4285973, 4720456, 4514470, 4392988, 4555941, 5259814, 4860031, 4944196, 5177857, 5119791, 5328720, 5372499, 5768888, 5480370, 5984711, 5951708, 5950980, 5853955, 6441246, 6483827, 6580322, 6797792, 6489410, 6775559, 7381101, 7358166, 7153824, 7554375, 7748391, 7974473, 8259982, 7949444, 8237601, 8659956, 8892355, 9118565, 9428159, 9360656, 9855902, 9766784, 10017058, 10644521, 10976427, 11329970, 11821053, 11803460, 12160072, 12679319, 12934763, 13570847, 13528717, 13706195, 14572658, 14717646, 15295232, 15627699, 16099745, 16954373, 17414237, 18165061, 18627911, 19515556, 20252266, 20675689, 21580390, 22324012, 22960251, 24182331]
16765B4182331N54769J056501R44350J368683Q97895J604848R23879J132992J651878
16756C4318126J560855J921405J193594K220919J448538K115301K282746K393984
16748D9455468K614984K786410K717101L531810K647245L599340L579825L818323
16740G4750506M609968M072731M646071N094074N218887N535534N973574N871559
16732A15772904O225755O175188P059732O045090O584868O286513N865186N812710
16724A65827946M888740M029853L582071K706067J279180K59217j119462j500834
16716A79952778k677841m294137m379322n055310n593428o460668o506882o591575
16708A38393615o535634p001085o425080o098474n703687o121019n248368n467962
$$ y = [24182331, 24737100, 25793601, 26737951, 28106634, 29004529, 30609377, 31533256, 32666248, 34318126, 35878981, 37800386, 38993980, 41214899, 42663437, 44778738, 47061484, 49455468, 52070452, 54856862, 57573963, 61105773, 63753018, 67352358, 70932183, 74750506, 79360474, 83433205, 88079276, 93173350, 98392237, 103927771, 109901345, 115772904, 121998659, 128173847, 135233579, 141278669, 147863537, 154150050, 160015236, 165827946, 170716686, 174746539, 178328610, 181034677, 182313857, 182573074, 181453612, 179952778, 177274937, 172980800, 168601478, 163546168, 157952740, 151492072, 144985190, 138393615, 131857981, 124856896, 118431816, 112333342, 106629655, 100508636, 95260268, 89792306]
16700H9792306m991377m548012m461743m291552l622222l841400l421708k937209
16692E7677083k959790k861630k593148k358974k274842j902529j941527k256306
16684C8528337j839221j564271j455936j520588j060213j521659r85598j185092
16676B7395759j204146j247895m60988j132786j177452l43381j201630q43675
16668A9783806m55170p26617p92816l27204n80310o94629j99195o81957p05483
16659A4620425m2864r17105N8805n79461n12507k27110n88527K59038p59727n32887
16649A0778080Q3455k28791m42798k77202R7143n06399k10313n11067j44310j44083
16639H493715l24184k36914L48400n98242M484o4934n38506j06521J62973k39934
$$ y = [89792306, 84800929, 80252917, 75791174, 71499622, 67877400, 64036000, 60614292, 57677083, 54717293, 51855663, 49262515, 46903541, 44628699, 42726170, 40784643, 38528337, 36689116, 35124845, 33668909, 32148321, 31088108, 29566449, 28580851, 27395759, 26191613, 24943718, 24482730, 23349944, 22172492, 21829111, 20627481, 19783806, 19328636, 18602019, 17809203, 17481999, 16901689, 16207060, 16007865, 15325908, 14620425, 14577561, 13660456, 13719261, 13139800, 12627293, 12400183, 11811656, 12070694, 11310967, 10778080, 10861535, 10632744, 10189946, 9912744, 10009887, 9503488, 9293175, 8782108, 8637798, 8493715, 8169531, 7932617, 8281017, 7682775, 7687259, 7622325, 7083819, 6977298, 7140271, 6900337]
16629F900337j60964j86304l47741o2815k54934l15168K92854m19284J35573j90195
16619E391359J14534n6353k21781R7951n43140J21659k4081L3185m72111O7500
16609D508722j16925K38027j68215m60494K34466j7275n82942M79352l23927N6459
16599C847248o5511O3139k44159l5793k50333L7220j29099K86997m00638P3820
16589C182891j48505J13665J33640n36567M77074l50646j43389K79440j93504
16580B814099r9855j66459L39362j52344l93484K02471P0131j9342n5349l22570
16570B216660J06082j1875P7469j63820K48042m33234j49278N18455l84075L71128
16560B395554k81091Q8765k31823L70955j10955j03912k46035L78788o01574J88904
$$ y = [6900337, 6739373, 6553069, 6205328, 6142513, 5887579, 5572411, 5865265, 5445981, 5581554, 5391359, 5505893, 5449540, 5227759, 5325710, 4782570, 4904229, 4880148, 4913333, 4441222, 4508722, 4391797, 4629824, 4461609, 4001115, 4235581, 4218306, 3635364, 4114716, 3790789, 3847248, 3781737, 3844876, 3600717, 3564924, 3314591, 3351811, 3222712, 3509709, 3109071, 3182891, 3034386, 3148051, 3281691, 2745124, 3222198, 2871552, 2728163, 3007603, 2814099, 2714244, 2547785, 2887147, 2734803, 2341319, 2543790, 2613921, 2594579, 2539230, 2216660, 2322742, 2310867, 2388336, 2224516, 2472558, 2039324, 1890046, 2408501, 2024426, 2395554, 2114463, 2203228, 1971405, 2342360, 2231405, 2127493, 1881458, 2260246, 1658672, 1847576]
16550A847576Q2081N0898J8048r0793k94578O0243K67490j10526l96772K47937
16540A681604L10463k58271l17890P6394R9169j75061j04197J49833j67996J9446
16530A313494L08094k8754k01797M496J01343k71672l2525P0799J80854J60935
16520A605267m71717K34905k94236R1360n4697j18568L31533l38506K58292k52471
16510I91162M42659l32469K85657k44103o6902J48241l23256K86123R4847l19522
16500I62437O0180R9504n5556k72930J68143K71594j89907j04805K67446k28951
16490I77155j095R8058k06439Q4589R4940j53796J75151E25298K37318J93770
16480I56386J55926M4957N114l39299o3662K19817D74425L56689K47955j16012
$$ y = [1847576, 1929657, 1980555, 1998603, 1907810, 1613232, 1673475, 1940965, 1830439, 1433667, 1681604, 1992067, 1733796, 1415906, 1492300, 1591469, 1416408, 1312211, 1462044, 1294048, 1313494, 1621588, 1592834, 1391037, 1395533, 1496876, 1225204, 1192679, 1263478, 1444332, 1605267, 1133550, 1368455, 1074219, 1165579, 1110882, 992314, 1323847, 985341, 1243633, 991162, 1433821, 1101352, 1387009, 1142906, 1076004, 1224245, 900989, 1187112, 1281959, 962437, 1022617, 1122121, 1066565, 793635, 961778, 1233372, 1043465, 938660, 1206106, 977155, 976060, 1074118, 867679, 952268, 1047208, 893412, 1068563, 525298, 762616, 956386, 1112312, 1157269, 1162383, 823084, 759422, 979239, 474425, 831114, 1079069, 963057]
16470I63057K08264l52785j3149L04982L2360k21599L0652j85382j09389J44128
16460H01139l04628K98321p5603C25437N95091k30504J40853j70777J58954m8827
16450G70227J6580J0717M1183k00239K71466j71254P1544k76740J24163j4545
16440F43102k3966M6093j58039J21379k05874K20133N2659r4177p7938N3928R9729
16429F77029L6602N3907B95757L54763n1754K83390l15807j52927Q5620L2005
16419E31047J67064J36146B92361K05299K13347K0818A88393M60514B79731N25924
16409H05655j41388n518Q359l946k2795k91741J16690J0406K36464m2883j42123
16398E27180k46381R9670j55325L52398K31119A82779L32201l3816r5387L8082
$$ y = [963057, 1171321, 818536, 805387, 1110369, 1142729, 921130, 951782, 766400, 657011, 801139, 496511, 794832, 719229, 325437, 920528, 690024, 830877, 660100, 819054, 770227, 786807, 797524, 838707, 638468, 909934, 738680, 810224, 533484, 657647, 643102, 619136, 665229, 507190, 628569, 422695, 642828, 695487, 601310, 523372, 577300, 677029, 713631, 767538, 295757, 650520, 598766, 882156, 566349, 413422, 499042, 531047, 698111, 834257, 292361, 497660, 711007, 731825, 188393, 648907, 279731, 805655, 664267, 658749, 667108, 663162, 640367, 348626, 465316, 475722, 712186, 669303, 527180, 280799, 380469, 225144, 577542, 808661, 182779, 514980, 481164, 385777, 423859]
16388D23859J12823K25222C49213Q3776j29457J85740j87406Q7256J59524A84706
16377A70020K32044A44454J08248N4051J17248O7627d7871F82135A40168K48510
16367C88678m5463Q2904J06122o0530B33899J36605L12146B37529J86807J54359
16357E78695A26690L78813M5018A98019J18592J23189k00748o7155J35061H9471
16346C64427J64383j33808q7048j20536k8974K30702A78262M9670D4762N29524
16336E74286J33389A56723J30142M00351C33672A59145L37342L5826r2765j06651
16326C32897j23169L67193p1593j61636B3320M41839B30490A495N68565j30336
16316D39724j50560j31816N4301l9025q0223B1330M2104K8615O6949E8940K67623
$$ y = [423859, 536682, 761904, 349213, 432989, 303532, 489272, 301866, 389122, 548646, 184706, 170020, 402064, 144454, 252702, 306753, 424001, 491628, -47871, 682135, 140168, 388678, 343215, 426119, 532241, 471711, 233899, 370504, 682650, 237529, 424336, 578695, 126690, 505503, 550521, 198019, 316611, 439800, 239052, 171897, 306958, 89471, 364427, 528810, 395002, 307954, 187418, 158444, 389146, 178262, 227932, 44762, 574286, 707675, 156723, 286865, 687216, 333672, 159145, 496487, 532313, 439548, 332897, 209728, 576921, 505328, 343692, 23320, 465159, 230490, 1495, 570060, 439724, 289164, 157348, 211649, 172624, 92401, 21330, 63434, 92049, 158998, 58940, 326563]
16305C26563j4959B7344L24174j37669R5706J76677J56275A93861J41017A25308
16294g730A91153P6877n7069j5082K58016j88107M4307g5580D14744g969C20896
16282E28279k12407q146A48508c911B92920j29963E4962J13045K05614q6591H8469
16270a03479A09198L92822B28549D9590K52501a36655B40076o7222O650J14123
16260B93627j10228p7634J38829q1926m5654N559d34818H4763J92426F9630e0275
16248C69967J10903g0870B25948K22392k23703k719f2778D43862a74283C24870
16237b55939F3422h589E7012M4235q211D0829H278K37125g1854m01951C39784
16225B28591a03541B17143J94420m7019b19625A17042N4901J92148j54865c9461
$$ y = [326563, 311604, 27344, 351518, 213849, 309555, 486232, 642507, 193861, 334878, 125308, -7730, 191153, 268030, 210961, 195879, 453895, 265788, 310095, -75580, 414744, -7969, 320896, 528279, 315872, 307726, 148508, -3911, 292920, 162957, 54962, 168007, 373621, 287030, 88469, -103479, 109198, 502020, 228549, 49590, 302091, -136655, 240076, 172854, 179504, 293627, 183399, 105765, 244594, 162668, 117014, 122573, -434818, 84763, 277189, 69630, -50275, 369967, 480870, -70870, 225948, 448340, 224637, 221918, -62778, 443862, -174283, 324870, -255939, 63422, -8589, 57012, 101247, 93036, 40829, 8278, 245403, -71854, -473805, 339784, 228591, -103541, 217143, 411563, 364544, -219625, 117042, 171943, 364091, 209226, -39461]
16214A62656g760j24900F0101L79091A31119J18830q7075a69998C84213j16890
16204B67323N7477j33784J14324c55158E4774J76669C6607K05641a04736B07506
16193B51419o3510f5537C0047K6475a13492A55272J05344a73570B15091h1741
16182B50514A07603B3302Q9238k1214L3935L2125J44337A6536J36065a58008d9376
16170a8308B39032K06331B05736N8716j02933a39798A21774J4250R9189r2419
16160A42794O0566A0469d9741A10165K07576j53416b74937a04353A20034b38037
16149A40155J33346a53650K2986G5567K7069b93138B32725E5025h8821k7058p0770
16138a86649H6136J75005A04868k3960L7356b37912A81796a19443C24397a34507
$$ y = [162656, -7760, -132660, 60101, 439192, 131119, 249949, 162874, -169998, 384213, 267323, 324800, 191016, 305340, -355158, 54774, 231443, 36607, 242248, -104736, 207506, 251419, 187909, -65537, 30047, 56522, -113492, 155272, 260616, -173570, 215091, -81741, 250514, 107603, 23302, 112540, 91326, 125261, 157386, 301723, 16536, 152601, -158008, -49376, -18308, 239032, 445363, 205736, 264452, 161519, -139798, 121774, 136024, 235213, 142794, 203360, 10469, -49741, 110165, 317741, 164325, -274937, -104353, 120034, -238037, 140155, 273501, -153650, -130664, 75567, 102636, -293138, 232725, 55025, -88821, -115879, -186649, 86136, 261141, 104868, 80908, 118264, -237912, 181796, -119443, 324397, -134507]
16127B18095I499c03236A95441B163b4829A16968f2252j09173C9374M65506A57849
16115a29280A56678h5504I2510J18794A04394a24704F6876o858O0343a62303D47175
16103A8066L3101k1469Q5351J64147J27888A75258j5455D130b8753m810E7033
16091a48947J1271N5613B49664a08820j56657H6703M1679a94398h2547d0470B18894
16079d121A15449h530B70931A11175N349d3048A7851K41143a36537A42287J27957
16068B70244q1724q0314c3121m0427a5683A2950e3525b6271G412h4508A59206
16056A8700J50692J76630E5032K18041l0652J5882m8338p7564d0562A16086c31477
16044A10313J37334e1406j49639d7930a8852D37053A98719i8038L7768j88934
$$ y = [218095, 9499, -303236, 195441, 2163, -24829, 116968, -62252, -171425, 39374, 504880, 157849, -129280, 156678, -85504, 92510, 211304, 104394, -124704, 66876, 60018, 120361, -162303, 447175, 18066, 51167, 29698, 115049, 279196, 407084, 175258, 159803, 4130, -28753, -33563, 57033, -148947, -137676, -82063, 249664, -108820, -265477, 86703, 128382, -194398, -82547, -40470, 218894, -4121, 115449, -8530, 270931, 111175, 116524, -43048, 17851, 258994, -136537, 142287, 270244, 188520, 108206, -33121, -73548, -15683, 12950, -53525, -26271, 7412, -84508, 159206, 18700, 169392, 346022, 55032, 273073, 242421, 258303, 209965, 132401, -40562, 116086, -331477, 110313, 247647, -51406, -201045, -47930, -18852, 437053, 198719, -98038, -60270, -249204]
16034b49204P2810F5697a1108A14943A3525L33882b62187A24723c33172e5996
16023A10477a23339j95214f9224a1928B28587a70774n4812I8559L02654c99289
16012a26921d6811B34612j05373J1666l4924a13408q8442A95020e4649B8302b7901
16000a81409h5601k2827d4769j33291A80943h2969j4281H1764g4827B85744B2675
15988d682j58973L0413B77056k6473J24675l2564J00583j62767K7805g1312D27672
15976B63406j23489e0029A49528M0159P3484A24846a90908B58091a63453p6825
15966b40278D55d22845J93285b9435j30556G8251b24435F7200c9361o9137a5838
15954c66878E0868k3270J69966a10516B4949a47424E3653b79011i003B66332J3076
$$ y = [-249204, -176394, 65697, -11108, 114943, 13525, 347407, -262187, 124723, -333172, -55996, 110477, -123339, -318553, -69224, -11928, 228587, -170774, -225586, 98559, 401213, -399289, -126921, -46811, 234612, 129239, 140905, 105981, -113408, -201850, 195020, -54649, 28302, -27901, -181409, -85601, -108428, -44769, -178060, 180943, -82969, -97250, 81764, -74827, 285744, 22675, -4682, -163655, -133242, 277056, 250583, 375258, 342694, 443277, 280510, 308315, -71312, 427672, 263406, 139917, -50029, 149528, 189687, 263171, 124846, -190908, 258091, -163453, -240278, 455, -422845, -229560, -29435, -159991, 78251, -224435, 67200, -39361, -108498, -15838, -366878, 50868, 27598, 197564, -110516, 24949, -147424, 53653, -279011, -9003, 266332, 279408]
15943B79408a59080A7933b78223N855b2274q3275G7213L9656h5066K6688B02529
15931A61018f5754n7308a7597A38119a8123B4283J18011Q423D8368O328d9611
15919a47094k48495J68867B7160a98065A23417C9437f3976A30110f8383A03760
15908a18814D9925i1703I0578b75543J09767J2944q7140d1735A17184c9462B79448
15896A8761f6344j28679E2414d11912C5993c5884C9475i8899k3958A44062N6525
15885B00587d5225H5000f395A65825a16827A63683n8439b72555d10j0782E4497
15873F0361k7656P0291i565l7971a0444n61934a8176j18163B17089b12027l36321
15862e48348B58780m7622d1157k35074J08619M4701E9323a5126B5481J13439H009
$$ y = [279408, -159080, 17933, -278223, -272368, -22274, -105549, 77213, 116869, -85066, -58378, 202529, 161018, -65754, -123062, -17597, 138119, -18123, 24283, 142294, 150717, 48368, 54696, -49611, -147094, -395589, -226722, 27160, -198065, 123417, 39437, -63976, 130110, -68383, 103760, -118814, 49925, -91703, 90578, -275543, -165776, -152832, -239972, -41735, 117184, -39462, 279448, 18761, -66344, -195023, 52414, -411912, 35993, -35884, 39475, -98899, -122857, 144062, 200587, -45225, 85000, -6395, 165825, -116827, 163683, 105244, -272555, -410, -11192, 54497, 60361, 32705, 102996, -9565, -47536, -10444, -572378, -18176, -136339, 217089, -212027, -548348, 258780, 211158, -41157, -276231, -167612, -122911, 59323, -15126, 25481, 138920, 8009]
15850H2809a01247l57926f5702E3320e3370p9229H2228b57793N8498c1117a3182
15838b11403n3828J1957A35163j0844J0732D6109a43662O3372j5650j03629a7096
15826A0866J27170J2658K322b09513a02400A6505M9413K9794K439a23664l5551
15815a59215j8494f1498B76983b78962k04702A7264a15878H4673Q7554a26944
15804C32628D5023O694Q9161g01946L26875a03460K3625G8687Q5451j6967b41821
15792B0437K52682b24267h2906b1920k41751b5804k8814k05059a9693j13416A10056
15780H7486b22318m5560f2763k25701Q8963J2959P9490J5301A66936f2015E04967
15768F003b20970f7016l9645B4537d5532k08152R3691B20867J23303H8197b34604
$$ y = [82809, -101247, -459173, -65702, 53320, -53370, -132599, 82228, -257793, -199295, -31117, -13182, -211403, -265231, -253274, 135163, 124319, 135051, 46109, -143662, -80290, -95940, -199569, -17096, 10866, 138036, 150694, 153016, -209513, -102400, 16505, 65918, 95712, 98151, -123664, -159215, -177709, -61498, 276983, -278962, -483664, 17264, -115878, 84673, 172227, -126944, 332628, 45023, 51717, 140878, -701946, -375071, -103460, -79835, 78687, 164138, 147171, -241821, 20437, 273119, -224267, -82906, -21920, -263671, -25804, -54618, -259677, -19693, -133109, 110056, 87486, -222318, -267878, -62763, -288464, -199501, -186542, -107052, -91751, 166936, -62015, 504967, 6003, -220970, -67016, -106661, 24537, -45532, -253684, -159993, 220867, 344170, 88197, -234604]
15756b2998E1257f1010A23796k6545a54982j23002I7016i6570i563j1645r442
15745c0650A01520a75850B37443a19300a4275B74812A18844J20985j8597G4989
15734b35898j09257N8425g0385B52416d9681n5908c3713B18712a7013B72232C6869
15722C30277a34987M1915A11660a2109m2084F1798P6469b30365f6761f093k88141
15711b94234a27489E5788Q5967k8853c24882f4172l1293q6262j00180C24398h032
15699A8282a22083m4519H881K63835a63674b8693A96135m0352J48052g1843j21962
15688a93805l7148A05469c20338e3755A28151j022E3557g3725l0478D2879i7674
15676c38871d6316B3110M2833B1701J69599a02431C71411I9781a92819a6315p5333
$$ y = [-22998, 51257, -61010, 123796, 97251, -154982, -277984, 97016, -96570, -9563, -21208, -30650, 101520, -175850, 237443, -119300, -14275, 274812, 118844, 239829, 221232, 74989, -235898, -345155, -286730, -70385, 252416, -49681, -105589, -33713, 218712, -17013, 272232, 36869, 330277, -134987, -93072, 111660, -12109, -54193, 61798, 138267, -230365, -66761, -6093, -294234, -127489, 55788, 141755, 112902, -324882, -64172, -95465, -181727, -281907, 324398, -8032, 18282, -122083, -166602, 8881, 272716, -163674, -28693, 196135, 155783, 303835, -71843, -193805, -230953, 105469, -320338, -53755, 128151, 127129, 53557, -73725, -104203, 42879, -97674, -338871, -46316, 23110, 65943, 21701, 191300, -102431, 371411, 99781, -192819, -16315, -91648]
15665i1648A6259L49564I3207b89242c4077j6424r9079B25775I3727a99068A64427
15653b29102m7404A67091a59674C4044a4152B29961c8206C78224B2628J22748
15643A45376B4486J1241a6086p9148A34919g982j83052i072r9956Q593A44913
15631h2833A53875K24134a2257A6365h4431B13717a99336A42065a0656E4518a22662
15619a38794B26210G3245f3777C7885q224c82997B6509a48788G9532e8098C10006
15607a299A20628e4171j78513D8614a82332A29720J59108c67816C10670A4358
15596a14514A55507J53263d05029E7437c75710J49822K9608c6079j2094C4772
15585A88116c3211B01540Q3195A3280a31794b8002k25604M8744j21348C9070b08139
$$ y = [-91648, 16259, 365823, 93207, -289242, -34077, -50501, -149580, 225775, 93727, -199068, 164427, -229102, -276506, 167091, -159674, 34044, -14152, 229961, -38206, 378224, 22628, 145376, 24486, 35727, -16086, -95234, 134919, -7982, -191034, -9072, -109028, -100435, 144913, -82833, 153875, 378009, -12257, 16365, -84431, 213717, -199336, 142065, -10656, 54518, -122662, -138794, 226210, 73245, -63777, 37885, 29661, -382997, 26509, -148788, 79532, -58098, 310006, -1299, 120628, -54171, -232684, 48614, -182332, 129720, 288828, -367816, 310670, 14358, -114514, 155507, 308770, -405029, 57437, -375710, -225888, -196280, -36079, -48173, 34772, 188116, -33211, 201540, 284735, 13280, -131794, -28002, -253606, -204862, -326210, 39070, -208139]
15573d0745E3246j6758c14394A96137b01023c5602A1591a92110A92612b44330
15562b90681A34785D2658N8634d0525A57685a9630A7504J9818Q5979c19147f108
15550b76804H9931b44670B04070a19630C43565f8120j9346b7653l49086F5324
15539G7465a71810g2955j12470F2795b17641Q7310j61646a38056A26966d4736
15528a86043a374r3801j67338r6855J71921H1854e1291l7020k121j40533B27902
15516A25864N4123a44652f9510P255n2145A78353G3511A1701d15254a37979E6359
15504a16318C12023A40819f7931A57440o9982l4174a38240k571m1184A344K02871
15493B04215n7301a06361p6382H3694a03448E0600b72359C8139K12485b47093
$$ y = [-40745, 53246, 36488, -314394, 196137, -201023, -35602, 11591, -192110, 192612, -244330, -290681, 134785, 42658, 101292, -40525, 157685, -19630, 17504, 37322, 123301, -319147, -6108, -276804, 89931, -244670, 204070, -119630, 343565, -68120, -87466, -27653, -376739, 65324, 77465, -171810, -72955, -185425, 62795, -217641, -130331, -291977, -138056, 126966, -44736, -186043, -1374, -95175, -262513, -359368, -187447, 81854, -51291, -88311, -90432, -230965, 227902, 125864, 179987, -144652, -69510, -62255, -114400, 178353, 73511, 11701, -415254, -137979, 56359, -116318, 312023, 140819, -67931, 157440, 87458, 53284, -138240, -140811, -181995, 1344, 204215, 146914, -106361, -182743, 83694, -103448, 50600, -272359, 38139, 250624, -247093]
15482i155k18552b1171B99278a59440L5627B24704D7323c0672r9327C8832J52603
15471A91435K0820o0572J12422b55581j39084C08547f2393a6610j4962p3940j04406
15460b09918E36190a03954B69561h6227L5068B3140J9928a47010A43482J64821
15450C08303A16351a02206b5990m98983b3001A43726j2524a48452A12116C8152
15439c05197n4678G0122K32262a68492C6985J09801G3198l5351J09796a41598
15428b4741j5301o7416k1805N4727B38494c2072B10707o5414a20248B19793J02672
15417C22465D8510a27328A19614a09479N1414D72484d13754a62699L2840p4725
15407b04584A41703b45595F7482c2471A31472D3249J61979A0135Q6791a43410
$$ y = [-9155, -227707, -21171, 299278, -159440, -123813, 224704, 47323, -30672, -129999, 38832, 191435, 212255, 151683, 264105, -255581, -394665, 308547, -62393, -16610, -31572, -105512, -209918, 536190, -103954, 269561, -86227, -51159, 23140, 43068, -147010, 143482, 308303, 116351, -102206, -25990, -524973, -23001, 143726, 131202, -148452, 112116, 38152, -305197, -359875, 70122, 302384, -168492, 36985, 146786, 73198, 37847, 147643, -141598, -24741, -40042, -107458, -129263, -74536, 238494, -32072, 210707, 145293, -120248, 219793, 322465, 48510, -127328, 119614, -109479, -58065, 472484, -413754, -162699, -129859, -204584, 141703, -245595, 67482, -32471, 131472, 43249, 205228, 10135, 96926, -143410]
15396A27695c64828M7361B94995i150p1040D3557L2597B767b55189A07125g7880
15384b2616k47512B67341a66117k04626i9782A83782g0226j82106E3444j6175
15374C7269O5799K39848H1244c46227A54925i657C04761d5799A94060j1138m263
15363A78659p5239C943N706L004a43945q2300g4417m00237B15575q3667e541G6845
15350B44437a87678P6381l3273j57174a5896p6305b3350H0972a50594D065a54643
15338A43394k1447d8885A55987a48352a928j80334a3629A9073a19609B74039j35185
15327A38854a52230A24752J54736j26200p4527c5142j06980G1511M8019k8960
15317I0570c17850G5247R6222c3189A94316F6452L38440A4710J51582d12B96790
$$ y = [127695, -364828, -317467, 294995, -9150, -80190, 43557, 76154, 2767, -255189, 107125, -77880, -22616, -270128, 267341, -166117, -370743, -99782, 183782, -70226, -252332, 53444, 37269, 103068, 342916, 81244, -346227, 154925, -9657, 304761, -45799, 194060, 182922, 178659, 103420, 3943, 9649, 12653, -143945, -226245, -74417, -474654, 215575, 131908, -5541, 76845, 244437, -187678, -111297, -144570, -301744, -15896, -92201, -23350, 80972, -150594, 4065, -154643, 143394, 121947, -48885, 155987, -148352, -1928, -182262, -13629, 19073, -119609, 274039, 138854, -152230, 124752, 279488, 153288, 78761, -35142, -142122, 71511, 119530, 90570, -317850, 75247, 171469, -33189, 194316, 66452, 404892, 14710, 166292, -412, 296790]
15305A4421b1165m6403p027j7527j15335h41q042B29456M3974M3619a13192A44019
15292E2163a03893d1572A92100c6638o2700A6249b1726j48383N1165A50937b46658
15280a18933C08569c3146C1561K53908j22354b09570M0707A17048M6234i4497
15269C05884C6642a67773A82655l3963F6268i8133K4002B9488c39547G906i8418
15257A33332c6405p0289m6085A73946K18822F58L07552d8609o1165H4708L33939
15246D18647j84165c675k46864F9523A5371J47690P2631F1191J06935c64514h9501
15234G8431d8519A99369c29342J53099C27724j61172a00148C07380r7596P9596
15224B89380G5345a94087C19171d8374k10929a15955A29184K7846f3326j89172
$$ y = [14421, -21165, -67568, -74595, -92122, -207457, -841, -8883, 229456, 273430, 317049, -113192, 144019, 52163, -103893, -41572, 192100, -36638, -99338, 16249, -21726, -170109, -118944, 150937, -246658, -118933, 308569, -33146, 31561, 285469, 163115, -209570, -168863, 117048, 163282, -94497, 305884, 36642, -167773, 182655, 148692, 66268, -98133, -74131, 29488, -339547, 7906, -98418, 133332, -36405, -106694, -152779, 173946, 392768, 658, 308210, -48609, -109774, 84708, 418647, 234482, -3675, -250539, 69523, 15371, 163061, 235692, 61191, 168126, -364514, -89501, 78431, -48519, 199369, -329342, -176243, 327724, 166552, -100148, 307380, 209784, 289380, 75345, -194087, 319171, -48374, -259303, -115955, 129184, 157030, -63326, -252498]
15214b52498F6230O5411J33778K89855b19225c1514A37260J83652c29768a28834
15203A9256L28174M1325I1789J09101q8213M0591F3757K4782Q9078H2883k525
15192H0358G985J30024f6558B57359c19874a741A52264b7967A84273g84D80851
15180E1566R5846g6493B72434H8764l2671c9288B78221b10868C2977P1609D0968
15168A97149g5425j64742B73833e4608B19674J07341g5538A21447J37039j14156
15158A44330n2625c501H698P7454C3138c19174H4059K62310a30681H9822m4882
15147D4940p425J40772a47943N9242C92044b93043A62311M7981P441o6948G2941
15135H5539k6062j4895a80938g7370B70858G647J64397b7159A4820J9067a02530
$$ y = [-252498, 66230, 131641, 265419, 555274, -219225, -31514, 137260, 320912, -329768, -128834, 19256, 347430, 388755, 91789, 200890, 112677, 153268, 63757, 88539, 177617, 82883, 80358, 7985, 138009, -66558, 257359, -319874, -1741, 152264, -27967, 184273, -784, 480851, 51566, 147412, -76493, 272434, 88764, 56093, -39288, 278221, -210868, 32977, 104586, 40968, 197149, -75425, -240167, 273833, -54608, 219674, 327015, -75538, 121447, 258486, 144330, 91705, -3501, 8698, 86152, 33138, -319174, 84059, 346369, -130681, 89822, 44940, 37515, 178287, -147943, -88701, 392044, -293043, 162311, 210292, 217733, 150785, 72941, 85539, 59477, 44582, -180938, -77370, 270858, 7647, 172044, -27159, 14820, 33887, -102530]
15123A32290n6867J31572a60081A19533E3666a64049b8764j87550R7777b992A52061
15111E0815K97025A61774c02046k425C42401j33964K7231B2706J91151F2586f8837
15099B49152c1216A1015R1309J8750E7655H043j312K7262K40024b5160k85401
15088c10561C98315j85912J15575K947p9862i6477A11314e134A92500C1507M0363
15077G1870N7659l1242i88D24996C1436K99183j45566c5080F1900J12443q861
15066A65482K1139p2521q670M15250k9452j76453j30260K22894C2030K04102C0024
15054b97299A6210K54262J58951a34239B75839j37609J07405L0905L45199C02613
15043C30176j40353r2587a83971B48488K7631r9764b12580B15048K11656b52777
$$ y = [132290, 75423, 206995, -160081, 119533, 53666, -164049, -28764, -216314, -118537, -2992, 152061, 50815, 347840, 161774, -302046, -304471, 342401, 208437, 235668, 22706, 213857, 62586, -68837, 249152, -31216, 11015, 102324, 121074, 57655, 8043, 6731, 33993, 274017, -25160, -310561, 398315, 212403, 327978, 330925, 251063, -96477, 111314, -5134, 192500, 31507, 71870, 129529, 98287, -988, 424996, 31436, 330619, 185053, -35080, 61900, 174343, 165482, 186621, 114100, 105430, 520680, 491228, 314775, 184515, 407409, 32030, 236132, 30024, -297299, 16210, 270472, 429423, -134239, 275839, 138230, 245635, 276540, 621739, 302613, 330176, 189823, 97236, -183971, 248488, 276119, 176355, -212580, 215048, 426704, -252777]
15032A52639i5136K1973B68573J4266K19372N9583B4449K90916F2547f7444A97310
15020C85495C4751J50839J84442j18460B045J82934K71446A43540J75695A48490
15009i0284B08360L0436j10542K15345e6473A17288a1483C9689L11618j16790
14999B34517A14536N5015n6617K20871I9209a02611B68486j02701D5489L8018
14989H3507P9438L00383j58637A49471Q4796B7508J38310K683L4391r0724J87069
14978B99237A12450i1369B45966a55911C88144A26605J60132A28368B3153a1717
14967c1970A25715d8397B71735K35199k38897J02248J27390A33004k8098K69698
14957C74604j71070j2002m3959L09158A56037J7809K5993o9867O4454J55994j31689
$$ y = [152639, -95136, -73163, 268573, 282839, 502211, 561794, 24449, 315365, 62547, -67444, 197310, 385495, 34751, 185590, 370032, 251572, 2045, 184979, 456425, 143540, 319235, 148490, -90284, 208360, 238796, 128254, 343599, -56473, 117288, -11483, 39689, 351307, 234517, 114536, 169551, 112934, 333805, 99209, -102611, 268486, 165785, 45489, 83507, 162945, 463328, 304691, 149471, 234267, 27508, 165818, 168501, 202892, 112168, 299237, 112450, -91369, 245966, -155911, 388144, 126605, 286737, 128368, 23153, -11717, -31970, 125715, -48397, 271735, 506934, 268037, 370285, 497675, 133004, 104906, 374604, 203534, 191532, 147573, 456731, 156037, 173846, 199839, 129972, 194426, 350420, 218731]
14946B18731J09352a36505A37027J40238j3560p4644l3754K1531J82415M9908
14936D09161N304o2429J49819P3964k33832l870J8131c3004E07105j2321m2558
14925D52226j62182E2494L96598k20255m559K99033k00799k0633A39513K09130
14915C48643A09927M79418k59343A30631J07662a8186E00510A92159Q1037J635
14905B74831f6855B25085F85N73160A00458M26316r2370B09531J91990n832q2676
14894C13013n6827H7409j8280N01163j80004l6335G5461J2260J75981K7330a55031
14882E48140j39632A96414M39055K9334C29000p4099k4002F4167M64353l8389
14872D90131m9790j00520m0888m2922A00439J22686K30180a10093D34376j81678
$$ y = [218731, 328083, -136505, 137027, 277265, 263705, 189061, 155307, 176838, 359253, 409161, 414465, 352036, 501855, 575819, 341987, 338117, 356248, -33004, 507105, 494784, 452226, 290044, 52494, 449092, 228837, 224278, 523311, 322512, 301879, 139513, 348643, 109927, 589345, 330002, 130631, 238293, -18186, 500510, 192159, 273196, 274831, -66855, 225085, 685, 573845, 100458, 526774, 434404, 209531, 401521, 395689, 313013, 256186, 87409, 69129, 570292, 390288, 353953, 75461, 87721, 263702, 291032, -155031, 548140, 408508, 196414, 635469, 664803, 329000, 254901, 230899, 64167, 528520, 490131, 440341, 339821, 298933, 256011, 100439, 223125, 453305, -110093, 434376, 252698]
14862B52698K57374j29656n3350L48266A15283K73555p9680M3906F7365M53270
14852E20635J40341k06357q1328o1930B3222N30630k27653J35312j23962j50644
14842A86905L73983j77482L8274K87152B81378O7151R8750J41756r931j78822
14832D00282N902j77101Q5511l2241M43253m0804j68839A77651L91286p9334m0244
14821D49359J40316q4624L1864p8784j92884A01712K90239N6335K96328k81015
14811D63599P1550r03O8745A78396K40194j20387K55513q9105J36356H2262L53199
14800D35461M62064C14457J52446J77355j64444J15150j60788K25438p8926Q5203
14790F65891j74822N7111K9957J11784P4005q4430J01646K4669k35081o8817m3504
$$ y = [252698, 510072, 380416, 327066, 675332, 115283, 388838, 309158, 353064, 67365, 520635, 660976, 454619, 373291, 311361, 23222, 553852, 326199, 461511, 337549, 186905, 560888, 383406, 421680, 708832, 281378, 348529, 447279, 589035, 579104, 400282, 406184, 229083, 314594, 282353, 725606, 684802, 515963, 177651, 568937, 489603, 449359, 589675, 505051, 536915, 458131, 265247, 101712, 391951, 448286, 744614, 463599, 535149, 534246, 602991, 178396, 418590, 298203, 553716, 464611, 600967, 82262, 435461, 897525, 314457, 466903, 644258, 479814, 594964, 434176, 659614, 580688, 665891, 491069, 548180, 578137, 689921, 763926, 679496, 781142, 805811, 570730, 501913, 458409]
14779D58409J3963M19340D39944R2135L78431m23077N7048j86857L31782k58003
14769D31403L3145k5893L75701l06315J34800j15563j5449L6883K69174j52152
14759F65734l7748K38547C80929L48630m9428M4639K45547C56322P3948L14541
14749G44811j2389j9504l9609k5748B78305R19227m10726l13115o5030M71410
14739H80071l47669r6004L15090m035K9310k99657K83001j55660p7799K89005
14729H15653j79812j39344J78397l632o7366M45329m38351J82102l2521K15197
14719I75652k81743K30751r6465l45624J304M39203m11715K96580Q1628k3180
14709H66391k8612r6425j088K06008k82026R5049k36036P77397o02285M72782
$$ y = [458409, 472372, 891712, 439944, 532079, 910510, 487433, 544481, 357624, 689406, 431403, 464548, 438655, 814356, 508041, 642841, 527278, 511829, 548712, 817886, 665734, 627986, 866533, 380929, 729559, 680131, 724770, 970317, 356322, 430270, 744811, 732422, 712918, 673309, 647561, 278305, 1197532, 786806, 473691, 408661, 880071, 532402, 436398, 751488, 747453, 776763, 477106, 760107, 604447, 526648, 815653, 635841, 496497, 674894, 671262, 603896, 1049225, 610874, 792976, 760455, 975652, 693909, 924660, 828195, 482571, 483875, 923078, 511363, 807943, 889571, 866391, 837779, 741354, 740266, 946274, 664248, 759297, 523261, 1300658, 698373, 1171155]
14699A171155k69886J24397k70080J23611P6876n0565j85005K60784k80225J67470
14689H68532l70177Q23074k86691O6044j71608l7655j30003O98896o92790J62903
14679I30525j1858n3556j05587J17309j55938J99752K42718m63207K00378L0158
14669I30694L26521j40844K2276l50197J13565K78298L2539k5352m72188J14167
14659H29479K40552R8679K48284n55750J06375K618J20301m14166N84994k09960
14649A051406K79713m63622J79842J68251J4352j10306J74157n675j6895O0745
14639A331968R0974j36624j47939L77340l38533J54722k76383J93598K24634J39392
14629A613149l24985O25J25604q6257j89503J69907L8329Q936K62917l94902L42452
$$ y = [1171155, 901269, 1025666, 755586, 879197, 956073, 905508, 720503, 981287, 701062, 868532, 498355, 1321429, 1034738, 1100782, 929174, 891519, 761516, 1460412, 767622, 930525, 918667, 865111, 759524, 876833, 720895, 920647, 1163365, 700158, 900536, 930694, 1257215, 1116371, 1138647, 788450, 902015, 1180313, 1212852, 1187500, 715312, 829479, 1070031, 1168710, 1416994, 861244, 967619, 970237, 1090538, 676372, 1261366, 1051406, 1331119, 867497, 1047339, 1215590, 1229942, 1119636, 1293793, 1288118, 1271223, 1331968, 1422942, 1286318, 1138379, 1515719, 1177186, 1331908, 1055525, 1249123, 1473757, 1613149, 1288164, 1288789, 1414393, 1328136, 1138633, 1308540, 1346869, 1355805, 1618722, 1223820, 1566272]
14618A566272k38656L2715m7624O071O50833o97414L06085L4366k70291J15030
14608A457387K17267j04793J8999r6759J9344J50839Q7344j61357R6200j47293
14598A537178j07027L43461k53188K09194n2002K14641m54447K29276j11352L42115
14588A897849k04338l69653O05904j64237r2335M19154P621k73220p8224L42165
14578B090686K70251m43723J39088L8564J25836k37956J02127L55764q7427r7472
14568B255738j97544K80590P0415l92883M54074n1636J89424l7130J89761l5220
14558B725589k6285J296M59317K04318K09274J76851N52216M57158J316838K404324
14548H480896M520869R704428J0877023Q245364B0695913H880350D172669j284400
$$ y = [1566272, 1327616, 1360331, 1312707, 1318778, 1969611, 1272197, 1578282, 1612648, 1342357, 1457387, 1674654, 1569861, 1588860, 1492101, 1511445, 1662284, 1749628, 1588271, 1684471, 1537178, 1430151, 1773612, 1520424, 1729618, 1677616, 1892257, 1437810, 1667086, 1555734, 1897849, 1693511, 1323858, 1929762, 1765525, 1673190, 2092344, 2099965, 1826745, 1748521, 2090686, 2360937, 1917214, 2056302, 2094866, 2220702, 1982746, 2084873, 2440637, 2353210, 2255738, 2058194, 2338784, 2409199, 2016316, 2470390, 2418754, 2608178, 2571048, 2760809, 2725589, 2699304, 2700600, 3159917, 3364235, 3573509, 3750360, 4302576, 4759734, 6076572, 8480896, 13001765, 22706193, 33583216, 41828580, 20695913, 8880350, 4172669, 2888269]
14540B888269l39884k13317l13712m9924o983K06731k36930O6761j38768J90145
14530B052388J41773m30409Q88734n80889K98060P887j61158K15442j01223j62438
14520B168167L38747r2236J74651l02588L43241J14959M06188p67638J72565J44102
14510B700158l6051O87657l71164R47o63361P45380m86312J81378M48389j91062
14500C015959Q2447J13288P2589o6902M38598n10701K52845K2038l22005N23172
14490C621328p8211j04210K76547k93107N29598j73472J87475m1572l14181M40624
14480D050819l76115K39728o1386K58484j24711k89318M26597k27962L73228l017
14470D266347k29055L95714n2174O5087J34004k60140K15670P3922K28918M370
$$ y = [2888269, 2548385, 2335068, 2021356, 1971432, 1964449, 2171180, 1934250, 2001011, 1862243, 2052388, 2194161, 1763752, 2652486, 2071597, 2369657, 2377544, 2216386, 2431828, 2330605, 2168167, 2506914, 2414678, 2589329, 2286741, 2629982, 2744941, 3151129, 2383491, 2556056, 2700158, 2664107, 3351764, 2980600, 2981547, 2318186, 3063566, 2577254, 2758632, 3207021, 3015959, 3098406, 3211694, 3284283, 3217381, 3655979, 3145278, 3398123, 3420161, 3098156, 3621328, 3543117, 3438907, 3715454, 3422347, 3951945, 3778473, 3965948, 3924376, 3610195, 4050819, 3674704, 3914432, 3853046, 4111530, 3986819, 3697501, 4124098, 3896136, 4269364, 4266347, 4037292, 4433006, 4380832, 4445919, 4579923, 4319783, 4535453, 4609375, 4838293, 4842663]
14460D842663L8824K04812j17956M30940k72090O6479k43654K4905L42547J14834
14450E432304j33345K39653J10763l1052K17939p1084J42551l5216K21312m45041
14440E648784K76545K58259o8391L79604p6245j29287M2760L28403J7712j0056
14430F668088J70896M22898N3015j27866J31625q1121M0002L66219l44533K52115
14420G551338L59036k80348M64809K61239j33067N18534q3958J53373J83365k05409
14410H788912K46522O0524Q1155L26424K87717q5264N8455L51032n7886K10842
14400A0268433L83592r9361O94M37880M17808n7885K79276P8828K93254O2466
14390A2064985M44749j77677L82024O02545r5341K39649J34648J75084K80067
$$ y = [4842663, 4881487, 5086299, 4968343, 5399283, 5127193, 5193672, 4950018, 4974923, 5317470, 5432304, 5298959, 5538612, 5649375, 5618323, 5836262, 5765178, 5907729, 5872513, 6093825, 5648784, 5925329, 6183588, 6115197, 6494801, 6418556, 6289269, 6332029, 6660432, 6678144, 6668088, 6838984, 7261882, 7314897, 7187031, 7318656, 7237535, 7277537, 7643756, 7299223, 7551338, 7910374, 7630026, 8094835, 8356074, 8223007, 8741541, 8657583, 8810956, 8994321, 8788912, 9035434, 9095958, 9177113, 9503537, 9791254, 9705990, 9764445, 10115477, 10057591, 10268433, 10652025, 10552664, 10553358, 10991238, 11409046, 11351161, 11630437, 11709265, 12002519, 12064985, 12509734, 12332057, 12714081, 13316626, 13221285, 13460934, 13595582, 13770666, 14050733]
14381A4050733N05028K06854K5078N15236L36886M17718L69696k09438N60729
14372A6778520L87258L70883M38399Q127L70145P92554M65166J54116K35756N11912
14362B0512836N47795O69119L43695K70041O99070L82547K73844J386580k34754
14353B4850773P85222O42252P86615O82685K54121J096595O03464Q19520P29528
14344C1250775J062370P76774J071471R97288K58805J262395J129326J039059
14336C8848263J334765R59635J263260J065451J402750J417014J642623J374240
14328D9308001J649547J689604K017675J694245K180184J763472K138352K587176
14320F5028256K116929K436869K723083K719494K925421K894419L355517L531445
$$ y = [14050733, 14555761, 14762615, 14787693, 15302929, 15639815, 16057533, 16427229, 16217791, 16778520, 17165778, 17536661, 17975060, 17983187, 18353332, 19145886, 19611052, 19765168, 20000924, 20512836, 21060631, 21729750, 22073445, 22343486, 23042556, 23425103, 23698947, 25085527, 24850773, 25635995, 26278247, 27064862, 27747547, 28001668, 29098263, 29701727, 30521247, 31250775, 32313145, 33089919, 34161390, 35158678, 35417483, 36679878, 37809204, 38848263, 40183028, 41142663, 42405923, 43471374, 44874124, 46291138, 47933761, 49308001, 50957548, 52647152, 54664827, 56359072, 58539256, 60302728, 62441080, 65028256, 67145185, 69582054, 72305137, 75024631, 77950052, 80844471, 84199988, 87731433]
14312H7731433L296455L667794L249502M483222M273081M563775N276429M862895
14304A21404586N410895N666069N911684O649164O701748P312617P727599Q067464
14296A74851826Q685900R000379R799121R996062J0498673J1099649J1743678
14289B45675288J1924622J2674283J3721968J3749902J4269794J4599056J4821058
14282C41435971J5117352J4750216J5066469J4281096J3350709J2706569J1136095
14275D37844477R661679O950433L910304L44842j950194j632645q67415j959433
14267D52302048m043944n964955r517841j1809406j3087337j3760833j4429809
14260C79687923j5116318j5333701j5648828j5494878j4942597j4839472j3914304
$$ y = [87731433, 91027888, 94695682, 97945184, 102428406, 106701487, 111265262, 116541691, 121404586, 126815481, 132481550, 138393234, 145042398, 151744146, 159056763, 166784362, 174851826, 183537726, 192538105, 202337226, 212333288, 222831961, 233931610, 245675288, 257599910, 270274193, 283996161, 297746063, 312015857, 326614913, 341435971, 356553323, 371303539, 386370008, 400651104, 414001813, 426708382, 437844477, 447506156, 454456589, 458366893, 458711735, 456761541, 455128896, 454261481, 452302048, 448258104, 442293149, 432775308, 420965902, 407878565, 394117732, 379687923, 364571605, 349237904, 333589076, 318094198, 303151601, 288312129, 274397825]
14253B74397825j3823334j2566211j2461029j1578723j1307495j0446792r855090
14246A92359151r207643q663060q090421p791553p780286p037551o212086o357314
14238A31219237n510118n444366n148398m773472m941813m278777m111513l290822
14230I3719958l829697l805053k971937l405359k830936k874051k843472k240332
14222F8919121k573790k085968k126591k117442k167667j788423j442885k216071
14214E2400284j452809j126475j615434j613343j308611j333856j291752r57536
14206D1700468r09158j515548j080813j283161j103314o47751n75537r80926j275207
14197C2329053q19129o96093m32596q07470n05626q37244j147470m62639n72071
$$ y = [274397825, 260574491, 248008280, 235547251, 223968528, 212661033, 202214241, 192359151, 183151508, 174488448, 166398027, 158606474, 150826188, 143788637, 137576551, 131219237, 125709119, 120264753, 115116355, 110342883, 105401070, 101122293, 97010780, 93719958, 89890261, 86085208, 83113271, 79707912, 76876976, 74002925, 71159453, 68919121, 66345331, 64259363, 62132772, 60015330, 57847663, 56059240, 54616355, 52400284, 50947475, 49821000, 48205566, 46592223, 45283612, 43949756, 42658004, 41700468, 40791310, 39275762, 38194949, 36911788, 35808474, 35160723, 34585186, 33604260, 32329053, 31509924, 30813831, 30381235, 29573765, 29068139, 28230895, 27083425, 26620786, 26048715]
14188B6048715n15438n13092o34945o02133m95085n74741k37438o04261l38010
14179B1533572n79250m36325n49721m09237j51462o22835J8472o31279l61462
14170A7810473j70794n45268j54948r9657o10866n56603l0656k28532o29696O07459
14160A5390912o20835n52995m26470o9054k58280l55268N4085n70637J90613m06852
14150A2375219l55585p4476j58289k56309K65650m49741o08852L19656n65233
14141A0492040K34603j58250k73261l25942q8063j17692L6503j30200l57640j14385
14131I197713J43349k23934K4866l18896j92195k07446J55267j21880k2561l16569
14121H117714p2312j36554n943J25395l96349j98801K37306k89572K05116m62886
$$ y = [26048715, 25533277, 25020185, 24385240, 23783107, 23288022, 22713281, 22475843, 21871582, 21533572, 20954322, 20517997, 19968276, 19559039, 19407577, 18784742, 18803214, 18171935, 17810473, 17639679, 17094411, 16939463, 16839806, 16228940, 15672337, 15641681, 15413149, 14783453, 15390912, 14770077, 14217082, 13790612, 13721558, 13463278, 13108010, 13162095, 12591458, 12782071, 12375219, 12019634, 11945158, 11786869, 11530560, 11796210, 11346469, 10737617, 11057273, 10492040, 10726643, 10568393, 10295132, 9969190, 9881127, 9763435, 9799938, 9669738, 9312098, 9197713, 9341062, 9117128, 9141994, 8823098, 8630903, 8423457, 8578724, 8456844, 8434283, 8117714, 8045402, 7908848, 7902905, 8028300, 7631951, 7433150, 7670456, 7380884, 7586000, 7123114]
14111G123114l05590j39218L23293m18457M64784m46072j81986j24911J97082
14102F492039q5628l00174R3626k29884J5341K00839m34338K5548P1643j22366
14092E726646o6674j75993k18958J46222N1999l43482K66415j05540l69723L93361
14082E304273k42990n20933L39481L0552j05433l25901K49991q859j89263J21295
14072D652213j59750q9116k6922l1698O4526k3190j96267j07246j86119K33183
14062D129614k25844j17360J32986k65590K44162k15431J56688l5304o4157J90010
14052C929774p46956N37931j29931j74779K39064n50658M00696l3923J04787m28147
14042C147858K98376l32108L20030n6791j10205j27876m20228L46137K14259j80382
$$ y = [7123114, 6817524, 6678306, 7001599, 6583142, 7047926, 6601854, 6419868, 6294957, 6492039, 6406411, 6106237, 6199863, 5969979, 5985320, 6186159, 5751821, 5777369, 5849012, 5726646, 5659972, 5483979, 5265021, 5411243, 5463242, 5119760, 5386175, 5280635, 4910912, 5304273, 5061283, 4540350, 4879831, 4910383, 4804950, 4479049, 4729040, 4720181, 4530918, 4652213, 4492463, 4403347, 4376425, 4344727, 4409253, 4386063, 4189796, 4082550, 3896431, 4129614, 3903770, 3786410, 3919396, 3653806, 3897968, 3682537, 3839225, 3803921, 3739764, 3929774, 3182818, 3720749, 3590818, 3416039, 3655103, 3104445, 3505141, 3471218, 3576005, 3147858, 3446234, 3114126, 3434156, 3377365, 3267160, 3139284, 2719056, 3065193, 3279452, 3099070]
14032C099070P7314n9395j48042M72826r22m56823J85695l44588j46486R7721
14022B776370J27189k97831M40350l63023L23729l30677l3245j06136j65013K04503
14012B576216r3950q8584K81937j70372q201k53204p392J59183J33199k28402
14002B300430k58142K41607l74812M98101j56551j76671J19945j44483J56841
13993B206265j0914K77337j02489R21606J095304L613728Q297691J2436172J3863615
13984D2598315j5781805j2401296o186656k283640j278105m34291m77218m28066
13976C327238L1096l08716k74785j56130P519m0417q1093j86483J11243k2599
13966B406873K72603n71014L20881n4021L3688l41368j04410M475K76108k03722
$$ y = [3099070, 3176384, 3116989, 2968947, 3441773, 3440851, 2984028, 3169723, 2825135, 2678649, 2776370, 2903559, 2605728, 3046078, 2683055, 3006784, 2676107, 2642862, 2536726, 2371713, 2576216, 2482266, 2393682, 2675619, 2505247, 2497046, 2243842, 2236450, 2395633, 2528832, 2300430, 2042288, 2283895, 1909083, 2407184, 2250633, 2073962, 2193907, 2049424, 2206265, 2195351, 2472688, 2370199, 3291805, 4387109, 8000837, 16298528, 28734700, 42598315, 26816510, 14415214, 8228558, 5944918, 4666813, 4232522, 3755304, 3327238, 3358334, 3049618, 2774833, 2618703, 2626222, 2585805, 2504712, 2318229, 2429472, 2406873, 2679476, 2108462, 2429343, 2375322, 2409010, 2067642, 1963232, 1967707, 2243815, 2040093]
13956B040093P8914k26666j43856M3700L66621P4517j25605N8779k48956k93089
13946A624452N17582l12199K3191K33865l13836P452O9928k54380K17606q8539
13936A725122j5970j86047J9116M79341m12251J73486K73702l77939k45828N14126
13926A946858p30372N14200m79428M64840K94810k13403l69576L65837o8224j74046
13916A551496J13779q9382K43135m12603J98100j52583k3719Q4554j44658J46960
13906A515079k06712K03044N1647p6046j59510N7M98424l29365k232p5199k69820
13895A149367M01790n01460M87237m51277K43129j55611j34450J16593L53240
13886A508558k53202l9049k48504M05348k20309l4229M1688K12462L8094k69140
$$ y = [2040093, 2119007, 1892341, 1748485, 1792185, 2158806, 2233323, 2107718, 2166497, 1917541, 1624452, 2142034, 1829835, 1853026, 2086891, 1773055, 1780507, 1850435, 1596055, 1813661, 1725122, 1709152, 1523105, 1542221, 2021562, 1609311, 1782797, 2056499, 1678560, 1432732, 1946858, 1216486, 1730686, 1251258, 1716098, 2010908, 1797505, 1427929, 1793766, 1725542, 1551496, 1665275, 1575893, 1819028, 1406425, 1604525, 1451942, 1428223, 1512777, 1368119, 1515079, 1308367, 1511411, 1563058, 1487012, 1327502, 1327559, 1825983, 1496618, 1494386, 1419187, 1149367, 1551157, 1049697, 1536934, 1085657, 1328786, 1173175, 1038725, 1155318, 1508558, 1255356, 1216307, 967803, 1373151, 1152842, 1118613, 1160301, 1372763, 1410857, 1141717]
13876A141717Q7869K79600k70132K70779k18018j00661m3462p7148J21287k14597
13866I77234J22387j15828n2735J27407J95429o771J7559R5285j29177j98779
13856A032011K34739l74040N27425k55902M1447j44615J02252j79324K87766K71834
13846A543593p03586L22558j83566J14879l23864M69730m30047K07405o3937J41727
13836A094892j15327l4498L40554j46266l87375L23675j69416k11776K21339j85608
13826G30194J44271K95784j58396j74717J6995M9756L3264m11153M81884K0213
13816A028095j84725j73723K91171k57580L19214J5807k15064j51549j12384M49201
13806A008463r2649K98000k98215k69456j07747K79976j11678k95107L72822j3544
$$ y = [1141717, 1229586, 1509186, 1239054, 1509833, 1291815, 1191154, 1147692, 1070544, 1191831, 977234, 1099621, 983793, 931058, 1058465, 1253894, 1247123, 1264682, 1359967, 1230790, 1032011, 1266750, 892710, 1420135, 1164233, 1205680, 1061065, 1163317, 983993, 1271759, 1543593, 840007, 1162565, 978999, 1093878, 770014, 1239744, 809697, 1017102, 953165, 1094892, 979565, 945067, 1285621, 1139355, 751980, 1075655, 906239, 694463, 915802, 730194, 874465, 1170249, 1011853, 837136, 854131, 903887, 937151, 525998, 1007882, 1028095, 843370, 669647, 960818, 703238, 1022452, 1038259, 823195, 671646, 559262, 1008463, 915814, 1213814, 915599, 646143, 538396, 818372, 706694, 411587, 784409, 770865]
13796G70865J04180o8445K90924k96382k07263M18966Q8672q0497j28844l05894
13786E86282K86806R089J85996m66347M62234p3467n4875j57601B90994N08970
13776G99964j92390n5388j18256o8098L41468M7082j52976N22357m92353n0166
13766E81244j2269k3940K26963l04338J17726J56533j12664J24055j57115K09612
13756H05807n7944j78892K1220o7965R9335N4795l20952J97277j6491k2473j18321
13745C95396M29008o4379C23975M59016j69133K21179C54358K84720R3374N8176
13735G90628C75810K16974P0974M39005D19201J43515J0434n0817k54985J96282
13725D63630J48953n8089L97903l04852k64118L54597J82737l96368N3098P0019
$$ y = [770865, 875045, 806600, 1097524, 801142, 593879, 1012845, 1101517, 1021020, 892176, 586282, 873088, 882177, 1068173, 601826, 1064060, 990593, 935718, 778117, 290994, 799964, 607574, 552186, 433930, 365832, 707300, 754382, 601406, 1123763, 631410, 581244, 568975, 545035, 771998, 467660, 585386, 741919, 629255, 753310, 596195, 805807, 747863, 568971, 590191, 522226, 621561, 676356, 355404, 552681, 536190, 513717, 395396, 824404, 760025, 323975, 782991, 613858, 835037, 354358, 639078, 732452, 790628, 375810, 592784, 663758, 1102763, 419201, 562716, 573150, 522333, 267348, 463630, 612583, 554494, 952397, 647545, 383427, 738024, 920761, 524393, 577491, 647510]
13715F47510l0352j52373j5881L91231j40554j35865K49959k43329J0216j62916
13705D17646L14823k05421p4378Q568J35727j92592N41889D15871k6434K75420
13695F64857B45956J1945M62637j25817o0556k49557l1590K53580j72602L43249
13685F77245j56265k36219L43196l08401K41649r2464J45860B73665j5589O72417
13675I30493k21422r2807J2906p7113J16698l32004K40338J31246C36740L62085
13665F98825k60531j57105J77825A99066J55932J34943L0072j65631J45417j58565
13655C41234p2489O5398M37229C18394K87395B16926M55866j11791j88057L97247
13645G70191A69298L52381O9962j90706J11739L1295L7790k66726J95732J33591
$$ y = [647510, 617158, 464785, 448904, 840135, 699581, 563716, 813675, 570346, 580562, 417646, 732469, 527048, 452670, 461238, 596965, 404373, 946262, 415871, 389437, 664857, 245956, 257901, 720538, 594721, 534165, 284608, 253018, 506598, 333996, 677245, 520980, 284761, 627957, 319556, 561205, 468741, 614601, 273665, 258076, 930493, 709071, 616264, 629170, 552057, 668755, 336751, 577089, 708335, 336740, 698825, 438294, 281189, 459014, 199066, 354998, 489941, 520013, 354382, 499799, 341234, 268745, 334143, 771372, 318394, 605789, 216926, 672792, 561001, 372944, 770191, 169298, 521679, 591641, 400935, 512674, 543969, 581759, 315033, 510765, 644356]
13635F44356j32329q0407L00955B54589L48043j17427j25322I2862M03327Q397
13625E04586J08499O1640l29436M57786B35083j06902j5645M73953j24239Q6773
13615E49023k34621J43971J55060A01010h3174A94850a32059B79381K63K44119
13605E23763B35167J77548j7593q9697O2763L38520l48050A08568M22609P5732
13595F06909k20243q921I0864J85769J72541n0837j60581K15594J83761C10310
13584a12872F25757j76701j58393J22187j90436K47791o8557G5679M5337K61859
13574C82875J11066k06564l8845J52275R1830B32695L95300B25822M34114k46041
13564D13895k3073A09663L42337M6932k37714a36482A72237L93250A85330A4650
$$ y = [644356, 512027, 431620, 732575, 254589, 602632, 485205, 359883, 92862, 496189, 504586, 613085, 674725, 345289, 803075, 235083, 128181, 112536, 586489, 462250, 549023, 314402, 458373, 613433, 101010, -83174, 194850, -132059, 279381, 279644, 523763, 235167, 412715, 395122, 305425, 368188, 706708, 358658, 108568, 531177, 606909, 386666, 377745, 90864, 276633, 449174, 398337, 237756, 453350, 637111, 310310, -112872, 625757, 449056, 290663, 412850, 222414, 470205, 401648, 75679, 121016, 382875, 493941, 287377, 248532, 400807, 492637, 232695, 627995, 225822, 659936, 413895, 390822, 109663, 452000, 498932, 261218, -136482, 172237, 565487, 185330, 14650]
13553F50194l18661A63033Q7824A02290Q8976J50853r7984K4783j09885M27790
13543E86823j35029A16462J92481M66049i5996D25525P3900j49470q5585j22817
13533A41553J97338J8567N6436A91373M1866H1862J63044C9342L32518j83197
13523A88663L1314K0988K7466J51400j14613M31483l64755n6443j54314K63474
13513D24663q3065N1314g1170b842A20771M71723A29691J16013J10911j33768
13503B22847k7404J82352j36636J58483m7751D413J21332J02513N4926D8180P5056
13492A23236n6266F130K90950l7964J8894H8946k5832B8991O633K08825r6523
13481A47926J42155J4520k1504j5142R5301a38626A44701L10461j9251J07480
$$ y = [650194, 331533, 163033, 250857, 102290, 191266, 342119, 244135, 268918, 159033, 586823, 451794, 116462, 308943, 774992, -95996, 425525, 499425, 349955, 264370, 141553, 338891, 357458, 413894, 191373, 233239, 81862, 244906, 39342, 371860, 188663, 219977, 240965, 268431, 419831, 305218, 736701, 371946, 315503, 161189, 424663, 341598, 392912, -71170, -2842, 120771, 592494, 129691, 245704, 356615, 222847, 195443, 377795, 241159, 399642, 351891, 4413, 125745, 228258, 283184, 48180, 123236, 66970, 6130, 297080, 259116, 278010, 88946, 63114, 28991, 35624, 244449, 147926, 290081, 304601, 283097, 267955, 363256, -138626, 144701, 455162, 435911, 543391]
13471E43391F1260L13966d1638B43167J41379j24633K51246A02878L87136A04040
13460B21599K4618Q5453J40733A22540K01516p1875J21115C3987O9439f7593A03824
13448B38262N4990D6338j8677L02155p7955p6013M2407K11530A22551N2144b8672
13436I8649J62457P0778p4903o2051l8499J67477O3704A71486D9665P9801J99884
13425C29350L03444C02931D3973K16871L0430c136B45694L6863m2224M14177k84064
13414C70446j61387D8759P1911d7398A96099l2140N5625a58170b4102E1859J77673
13403B29532A1684J889K14713e8119A08646a43686B13413O7618o0988K99063B27665
13391a35066b8652k4838C58821Q8083j82372G6774M0675A8211K00328b58A46840
$$ y = [543391, 61260, 375226, -41638, 243167, 384546, 259913, 511159, 102878, 490014, 104040, 221599, 246217, 331670, 472403, 122540, 324056, 252181, 373296, 33987, 103426, -67593, 103824, 238262, 293252, 46338, 27661, 329816, 251861, 175848, 218255, 429785, 122551, 174695, -28672, 98649, 261106, 331884, 256981, 194930, 156431, 323908, 387612, 171486, 49665, 129466, 329350, 632794, 302931, 43973, 260844, 291274, -3136, 245694, 282557, 240333, 654510, 370446, 209059, 48759, 120670, -47398, 196099, 163959, 219584, -158170, -24102, 51859, 229532, 11684, 13573, 228286, -58119, 108646, -143686, 213413, 281031, 220043, 519106, 227665, -135066, -28652, -53490, 358821, 446904, 264532, 76774, 117449, 18211, 218539, -258, 146840]
13379c06035B13480L17967n1251k7729A61543J63760K96928E3588J6199J83630
13369B53417K77359p6066G1887K98685o4256a47453F2928J45236m7999a62912
13358A13429M1921Q3614J23912c2243f318I5194L33866q0438J81583k63634K7947
13347B94518K60969e4542E02857j30467Q0646A57225K56710j63216L41961B76093
13336B24460j5317n9048b33877B77913L7840O4237A8243J48990J68455b27290
13325A09330q749M30502A00874h9087b8481B84668p8871F038K66376G3439L9497
13314A12936o201a7988A71114l9591a66415A63218e9521A05479C2477c9345B54793
13302a8774B43988p3949b05694I1478a73533D7413J64590Q8715H1568K0456J14620
$$ y = [-306035, 213480, 531447, 480196, 452467, 161543, 325303, 622231, 53588, 69787, 253417, 530776, 454710, 71887, 370572, 306316, -147453, 62928, 208164, 160165, -162912, 113429, 155350, 238964, 362876, -32243, -6318, 95194, 429060, 348622, 530205, 266571, 294518, 555487, -54542, 502857, 372390, 453036, 157225, 413935, 250719, 592680, 276093, 224460, 209143, 150095, -233877, 277913, 315753, 379990, 18243, 167233, 335688, -227290, 109330, 100581, 531083, 100874, -89087, -28481, 284668, 205797, 6038, 272414, 73439, 112936, 106735, -17988, 171114, 131523, -166415, 163218, -59521, 105479, 32477, -39345, 254793, -18774, 243988, 170039, -205694, 91478, -173533, 47413, 212003, 300718, 81568, 102024, 216644]
13291B16644G7300K08488l9792n0742K36908A41166a30078A9556K53599m460J64150
13280D32845K5813m1638H95N8078J25038D8508i3001M0614D23862D4033J17511
13269A61544e2036A26902m4725I667c25929D95062A6370K35793Q5496j11434M3967
13258B70192A4304J47083b3407G8570h3236C98950i9288A54297a2050A28060J25037
13247B53097h5617A49466N2506N0192j21659D3274K64695M9561m7799o6572A02508
13235A81927g6192C17549G5226J30443a43228f3280E8466N8188B9212R8695k5142
13224A02765A5752a00615L1058A08557J20343F8155K53824K019G8671J20305a65398
13212D0017M00593i2745j28308A99502H5863a14896B1834K9595B3055K39619a96630
$$ y = [216644, 77300, 285788, 245996, 195254, 432162, 141166, -130078, 19556, 273155, 268695, 432845, 458658, 417020, 895, 58973, 184011, 48508, -93001, -52387, 423862, 44033, 161544, -52036, 126902, 82177, 9667, -325929, 495062, 16370, 252163, 337659, 226225, 270192, 14304, 161387, -23407, 78570, -83236, 398950, -99288, 154297, -12050, 128060, 253097, -85617, 149466, 201972, 252164, 130505, 43274, 307969, 357530, 309731, 243159, 102508, 181927, -76192, 317549, 75226, 205669, -143228, -63280, 58466, 116654, 29212, 127907, 102765, 15752, -100615, -69557, 108557, 228900, 68155, 321979, 323998, 78671, 198976, -165398, 40017, 440610, -92745, -221053, 199502, 85863, -114896, 21834, 51429, 23055, 262674, -196630]
13200A90301b18275C22145c4338D85314B21741i436B25844D6404K3743M26720
13190D96867b514A86019J68J38359A03935J70008j14680h539C7192J57692H2876
13178B12978a24133A06316K06200C4556J39653A0391J34187Q9459J2049I8015
13167D9337J69869r9530K90022F1748a09107j11273b0092A77274K95512a33278
13156A47573m8965J37747o0189L2140H8570D4139a06199G2804F648J16385l7972
13145H5061Q4826b25415C61025G5652B7078Q6402K985h7039E0281b9223n5243
13134h4466C407K75045A8134M0809a59139k5698M3725a1770B40578C8828a3216
13122A64568p307o6224K06428D3076K0221J54414O7298A31379h370j6324l22402
$$ y = [190301, -218275, 322145, -34338, 485314, 221741, -9436, 225844, 46404, 70147, 496867, -2514, 186019, 186187, 324546, 103935, 273943, 159263, -8539, 37192, 194884, 82876, 212978, -124133, 106316, 312516, 34556, 174209, 10391, 144578, 234037, 246086, 98015, 49337, 219206, 119676, 409698, 61748, -109107, -220380, -20092, 177274, 472786, -133278, 147573, 98608, 236355, 176166, 208306, 88570, 44139, -106199, 72804, 6648, 123033, 85061, 169887, -225415, 361025, 75652, 27078, 113480, 116465, -87039, 50281, -29223, -84466, 3407, 278452, 18134, 58943, -159139, -184837, -141112, -11770, 240578, 38828, -13216, 164568, 157261, 91037, 297465, 43076, 63297, 217711, 285009, 131379, -8370, -24694, -347096]
13111c47096A35632k6937b34241A82733c5265D19576B00949P3411D9708d1983
13100C63522i4850G0550L7002h4097E3662L19827j76927f4812j99659B97790j01083
13089A96707K08767A56463J64013k8759A18103p975L6348j0460a45860B34112
13078B15784M1129A17851M1256Q4821a64382B34898H3901K32335H8608M4604d911
13066d0079F8367K09617K00379a31365C16372A52082d0186A37878m3208M0615
13056A35285J26694K3268b5356F0485J57397c7984B73199q9796q9555K20943e2570
13044B76090a1815B75585d1925d720D1205j8515b78777e7534G2477J66988p8289
13033A61176C4537A1052K56433a44612L5956b6610K690I4085M14017G8317K6191
$$ y = [-347096, 135632, 108695, -234241, 182733, -35265, 419576, 200949, 274360, 49708, -41983, 363522, -94850, 70550, 107552, -84097, 53662, 373489, 196562, -64812, -264471, 297790, 196707, 405474, 156463, 320476, 291717, 118103, 110128, 146476, 136016, -145860, 234112, 215784, 256913, 117851, 159107, 243928, -164382, 234898, 83901, 316236, 88608, 133212, -4911, -40079, 68367, 277984, 478363, -131365, 316372, 152082, -40186, 137878, 94670, 135285, 261979, 285247, -25356, 60485, 217882, -37984, 273199, 183403, 93848, 314791, -52570, 276090, -11815, 275585, -41925, -4720, 41205, 22690, -278777, -57534, 72477, 239465, 161176, 34537, 11052, 267485, -144612, -108656, -26610, -23920, 94085, 508102, 78317, 104508]
13022A04508c3132B23084o122B4265b55556A76522l4215a66119A4429K04366M1445
13011B60240a41855J0223D74100i077H7809g35H9797C9261P2186N2079F5290A6747
12998e8667m7723A0440c1837m4645D7925G113O4641c265j44971j92262k7902g4090
12985f7830b9186a4376B39913l7115l4599b0404C73530c6195A20642A6408K90525
12974C06933j40176C686a0462j49714H2411a95518d3715C42611c3896B30582H167
12962C0285f7634b2331A20070a83627A01981J41395a64561A84080J75096j76891
12952A82285G5145P8508a36353r1532E6739j1451K25905m8519a71579g6143C01224
12940A0019K42810L35952A78801h5563A4750c6506c594j18989f1160J1137j12978
$$ y = [104508, -33132, 223084, 216962, 24265, -255556, 176522, 142307, -166119, 14429, 218795, 260240, -141855, -131632, 474100, -9077, 87809, -735, 89797, 39261, 111447, 163526, 65290, 16747, -58667, -106390, 10440, -31837, -76482, 47925, 7113, 71754, -3265, -148236, -340498, -368400, -74090, -67830, -29186, -14376, 239913, 202798, 168199, -20404, 373530, -36195, 120642, 16408, 306933, 166757, 3686, -10462, -160176, 82411, -195518, -43715, 342611, -33896, 230582, 8167, 30285, -67634, -22331, 120070, -183627, 101981, 243376, -164561, 184080, 359176, 182285, 75145, 153653, -136353, -227885, 56739, 45288, 271193, 222674, -171579, -76143, 301224, 10019, 252829, 588781, 178801, -85563, 14750, -36506, -3594, -122583, -61160, -50023, -163001]
12929a63001E3640a8672m6964B13384G8557c42148J66939B30791f428k5914k01679
12918b34021I6026a94170g282C41202c46563i742k0563A04025P7324b11060A8657
12906E1792h8171l2474A50059K52923p2063b9105B14129d40718a1785j11317j52729
12895b75831A88263B3830Q6487a4772D7541k2666M3434h7726B05860j2282b22168
12883C8829O4152b78584f2519R211H2612K39453c8856A01406M1119C6373L9659
12872G6032B6741K1853k957J16375G1646B4660a1638j27989A70416E0103a49759
12860a23107r83B70901b36265D0426L1444a27265r384j30983g4096k6433L1879
12849f8650K9517q5636D76628h5315B67488q0771N204A1036a66636C19680i4971
$$ y = [-163001, 53640, -18672, -65636, 213384, 78557, -342148, -175209, 230791, -6428, -32342, -234021, 96026, -194170, -7282, 341202, -346563, -9742, -30305, 104025, 181349, -211060, 18657, 51792, -88171, -120645, 150059, 402982, 330919, -29105, 214129, -440718, -11785, -123102, -275831, 188263, 23830, 110317, -14772, 47541, 24875, 68309, -87726, 205860, 193578, -222168, 38829, 102981, -278584, -62519, -53308, 82612, 322065, -38856, 101406, 142525, 36373, 76032, 26741, 48594, 45637, 162012, 71646, 24660, -11638, -139627, 170416, 50103, -149759, -123107, -124090, 270901, -236265, 40426, 71870, -127265, -136649, -267632, -74096, -100529, -68650, -39133, -124769, 476628, -85315, 267488, 186717, 191921, 11036, -166636, 319680, -94971]
12837A19272P8479a70683B07406a02360C33291d2660I809O470K80885j42756a03564
12825F7099K66946c6801B347g7413A97649B6697O3320c13264D3865a14162o7591
12814a81753n4766B74948a13622k1514b3343A33268b23867N0038L9105e3064A68672
12802b33288a3677k74952A26925N3116q8718a84159n5103e427j74055A22273c32861
12790C32244g4501C9833A8835a23000B3043J21391c4820G8424a02596B19387b01700
12778e3049j01133E0747j0220a29452B18769K0992l4925A1461O857L2920J85830
12767B37068f4043r2953A95523C4835a4346A39136J10840M2540d2122A33579b8171
12755a63014A09660m7526J96388b7446n7505c1403A52523B6391J18947L6682J76121
$$ y = [119272, 197751, -170683, 207406, -102360, 333291, -42660, 9809, 16279, 297164, 154408, -103564, 67099, 334045, -36801, 2347, -77413, 197649, 26697, 90017, -313264, 43865, -114162, -181753, -236519, 274948, -113622, -135136, -23343, 133268, -223867, -173829, -134724, -53064, 168672, -233288, -13677, -288629, 126925, 180041, 91323, -184159, -239262, -5427, -179482, 122273, -332861, 332244, -74501, 39833, 18835, -123000, 23043, 144434, -34820, 78424, -102596, 219387, -201700, -53049, -154182, 50747, 40527, -129452, 218769, 239761, 204836, 11461, 18318, 51238, 237068, -64043, -156996, 195523, 34835, -14346, 139136, 249976, 292516, -42122, 133579, -28171, -163014, 109660, 62134, 258522, -27446, -84951, -31403, 152523, 26391, 145338, 182020, 358141]
12744C58141j20537I6971k4669b2549B5941J99003q2448K545j5023C9731a09865
12732e291A57352J54444a75014A59891a98361B40941b31259N7731B37984I9818
12721a93872E4131J700J13948M9479p3061e381A96411n6438K71601p6079c25666
12709A87783L06425A69775F2410d2204D60651j58642A297M21142m2641c26407
12698A88338b54359m4861E4488d0787E0975J16052q3037J36181j05897m4863a03603
12686A87215e7357j37994a825A54997L6812b05443K0805C65406d8639K3611G3245
12674D36717F4660d4876B65738q1318H1760a34984C55400A04120C6855K30974
12664B67829g3248G5992K93835J0405F8305R2252B3991K49664J10546A56458a22267
$$ y = [358141, 237604, 96971, 72302, -22549, 25941, 224944, 142496, 145041, 130018, 39731, -109865, -5291, 157352, 311796, -175014, 159891, -198361, 240941, -231259, -173528, 237984, 99818, -193872, 54131, 55831, 169779, 219258, 146197, -5381, 196411, 139973, 411574, 335495, -325666, 187783, 494208, 169775, 62410, -42204, 460651, 302009, 1297, 422439, 379798, -326407, 188338, -254359, -299220, 54488, -40787, 50975, 167027, 83990, 220171, 114274, 69411, -103603, 187215, -57357, -195351, -1825, 154997, 191809, -205443, -184638, 365406, -48639, -25028, 73245, 436717, 64660, -44876, 265738, 184420, 81760, -134984, 355400, 104120, 36855, 267829, -73248, 75992, 369827, 380232, 68305, 160557, 23991, 273655, 384201, 156458, -122267]
12652A14481J24435j00405g2777K978E41272d5694j6171A70271D7594h2779m6167
12641a28946A88894E158a93652B0358K51084i2180Q826j33066f2209B38546A08932
12629C04233A2515K5467J50781R298n1190a72232K1600A63497Q8801M5917a2956
12617A28016J58119D9044i272I6825r778f232C2530b47391N7144Q1838A48109
12605a17422c3637p9511F4388b8641D26587b32435B12866Q934J7452q1955Q5791
12594B43088a30156K1721D1481Q6218B141b13775c6649C1985h295k63470f7745
12582h8741k13944c9034j52475B76279a5073j63998A37514b82817A26168K1225
12572A47393b07335j33467J44927D8519g3515B3003J79740I4521J03874E8407
$$ y = [114481, 238916, 138511, -72777, -69799, 541272, -45694, -61865, 170271, 47594, -82779, -128946, 188894, 5158, -193652, 20358, 271442, -92180, -83354, -216420, -62209, 238546, 108932, 304233, 12515, 37982, 188763, 198061, 146871, -172232, -150632, 163497, 252298, 298215, -12956, 128016, 286135, 49044, -9272, 96825, 87047, -6232, 32530, -247391, -190247, -108409, 148109, -117422, -33637, -113148, 64388, -28641, 426587, -232435, 212866, 221800, 239252, 157297, 243088, -130156, -108435, 41481, 127699, 2141, -213775, -36649, 31985, -8295, -271765, -67745, -88741, -302685, -39034, -191509, 276279, -15073, -179071, 137514, -282817, 126168, 147393, -207335, -340802, -195875, 48519, -73515, 23003, 202743, 94521, 198395, 58407]
12561c6485B18594I1485D2022R4980b9324B07623Q4106J32329j89919b056D28942
12549b9509j02508J1801A56053J8865f8697A45257a8108B8291R005b73721A66729
12537C814b24017a00833E3522a00127C7485L22094F9289N262b03536A60016P4223
12526B34239H8433a62682B17097M22956b2560C19457G4685b28300B59754p4703
12516A85051L4100g228C70585j42951a27225E9934a18862B59241A12420a70691
12505C9323J95025Q1576M8277A68667d1406B05065a92733B47586e9120r0025e1548
12493C19644b46054P8573O8897A26069Q2285A6711R8141Q9519N237I8724c23787
12481e8675k09108d5206n2522j34010i8325C73100g6879Q025E0444L59408B7106
$$ y = [-36485, 218594, 91485, 42022, 137002, -29324, 207623, 291729, 424058, 234139, -2056, 428942, -29509, -132017, -120216, 156053, 174918, -68697, 145257, -18108, 28291, 37296, -273721, 166729, 3814, -224017, -100833, 53522, -100127, 37485, 359579, 69289, 74551, -203536, 160016, 234239, 88433, -162682, 217097, 640053, -22560, 319457, 74685, -228300, 259754, 185051, 219151, -7228, 370585, 227634, -127225, 59934, -118862, 259241, 112420, -170691, 39323, 234348, 315924, 364201, 168667, -41406, 205065, -192733, 247586, -59120, -149145, -51548, 319644, -246054, -167481, -98584, 126069, 208354, 16711, 114852, 204371, 209608, 98724, -323787, -58675, -267783, -45206, -97728, -231738, -98325, 373100, -76879, -68854, 50444, 409852, 27106]
12469a66660p403A70684b77324A00936j7772M0141b28616B34250a56378a0423
12458b4161q226B20634b03327Q4168l36597D1552a05367p014j11945f308A9419
12446C91330j54396b66452h0554B36319d70733C95290d5182j09906G8487P7032
12436A55519D6796J95452E5191L6259f0883k59081A5057N8292a74224C2865a6964
12424c2882B1079b08309C51944A45919d9585J9184H4976M9871F138M8308a0166
12412a3193D8984h4131B02884A3668K39941i2598n100M8260k06790A18201a1161
12400E2J80793J51700b21275l0289C99766F9620B6803J48975a92125A74888a44618
12388i67B00058a45412N7643G4849L4656b84190j70060B8209K26611b82188K5417
$$ y = [-166660, -174063, 170684, -277324, 100936, 83164, 123305, -228616, 234250, -156378, -10423, -24161, -32387, 220634, -203327, -119159, -455756, 41552, -105367, -112381, -224326, -6308, 19419, 391330, 236934, -266452, -80554, 236319, -470733, 395290, -45182, -155088, 78487, 155519, 46796, 242248, 55191, 91450, -60883, -319964, 15057, 73349, -174224, 32865, -16964, -32882, 21079, -208309, 351944, 145919, -49585, -30401, 84976, 134847, 6138, 54446, -10166, -13193, 48984, -84131, 202884, 13668, 253609, -92598, -97698, -49438, -256228, 118201, -11161, 52, 180845, 332545, -221275, -251564, 399766, 69620, 26803, 175778, -192125, 174888, -144618, -967, 200058, -145412, -87769, 74849, 109505, -284190, -454250, 28209, 254820, -282188, -256771]
12377b56771m3355j5028i2075k4893A38697J18938a16277B62511e0475A57918
12366A97965c05680c0525B08764a92400c1414I5227J45643b42372b3508C06162
12355b6990C6696f4798a5063r7495E9388J61933d5549B01884b71409b4972j01072
12344a26044j47011f1782E133a53152D87771k29266b54440a23392C24021d41598
12333A52419C530a65065D06078j62421a20619B12911C6828K56223c9890j0051
12323d9941j12043a9217k6645l45707F2706K25481b5670A90208a8619F2546c8842
12311c73934A257Q6846c639k49862A20134E317J03115J01744O5797E1667b26577
12299E8171O9209j2638a07856a6778A28092a16052J3364G4051e4429j19370b2035
$$ y = [-256771, -300126, -315154, -92075, -116968, 138697, 257635, -116277, 262511, -50475, 157918, 197965, -305680, -30525, 208764, -192400, -31414, 95227, 240870, -242372, -23508, 306162, -26990, 36696, -64798, -15063, -112558, 59388, 221321, -45549, 201884, -271409, -24972, -126044, -273055, -61782, 5133, -153152, 487771, 258505, -254440, -123392, 324021, -441598, 152419, 3530, -165065, 406078, 243657, -120619, 212911, 36828, 293051, -39890, -49941, -161984, -19217, -45862, -391569, 62706, 288187, -25670, 190208, -18619, 62546, -38842, -373934, 1257, 88103, -3639, -253501, 120134, 5317, 108432, 210176, 275973, 51667, -226577, 58171, 127380, 114742, -107856, -16778, 128092, -116052, -102688, 74051, -54429, -173799, -22035]
12287I0265L90089e26909a37925C34718I8300a26344A69738J42031A10516K2442
12277A32958c09444D1185J2384J90763J6008A07124C2497J21020c653k66252C23566
12265A00681l9942K9042L35446e2000C8839a7989C7724g8806C12288k2983a13723
12253A40221e4492a9477E2230k3452N5049J24475A7598f8161A90560j3649B4553
12241C01451A24917A3752J75269B8939J95423D6385J30047J89827A09106K72938
12231C82044G6818J86933d6540B23255G4230O2536L56685M6639k31232A34725
12220A92020q9923J17716m9987B1898K12557j2106J83233B4586p429f7211k29583
12209b96794C89505c5891A19246A9851K85196e4623o0808B58641k9033p4411L2532
$$ y = [90265, 480354, -526909, -137925, 334718, 98300, -126344, 169738, 311769, 110516, 132958, -309444, 41185, 53569, 244332, 260340, 107124, 32497, 153517, -3653, -269905, 323566, 100681, 60739, 89781, 425227, -52000, 38839, -17989, 37724, -78806, 312288, 289305, -113723, 140221, -54492, -19477, 52230, 28778, 83827, 208302, 17598, -68161, 190560, 176911, 24553, 301451, 124917, 13752, 189021, 28939, 224362, 46385, 176432, 366259, 109106, 382044, 76818, 263751, -46540, 223255, 74230, 136766, 493451, 540090, 308858, 134725, 192020, 102097, 219813, 169826, 21898, 234455, 222349, 405582, 24586, 17157, -67211, -296794, 389505, -35891, 119246, 19851, 305047, -54623, -115431, 258641, 229608, 155197, 187729]
12198A87729a42465O3457n546C90832A44328K52347O5165a55545C10488j34143
12188A76345k4360a20581A97145c1306A2437Q1954J61546j26035C3796e6829A85634
12176i1420B2578N6721L44157a33056E7249a63921C99080A30938l1752O7633J54391
12165C21210K32156p1764c0956F0628h2639B28911q1053k954J29716c00884F297
12153A33307N9254B3990J02682E0826J3523L77177a20513j39733C19393g8176
12142a13363C92600e1284q976K4544A56574g141k20214B82839b41929q579i4083
12130F3170b50534G090Q5071A0053a06562B25111l0654l8745a14201b139l75715
12119c77854E7011f4202j4163n47957B37637I602a49900e2959F6402a22496N6430
$$ y = [187729, -142465, -79008, -84554, 390832, 144328, 396675, 461840, -155545, 310488, 176345, 151985, -120581, 197145, -31306, 12437, 94391, 255937, 129902, 33796, -56829, 185634, -91420, 22578, 79299, 423456, -133056, 57249, -163921, 399080, 130938, 99186, 166819, 321210, 553366, 481602, -30956, 60628, -82639, 228911, 147858, 144904, 274620, -300884, 6297, 133307, 192561, 23990, 126672, 50826, 64349, 441526, -120513, -260246, 319393, -78176, -113363, 392600, -51284, -60260, -35716, 156574, -7141, -227355, 282839, -241929, -250508, -94083, 63170, -250534, 7090, 92161, 10053, -106562, 225111, 194457, 155712, -114201, -2139, -377854, 57011, -64202, -78365, -626322, 237637, 9602, -149900, -52959, 66402, -122496, -66066]
12108f6066l382B53010d5812C2890a87768B92519j43265J90109A00865D6477b18011
12096A1369J66075G525i9560r5546A27453J62561f9402D4614a44415O9171C10353
12084d95609a12545C63555a63377A35621K5939L2785a40222n4967B92842A39263
12073E4138J12653k6234k3706J08688j10978n2643Q35644P51067o81398B34264
12062D3379e5873D8724b17557A69094K98344A57008o9085d9276j91245F7490K85700
12051C53190j66113e4472I7818a93931Q3482A48671b8605A87517b29094a0662
12040B16784b18661A58835N8166a76570M9150c6432G3571a16417r9434h1890C9153
12028D1933c46054n825C24833q1800a23342A39673a64050l3217B00665p3833J6655
$$ y = [-66066, -69448, 253010, -45812, 32890, -187768, 292519, 149254, 339363, 100865, 46477, -218011, 11369, 177444, 7525, -99560, -195106, 127453, 290014, -69402, 44614, -144415, -75244, 310353, -495609, -112545, 363555, -163377, 135621, 161560, 194345, -140222, -195189, 292842, 139263, 54138, 166791, 140557, 116851, 225539, 114561, 61918, 897562, 1648629, 967231, 234264, 43379, -55873, 48724, -217557, 169094, 467438, 157008, 87923, -49276, -240521, 67490, 353190, 187077, -54472, 97818, -193931, -110449, 148671, -28605, 187517, -229094, -10662, 216784, -218661, 158835, 217001, -176570, -127420, -36432, 73571, -116417, -215851, -81890, 39153, 41933, -346054, -351879, 324833, 243033, -123342, 139673, -164050, -197267, 200665, 126832, 143487]
12017A43487b11331A48914J70437j49260a23469R533A18202b86224a30165G5553
12006G3327A8043J82923E0556a23691A9907c34389a12241A7631J16006f6704H7559
11994b74620D8689b6130H9547C7424a9475C8912J03577G001b67494h6930r0588
11983a77518j24881J35362A01592K242a42403A5600a96792d7767j53134A06310
11972C6169N4446a7213C44970C688c00818H0673R7923c51890C99554H2980b62218
11960A54919b45980j1917J18371j28389G4429a58628K8585k052A73178D3648a27008
11948b38210d8424b0989o344B03531L7606a58998e8933j32618k6863o598C1924
11936a5633j44822j67359B9398F618e0662A0252a6530A94460F8171J14905d6066
$$ y = [143487, -211331, 148914, 319351, 170091, -123469, -113936, 118202, -286224, -130165, 75553, 73327, 18043, 200966, 50556, -123691, 19907, -334389, -112241, 17631, 133637, -66704, 87559, -274620, 48689, -26130, 89547, 37424, -19475, 38912, 142489, 7001, -267494, -86930, -177518, -302399, -167037, 101592, 103834, -142403, 15600, -196792, -47767, -200901, 106310, 36169, 90615, -17213, 344970, 3688, -300818, 80673, 178596, -351890, 399554, 82980, -262218, 154919, -245980, -257897, -139526, -267915, 74429, -158628, -130043, -132095, 173178, 43648, -127008, -238210, -48424, -20989, -27333, 203531, 241137, -158998, -58933, -191551, -218414, -225012, 31924, -15633, -160455, -327814, 29398, 6618, -50662, 10252, -16530, 194460, 68171, 183076, -46066]
11924F5055M2048c4534B07659o7144d7990q8723j64354G7654A0200J2069r948
11913A2321O6348J76459r7391f8109A47431l2303a85538h1450B25847a47465E2256
11901E1799b42656H5928b0326A64421a32725E0671J05297b20289e367k03991j30358
11890c39716a6881k81179D28353A265b64117M3653B31310A256a51188M1251c6022
11878h0029C0850J77975c9942e071m41728f7008B2878J04455d5371l9312f425
11866b14643J4895K8622Q5089M1003B87459D6660b50954e8692A30916f0073B65178
11854I0664h1896A812K6090L5247J24916B1546f6694k22563A57697J81006h7047
11842a42992J4747P319p4719C5901a10821c8893B25050c8306A53354d9206C872
$$ y = [65055, 107103, -34534, 207659, 140515, -47990, -136713, -301067, 77654, 10200, 22269, 12321, 78669, 255128, 157737, -68109, 147431, 115128, -185538, -81450, 225847, -147465, 52256, 51799, -242656, 85928, -20326, 164421, -132725, 50671, 155968, -220289, -5367, -209358, -339716, -16881, -298060, 428353, 1265, -264117, -220464, 231310, 1256, -151188, -109937, -36022, -80029, 30850, 208825, -39942, -5071, -446799, -67008, 22878, 127333, -45371, -84683, -6425, -214643, -199748, -171126, -86037, -45034, 287459, 46660, -250954, -58692, 130916, -60073, 265178, 90664, -81896, 1812, 27902, 63149, 188065, 21546, -66694, -289257, 157697, 338703, -87047, -142992, -128245, -120926, -195645, 35901, -110821, -38893, 225050, -38306, 153354, -49206, 3872]
11830d76801A04346K28420C4168P9060a39964e9039j38070O8648c6745C17026
11819F3738a26542B18521l6285c41576a43624A8686O3224J58312r6653D7292k0266
11808B7026h3513j57726A05893D6303K80731a94829P5900j04938J01361F4126
11797A85266a69866B5705K6142a35874A01272L970p348D8432f4097p9029A82550
11785g5619C2260J48867K05125C2860a4775A79089M033D9100a82579j7708c4913
11773H5962b18731B120J15734E1102d5431B83783A29773J1944D0486g5098B5086
11761b55062a17736a0473n2236B27619r1685a7317C4322K74515a75330c7061A60243
11749h0820B876K77685b4791B6285A1321c50338J55039D17158A95840a1530B9251
$$ y = [-476801, 104346, 332766, 34168, 113228, -139964, -59039, -197109, -128461, -36745, 317026, 63738, -126542, 218521, 182236, -341576, -143624, 18686, 81910, 240222, 143569, 47292, 27026, -83513, -241239, 105893, 46303, 327034, -194829, -118929, -223867, -122506, 64126, 185266, -169866, 25705, 51847, -135874, 101272, 105242, 97894, 48432, -64097, -143126, 182550, -75619, 32260, 181127, 386252, 32860, -14775, 179089, 183122, 49100, -182579, -200287, -34913, 85962, -218731, 2120, 117854, 51102, -45431, 283783, 129773, 141717, 40486, -75098, 25086, -255062, -117736, -10473, -62709, 227619, 135934, -17317, 34322, 308837, -175330, -37061, 160243, -80820, 2876, 280561, -24791, 26285, 11321, -350338, -195299, 417158, 195840, -11530, 29251]
11737A80306a21629n9422k3786C2824a8703p9561D50608c01181b7127I1392b705
11725b50265B4324J41100F7507J14791H4532a6331G1585J23685b07927B55518
11714A5454a03910A66319a44026B53251h5839A69782n9989m8641a08040B45713
11703a79847k33538c121l3915G5171K3228b399p3922e228n7071N355A48401a64633
11690B5822a59502C11540g8787G8993b3879F1186a23764j00093I5895a28536A69594
11678A8016K00500q355g8955A22578D5629J23172a67438m8343L9174q3291f5248
11666B33135r9559a16962j39216i1826j58174f2687j03023J4962A08155a30200
11655a98819A53941l5038n3102J64997H1870f4369A13725b0557A53927a6779I8581
$$ y = [180306, -121629, -181051, -204837, 32824, -18703, -98264, 450608, -301181, -27127, 91392, -2705, -250265, 24324, 165424, 67507, 182298, 84532, -16331, 71585, 195270, -207927, 255518, 15454, -103910, 166319, -144026, 253251, -85839, 169782, 109793, 61152, -108040, 245713, -179847, -413385, -3121, -37036, 75171, 98399, -2399, -76321, -5228, -62299, -56944, 148401, -164633, 25822, -159502, 311540, -78787, 78993, -23879, 61186, -123764, -223857, 95895, -128536, 169594, 18016, 218516, 210161, -78955, 122578, 45629, 168801, -167438, -215781, -176607, -259898, -65248, 233135, 133576, -116962, -256178, -91826, -250000, -62687, -165710, -150748, 108155, -130200, -198819, 153941, 118903, 65801, 230798, 81870, -64369, 113725, -20557, 153927, -16779, 98581]
11643a26729N1332l5748A60396p4945b38847C73143a59926C8810K546K98607g296
11631D5975K8889b44848I3185K5746a40500G9306J60710m4169a03580a8347H0393
11619A87c3725l81667A9344a92487A00093i2973l45262J52345A82199a36715B49536
11607A29242j4278a32289B04223P6614n4051b19783D97907B28218b5480E66423
11596E8406a87244D0862A2116J34919J15805j08133J40751o4069r2452J49315
11586B88252m1089L2699K0889I2700K02255j9610m8550M5164J36526A10015c62009
11574A81513A8525J61446B9784R3063f8101B47761F0554L38493j23734J68025
11564D43338A42164a3302l4859A832L60986A16659D5329f8100j03416H8404J999
$$ y = [-126729, -75397, -111145, 160396, 85451, -238847, 373143, -159926, 38810, 41356, 339963, -7296, 45975, 74864, -244848, 93185, 118931, -140500, 79306, 240016, 195847, -103580, -18347, 80393, 187, -33725, -415392, 19344, -192487, 100093, -92973, -438235, -285890, 182199, -136715, 249536, 129242, 114964, -132289, 204223, 280837, 226786, -219783, 497907, 228218, -25480, 566423, 58406, -187244, 40862, 12116, 147035, 262840, 154707, 295458, 231389, 138937, 288252, 247163, 279862, 300751, 92700, 294955, 275345, 226795, 271959, 408485, 110015, -362009, 181513, 18525, 179971, 29784, 122847, -68101, 247761, 60554, 399047, 275313, 443338, 142164, -13302, -48161, 1832, 362818, 116659, 45329, -68100, -171516, 88404, 90403]
11553I0403J1593c95045H9297L5370E0445R4965c10259J49175B8969J36546q1465
11542H4050f4153J0120A22859i1531A07008L0242a49239C55847G1830o972J33485
11531A98343L6159e140A04509a33595D99233B42999H450L49380A16322J00702
11521B17024l3969a25714N8740A55638A8948R8924K7710J5849a70349A14078a67364
11509a60414A80163F353h4880A35073K84662j53332a12781B79822h8418B67899
11498g5754A16951J63358R0590a55115B66078q0060H3298Q591J52155A2386L00805
11487C13191j42495l9280M91493A94320L20463B53222K05807H5878N1250J47436
11477B84564j21926o2224Q9368J68522J76529k34468j27673J86699g2401l9812
$$ y = [90403, 101996, -395045, 89297, 124667, 50445, 145410, -310259, -161084, 28969, 165515, 84050, -64153, -54033, 122859, -91531, 107008, 137250, -149239, 355847, 71830, 64858, 198343, 234502, -5140, 104509, -133595, 499233, 242999, 8450, 357830, 116322, 217024, 183055, -125714, -66974, 155638, 18948, 117872, 145582, 161431, -170349, 114078, -167364, -160414, 180163, 6353, -84880, 135073, 419735, 266403, -112781, 279822, -88418, 267899, -75754, 116951, 280309, 370899, -155115, 266078, 186018, 83298, 91889, 244044, 12386, 313191, 170696, 131416, 622909, 194320, 514783, 253222, 459029, 85878, 137128, 284564, 162638, 100414, 189782, 358304, 534833, 300365, 172692, 359391, -72401, -112213]
11467a12213j11969A42040k9379f9166H0758K663J54564a89350B92473A08099
11456a95206A49702K2250a04358A84436q2211Q9825a8051j70223D54778j91242
11446B63536d6322B295K13057b3288C6465L8061J79020A21644a74449g4212L3035
11435d1177D2084K4953i9437C87280C3783f5327H8036a02358j51140F435J82133
11424A88568g335k41189F189e986A7268b33062B2368b86164A31012d3448I4907
11412A841a32292j10096f4269C08916D6089b27553A34486G458a43384d039E8625
11400G5168A1979J11368B5397J5382c43689a65827l9123A62282b08797b9979A77175
11388a42644A484P8836L80657k10359p5197l3593a23856D00611a41245q302D2678
$$ y = [-112213, -224182, 142040, 112661, -69166, 80758, 83421, 237985, -189350, 292473, 108099, -195206, 149702, 171952, -104358, 184436, 102225, 192050, -18051, -188274, 454778, 263536, -46322, 2295, 215352, -23288, 36465, 74526, 253546, 121644, -174449, -74212, -41177, 42084, 67037, -99437, 387280, 33783, -65327, 88036, -102358, -253498, 6435, 188568, -7335, -248524, 6189, -5986, 17268, -233062, 22368, -286164, 131012, -43448, 94907, 1841, -132292, -242388, -64269, 308916, 46089, -227553, 134486, 7458, -143384, -4039, 58625, 75168, 11979, 123347, 25397, 40779, -343689, -165827, -204950, 162282, -208797, -29979, 177175, -142644, 1484, 80320, 460977, 250618, 175421, 141828, -123856, 400611, -141245, -149547, 42678]
11376A76940b61565c1411A50207K49528F327L4693f6186A12644l4883b5663H0273
11364i2427B24611g975j60539P1571p0174C3541a20628D6476a06063j23527A83848
11352A19700i3409F8961L615M46891A70853a95341A12330f2223j34069B8607f2228
11340b73404N4228G825L06041A2331h3550L4862E8834J12200F6509h4176A00039
11328A0990c28067l6774a14399r1066e8467A91659d5233C58836A7473a05558C27535
11316B61789A8047b84525J39493H5665J7464d026k32161D1269K06606B2643J45872
11305A68515b07858m1066e8432n7293m0951E8180a2466q437A74331E8111c01035
11293i9165A4094R9456A3171L09706a40059j6948k730j32659B45175a46503A49284
$$ y = [176940, -261565, -31411, 150207, 399735, 6327, 41020, -66186, 112644, 77761, -25663, 80273, -92427, 224611, -7975, -168514, -96943, -167117, 33541, -120628, 46476, -106063, -229590, 183848, 119700, -93409, 68961, 72576, 519467, 170853, -195341, 112330, -62223, -196292, 28607, -62228, -273404, -219176, 7825, 313866, 12331, -83550, -48688, 58834, 171034, 66509, -84176, 100039, 10990, -328067, -364841, -114399, -205465, -58467, 191659, -45233, 358836, 17473, -105558, 327535, 261789, 18047, -284525, -145032, 85665, 103129, -4026, -236187, 41269, 247875, 22643, 168515, -207858, -248924, -58432, -115725, -156676, 58180, -12466, -20903, 174331, 58111, -301035, -99165, 14094, 113550, 13171, 322877, -140059, -157007, -159737, -292396, 245175, -146503, 149284]
11281a56098E3961e4232j4138A71185b20619A28283A5985K25741D2612a46727
11270A88003a3461B90626e4926j43527A60908E407b94709R0750B4517a92212N4145
11259a38067B50195b3675j81582B34634a87130B54039a51786B1282d14737r661
11249d24398A12469c483E6406j0724L0214k2503h3317C93558a21459A25155a67937
11237A58752m7081c5635a4312m2477j27015L6921j25545i9818A66976a15015q1489
11226a96504A1655K70967I9773D8296a06766j5725e2170D08566a8261j06272a1732
11214C8824i6850c7642k52074d8718I3971B0622a66859D81848a22482N9905B01104
11202A160O719L2286a24580n596n9073k2207l5092g3470A78997q6936b25485N3560
$$ y = [-156098, 53961, -54232, -68370, 171185, -220619, 128283, 15985, 241726, 42612, -146727, 188003, -13461, 290626, -54926, -198453, 160908, 5407, -294709, -203959, 24517, -192212, -138067, 250195, -23675, -205257, 234634, -187130, 254039, -151786, 21282, -414737, -424398, 112469, -3483, 56406, 45682, 75896, 53393, -83317, 393558, -121459, 125155, -167937, 158752, 111671, -35635, -14312, -56789, -183804, -146883, -272428, -99818, 166976, -115015, -196504, 11655, 282622, 99773, 48296, -106766, -122491, -52170, 408566, -18261, -124533, -11732, 38824, -96850, -37642, -289716, -48718, 93971, 20622, -166859, 481848, -122482, -62577, 201104, 1160, 7879, 40165, -124580, -130176, -189249, -211456, -246548, -73470, 178997, 92061, -225485, -171925]
11190a71925j4860B1398b24164i6099m7188a2955m6994j53513A3697Q9715h0005
11178e0192F1294k497a72201A02072h3416G8305A7737d36889g5016j5203q765
11167i8984K0113A98698b89235A85296c68541a71472P9563c3987E0966a15512
11156d5677k08966A78544e5096A98212b58880b4768k91267A07098e1058B1729
11145b86093e8544j5263C26418d2486j09559L6918D43346A00174J9527a45896
11134C6910a0334m732p2564D19730B06864i85D17837G989c29703A52863J80528
11123C33391d3902B6745a52387A54949a0126G1840J68247D1433a10541p2298e4756
11111c49718G435K46729K2662o6375b7507G6991J93471I6572p109K90181p0208
$$ y = [-171925, -186785, 21398, -224164, -96099, -143287, -12955, -59949, -213462, 13697, 103412, -80005, -50192, 61294, 58797, -172201, 102072, -83416, 78305, 17737, -436889, -75016, -90219, -98984, -78871, 198698, -289235, 185296, -368541, -171472, -91909, -33987, 50966, -115512, -45677, -254643, 178544, -55096, 198212, -258880, -24768, -316035, 107098, -51058, 21729, -286093, -58544, -73807, 326418, -42486, -152045, -115127, 443346, 100174, 119701, -145896, 36910, -10334, -15066, -87630, 419730, 206864, -985, 417837, 7989, -329703, 152863, 333391, -43902, 26745, -152387, 154949, -10126, 71840, 240087, 41433, -110541, -182839, -54756, -349718, 7435, 254164, 276826, 210451, -27507, 76991, 270462, 96572, 89463, 379644, 309436]
11100C09436a25601b4115D58551A29935D4317K74269j05673r8529O9857J81414
11090C65655j26326J1025a92728E19551B8288K30844J7746j19337J94882Q230
11080C60653o8864r366j04476J57275R7284j08466k2061q0943J28188J69156k45557
11069B72823j4448j08309N6094K41022K39265j56459k40281K27531r3109j98147
11059B25982N95822l595K13556m38488K26J89210m2303k56525J45142K42916j31553
11048G40390q0073N96798n58159J26485j85886K03845j30464K11958n2582j30371
11038G41941n3494K93318J11568l48281o4419K75816k73333K4298p2340K66964
11028I02038J58031k66292k42187K80965L04334j49089D65498M21980l03300K9025
$$ y = [309436, -125601, -24115, 458551, 129935, 44317, 318586, 212913, 114384, 184241, 365655, 239329, 250354, -192728, 519551, 28288, 259132, 276878, 157541, 352423, 360653, 291789, 282423, 177947, 335222, 432506, 324040, 301979, 221036, 349224, 518380, 272823, 258375, 150066, 206160, 447182, 686447, 529988, 289707, 517238, 424129, 225982, 821804, 818209, 1031765, 593277, 593503, 782713, 740410, 483885, 629027, 871943, 740390, 660317, 1257115, 698956, 825441, 639555, 843400, 712936, 924894, 872312, 741941, 688447, 981765, 1093333, 745052, 680633, 956449, 683116, 707414, 635074, 902038, 1060069, 793777, 551590, 832555, 1136889, 987800, 465498, 887478, 584178, 613203]
11018F13203q5159L53701j13121j24591J63284K49289k52459N5177j40263K51692
11008I70753k46043j4861K84622j29347k77947M6271J88997j13331k00439J95812
10998G04487k9255L4981K46413m28585K04059k72428N85461j77958p5347J035
10988G92863J60314K87455m69993M62830K28877l1291l3189q1295K17672N0242
10978A584485j0627O48301O1431K64813L06176N61354j40639K7523J00138j87768
10968C215187m95473J83711n97805m88547l00612P80232j81149m84029k4944J20293
10958A726864k34153k74119J26288J71897l33504J40047m15104M5752k16608l7061
10948G00299N2872k28820j56317A80645G9484K96650j27221j14708i5002C93673
$$ y = [613203, 528044, 881745, 768624, 644033, 807317, 1056606, 804147, 859324, 719061, 970753, 724710, 709849, 994471, 865124, 587177, 633448, 822445, 709114, 508675, 704487, 675232, 710213, 956626, 528041, 732100, 459672, 1045133, 867175, 791828, 792863, 953177, 1240632, 770639, 1233469, 1462346, 1431055, 1397866, 1316571, 1534243, 1584485, 1573858, 2222159, 2283590, 2548403, 2854579, 3415933, 3275294, 3302817, 3402955, 3215187, 2719714, 2903425, 2305620, 1817073, 1516461, 2296693, 2115544, 1631515, 1606571, 1726864, 1492711, 1218592, 1344880, 1516777, 1183273, 1323320, 908216, 953968, 737360, 700299, 753171, 524351, 368034, 180645, 79484, 376134, 248913, 134205, -95002, 393673]
10937G0354c7637A97171a31312d6272j6322A53579B8554J30530J34089a17984
10926A16517a09921A35683R1170c53679G7076b54632A58328b44006B40840b1226
10915F2629f74A19257J16285a11627j9409D06366a81667k16121P6383D55L85432
10904C85887a49899R465l7910f3777B0606L51743B1274d3134n2602j457C2236
10892H4382K93754b42352A14962a71173H8633J348c08792E0379N1296d3984G5404
10880g3234j9973o3379K6928F7384a62781B72829h1409m2355A48276a61591A99862
10868F4253N8963J4524a87230B68506b08693B19856d16916a70756A30768J34186
10858B64954d48n2299C175J03431L3347a61916b3229n0994H9498a54805O22F9501
$$ y = [70354, -37637, 197171, -131312, -46272, -62594, 153579, 28554, 159084, 293173, -117984, 116517, -109921, 135683, 226853, -353679, 77076, -254632, 158328, -244006, 240840, -21226, 62629, -674, 119257, 235542, -111627, -131036, 406366, -181667, -397788, -321405, 455, 385887, -149899, -140434, -178344, -63777, 20606, 372349, 21274, -43134, -95736, -97193, 32236, 84382, 378136, -242352, 114962, -171173, 88633, 89981, -308792, 50379, 101675, -43984, 75404, -73234, -93207, -156586, -129658, 67384, -162781, 272829, -81409, -123764, 148276, -161591, 199862, 64253, 123216, 137740, -187230, 268506, -208693, 219856, -416916, -170756, 130768, 264954, -448, -52747, 3175, 106606, 139953, -161916, -23229, -74223, 89498, -154805, -154183, 69501]
10845A26435b38437i8544j713M9293C5040b35589c0354j96031i9836h469l07984
10834c16453J38108A34292a30049B10843g2889l6663C6060c05217A73141j7779
10824A55362A3314i7972P573r2518K8992q1006A69980a15380e2719A80839J19794
10813C00633b84554P4629L1505A74384o8445c7208I4697c5917I2968a82577f9964
10801B29291C611a37119l6420G6999O3334M0172a70343A12466J30571b27616g6521
10789c4586A1486P4852e6826C6015a46306c2992B61530a8798E3575L3879c35375
10777B08085d6248B9024a55002N6727d1457l11091a6002H8834c73952G2679e7212
10765A15189E7006b76842k13696B5324h346k7017D7188L50611g8779B3440a30029
$$ y = [126435, -238437, -98544, -100257, -50964, 35040, -235589, -30354, -226385, -99836, -8469, -316453, -178345, 134292, -130049, 210843, -72889, -109552, 36060, -305217, 173141, 155362, 13314, -97972, -90399, -182917, -153925, -234931, 169980, -115380, -52719, 180839, 300633, -284554, -209925, -178420, 174384, 105939, -37208, 94697, -35917, 92968, -182577, -69964, 229291, 3611, -137119, -173539, 76999, 140333, 180505, -170343, 112466, 243037, -227616, -76521, -34586, 11486, 86338, -56826, 36015, -146306, -32992, 261530, -18798, 53575, 87454, -335375, 208085, -46248, 29024, -155002, -98275, -41457, -352548, -16002, 88834, -373952, 72679, -57212, 115189, 57006, -276842, -490538, 25324, -8346, -35363, 47188, 397799, -78779, 23440, -130029]
10753a62163r1142J17532f2692A22382a9076H070K35687a78584b5352k95908e9382
10741h4604H8568M5234b78921a20001B70079i5147K074k59185J25299n5596G6277
10729e3120A02157C9852d708o0830A09060b20869d7058r7112F3249g973D567K9655
10717C4222h3491C15371F114a21653c5432k11860b9186o01A23012k8121a40475
10705d2428m2688E4023a26762l30535A87816m407B1843O2665k1036J3439J99021
10694B75932D3928B766h9613K6018A66983f1929C32743b3816B00772c613l5937
10683c9550B05389c211j79722h424B43542c68497a202o5256j27864e5367k4534
10672g9901C25544a21620J2100G0409g6359A46180b23648j21086I6675a23316
$$ y = [-162163, -253305, -135773, -62692, 122382, -19076, 8070, 243757, -178584, -25352, -321260, -59382, -84604, 88568, 133802, -278921, -120001, 270079, -95147, -93073, -352258, -226959, -282555, 76277, -53120, 102157, 39852, -4708, -65538, 109060, -220869, -47058, -144170, 63249, -7973, 4567, 34222, -83491, 315371, 6114, -121653, -35432, -247292, -29186, -29787, 123012, 94891, -140475, -42428, -85116, 54023, -126762, -457297, 187816, 183409, 21843, 84508, 63472, 76911, 275932, 43928, 2766, -89613, -63595, 166983, -61929, 332743, -23816, 200772, -3613, -39550, 205389, -3211, -182933, -8424, 243542, -368497, -1202, -66458, -194322, -55367, -79901, 325544, -121620, -109520, 70409, -76359, 146180, -223648, -344734, 96675, -123316]
10661a58599b9883B4463b0561o2010B2830J39656c4754j58086D9184K18282b30074
10649d9276G1012A405R9212j063b18158o6389A23327d7350j17863j78181B8240
10637B85627B8115b14421K8034A45686a46782A14600d6875a4793A89365i3321
10626b03562n1350A34602k5948N0944a8236D4438A9073c06172B25997a29726c4943
10614b07035I739h3486b6976j57697j57254C3749d51337J17638H9739e066j60726
10603a65792H0444a26423j46395J620I9416b3095j44393c8753A3104a46100k13853
10592c59953J67644B26508G989a899j30632M965A33180b46766P9405F1499b4109
10580c05798G4290J02688n0536B1669c1793A33070L4511h7672A02957B2819c58637
$$ y = [-158599, -29883, 24463, -20561, -82571, 22830, 162486, -34754, -192840, 49184, 267466, -230074, -49276, 71012, 1405, 100617, 99554, -218158, -284547, 123327, -47350, -165213, -343394, 28240, 285627, 28115, -214421, -186387, 145686, -146782, 114600, -46875, -14793, 189365, -93321, -203562, -254912, 134602, 108654, 159598, -18236, 44438, 19073, -306172, 225997, -129726, -34943, -207035, 9739, -83486, -26976, -184673, -341927, 33749, -451337, -333699, 89739, -5066, -165792, 80444, -126423, -272818, -271198, 99416, -23095, -167488, -38753, 13104, -146100, -359953, -192309, 226508, 7989, -1899, -132531, -127566, 133180, -246766, -167361, 61499, -24109, -305798, 74290, 176978, 126442, 21669, -31793, 133070, 167581, -87672, 102957, 22819, -358637]
10568a69896B90521o1149c63245A14101K1343C869M3314c01824r016C1723e4924
10556b23998N988J5138P6854B46263C3355a97761A31961n7795a7764n4306H9563
10544d21513D7592L44819a67212a5764m4998H7307A6884e0955k18881b3771o7250
10533i1021m5438K0359C17105H7927O7076O6121i0435j59649C20249j40083h0164
10521h0959D39476A9455R1683J6950B9929L9148j2788a1198j06827D7081H430
10509B6349J34238d1866i776n4462F0005b38065o5310B5997L28990A33355E9076
10497a64572b6319j13146H9279f9964p9357f4094B09806a61223C26815A5227a02937
10485A74497J58029A01480N49435l21366j9743J59490a68449B75429L92941c47266
$$ y = [-169896, 290521, 229372, -363245, 114101, 135444, 3869, 47183, -301824, -310840, 31723, -54924, -223998, -218010, -202872, -126018, 246263, 33355, -197761, 131961, 74166, -17764, -72070, 89563, -421513, 47592, 392411, -167212, -15764, -60762, 87307, 16884, -50955, -269836, -23771, -91021, -136459, -116100, 317105, 87927, 155003, 221124, -90435, -250084, 320249, 180166, -80164, -80959, 439476, 19455, 111138, 128088, 29929, 69077, 56289, -11198, -118025, 47081, 8430, 26349, 160587, -41866, -9776, -64238, 60005, -238065, -303375, 25997, 354987, 133355, 59076, -164572, -26319, -139465, 89279, -69964, -149321, -64094, 209806, -161223, 326815, 15227, -102937, 174497, 332526, 101480, 650915, 329549, 309806, 469296, -168449, 275429, 668370, -347266]
10474A69441a95727m1250J5279J3125Q508B8105a19133c6441j41279J4917m6799
10463b09602Q3989c7355B847J40589b01259A0852g2277k9333m6972B75427d9415
10451A38560b87749J14853E4371a0036G1214i9770E7178k2963Q9384a57886A26023
10439a33555d4836f775D2437a17971D3208a40453B1531a2909j48048r6595D919
10427b14351K7409B99656D8776N6965a67734C86312G0820L6619b48466k25115
10417d73581g4135H021d9045l72572a30807A92533i4422A08343J4984K293a38805
10405H5222O9895C7953i3309j11251m163B17972n8106b9593B79139b31723J7959
10394b13764H7195C767J92476J36197f1794A53055b37725h0130C42903a42000
$$ y = [169441, -195727, -236977, -221698, -208573, -200065, 28105, -119133, -36441, -177720, -162803, -209602, -125613, -37355, 2847, 143436, -201259, 10852, -72277, -101610, -148582, 275427, -49415, 138560, -287749, -172896, 54371, -10036, 71214, -99770, 57178, 34215, 123599, -157886, 126023, -133555, -44836, -6775, 42437, -117971, 43208, -140453, 21531, -12909, -160957, -257552, 4919, -214351, -186942, 299656, 48776, 105741, -167734, 386312, 70820, 107439, -248466, -473581, -74135, 8021, -49045, -421617, -130807, 192533, -94422, 108343, 123327, 125620, -138805, 85222, 155117, 37953, -93309, -204560, -208723, 217972, 159866, -29593, 279139, -231723, -213764, 87195, 3767, 196243, 332440, -61794, 153055, -237725, -80130, 342903, -142000]
10383B13085J34974A30586e5862C38690I1413J82379K31764B12174J26925E0381
10372C42444k1906J03310J48550J3447B92386J34230j65153K55713j46489q6054
10362B84633K76319F2576R9673J09019C6388M47432A88058J44326j23343K20288
10352D29329Q484L65063m7491m2251k84068j78652A08250J42505K38760L8582
10342E28097C1437J85005J57982E2783J11147J64929j1763J86993j49183j37116
10332B17790H6167h1969D7734c01012B60562r9590b01752B42447r8660K7716M5041
10321B16544Q7388j25245D5408J31921Q3207j27396J61157q0001e0614A51360
10310b64324a3068p0969K1683B6698M0525O7187K06741G2049Q7555j6164k3467
$$ y = [213085, 348059, 130586, -55862, 338690, 91413, 273792, 505556, 212174, 339099, 50381, 342444, 320538, 423848, 572398, 585845, 292386, 426616, 261463, 517176, 370687, 284633, 560952, 62576, 162249, 271268, 36388, 483820, 188058, 332384, 209041, 429329, 437813, 802876, 755385, 713134, 429066, 250414, 108250, 250755, 489515, 528097, 31437, 216442, 374424, 52783, 163930, 328859, 317096, 504089, 354906, 217790, 86167, -81969, 47734, -301012, 260562, 160972, -201752, 242447, 143787, 171503, 216544, 303932, 178687, 45408, 177329, 260536, 133140, 294297, 214296, -50614, 151360, -264324, -13068, -84037, -62354, 26698, 67223, 134410, 341151, 72049, 159604, 143440, 119973]
10299A19973a63034H4556a83516O3496L3616k71505A37635a83171O249c8356G3280
10287a71239m8608d3636j53796m0279j5220A0312b7628j8389E6171J9423l6067
10276C9527m495f0033l771l5722c7759q0230C06526p9277a27702N3172E2542e648
10263E11780B31764J29714L36445B53754j8264Q2509J92294A22835J96849c18221
10252I3372b09693A44118B5842d6801J7630j18724j16375A31969a58438j0475
10242a68913A57672f23053b72934a10716M0946A51198B2439h4012B1041O960a8925
10230I2620J08405a77948L3646d8050j63920A78108b31242P7365B11914c48368
10219G7656N909O1792B9405c7324H9100b51850a25225e6747A32477J8147a78867
$$ y = [119973, -163034, 84556, -183516, -120020, -86404, -357909, 137635, -183171, -176922, -38356, 73280, -171239, -219847, -43636, -197432, -237711, -252931, 10312, -27628, -46017, 56171, 75594, 39527, 35032, -60033, -63804, -99526, -37759, -117989, 306526, 227249, -127702, -74530, 52542, -5648, 511780, 231764, 361478, 697923, 253754, 235490, 317999, 510293, 122835, 319684, -318221, 93372, -209693, 144118, 25842, -46801, -29171, -147895, -264270, 131969, -158438, -168913, 157672, -623053, -272934, -110716, -69770, 151198, 22439, -84012, 21041, 28001, -18925, 92620, 201025, -177948, -144302, -48050, -211970, 178108, -231242, -153877, 211914, -348368, 77656, 83565, 145357, 29405, -37324, 89100, -251850, -125225, -56747, 132477, 150624, -178867]
10207F4410a69457c0958j04287C14362E7138b12935n793j54973J23059B01845
10196f4344A4558b57936A87239a98931h7825E5220c968j72722j33260B42148b29076
10184a97831f0796m7075l7509B36906b47117q3033R2578h3440A21801K9748R5560
10173B47109b26378I0478J13816i0454A1299L04716G668J9047g2099A14027b21152
10161E0093f3966o8976e7019Q635B9475c75365b467D50271h8949A43447a27959
10149H5286d79921a44812A01775c25850Q3170Q0397O1963j02537E680c65628a03535
10137c06913f5713a5049A28362j6634n2836b00345P3346B45896F8234a2195A82767
10125E702O4353J77421a64728M8735B88227j12470a58753A06629B9205j2995a51903
$$ y = [64410, -169457, -30958, -135245, 314362, 57138, -212935, -218728, -373701, -250642, 201845, -64344, 14558, -257936, 187239, -198931, -87825, 55220, -3968, -176690, -309950, 242148, -229076, -197831, -60796, -107871, -145380, 236906, -247117, -330150, -237572, -83440, 121801, 151549, 247109, -226378, 90478, 204294, -90454, 11299, 316015, 7668, 26715, -72099, 114027, -221152, 50093, -63966, -132942, -57019, -48384, 29475, -375365, -2467, 450271, -88949, 143447, -127959, 85286, -479921, -144812, 101775, -325850, -242680, -162283, -100320, -202857, 5680, -365628, -103535, -306913, -65713, -15049, 128362, 111728, 58892, -200345, -126999, 245896, 68234, -12195, 182767, 5702, 70055, 247476, -164728, -115993, 288227, 175757, -158753, 106629, 29205, 16210, -151903]
10113a51273N6624o7036A27499c90167D1588b10057n2845j06936B27216h8630
10102h0258j13259k05206M4901D45169j17834c0294K330I0297J19389O6935D0529
10090A12600A99f4323q5785A02974a40792G4046a40769r8182a6895q2431j33670
10079b32996C24604a39028B91245a57988E9033a44483a1128k83171b175m3408
10069d5583q9284k12102h2800c8370G4242e2046a4622C2775A4676b3517A76088
10057B6625J7145g6789k16410A2320O3379b3145A5623e0767i810j08513c2943
10045B7288P1516a7552l27423c2981h043j30057q1720B00908D744b61803A24074
10033d12735a04238I1807R6962b15283h950A4994e7995k22566b8021m4633B9446
$$ y = [-151273, -94649, -161685, 127499, -390167, 41588, -210057, -262902, -369838, 227216, -88630, -80258, -193517, -398723, -353822, 445169, 327335, -30294, -27964, 90297, 209686, 276621, 40529, 112600, 199, -64323, -150108, 102974, -140792, 74046, -140769, -238951, -16895, -99326, -232996, 324604, -139028, 291245, -157988, 59033, -144483, -11128, -294299, -2175, -45583, -134867, -346969, -82800, -38370, 74242, -52046, -14622, 32775, 14676, -23517, 176088, 26625, 43770, -76789, -293199, 12320, 75699, -23145, 15623, -50767, -9810, -118323, -32943, 27288, 98804, -17552, -344975, -32981, -8043, -138100, -219820, 200908, 4744, -261803, 124074, -412735, -104238, 91807, 188769, -215283, -8950, 14994, -57995, -280561, -28021, -72654, 29446]
10021I9225f7679m0740o3086l7578r4516H0214H891a72606M6184o7141m1410h8478
10008b29102K3906J113a3778j50893H3370c08498j16368f3054k0526c3245l21
9997c3566j10087J4929A67143l3062o5082e5489A95814b08165B8605O6748a71838
9985A27896a91515g8008A69854e5918F5686K53028b9166j95863n8498m7720G9451
9973B70309j32348i5297r7526O1451G9872g1202B20504a97237F6802a70465o6079
9962b36544C14006H3913a17101p5987H0461b29246a07468j47700N6318L7165A2134
9950D9855c28108E4009N464h7541j94479G6451c91355a20780j07414i494n7237
9939f6731k38844A37995b27447C2000c62067f0806A26121a12307a9352D5135j3688
$$ y = [99225, -67679, -108419, -171505, -209083, -303599, 80214, 8891, -172606, -126422, -193563, -234973, -88478, -229102, -205196, -204083, -13778, -164671, 83370, -308498, -424866, -63054, -83580, -33245, -33566, -143653, -128724, 167143, 134081, 68999, -55489, 195814, -208165, 28605, 95353, -171838, 127896, -191515, -78008, 169854, -55918, 65686, 318714, -29166, -225029, -283527, -331247, 79451, 270309, 137961, -95297, -192823, -131372, 79872, -71202, 220504, -197237, 66802, -170465, -236544, 314006, 83913, -117101, -193088, 80461, -229246, -107468, -255168, -198850, -161685, 12134, 49855, -328108, 54009, 59473, -87541, -282020, 76451, -391355, -120780, -228194, -9494, -66731, -305575, 137995, -227447, 32000, -362067, -60806, 126121, -112307, -19352, 45135, 31447]
9928C1447J5724d95216J70642J41584A59545b40481C0930b18779a04899l8021
9918a42920J1632H932M6703N9168a50190M2263m184d4326m19692a4111f151j00318
9906a06469I1813j7935K5078J24414c06707e2789j8467C93210k2984A52314d3387
9894B92052A21100m3385b59546g2833A80351b33771M3337b1294l62023h4488A42166
9882B41118a75857d9789j17330A34081K9031J09190j18153p0228a93141a3139
9871b38587f7639C0828d3742m50205A37791b17108k48173h4002j3162E7612a14503
9859A48291i8944j80151A80530a5472k40937A24599m8204a98776M8204G2256K6556
9848I8812B9675O7849b78348M3104l9919H1128a22201G1895i3108a2037n40838
$$ y = [31447, 47171, -495216, -324574, -182990, 159545, -240481, 30930, -218779, -104899, -142920, -131288, 8932, 55635, 114803, -150190, -107927, -112111, -44326, -464018, -14111, -6151, -106469, 91813, 73878, 98956, 223370, -306707, -52789, -71256, 393210, 370226, 152314, -43387, 292052, 121100, 77715, -259546, -72833, 180351, -233771, -190434, -21294, -383317, -84488, 142166, 241118, -175857, -49789, -167119, 134081, 163112, 272302, 154149, 83921, -193141, -13139, -238587, -67639, 30828, -43742, -493947, 137791, -217108, -465281, -84002, -97164, 57612, -114503, 148291, -98944, -279095, 180530, -15472, -256409, 124599, 76395, -198776, -150572, 72256, 98812, 29675, 97524, -278348, -235244, -275163, 81128, -122201, 71895, -93108, -12037, -552875]
9837e52875A17332b5122C6750b7381n8603D6449R153a46586j73958c5045C5362
9825b01973f2278j71799H985L00793e1912a9532j11791G2095a31665k57019g6617
9813I8619P3019n4788b35046P143D2735L6589J02861r919a4165k1627p3223A30
9800B1365a34609B96145a37641j56346A13384a88814d4021A74213F570b12614
9789a70973A66652b50074J14352e9757A46937D0710a00756q5740q3743q0419a2124
9777C31136b47616a09228n7033j25897d8355j74850b408A2987c9885C13345b8597
9765c8356j07224a1016j75717d3380n8857j80536a07442A75185e2260k22889L1973
9754b43176g4950A3395e75269J63180p4835B13515e181k12689L7116A7645K93714
$$ y = [-552875, 117332, -25122, 36750, -27381, -85984, 46449, 55602, -146586, -320544, -35045, 35362, -201973, -62278, -234077, 8985, 309778, -51912, -19532, -131323, 72095, -131665, -388684, -76617, 98619, 171638, 116850, -235046, -227903, 42735, 79324, 182185, 172266, -14165, -35792, -109015, 130, 21365, -134609, 296145, -137641, -293987, 113384, -188814, -44021, 174213, 6570, -212614, -170973, 166652, -250074, -135722, -59757, 146937, 40710, -100756, -186496, -270239, -350658, -12124, 331136, -247616, -109228, -166261, -292158, -48355, -223205, -2408, 12987, -39885, 313345, -28597, -38356, -145580, -11016, -186733, -43380, -102237, -282773, -107442, 175185, -52260, -275149, -243176, -74950, 13395, -575269, -412089, -486924, 213515, -5181, -217870, -180754, 17645, 311359]
9743C11359A8881L33767A31175c57618j0290a47097j27087f5651B21205a50669
9732B02031B8687J50135f4382n9019A6630a95941B99357I5550i8566B12928j05274
9721A07654K6357a46119c7139l03244A17978a33918A41473K77852A48418a37191
9710g0181j12934F3292d0994A67526b05038j28078A36663b25386k860D0712J27465
9699A68177c07988J18475A64527B5742e26794g1498j94464A04594c86302D3649
9688a07126p3575J8832c3078j31445P6961g134A84976H4181L7432a64287j5027
9677a79314F265b32487F4568A0084a31150P018A8243a29101B77272b46054D3011
9665C51657P451g0771H6782c83458e1062A20591J8505m6716D2827b00480h6515
$$ y = [311359, 18881, 352648, 131175, -357618, -367908, -147097, -274184, -65651, 221205, -150669, 202031, 28687, 178822, -64382, -123401, 16630, -195941, 299357, 95550, -98566, 212928, 107654, 134011, -146119, -37139, -340383, 117978, -133918, 141473, 419325, 148418, -137191, -70181, -183115, 63292, -40994, 167526, -205038, -333116, 136663, -225386, -228246, 40712, 168177, -307988, -189513, 164527, 25742, -526794, -71498, -265962, 104594, -386302, 43649, -107126, -180701, -161869, -33078, -164523, -87562, -7134, 184976, 84181, 121613, -164287, -179314, 6265, -232487, 64568, 10084, -131150, -124132, 18243, -129101, 277272, -246054, 43011, 351657, 359108, -70771, 86782, -383458, -51062, 120591, 139096, 92380, 42827, -200480, -86515]
9653A64902a73474L2472B38880c7516C653q4f2430p3103k04263p5067J22449j22424
9641d14838B96058a05335J6513a6400n7468p3416d2208j78656B19014b70071k00613
9630d70684g8062b3044G7031N2383j5838b03494A87111a44485c1138C7541a48788
9618f0091j91055K4910f6958F914K5861a46112b8866r763j84360L1930e0928B2362
9605A40012a78311e2997I1125P1237a9102C3102f4609r987b0122m32221A09274
9593e9224r502C0477b83C46347g4779G7095A9118a16142N5727r953j91944B46003
9580a24777d1297I0021a02081D4376J7459f118j40647C71682a72727B95810a04158
9568f3682j66426C33763E1920J4462P7721a21736J9502N758m508B7382a24654
$$ y = [164902, -173474, -141002, 238880, -37516, 3653, 3569, -62430, -135533, -339796, -414863, -292414, -414838, 296058, -105335, -88822, -16400, -73868, -147284, -42208, -220864, 219014, -270071, -470684, -78062, -23044, 77031, 129414, 113576, -203494, 187111, -144485, -31138, 37541, -148788, -60091, -251146, -226236, -66958, 6914, 32775, -146112, -28866, -38629, -222989, -191059, -50928, 22362, 140012, -178311, -52997, 91125, 162362, -19102, 33102, -64609, -74596, -20122, -452343, 109274, -59224, -68726, 30477, -283, 346347, -74779, 77095, 19118, -116142, -60415, -70368, -262312, 246003, -124777, -41297, 90021, -102081, 44376, 61835, -6118, -146765, 371682, -172727, 295810, -104158, -63682, -230108, 333763, 51920, 66382, 144103, -121736, -102234, -96476, -100984, 27382, -124654]
9556g7723j29202g6145J1247A13781a39971D7073c6828a1729B89177C8626K48163
9545B86789c0343n6415p2268l8392A5032a65014O7098E6479g2659a1322B43352
9533E0917K15122a28181K0894j50546C7791f6600C4789a63762c5771j32336j64299
9522c32406k7533a41099l2377h2597j34732c8342j4088n29827A04351f8087J0008
9511e8079C67552d6628k12252C86344d8463p6062f1029n5325A09832l0371d87190
9499a73019J0124d5098p1900d8833F7806c12611H4683l1682G712a58424G2894
9487b59193R9981k63005J67389A58997c68641g9368I843c11043R0379A8846c54979
9475c05173J21587A8440a13651c1615B45158f5426B23354b47140g8832l3138B74285
$$ y = [-77723, -206925, -76145, -64898, 113781, -139971, 47073, -36828, -11729, 289177, 38626, 286789, -30343, -86758, -159026, -197418, 15032, -165014, -97916, 56479, -72659, -11322, 243352, 50917, 266039, -128181, -107287, -257833, 37791, -66600, 34789, -163762, -35771, -168107, -332406, -359939, -141099, -173476, -82597, -217329, -38342, -52430, -582257, 104351, -68087, -58079, 367552, -46628, -258880, 386344, -48463, -124525, -61029, -116354, 109832, 79461, -487190, -173019, -162895, -45098, -116998, -48833, 67806, -312611, 84683, 53001, 7712, -158424, 72894, -259193, -159212, -422217, -254828, 158997, -368641, -79368, 9843, -311043, -220664, 18846, -354979, -305173, -183586, 18440, -113651, -31615, 245158, -65426, 223354, -247140, -78832, -111970, 274285]
9463b47196f0463C65947b02739A40173C3220K21438F787a00733K4222A16643a08796
9451a27498D3991a31991p1454M9875c9376j73103J1548P7837B14038l7310i7716
9439a11276j25496f0497j73347L5290M0802B31919a05953L4553f305j248A30264
9427a09841B7666g4071C97080H2289d95483B90530B3345e2957F0120a87839B40214
9415a44546b2768p1280b1711A37488b46806J01459L1626A19921a33655H9548K43382
9404C32930B9744J08251a90453A89117a05114D0137L44766E2298a75452A08389
9393h3212j86966J02298K083M6441k41810i9710a2769j48592H4754L5857C6718
9381b79543a05944j31372a15799b1042q0321E6480K25962b30244B0815J20793
$$ y = [-247196, -60463, 365947, -202739, 140173, 33220, 254658, 6787, -100733, -76511, 116643, -108796, -127498, 43991, -131991, -203445, -153570, -39376, -212479, -200931, -123094, 214038, 176728, -97716, -111276, -236772, -60497, -233844, -198554, -157752, 231919, -105953, -71400, -6305, -7553, 130264, -109841, 27666, -74071, 397080, 82289, -495483, 290530, 23345, -52957, 60120, -187839, 240214, -144546, -22768, -94048, -21711, 137488, -246806, -145347, -113721, 119921, -133655, 89548, 332930, 29744, 137995, -190453, 189117, -105114, 40137, 384903, 52298, -175452, 108389, -83212, -270178, -167880, -165797, -119356, -361166, -99710, -12769, -161361, 84754, 120611, 36718, -279543, -105944, -237316, -115799, -21042, -101363, 56480, 282442, -230244, 20815, 141608]
9371A41608e4605k83126a00720k11820I3383a43827f3195a2040A12184b34706
9360b41474I3155j1322b71747J6002A0320a40096K4735j86171c8480E8197a21137
9348B29643g566m19663a54323F6060i0848B2268c2976C86602g3693m8811L2374
9337i0130n7909j84688C34023b91145N9415J11609D9685a91443L0632j302N1840
9326a10273J4386A17024l064a72036N4803A3183a38994j09620a454A08068g4592
9314i2839o5048j60264B23981c16950J2116l2560f1150A62393e1056C0839a87634
9302C30607k0649J3200C8197c23842E7072a2085q0092M5177j72123j85569A43429
9290A90486E5640j6955P5627a81645D1900e1488C16553a27498a0712n8825J0273
$$ y = [141608, -54605, -337731, -100720, -312540, 93383, -143827, -63195, -12040, 112184, -234706, -241474, 93155, 81833, -271747, -255745, 10320, -140096, -115361, -301532, -38480, 58197, -121137, 229643, -7566, -427229, -154323, 66060, -90848, 22268, -32976, 386602, -73693, -122504, -90130, -148039, -332727, 334023, -291145, -231730, -120121, 49685, -191443, -160811, -162113, -110273, -95887, 117024, 113960, -172036, -117233, 13183, -138994, -248614, -1454, 108068, -74592, -92839, -157887, -318151, 223981, -316950, -304834, -337394, -61150, 162393, -51056, 30839, -187634, 330607, 309958, 323158, 38197, -323842, 57072, -12085, -92177, -47000, -219123, -404692, 143429, 190486, 55640, 38685, 114312, -181645, 41900, -51488, 316553, -127498, -10712, -69537, -59264]
9279e9264A73132a3488j37000n3363l7091G544a75879N5318j79709c5790A48458
9267c45533J14240G4494b74350e3481b2837n1643B27279b78376A99044b43353
9256c82402H206c19093f4793n1555o6753q7788A20347N5240M1473d49912e6k7685
9244b7741C8387f8208m6927J7182A0968b40505R364g4021k97426b0134N149A18806
9231G1412N048d40797J24699H6067b38336J03847a3645p8464p8070D675e7359
9219c07162B58622N4971b16540P4089F218a27246L1782D7904P468K50024O963
9208C12359A17196f2699F9640O0016G012a54866B10773a11631C16490a85460a957
9196b73181A12322L16218d47147J50246c7833k57413B8380a89751R2927o9077
$$ y = [-59264, 173132, -13488, -150488, -203851, -240942, 7544, -175879, -120561, -300270, -35790, 148458, -345533, -231293, 74494, -274350, -53481, -22837, -74480, 227279, -278376, 199044, -243353, -382402, 8206, -319093, -64793, -116348, -183101, -270889, 120347, 175587, 217060, -449912, -56, -27741, 38387, -68208, -115135, -97953, 10968, -240505, -231141, -74021, -371447, -20134, -14985, 118806, 71412, 76460, -440797, -316098, 86067, -238336, -134489, -13645, -92109, -170179, 4675, -57359, -307162, 258622, 313593, -216540, -142451, 6218, -127246, -95464, 47904, 55372, 305396, 312359, 117196, -62699, 69640, 129656, 7012, -154866, 210773, -111631, 316490, -185460, -1957, -273181, 112322, 428540, -447147, -296901, -37833, -295246, 28380, -189751, -96824, -165901]
9186a65901e9673C02329c6034B3873f4598j81481h4909B3662M8332c42303L1023
9175c11280c3960p2504m21E2382e7268l5845A85681a28467L6737l4171N6604A72340
9162b5296A29706Q4562r4229K7944b038j08561M1595r2057A83775a4798A341K72497
9150B73838I3174b72930k1212A35765a76150r5147R0892g9681A36944a48594c1968
9138d6745n9153M1561m05337C9357c6774k6290r400B4428h6182B6179a85945d0757
9125h5126j23361F8733j9392J9747A0027A522c19063B9395a48098o536j2424A65961
9112a7423j1302D0924a45810N2393B09138F6676g3400B4402K22895f9133j08477
9101a77610F9332g9463p7906R728e5574j27718C97486E2176a16737J9503A25285
$$ y = [-165901, -59673, 302329, -36034, 23873, -64598, -246079, -84909, 23662, 71994, -342303, -311280, -33960, -106464, -106885, 52382, -57268, -93113, 185681, -128467, -91730, -125901, -69297, 172340, -25296, 129706, 214268, 120039, 147983, -2038, -110599, -69004, -161061, 183775, -14798, 1341, 273838, 93174, -272930, -294142, 135765, -176150, -271297, -180405, -79681, 136944, -148594, -31968, -46745, -105898, -64337, -469674, 39357, -36774, -63064, -72464, 24428, -86182, 26179, -185945, -40757, -85126, -208487, 68733, 49341, 69088, 10027, 1522, -319063, 29395, -148098, -154634, -167058, 165961, -17423, -28725, 40924, -145810, -93417, 209138, 66676, -73400, 24402, 247297, -69133, -177610, 69332, -79463, -157369, -147641, -55574, -183292, 397486, 52176, -116737, -97234, 125285]
9089A08686c3305F2236r837h1942J3976A78632p7817a59676A63339a52650G8456
9077A42592a0566o4307G6959g9364l04449Q6087e2039A86161e9125J5748k11624
9066b55001a03313j21918m4694O9850b4520l360A48820a53415f6095k3307m9400
9055a38802a1652j314A50919D2002d4317j93965e5124A1044K8708a04280A64112
9043b7367A75064b14739A91798a82275D5162f8137A25630R2550j3277C4403N596
9032C9999A3809a19650b8055j85770g7016l96718H6171i1614A48486f6102j90672
9021b56774A63811J667n3330J2815b06499b6320j62542L4072E8966D17a78199
9009A08931b52271A42968d6639H1991b1826G2193E687a00408M0953a9671j71182
$$ y = [108686, -33305, 62236, 52399, -81942, -67966, 178632, 100815, -159676, 163339, -152650, 78456, 142592, -10566, -74873, 76959, -79364, -383813, -297726, -52039, 186161, -59125, -43377, -255001, -103313, -225231, -269925, -200075, -24520, -27880, 148820, -153415, -66095, -89402, -138802, -11652, -12966, 150919, 42002, -44317, -238282, -55124, 11044, 39752, -104280, 164112, -27367, 175064, -214739, 191798, -182275, 45162, -68137, 125630, 218180, 204903, 34403, 39999, 13809, -119650, -28055, -213825, -77016, -473734, 86171, -91614, 148486, -66102, -256774, 163811, 165478, 112148, 124963, -206499, -26320, -188862, -154790, 58966, 417, -178199, 108931, -252271, 142968, -46639, 81991, -21826, 72193, 5687, -100408, -59455, -19671, -190853]
8998a90853B41237D617b80056a10909M6397D1936J44358d9882k52728a35754D0303
8986c58654M6473a51950c7791k1577l18983i3148k5710K4327r9542B50621j13932
8975A36689b18985R0408N6280b9534k68043B4923b02995b0069F0415i8172o3858
8964a62030O765K4321j78244B33048C9592a21956A23395a78652q1032R6471n7922
8953b21135f334B1723c76691a63440G1355a4376j58228B15769f3153l23468J13520
8942b73101E8220b65410g0021C7679J87937a35537B08697i2303C46357b01062
8931G9331d5067G1124d9565j42349A60681a54804D19894O67642J307854J873752
8921D269142J256627A373979C91701A9117J01959Q523l3890N2274k5155H76K46300
$$ y = [-190853, 241237, 4617, -280056, -110909, -64512, 41936, 186294, -49882, -302610, -135754, 40303, -358654, -312181, -151950, -37791, -59368, -378351, -93148, -118858, -94531, -194073, 250621, 136689, -218985, -128577, -72297, -29534, -297577, 24923, -202995, -20069, 60415, -98172, -162030, -155265, -130944, -309188, 233048, 39592, -121956, 123395, -178652, -259684, -163213, -221135, -6334, 21723, -376691, -163440, 71355, -14376, -172604, 215769, -63153, -386621, -273101, 58220, -265410, -70021, 37679, 225616, -135537, 208697, -92303, 346357, -201062, 79331, -45067, 71124, -49565, -191914, 160681, -154804, 419894, 1087536, 2395390, 4269142, 5525769, 1373979, 391701, 19117, 121076, 129599, 95709, 147983, 122828, 876, 247176]
8910B47176A8900i0231A54218p6540f2719n3518j1024B87679c69907c1681C0132
8898a94750R1287j52196A45873L3466b07806M5196k22158h7403m0975j02092A2490
8886c993A95433H9933d60877B37720H2311a08150d0835o1732o7661h318A82003
8874B2103h3519A24834a92823E899L4219J55740d1463H5774e1928J8553j42659
8863a76034d7335A30740a03218j03394B98727a78216g3755k92004d6761A62994
$$ y = [247176, 18900, -90231, 154218, 77678, -62719, -116237, -127261, 287679, -369907, -31681, 30132, -194750, -103463, -255659, 145873, 179339, -207806, -162610, -384768, -87403, -128378, -230470, 12490, -3993, 195433, 89933, -460877, 237720, 82311, -108150, -40835, -102567, -170228, -8318, 182003, 22103, -83519, 124834, -192823, 5899, 40118, 195858, -41463, 85774, -51928, -33375, -176034, -47335, 130740, -103218, -206612, 298727, -178216, -73755, -365759, -46761, 162994]
$$ [...]
##END NTUPLES=NMR SPECTRUM
##END=
