##TITLE=AC1691_COLAH14372_8650510_jDf0gVVFdt
##JCAMPDX= 6.0         $$ Bruker NMR JCAMP-DX V2.0
##DATA TYPE= NMR SPECTRUM
##DATA CLASS= NTUPLES
##ORIGIN= BRUKER
##OWNER= Administrator
$$ 1.72 TOPSPIN		Version 2.1
$$ 2014-05-30 17:46:08.925 -0700  Administrator@X
$$ Compression mode = diff/dup
##.OBSERVE FREQUENCY= 400.02188249412
##.OBSERVE NUCLEUS= ^1H
##.ACQUISITION MODE= SIMULTANEOUS (DQD)
##.ACQUISITION SCHEME= undefined
##.AVERAGES= 64
##.DIGITISER RES= 22
##SPECTROMETER/DATA SYSTEM= spect
##.PULSE SEQUENCE= noesygpps1d.comp
##.SOLVENT NAME= COFFEE_meoh
##.SHIFT REFERENCE= INTERNAL, COFFEE_meoh, 1, 14.96089
##AUDIT TRAIL= $$ (NUMBER, WHEN, WHO, WHERE, PROCESS, VERSION, WHAT)
$$ ##TITLE= Audit trail, TOPSPIN		Version 2.1
$$ ##JCAMPDX= 5.01
$$ ##ORIGIN= Bruker BioSpin GmbH
$$ ##OWNER= Administrator
$$ $$ E:\/data/COFFEE/nmr/AC1691_COLAH14372_8650510_jDf0gVVFdt/12/pdata/1/auditp.txt
$$ ##AUDIT TRAIL=  $$ (NUMBER, WHEN, WHO, WHERE, PROCESS, VERSION, WHAT)
(   1,<2014-05-30 17:46:03.878 -0700>,<Administrator>,<X>,<go>,<TOPSPIN 2.1>,
      <created by zg
	started at 2014-05-30 17:34:34.285 -0700,
	POWCHK enabled, PULCHK disabled,
       configuration hash MD5:
       C8 4E 4E 5D D3 5C D8 9E 9F 52 82 E0 59 8A DE 15
       data hash MD5: 64K
       38 AB C4 1D D1 D4 88 C0 E0 70 6B 68 C6 C1 97 A8>)
(   2,<2014-05-30 17:46:06.863 -0700>,<Administrator>,<X>,<proc1d>,<TOPSPIN 2.1>,
      <Start of raw data processing
       efp LB = 0.3 FT_mod = 6 PKNL = 1 PHC0 = 0 PHC1 = 0 SI = 128K 
       data hash MD5: 128K
       8C FE 8D 01 C2 79 0F C4 6D 83 5E CF 66 C7 37 E7>)
(   3,<2014-05-30 17:46:07.878 -0700>,<Administrator>,<X>,<proc1d>,<TOPSPIN 2.1>,
      <pk PHC0 = -86.37451 PHC1 = 0 
       data hash MD5: 128K
       AB 98 2E E3 C6 00 75 C0 3B A9 F5 44 E0 EF 38 9A>)
(   4,<2014-05-30 17:46:08.347 -0700>,<Administrator>,<X>,<proc1d>,<TOPSPIN 2.1>,
      <abs ABSG = 1 
       data hash MD5: 128K
       04 F8 D1 6F EE 3A AB CC 18 58 4D D9 9D DF A0 E0>)
(   5,<2014-05-30 17:46:08.457 -0700>,<Administrator>,<X>,<proc1d>,<TOPSPIN 2.1>,
      <abs ABSG = 2 
       data hash MD5: 128K
       47 72 66 1D 58 DE 66 C0 C2 6F 4F B8 C6 82 E6 DF>)
(   6,<2014-05-30 17:46:08.550 -0700>,<Administrator>,<X>,<proc1d>,<TOPSPIN 2.1>,
      <abs ABSG = 3 
       data hash MD5: 128K
       EB 4C 62 8E 41 0E 05 E7 24 4D C1 5D 20 C5 78 EA>)
(   7,<2014-05-30 17:46:08.644 -0700>,<Administrator>,<X>,<proc1d>,<TOPSPIN 2.1>,
      <abs ABSG = 4 
       data hash MD5: 128K
       0D 9D 34 4F C4 74 C9 E3 91 38 8A E0 D8 18 BE 7A>)
(   8,<2014-05-30 17:46:08.753 -0700>,<Administrator>,<X>,<proc1d>,<TOPSPIN 2.1>,
      <abs ABSG = 5 
       data hash MD5: 128K
       0B 82 FE 3F BE A4 4B 8B 99 A6 8E 8C 45 16 23 B4>)
$$ ##END=
$$ 
$$ $$ hash MD5
$$ $$ 19 05 D6 81 9D 07 94 CB 31 C9 9D 9D 1A 73 AA CA
##$RELAX= 
##$RELAX= 
##$RELAX= 
##$RELAX= 
##$RELAX= 
##$RELAX= 
##$RELAX= 
##$RELAX= 
$$ Bruker specific parameters
$$ --------------------------
##$DU= <E:\>
##$EXPNO= 12
$$ [...]
##$TP07= 0
##$TPNAME0= <>
##$TPNAME1= <>
##$TPNAME2= <>
##$TPNAME3= <>
##$TPNAME4= <>
##$TPNAME5= <>
##$TPNAME6= <>
##$TPNAME7= <>
##$TPOAL= (0..7)
0.5 0.5 0.5 0.5 0.5 0.5 0.5 0.5
##$TPOFFS= (0..7)
0 0 0 0 0 0 0 0
##$TUNHIN= 0
##$TUNHOUT= 0
##$TUNXOUT= 0
##$USERA1= <user>
##$USERA2= <user>
##$USERA3= <user>
##$USERA4= <user>
##$USERA5= <user>
##$V9= 5
##$VALIST= <valist>
##$VCLIST= <CCCCCCCCCCCCCCC>
##$VD= 0
##$VDLIST= <DDDDDDDDDDDDDDD>
##$VPLIST= <PPPPPPPPPPPPPPP>
##$VTLIST= <TTTTTTTTTTTTTTT>
##$WBST= 2048
##$WBSW= 25
##$XGAIN= (0..3)
0 0 0 0
##$XL= 0
##$YL= 0
##$YMAX_a= 6649047
##$YMIN_a= -12412854
##$ZGOPTNS= <>
##$ZL1= 120
##$ZL2= 120
##$ZL3= 120
##$ZL4= 120
##$ABSF1= 14.96089
##$ABSF2= -5.597292
##$ABSG= 5
##$ABSL= 3
##$ALPHA= 0
##$AQORDER= 0
##$ASSFAC= 0
##$ASSFACI= 0
##$ASSFACX= 0
##$ASSWID= 0
##$AUNMP= <proc_prof1d_extract.lims>
##$AXLEFT= 0
##$AXNAME= <>
##$AXNUC= <1H>
##$AXRIGHT= 0
##$AXTYPE= 0
##$AXUNIT= <>
##$AZFE= 0.1
##$AZFW= 0.1
##$BCFW= 0
##$BC_mod= 0
##$BYTORDP= 0
##$COROFFS= 0
##$CY= 15
##$DATMOD= 1
##$DC= 0
##$DFILT= <>
##$DTYPP= 0
##$F1P= 0
##$F2P= 0
##$FCOR= 0.5
##$FTSIZE= 131072
##$FT_mod= 6
##$GAMMA= 0
##$GB= 0
##$INTBC= 1
##$INTSCL= 1
##$ISEN= 128
##$LB= 0.3
##$LEV0= 0
##$LPBIN= 0
##$MAXI= 10000
##$MC2= 0
##$MEAN= 0
##$ME_mod= 0
##$MI= 0
##$NCOEF= 0
##$NC_proc= -2
##$NLEV= 6
##$NOISF1= 0
##$NOISF2= 0
##$NSP= 0
##$NTH_PI= 0
##$NZP= 0
##$OFFSET= 14.96089
##$PC= 1
##$PHC0= -86.37451
##$PHC1= 0
##$PH_mod= 1
##$PKNL= yes
##$PPARMOD= 0
##$PPDIAG= 0
##$PPIPTYP= 0
##$PPMPNUM= 2147483647
##$PPRESOL= 1
##$PSCAL= 4
##$PSIGN= 0
##$PYNMP= <proc.py>
##$REVERSE= no
##$SF= 400.020009680849
##$SI= 131072
##$SIGF1= 0
##$SIGF2= 0
##$SINO= 400
##$SIOLD= 131072
##$SPECTYP= <>
##$SREGLST= <1H.CDCl3>
##$SSB= 0
##$STSI= 131072
##$STSR= 0
##$SW_p= 8223.68421052631
##$SYMM= 0
##$S_DEV= 0
##$TDeff= 65536
##$TDoff= 0
##$TI= <>
##$TILT= no
##$TM1= 0
##$TM2= 0
##$TOPLEV= 0
##$USERP1= <user>
##$USERP2= <user>
##$USERP3= <user>
##$USERP4= <user>
##$USERP5= <user>
##$WDW= 1
##$XDIM= 131072
##$YMAX_p= 379788926
##$YMIN_p= -14303
##$CURPLOT= <Network HP LaserJet P1505>
##$CURPRIN= <$Network HP LaserJet P1505>
##$DFORMAT= <normdp>
##$LAYOUT= <+/1D_H.xwp>
##$LFORMAT= <normlp>
##$PFORMAT= <normpl>
##$SURQMSG= 1
$$ End of Bruker specific parameters
$$ ---------------------------------
##NTUPLES= NMR SPECTRUM
##VAR_NAME=  FREQUENCY,     SPECTRUM/REAL,   SPECTRUM/IMAG
##SYMBOL=    X,             R,               I
##VAR_TYPE=  INDEPENDENT,   DEPENDENT,       DEPENDENT
##VAR_FORM=  AFFN,          ASDF,            ASDF
##VAR_DIM=   131072,        131072,          131072
##UNITS=     HZ,            ARBITRARY UNITS, ARBITRARY UNITS
##FACTOR=    0.0627417313425164, 1,          1
##FIRST=     8223.62146879497, -305,         -65235
##LAST=      0,             1522,            -65488
##MIN=       0,             -14303,          0
##MAX=       8223.62146879497, 379788926,    0
$$ Real data points
##PAGE= N=1
##DATA TABLE= (X++(R..R)), XYDATA
$$ [...]
61692D72069l610m051m375m303l810l131k604k342k048j365m86j24n65j042o14
61677D37599L91N69o63k034j890j67J684K434K000R50o9m51n7M20J62n25n16N45
61659D40382J786K490K929L437L627L291L087L476L716L068K311K769M119M660
61645D85148L817L002L547N000O032O113N501M331K626Q42m75j406k475l813m992
61630E12798n703o103o421o576o313n553m565l742l175k451j110O57K002K317
61616D66062J886J456J384J428J162L53r65k509l908n055o126p172p915q155q169
61601D23757q357q676q758q446p864p059o048n122m735m896n079m879m466m225
61587C35147m189m051l598k917k292j961j950k034k016j951k040k279k451k468
$$ plain form
61692 472069 468459 464408 460033 455730 451920 448789 446185 443843 441795 440430 439944 439820 439255 438213 437599
61677 437599 437990 438559 437896 435862 433972 433805 435489 437923 439923 440873 440804 440353 440296 440716 440878 440353 439837 440382
61659 440382 442168 444658 447587 451024 454651 457942 461029 464505 468221 471289 473600 476369 480488 485148
61645 485148 488965 491967 495514 500514 506546 512659 518160 522491 525117 525959 525484 524078 521603 517790 512798
61630 512798 507095 500992 494571 487995 481682 476129 471564 467822 464647 462196 461086 461743 463745 466062
61616 466062 467948 469404 470788 472216 473378 473731 472766 470257 466349 461294 455168 447996 440081 431926 423757
61601 423757 415400 406724 397966 389520 381656 374597 368549 363427 358692 353796 348717 343838 339372 335147
61587 335147 330958 326907 323309 320392 318100 316139 314189 312155 310139 308188 306148 303869 301418 298950
61573B98950k489k581k589k425k294k320k215j627p80m14r44j846k126j347j18
61558B72835N69M22Q3K57Q37J138Q51M44N17J096J701J897J604R83K66l41o25
61541B84534l38P09K264L500L658K955K471K960M004M565M040K623R29l94r62
61526C17518j027j326k270l361l831l584l192l065l135l256l361l247k642j652
61512B78569p59l23l67q04j434j742j241j72N96N10j84r84j620j833j320l06K74
61495B66860k06j180j451n83P43J544J415O52q1k79o3o9o31j234j067l3J156J865
61477B67358K136K275K245J719P39j2J49R93J404N85r23j834j582p56p5M00P81
61460B75602P57M7q85j203o42K97R75J083O41j3l98l04j0K18N75J351K388L307
$$ plain form
61573 298950 296461 293880 291291 288866 286572 284252 282037 280410 279630 279216 278272 276426 274300 272953 272835
61558 272835 273404 273826 273909 274166 275003 276141 276992 277436 277953 279049 280750 282647 284251 285234 285500 285159 284534
61541 284534 284196 284905 287169 290669 294327 297282 299753 302713 306717 311282 315322 317945 318874 318480 317518
61526 317518 316491 315165 312895 309534 305703 302119 298927 295862 292727 289471 286110 282863 280221 278569
61512 278569 277810 277487 277120 276316 274882 273140 271899 271727 272323 272833 272649 271665 270045 268212 266892 266586 266860
61495 266860 266654 265474 264023 263440 264183 265727 267142 267794 267713 267434 267371 267302 266671 265437 264370 264337 265493 267358
61477 267358 269494 271769 274014 275733 276472 276460 276609 277602 279006 279591 278668 276834 275252 274496 274421 274821 275602
61460 275602 276359 276406 275521 274318 273676 273973 274948 276031 276672 276659 276261 275957 275947 276165 276740 278091 280479 283786
61442B83786M071M781N170M894M264M087M653N373N537N023M170L376K899K723
61428C44807K482J872J156R28J341J901K063J734J170P91J000J748K311J976R95
61413C68275K94K53L49J34k48p29j676l062l978l747l022k991l760m356m151l484
61397C34101k880k408k048j982k156k112j602j017q01p46l86K42P30J039J504
61382C19478K021K014J398R41J205J651J475R54J104K096K934K844K193J747J702
61367C45757J940K480L200L584L399L157L329L543L251K736K722L272L962M831
61353C91163O236P896R071R673J0300J1057J1296J0736R884R047P910O400N169
61340E05838M665M516M332M379M830N065M427L162J873N65j038k662l754m379
$$ plain form
61442 283786 287857 292638 297808 302702 306966 311053 315706 321079 326616 331639 335809 339185 342084 344807
61428 344807 347289 349161 350317 351245 352586 354487 356550 358284 359454 360245 361245 362993 365304 367280 368275
61413 368275 368569 368822 369171 369305 369057 368328 366652 363590 359612 355865 352843 349852 346092 341736 337585 334101
61397 334101 331221 328813 326765 324783 322627 320515 318913 317896 317095 316349 315963 316205 316935 317974 319478
61382 319478 321499 323513 324911 325852 327057 328708 330183 331137 332241 334337 337271 340115 342308 344055 345757
61367 345757 347697 350177 353377 356961 360360 363517 366846 370389 373640 376376 379098 382370 386332 391163
61353 391163 397399 405295 414366 424039 434339 445396 456692 467428 477312 486359 494269 500669 505838
61340 505838 510503 515019 519351 523730 528560 533625 538052 541214 543087 543652 542614 539952 536198 531819
61326E31819n044n819o291o359o378o509o449n859m704l232j914j254j266j267
61312D69474o45M09J314K001K836L796M429M700N169O105O935O958O167M978L407
61297E28033J043k054m874o192n836m871m426m549m534m093l679l631l599l065
61283D73673j985o23Q75K344L421L911M212M897N985O927P236O978O656O755P252
61268E38514P559P209O574O500P148P790P911P906Q309Q970R530J0111J0873J1424
61254F56328J1287J0648R844Q547O314L609J448J14r06j850k528l251m838p356
61240F87410r677j0838j1118j1300j1459j1108j0223r455r285r375q891p404n439
61227E61838m011l561l462k862j724p27l09l50o78j210j522r97K87J331J340O93
$$ plain form
61326 531819 526775 520956 514665 508306 501928 495419 488970 483111 478407 475175 473261 472007 470741 469474
61312 469474 468829 469238 470552 472553 475389 479185 483614 488314 493483 499588 506523 513481 519648 524626 528033
61297 528033 529076 527022 522148 515956 510120 505249 500823 496274 491740 487647 483968 480337 476738 473673
61283 473673 471688 471065 471940 474284 477705 481616 485828 490725 496710 503637 510873 517851 524507 531262 538514
61268 538514 546073 553282 559856 566356 573504 581294 589205 597111 605420 614390 623920 634031 644904 656328
61254 656328 667615 678263 688107 696654 702968 706577 708025 708139 707233 705383 702855 699604 694766 687410
61240 687410 677733 666895 655777 644477 633018 621910 611687 602232 592947 583572 574681 567277 561838
61227 561838 557827 554266 550804 547942 546218 545491 545182 544832 544154 542944 541422 540425 540712 542043 543383 544076
61211E44076L93P52J100P82O2j95M41J499K274K763L610N194P196R230J1361J3585
61195F04123J5319J6063J6309J7061J8483J9611J9492J8022J5671J2937J0257
61184G83348P986O216M905M201M234M567M349L167J383l93j868l021m009n092
61170H09973o378p550q325q996j0070j1384j2268j2560j2789j3252j3663j3868
61158F78870j4112j4299j3790j2398j0860r737q581o819m878l558k773j786n47
61145E74732O0o86k628n152p725r862j1092j1262j0574r273p530n692m237l297
61131D85782k389r15J132L105M377N000N650O898Q621J0287J1682J3131J4955
61118E67316J6965J8615J9546J9925K0281K0983K1810K2136K1697K0980K0537
$$ plain form
61211 544076 544469 545221 546321 547103 547165 546970 547411 548910 551184 553947 557557 562751 569947 579177 590538 604123
61195 604123 619442 635505 651814 668875 687358 706969 726461 744483 760154 773091 783348
61184 783348 791334 797550 802455 806656 810890 815457 819806 822973 824356 823963 822095 819074 815065 809973
61170 809973 803595 796045 787720 778724 768654 757270 745002 732442 719653 706401 692738 678870
61158 678870 664758 650459 636669 624271 613411 603674 595093 588274 583396 579838 577065 575279 574732
61145 574732 574792 574106 571478 566326 558601 548739 537647 526385 515811 506538 499008 493316 489079 485782
61131 485782 483393 482478 483610 486715 491092 496092 501742 508640 517261 527548 539230 552361 567316
61118 567316 584281 602896 622442 642367 662648 683631 705441 727577 749274 770254 790791
61107G90791K0140J9053J7084J4819J2815J1014R038O585L390o12m881q530j1263
61094H79443j3647j6178j8532k0103k0917k1479k2058k2511k2722k2748k2611
61083F55937k2201k1393k0173j8699j7267j6015j4731j3231j1907j1368j1525
61072D77427j1506j0685r250p676o235n210m883m905m389l127k095k149k768k804
61058C99745j968q57J25J084K105L142M219N210N743N895O588Q387J0325J0997
61044D60740J0584J0699J2107J3786J4482J4181J3551J2923J2394J2220J2405
61033F00072J2383J1670J0464R169P791O347N425N610O591P405P591P580Q082
61020G06180R440J1591J4354J7759K2228K8229L5578M3292N0399N6630O2118O7087
$$ plain form
61107 790791 810931 829984 847068 861887 874702 885716 894754 901339 904729 904117 899236 890706 879443
61094 879443 865796 849618 831086 810983 790066 768587 746529 724018 701296 678548 655937
61083 655937 633736 612343 592170 573471 556204 540189 525458 512227 500320 488952 477427
61072 477427 465921 455236 445986 438310 432075 426865 421982 417077 412688 409561 407466 405317 402549 399745
61058 399745 397777 396920 397045 398129 400234 403376 407595 412805 418548 424443 431031 439418 449743 460740
61044 460740 471324 482023 494130 507916 522398 536579 550130 563053 575447 587667 600072
61033 600072 612455 624125 634589 643758 651549 657896 663321 668931 675522 682927 690518 698098 706180
61020 706180 715620 727211 741565 759324 781552 809781 845359 888651 939050 995680 1057798 1124885
61008A124885P2244P8484Q4626Q5646P5408N2763K4389K19j3893j8416j6266r346
60996A540743j5N999J322j7155m4679p1554q9648r6487r4453q7445p8409o8904
60984H99315n9790n1670m4780l8918l3788k9378k5780k2832k0233j7997j6342
60973E37807j5135j3864j2341j0966j0041r216q043o734n835n300m510l235k044
60960D30543j560j600j425o22N15J446J966K342L000M096N358O284O508O091N459
60945D68401N019M847M745M512M029L114J618k35j794k611k922l301m029n006
60931D76387o085p012p271o531n239m247l796l398k746k100j617j003k03K49J01
60916D25489O6R16K231K769K041R03M56Q69J435J525J230J118J486K027K310K332
$$ plain form
61008 1124885 1197129 1275613 1360239 1445885 1521293 1574056 1598445 1598664 1584771 1566355 1550089 1540743
60996 1540743 1540728 1546727 1548049 1530894 1486215 1414661 1325013 1228526 1134073 1046628 968219 899315
60984 899315 839525 787855 743075 704157 670369 640991 615211 592379 572146 554149 537807
60973 537807 522672 508808 496467 485501 475460 466244 458201 451467 445632 440332 435822 432587 430543
60960 430543 428983 427383 425958 425336 425851 427297 429263 431605 434605 438701 444059 450343 456851 462942 468401
60945 468401 473420 478267 483012 487524 491553 494667 496285 496050 494256 491645 488723 485422 481393 476387
60931 476387 470302 463290 456019 449488 444249 440002 436206 432808 430062 427962 426345 425342 425139 425388 425489
60916 425489 425555 426471 428702 431471 433512 434415 434871 435740 437175 438700 439930 441048 442534 444561 446871 449203
60900D49203K264J840O77q31j606j277o88o24p33l67Q4l32j614k758l188l383
60884D36667l912m538m661m115l164k022p38N24J370J570J504K039L608N498O456
60869D36086O175N638N780O356O540O162N780N824O232O715O948O736O361O336
60855E23669O539O130M887L883M035M616M317L297K907L620M582N161N590N847
60841E89080N340M184L503L776L945L011J627J214K210M062O324Q767J0850J2095
60827F59988J2838J3844J5255J6573J7617J8727K0043K1150K1678K1739K1614
60816H61066K1271K0345J8491J5701J2374Q976N551J761k493o725j0392j3490
60804I32436j6288j8680k0236k0844k0952k1002k0901k0224j8897j7441j6475
$$ plain form
60900 449203 451467 453307 453984 453153 451547 450270 449582 448958 448225 447858 447942 447610 445996 443238 440050 436667
60884 436667 432755 428217 423556 419441 416277 414255 413517 414041 415411 416981 418485 420524 424132 429630 436086
60869 436086 442261 447899 453679 460035 466575 472737 478517 484341 490573 497288 504236 510972 517333 523669
60855 523669 530208 536338 541225 545108 549143 553759 558076 561373 564280 567900 572482 577643 583233 589080
60841 589080 594420 598604 602107 605883 609828 612839 614466 615680 617890 621952 628276 637043 647893 659988
60827 659988 672826 686670 701925 718498 736115 754842 774885 796035 817713 839452 861066
60816 861066 882337 902682 921173 936874 949248 958224 963775 965536 963043 956318 945926 932436
60804 932436 916148 897468 877232 856388 835436 814434 793533 773309 754412 736971 720496
60793G20496j5995j5395j4250j2869j1799j1074j0295r370q641q344q327q395
60781E85742q430q197p507o678o325o550o791o663o358o099n751n294n036n026
60767D95037m842m401m404n329o510o895o401n837n706n772n744n665n636n627
60753D16268n597n416m799l677k577k104k169k134j703j123n97n8L63K92l03r22
60737C83744j223j458j894k177j687m06R30J559J350P93N22Q33J598K510L325
60722C88319L826L678K647J001n04j288j532j937k872l990m716m968n105n273
60708C67286n171m627m058l961m162m030l406k847k801l073l296l515l873m009
60694C14457l335j851l08N15N26K16Q8K19L03Q5k65k57L54J183J531J100L64J06
$$ plain form
60793 720496 704501 689106 674856 661987 650188 639114 628819 619449 610808 602464 594137 585742
60781 585742 577312 569115 561608 554930 548605 542055 535264 528601 522243 516144 510393 505099 500063 495037
60767 495037 490195 485794 481390 476061 469551 462656 456255 450418 444712 438940 433196 427531 421895 416268
60753 416268 410671 405255 400456 396779 394202 392098 389929 387795 386092 384969 384372 384314 384677 384969 384666 383744
60737 383744 382521 381063 379169 376992 375305 374899 375829 377388 378738 379531 380053 380886 382484 384994 388319
60722 388319 392145 395823 398470 399471 398967 397679 396147 394210 391338 387348 382632 377664 372559 367286
60708 367286 362115 357488 353430 349469 345307 341277 337871 335024 332223 329150 325854 322339 318466 314457
60694 314457 311122 309271 308963 309478 310004 310220 310308 310527 310830 310915 310650 310393 310747 311930 313461 314561 314925 315031
60676C15031O16J318J462J077R68J611K452K647K206J796J671J470J060Q42J009
60661C37236J219J308J654K476L319L754M093M851N900O667O883O602N857M865
60647C96684M231M328M651M381L485K510J481k01k652m973o201o319o051n955
60633C89399o010n929n602n266n187n224m869l932k920k477k606k846k970l057
60619C30504k990k415j277RJ007J523J465R06L36L12P62J003N99j90r38j548j978
60602C27090j960j382o74l72m47l94M6N86Q23P04N19M74N13N08N32P20R32Q65
60584C29083O02O88J357K079K268K181K590L652M821N798O829P882Q343P993P681
60569C93847Q311R555J0178R440P620N350L065J097m09j748l347m886n365m392
$$ plain form
60676 315031 315647 316965 318427 319504 320472 322083 324535 327182 329388 331184 332855 334325 335385 336227 337236
60661 337236 338455 339763 341417 343893 347212 350966 355059 359910 365810 372477 379360 385962 391819 396684
60647 396684 400915 405243 409894 414275 417760 420270 421751 421550 418898 413925 407724 401405 395354 389399
60633 389399 383389 377460 371858 366592 361405 356181 351312 347380 344460 341983 339377 336531 333561 330504
60619 330504 327514 325099 323822 323831 324838 326361 327826 328732 329068 329380 330142 331145 331744 331554 330616 329068 327090
60602 327090 325130 323748 323074 322702 322255 321861 321907 322493 323316 324020 324539 325013 325526 326034 326566 327286 328218 329083
60584 329083 329685 330373 331730 333809 336077 338258 340848 344500 349321 355119 361948 369830 378173 386166 393847
60569 393847 402158 411713 421891 431331 438951 444301 447366 448463 448054 446306 442959 438073 432708 428316
60555D28316k935k204k058j223R37L591N634P065Q581J0218J1206J1182J0814
60542D89124J0920J1438J1602J0800Q828N728J906j662m040n180n848o545o992
60529E20079o805o217n782n633n444m960m202l191j914o29J61K90K30N79J415
60514D77977K383L315M398N796P474R452J1862J4556J7101J9458K2240K5900K9946
60501F51858L3446L6062L7933L8864L8421L6782L4517L1340K6052J8250R156Q7
60489I92768r120j9129k9175l7285m2355m4958m6013m5574m3316l9517l5075l0835
60477E70416k7205k4098k1134j8061j5090j2606j0645q971p577o674o193n764
60465D06398n241m863m796m883m875m603l979l241l036l689m422m041k476r65
$$ plain form
60555 428316 425381 423177 421119 419896 420833 424424 430058 437123 445704 455922 467128 478310 489124
60542 489124 500044 511482 523084 533884 542712 548440 550346 548684 544644 539464 533616 527071 520079
60529 520079 513274 507057 501275 495642 490198 485238 481036 477845 475931 475302 475463 475753 475983 476562 477977
60514 477977 480360 483675 488073 493869 501343 510795 522657 537213 554314 573772 596012 621912 651858
60501 651858 685304 721366 759299 798163 836584 873366 907883 939223 965275 983525 992681 992768
60489 992768 983648 964519 935344 898059 855704 810746 764733 719159 675843 636326 601251 570416
60477 570416 543211 519113 497979 479918 464828 452222 441577 432606 425029 418355 412162 406398
60465 406398 401157 396294 391498 386615 381740 377137 373158 369917 366881 363192 358770 354729 352253 351288
60451C51288m63o09o13m22m57p26r01q99q08n59j60pl85q48p18n6L76R2o71j452
60431C41002k012k255k139j754j214m78M58J274J624J635J706J808J545R17N41
60416C42658Q21J373J567J344J076R41Q24O94O43O23M34J22MK50O33Q62R59J128
60398C56956J381J508J396J171J050J156J529K099K617K742K343J656J089R41
60384C79634J326K130K874K886J991R66Q89J906L008L189K549J955J858J898J643
60369D10702J236J077J163J116Q07O13Q97J399J476R09K33J18O24J297J811K200
60353D27678K494K550K427K535L139L831L889L102J985J078L52n44j672k678l210
60338D46956l241k953k580k373k464k599k200j038K28N29m10j634j906j030lR3
$$ plain form
60451 351288 350825 350216 349603 349181 348724 347998 347097 346198 345390 344831 344671 344664 344279 343431 342713 342657 343033 343125 342454 341002
60431 341002 338990 336735 334596 332842 331628 331150 331608 332882 334506 336141 337847 339655 341200 342117 342658
60416 342658 343479 344852 346419 347763 348839 349780 350604 351298 351941 352564 352998 353120 353124 353374 354007 354869 355828 356956
60398 356956 358337 359845 361241 362412 363462 364618 366147 368246 370863 373605 375948 377604 378693 379634
60384 379634 380960 383090 385964 388850 390841 391807 392696 394602 397610 400799 403348 405303 407161 409059 410702
60369 410702 411938 413015 414178 415294 416101 416714 417611 419010 420486 421395 421628 421746 422370 423667 425478 427678
60353 427678 430172 432722 435149 437684 440823 444654 448543 451645 453630 454708 455060 454516 452844 450166 446956
60338 446956 443715 440762 438182 435809 433345 430746 428546 427508 427736 428265 427855 426221 424315 423285 423282 423375
60322D23375q21j834j965j002M28J537K050K290K747L725N291P268R156J0337
60308D62582J0696J0910J1875J3726J5554J6093J4697J1747Q217M811J464k302
60296E80070o519j0509j3487j5121j5408j4398j2467j0552r461q956q025o204
60284D48963m157k795k255k086k009k083k272k338k219k171k445k952l408l577
60270D12196l326k562j414l87j05o64j379j434p44JJ85q4l17k75r2J8j14o01j270
60251C97632j571j145l50J00P1J24N86J001Q08K21k9L10P34P38M51K87K82J40
60233D00390j58j47N60J742K851L612M115M374M181L472K532J721J192R74J082
60218D32493J370J590J760K233L151M069M494M534M645M833M547L502K250J728
$$ plain form
60322 423375 422554 420720 418755 417753 418181 419718 421768 424058 426805 430530 435821 443089 452245 462582
60308 462582 473278 484188 496063 509789 525343 541436 556133 567880 576097 580908 582372 580070
60296 580070 573551 563042 549555 534434 519026 504628 492161 481609 472148 463192 455167 448963
60284 448963 444806 442011 439756 437670 435661 433578 431306 428968 426749 424578 422133 419181 415773 412196
60270 412196 408870 406308 404894 404507 404402 403738 402359 400925 400181 400182 400367 400283 399966 399691 399599 399617 399503 398902 397632
60251 397632 396061 394916 394566 394666 394737 394861 395447 396448 397256 397477 397448 397758 398492 399230 399681 399968 400250 400390
60233 400390 400232 400085 400645 402387 405238 408850 412965 417339 421520 424992 427524 429245 430437 431411 432493
60218 432493 433863 435453 437213 439446 442597 446666 451160 455694 460339 465172 469719 473221 475471 477199
60204D77199K325L493M295M252L641L005K588K386K459K795K994K676K171K173
60190E18452K588K470J382O1p53j371k323l185l205k639k396k654k817k736k837
60175D98037k982k353q38M52N23l16j082j331j256j119j044j052r59n05J75N91
60159D84941O29Q16J547K416K637J900O77j44J30J350K521K797K472K493L067
60144E10249L505L477L527M023M451M301L964M142M846N582O092O331O106N365
60130E75961M540M043L637K811J570M09l64q61j345k045l018l939m268l936l541
60115E69654l567l691l254k123p55K77N22j48j246j958k076k167k496k426j498
60100E43048m33k67q65j219q96l44J05N58R54J043J110J838L220M355M718M902
$$ plain form
60204 477199 479524 483017 487312 491564 495205 498210 500798 503184 505643 508438 511432 514108 516279 518452
60190 518452 521040 523510 524892 524953 524200 522829 520506 517321 514116 511477 509081 506427 503610 500874 498037
60175 498037 495055 492702 491864 492316 492839 492523 491441 490110 488854 487735 486691 485639 484680 484175 484350 484941
60159 484941 485570 486386 487933 490349 492986 494886 495563 495419 495549 496899 499420 502217 504689 507182 510249
60144 510249 513754 517231 520758 524781 529232 533533 537497 541639 546485 552067 558159 564490 570596 575961
60130 575961 580501 584544 588181 590992 592562 592971 592607 591746 590401 588356 585338 581399 577131 573195 569654
60115 569654 566087 562396 559142 557019 556264 556541 557063 556915 555669 553711 551635 549468 546972 544546 543048
60100 543048 542615 542348 541483 540264 539368 539024 539129 539687 540641 541684 542794 544632 547852 552207 556925 561827
60084E61827N578O301O089M923M001M266N180N343M161K433J113L3j523l346m444
60069F01935m741n481p369r246r611q701p935p772p448o707o362o801p164o618
60055D99979n571m861m416l493j940m30M03O36O82P28O64N07O70J583L000M001
60039D92142L968L321K897K796K412J468L95l80r19j414j892k499l529m880n983
60024D87903o504o781p199p575p547p191o840o555o147n578m954m252l378k416
60010D04986j549q46k76J61N27R53J392J582J481J459J724J825J188J5q50r30
59994D12842m84J43R71J958K658K784K744L095L676L849L513L232L305L289K817
59979D50392K293K306K674K613J786O49j87n17n16m74n56n24J46J433K368K029
$$ plain form
60084 561827 567405 573706 579795 584718 588719 592985 598165 603508 607669 610102 611215 611248 609725 606379 601935
60069 601935 597194 591713 584344 575098 565487 556786 548851 541079 533631 526924 520562 513761 506597 499979
60055 499979 494408 489547 485131 481638 479698 479268 479671 480307 480989 481717 482381 482888 483558 485141 488141 492142
60039 492142 496110 499431 502328 505124 507536 509004 509399 509019 508100 506686 504794 502295 498766 493886 487903
60024 487903 481399 474618 467419 459844 452297 445106 438266 431711 425564 419986 415032 410780 407402 404986
60010 404986 403437 402591 402315 402476 403003 403956 405348 406930 408411 409870 411594 413419 414607 414622 413772 412842
59994 412842 412358 412501 413472 415430 418088 420872 423616 426711 430387 434236 437749 440981 444286 447575 450392
59979 450392 452685 454991 457665 460278 462064 462713 462526 462009 461493 461019 460463 459939 460085 461518 463886 465915
59963D65915Q58K49Q55J997K884L455L832L792L376L206L498L416K202M37o62
59948D99310q18p49q93j045j101j348j886k431k784k983l009k893l014l701m538
59933D66117m718m097l303k766k303j751j325j088p12j9O65J065J422K070K896
59918D52153L495L636L407L123L225L988N200O352P129P562P755P797P926Q322
59904E31070Q687Q496P712O746N630L830J147j661l550m218m175m054m119m231
59890E47310m019l187j835m03P30J481J900K090K298K750L304L476L067K461K153
59875E63576K156K000J318K53o43r64q91r23j162j210r70j021j758k559k558j966
59859E52678j854k587l346l387k956k693k726k856l050l296l319k931k372j988
$$ plain form
59963 465915 466773 467022 467877 469874 472758 476213 480045 483837 487213 490419 493917 497333 499535 499972 499310
59948 499310 498492 497743 496850 495805 494704 493356 491470 489039 486255 483272 480263 477370 474356 470655 466117
59933 466117 461399 457302 453999 451233 448930 447179 445854 444766 444054 444035 444700 445765 447187 449257 452153
59918 452153 455648 459284 462691 465814 469039 473027 478227 484579 491708 499270 507025 514822 522748 531070
59904 531070 539757 548253 555965 562711 568341 572171 573318 571657 568107 563889 559714 555660 551541 547310
59890 547310 543291 540104 538269 537866 538596 540077 541977 544067 546365 549115 552419 555895 558962 561423 563576
59875 563576 565732 567732 569050 569303 568660 567696 566805 565882 564720 563510 562540 561519 559761 557202 554644 552678
59859 552678 550824 548237 544891 541504 538548 535855 533129 530273 527223 523927 520608 517677 515305 513317
59845E13317j831j871k267k978l449l131k229j523j445j689j726j454j163j013
59831D85548p42l0R29J470J261P38N00M87K18l79q87j169j582k308k929k949k332
59814D75844j355k51P57J407J636J684J741J667J251O29K35L66P92Q67J66r35
59798D86501j611j639j677k219k775k682k271k414l140l613l388k860k413j954
59784D51845j506j424j750k051k129k231k339j983j087k87j4Q0M45R90J516K161
59768D40236K984L593L677L452L292L300L480L752L729L107K518L035M540N541
59754D90236N170M377M406N024N276N188N549O390O867O593O108O043O494P120
59740E70841P318O497M783L190K543K454K040J201M47k05j183k336k942k793k424
$$ plain form
59845 513317 511486 509615 507348 504370 500921 497790 495561 494038 492593 490904 489178 487724 486561 485548
59831 485548 484806 484776 485705 487175 488436 489174 489674 490161 490379 490000 489113 487944 486362 484054 481125 478176 475844
59814 475844 474489 474238 474995 476402 478038 479722 481463 483130 484381 485010 485245 485611 486403 487270 487436 486501
59798 486501 484890 483251 481574 479355 476580 473898 471627 469213 466073 462460 459072 456212 453799 451845
59784 451845 450339 448915 447165 445114 442985 440754 438415 436432 435345 435058 435044 435124 435569 436559 438075 440236
59768 440236 443220 446813 450490 453942 457234 460534 464014 467766 471495 474602 477120 480155 484695 490236
59754 490236 495406 499783 504189 509213 514489 519677 525226 531616 538483 545076 551184 557227 563721 570841
59740 570841 578159 584656 589439 592629 595172 597626 599666 600867 601314 601109 599926 597590 594648 591855 589431
59725E89431k211k025j843k005k551k995l018k809k574k176j571j096j020j130
59711E60407r88m18L93J037J189R43Q32J186J625J579J186J134J646K164K132
59696E76047J642J079O31L52L60O53R06P06m6j018j684j679j136n73l43l07k80
59679E75310n51j521k928l874l828l247l048l625m551n059m757l913l103k613
59665E28692k270j907j666j716j885j823j451r64n23j66J01L85Q89J568J987J806
59649E21057J296J002J013R03L57n46j642k905m180n057n203m763m260m055l954
59634D89063l454k397j324r59j369j890j931j607j482j882k635l286l523l463
59620D57861l553l945m117l437k095j002p33j026j337j391j048k54P15J358J559
$$ plain form
59725 589431 587220 585195 583352 581347 578796 575801 572783 569974 567400 565224 563653 562557 561537 560407
59711 560407 559419 559001 559394 560431 561620 562563 563395 564581 566206 567785 568971 570105 571751 573915 576047
59696 576047 577689 578768 579399 579751 580111 580764 581670 582376 582330 581312 579628 577949 576813 576240 575897 575590 575310
59679 575310 574759 573238 570310 566436 562608 559361 556313 552688 548137 543078 538321 534408 531305 528692
59665 528692 526422 524515 522849 521133 519248 517425 515974 515010 514487 514321 514422 514807 515696 517264 519251 521057
59649 521057 522353 523355 524368 525271 525628 525082 523440 520535 516355 511298 506095 501332 497072 493017 489063
59634 489063 485609 483212 481888 480929 479560 477670 475739 474132 472650 470768 468133 464847 461324 457861
59620 457861 454308 450363 446246 442809 440714 439712 438979 437953 436616 435225 434177 433923 434638 435996 437555
59605D37555J616J653J529J375J483J532Q32l75q64j38P32P25L32N56J234J450
59589D51227J051O44M23N2n05r64j367j964k526k646k497k603k969l138k986k789
59573D26443k633k397k132j886j434p11j77j09o0L08N16K11J81J191K337K066
59557D21714N57m15J3Q48J098J155J822L057M229M901N067N208O178Q172R972
59542D73576J0250R566R724J1106J2266J2492J2980J4434J5010J2247O247k76
59530E99622m706o232n469l551j587r1J137K239K691J976N32o48j210j733k862
59515E80108m567o293p531q309r114j0189j0969j0645r278p844p057o700o281
59502D75331n725n091m244l203k369j986j766j362q29l21K14P68J066R57O58L77
$$ plain form
59605 437555 439171 440824 442353 443728 445211 446743 447575 447200 446336 446198 446930 447655 447987 448543 449777 451227
59589 451227 452278 452922 453345 453397 452892 451928 450561 448597 446071 443425 440928 438325 435356 432218 429232 426443
59573 426443 423810 421413 419281 417395 415961 415250 415073 414964 414904 415212 415728 415939 416120 417311 419648 421714
59557 421714 422271 421856 421869 422717 423815 424970 426792 429849 434078 438979 444046 449254 455432 463604 473576
59542 473576 483826 493392 503116 514222 526488 538980 551960 566394 581404 593651 599898 599622
59530 599622 594916 588684 583215 579664 578077 577986 579123 581362 584053 586029 586561 585913 584703 582970 580108
59515 580108 575541 569248 561717 553408 544294 534105 523136 512491 503213 495369 488312 481612 475331
59502 475331 469606 464515 460271 457068 454699 452713 450947 449585 448756 448435 448649 449417 450483 451440 452098 452475
59486D52475J28M2L97J128J790K229K743L413L862L943M042M398M741M803M601
59471D94735L978K678J212O78J267J854J657J359J812K598K925L070L776M785
59457E28384N365N795O938Q491R135Q575Q006Q146Q040O577M256K523J858J412
59443F13501K56j714m125o668r030j0674j1095j0323q952p553o221m830l489k475
59429E26608j747r74o7P14J372K402M151O318Q434J0465J2478J4105J4949J5402
59415F14610J6261J7417J7633J6117J3859J2575J2242J0528N289k635r867j3636
59403G10393j3852j2048r530p054n197l743j533J584L035l59q212j6166k0333
59390F16985k0800k0029j9235j7850j5489j2776j0383q451o986n905m772l265
$$ plain form
59486 452475 452603 452645 453042 454170 455960 458189 460932 464345 468207 472150 476192 480590 485331 490134 494735
59471 494735 498713 501391 502603 503281 504548 506402 508059 509418 511230 513828 516753 519823 523599 528384
59457 528384 533749 539544 546482 554973 564108 572683 580689 588835 596875 603452 607708 610231 612089 613501
59443 613501 613757 612043 607918 601250 592220 581546 570451 560128 551176 543623 537402 532572 529083 526608
59429 526608 524861 523887 523820 524534 525906 528308 532459 538777 547211 557676 570154 584259 599208 614610
59415 614610 630871 648288 665921 682038 695897 708472 720714 731242 736531 733896 724029 710393
59403 710393 696541 684493 674963 667909 662712 658969 657436 659020 662055 661696 653484 637318 616985
59390 616985 596185 576156 556921 539071 523582 510806 500423 491972 484986 479081 474309 471044
59378D71044j771q68m04J40O66P37O96J437K949M036L864L027K623K909L377L739
59362D98201M199M888N528N824N957O469P650R229J0816J2441J4332J6189J7287
59349F19010J7465J7443J7755J7887J7082J5630J4596J4367J4214J3305J1524
59338G90278R103O126K775l44k655m316o102q430j0803j2337j2778j2714j2784
59325G25019j2965j2881j2548j2276j1983j1161r697q199p294o948o707o225n385
59312F00750m334l631l898m925n583n040l768k851k647k631k337j824j285p56
59298E55240k77j1j1j09k7M25J180J793J788J268J008J605K733L560L733L654
59282E77552L817M286M899N650O674P832Q637Q830Q984R992J1752J2852J2158
$$ plain form
59378 471044 469273 468405 468001 468141 468807 469544 470240 471677 474626 478662 482526 485553 488176 491085 494462 498201
59362 498201 502400 507288 512816 518640 524597 531066 538716 547945 558761 571202 585534 601723 619010
59349 619010 636475 653918 671673 689560 706642 722272 736868 751235 765449 778754 790278
59338 790278 799381 805507 808282 807938 805283 800967 794865 786435 775632 763295 750517 737803 725019
59325 725019 712054 699173 686625 674349 662366 651205 641508 633309 626015 619067 612360 606135 600750
59312 600750 596416 592785 588887 583962 578379 573339 569571 566720 564073 561442 559105 557281 555996 555240
59298 555240 554963 554952 554941 554832 554805 555230 556410 558203 559991 561259 562267 563872 566605 570165 573898 577552
59282 577552 581369 585655 590554 596204 602878 610710 619347 628177 637161 647153 658905 671757 683915
59269F83915J0345R024Q541P742N973M112L040K115J38k784n329o677p226p676
59255G05253q190q659r206j0012j0834j0962r857p875o160n529n520m970l464
59242F04015j679l04P21J691K467K782K689K388J927J312N38o39k453m502n933
59227F05020o517o949p802q814r515r809r650q880p830p310p477p419o449n048
59213D95551l905k844j527m52k46m44kJ217K346K735K547K244K135K303K520K377
59197E06555J838J384J316J426J669K436L675M523M514M429N153O309O894O765
59183E58886O555O622O890P330P780P674O815N984N924O228O029N359M840M573
59169F47489M287M194M610N081M943M401M046L688K735J361J68r87k604m306n241
$$ plain form
59269 683915 694260 703284 711825 719567 725540 729652 732692 734807 734945 732161 726832 720155 712929 705253
59255 705253 697063 688404 679198 669186 658352 647390 637533 629658 623498 617969 612449 607479 604015
59242 604015 602336 602032 602753 604444 606911 609693 612382 614770 616697 618009 618547 617908 615455 610953 605020
59227 605020 598503 591554 583752 574938 565423 555614 545964 537084 529254 521944 514467 507048 500599 495551
59213 495551 491646 488802 487275 486823 486577 486133 486131 487348 489694 492429 494976 497220 499355 501658 504178 506555
59197 506555 508393 509777 511093 512519 514188 516624 520299 524822 529336 533765 538918 545227 552121 558886
59183 558886 565441 572063 578953 586283 594063 601737 608552 614536 620460 626688 632717 638076 642916 647489
59169 647489 651776 655970 660580 665661 670604 675005 679051 682739 685474 686835 687003 686016 683412 679106 673865
59154F73865n540o116p079p676p755p994q548q757q390q006p827p261n903m161
59140E72852k657j698j398j539j414o58J9j50n25K26K125L879M829N532O350O908
59124E92681P212P972R366J0639J1290J1600J1755J1557J1281J1636J2540J3174
59112G22703J3493J4325J5514J5561J3835J1779J0918J0861J0305R033P768O716
59100H62811N473L941K442J133l9j077k064l198m307m842m680m420m607n156n842
59085H35568o692p602q237q649r326j0360j1289j1997j2891j3906j4299j3967
59073G06353j3834j4306j4253j2522r738p654p118p494p783p516o765n860n093
59060E86417m474l891l558l767m196m141l625l436l806l927l221k220j619j221
$$ plain form
59154 673865 668325 662209 655130 647454 639699 631705 623157 614400 606010 598004 590177 582916 577013 572852
59140 572852 570195 568497 567099 565560 564146 563488 563507 563357 562832 563058 565183 569062 573891 579423 585773 592681
59124 592681 599893 607865 617231 627870 639160 650760 662515 674072 685353 696989 709529 722703
59112 722703 736196 750521 766035 781596 795431 807210 818128 828989 839294 848327 856095 862811
59100 862811 868284 872225 874667 875800 875761 874684 872620 869422 865115 860273 855593 851173 846566 841410 835568
59085 835568 828876 821274 813037 804388 795062 784702 773413 761416 748525 734619 720320 706353
59073 706353 692519 678213 663960 651438 641700 634046 626928 619434 611651 604135 597370 591510 586417
59060 586417 581943 578052 574494 570727 566531 562390 558765 555329 551523 547596 544375 542155 540536 539315
59046E39315n23L21Q23R59J026J153J465K246L348M006L782L302L461M359N533
59031E74576O778Q101R232R849J0156J0702J1760J3143J4485J5574J6554J7843
59019G18753J9439K0465J9932J8017J5833J3799J1107P058K215k198n446p421
59007H31553q310q477q270p630o299m458k639j034M41J542K021K453L513M452
58993G98858L646R43j882l510m535n882p229p971q511r429j0318j0597j0672j1136
58979G11775j1485j0699q812o886n697n072m230k371N64L400M787M964N529P021
58965F82788Q131P930P469P990Q877Q795P943P479P464O900N446L601J475j276
58951G71012m367o941q675r926j0829j1186j1049j0615r742q321o868n920n203
$$ plain form
59046 539315 538792 539113 539936 540895 541921 543074 544539 546785 550133 554139 557921 561223 564684 569043 574576
59031 574576 581354 589455 598687 608536 618692 629394 641154 654297 668782 684356 700910 718753
59019 718753 738192 758657 778589 796606 812439 826238 837345 844403 846618 844420 838974 831553
59007 831553 823243 814766 806496 798866 792567 788109 785470 784436 784877 786419 788440 790893 794406 798858
58993 798858 802504 803447 801565 798055 793520 787638 780409 772438 763927 754498 744180 733583 722911 711775
58979 711775 700290 689591 680779 673893 668196 663124 658894 656523 657087 660487 665274 670238 675767 682788
58965 682788 690919 698849 706318 714308 723185 731980 739923 747402 754866 761766 767212 770813 772288 771012
58951 771012 766645 759704 751029 741103 730274 719088 708039 697424 687682 679361 672493 666573 661370
58938F61370m178l085k511k275j715q59l96n74j002j393j772k071k264k692l585
58923F30998m537n054n344n834o295o187n556m836m051l001j929j250q44l17L40
58908E76303J009J978L464M949N770O062O429O965P353P636Q138Q889R706J0525
58894F65176J1157J1263J1119J1742J3569J5650J6973J7835J8984K0161K0562
58883H34191K0185J9444J7983J5114J1173P274L937R33j820m306p098j0767j4693
58870H91550j7386j8106j7433j6425j5779j5497j4798j2862j0238q639q642q681
58858G27064p374n669n232n782n905n677o288p529p823o787n693n216m667l794
58844F43628l412l714l701l039k884m097n908p189p856q318q501q246p847p521
$$ plain form
58938 661370 657192 654107 651596 649321 647606 646747 646351 645777 644775 643382 641610 639539 637275 634583 630998
58923 630998 626461 621407 616063 610229 603934 597747 592191 587355 583304 580303 578374 577124 576280 575963 576303
58908 576303 577312 579290 582754 587703 593473 599535 605964 612929 620282 627918 636056 644945 654651 665176
58894 665176 676333 687596 698715 710457 724026 739676 756649 774484 793468 813629 834191
58883 834191 854376 873820 891803 906917 918090 925364 929301 930234 928414 924108 917010 906243 891550
58870 891550 874164 856058 838625 822200 806421 790924 776126 763264 753026 744387 735745 727064
58858 727064 719690 714021 708789 703007 697102 691425 685137 677608 669785 662998 657305 652089 647422 643628
58844 643628 640216 636502 632801 629762 626878 622781 616873 609684 601828 593510 585009 576763 568916 561395
58830E61395p009o154n245m433l591k900k803l123l102k560k156k251k363k020
58816E11685j348n64K99R72J137J109J447J864J535O33L15Q47J036O8j256j765
58800E18014j445r35l53M51J127J135N72L8j24l6M4M1J13N27J288K061K628L153
58782E28299L648L753L533L935N410O733O397M818L783L830L734K635J105k08
58768E81405j541l031m138m691n327o156o140m668k765j788j614j126O0J330K214
58753E42024K932L810M708N171M928M266L825L897M070L898L664L988M879N815
58739F01875O574P388Q413R685J1385J3379J4807J4976J4491J4525J5117J5246
58727G47861J4438J3139J1566R360O543L695J032j654m005n171n132m739m291
$$ plain form
58830 561395 554386 548232 542987 538554 534963 532063 529260 526137 523035 520475 518319 516068 513705 511685
58816 511685 510337 509773 510072 511044 512181 513290 514737 516601 518136 518769 519084 519931 520967 521035 519779 518014
58800 518014 516569 515634 515281 515732 516859 517994 518566 518604 518480 518444 518488 518529 518642 519169 520457 522518 525146 528299
58782 528299 531947 535700 539233 543168 548578 555311 561708 566526 570309 574139 577873 580508 581613 581405
58768 581405 579864 576833 572695 568004 562677 556521 550381 545713 542948 541160 539546 538420 538480 539810 542024
58753 542024 544956 548766 553474 558645 563573 567839 571664 575561 579631 583529 587193 591181 596060 601875
58739 601875 608449 615837 624250 633935 645320 658699 673506 688482 702973 717498 732615 747861
58727 747861 762299 775438 787004 796364 802907 806602 807634 805980 801975 796804 791672 786933 782642
58714G82642l171j239O03J721K444L032K908J586m85k595m559o431q185j0037
58700G58234j2365j4983j7153j8546j9466j9978j9662j8460j6948j5537j4151
58689E70985j2779j1527j0142q366o811o354o660o468n464m659m678m916m714
58676D77447m156l357k116p15R5L67J052K492L961N081O387P997R019Q950Q517
58661E21021Q407Q340Q029P870P849O899M318J014j530k847l396l599l690l857
58647E54828l972l737l366l437l870l949l603l539l870l808l117k684l023l403
58633E05450l085k374j769j142m12k1j32k38j68l99q70o89M02J442J817K257L442
58616E03511M780N461N690N963O115N957N939O248O098M881L169J799O97n51j701
$$ plain form
58714 782642 779471 778232 778835 780556 783000 786032 788940 790526 790041 787446 782887 776456 768271 758234
58700 758234 745869 730886 713733 695187 675721 655743 636081 617621 600673 585136 570985
58689 570985 558206 546679 536537 528171 521360 515006 508346 501878 496414 491755 487077 482161 477447
58676 477447 473291 469934 467818 467103 467198 467565 468617 471109 475070 480151 486538 494535 503554 512504 521021
58661 521021 529428 537768 545797 553667 561516 568415 572733 573747 572217 569370 565974 562375 558685 554828
58647 554828 550856 547119 543753 540316 536446 532497 528894 525355 521485 517677 514560 511876 508853 505450
58633 505450 502365 499991 498222 497080 496668 496647 496515 496277 496109 495710 494840 494151 494553 495995 497812 500069 503511
58616 503511 508291 513752 519442 525405 531520 537477 543416 549664 555762 560643 563812 565611 566308 565757 564056
58601E64056k264k315k230k121k088k292k448k054j443j561k222j822N41L686
58587E43423N918O980P704Q568R494J0363J1047J1467J1877J2512J2843J2150
58575F64346J0836R953R420Q178O391N731O924Q709R945J1169J3218J5758J8215
58562G98793K0715K3220K4984K5802K6498K7405K7626K6511K4536K1985J8349
58551A066424J3847R852O826L474j002n511r117j2795j7612k2648k6246k8148
58539I77344k9049k9149k8499k7684k6980k5790k3860k1889k0138j7830j4806
58528G11670j2187j0465q579o009l920l077k472j361p68j404k014j443n86n29
58514F56856n35K44Q31K35m46J86J366J517P56lr07k192k761j883q77j037j362
$$ plain form
58601 564056 561792 559477 557247 555126 553038 550746 548298 546244 544801 543240 541018 539196 539737 543423
58587 543423 549341 556321 564025 572593 582087 592450 603497 614964 626841 639353 652196 664346
58575 664346 675182 685135 694555 702733 709124 714855 721779 730488 740433 751602 764820 780578 798793
58562 798793 819508 842728 867712 893514 920012 947417 975043 1001554 1026090 1048075 1066424
58551 1066424 1080271 1090123 1096949 1100423 1099421 1093910 1084793 1071998 1054386 1031738 1005492 977344
58539 977344 948295 919146 890647 862963 835983 810193 786333 764444 744306 726476 711670
58528 711670 699483 689018 680439 674430 670510 667433 664961 663600 662832 661428 659414 657971 657385 656856
58514 656856 656321 656565 657396 657631 657185 657371 658737 660254 661010 661007 660100 657908 655147 653264 652387 651350 649988
58497F49988n87J38q18k364k216n85M39M20P31J800K773L536M761O233P269Q434
58481F79952J0737J3584J5462J6195J6663J6901J6323J5193J3972J1964Q473M477
58469H39896J315j441m769p974r788j0758j2192j3574j3369j1688r840p965n439
58456G32414k882j419n25J067K904L528L019K547K045P11r41j854k659m606o878
58441G26471p509o469n438m893l864k221p74M64J954L059L035K943M255O282P376
58426G24671P867R199J1002J1805J1941J2753J3531J2335R516P254N850L554J00
58413H41378k711m173n485p105q009p970q072q563q458p491o352n060l150j255
58399G57524l05L48J810L296L426L042L967N616N812M481L509L258K367P66k42
$$ plain form
58497 649988 649401 649539 648721 646357 644141 643556 643995 644415 645146 646946 649719 653255 658016 664249 671518 679952
58481 679952 690689 704273 719735 735930 752593 769494 785817 801010 814982 826946 835419 839896
58469 839896 841211 839770 835001 827027 817239 806481 794289 780715 767346 755658 745818 737853 732414
58456 732414 729532 728113 727588 728655 731559 735087 738106 740653 742698 743409 742468 740614 737955 733349 726471
58441 726471 718962 712493 707055 702162 698298 696077 695303 695767 697721 700780 703815 706758 711013 717295 724671
58426 724671 732538 741737 752739 764544 776485 789238 802769 815104 824620 831874 837724 841278 841378
58413 841378 838667 834494 829009 821904 813895 805925 797853 789290 780832 773341 766989 761929 758779 757524
58399 757524 757219 757567 759377 762673 766099 769141 773108 778724 784536 789017 792526 795784 798151 798917 798675
58384G98675p40k007l701m099l132k260j657m01R42R98M52J102K514K908K823
58369G92417M328O945Q111P505P287Q056Q366Q186R020J0522J0772J0014J0264
58356I01793J1229J0623Q583P604P778O594L913K671L720M413L499L165M782O595
58342I86962P211P731Q957R867J0214J1413J3706J5502J6357J7424J8393J7478
58330A141215J5034J3555J3460J2516J0070Q034P050N529L218J889J799J365Q14
58317A235548K131M806O017N526O090Q344R879J0095J1241J3711J5085J4893J5598
58304A358964J7754J8899J8382J8532J9905K0203J8965J8436J8718J7210J4020
58293A559988J2686J4158J5330J4827J4943J6520J7356J7117J8286K0990K2428
$$ plain form
58384 798675 797935 795928 792227 788128 784996 782736 781079 780678 781620 782618 783070 784172 786686 789594 792417
58369 792417 796745 803690 811801 819306 826593 834649 843015 851201 860221 870743 881515 891529 901793
58356 901793 913022 923645 932228 939832 947610 954204 958117 960788 964508 968921 972420 975585 980367 986962
58342 986962 994173 1001904 1010861 1020728 1030942 1042355 1056061 1071563 1087920 1105344 1123737 1141215
58330 1141215 1156249 1169804 1183264 1195780 1205850 1213884 1220934 1226463 1229681 1231570 1233369 1234734 1235548
58317 1235548 1237679 1242485 1248502 1254028 1260118 1268462 1278341 1288436 1299677 1313388 1328473 1343366 1358964
58304 1358964 1376718 1395617 1413999 1432531 1452436 1472639 1491604 1510040 1528758 1545968 1559988
58293 1559988 1572674 1586832 1602162 1616989 1631932 1648452 1665808 1682925 1701211 1722201 1744629
58282A744629K2634K4770K8536K9685K7664K7084K9820L2327L2895L4703L9250
58271B073997M3467M5810M8725N2771N4988N5352N7846O2853O5753O5461O6678
58260B693701P1124P4374P4273P4398P6165P5737P2143P0078P1168P0926O7925
58249C492012O7201P0852P4369P6203Q1436R1614J00643J05491J11291J21047
58239D392159J30251J36641J45019J57106J67321J73985J83804J99558K14674
58230E900518K25853K39224K57925K76043K91354L11066L37977L64625L88441
58221H593026M18218M57755M98276N35736N79777O36302O97882P61326Q37320
58212A4015618R31946J037259J151566J289708J461382J660117J886234K158196
$$ plain form
58282 1744629 1767263 1792033 1820569 1850254 1877918 1905002 1934822 1967149 2000044 2034747 2073997
58271 2073997 2117464 2163274 2211999 2264770 2319758 2375110 2432956 2495809 2561562 2627023 2693701
58260 2693701 2764825 2839199 2913472 2987870 3064035 3139772 3211915 3281993 3353161 3424087 3492012
58249 3492012 3559213 3630065 3704434 3780637 3862073 3953687 4054330 4159821 4271112 4392159
58239 4392159 4522410 4659051 4804070 4961176 5128497 5302482 5486286 5685844 5900518
58230 5900518 6126371 6365595 6623520 6899563 7190917 7501983 7839960 8204585 8593026
58221 8593026 9011244 9468999 9967275 10503011 11082788 11719090 12416972 13178298 14015618
58212 14015618 14947564 15984823 17136389 18426097 19887479 21547596 23433830 25592026
58204B5592026K488420K873393L322220L867595M534415N329888O279919P436497
58196F1724373Q832155J0473854J2395424J4635573J7108123J9560205K1727045
58189A66456752K3475769K4755025K5522073K5811980K5670260K4692141K1681431
58182C38065431J5259254N225733o709087j7769904k5781540l0107300l1321229
58175B46861358l0385764k8166724k5335701k2350371j9447412j6727701j4260285
58168I0187400j2092175j0217715q604868p238729o107765n173850m392128l742640
58160C2617530l215116k782223k414445k104522j853136j645483j463283j305241
58152A5834081j175318j063902r59073q64055p85871p18191o51498n89231n38317
$$ plain form
58204 25592026 28080446 30953839 34276059 38143654 42678069 48007957 54287876 61724373
58196 61724373 70556528 81030382 93425806 108061379 125169502 144729707 166456752
58189 166456752 189932521 214687546 240209619 266021599 291691859 316384000 338065431
58182 338065431 353324685 358550418 351841331 334071427 308289887 278182587 246861358
58175 246861358 216475594 188308870 162973169 140622798 121175386 104447685 90187400
58168 90187400 78095225 67877510 59272642 52033913 45926148 40752298 36360170 32617530
58160 32617530 29402414 26620191 24205746 22101224 20248088 18602605 17139322 15834081
58152 15834081 14658763 13594861 12635788 11771733 10985862 10267671 9616173 9026942 8488625
58143H488625m94049m49005m07205l75358l49095l21150k94589k75235k59196
58134E263743k40054k20810k07086j95797j81592j67441j58248j50776j40015
58125C601924j28949j22188j16470j07232r8109r4378r2910q8127q2199q0014
58115B591348p9406p5517o9976o7016o5072o0544n5506n3663n2930m9660m5999
58104A916059m5660m6645m5316m3414m3974m4584m1779l7947l6865l6444l2892
58093A460539k8137k6197k5911k4052k1928k2221k2862k0734j7883j7606j7923
58082A215085j5522j2607j3100j5427j5797j5480j7991k1934k3488k3374k4681
58071A015684k6223k4729k1420k0029k0164j8823j6512j5767j5572j3310j0421
$$ plain form
58143 8488625 7994576 7545571 7138366 6763008 6413913 6092763 5798174 5522939 5263743
58134 5263743 5023689 4802879 4595793 4399996 4218404 4050963 3892715 3741939 3601924
58125 3601924 3472975 3350787 3234317 3127085 3028976 2934598 2841688 2753561 2671362 2591348
58115 2591348 2511942 2436425 2366449 2299433 2234361 2173817 2118311 2064648 2011718 1962058 1916059
58104 1916059 1870399 1823754 1778438 1735024 1691050 1646466 1604687 1566740 1529875 1493431 1460539
58093 1460539 1432402 1406205 1380294 1356242 1334314 1312093 1289231 1268497 1250614 1233008 1215085
58082 1215085 1199563 1186956 1173856 1158429 1142632 1127152 1109161 1087227 1063739 1040365 1015684
58071 1015684 989461 964732 943312 923283 903119 884296 867784 852017 836445 823135 812714
58060H12714j0141j1347j0597q558q465r729r142p204p249r166r750q594q201
58047F94571q776q105o231n369n668n545n541p416j0063j0716r443q416p799o437
58033E89046n366o278p752p315n986o376p713p421o296p153r342r638p840o599
58019D87971o301m975k933k596l817m007k901k732l676l505k017j487k396k691
58005D41937j663q46p29j58Q61J076P74J344K247J765M37L66J416J690J333K127
57989D53977L652L713K497K310L226K842P17q65r48j182k421l548m143n102o071
57974D48654n528l883l392m456n054m277l496l488l338k672k284k109j190J18
57960D03605M20j39j88J72k36q88j96J260J323M6l45O26J135O73Q22K007K724
$$ plain form
58060 812714 802573 791226 780629 772071 763606 753877 744735 737531 730282 721116 711366 702772 694571
58047 694571 685795 677690 671459 666090 660422 654877 649336 641920 631857 621141 611698 603282 595483 589046
58033 589046 583680 577402 569650 562335 556349 549973 542260 534839 528543 521390 512048 502410 494570 487971
58019 487971 481670 476695 473762 471166 467349 463342 460441 457709 454033 450528 448511 447024 444628 441937
58005 441937 440274 439428 438699 438541 439402 440478 441252 442596 444843 446608 447045 447411 448827 450517 451850 453977
57989 453977 457629 461342 463839 466149 469375 472217 472934 472069 471121 469939 467518 463970 459827 454725 448654
57974 448654 443126 439243 435851 431395 426341 422064 418568 415080 411742 409070 406786 404677 403487 403605
57960 403605 404025 403886 403698 403870 403634 402746 402550 403810 405133 405179 404834 405460 406595 407268 408090 410097 412821
57943D12821K621L256N102O764P707Q900J0188J0099Q824Q427R373R755Q661P334
57929E19832O278M222R50j733k948m069o069q065r337j0386j1216j0998j0188
57916D56273j0419j1598j1686j0103q692q462q158o986n985n587m464k138k60
57903C61735M8j54J41K55k95m95K36Q86Q27J034K115L005K878K527K722K970K888
57886C83323L026L336K690R29m70p94j229k591l830l982l871m552n672o492p051
57871C52770p337o707n181l879l322k754j818j323j605j742j166n40k50L29J392
57856C16867K150K416L056M195M717M252L882M054L684K180N77k95j021k053k674
57841C45987k551k619l413m102m163m365n102n351m353k871j757p16N56J421J553
$$ plain form
57943 412821 415442 418698 423800 430564 438271 447171 457359 467458 476282 484709 494082 503837 512498 519832
57929 519832 526110 530332 531282 529549 526601 522532 516463 508398 499061 488675 477459 466461 456273
57916 456273 445854 434256 422570 412467 403775 395313 387155 380169 374184 368597 364133 361995 361735
57903 361735 361783 361629 361770 362025 361730 361235 361471 362357 363184 364218 366333 369338 372216 374743 377465 380435 383323
57886 383323 386349 389685 392375 393304 392834 392040 390811 388220 384390 380408 376537 371985 366313 359821 352770
57871 352770 345433 338726 333545 329666 326344 323590 321772 320449 318844 317102 315936 315396 315146 315475 316867
57856 316867 319017 321433 324489 328684 333401 337653 341535 345589 349273 351453 352030 351735 350714 348661 345987
57841 345987 343436 340817 337404 333302 329139 324774 319672 314321 309968 307097 305340 304624 305180 306601 308154
57826C08154J744K597L617M325M885N053M105K491J872K661L206K305Q58O2l88
57811C47547j259k422l525m653n527n457m782m820n701n982n053m141m088m037
57797B86100l298k595k415k014j152q78j458j433j00J100J024Q10J771L103L480
57782B82045L306L673M427M904N410O311O927O726O472O748O739N771M691M175
57768C58325L181P84j778k808k737l240m692o197p264p868p646o597n853o214
57754B99396o678n899m336l544l957m725n146n004m131k793j907j908k083j879
57740B45406j890k607l302l231k851k792k705k313k320l030l289k223q54m87p08
57725B10804m81j58o31j417j380p06m26n59l09L17N92L86J40p0l45l40J16L96
$$ plain form
57826 308154 309898 312495 316112 320437 325322 330375 334480 336971 338843 341504 344710 347015 347873 347935 347547
57811 347547 346288 343866 340341 335688 330161 324704 319922 315102 309401 303419 298366 294225 290137 286100
57797 286100 282802 280207 277792 275778 274626 273748 272290 270857 270757 271857 272881 273691 275462 278565 282045
57782 282045 285351 289024 293451 298355 303765 310076 317003 323729 330201 336949 343688 349459 354150 358325
57768 358325 361506 362290 360512 357704 354967 351727 347035 340838 333574 325706 318060 311463 305610 299396
57754 299396 292718 286819 282483 278939 274982 270257 265111 260107 255976 253183 251276 249368 247285 245406
57740 245406 243516 240909 237607 234376 231525 228733 226028 223715 221395 218365 215076 212853 211999 211512 210804
57725 210804 210323 210165 209534 208117 206737 206031 205605 205046 204737 205054 205646 206032 206172 206102 205757 205417 205533 205929
57707B05929R3j34L10Q23P36N62R92J564J611J570K010K293J646O70L63M54J22
57690B21614l95l96j41k06j75O42J828K619L329M657O397Q117J0319J3468J6883
57675B88560K0082K4215L0318L7055M2138M5326M8049N0757N2788N4384N6377
57664G50049N7450N3586M1022J9211q546l6210n7411o8833p1716o9369o3871n6111
57652D89251m7641m0322l4455k9207k4593k1218j8474j5064j1338r042q491p927
57640B21479o102l868k563k283k366k460k504k457k458k609k586k109j648j808
57626A83658k289k331j927j673j663j578j517j761j980j773j567j883k191j690
57612A57835p89m74n85j84O11P09j03q01p06k15J45L14K91O4o4J57M38N10P23
$$ plain form
57707 205929 206022 205888 206198 207021 207757 208319 209311 210875 212486 214056 216066 218359 220005 220675 221038 221492 221614
57690 221614 221219 220823 220682 220476 220301 220943 222771 225390 228719 233376 239773 247890 258209 271677 288560
57675 288560 308642 332857 363175 400230 442368 487694 535743 586500 639288 693672 750049
57664 750049 807499 861085 902107 921318 912772 876562 819151 750318 678602 609233 545362 489251
57652 489251 441610 401288 366833 337626 313033 291815 273341 258277 246939 237897 229406 221479
57640 221479 215377 211509 208946 206663 204297 201837 199333 196876 194418 191809 189223 187114 185466 183658
57626 183658 181369 179038 177111 175438 173775 172197 170680 168919 166939 165166 163599 161716 159525 157835
57612 157835 157046 156572 155987 155803 156414 157123 157020 156219 155513 155298 155443 155757 156048 156112 156048 156205 156643 157153 157876
57593A57876J206J182J72q18o58Q9J21m57n05J10N37N73O48M75n51j791j911r89
57575A55309l80n52o12o8M85O07M84J11o56j244q85K8L79Q2k1J86L0m88o25k80
57555A51890k0J51O04R29N30J39R75K590L289K619J601O13q35k263k354j288p67
57538A58403j248j267j65O35j3j245j807j750j548j047k91jl27m10P0K70j92m12
57520A47655J70P05M68P6K57O42P33R09J447J692J147M06R1j63o98q87j91P43
57502A55202J013P84O74N69Kq58j471j737j855j771j330o63l2L48K17m25q46k14
57484A47607J227K311K442K033J535J036Q72J431K202K169J298N45J56n56j613
57469A64695k031j596j417k045k506j992j187r88j133r60n81k91J58R19J471J437
$$ plain form
57593 157876 159082 160264 160436 159618 158960 159049 159170 158713 158208 158318 158855 159428 160076 160551 160000 158209 156298 155309
57575 155309 154929 154377 153765 153697 154182 154789 155273 155384 154728 153484 152599 152627 153006 153088 153067 153253 153283 152795 152170 151890
57555 151890 151870 152021 152625 153554 154084 154223 155198 157788 161077 163696 165297 165910 165075 162812 160458 159170 158403
57538 158403 157155 155888 155723 156358 156345 155100 153293 151543 149995 148948 148657 148656 148329 147919 147989 148259 148067 147655
57520 147655 147825 148530 148998 149074 149331 149973 150706 151615 153062 154754 155901 156307 156398 156235 155537 154650 154459 155202
57502 155202 156215 156999 157673 158242 158244 157386 155915 154178 152323 150552 149222 148559 148527 148875 149092 148667 147821 147607
57484 147607 148834 151145 153587 155620 157155 158191 159063 160494 162696 164865 166163 166708 166864 166308 164695
57469 164695 162664 161068 159651 157606 155100 153108 151921 150933 149800 148840 148259 147968 148126 149045 150516 151953
57453A51953J229J209J079O61M22O32Q12O01K74L2l06n16L0J104J518Q65K00L79
57435A62178Q49P89L33m9l85o40l95L25Q08Q26R89J416J249J91p38o97j81R1K28
57416A67187L72J09m71l84P19J722J709J227J027P79J04l77j32K48K32M07J233
57399A75711J900J675J245J394J498P48j12J41J212J876J937K166K736L181L430
57384B00738L667L577K828J841J142M95l17n63L60J619J936J399J020J032Q76
57369B21650M40J41j3k49k77L05J054J165O23N1k51l03M2Q48J720K360K990L609
57351B35905L582K664J670J333J326J175J224J758K224K242K369K756K265L56
57337B62849j320q53J232K887L348L358L286K928K685L129L625L090J931J545
$$ plain form
57453 151953 153182 154391 155470 156131 156553 157185 157997 158598 158872 158904 158598 158082 158112 159216 160734 161599 161799 162178
57435 162178 163027 163816 164149 164100 163715 163075 162680 163005 163813 164639 165628 167044 168293 168484 167746 167049 166868 166959 167187
57416 167187 167559 167668 167197 166813 167532 169254 170963 172190 173217 173996 174100 173723 173591 173839 174071 174478 175711
57399 175711 177611 179286 180531 181925 183423 184171 184059 184200 185412 187288 189225 191391 194127 197308 200738
57384 200738 204405 207982 210810 212651 213793 214288 213971 213408 213768 215387 217323 218722 219742 220774 221650
57369 221650 222090 222231 222218 221969 221692 221997 223051 224216 224839 224890 224639 224336 224378 225226 226946 229306 232296 235905
57351 235905 239487 242151 243821 245154 246480 247655 248879 250637 252861 255103 257472 260228 262493 262849
57337 262849 261529 260676 261908 264795 268143 271501 274787 277715 280400 283529 287154 290244 292175 293720
57323B93720K107K515K465K844L936M782M652L830K823J979J920L142N023O341
57309C42079O827P161P564P613P336P333P799Q479R432J0760J1763J1718J1241
57296D57105J1551J2517J2946J2729J3063J4373J5615J6088J6437J7324J8386
57285F18134J9087J9556J9981K0170K0268K0981K2569K4386K5888K7320K9033
57274H67373L0790L2207L3241L3959L4342L4636L5357L6780L8715M0788M2530
57263A260718M3438M3582M3859M4963M6300M6712M5974M4646M2814M0123L6962
57252A740091L4340L2481L0682K8713K7301K6791K6338K4952K2693K0415J8769
57241B033566J7712J6800J5924J5946J8028K1914K5533K7146K7280K7488K7899
$$ plain form
57323 293720 295827 298342 300807 303651 307587 312369 317021 320851 323674 325653 327573 330715 335738 342079
57309 342079 348906 356067 363631 371244 378580 385913 393712 402191 411623 422383 434146 445864 457105
57296 457105 468656 481173 494119 506848 519911 534284 549899 565987 582424 599748 618134
57285 618134 637221 656777 676758 696928 717196 738177 760746 785132 811020 838340 867373
57274 867373 898163 930370 963611 997570 1031912 1066548 1101905 1138685 1177400 1218188 1260718
57263 1260718 1304156 1347738 1391597 1436560 1482860 1529572 1575546 1620192 1663006 1703129 1740091
57252 1740091 1774431 1806912 1837594 1866307 1893608 1920399 1946737 1971689 1994382 2014797 2033566
57241 2033566 2051278 2068078 2084002 2099948 2117976 2139890 2165423 2192569 2219849 2247337 2275236
57230B275236K7382K5719K4040K3042K2341K1738K1752K2499K3373K4147K5344
57219B536613K7110K8805L0110L1489L3139L4402L4740L4381L3660L2463L0816
57208B887728K9280K8305K7844K7817K8397K9528L0755L1783L2676L3373L3636
57197C221122L3550L3508L3681L4035L4761L6006L7243L7749L7636L7722L8368
57186C615381L9203L9896M0411M0580M0245L9751L9516L9179L7997L5976L3802
57175D041937L1776K9679K7554K5734K4355K3683K4574K7581L1967L6659M1563
57164D367062M6483M9233M6903L9255K9302K0239J3287Q629O508O497P180P552
57152D648130P819Q222Q129O900M730K033j090m276o728q179r265j0550j1895
$$ plain form
57230 2275236 2302618 2328337 2352377 2375419 2397760 2419498 2441250 2463749 2487122 2511269 2536613
57219 2536613 2563723 2592528 2622638 2654127 2687266 2721668 2756408 2790789 2824449 2856912 2887728
57208 2887728 2917008 2945313 2973157 3000974 3029371 3058899 3089654 3121437 3154113 3187486 3221122
57197 3221122 3254672 3288180 3321861 3355896 3390657 3426663 3463906 3501655 3539291 3577013 3615381
57186 3615381 3654584 3694480 3734891 3775471 3815716 3855467 3894983 3934162 3972159 4008135 4041937
57175 4041937 4073713 4103392 4130946 4156680 4181035 4204718 4229292 4256873 4288840 4325499 4367062
57164 4367062 4413545 4462778 4509681 4548936 4578238 4598477 4611764 4620393 4626901 4633398 4640578 4648130
57152 4648130 4655949 4664171 4672300 4679200 4683930 4685963 4684873 4680597 4673869 4665690 4656425 4645875 4633980
57139D633980j3033j3914j4159j3065j0393o469j438M739J1502J7919K3699K8940
57127D648308L2952L4629L4119L2886L1929L1210L0951L2067L5100M0033M7362
57116E031546N7710P0100Q2228R3120J04110J16827J31808J49766J72509K01679
57106F211403K37824K81500L34050L96725M70579N58034O63307P90662R43766
57097A0887850J127302J347192J607874J910473K254145K636970L053980L495574
57089B8321360L948609M397204M822487N205473N531195N781307N911631N838219
57081F9757485N462554M732063L689321K464531J214148N3954r67412j849683
57073H4556961k607220l249454l779754m200096m512749m720419m827324m839671
$$ plain form
57139 4633980 4620947 4607033 4592874 4579809 4569416 4562947 4561509 4566248 4577750 4595669 4619368 4648308
57127 4648308 4681260 4715889 4750008 4782894 4814823 4846033 4876984 4909051 4944151 4984184 5031546
57116 5031546 5089256 5159356 5241584 5334704 5438814 5555641 5687449 5837215 6009724 6211403
57106 6211403 6449227 6730727 7064777 7461502 7932081 8490115 9153422 9944084 10887850
57097 10887850 12015152 13362344 14970218 16880691 19134836 21771806 24825786 28321360
57089 28321360 32269969 36667173 41489660 46695133 52226328 58007635 63919266 69757485
57081 69757485 75220039 79952102 83641423 86105954 87320102 87374056 86406644 84556961
57073 84556961 81949741 78700287 74920533 70720437 66207688 61487269 56659945 51820274
57065E1820274m764414m608830m382210m097238l769340l415434l053028k698307
57057B1031473k363317k055239j778238j534724j324542j144898r92428q64538
57049H973549p58441o70431n97117n36100m84738m39830l99453l63700l32521
57040D391218l04394k78098k54112k32871k13249j94307j77057j62643j50082
57031B424405j37650j25448j14708j05505r6967q8977q1859p5112o8211o1963
57021A468005n7386n3830m9999m6083m3069m0656l7776l4728l2708l1527k9822
57010A010421k7366k5192k3496k1382j8850j7088j6411j5631j3968j2098j0781
56999H08158r795q770p980p724p779p842p840p619o984o093n225m302l266k584
$$ plain form
57065 51820274 47055860 42447030 38064820 33967582 30198242 26782808 23729780 21031473
57057 21031473 18668156 16612917 14834679 13299955 11975413 10830515 9838087 8973549
57049 8973549 8215108 7544677 6947560 6411460 5926722 5486892 5087439 4723739 4391218
57040 4391218 4086824 3808726 3554614 3321743 3108494 2914187 2737130 2574487 2424405
57031 2424405 2286755 2161307 2046599 1941094 1844127 1755150 1673291 1598179 1529968 1468005
57021 1468005 1410619 1356789 1306790 1260707 1217638 1176982 1139206 1104478 1071770 1040243 1010421
57010 1010421 983055 957863 934367 912985 894135 877047 860636 845005 831037 818939 808158
56999 808158 798363 789593 781613 773889 766110 758268 750428 742809 735825 729732 724507 720205 716939 714355
56985G14355k541k522j880j153j482l213o095j0252j5646k0992k4562k5988k6099
56972E71930k5418k3910k1874j9690j7005j3465r886p309n264k394J441N188Q412
56959D40756J1389J3681J4484J4381J4807J5454J3995Q993J560o197j2900j7617
56947E12786j9626j9359j8332j7349j5705j2747r077n628k498O16L723O820J0111
56934D13735J3451J6187J7929J8915J9428J9474J8886J6949J2121L452p566j7628
56922E45333k4441k8033k9370k9019k7483k5492k3314k0694j7808j5408j3704
56911B90567j2067j0138q311o851n527m365l721l415k774j788j123p81K2J372
56897B31100K322K556L046M439O023P046P977R548J1395J2617J3013J3055J3114
$$ plain form
56985 714355 711814 709292 707412 706259 704777 701564 695469 685217 669571 648579 624017 598029 571930
56972 571930 546512 522602 500728 481038 464033 450568 440682 433373 428109 425715 427156 432344 440756
56959 440756 452145 465826 480310 494691 509498 524952 538947 547940 549500 543303 530403 512786
56947 512786 493160 473801 455469 438120 422415 409668 400591 394963 392465 393081 396804 403624 413735
56934 413735 427186 443373 461302 480217 499645 519119 538005 554954 567075 570527 562961 545333
56922 545333 520892 492859 463489 434470 406987 381495 358181 337487 319679 304271 290567
56911 290567 278500 268362 260051 253200 247673 243308 239587 236172 233398 231610 230487 229706 229728 231100
56897 231100 233422 235978 239024 243463 249486 256532 264509 274057 285452 298069 311082 324137 337251
56884C37251J3228J3140J2126R404N071J46m524q615j1518j2293j0908q584o381
56871C27543m208j677J032L750O917J0864J5090J8889K2183K5189K7778K9692
56859D83042L0968L1712L1663L0042K5584J7111N026p832j7892k3684k6196k6582
56847E52962k4813k0856j5676j0333m999N19O179J2140J8798K5804L1977L6763
56835F08465M0873M4845M8032M9682M9821M7944M1744K8736R220j3053l3105m7337
56823H75867n4701n6281n3926m9007m2381l5053k7984k1188j3930o106J486Q384
56811E25180J4940K1141K6053K9103L1072L2970L4492L4045K9744K0207N511j1878
56799G92580k7898l9447m5957m8336m7419m3940l8996l3503k7732k1859j6326
$$ plain form
56884 337251 350479 363619 375745 385149 390220 390366 385842 377227 365709 353416 342508 333924 327543
56871 327543 323335 321658 322690 326440 333357 344221 359311 378200 400383 425572 453350 483042
56859 483042 514010 545722 577385 607427 633011 650122 655148 647316 629424 605740 579544 552962
56847 552962 528149 507293 491617 481284 476285 476804 482983 495123 513921 539725 571702 608465
56835 608465 649338 694183 742215 791897 841718 889662 931406 960142 969362 956309 923204 875867
56823 875867 821166 764885 710959 661952 619571 584518 556534 535346 521416 515310 516796 525180
56811 525180 540120 561261 587314 616417 647489 680459 714951 748996 778740 798947 804458 792580
56799 792580 764682 725235 679278 630942 583523 539583 500587 467084 439352 417493 401167
56788D01167j1166n791j51M712P962J0163J2385J4772J6689J7610J7146J4656
56776E00154R685K510o090j5055k2754k7440k8697k7902k6585k5008k2829k0314
56764B89675j8046j6036j3982j1959j0239q797p563o619n799m663l309k476k401
56751A77786k436k227k309k864k977k047j031j130j992k310j705r10m90m04n38
56736A52416p77p88m46j68k29k24J54L98L7l52Q1J122J770J555P93p6o53m97L14
56717A54430R23P26K98N19J254J714J718J607J298M67m80o56L8P06O53J02l90
56700A64927n78n03k58L8K77M64O25P63R69J289J417Q77k96j461k074k081j585
56683A62810p15P2L00K25N38J185J359Q31L23K11km96n85mL68j16q10r26p86r84
$$ plain form
56788 401167 390001 384210 384059 388771 396733 406896 419281 434053 450742 468352 485498 500154
56776 500154 509839 512349 506259 491204 468450 441010 412313 384411 357826 332818 309989 289675
56764 289675 271629 255593 241611 229652 219413 210616 203053 196434 190635 185972 182663 180187 177786
56751 177786 175350 173123 170814 167950 164973 162926 161895 160765 158773 156463 154758 153848 153358 152954 152416
56736 152416 151639 150851 150405 150237 150008 149784 149938 150336 150373 150021 150102 151224 152994 154549 155342 155266 154613 154116 154430
56717 154430 155353 156079 156377 156896 158150 159864 161582 163189 164487 164954 164474 163818 163856 164562 165215 165317 164927
56700 164927 164349 163846 163588 163626 163903 164367 164992 165755 166724 168013 169430 170307 170011 168550 166476 164395 162810
56683 162810 162095 162167 162467 162692 163230 164415 165774 166605 166928 167139 167137 166641 166056 166052 166420 166304 165494 164568 163782 162798
56663A62798j163p11J36P55J126J495J751J922K454L266L368K350J323J349J936
56648A84155K121K071K333K437J779J127J598K653K717J544M47K84N91P79Q56
56633B07492Q51N87J88o6l25q95j475j489r96n64l94l32m65r34j418j560j617
56616A96588j972k327k155j633j386j585j954k300k448k067j153k44K65M69K54
56601A76352p48k006k111p67M73M47K9L13O05j26j015n45Q18J323P51M84J013
56584A75290J366J057Q23J156J650J873J773J180J53m12K82J637K463K722L146
56569A96159L607L441L042L468M652N620O282P345Q606R041Q678Q704R541J0327
56555B88513J0351R532P547M211Q25o70j07Q05R71Q13O04k33j673k657k729k601
$$ plain form
56663 162798 161635 160924 161060 161815 162941 164436 166187 168109 170563 173829 177197 179547 180870 182219 184155
56648 184155 186276 188347 190680 193117 194896 196023 197621 200274 202991 204535 204982 205266 205857 206636 207492
56633 207492 208343 208930 209118 209052 208727 207832 206357 204868 203872 203308 202914 202582 202117 201183 199765 198205 196588
56616 196588 194616 192289 190134 188501 187115 185530 183576 181276 178828 176761 175608 175364 175629 176098 176352
56601 176352 175604 173598 171487 170720 171193 171640 171669 171982 172587 172461 171446 170901 171719 173042 173793 174277 175290
56584 175290 176656 177713 178536 179692 181342 183215 184988 186168 186321 185909 186191 187828 190291 193013 196159
56569 196159 199766 203207 206249 209717 214369 219989 226271 233616 242222 251263 259941 268645 278186 288513
56555 288513 298864 308396 315943 320154 320979 320309 320202 321007 321978 322791 323395 323162 321489 318832 316103 313502
56539C13502k633k272j580j657k865m001m062l558l365l470l598l987m764n429
56525B66261n606n489n156m359l324k765k764k584j987j678k080k663k852k672
56511B20282k211j409o81o53j091j080n20k83o55q56m15J17K58K69L33J15m29
56494B11091p77p07n89o06o22q50j531j919r44R41K008J589Q07N69L58m04j159
56477B07255j146m79L91J341K173K460K249K076K023J676J197J285J876K026J382
56462B27785O30K22j53o07p78p57j050j417j059j97j0p31j231q86l32L8P78K012
56444B22257K817K638K042J470N89o06j326j226r00p22l90k8l09j055j144k29
56428B23878P62J240J601J951J718R84N91N73Q7p44q13j20Q2k86J78J596K140
$$ plain form
56539 313502 310869 308597 307017 305360 302495 298494 294432 290874 287509 284039 280441 276454 271690 266261
56525 266261 260655 255166 250010 245651 242327 239562 236798 234214 232227 230549 228469 225806 222954 220282
56511 220282 218071 216662 215981 215328 214237 213157 212637 212354 211699 210843 210428 210545 210803 211072 211405 211520 211091
56494 211091 210314 209607 209018 208412 207790 206940 205409 203490 202546 203487 205495 207084 207891 208460 208818 208414 207255
56477 207255 206109 205630 206021 207362 209535 211995 214244 216320 218343 220019 221216 222501 224377 226403 227785
56462 227785 228415 228637 228484 227877 227099 226342 225292 223875 222816 222619 222609 221878 220647 219761 219429 219467 220245 222257
56444 222257 225074 227712 229754 231224 231813 231207 229881 228655 227755 227033 226643 226615 226306 225251 224107 223878
56428 223878 224640 225880 227481 229432 231150 232134 232725 233298 233385 232641 231828 231708 231790 231504 231682 233278 235418
56411B35418J116K88Q11J236J60j193j067j1L17j55l60q2J70L74O03M23j22k2
56393B37904J083K000J892J611J970K120J186J10J46P45O47Rj10L83P90Q95Q58
56376B54239O06L19N98J239J106J63O6J542K797K104M18k67J84O57R61J513J822
56359B70067J243M31M15Q84R72Q71J158J389R16K45Q9n4q40j524j078rN62P84
56341B76521J468K303K388J867J540J434J182J165J847K665K820K599K627K646
56327C05072K205J730J758J996K179K738L540L301J566j55n50l40n13m50M15P86
56311C25278m28j782j403j08mj014j332n54K34Q44K034L476L923L250K429J794
56295C36637J098Q19J598K736L027K532K046J519O42J85R37K098K522K654L425
$$ plain form
56411 235418 236534 236822 237633 238869 239029 237836 236769 236758 237075 236920 236560 236478 236648 237022 237625 238048 237926 237904
56393 237904 238987 240987 242879 244490 246460 248580 249766 249876 250022 250767 251414 251423 251313 251696 252486 253381 254239
56376 254239 254845 255164 255762 257001 258107 258270 258336 259878 262675 264779 265197 264930 265114 265771 266732 268245 270067
56359 270067 271310 271741 272156 273040 274012 274883 276041 277430 278346 278591 278680 278626 277786 276262 275184 275175 275737 276521
56341 276521 277989 280292 282680 284547 286087 287521 288703 289868 291715 294380 297200 299799 302426 305072
56327 305072 307277 309007 310765 312761 314940 317678 321218 324519 326085 325930 325380 325040 324527 324077 324492 325278
56311 325278 324850 323068 321665 321557 321553 320539 319207 318653 318887 319731 321765 325241 329164 332414 334843 336637
56295 336637 337735 338554 340152 342888 345915 348447 350493 352012 352654 352839 353776 355874 358396 361050 364475
56280C64475M235M023L367L417L704L187K544L062M131M268L848M378N687O301
56266D20627O028N803N575M846M646O301Q761R806R506R840J1245J2362J3007
56253E28353J4476J6907J9034K0731K3171K6206K8275K9210L0607L3006L5065
56242H05041L5980L6478L6883L6355L4570L2266K9668K6233K2127J8236J4444
56231A128281R772M280q86n365r783j4129j7687k0414k2748k4361k4853k5153
56219I76954k6350k7686k7714k6765k6049k5148k2973k0509j9748k0266j9754
56208G13992j7737j5932j5014j3934j2532j1862j1711j0567q421o947o576n978
56196E76781m739l967l920l574k871k820l120k248k50J112J261J384J855J663
$$ plain form
56280 364475 368710 372733 376100 379517 383221 386408 388952 392014 396145 400413 404261 408639 414326 420627
56266 420627 426655 432458 438033 442879 447525 453826 462587 472393 481899 491739 502984 515346 528353
56253 528353 542829 559736 578770 599501 622672 648878 677153 706363 736970 769976 805041
56242 805041 841021 877499 914382 950737 985307 1017573 1047241 1073474 1095601 1113837 1128281
56231 1128281 1138053 1142333 1141447 1136082 1126299 1112170 1094483 1074069 1051321 1026960 1002107 976954
56219 976954 950604 922918 895204 868439 842390 817242 794269 773760 754012 733746 713992
56208 713992 696255 680323 665309 651375 638843 626981 615270 604703 596282 589335 582759 576781
56196 576781 572042 568075 564155 560581 557710 554890 551770 549522 549272 550384 551645 553029 554884 556547
56182E56547P97O39J544K353K594K900L160K747K528L936O078O532N207M465N210
56167F07237N837N463N255N986O920P777R160J0716J1332J1437J2531J4422J5636
56154G29709J6488J8783K2436K5487K7621L0527L4697L9036M3763N0410N8745
56143A097702O7018P5300Q5074R5533J04005J10329J16864J23796J28275J28612
56133B132508J25251J17395J03329Q5136O8649N7270M9604M3890M0214L6944K9870
56122B890060J7176J709j3415k7687m0321m8933n3473n7961o5986p7352r0439
56111B433378j04296j16792j24362j25565j22061j15027j04064r0520p7850o7215
56101A385626n6566m5215l5414k8150k1703j5630j1821j0124p577l540r71q82
$$ plain form
56182 556547 557344 557983 559527 561880 564474 567374 570534 573281 575809 579745 585823 592355 597562 602027 607237
56167 607237 613074 618537 623792 629778 636698 644475 653635 664351 675683 687120 699651 714073 729709
56154 729709 746197 764980 787416 812903 840524 871051 905748 944784 988547 1038957 1097702
56143 1097702 1164720 1240020 1325094 1420627 1524632 1634961 1751825 1875621 2003896 2132508
56133 2132508 2257759 2375154 2478483 2563619 2632268 2689538 2739142 2783032 2823246 2860190 2890060
56122 2890060 2907236 2908945 2895530 2867843 2827522 2778589 2725116 2667155 2601169 2523817 2433378
56111 2433378 2329082 2212290 2087928 1962363 1840302 1725275 1621211 1530691 1452841 1385626
56101 1385626 1329060 1283845 1248431 1220281 1198578 1182948 1171127 1161003 1153426 1149886 1148915 1148033
56089A148033l86J843L109J919P97J524K307K057K754N063O300N350M966O733
56075A192369Q421Q729R786J2359J3728J2920J2983J5290J6896J6386J6766J9470
56063A356103K1186K0087J9517K1713K3524K2400K1121K2267K3386K2015K0381
56052A593700K0722K0908J9108J7780J8805J9615J8344J7686J9545K1171K0710
56041A808094K1072K4057K6446K6226K6676K9709L1686L0677L1172L6163M1204
56030B133182M2155M2219M5182M8306M8345M8217N0949N3351N2523N2339N6569
56019B673337O1749O3930O6070P1531P6791P8068P8825Q3076Q7744Q9310R1289
56008C521720R7219J03147J05229J07680J14771J22325J25934J29969J39217J49281
$$ plain form
56089 1148033 1147647 1149490 1152599 1154518 1155315 1156839 1159146 1161203 1163957 1169020 1175320 1180670 1185636 1192369
56075 1192369 1200790 1209519 1219305 1231664 1245392 1258312 1271295 1286585 1303481 1319867 1336633 1356103
56063 1356103 1377289 1397376 1416893 1438606 1462130 1484530 1505651 1527918 1551304 1573319 1593700
56052 1593700 1614422 1635330 1654438 1672218 1691023 1710638 1728982 1746668 1766213 1787384 1808094
56041 1808094 1829166 1853223 1879669 1905895 1932571 1962280 1993966 2024643 2055815 2091978 2133182
56030 2133182 2175337 2217556 2262738 2311044 2359389 2407606 2458555 2511906 2564429 2616768 2673337
56019 2673337 2735086 2799016 2865086 2936617 3013408 3091476 3170301 3253377 3341121 3430431 3521720
56008 3521720 3618939 3722086 3827315 3934995 4049766 4172091 4298025 4427994 4567211 4716492
55998D716492J55021J60668J71491J83375J91172J99395K13638K29454K40985
55989F461691K52536K70185K90324L08071L28055L54916L82761M06638M34187
55980I489364M72670N15444N55398N99993O57744P22368P86854Q60303R53128
55971A5613266J059353J172569J304963J470371J664159J881861K141107K461814
55963B8769463K843597L289030L829009M497105N302300O258963P417956Q834164
55955G1041587J0534642J2550003J4913305J7548980K0204249K2581387K4516390
55948A93890543K5963523K6891217K7326131K7355510K6717925K4312021J8558199
55941C71015069Q773857l715978j6058748k5599483l1212378l3261816l2748495
$$ plain form
55998 4716492 4871513 5032181 5203672 5387047 5578219 5777614 5991252 6220706 6461691
55989 6461691 6714227 6984412 7274736 7582807 7910862 8265778 8648539 9055177 9489364
55980 9489364 9962034 10477478 11032876 11632869 12290613 13012981 13799835 14660138 15613266
55971 15613266 16672619 17845188 19150151 20620522 22284681 24166542 26307649 28769463
55963 28769463 31613060 34902090 38731099 43228204 48530504 54789467 62207423 71041587
55955 71041587 81576229 94126232 109039537 126588517 146792766 169374153 193890543
55948 193890543 219854066 246745283 274071414 301426924 328144849 352456870 371015069
55941 371015069 379788926 376072948 360014200 334414717 303202339 269940523 237192028
55934B37192028l0652698k7749042k4584394k1461759j8509908j5805799j3411195
55927H5017233j1336068r548261q025963o760018n716958m845822m117567l522667
55919C1143909l037835k629324k282967k000051j768745j567362j390190j243809
55911A5223626j122446j011014r07980q22325p51586o83976o18707n64351n20160
55902H221081m77354m35819m02111l74060l43952l13868k91920k76200k57813
55893E047984k36972k21130k09848j96113j80397j69259j61904j51625j38901
55884C381835j30126j24909j17152j07265j01148r8350r3094q5846q2275q1668
55874B360002p7799p0753o6832o6906o5492o1357n8959n9007n7235n2976n0108
$$ plain form
55934 237192028 206539330 178790288 154205894 132744135 114234227 98428428 85017233
55927 85017233 73681165 64132904 56106941 49346923 43629965 38784143 34666576 31143909
55919 31143909 28106074 25476750 23193783 21193732 19424987 17857625 16467435 15223626
55911 15223626 14101180 13090166 12182186 11359861 10608275 9924299 9305592 8741241 8221081
55902 8221081 7743727 7307908 6905797 6531737 6187785 5873917 5581997 5305797 5047984
55893 5047984 4811012 4589882 4380034 4183921 4003524 3834265 3672361 3520736 3381835
55884 3381835 3251709 3126800 3009648 2902383 2801235 2702885 2609791 2523945 2441670 2360002
55874 2360002 2282203 2211450 2144618 2077712 2012220 1950863 1891904 1832897 1775662 1722686 1672578
55863A672578m9154m6879m3669m3096m4234m2494l7969l5030l3937l0795k5642
55852A239679k2735k2683k1879j9875k0001k2531k4280k4935k6924k9135k7870
55841I76831k3997k2157k2805k1954j8892j7271j8071j8226j6881j6524j7290
55830G62763j6384j3801j2624j3064j2086r452q269r008q749p043o809q667r854
55817F26953r513r765j0884j0632q966q288q494p012m194l333m645m620k177k10
55803E34220MP68L069M633M359M184N141N656M973M458M427L477J679P55N57r19
55787E81441l646n486o181p530r592j0800j1807j4785j8797k0343j8835j7012
55775D36627j5795j3453j0201q637q811p741m776k720k598k116m31K83n37l85
$$ plain form
55863 1672578 1623424 1576545 1532876 1489780 1445546 1403052 1365083 1330053 1296116 1265321 1239679
55852 1239679 1216944 1194261 1172382 1152507 1132506 1109975 1085695 1060760 1033836 1004701 976831
55841 976831 952834 930677 907872 885918 867026 849755 831684 813458 796577 780053 762763
55830 762763 746379 732578 719954 706890 694804 685352 677083 668075 659326 652283 645474 636807 626953
55817 626953 617440 607675 596791 586159 577193 568905 560411 553399 549205 545872 541227 536607 534430 534220
55803 534220 534224 534992 538061 542694 547053 551237 556378 562034 567007 571465 575892 579369 581048 581803 582360 581441
55787 581441 577795 572309 566128 558598 549006 538206 526399 511614 492817 472474 453639 436627
55775 436627 420832 407379 397178 388541 379730 371989 367213 364493 361895 359779 359348 359631 359094 358709
55761C58709J458K209N06j191j105r29k116l312l526m211o103p424p207p110q110
55746C10538q615p696o950p356p328n829m383m234m302l685l391l962m066l069
55732B35672k293k433k329j602j649k670k745j221j88j054k480l107l505l967
55718B04429l334j565o59j471k263j847j346j476j051K64Q15J51K98K023K893
55703A95861J261q13r10O7oj049j813k269k711k433j319q99j897k702k025j119
55687A75224j406j968j415l47J08M62J556K638K705K353K514K772K468K108K152
55672A91924J896R16J39J25n8r49j383m63P91J187J123J292J287Q05N65Q05N61
55655B00563m00p34J40Q80O35N53J522K471K457K287K502J942J08j258r64o92
$$ plain form
55761 358709 360167 362376 362882 361691 360586 359657 357541 354229 350703 346492 340389 332965 325758 318648 310538
55746 310538 301923 294227 287277 279921 272593 266764 262381 258147 253845 250160 246769 242807 238741 235672
55732 235672 233379 230946 228617 227015 225366 222696 219951 218730 218542 217488 215008 211901 208396 204429
55718 204429 201095 199530 198871 197400 195137 193290 191944 190468 189417 189681 190496 190647 190945 192968 195861
55703 195861 197122 196309 195399 195466 195460 194411 192598 190329 187618 185185 183866 182967 181070 178368 176343 175224
55687 175224 173818 171850 170435 170088 170196 170658 172214 174852 177557 179910 182424 185196 187664 189772 191924
55672 191924 193820 194736 194875 195000 194942 193993 192610 192147 192938 194125 195248 196540 197827 198632 199197 200002 200563
55655 200563 200163 199429 199569 200449 201084 201637 203159 205630 208087 210374 212876 214818 214926 213668 212704 212012
55639B12012k362n038o676p249p808p993o945n450m862m855m362l652l516l319
55625A37925j997j70O83M67J50j42r65k077k656k555k163j576r19o30o89m70j17
55608A22099o60j998k449j383m30p55j102k28O80Q4j070r76q7k35j472k198j828
55591A05992j277j076q72n48l24K3Q02J606J884J822J791J622J281J322J904K363
55575A18315K536L184M303M609L745L185L661L574J624p15j383q20q39j679k348
55560A40952k695l085l037k220j783k628l439k595j072j002k205k651j849j210
55546A09481j193o79O14J323O62l56n17J32Q56J167R18K69k60l25j58N2O10J500
55528A14096J885J274M19J14K7l44n80l26l70j390k620l068l127l527l718k882
$$ plain form
55639 212012 209650 204612 197936 190687 182879 174886 167941 162491 157629 152774 148412 144760 141244 137925
55625 137925 135928 135758 136441 136908 137058 136916 135951 133874 131218 128663 126500 124924 124005 123375 122686 122216 122099
55608 122099 121439 119441 116992 115609 115179 114424 113322 113094 113774 113858 112788 111812 111725 111490 110018 107820 105992
55591 105992 104715 103639 102767 102219 101895 101918 102720 104326 106210 108032 109823 111445 112726 114048 115952 118315
55575 118315 120851 124035 128338 132947 136692 139877 143538 147112 148736 148021 146638 145818 144979 143300 140952
55560 140952 138257 135172 132135 129915 128132 125504 122065 119470 118398 117396 115191 112540 110691 109481
55546 109481 108288 107609 108223 109546 110208 109852 109335 109467 110323 111490 112408 112677 112417 112092 111934 111986 112596 114096
55528 114096 115981 117255 117674 117788 117815 117471 116891 116565 116195 114805 112185 109117 105990 102463 98745 95863
55512I5863j640j145j207r26m36m61p91p79p17j091j279n27M42M65r9j58J19j64
55494H5469p48p05l33o09j214r51J06O62K96j86l59n53p60n45%M18O99Q56L52
55475H1895q10j216J16J823J825K67j011j275j208r59p0R11Q26p2m40j57l65j209
55457G8871j462o70J61L21K08J06k89p76n55M19J236J413J298J078O03K13N05
55440H2680J144J121K00r43j821k270j884n48P41R28M22K81L96k5o81o75l39p36
55422G7991j555j416k09Q01J156J536J938J436Q7p58m52K36O29P83N49l40j093
55405H1319n86N97O92m39j023k90L56k14j144j255p37k14L76J058J206O12L3n3
55387H0294j46n49o40j0P19R20Q81J084J406J481J151K73j098k179k072j085m14
$$ plain form
55512 95863 94223 93078 91871 90945 90509 90048 89257 88478 87761 86670 85391 84864 85306 85771 85672 85514 85633 85469
55494 85469 84721 84016 83683 83074 81860 80909 81015 81677 81973 81787 81428 80875 80115 79570 79570 79988 80687 81543 81895
55475 81895 81085 79869 79985 81808 83633 83900 82889 81614 80406 79447 79377 80288 81114 81042 80602 80445 80080 78871
55457 78871 77409 76739 76900 77221 77429 77535 77246 76470 75915 76334 77570 78983 80281 81359 81962 82175 82680
55440 82680 83824 84945 85145 84202 82381 80111 78227 77679 78420 79348 79770 80051 80447 80422 79741 79066 78727 77991
55422 77991 76436 75020 74811 75612 76768 78304 80242 81678 81765 81007 80555 80791 81420 82203 82752 82412 81319
55405 81319 80733 81330 82022 81583 80560 80270 80626 80412 79268 78013 77276 77062 77438 78496 79702 80314 80347 80294
55387 80294 80148 79599 78959 78949 79668 80588 81469 82553 83959 85440 86591 86864 85766 83587 81515 80430 80016
55370H0016n04p40p65q43q94n01K9l1l77K5R94J172K57l98N5P62P97M81L78L23
55350H0236J10N9J79l9n16m28L40P44J42q11j327j346r17L6Q99O49n03j079m84
55331G5944J98J45MM38Q63O77M67R67J740J956J616J159O40N0k75k68m58j119
55313H4744j758j893j605j027j78N12M65J6J52Q93J121L63m97o47k73L10J150
55296H1848J857J699R77R63J868K321J470J54o64j154j523j228k72K08l01o82
55280H7541o3O66L87m07o32m05m76p58p37n76o65p42m83k38k78j07N40R68O88
55261H4223L89O95R22K99n33n25%on25o25p1M45M82K28j41n48p18n18l28m49n36
55240H2160k86j37n89j305j587j341r32m74P5N42P47P53N62L8n41n48O3O20Q05
$$ plain form
55370 80016 79512 78772 78007 77164 76270 75769 75798 75767 75390 75415 76409 77581 77838 77440 77495 78257 79054 79535 79913 80236
55350 80236 80346 80405 80584 80545 80029 79601 79941 80685 80827 80016 78689 77343 76426 76462 77361 78010 77507 76428 75944
55331 75944 76142 76287 76291 76729 77592 78269 78736 79703 81443 83399 85015 86174 86814 86864 86589 86321 85863 84744
55313 84744 82986 81093 79488 78461 78283 78795 79260 79276 79428 80321 81442 81805 81308 80661 80388 80698 81848
55296 81848 83705 85404 86381 87344 89212 91533 93003 93157 92493 91339 89816 88588 88316 88524 88223 87541
55280 87541 87478 88144 88531 88124 87492 87087 86611 85853 85116 84540 83875 83133 82650 82412 82134 82027 82567 83535 84223
55261 84223 84612 85307 86229 86528 85995 85470 85470 85464 84939 84314 84243 84688 85170 85398 85257 84709 83991 83473 83145 82696 82160
55240 82160 81874 81737 81148 79843 78256 76915 75983 75509 75584 76126 76873 77626 78188 78226 77685 77137 77200 77820 78625
55221G8625J017J373J346Q66O58R61R62J74o84q82p60q31q43m68jL28P81J236
55203H3858R95J02k99K68Q20O87O57J289J604P67k42j86M23M15j2j3N7o66j764
55184H8760k081j604j150o99L54J628K032J455P76L77m2m06k91Q1P5j55J29R59
55166I0198J560J443Q62J97l43o23p45r39r68k83P32P48n44j607j156N7O85Q38
55148I0112J194J309N04m07k16N43M30m34o44P7O87P97R44R07k43k191l210k430
55130H7729q28L95J044J270R61L68J34L44M38K47J82K62l7p52j230j152q57n44
55112H7974l6N73Q82Q73Q84R13P06M11L90N37N45N56P57P35J73k54K15J063J209
55093I9106O78K96J30l83j026j011m54k22l77j32N73R01M83k41j059j948k238
$$ plain form
55221 78625 79642 81015 82361 83227 83885 84846 85808 85982 85298 84416 83656 82825 81982 81514 81513 81841 82622 83858
55203 83858 84853 84955 84656 84924 85744 86431 87088 88377 89981 90748 90506 90320 90743 91158 91146 91133 91190 90524 88760
55184 88760 86679 85075 83925 83226 83580 85208 87240 88695 89471 89848 89806 89400 89109 89190 89265 89110 89239 90198
55166 90198 91758 93201 94063 94260 93917 93294 92549 91610 90642 90359 91091 91839 91295 89688 88532 88589 89274 90112
55148 90112 91306 92615 93119 92712 92496 93039 93469 93035 92391 92468 93155 93952 94896 95803 95560 93369 90159 87729
55130 87729 86901 87296 88340 89610 90571 90939 91073 91417 91855 92102 92284 92546 92509 91757 90527 89375 88518 87974
55112 87974 87938 88511 89393 90266 91150 92063 92769 93180 93570 94107 94652 95208 95965 96700 96873 96619 96834 97897 99106
55093 99106 99784 100080 100210 99827 98801 97790 97336 97114 96737 96605 97178 98079 98562 98321 97262 95314 93076
55076I3076j307l2O8q03r05K54J161P45j40l37L7L77O54Q86P47L27K46N03L49
55057I5906l21o40l04n7j43K69J387K013J385M49K83M10q4p63n70L96J086R92
55039A01694M22l08r71j093m72K43K67k44n17k87O4K22J54j73p23j143j083p06
55021I5346m46l86k29J63N33N84L95M00Q90J517J518O24n38j175j174q56l17M25
55003I7274J035J204J107R35M39l77o98j1P67M45n22o15N25J760K269K257J851
54986A09645Q24l74p48l44k79q70j119n56n3j67r2Q15J794J927J553J361J114
54969A14431L66l91m26J9K07J63L89Q54J051Q39M46m4n84r01q54p33p15n14jL24
54949A13926P1l22j89M51J052J282J110O17J64L02J036J542J087o9j078j346p90
$$ plain form
55076 93076 91769 91737 91805 91002 90097 90351 91512 92257 92117 91780 91817 92194 92848 93734 94481 94808 95054 95557 95906
55057 95906 95585 94945 94641 94584 94441 94710 96097 98110 99495 99944 100227 100637 100553 99790 99220 99616 100702 101694
55039 101694 102116 101808 100837 99744 99272 99515 99782 99538 99021 98734 98798 99020 99174 99001 98278 97135 96052 95346
55021 95346 94900 94514 94285 94448 94981 95565 95960 96360 97250 98767 100285 100909 100371 99196 98022 97166 96849 97274
55003 97274 98309 99513 100620 101555 101994 101617 100919 100908 101675 102120 101598 100983 101508 103268 105537 107794 109645
54986 109645 110469 110095 109347 109003 108724 107854 106735 106179 106126 105959 105867 106682 108476 110403 111956 113317 114431
54969 114431 114797 114406 113980 113999 114206 114369 114758 115612 116663 117502 117948 117904 117320 116419 115565 114832 114117 113603 113602 113926
54949 113926 113997 113675 113486 113937 114989 116271 117381 117998 118162 118464 119500 121042 122129 122060 120982 119636 118846
54932A18846K58J067R39O7m40K17J687L087L991M470M710M981N536O214O528O379
54916A68537O248O441O608O258N273L729J755k91k032l558n183o627p185o783
54902A73190o144n751n431m976m464l786k762j830j623j804j367l05K39k32q39
54887A32115p90l36K07J032J896J972J433J822L821N925O485N938N755O165O299
54872A79739N889N406M966M321L585K902J716o24l747o531q206q559p634o017
54858A67206m834m645m738m270l564l434l789l861l370k681k063j630j586j881
54844A20860k038j872j850k133k029j095qM62N43O95O43J68n9M26P86J76o36m17
54826A12622M26M91l28q36o22n17r52j303j074n03J70Q99J267Q04l6k93J04L38
$$ plain form
54932 118846 119104 120171 121110 121177 120737 120954 122641 125728 129719 134189 138899 143880 149416 155630 162158 168537
54916 168537 174785 181226 187834 194092 199365 203094 204849 204558 202526 198968 193785 187158 179973 173190
54902 173190 167046 161295 155864 150888 146424 142638 139876 138046 136423 134619 133252 132947 133186 132954 132115
54887 132115 131325 130989 131196 132228 134124 136096 137529 139351 143172 149097 155582 161520 167275 173440 179739
54872 179739 185628 191034 196000 200321 203906 206808 208524 207900 204153 197622 189416 180857 173223 167206
54858 167206 162372 157727 152989 148719 145155 141721 137932 134071 130701 128020 125957 124327 122741 120860
54844 120860 118822 116950 115100 112967 110938 109843 109835 110297 110840 111535 112178 112346 112287 112713 113499 113675 113039 112622
54826 112622 113048 113539 113211 112375 111753 111236 110284 108981 107907 107404 107574 108473 109740 110544 110508 110215 110319 110657
54808A10657J33L5K36K85J06K07O42Q11N53M72Q46J122Q33K21l54q29j058p21
54790A14197Q0P60R98R45P39M12L02P92J568J898J688J532J657J681J433J199
54774A31881J077R05R09J545K624L452L985M881O250P361P806P998Q159P864O969
54759B03666O037N281M029J873n26k438m094n856p112p052o145n761o378p030
54745A68494o664n373m015l115k496j838j191q96j107j596j963j885j140K21J636
54730A37072K359K355K423L086L801L851L551L744M408M742M598M777N689O654
54716A93110O838O145M765K660J9k394l950m875n709o424o630o378o212o335o275
54701A58355n487m077k766k131k055j965j520r54o72p79j148j646k113k311k111
$$ plain form
54808 110657 110790 110825 111061 111346 111452 111659 112301 113112 113665 114137 114983 116105 116938 117159 116805 115976 114918 114197
54790 114197 114277 115037 116035 116980 117719 118131 118433 119225 120793 122691 124379 125911 127568 129249 130682 131881
54774 131881 132958 133863 134772 136317 138941 142393 146378 151259 157509 164870 172676 180674 188833 196697 203666
54759 203666 209703 214984 219013 220886 220360 217922 213828 207972 200860 193808 187663 181902 175524 168494
54745 168494 161830 156457 152442 149327 146831 144993 143802 142906 141799 140203 138240 136355 135215 135436 137072
54730 137072 139431 141786 144209 147295 151096 154947 158498 162242 166650 171392 175990 180767 186456 193110
54716 193110 199948 206093 210858 213518 213537 211143 207193 202318 196609 190185 183555 177177 170965 164630 158355
54701 158355 152868 148791 146025 143894 141839 139874 138354 137400 136728 135949 134801 133155 131042 128731 126620
54686A26620j607r29j47M58M92N3j93J41N84N64K11p3l84r69j437j195m08J78
54668A21959K88L13N00N97L26l17j144j760j667q87j59NM0M54P88L86k96k58L93
54649A19561O60L46K26N00M54q7k69K60O35J85m72m84l4K35K19R9k40p65q53j37
54629A20039P00P10q8q94j234j191q64l27M2k10r72j620j660j111l24L53P82J086
54611A13217J381J466J065L46j58k56k48k64mO47J256J452J434J518J586J370
54595A25808R36N37K10p2j55P4M02M98K75r8l51k15L18P19L82m99q95j50J163
54576A28887J923J738J145Q04Q08P56K82m39q01m96l6j43o93q51l29J40j09p22
54558A31864r60p32m52j74L66R77R95K65l74O2J528K954L369K820K067J647J471
$$ plain form
54686 126620 125013 124084 123937 124395 124887 124940 124747 124888 125472 126036 126247 126174 125790 124821 123384 122189 121781 121959
54668 121959 122247 122560 123060 123657 123983 123666 122522 120762 119095 118208 118049 118054 118094 118548 119336 119722 119426 119168 119561
54649 119561 120221 120567 120793 121293 121747 121660 121391 121651 122286 122471 121999 121515 121481 121716 121935 122034 121794 121029 120176 120039
54629 120039 120739 121449 121361 120467 119233 118042 117178 116851 116893 116683 115711 114091 112431 111320 110996 111349 112131 113217
54611 113217 114598 116064 117129 117475 117317 117061 116813 116549 116545 117192 118448 119900 121334 122852 124438 125808
54595 125808 126744 127281 127491 127419 127264 127338 127740 128238 128513 128415 128064 127849 128167 128886 129268 128769 127874 127724 128887
54576 128887 130810 132548 133693 134497 135305 136061 136343 135904 135103 134607 134571 134428 133735 132884 132555 132695 132586 131864
54558 131864 130904 130172 129720 129546 129912 130889 131884 132149 131775 131837 133365 136319 139688 142508 144575 146222 147693
54541A47693J261R35N15km01l26J90N98O00N82Q78J047N42k31l97O9K80k57j037
54522A52539j353j034k97N03R07O34J9l65n05q47j426j776j726j591j442r51j07
54505A41182O05R48J194J423J236M82l85r06j070q98l25L44N30K02J2L03P07R94
54487A46578J531K435K982K516J366L78n2k9K27M30L13N1J70O92J012R15J026
54470A62541J764K494K410J702J185J132J142Q56K74l79o67j51R25J537R71l45
54454A77391j510k204k531k263j096M58J251P85j39l66K27N56l19j824k333j247
54438A64836Pk11j405j642m38M90j83j481j702p63J37M08M39M90M33L52M65N01
54420A60733N1n76n82J74R87J222R18M47J05M3J47J4n32j019q33j2Q14J169J011
$$ plain form
54541 147693 148954 149889 150404 150402 150001 149675 149865 150463 151063 151645 152523 153570 154112 153881 153484 153553 153833 153576 152539
54522 152539 151186 150152 149855 150358 151265 151899 151918 151553 151048 150201 148775 146999 145273 143682 142240 141289 141182
54505 141182 141787 142735 143929 145352 146588 147070 146685 145779 144709 143811 143486 143830 144360 144562 144574 144877 145584 146578
54487 146578 148109 150544 153526 156042 157408 157786 157734 157705 157932 158362 158675 158726 158896 159588 160600 161515 162541
54470 162541 164305 166799 169209 170911 172096 173228 174370 175226 175500 175121 174454 174303 175228 176765 177736 177391
54454 177391 175881 173677 171146 168883 167787 168245 169496 170281 170142 169776 170003 170559 170240 168416 166083 164836
54438 164836 164843 164632 163227 161585 161147 161637 161454 159973 158271 157508 157645 158053 158492 158982 159415 159767 160232 160733
54420 160733 160784 160208 159626 159800 160787 162009 162927 163374 163479 163522 163669 163683 163151 162132 161299 161287 162101 163270 164281
54401A64281M46l47r19p81R6J161J737J491O82%j4M03M81j23r09j178q11j76L50
54382A65870O03O75Q24J068R12J0j049j396j211j454k152k164j019J99N44N86
54366A60846J240K154K394J899J227N00l02o21n3O54N42m8j24K33N5p34j169q49
54348A67844m65n47q13r93j261j555j401p64k83k97l45N9P07J115J085O41r9p52
54330A61876q28l02K71L77m0o41r36n77K06O22K44l98n74l81l32l20J08P11P46
54311A59832J85k20k66o55j705k579k291r76K79O10L0p02p88k06K21r3o58o25
54293A49393j32r8p36j182p72J04P05Q46P17M24N8j81k45k69k20R9N92Q41O97
54274A50641M44K99J82R6K33N56P39O50N16M58L13P4M5L78Q16J043J037R71J047
$$ plain form
54401 164281 164727 164380 163461 162680 162776 163937 165674 167165 167847 167847 167833 168236 168717 168594 167685 166507 165696 165520 165870
54382 165870 166473 167148 167972 169040 169952 169962 168913 167517 166306 164852 162700 160536 159517 159716 160260 160846
54366 160846 162086 164240 166634 168533 169760 170260 169958 169337 169284 169938 170480 170432 170308 170541 170596 169862 168693 167844
54348 167844 167379 166832 166019 165026 163765 162210 160809 160045 159762 159465 159120 159179 159886 161001 162086 162727 162628 161876
54330 161876 161048 160746 161017 161394 161354 160713 159777 159200 159406 160028 160272 159874 159300 158919 158587 158267 158375 159086 159832
54311 159832 160017 159797 159531 158876 157171 154592 152301 151325 151604 152214 152244 151542 150754 150548 150769 150676 150018 149393
54293 149393 149261 149163 148427 147245 146473 146577 147282 148128 148845 149269 149327 149146 148901 148632 148412 148511 149103 149944 150641
54274 150641 151085 151384 151566 151662 151895 152451 153190 153840 154356 154814 155127 155201 155246 155624 156440 157483 158520 159491 160538
54255A60538J375J719J601R62M57N42O45Mr35j042l23o1r26k068k507k291j788
54238A55902q80K81O80l15j698j927r56j35k58p65r48r13r69q69k75M66O46J96
54220A47263j87O4P06J053P87J74l74o29n07k2N87R10P46K96r7j85J60Q47J362
54201A52954J106J76n59m97mK32J79K42M51M71K14j00l98o53o22j71K20l6p13
54182A52492r61m70J11K9p58j650j964j425m97j15o64j386j235j88P93R85M29
54165A43526n36j577k147j720m73P21J178R65N97N51R83J587J733J162L68n0j51
54148A46717k91l75p5M51O64L83j63p09r36n05K89M58k80p01K37J609J791R44
54130A49508N64Q44M83p78j435p02J54o9o27k23Q96J563J522J447J689J999K123
$$ plain form
54255 160538 161913 163632 165233 166195 166652 167194 167839 167843 166908 165866 165543 165482 164556 162488 159981 157690 155902
54238 155902 155022 155303 155983 155668 153970 152043 151087 150952 150694 149929 148981 148068 147099 146230 145955 146421 147067 147263
54220 147263 147076 147140 147846 148899 149686 149860 149486 148857 148350 148328 148915 149825 150571 150867 150770 150585 150745 151592 152954
54201 152954 154060 154236 153677 153180 153176 153408 153587 153829 154280 154751 154965 154865 154467 153814 153192 153021 153241 153205 152492
54182 152492 151531 151061 151172 151201 150443 148793 146829 145404 144907 144792 144128 142742 141507 141319 142112 143097 143526
54165 143526 142990 141413 139266 137546 137073 137794 138972 139937 140534 141085 142068 143655 145388 146550 146918 146868 146717
54148 146717 146426 146051 145976 146427 147091 147474 147311 146602 145666 145161 145450 145908 145628 144927 145164 146773 148564 149508
54130 149508 150072 150916 151399 150621 149186 148484 148638 148569 147942 147719 148615 150178 151700 153147 154836 156835 158958
54113A58958J829Q25o49j631j480p33l44n29q21q40n12K2L42N9n10n60LM15K79
54094A54123J18K23M7o54j058n03M24Q91J043J343J463R38K61K46O70O27j78j253
54076A58771k109k368j659k52O49K50o27o81L9N29O14R73J564J461M48m74n08
54059A56620n4J82K14M38Q63J157J132R09P81R86J417J648J496J374J702K214
54043A73079K369K249K456L246M299N270O000O272N920N263M912N070N228M612
54029B36245K706k95l340n117n343n151n718o815p213o253m432k678j669j629
54015A83298k169k453k053j492j402j559j388j089j279j728j474l22O82O27j74
54000A66025q11r26p89o63m89p9N77J204J444J265R25M79l23j342j799j247l25
$$ plain form
54113 158958 160787 161612 160963 159332 157852 157119 156775 156246 155425 154585 154073 154095 154437 154496 153986 153426 153429 153844 154123
54094 154123 154241 154464 154511 153857 152799 152296 152720 153611 154654 155997 157460 158398 158659 158905 159575 160202 160024 158771
54076 158771 156662 154294 152635 152383 153032 153282 152655 151974 152013 152542 153156 154129 155693 157154 157602 157128 156620
54059 156620 156566 156748 156962 157400 158263 159420 160552 161461 162242 163228 164645 166293 167789 169163 170865 173079
54043 173079 175448 177697 180153 183399 187698 192968 198968 205240 211160 216423 221335 226405 231633 236245
54029 236245 238951 238656 235316 230199 224856 219705 213987 207172 199959 193706 189274 186596 184927 183298
54015 183298 181129 178676 176623 175131 173729 172170 170782 169693 168414 166686 165212 164890 165572 166199 166025
54000 166025 165214 164288 163499 162836 162347 162268 162845 164049 165493 166758 167683 168162 167839 166497 164698 163451 163126
53983A63126J14J95N73J114J047L01l23l94l68o43r31r18p68o82m96j30J47J63
53965A61127J81M23O86O97N66N79Q32J170J342J175Q27P62J182J606J454Q83N31
53948A76023N48N85O36J136K062K698K588K150K010K293K845L648M595N301N469
53933B14587N180M596L749K842K305K221K106J543P08l8p20j486k118k345k371
53918B30759k607k850k289o01J347K252J805R91P86R89P40pk85M18J276J260N54
53901B34538N3j61q74k361l848m564m555m182l469k375j190k60M66J314K509M054
53885B15095N669O877P480P970R004J0430J1340J1102R736P094K668l256q868
53872B92341j2148j2752j2015j1243j0594r556p936o153m862m402m468m335l587
$$ plain form
53983 163126 163240 163435 164008 165122 166169 166470 166147 165753 165385 164742 163811 162893 162125 161443 160947 160817 160964 161127
53965 161127 161308 161731 162417 163114 163680 164259 165091 166261 167603 168778 169605 170367 171549 173155 174609 175492 176023
53948 176023 176571 177156 177792 178928 180990 183688 186276 188426 190436 192729 195574 199222 203817 209118 214587
53933 214587 219767 224363 228112 230954 233259 235480 237586 239129 239837 239799 239079 237593 235475 233130 230759
53918 230759 228152 225302 223013 222412 223759 226011 227816 228807 229593 230582 231322 231315 231030 231448 232724 233984 234538
53901 234538 234591 234430 233556 231195 227347 222783 218228 214046 210577 208202 207012 206752 207218 208532 211041 215095
53885 215095 220764 227641 235121 243091 252095 262525 273865 284967 294703 301797 304465 301209 292341
53872 292341 280193 267441 255426 244183 233589 224033 216097 209944 205082 200680 196212 191877 188290
53859A88290k567j899j650j314n83J94N35M80M00L33o4q40j470j473j058p12m16
53842A76186K09J003J176L76o71j018o45k89m38q88j168r43j89O85J049P67M81
53825A75683P50J195J062M70K73O81Q52K13n23k44R99J954J691O21q7J39Q10J177
53807A87716J124J077J262J406J252Q78M31q2n09m44K54J184J879K172J901P87
53791B02288q70j938j613m94J77J55J85O22R55P89M38K74J50j57m29l15J50N91
53773B00958N93o0j228k363k909k784k297j605o54M19J171J218N55l95r65o68
53757A88986K33R12R51P97Q76P68p0j277j966j896j438o83N12J779K411K367K228
53740A95490K206J986J576J406J457J209N93K20M25Q75J263J636J861J645J230
$$ plain form
53859 188290 185723 183824 182174 180860 180277 180471 181006 181486 181886 182219 182155 181315 179845 178372 177314 176602 176186
53842 176186 176395 177398 178574 178950 178279 177261 176616 176327 175889 175001 173833 172890 172701 173386 174435 175202 175683
53825 175683 176433 177628 178690 179160 179433 180114 180966 181179 180656 180412 181411 183365 185056 185677 185590 185729 186539 187716
53807 187716 188840 189917 191179 192585 193837 194715 195146 195064 194555 194111 194365 195549 197428 199600 201501 202288
53791 202288 201418 199480 197867 197373 197550 197705 197890 198512 199467 200256 200694 200968 201118 200961 200532 200217 200367 200958
53773 200958 201551 201491 200263 197900 194991 192207 189910 188305 187651 188070 189241 190459 191014 190619 189654 188986
53757 188986 189219 190131 191082 191879 192755 193523 193453 192176 190210 188314 186876 186193 186705 188484 190895 193262 195490
53740 195490 197696 199682 201258 202664 204121 205330 205923 206143 206568 207443 208706 210342 212203 213848 215078
53725B15078J273J751J911J531J371J927K646K838K614K311J846J200Q72J160
53711B40329J533J346P85O48J400K827M189M595L766K607K381L145L785L776L799
53696B80911M228M192L046J780J783K809L319K560J281M83L17L05O9l39n51l79
53680C05814j87m67r70r04j98K18j84p07n80j66k37o71q08n70l55j79J63L68k1
53661B99359p71j210j189j056q92o16n77j183j980j982j029m5K26M7J3J93K81
53644B87589K25K90O43J013R02K12m02j50Q45J629J663J435J536J808J963K343
53628C03544L254M055L812K682J763J711K233K855L364L538L168K582K595L671
53614C44827N406O800O930N625L805K839L169L892M058L865L922M024L600K959
$$ plain form
53725 215078 216351 218102 220013 221544 222915 224842 227488 230326 232940 235251 237097 238297 239169 240329
53711 240329 241862 243208 243993 244641 246041 248868 253057 257652 261418 264025 266406 269551 273336 277112 280911
53696 280911 285139 289331 292377 294157 295940 298749 302068 304628 305909 306392 306709 307014 307083 306744 306193 305814
53680 305814 305627 305160 304190 303286 303088 303306 303122 302415 301835 301669 301432 300761 299953 299383 299028 298849 299012 299380 299359
53661 299359 298588 297378 296189 295133 294241 293625 293048 291865 289885 287903 286874 286829 287055 287102 287115 287308 287589
53644 287589 287814 288104 288747 289760 290662 290874 290472 290322 291167 292796 294459 295894 297430 299238 301201 303544
53628 303544 306798 310853 314665 317347 319110 320821 323054 325909 329273 332811 335979 338561 341156 344827
53614 344827 350233 357033 363963 369588 373393 376232 379401 383293 387351 391216 395138 399162 402762 405721
53600D05721K936L396L244K094R13O21Q86Q24K64j93q0L55M24k07r52q06L16J175
53582D20931O93n49j097o35k36o37j271j376j129j218j849k651l156l094k542
53567D00184k010j986k239k028j162l41k18n25n13R2Q59J184Q71L35K45Q43J633
53550C95224K018K051K163K362K271J941J927K440L003L186L217L607M554N828
53536D35792O935P334O941O512P066Q728J0511J1453J1533J1451J1876J3043J4645
53523E63820J5960J6473J6499J6861J7879J9136K0298K1567K3156K4793K6062
53512G82504K6864K7367K7803K8444K9320K9929K9743K9104K9004K9782L0605
53501A100469L0641L0074K9586K9299K8824K7972K6926K5894K5042K4508K4190
$$ plain form
53600 405721 408657 412053 415297 417391 418304 418925 419811 420635 420899 420706 420626 420981 421405 421198 420246 419440 419756 420931
53582 420931 421624 421075 419978 419343 419107 418470 417199 415823 414694 413476 411627 408976 405820 402726 400184
53567 400184 398174 396188 393949 391921 390759 390418 390200 389675 389162 389254 390113 391297 392168 392503 392748 393591 395224
53550 395224 397242 399293 401456 403818 406089 408030 409957 412397 415400 418586 421803 425410 429964 435792
53536 435792 442727 450061 457002 463514 470580 479308 489819 501272 512805 524256 536132 549175 563820
53523 563820 579780 596253 612752 629613 647492 666628 686926 708493 731649 756442 782504
53512 782504 809368 836735 864538 892982 922302 952231 981974 1011078 1040082 1069864 1100469
53501 1100469 1131110 1161184 1190770 1220069 1248893 1276865 1303791 1329685 1354727 1379235 1403425
53490A403425K3723K2947K2163K1661K1310K0906K0546K0317K0011J9524J9214
53479A635747J9266J9044J7713J5409J3200J1743J0503Q495N427J908j301l964
53467A753190o426r138j2219j5383j8198k0225k1129k0921k0217j9960k0657k2032
53455A546685k3524k4838k5935k6693k6967k6840k6589k6384k6218k5981k5496
53444A261220k4476k2735k0469j8208j6369j4886j3320j1439r485p789o186m142
53432A091716j570Q68K543L648M848O396Q068R781J1695J3742J5583J7136J8685
53419A203139K0376K2021K3476K4819K6089K7348K8962L1307L4018L6187L7523
53408A515265L8729M0432M2341M3977M5656M8051N1119N4108N6569N8813O1322
$$ plain form
53490 1403425 1427148 1450095 1472258 1493919 1515229 1536135 1556681 1576998 1597009 1616533 1635747
53479 1635747 1655013 1674057 1691770 1707179 1720379 1732122 1742625 1751120 1756547 1758455 1757154 1753190
53467 1753190 1746764 1737626 1725407 1710024 1691826 1671601 1650472 1629551 1609334 1589374 1568717 1546685
53455 1546685 1523161 1498323 1472388 1445695 1418728 1391888 1365299 1338915 1312697 1286716 1261220
53444 1261220 1236744 1214009 1193540 1175332 1158963 1144077 1130757 1119318 1109833 1102044 1095858 1091716
53432 1091716 1090146 1091014 1093557 1097205 1102053 1108449 1116517 1126298 1137993 1151735 1167318 1184454 1203139
53419 1203139 1223515 1245536 1269012 1293831 1319920 1347268 1376230 1407537 1441555 1477742 1515265
53408 1515265 1553994 1594426 1636767 1680744 1726400 1774451 1825570 1879678 1936247 1995060 2056382
53397B056382O4107O6624O8194O8612O8452O8590O9197O9557O9018O7695O5941
53386B802369O3681O0864N8116N6072N4239N1463M7585M3798M0965L8346L4557
53375C352055K9348K3800J8884J4369R281K999m301j2148k0445k9469l9174m8663
53363C296536n6614o2270o5885o8173o9622p0398p0611p0336o9506o8149o6660
53352B558312o5503o4567o3185o1050n8820n7543n7575n8313n8847n8576n7241
53341A897092n4846n1694m8261m4853m1508l8254l5223l2386k9450k6222k2911
53330A471484j9927j7528j5817j4867j4648j4913j5332j5611j5468j4685j3362
53319A299326j1894j0591r429q285p090n683l824j614M08J857K907L966N265O907
$$ plain form
53397 2056382 2120489 2187113 2255307 2323919 2392371 2460961 2530158 2599715 2668733 2736428 2802369
53386 2802369 2866050 2926914 2985030 3041102 3095341 3146804 3194389 3238187 3279152 3317498 3352055
53375 3352055 3381403 3405203 3424087 3438456 3447737 3450736 3446435 3434287 3413842 3384373 3345199 3296536
53363 3296536 3239922 3177652 3111767 3043594 2973972 2903574 2832963 2762627 2693121 2624972 2558312
53352 2558312 2492809 2428242 2365057 2304007 2245187 2187644 2130069 2071756 2012909 1954333 1897092
53341 1897092 1842246 1790552 1742291 1697438 1655930 1617676 1582453 1550067 1520617 1494395 1471484
53330 1471484 1451557 1434029 1418212 1403345 1388697 1373784 1358452 1342841 1327373 1312688 1299326
53319 1299326 1287432 1276841 1267412 1259127 1252037 1246354 1242530 1240916 1241324 1243181 1246088 1250054 1255319 1262226
53305A262226Q880J0754J1910J2523J3759J6409J9766K2507K4292K5711K7104
53294A455841K8322K9519L1086L2756L3652L3414L2584L1695L0711K9496K8103
53283A797179K6338K3830K0847J8317J6618J4923J2267Q729N084J759j353m405
53271A940133p493j0863j4723j8872k2749k5945k8486l0766l3140l5485l7260
53260A674351l8156l8577l9055l9410l9102l8261l7640l7434l6906l5487l3567
53249A260756l1921l0962l0849l1675l3005l3859l3676l2896l2122l1176k9631
53238I08984k7805k6452k5592k4335k1967j8779j5751j3670j2609j2046j1443
53227F98535j0767j0382j0470j0778j1003j1125j1352j1954j3092j4484j5359
$$ plain form
53305 1262226 1271106 1281860 1293770 1306293 1320052 1336461 1356227 1378734 1403026 1428737 1455841
53294 1455841 1484163 1513682 1544768 1577524 1611176 1644590 1677174 1708869 1739580 1769076 1797179
53283 1797179 1823517 1847347 1868194 1886511 1903129 1918052 1930319 1939048 1944132 1945891 1944538 1940133
53271 1940133 1932640 1921777 1907054 1888182 1865433 1839488 1811002 1780236 1747096 1711611 1674351
53260 1674351 1636195 1597618 1558563 1519153 1480051 1441790 1404150 1366716 1329810 1294323 1260756
53249 1260756 1228835 1197873 1167024 1135349 1102344 1068485 1034809 1001913 969791 938615 908984
53238 908984 881179 854727 829135 804800 782833 764054 748303 734633 722024 709978 698535
53227 698535 687768 677386 666916 656138 645135 634010 622658 610704 597612 583128 567769
53216E67769j5159j4245j3397j2716j1752j0589r892r747r469q889q787r458r878
53203D23791r177q131q106r094r886r827r320q756p953o815n677m833m286m024
53189C17906m069m156l957l592l419l304k667j392k55j31j061k252k817k487j742
53174B80605j279j359j679j858j784j484j016n96m54m24j72N7m05j522k232j863
53158B62535j126j063j580j840j629j349j015l05M70M94k84r05p26k46k85q78
53142B50268j376j298p30j00K34K87L60N69N87J38m52n20J26R89J413J223P92
53125B52510P22J242J845J815J152O20O35P12L41j67k58%J97K82L34J10n24j111
53107B60457j278j382j774j943j395q29j207k055k036j129p70j640k680k691j765
$$ plain form
53216 567769 552610 538365 524968 512252 500500 489911 480019 470272 460803 451914 443127 433669 423791
53203 423791 414614 406483 398377 389283 379397 369570 360250 351494 343541 336726 331049 326216 321930 317906
53189 317906 313837 309681 305724 302132 298713 295409 292742 291350 291095 290964 289903 287651 284834 282347 280605
53174 280605 279326 277967 276288 274430 272646 271162 270146 269550 269096 268672 268500 268557 268152 266630 264398 262535
53158 262535 261409 260346 258766 256926 255297 253948 252933 252628 253098 253592 253308 252403 251677 251431 251146 250268
53142 250268 248892 247594 246864 246764 246998 247285 247645 248214 248801 248939 248487 247967 248093 249082 250495 251718 252510
53125 252510 253232 254474 256319 258134 259286 259906 260541 261253 261594 261427 261169 261169 261366 261648 261982 262092 261568 260457
53107 260457 259179 257797 256023 254080 252685 251856 250649 248594 246558 245429 244659 243019 240339 237648 235883
53092B35883o26L62R80R23L91J53M99Q49P76O81Q63Q40K26m39m82j28Oj05j17
53073B41535o9j67k22LJ77j05n27m36R5L17j33p60q63k45P15J426J512J107O61
53054B44021L40o0n13n38JL76j84j363k092j834j046m03j01K1M5j41o11j150j213
53035B33555m67N60Q11l7j024j056k78K51m9p53j164r94k87O91J434J548J231
53018B33972J024J018P79K01j82K8L64O4q62j565j336l30O96J122Q47K48j74j32
53000B35782K63O37P19N62L39Q1k36l68R3J093J922J884J138M79L59M94M74L81
52982B46096N35R36J278J331J078N39j68o70m84M85J679K239J777Q16M21J142
52966B59030K362K901K313J333Q14O28m4j402k534k470j349k57M3k14m39n39q19
$$ plain form
53092 235883 235257 235619 236599 237522 237913 238066 238565 239414 240190 240871 241734 242574 242800 242361 241879 241751 241757 241652 241535
53073 241535 241466 241299 241077 241080 241257 241152 240625 240189 240284 240601 240468 239708 238845 238600 239315 240741 242253 243360 244021
53054 244021 244361 244301 243788 243250 243251 243627 243443 242080 239988 238154 237108 236705 236604 236625 236670 236529 235918 234768 233555
53035 233555 233088 233648 234459 234422 233398 232342 232064 232315 232266 231513 230349 229355 229068 229759 231193 232741 233972
53018 233972 234996 236014 236793 236994 236812 236840 237204 237268 236406 234841 233505 233175 233871 234993 235840 236088 235914 235782
53000 235782 236045 236682 237401 237963 238302 238383 238147 237779 237872 238965 240887 242771 243909 244388 244747 245241 245715 246096
52982 246096 246631 247567 248845 250176 251254 251793 251625 250955 250471 250956 252635 254874 256651 257467 257888 259030
52966 259030 261392 264293 266606 267939 268753 269381 269337 267935 265401 262931 261582 261325 261368 261154 260715 260176 259357
52949B59357j261j439j212j048j396k016k268j841r71q0N26P57P86Q89R66N16
52933B50265o11j651j643o32L41M39k34j067j594j602j152o72o88j164j547j506
52917B35282j302j188r97n62j19J05K63M77M13k31j033j228o54J04M82L71p8o42
52899B29463r67p90l17q8k90n25l69J63P81J209J198N69l84r02n48J62M11J66
52881B28942R2M13N17K5m34o4Q62J274O99k37o46k18Q19J965K597K401J802J496
52863B42305J497J236P13O54J273J718J353O86L42j21j364k896l652l551l303
52848B36890k894j707n4O96l4j202j679j610j652j820j816j795j991k030j420
52833B15882l52N24R31J026Q93N49K14R9M1l01r14j451j616j336o92Q9P28J185
$$ plain form
52949 259357 258096 256657 255445 254397 253001 250985 248717 246876 245905 245825 246351 247108 247894 248783 249749 250265
52933 250265 249654 248003 246360 245728 246069 246508 246274 245207 243613 242011 240859 240187 239499 238335 236788 235282
52917 235282 233980 232792 231795 231233 231114 231219 231482 231959 232372 232141 231108 229880 229226 229330 229812 230183 230105 229463
52899 229463 228496 227706 227389 227301 227011 226486 226117 226280 227061 228270 229468 230037 229653 228751 228203 228365 228776 228942
52881 228942 229034 229447 229964 229989 229555 229491 230353 231627 232326 232089 231443 231225 232044 234009 236606 239007 240809 242305
52863 242305 243802 245038 245751 246405 247678 249396 250749 251435 251777 251656 250292 247396 243744 240193 236890
52848 236890 233996 232289 232235 232931 232897 231695 230016 228406 226754 224934 223118 221323 219332 217302 215882
52833 215882 215530 216054 216985 218011 218904 219453 219667 219766 219807 219506 218592 217141 215525 214189 213497 213586 214314 215499
52815B15499J611J922J804J295R90J281J798J988J861J696J354M80p66j814k459
52800B28540k982l451l424k630j545r63j115j490j441q32o5L72K87j48m98k88
52784B08327N65J436J501P39J40N49J618K317K162J410L64p36j300p92L19Q30
52768B19449K92m75o35l77l18n48p68q70q73p20n57p11j111j170o81k34k83l43
52750B09067K20J137J657J676J689J857J835J470J036P74O96Q24J175J558J727
52735B28398J798K149K876L533L456K376Q79M9L04O89L8j246j554m74L28n61k249
52718B40789k927k454k105k186j660k21P92K17j287k171j881j154q38j081j458
52703B20375j443p84L24J413K094K153J558O70K38O98J502J671J042M33N31J098
$$ plain form
52815 215499 217110 219032 220836 222131 223121 224402 226200 228188 230049 231745 233099 233579 232813 230999 228540
52800 228540 225558 222107 218683 216053 214508 213545 212430 210940 209499 208667 208602 208974 209261 209113 208615 208327
52784 208327 208892 210328 211829 212568 212708 213257 214875 217192 219354 220764 221128 220392 219092 218300 218619 219449
52768 219449 219741 219266 218631 218254 217936 217388 216620 215750 214877 214157 213600 212889 211778 210608 209927 209693 209410 209067
52750 209067 209287 210424 212081 213757 215446 217303 219138 220608 221644 222418 223114 223938 225113 226671 228398
52735 228398 230196 232345 235221 238754 242210 244586 245465 245514 245818 246507 246545 245299 243745 243271 243599 243038 240789
52718 240789 237862 235408 233303 231117 229457 229236 230028 230245 228958 226787 224906 223752 222914 221833 220375
52703 220375 218932 218148 218472 219885 221979 224132 225690 226360 226598 227296 228798 230469 231511 231944 232475 233573
52687B33573J513J608J574J425R55J62o15j034j067r15o89l65n3j28p14j242r61
52670B33027L2Q14Q62O35O45O00O9n25m10L77J071J242J146J066J052J227J768
52653B44698K402K489J679J98j443k676l019k527j931j790j680q13O59J734J816
52638B39796J225M82j79n44m70k63l44m40O4R06J073L79mP88J962K162J284L86
52620B48263R3%m66j181j591j432j044j047j615k108j654j85J367K087J937J493
52604B42917J182J055J004Q56M40j52n16l81K1K98M34O74R98J046O85K60J44J93
52586B51158j9m28l39O77J941K230J196k00q51o45j99L1m2m09r34j216r84m64
52568B50503l5K21L01j9o95j065o34M8L6p01j365j526j384r85j56P46J030Q14
$$ plain form
52687 233573 235086 236694 238268 239693 240648 240810 240195 239161 238094 237179 236490 236125 236072 235944 235230 233988 233027
52670 233027 233059 233873 234735 235370 236015 236615 236684 236159 235749 236126 237197 238439 239585 240651 241703 242930 244698
52653 244698 247100 249589 251268 251466 250023 247347 244328 241801 239870 238080 236400 235587 236246 237980 239796
52638 239796 241021 241503 241324 240780 240310 240047 239703 239263 239327 240233 241306 241685 241681 242469 244431 246593 247877 248263
52620 248263 248356 248356 247890 246709 245118 243686 242642 241595 239980 237872 236218 236033 237400 239487 241424 242917
52604 242917 244099 245154 246158 247014 247454 247302 246786 246405 246426 246724 247158 247832 248830 249876 250561 250821 250965 251158
52586 251158 251139 250711 250372 251049 252990 255220 256416 256216 255365 254720 254521 254552 254510 254101 253167 251951 250967 250503
52568 250503 250468 250689 250990 250971 250276 249211 248577 248625 248661 247960 246595 245069 243685 242700 242544 243290 244320 245134
52550B45134R84J756K167J481K51n05n39k51O6K79J96j86n17n21k80J39Q05J452
52532B51911J449O83j52n01o95j210j771j712r19J18Q99J110O08k84q19o17j41
52515B47957j3j71j01L93J174K165L212L787L398K224J006L08J71K74J88l65j185
52498B64422j727j727j452j259j181j172j310j504j470j242j216j424j311n89
52484B45838K78Q89J469K093K119J208K76M02J224J469Q32K28L16P68J143J478
52468B62030J810J953J979K189K374J896P82n6l4L13K30k43o34r19j351j789j808
52451B68722j375r14p53q50j017j025o63l5K48l57j547k300j972r48p1L13M56
52434B55912N96P13Q21J060J313J148M68j74k84j51k81l34N20K117L145K848K131
$$ plain form
52550 245134 246118 247874 250041 251522 251773 251268 250729 250478 250544 250823 251019 250833 250316 249795 249515 249654 250459 251911
52532 251911 253360 254043 253891 253390 252695 251485 249714 248002 247083 247201 248100 249210 249818 249534 248715 248098 247957
52515 247957 247944 247773 247672 248065 249239 251404 254616 258403 261801 264025 265031 265339 265510 265784 265972 265607 264422
52498 264422 262695 260968 259516 258257 257076 255904 254594 253090 251620 250378 249162 247738 246427 245838
52484 245838 246116 247005 248474 250567 252686 253894 254170 254572 255796 257265 258097 258325 258641 259409 260552 262030
52468 262030 263840 265793 267772 269961 272335 274231 275013 274957 274923 275236 275466 275223 274589 273670 272319 270530 268722
52451 268722 267347 266433 265680 264830 263813 262788 262125 262090 262338 261981 260434 258134 256162 255214 255143 255456 255912
52434 255912 256508 257221 258042 259102 260415 261563 262031 261857 261573 261422 261141 260807 261327 263444 266589 269437 271568
52417B71568K303L349M299M886N776P172Q206Q106P267O602O260N518L767J198
52403C46277j501l749n334o245o523o305n853n364m772l897k814j840j142n47
52389B90391P6N61P78R55J388J976K364K427K303K104J913K032K769L878M542
52374C20457M185L180K597L239M880O401O727N773M477L794L710L401K362J134
52360C76317P31J478K658L427L759M211M893N255N075N025N736O771P256P301
52346D39893P926R539J1361J2560J3212J3779J4443J5339J6817J8796K0453K1130
52334F15248K1137K1179K1452K1878K2674K3865K4711K4470K3569K3059K3088
52323H66330K2724K1383J9554J7877J6233J4120J1437Q615O265M789M035L266
$$ plain form
52417 271568 273871 277220 281519 286405 292181 299353 307559 315665 322932 329534 335794 341312 345079 346277
52403 346277 344776 341027 335693 329448 322925 316620 310767 305403 300631 296734 293920 292080 290938 290391
52389 290391 290467 291028 291806 292761 294149 296125 298489 300916 303219 305323 307236 309268 312037 315915 320457
52374 320457 324642 327822 330419 333658 338538 344939 351666 357439 361916 365710 369420 372821 375183 376317
52360 376317 377048 378526 381184 384611 388370 392581 397474 402729 407804 412829 418565 425336 432592 439893
52346 439893 447819 457358 468719 481279 494491 508270 522713 538052 554869 573665 594118 615248
52334 615248 636385 657564 679016 700894 723568 747433 772144 796614 820183 843242 866330
52323 866330 889054 910437 929991 947868 964101 978221 989658 998273 1004538 1009327 1013362 1016628
52311A016628J842o7j738k825l572m188m609m943n555o495p267p403o935o164
52297I56709n304m507l827l018j720nJ599K813L948N335O765P855Q719R901J1749
52282I97012J4026J6105J7393J7704J7314J6650J5865J4816J3495J2277J1594
52271A164251J1375J0905R309O396K999K96j379k766m580o563p987q851r878j1407
52257A152120j2901j3722j3884j3802j3697j3501j3083j2312j1087r607q466q247
52245A007811q924r794j0019r312q065o829n706m402k823j313k05N42J037J197
52231I43195J075J148J848K940L765L965L726L460L575M265N228N804N787N780
52217I95561O308P023P296P271P522P908P676O615N320M244L339K661K553K937
$$ plain form
52311 1016628 1018470 1018403 1016665 1013840 1010268 1006080 1001471 996528 990973 984478 977211 969808 962873 956709
52297 956709 951405 946898 943071 940053 938333 938328 939927 942740 946688 952023 958788 966643 975362 985263 997012
52282 997012 1011038 1027143 1044536 1062240 1079554 1096204 1112069 1126885 1140380 1152657 1164251
52271 1164251 1175626 1186531 1195840 1202236 1205235 1205531 1204152 1201386 1196806 1190243 1182256 1173405 1163527 1152120
52257 1152120 1139219 1125497 1111613 1097811 1084114 1070613 1057530 1045218 1034131 1024524 1016058 1007811
52245 1007811 998887 989093 979074 969762 961697 954868 949162 944760 941937 940624 940419 940961 941998 943195
52231 943195 944270 945418 947266 950206 953971 957936 961662 965122 968697 972962 978190 983994 989781 995561
52217 995561 1001869 1008892 1016188 1023459 1030981 1038889 1046565 1053180 1058500 1062744 1066083 1068744 1071297 1074234
52203A074234L195L033K797K790K885L023L341L607L245K291J577J556J688J408
52189A110670R85P92M78m36j615k410k864l470m203m570m521m584n045n505n390
52174A068312m547l331k297j781j556j144m88J2K69Q50K109L493M222M301M285
52159A072709M389M459M632N265O246O954P006O635O303O311O706P268P685Q092
52145A160660R129J1063J3095J4197J4456J4863J5865J6861J7227J7064J6726
52134A321206J6402J6458J7459J9288K0798K0993K0217J9568J9462J9375J8902
52123A530128J8305J7876J7348J6260J4551J2507J0307P887N176K229q18l754
52111A648002o293q256r786j1257j2837j4272j5143j5279j4805j3847j2393j0440
$$ plain form
52203 1074234 1077429 1080462 1083259 1086049 1088934 1091957 1095298 1098905 1102150 1104441 1106018 1107574 1109262 1110670
52189 1110670 1111655 1112447 1112925 1112489 1110874 1108464 1105600 1102130 1097927 1093357 1088836 1084252 1079207 1073702 1068312
52174 1068312 1063765 1060434 1058137 1056356 1054800 1053656 1053168 1053180 1053449 1054299 1056408 1059901 1064123 1068424 1072709
52159 1072709 1077098 1081557 1086189 1091454 1097700 1104654 1111660 1118295 1124598 1130909 1137615 1144883 1152568 1160660
52145 1160660 1169789 1180852 1193947 1208144 1222600 1237463 1253328 1270189 1287416 1304480 1321206
52134 1321206 1337608 1354066 1371525 1390813 1411611 1432604 1452821 1472389 1491851 1511226 1530128
52123 1530128 1548433 1566309 1583657 1599917 1614468 1626975 1637282 1645169 1650345 1652574 1651756 1648002
52111 1648002 1641709 1633453 1623667 1612410 1599573 1585301 1570158 1554879 1540074 1526227 1513834 1503394
52099A503394q169n894l935k521j635r11J59J716L337M437M860N003N457O617
52085A511915Q527J0877J3158J4977J6295J7287J8027J8394J8335J7996J7493
52074A683281J6640J5136J3027J0816Q922P189N088K425l94k932n333q129j1447
52061A734289j4664j7001j8350j9389k0795k2509k3864k4456k4628k4984k5594
52050A498055k6047k6165k6252k6494k6515k5770k4210k2282k0463j8934j7544
52039A237379j5890j3713j1303r270p755o245m419k669j464o71j01j66j265k802
52025A159646l740l993m441n552o912q087r099r789r733r150r077j0075j1475
52012A058523j2438j3100j4048j5242j6250j7082j7982j8673j8614j7923j7358
$$ plain form
52099 1503394 1495225 1489331 1485396 1482875 1481240 1480329 1480488 1482204 1485541 1489978 1494838 1499841 1505298 1511915
52085 1511915 1520442 1531319 1544477 1559454 1575749 1593036 1611063 1629457 1647792 1665788 1683281
52074 1683281 1699921 1715057 1728084 1738900 1747822 1755011 1760099 1762524 1762130 1759198 1753865 1745736 1734289
52061 1734289 1719625 1702624 1684274 1664885 1644090 1621581 1597717 1573261 1548633 1523649 1498055
52050 1498055 1472008 1445843 1419591 1393097 1366582 1340812 1316602 1294320 1273857 1254923 1237379
52039 1237379 1221489 1207776 1196473 1187203 1179448 1173203 1168784 1166115 1164651 1163980 1163879 1163713 1162448 1159646
52025 1159646 1155906 1151913 1147472 1141920 1135008 1126921 1117822 1108033 1098300 1089150 1080073 1069998 1058523
52012 1058523 1046085 1032985 1018937 1003695 987445 970363 952381 933708 915094 897171 879813
52001H79813j7339j7559j7604j7443j7178j6642j5553j3851j1877j0185r142q635
51989G06805q269p867p526p237o835o428o454p035p747q289q859r569r955r630
51975E95105q941q400p872o956n878n150m552l310j321N74J754K485L188L647
51961E54373L461K864K537K730K886K257O85j220k668l458m013m665n096m717
51947E45956l365j403P42K767M401N514O357P357Q652J0005J1058J1426J0711
51934F20178Q836O363M079K216L65j880m530p365j0054j2123j3254j3782j4381
51921E64668j5085j5082j3760j1656r912r019q503p791o938o332n920n103l440
51908D46127j246P43K182L337M492N530O275O964Q005R333J0389J0656J0027Q738
$$ plain form
52001 879813 862474 844915 827311 809868 792690 776048 760495 746644 734767 724582 715440 706805
51989 706805 698536 690669 683143 675906 669071 662643 656189 649154 641407 633118 624259 614690 604735 595105
51975 595105 586164 577764 569892 562936 557058 551908 547356 544046 542725 543299 545053 547538 550726 554373
51961 554373 557834 560698 563235 565965 568851 571108 571793 570573 567905 564447 560434 555769 550673 545956
51947 545956 542591 541188 541930 544697 549098 554612 560969 568326 576978 586983 598041 609467 620178
51934 620178 629014 635377 639456 641672 642037 640157 635627 628262 618208 606085 592831 579049 564668
51921 564668 549583 534501 520741 509085 499173 490154 481651 473860 466922 460590 454670 449567 446127
51908 446127 444881 445624 447806 451143 455635 461165 467440 474404 482409 491742 502131 512787 522814 531552
51894E31552P152N677M654M319M848O133P494Q008P465O584N849M514J485k950
51880F02784p005r029q764o936m414k005m24J02o5m72r98j667k414l285m483n962
51864E44963p281q136q757r483j0126j0144r254p694n910m232k761j439k79M53
51850D59920M59j35q01j196j515k133l080m044m666m708m154l268k347j428m49
51835D26455L00L63q1j83M57J157J146O87N84Q52P12j92j306k070k562l005l191
51818D20123k816k009j177n48j10K40O76J252J635J374O60L29P09R77K67j018
51802D20564j775j841k078k800l132k402j316j053j753k604l049l113k832k117
51788C88699j208n87l48k02q3j67k85K9O25O34l26j378j283R0J729K651K772K674
$$ plain form
51894 531552 538704 544381 549035 553354 558202 564335 571829 579837 587302 593886 599735 604249 605734 602784
51880 602784 595779 586750 577986 571050 566636 564631 564207 564309 564244 563772 562774 561107 558693 555408 550925 544963
51864 544963 537682 529546 520789 511306 501180 491036 481782 474088 468178 463946 461185 459746 459467 459920
51850 459920 460379 460244 459443 458247 456732 454599 451519 447475 442809 438101 433947 430679 428332 426904 426455
51835 426455 426755 427118 427037 426854 427311 428468 429614 430301 430885 431737 432449 432257 430951 428881 426319 423314 420123
51818 420123 417307 415298 414121 413573 413463 413703 414379 415631 417266 418640 419300 419629 420338 421315 421582 420564
51802 420564 418789 416948 414870 412070 408938 406536 405220 404167 402414 399810 396761 393648 390816 388699
51788 388699 387491 386904 386556 386354 386271 386104 385819 385848 386473 387107 386781 385403 384120 384210 385939 388590 391362 394036
51770C94036K891L496M216M918N765O738P255O786N750N077M818L899J661j200
51756D56106l653n611p456q927r378q863q043p186o008m450k826j320NQ42J071
51741C84303J467L007N412P294P964Q124Q463Q609Q053P212O792O590N860M519
51727D73669L260K634K544K460J675m12l569o515p984p931p226o327n030l485
51713D37763k562k862l877m627m657m105l123j819n12N19J492K864M437N208M423
51698D28562K460M59q03j274j126l89P64J806K189J681K91j799m029n544n884
51683D17364n426m745l907k765j738j467j677j182O90L216N196O259O770O940
51669D23528O665O104N738N756N811N491M664L387J732j21j869l192l688k915
$$ plain form
51770 394036 396927 400423 404639 409557 415322 422060 429315 436101 441851 446928 451746 455645 457306 456106
51756 456106 452453 446842 439386 430459 421081 412218 404175 396989 390981 386531 383705 382385 382390 383232 384303
51741 384303 385770 388777 394189 401483 409447 417571 426034 434643 442696 449908 456700 463290 469150 473669
51727 473669 476929 479563 482107 484567 486242 485830 482261 475746 467762 459831 452605 446278 441248 437763
51713 437763 435201 432339 428462 423835 419178 415073 411950 410131 409619 410138 411630 414494 418931 424139 428562
51698 428562 431022 431481 430678 429404 428278 427889 428653 430459 432648 434329 434620 432821 428792 423248 417364
51683 417364 411938 407193 403286 400521 398783 397316 395639 394457 395147 398363 403559 409818 416588 423528
51669 423528 430193 436297 442035 447791 453602 459093 463757 467144 468876 468755 466886 463694 460006 457091
51655D57091r26J183J832M76j864l816n092o241p359p780p143o076n532n795o393
51640C96565o712o390n452m308l464l001k586k110j904k072k085j491o03P7O88
51625C55152J530K157J907J149R33J359J393N37m37q62j124j607j743j040j50
51610C59154Q4k0K38M88m2p87k61J798L989N226N910O834P897Q508Q390P399N309
51593D20114K371l65j908k305k274k172j657l10J673L401L987L504L088L787N489
51578D36423P389R144J0911J2563J3761J4694J5767J6562J6282J5364J5404J6911
51566F01175J8400J8471J7788J7973J9517K1873K4861K8589L2322L4759L5476
51555H71204L4972L3234K9264K2405J3386L730n289j3028j9515k5329l0914l5759
$$ plain form
51655 457091 456165 457348 459180 459656 457792 453976 448884 442643 435284 427504 420361 414285 408753 402958 396565
51640 396565 389853 383463 378011 373703 370239 367238 364652 362542 360638 358566 356481 354990 354387 354464 355152
51625 355152 356682 358839 360746 361895 362828 364187 365580 366117 365680 364818 363694 362087 360344 359304 359154
51610 359154 359238 359218 359456 359944 359902 359115 358854 360652 364641 369867 375777 382611 390508 399016 407406 414805 420114
51593 420114 422485 422120 420212 417907 415633 413461 411804 411494 413167 416568 420555 424059 427147 430934 436423
51578 436423 443812 452956 463867 476430 490191 504885 520652 537214 553496 568860 584264 601175
51566 601175 619575 638046 655834 673807 693324 715197 740058 768647 800969 835728 871204
51555 871204 906176 939410 968674 991079 1004465 1008195 1002906 989878 970363 945034 914120 878361
51543H78361l8786l9697l9370l8632l7301l4896l1715k8587k5853k3242k0613
51532E19669j8143j5796j3312j0871r182q481p947o673m947l851l748l901l702
51519D09115l452l539l574l018k157j701j785k026k339k837l093k469j181j89
51505C75755P4L2n1l89p34k35J180K268K112J474J616K437K844K488K012J848
51489C94731J765J663J852K372K741K564J876Q30m85j846l040m199n545o802p348
51474C81129p037o360n723n058m236l441k910k674k667k799k800k361j489m60
51460C31114O28J865L062L697L515K871K248J716J148P14Q43J634K605L255L739
51445C64654M766O664Q796J0240J0832J1084J0998R728O744K874l22j929k023
$$ plain form
51543 878361 839575 799878 760508 721876 684575 649679 617964 589377 563524 540282 519669
51532 519669 501526 485730 472418 461547 452365 443884 435937 429264 424317 420466 416718 412817 409115
51519 409115 405663 402124 398550 395532 393375 391674 389889 387863 385524 382687 379594 377125 375944 375755
51505 375755 375829 375861 375810 375421 374687 374452 375632 377900 380012 381486 383102 385539 388383 390871 392883 394731
51489 394731 396496 398159 400011 402383 405124 407688 409564 410394 409909 408063 405023 400824 395279 388477 381129
51474 381129 374092 367732 362009 356951 352715 349274 346364 343690 341023 338224 335424 333063 331574 331114
51460 331114 331742 333607 336669 340366 343881 346752 349000 350716 351864 352578 353421 355055 357660 360915 364654
51445 364654 369420 376084 384880 395120 405952 417036 428034 437762 444506 447380 447058 445129 443106
51432D43106j162q1L09n99k573m826o727p906p968o823n175m028l588l230k553
51417C86176j967k011k602l161l150k418j286m23k47m44l65J33O55J019J477K155
51401C73541K786L208L580L950M079L965M050M704N808P192Q974J1229J3610J5750
51387D66426J7752K0004K2705K5874K9519L3501L7389M0821M3810M6448M8428
51376H32677M9182M8427M6209M2482L6953K9445K0311J0428P84q136j6582k5060
51364A067120l3441m0703m5796m8590m9794n0068m9528m8082m5829m2892l9159
51353E73238l4590k9774k5629k2362j9120j5146j1013q106o864o245n171l807
51341C85411k937k689k643k731l187l744l763l210k744k632k371j649r40p27p28
$$ plain form
51432 443106 441944 441863 442172 441573 439000 434174 427447 419541 411573 404750 399575 395547 391959 388729 386176
51417 386176 384209 382198 379596 376435 373285 370867 369581 369158 368911 368467 368102 368235 368890 369909 371386 373541
51401 373541 376327 379535 383115 387065 391144 395109 399159 403863 409671 416863 425837 437066 450676 466426
51387 466426 484178 504182 526887 552761 582280 615781 653170 693991 737801 784249 832677
51376 832677 881859 930286 976495 1018977 1055930 1085375 1105686 1116114 1116898 1108762 1092180 1067120
51364 1067120 1033679 992976 947180 898590 848796 798728 749200 701118 655289 612397 573238
51353 573238 538648 508874 483245 460883 441763 426617 415604 407498 400634 394389 389218 385411
51341 385411 382474 379785 377142 374411 371224 367480 363717 360507 357763 355131 352760 351111 350171 349444 348716
51326C48716m61j18k64r17j548j839j942j996j901j645j493j618j772j533q68
51311C28801l05l54q01q68k02N78P11L59K67M93L41l54p20j34P02P60K37K44J121
51292C30876J989K062J632J462J783K304K841L416L957M208M004L491L004K719
51278C69748K367J417k47j906k630k305j688j368j130o09l2J87K08N01R20P89
51262C64222L9n06k73J64j42j192k050k057j498j107j276j810k145j854j169q02
51246C46544j012j147o11J18J31m68o49n1N88P74R34J224Q01p72k277k226r19
51229C40982P5K04M07J274K105K134J651J391J535J861K229K440K098J170K27
51214C61783k11k47j88j4L71P34P83O05M37K82M8j64k93n21r08j070o66K8M65
$$ plain form
51326 348716 348255 348137 347873 346956 345408 343569 341627 339631 337730 336085 334592 332974 331202 329669 328801
51311 328801 328496 328142 327341 326473 326271 326849 327560 327919 328186 328679 329020 328666 327946 327812 328514 329274 329511 329755 330876
51292 330876 332865 334927 336559 338021 339804 342108 344949 348365 352322 356530 360534 364025 367029 369748
51278 369748 372115 373532 373285 371379 368749 366444 364756 363388 362258 361649 361617 361804 362012 362513 363433 364222
51262 364222 364261 363755 363482 363646 363504 362312 360262 358205 356707 355600 354324 352514 350369 348515 347346 346544
51246 346544 345532 344385 343774 343892 344023 343555 342906 342855 343443 344217 345151 346375 347176 346404 344127 341901 340982
51229 340982 341057 341261 341668 342942 345047 347181 348832 350223 351758 353619 355848 358288 360386 361556 361783
51214 361783 361572 361325 361137 361123 361494 362228 363011 363616 364053 364335 364383 364219 363926 363405 362497 361427 360761 360789 361254
51195C61254N40N61O05M31Nk71k4O82J446J844J693J224R95J322J802J700Q25
51178C76634k63j046j636k346k975k981k270j408r43q80r41j006r54m23P75K063
51162C59400K558K188J784J898K087J799J352J346J541J079j73j308j554j138
51148C72859p34n91n38m81m81n41o15p47r93j266j356j137o85k37N0L01Q01J527
51130C65136K103K288K293K346K327K181K297K876L212K390O31q25j196q77n46
51115C86636l77k40r2K13Q37J447J443R57R54J952L222L773L511K948K339J784
51099D11307J662K218K978L257L026K745K555K315K135K266K476K204J398N99
51085D43141J12l57j091j827k039j543p27k80o41j455j756r83K81R62Q56Q48J700
$$ plain form
51195 361254 361794 362355 362960 363391 363396 363125 363101 363783 365229 367073 368766 369990 370985 372307 374109 375809 376634
51178 376634 376371 375325 373689 371343 368368 365387 363117 361709 360766 359886 358945 357939 356985 356562 357337 359400
51162 359400 361958 364146 365930 367828 369915 371714 373066 374412 375953 377032 376859 375551 373997 372859
51148 372859 372125 371534 370996 370515 370034 369493 368878 368131 367138 365872 364516 363379 362694 362457 362507 362808 363609 365136
51130 365136 367239 369527 371820 374166 376493 378674 380971 383847 387059 389449 390080 389255 388059 387182 386636
51115 386636 386259 386019 385927 386140 386977 388424 389867 390824 391778 393730 396952 400725 404236 407184 409523 411307
51099 411307 412969 415187 418165 421422 424448 427193 429748 432063 434198 436464 438940 441144 442542 443141
51085 443141 443253 442896 441805 439978 437939 436396 435669 435389 434748 433293 431537 430554 430835 431797 432653 433501 435201
51068D35201L093M129M465M654N418O821Q278R266R903J0658J1533J1807J0806
51055E36032Q797O885O122O847Q774J1299J3615J4782J4122J1812R002P021O150
51042F61260N286L084n88m526p367q538q264p304o924q323j1540j5085j7213j7412
51028E56546j6405j4971j3253j1101q592o064l831k034o43M26J182J650K043K715
51014D87668L836N269O684P672P906P588P565Q498R827J0369J0041J0177J1656
51001E94756J3568J4488J4496J4911J6302J7790J8426J8342J8142J7865J7057
50990G76143J5621J3995J2556J1202R740Q437P864Q034P995O762M575K823K662
50977H88409M150O738J0055J3862J7825K1800K6048L0762L5720M0662M5689N0880
$$ plain form
51068 435201 438294 442423 446888 451542 456960 463781 472059 481325 491228 501886 513419 525226 536032
51055 536032 544829 551714 557836 564683 573457 584756 598371 613153 627275 639087 648089 655110 661260
51042 661260 666546 669630 669042 664516 657149 648611 640347 633043 626119 617796 606256 591171 573958 556546
51028 556546 540141 525170 511917 500816 492224 486160 482329 480295 479652 480078 481260 482910 484953 487668
51014 487668 491504 496773 503457 511129 519035 526623 534188 542686 552513 562882 572923 583100 594756
51001 594756 608324 622812 637308 652219 668521 686311 704737 723079 741221 759086 776143
50990 776143 791764 805759 818315 829517 839257 847694 855558 863592 871587 878349 882924 885747 888409
50977 888409 892559 899297 909352 923214 941039 962839 988887 1019649 1055369 1096031 1141720 1192600
50965A192600N5882O0250O3957O7162O9855P2017P3738P4694P4065P1471O7590
50954A943281O3247N8334N2335M5463L8424L1390K4128J6937J0530N062J85l963
50942B285353o894r102j2151j6795k1785k5085k5968k5332k4451k3945k3919k4591
50930B045335k6489k9924l4346l8561m1857m4670m7736n0971n3699n5661n7039
50919A564382n7639n6925n4913n2246m9326m6032m2445l9010l5785l2334k8652
50908A069075k5406k2885k0542j8053j6002j4833j3827j1996r574p736p078p127
50896H94016p163o796n807m257k848k461l040l449k729j182J19O96J100K068L528
50881H61795M751N326N711O591P975R237J0007J0572J1327J2307J3416J4720J6201
$$ plain form
50965 1192600 1248482 1308732 1372689 1439851 1509706 1581723 1655461 1730155 1804220 1875691 1943281
50954 1943281 2006528 2064862 2117197 2162660 2201084 2232474 2256602 2273539 2284069 2289131 2289316 2285353
50942 2285353 2278459 2269357 2257206 2240411 2218626 2193541 2167573 2142241 2117790 2093845 2069926 2045335
50930 2045335 2018846 1988922 1954576 1916015 1874158 1829488 1781752 1730781 1677082 1621421 1564382
50919 1564382 1506743 1449818 1394905 1342659 1293333 1247301 1204856 1165846 1130061 1097727 1069075
50908 1069075 1043669 1020784 1000242 982189 966187 951354 937527 925531 915957 908221 901143 894016
50896 894016 886853 880057 874250 869993 867145 864684 861644 858195 855466 854284 854403 855099 856199 858267 861795
50881 861795 866546 871872 877583 884174 892149 901386 911393 921965 933292 945599 959015 973735 989936
50868I89936J7579J8809K0448K3080K6512L0029L3318L6653M0259M4122M8510
50857A329255N4069O0972O8512P6029Q3887R2854J02722J12358J21262J30180
50847B232100J39679J48794J55861J60393J63264J65135J65489J63355J58124
50838C652194J49340J36474J19627J00109P9700N9439L9487J9928J295j5534k9547
50827D312512l9873m6251m9183m9359m7115m2660l6626l0075k4117j9773j7938
50816C909542j9166k3617l1371m2344n5632o9497q2547r4636j06110j16680j25539
50805C142403j32129j36020j36521j33293j27122j19234j10050r9442q7962p6664
50795A983966o5816n4868m3809l3488k4357j5992q193j572L452P209R770J0398
$$ plain form
50868 989936 1007515 1026324 1046772 1069852 1096364 1126393 1159711 1196364 1236623 1280745 1329255
50857 1329255 1383324 1444296 1512808 1588837 1672724 1765578 1868300 1980658 2101920 2232100
50847 2232100 2371779 2520573 2676434 2836827 3000091 3165226 3330715 3494070 3652194
50838 3652194 3801534 3938008 4057635 4157744 4237444 4296883 4336370 4356298 4357593 4342059 4312512
50827 4312512 4272639 4226388 4177205 4127846 4080731 4038071 4001445 3971370 3947253 3927480 3909542
50816 3909542 3890376 3866759 3835388 3793044 3737412 3667915 3585368 3490732 3384622 3267942 3142403
50805 3142403 3010274 2874254 2737733 2604440 2477318 2358084 2248034 2148592 2060630 1983966
50795 1983966 1918150 1863282 1819473 1785985 1761628 1745636 1737443 1735871 1739323 1746532 1756302 1766700
50783A766700Q749N900L305J184j204m165p216r941j2399j4741j7039j9463k2278
50770A677392k5501k8836l1887l4289l5848l6748l7473l8309l8996l8935l7625
50759A292945l4944l1320k7573k4321k1427j8373j5037j1745q611n455k303O33
50747A092469L559O990J0935J4803J8284K1681K5266K9098L3567L9241M5789N2030
50735A393712N7438O2770O8644P4475P9536Q4189Q9041R3524R6296R6752R5256
50724B291633R2289Q8116Q3036P7057O9501N9614M7487L3823J9183M018j0824
50713B854933k4345l5782m4246m8579m8472m5367m1218l6527l0506k2987j5179
50702B461725q584m144k362l252n989r646j4447k1389l0395l9881m8508n6283
$$ plain form
50783 1766700 1775449 1781349 1784654 1785838 1784634 1780469 1773253 1763312 1750913 1736172 1719133 1699670 1677392
50770 1677392 1651891 1623055 1591168 1556879 1521031 1484283 1446810 1408501 1369505 1330570 1292945
50759 1292945 1258001 1226681 1199108 1174787 1153360 1134987 1119950 1108205 1099594 1094139 1091836 1092469
50747 1092469 1096028 1103018 1113953 1128756 1147040 1168721 1193987 1223085 1256652 1295893 1341682 1393712
50735 1393712 1451150 1513920 1582564 1657039 1736575 1820764 1909805 2003329 2099625 2196377 2291633
50724 2291633 2383922 2472038 2555074 2632131 2701632 2761246 2808733 2842556 2861739 2865757 2854933
50713 2854933 2830588 2794806 2750560 2701981 2653509 2608142 2566924 2530397 2499891 2476904 2461725
50702 2461725 2453141 2448997 2446635 2443383 2437394 2427748 2413301 2391912 2361517 2321636 2273128 2216845
50690B216845o3318o8534p0484o8969o4926n9163n2017m3982l5657k6936j7076
50679A645783n909N468J5633K4249L2237M0576M9150N6851O2534O5756O6716O5766
50667B124810O3186N9242N4222M8384M1900L4965K7951K1460J6039J1653P647
50656B511459L546k88l207n382p716j0546j3110j4558j4876j4363j2844j0087
50644B408028o497k661J586O802J2763J8308K2538K5601K8196L0627L2403L2592
50632B610286L0566K6592K1637J6549J1751P547L685j880j2437k9154m8391o3726
50620B573025p0997p0711o5827n8559m9718l9827k9703k0191j1901n118K54M419
50608B155146P253Q480Q182O627L559j669r076j7807k6976l6241m5277n3398n9969
$$ plain form
50690 2216845 2153527 2084993 2014509 1945540 1880614 1821451 1769434 1725452 1689795 1662859 1645783
50679 1645783 1639874 1645342 1660975 1685224 1717461 1758037 1807187 1864038 1926572 1992328 2059044 2124810
50667 2124810 2187996 2247238 2301460 2349844 2391744 2426709 2454660 2476120 2492159 2503812 2511459
50656 2511459 2515005 2514717 2511510 2506128 2498412 2487866 2474756 2460198 2445322 2430959 2418115 2408028
50644 2408028 2401531 2398870 2400456 2407258 2420021 2438329 2460867 2486468 2514664 2545291 2577694 2610286
50632 2610286 2640852 2667444 2689081 2705630 2717381 2724928 2728613 2726733 2714296 2685142 2636751 2573025
50620 2573025 2502028 2431317 2365490 2306931 2257213 2217386 2187683 2167492 2155591 2150473 2150727 2155146
50608 2155146 2162399 2170879 2179061 2185688 2189247 2187578 2178502 2160695 2133719 2097478 2052201 1998803 1938834
50595A938834o4668o7133o7099o5194o2780o0444n7403n2962m7852m3328l9485
50584A310486l5398l0629k5685k1153j7251j4205j2178j0707q877o302l531j254
50572A123316L90J636K626L439M255N325O879R170J2322J6142K0238K4444K8869
50559A259051L3583L8432M3191M7597N1337N4311N6859N9335O1372O2059O1001
50548A828128N8727N5904N2670M9056M5620M3053M1524M0956M1729M4295M8169
50537B349831N2010N5066N7911O1526O5983P0482P4345P7630Q1033Q5426R1203
50526C122446R7638J03154J06603J08097J08225J06714J02533R5170Q5156P3178
50516D108914N9296M3299K5430O378j3159l2684n1741o9761q5991r9565j09864
$$ plain form
50595 1938834 1874166 1807033 1739934 1674740 1611960 1551516 1494113 1441151 1393299 1349971 1310486
50584 1310486 1275088 1244459 1218774 1197621 1180370 1166165 1153987 1143280 1134403 1128101 1124570 1123316
50572 1123316 1123706 1125342 1127968 1131407 1135662 1140987 1147866 1157036 1169358 1185500 1205738 1230182 1259051
50559 1259051 1292634 1331066 1374257 1421854 1473191 1527502 1584361 1643696 1705068 1767127 1828128
50548 1828128 1886855 1942759 1995429 2044485 2090105 2133158 2174682 2215638 2257367 2301662 2349831
50537 2349831 2401841 2456907 2514818 2576344 2642327 2712809 2787154 2864784 2945817 3031243 3122446
50526 3122446 3220084 3323238 3429841 3537938 3646163 3752877 3855410 3950580 4035736 4108914
50516 4108914 4168210 4211509 4236939 4243317 4230158 4197474 4145733 4075972 3989981 3890416 3780552
50505C780552j16760j20324j20345j16446j08599r7289q3215o7213n0288l3238
50495B866835j6326R8J4783K6179L3860L8467M0078L7580L0076J8017K455j5910
50483C076192l6128n6305p4543r0136j02978j12358j17376j18355j16725j13608
50473B137680j09327j04170r8536r2321q5145p7431p0416o4760n9846n4752m9305
50462A271671m3850l8582l3513k8759k4498k0831j7781j5178j2636r982p646o068
50450A012347m846l102p56J260K255K690L478M921O576P826Q295Q107P967Q660
50436A065678J0237J2010J3426J4605J5910J7435J9050K0553K1762K2824K4470
50425A257960K7256L0498L2778L3816L5013L7592M1008M4015M6639M9887N3835
$$ plain form
50505 3780552 3663792 3543468 3423123 3306677 3198078 3100789 3017574 2950361 2900073 2866835
50495 2866835 2850509 2850607 2865390 2891569 2925429 2963896 3003974 3041554 3071630 3089647 3092102 3076192
50483 3076192 3040064 2983759 2909216 2819080 2716102 2603744 2486368 2368013 2251288 2137680
50473 2137680 2028353 1924183 1825647 1733326 1648181 1570750 1500334 1435574 1375728 1320976 1271671
50462 1271671 1227821 1189239 1155726 1126967 1102469 1081638 1063857 1048679 1036043 1026061 1018415 1012347
50450 1012347 1007501 1004399 1003643 1004903 1007158 1009848 1013326 1018247 1024823 1032649 1040944 1049051 1057018 1065678
50436 1065678 1075915 1087925 1101351 1115956 1131866 1149301 1168351 1188904 1210666 1233490 1257960
50425 1257960 1285216 1315714 1348492 1382308 1417321 1454913 1495921 1539936 1586575 1636462 1690297
50414A690297N7212N9231O0745O2989O5808O7914O8544O7982O6483O3517N8616
50403B389338N2387M5912L9309L1591K2089J1351L44j0594k1607l2588m3184n3181
50391B431167o2246o9600p4532p7063p7545p5818p1466o4829n6955m8499l9347
50380A713267k9463j9494j0311k396M148R376J3369J6003J6843J5561J2212O735
50368A745850j298j1603k2261l1013l7429m2739m7519n0921n2342n2438n1827
50357A344460n0181m7445m4719m2863m1228l8899l6276l4131l1855k8298k3900
50346I24665k0382j8279j6365j3716j0938q858p244n562m041l092k361j252m6
50333H12529L83j57q14n99O76K350L489L600L166L328M764O959Q888J0258J1558
$$ plain form
50414 1690297 1747509 1806740 1867485 1930474 1996282 2064196 2132740 2200722 2267205 2330722 2389338
50403 2389338 2441725 2487637 2526946 2558537 2580626 2591977 2592321 2581727 2560120 2527532 2484348 2431167
50391 2431167 2368921 2299321 2224789 2147726 2070181 1994363 1922897 1858068 1801113 1752614 1713267
50380 1713267 1683804 1664310 1653999 1651603 1655751 1665127 1678496 1694499 1711342 1726903 1739115 1745850
50368 1745850 1744552 1732949 1710688 1679675 1642246 1599507 1551988 1501067 1448725 1396287 1344460
50357 1344460 1294279 1246834 1202115 1159252 1118024 1079125 1042849 1008718 976863 948565 924665
50346 924665 904283 886004 869639 855923 844985 836127 828883 823321 819280 816188 813827 812575 812529
50333 812529 812912 812755 811941 811342 812018 814368 817857 821457 824623 827951 832715 839674 848562 858820 870378
50318H70378J3025J4234J4934J5506J6135J6062J4391J1401Q269N765L989L221
50306A007310L952N781P389Q110Q656R708J0678J0728J0224J0037J0048R503Q478
50293A120602P757P432O853N896N085M504L768L138L416M587N792O771Q100R844
50279A203545J1464J3228J5597J6550J1700r02j7266l0506l6714l6656l2921k7609
50267A089510k2346j8139j4615j0684o383k984j076K58K009M066N922P577R110
50254A042225J0100J0142R525Q878Q431Q020P554P070O479N585M431L520L611
50241A135571N104P608J0272J2601J4776J7251K0454K4846L0658L7275M3549M9059
50229A409024N4443O0059O5102O8618P0630P1415P0391O6851O1272N4842M8057
$$ plain form
50318 870378 883403 897637 912571 928077 944212 960274 974665 986066 994335 1000100 1004089 1007310
50306 1007310 1011262 1017043 1024432 1032542 1041198 1050906 1061584 1072312 1082536 1092573 1102621 1112124 1120602
50293 1120602 1128359 1135791 1142644 1148540 1153625 1158129 1161897 1165035 1168451 1173038 1178830 1185601 1193701 1203545
50279 1203545 1215009 1228237 1243834 1260384 1272084 1271182 1253916 1223410 1186696 1150040 1117119 1089510
50267 1089510 1067164 1049025 1034410 1023726 1017343 1014359 1013283 1013541 1015550 1019616 1025538 1033115 1042225
50254 1042225 1052325 1062467 1071992 1080870 1089301 1097321 1104875 1111945 1118424 1124009 1128440 1131960 1135571
50241 1135571 1140675 1148283 1158555 1171156 1185932 1203183 1223637 1248483 1279141 1316416 1359965 1409024
50229 1409024 1463467 1523526 1588628 1657246 1727876 1799291 1869682 1936533 1997805 2052647 2100704
50218B100704M1007L4627L0274K7785K5176K0459J2914K521j0683k6193m2890
50207B215701n9577p5005q7380r4931r7436r6282r2668q6723p8712o9958o1804
50196A315225n4398m7380m1145l6634l4252l3713l4507l5915l6837l6382l4554
50185H89508l1954k9054k6076k3230k0523j7649j4565j1923j0365r570q602p110
50173F78887n632m635l800k447m29J633K918L218L168L617M716N848O495O889
50159G00446P593Q750J0029J1069J1683J1809J1633J1661J2239J3035J3249J2495
50147H35691J1128R752Q583P527O605O053O007O320O772P363Q230R363J0617J2021
50133I52032J3788J5921J8012J9683K1016K2313K3554K4548K5565K7361L0477
$$ plain form
50218 2100704 2141711 2176338 2206612 2234397 2259573 2280032 2292946 2295467 2284784 2258591 2215701
50207 2215701 2156124 2081119 1993739 1898808 1801372 1705090 1612422 1525699 1446987 1377029 1315225
50196 1315225 1260827 1213447 1172302 1135668 1101416 1067703 1033196 997281 960444 924062 889508
50185 889508 857554 828500 802424 779194 758671 741022 726457 714534 704169 694599 685997 678887
50173 678887 673255 668620 664820 662373 661944 663577 666495 669713 672881 676498 681214 687062 693557 700446
50159 700446 708039 716789 726818 737887 749570 761379 773012 784673 796912 809947 823196 835691
50147 835691 846819 856571 865154 872681 879286 885339 891346 897666 904438 911801 920031 929394 940011 952032
50133 952032 965820 981741 999753 1019436 1040452 1062765 1086319 1110867 1136432 1163793 1194270
50122A194270L4768L9810M5469N1880N9070O6919P5450Q4869R5193J05947J16441
50111A970086J26375J35921J44947J52269J56102J55370J50358J42125J31880
50102C265433J21125J11602J04253R8315R1918Q3446P1867N6099L4976Q307k2391
50091D024950n4389q4844j11670j33846j51182j63729j71407j74249j72686j67372
50081B639576j59146j49386j39695j30567j20817j09268r6674q5036p5233o6497
50071A507257n8252n1154m5844m1764l7900l3922k9906k5678k1217j7197j4304
50060A130119j2335j0528q567o698n158m020l457l522l769l604k957k350k342
50047A060812l109m372n458n693n106m544m754n528o083o035n696n536n700n914
$$ plain form
50122 1194270 1229038 1268848 1314317 1366197 1425267 1492186 1567636 1652505 1747698 1853645 1970086
50111 1970086 2096461 2232382 2377329 2529598 2685700 2841070 2991428 3133553 3265433
50102 3265433 3386558 3498160 3602413 3700728 3792646 3876092 3947959 4004058 4039034 4047341 4024950
50091 4024950 3970561 3885717 3774047 3640201 3489019 3325290 3153883 2979634 2806948 2639576
50081 2639576 2480430 2331044 2191349 2060782 1939965 1830697 1734023 1648987 1573754 1507257
50071 1507257 1449005 1397851 1352007 1310243 1272343 1238421 1208515 1182837 1161620 1144423 1130119
50060 1130119 1117784 1107256 1098689 1091991 1086833 1082813 1079356 1075834 1072065 1068461 1065504 1063154 1060812
50047 1060812 1057703 1053331 1047873 1042180 1037074 1032530 1027776 1022248 1016165 1010130 1004434 998898 993198 987284
50033I87284n659m685l520l131l679m097l387j955j020r88j218j222j269j633
50019I49821j976j782q93N28K031K726J786l80k040j768J37K370M353O566R406
50004I70885J2612J5966J9811K4490K9783L5306M1109M7393N3947O0279O6081
49993A377662P1127P5059P7922Q0637Q4065Q7482Q8761Q6416Q0761P2881O3288
49982B246061N2377M1514L2634K6741K3288K0792J7304J0686n55j6218l4680n4239
49970B365705p3766r1973j06920j16827j21169j20692j16550j09616j00443q9617
49960A318132p8080o6984n7085m8390m0569l3546k7358k1746j6358j1314p075
49949I09627l900j856j179j933l436m751n819p308r262j0760j1299j1640j2728
$$ plain form
50033 987284 981625 976940 973420 970289 966610 962513 959126 957171 956151 955163 953945 952723 951454 949821
50019 949821 947845 946063 945170 945698 947729 950455 952241 951861 949821 948053 948190 950560 954913 961479 970885
50004 970885 983497 999463 1019274 1043764 1073547 1108853 1149962 1197355 1251302 1311581 1377662
49993 1377662 1448789 1523848 1601770 1682407 1766472 1853954 1942715 2029131 2109892 2182773 2246061
49982 2246061 2298438 2339952 2372586 2399327 2422615 2443407 2460711 2471397 2470842 2454624 2419944 2365705
49970 2365705 2291939 2199966 2093046 1976219 1855050 1734358 1617808 1508192 1407749 1318132
49960 1318132 1240052 1173068 1115983 1067593 1027024 993478 966120 944374 928016 916702 909627
49949 909627 905727 903871 902692 900759 897323 892572 886753 879445 870183 859423 848124 836484 823756
49936H23756j4430j6016j7328j8707k0137k1119k1281k0515j8725j6044j3172
49925F26282j0894r184p362n198l261k039j189r5J162J971K229K631L595M437
49911F03085M207L277L243M987P466Q982R158Q974R244R890J0627J1431J2082
49898G06653J1983J0792Q852O691M528K404M30j334k992m703o705r270j2195j4496
49884G00638j5285j4933j4673j4977j5135j4576j3673j2896j2027j0745r247p674
49872E44797n647l054o94O04J127J796K857L780M282M727N436O265O996P781Q904
49857E89957J0244J1196J1295J0956J1147J2029J2391J1115Q836P092O034M286
$$ plain form
49936 823756 809326 793310 775982 757275 737138 716019 694738 674223 655498 639454 626282
49925 626282 615388 606204 598842 593644 590383 588344 587155 587060 588222 590193 592422 595053 598648 603085
49911 603085 607292 610569 613812 618799 626265 635247 644405 653379 662623 672513 683140 694571 706653
49898 706653 718636 729428 738280 744971 749499 751903 752333 750999 748007 743304 736599 727329 715134 700638
49884 700638 685353 670420 655747 640770 625635 611059 597386 584490 572463 561718 552471 544797
49872 544797 539150 536096 535402 536006 537133 538929 541786 545566 549848 554575 560011 566276 573272 581053 589957
49857 589957 600201 611397 622692 633648 644795 656824 669215 680330 689166 696258 702292 706578
$$ [...]
##END NTUPLES=NMR SPECTRUM
##END=
