##TITLE=AC1694_ROEFFECT0025_8636665_yRcWPYUucc
##JCAMPDX= 6.0         $$ Bruker NMR JCAMP-DX V2.0
##DATA TYPE= NMR SPECTRUM
##DATA CLASS= NTUPLES
##ORIGIN= BRUKER
##OWNER= Administrator
$$ 1.72 TOPSPIN		Version 2.1
$$ 2014-05-22 15:05:29.682 -0700  Administrator@X
$$ Compression mode = diff/dup
##.OBSERVE FREQUENCY= 400.02188249412
##.OBSERVE NUCLEUS= ^1H
##.ACQUISITION MODE= SIMULTANEOUS (DQD)
##.ACQUISITION SCHEME= undefined
##.AVERAGES= 8
##.DIGITISER RES= 22
##SPECTROMETER/DATA SYSTEM= spect
##.PULSE SEQUENCE= zg30
##.SOLVENT NAME= COFFEE_meoh
##.SHIFT REFERENCE= INTERNAL, COFFEE_meoh, 1, 14.98509
##AUDIT TRAIL= $$ (NUMBER, WHEN, WHO, WHERE, PROCESS, VERSION, WHAT)
$$ ##TITLE= Audit trail, TOPSPIN		Version 2.1
$$ ##JCAMPDX= 5.01
$$ ##ORIGIN= Bruker BioSpin GmbH
$$ ##OWNER= Administrator
$$ $$ E:\/data/COFFEE/nmr/AC1694_ROEFFECT0025_8636665_yRcWPYUucc/10/pdata/1/auditp.txt
$$ ##AUDIT TRAIL=  $$ (NUMBER, WHEN, WHO, WHERE, PROCESS, VERSION, WHAT)
(   1,<2014-05-22 15:05:22.016 -0700>,<Administrator>,<X>,<go>,<TOPSPIN 2.1>,
      <created by zg
	started at 2014-05-22 15:04:14.043 -0700,
	POWCHK enabled, PULCHK disabled,
       configuration hash MD5:
       C8 4E 4E 5D D3 5C D8 9E 9F 52 82 E0 59 8A DE 15
       data hash MD5: 64K
       74 0D AE AB A0 F6 D5 9A 04 D3 B7 DF D1 C8 B2 3A>)
(   2,<2014-05-22 15:05:24.671 -0700>,<Administrator>,<X>,<proc1d>,<TOPSPIN 2.1>,
      <Start of raw data processing
       efp LB = 0 FT_mod = 6 PKNL = 1 PHC0 = 0 PHC1 = 0 SI = 32K 
       data hash MD5: 32K
       54 D7 8A C0 0E A3 5A 2C 2C 14 A6 A0 62 26 39 93>)
(   3,<2014-05-22 15:05:24.969 -0700>,<Administrator>,<X>,<proc1d>,<TOPSPIN 2.1>,
      <pk PHC0 = 95.39429 PHC1 = 0 
       data hash MD5: 32K
       AD FF 78 B5 FD 39 B8 50 73 92 9D 50 D7 30 03 61>)
(   4,<2014-05-22 15:05:25.089 -0700>,<Administrator>,<X>,<proc1d>,<TOPSPIN 2.1>,
      <abs ABSG = 1 
       data hash MD5: 32K
       4C DE BB 13 57 39 06 76 33 1F 8C AA 1B 18 64 44>)
(   5,<2014-05-22 15:05:25.167 -0700>,<Administrator>,<X>,<proc1d>,<TOPSPIN 2.1>,
      <abs ABSG = 2 
       data hash MD5: 32K
       34 0A 54 D0 44 53 84 EB 6A BE 94 F6 42 A0 34 6E>)
(   6,<2014-05-22 15:05:25.229 -0700>,<Administrator>,<X>,<proc1d>,<TOPSPIN 2.1>,
      <abs ABSG = 3 
       data hash MD5: 32K
       1F 1E 78 87 FB 1C 63 1C C4 F2 66 F9 42 BB 9D 8E>)
(   7,<2014-05-22 15:05:25.292 -0700>,<Administrator>,<X>,<proc1d>,<TOPSPIN 2.1>,
      <abs ABSG = 4 
       data hash MD5: 32K
       C4 AA 4C 8B 60 80 F4 39 8A B6 C5 10 AF F5 8F E6>)
(   8,<2014-05-22 15:05:25.354 -0700>,<Administrator>,<X>,<proc1d>,<TOPSPIN 2.1>,
      <abs ABSG = 5 
       data hash MD5: 32K
       A6 27 1F 78 24 2E 91 F2 47 F3 64 4F 64 D7 F9 29>)
$$ ##END=
$$ 
$$ $$ hash MD5
$$ $$ 85 34 52 8A E1 16 C9 1C AD BE 2E E9 0C 65 A3 7B
##$RELAX= 
##$RELAX= 
##$RELAX= 
##$RELAX= 
##$RELAX= 
##$RELAX= 
##$RELAX= 
$$ Bruker specific parameters
$$ --------------------------
##$DU= <E:\>
##$EXPNO= 10
$$ [...]
##$TP= (0..7)
150 150 150 150 150 150 150 150
##$TP07= 0
##$TPNAME0= <>
##$TPNAME1= <>
##$TPNAME2= <>
##$TPNAME3= <>
##$TPNAME4= <>
##$TPNAME5= <>
##$TPNAME6= <>
##$TPNAME7= <>
##$TPOAL= (0..7)
0.5 0.5 0.5 0.5 0.5 0.5 0.5 0.5
##$TPOFFS= (0..7)
0 0 0 0 0 0 0 0
##$TUNHIN= 0
##$TUNHOUT= 0
##$TUNXOUT= 0
##$USERA1= <user>
##$USERA2= <user>
##$USERA3= <user>
##$USERA4= <user>
##$USERA5= <user>
##$V9= 5
##$VALIST= <valist>
##$VCLIST= <CCCCCCCCCCCCCCC>
##$VD= 0
##$VDLIST= <DDDDDDDDDDDDDDD>
##$VPLIST= <PPPPPPPPPPPPPPP>
##$VTLIST= <TTTTTTTTTTTTTTT>
##$WBST= 1024
##$WBSW= 4
##$XGAIN= (0..3)
0 0 0 0
##$XL= 0
##$YL= 0
##$YMAX_a= 650241
##$YMIN_a= -551125
##$ZGOPTNS= <>
##$ZL1= 120
##$ZL2= 120
##$ZL3= 120
##$ZL4= 120
##$ABSF1= 14.98509
##$ABSF2= -5.573092
##$ABSG= 5
##$ABSL= 3
##$ALPHA= 0
##$AQORDER= 0
##$ASSFAC= 0
##$ASSFACI= 0
##$ASSFACX= 0
##$ASSWID= 0
##$AUNMP= <proc_prof1d_extract_pilot.lims>
##$AXLEFT= 0
##$AXNAME= <>
##$AXNUC= <1H>
##$AXRIGHT= 0
##$AXTYPE= 0
##$AXUNIT= <>
##$AZFE= 0.1
##$AZFW= 0.1
##$BCFW= 0
##$BC_mod= 0
##$BYTORDP= 0
##$COROFFS= 0
##$CY= 15
##$DATMOD= 1
##$DC= 0
##$DFILT= <>
##$DTYPP= 0
##$F1P= 0
##$F2P= 0
##$FCOR= 0.5
##$FTSIZE= 32768
##$FT_mod= 6
##$GAMMA= 0
##$GB= 0
##$INTBC= 1
##$INTSCL= 1
##$ISEN= 128
##$LB= 0
##$LEV0= 0
##$LPBIN= 0
##$MAXI= 10000
##$MC2= 0
##$MEAN= 0
##$ME_mod= 0
##$MI= 0
##$NCOEF= 0
##$NC_proc= -8
##$NLEV= 6
##$NOISF1= 0
##$NOISF2= 0
##$NSP= 0
##$NTH_PI= 0
##$NZP= 0
##$OFFSET= 14.98509
##$PC= 1
##$PHC0= 95.39429
##$PHC1= 0
##$PH_mod= 1
##$PKNL= yes
##$PPARMOD= 0
##$PPDIAG= 0
##$PPIPTYP= 0
##$PPMPNUM= 2147483647
##$PPRESOL= 1
##$PSCAL= 4
##$PSIGN= 0
##$PYNMP= <proc.py>
##$REVERSE= no
##$SF= 400.02
##$SI= 32768
##$SIGF1= 0
##$SIGF2= 0
##$SINO= 400
##$SIOLD= 32768
##$SPECTYP= <>
##$SREGLST= <1H.CDCl3>
##$SSB= 0
##$STSI= 32768
##$STSR= 0
##$SW_p= 8223.68421052631
##$SYMM= 0
##$S_DEV= 0
##$TDeff= 65536
##$TDoff= 0
##$TI= <>
##$TILT= no
##$TM1= 0
##$TM2= 0
##$TOPLEV= 0
##$USERP1= <user>
##$USERP2= <user>
##$USERP3= <user>
##$USERP4= <user>
##$USERP5= <user>
##$WDW= 1
##$XDIM= 32768
##$YMAX_p= 467402817
##$YMIN_p= -735678
##$CURPLOT= <Network HP LaserJet P1505>
##$CURPRIN= <$Network HP LaserJet P1505>
##$DFORMAT= <normdp>
##$LAYOUT= <+/1D_H.xwp>
##$LFORMAT= <normlp>
##$PFORMAT= <normpl>
##$SURQMSG= 1
$$ End of Bruker specific parameters
$$ ---------------------------------
##NTUPLES= NMR SPECTRUM
##VAR_NAME=  FREQUENCY,     SPECTRUM/REAL,   SPECTRUM/IMAG
##SYMBOL=    X,             R,               I
##VAR_TYPE=  INDEPENDENT,   DEPENDENT,       DEPENDENT
##VAR_FORM=  AFFN,          ASDF,            ASDF
##VAR_DIM=   32768,         32768,           32768
##UNITS=     HZ,            ARBITRARY UNITS, ARBITRARY UNITS
##FACTOR=    0.250966925370066, 1,           1
##FIRST=     8223.43324360094, -178604,      67132
##LAST=      0,             55591,           -62278
##MIN=       0,             -735678,         0
##MAX=       8223.43324360094, 467402817,    0
$$ Real data points
##PAGE= N=1
##DATA TABLE= (X++(R..R)), XYDATA
$$ [...]
$$ plain form
19529 -253051 -80912 -331695 -338692 12091 -163809 -129678 47847 -158286 33555 53124 -45610
19517 -62115 -87493 -20150 -184244 -47973 -164709 -97153 -5563 -404966 -52484 132571 44025
19505 -169308 25958 -64452 -119194 -257991 -136415 -113489 -7026 -67239 44544 -120686 -107222
19494 -107222 -154950 -301725 8193 -85208 -126011 -116361 -41754 -251512 -59334 263440 113388
19482 -276216 -19099 -53119 125910 -277722 -39557 -461933 -101199 -17083 -30951 -245309
19472 -245309 -112514 4553 -111561 -62421 -8899 -151524 -61997 -272108 -188792 -60950 -89128
19461 -89128 -232410 -128060 232598 -327183 120076 -186508 -90931 -201844 -113614 -163086
19451 -163086 -71756 -118482 -83204 -86689 -229685 65685 -95397 -173666 -466724 -94446 270204
$$ packed form
19529b53051h0912k50783o997A2091a63809L4131D7847a58286C3555J9569d5610
19517f2115k5378b0150j64094d7973j16736O7556e563l99403e2484A32571D4025
19505a69308B5958f4452n4742j38797J21576K2926g026o0213D4544a20686J3464
19494a07222m7728j46775H193h5208m0803R650d1754k09758e9334B63440A13388
19482b76216a9099l4020A25910b77722c9557m22376a01199a7083j3868k14358
19472b45309a12514D553a11561M9140h899j42625f1997k10111Q3316f0950k8178
19461h9128j43282J04350B32598c27183A20076a86508i0931j10913Q8230m9472
19451a63086g1756m6726L5278l485j42996F5685i5397p8269k93058i4446B70204
$$ plain form
19439 -96465 -165256 201142 -170905 -153487 101852 -132436 -366232 -55577 204839 73317
19428 -110645 -259016 25702 -206784 -229851 -34022 7102 97874 -108386 40428 -178475 -183869
19417 -183869 -214031 203353 78430 -46329 17846 -104363 4850 -318220 244644 -68859 -212644
19406 -212644 260166 -12137 53519 -15724 -223167 132859 -50940 35131 -20279 34829 -179626
19394 -502468 -68422 -203452 -367436 -12591 -362591 21820 -53167 229688 5801 -242968 -169003
19383 -169003 120855 -542128 -88009 88388 -121215 -112562 -192524 335713 -8335 -85444 -171055
19372 -171055 -70393 -103085 -20023 70848 -199792 -170743 -142910 -249537 -294392 -48096 -29431
19361 -29431 86937 125454 -51316 -90789 -86512 118318 47391 -149397 11121 -52587 -39979
$$ packed form
19439i6465o8791B01142a70905J7418A01852a32436k33796e5577B04839G3317
19428a10645j48371B5702b06784k3067c4022G102R0772a08386D0428a78475n394
19417a83869l0162B03353G8430d6329A7846a04363D850c18220B44644f8859j43785
19406b12644B60166a2137E3519a5724k07443A32859e0940C5131b0279C4829a79626
19394e02468f8422j35030j63984a2591l50000B1820e3167B29688E801b42968P3965
19383a69003A20855e42128h8009H8388a21215Q653p9962C35713h335p7109q5611
19372a71055g0393l2692b0023G0848a99792K9049K7833j06627m4855d8096J8665
19361b9431H6937L8517e1316l9473M277A18318D7391a49397A1121e2587J2608
$$ plain form
19350 -39979 -350082 301078 154587 415271 18178 -291632 -235621 88184 -54604 -149256 -137800
19339 -137800 148211 -120673 15225 264765 -11689 -352299 -184730 87503 -205776 -317434
19329 -317434 62682 -199127 -59302 -249926 63127 158729 201285 35693 -191892 -131874 -93418
19318 -93418 -394660 -132337 -38312 -153468 -19509 20487 252678 20154 188485 94228 -132995
19306 144095 284415 -33517 -75816 -238274 108082 -159108 9120 106230 343558 89025 -344873
19294 -305864 53381 565565 -104726 -9911 217570 -313706 -25277 -108885 34031 -268447 -192786
19283 -192786 49787 130452 -123866 -80631 83269 131355 -135836 60427 -134931 -8197 -154881
19272 -154881 -96780 -123870 -183050 213707 67944 90494 -270442 -31847 -87265 -195377 -162987
$$ packed form
19350c9979l10103C01078j46491K60684A8178b91632N6011H8184e4604r4652J1456
19339a37800A48211a20673A5225K49540a1689l40610J67569H7503b05776j11658
19329c17434F2682a99127e9302j90624F3127R5602M2556C5693a91892O0018L8456
19318i3418l01242a32337c8312j15156a9509B0487K32191B0154J68331I4228a32995
19306A44095J40320c3517m2299j62458A08082a59108I120R7110K37328H9025c44873
19294c05864E3381N12184a04726i911B17570c13706b5277q3608C4031b68447P5661
19283a92786D9787Q0665a23866M3235H3269M8086a35836F0427a34931h197j46684
19272a54881N8101k7090n9180B13707F7944K2550b70442c1847n5418j08112L2390
$$ plain form
19261 -162987 -243240 -177967 292282 -81288 -198873 -55505 -121832 -89871 -458265 -242885 -214945
19250 -214945 -20008 -57935 57188 51982 84015 -119108 37078 24451 -428025 -207411 -321674
19239 -321674 -22951 36152 -37975 121837 -177398 75116 55274 -106200 53612 -306018 -146988
19227 66817 -249018 277648 -90264 -163795 55231 -59802 15449 -297646 -24669 -65064 47733
19215 36420 38002 -26744 -88958 41282 -628547 -161497 -67119 293176 -205630 -259224 -84817
19203 333781 296048 115519 -96690 167347 -215793 -300906 -128574 -192672 -335314 -110833
19192 132704 85056 69283 -160965 -42733 196134 386617 151730 -466780 -348373 218704
19181 98773 -281308 -231994 140007 19383 63982 -198175 49754 263555 60961 55315 -66134
$$ packed form
19261a62987q0253O5273B92282h1288j17585e5505o6327L1961l68394K15380K7940
19250b14945b0008l7927E7188n206L2033a19108C7078j2627d28025b07411j14263
19239c21674b2951C6152c7975A21837a77398G5116j9842a06200E3612c06018a46988
19227F6817b49018B77648i0264p3531E5231e9802A5449b97646b4669m0395D7733
19215C6420J582b6744o2214D1282f28547a61497f7119B93176b05630n3594h4817
19203C33781l7733A15519i6690A67347b15793q5113a28574o4098j42642a10833
19192A32704m7648j5773a60965d2733A96134J90483A51730d66780J18407B18704
19181I8773b81308M9314A40007A9383M4599a98175D9754K13801F0961n646f6134
$$ plain form
19169 -41604 16722 -41679 -185826 -137542 -268516 -60920 35857 -237802 198623 -38112 -1124
19157 125272 -82659 -217999 -196568 -99021 -37477 66830 35677 -55007 -148854 -343100 -205219
19146 -205219 -340906 -156158 -100574 5489 81317 -107406 -145593 -501186 -64563 83145 -467135
19134 -108394 -54786 -39433 194307 -81833 4052 72768 155401 13081 -104395 129304 -148844
19122 -204286 -49111 128488 262491 134202 99242 63602 119598 -324460 -2707 -222489 -71490
19110 39347 -553133 301011 52946 -153386 -267090 -63278 -194950 -35822 -220955 -342477
19100 -342477 -172072 -239038 141794 116247 -169119 -127190 171176 -211383 511719 47752
19089 -406113 -207573 -121403 -70055 -191001 -105539 -27684 -292597 -206288 -281561 -325259 165760
$$ packed form
19169d1604A6722d1679j44147M8284j30974f0920C5857b37802A98623c8112a124
19157A25272h2659j35340K1431R7547c7477F6830l1153e5007r3847j94246J37881
19146b05219j35687a56158N5584E489P5828a07406l8187l55593f4563H3145d67135
19134a08394N3608J5353A94307h1833D052O8716Q2633A3081a04395A29304a48844
19122b04286d9111A28488J34003j28289l4960l5640N5996c24460b707k19782g1490
19110C9347e53133C01011E2946a53386j13704f3278j31672c5822j85133j21522
19100c42477J70405o6966A41794k5547a69119M1929A71176b11383E11719D7752
19089d06113J98540Q6170N1348j20946Q5462b7684k64913Q6309p5273m3698A65760
$$ plain form
19077 16051 40492 -299431 -247587 -154286 -243436 -156846 79691 32598 -49945 158003 302719
19066 302719 -384772 54706 -265434 -67502 -173997 -256601 123218 -169026 -210380 316013
19055 5231 -41012 -24009 -223202 -175354 -89219 -182347 -24160 -170172 30092 -15643 -110256
19044 -110256 112728 137594 151423 -186379 -245628 -177498 -175275 221879 189372 188863 267920
19033 267920 126690 -209140 41763 -138551 -142767 267731 -167763 -57336 -59051 -7839 -22863
19022 -22863 302476 108557 58592 142828 -190253 271391 107488 -113198 88583 398314
19012 398314 -265926 -257005 45684 -18912 250530 166 73498 -141137 190264 -67055 -160900
19001 -160900 112966 -42214 309016 12284 -200746 217072 -457532 -205927 334408 375691
$$ packed form
19077A6051K4441b99431N1844R3301q9150Q6590G9691C2598d9945A58003J44716
19066C02719c84772E4706b65434f7502j06495q2604A23218a69026m1354C16013
19055E231d1012J7003j99193M7848Q6135r3128b4160j46012C0092a5643r4613
19044a10256A12728K4866J3829a86379n9249O8130K223B21879l2507n09P9057
19033B67920A26690b09140D1763a38551m216B67731a67763e7336j715g839j5024
19022b2863C02476A08557m9965Q4236a90253B71391A07488a13198H8583L09731
19012C98314b65926Q921D5684a8912B50530A66P3332a41137A90264f7055r3845
19001a60900A12966d2214C09016A2284b00746B17072d57532b05927C34408M1283
$$ plain form
18991 375691 -200422 -38573 -172200 123962 7747 -28259 -37574 -380673 9173 109731 -128892
18979 -128936 770 129589 18872 -269741 27700 -159368 289766 77467 103432 65238 145632
18968 145632 134467 -180193 186023 148358 -90282 21768 -18413 -237220 84615 -2497 -202984
18957 -202984 -201339 -33422 69959 -84740 113854 -198276 -291978 19482 98620 35991 -137327
18945 69709 81516 207290 -146393 159595 -213485 104060 424061 -179285 133600 -121171
18934 426513 -289202 56354 -44608 82853 -20533 160727 26440 -129856 -105268 -330739 261229
18922 -64414 -135195 -179864 -232589 142663 35931 -58848 -92981 469860 14764 -42597 -149341
18911 -149341 182473 185497 -6556 -169233 -446891 -141463 190758 66139 -88794 -427564 361391
$$ packed form
18991C75691b00422c8573j33627A23962G747b8259r315l43099I173J00558a28892
18979a28936G70J28819A8872b69741B7700a59368B89766G7467K5965l8194Q0394
18968A45632j1165a80193A86023l7665i0282B1768a8413k18807H4615b497k00487
18957b02984J645c3422F9959h4740A13854a98276r3702A9482P9138C5991a37327
18945F9709J1807J25774a46393A59595b13485A04060L20001a79285A33600a21171
18934D26513b89202E6354d4608H2853b0533A60727B6440a29856K4588k25471B61229
18922f4414p0781m4669n2725A42663C5931e8848l4133D69860A4764d2597j06744
18911a49341A82473L024f556j62677k77658a41463A90758F6139h8794l38770C61391
$$ plain form
18899 -48157 137259 -35720 219842 70606 111159 113180 -3234 -153398 -179063 -112502 -40469
18887 1133 6876 -197274 60142 147894 -356433 -166701 -135647 -76391 -241055 -192580 -113597
18876 -113597 -82086 -62300 1284 50958 -232885 -51905 -332672 -3445 3942 -268483 -255094
18865 -255094 -214904 -195137 -18028 5576 205746 160851 -338268 203040 6543 -77830 -34040
18853 -61285 94820 -5290 17735 -271192 -3630 -10458 189174 -520138 -131784 127632 -96281
18841 -233158 230718 57030 116930 -173482 88263 -150614 -127682 -54275 -200884 -132059 -75121
18830 -75121 310201 -86413 3308 -79308 -220586 173035 -419080 -40926 -234782 151090 -33805
18818 -5546 341991 10847 134734 89915 49593 101555 -170240 381889 177204 330126 204280
$$ packed form
18899d8157A37259c5720B19842G0606M0553K021c234j50164k5665O6561d0469
18887A133N743a97274F0142Q7752c56433a66701L1054N9256j64664M8475P8983
18876a13597L1511J9786A284M9674b32885e1905k80767c445C942b68483J3389
18865b55094M0190J9767a8028E576K00170m4895c38268B03040F543g7830c4040
18853f1285I4820e290A7735b71192c630o828A89174e20138a31784A27632i6281
18841b33158B30718E7030N9900a73482H8263a50614K2932e4275j46609O8825N6938
18830g5121C10201h6413C308g9308j41278A73035d19080d0926j93856A51090c3805
18818e546C41991A0847J23887m4819m0322N1962a70240C81889A77204J52922j25846
$$ plain form
18807 204280 144549 -93884 -291139 -16791 -214570 -117801 -81348 -84373 129630 -99596 23941
18795 -322114 -210204 -255462 -273798 201274 -190927 -73553 3738 -204118 210829 -20346 -254753
18784 -254753 -80282 -264735 176281 85067 -238038 -496059 154234 -285388 -225942 -257125
18774 -257125 106393 -112282 28832 -109093 21745 -254301 18324 -267340 -181910 177023
18763 97304 -86926 -262672 -307245 -242925 150714 -70881 -199094 236948 -526553 -144632
18752 115779 66668 81507 166523 -39857 -15381 -144285 78654 8137 -187934 -371899 -173953
18740 64930 35585 -51736 -55311 -310073 -7522 16266 -54497 -108172 228007 127661 26641
18728 142868 -372401 -228620 -71835 184101 -1530 -166215 -86942 -46206 -159418 101668
$$ packed form
18807B04280n9731i3884j97255a6791j97779R6769L6453l025A29630i9596B3941
18795c22114J11910m5258j8336B01274a90927g3553C738b04118B10829b0346k34407
18784b54753h0282j84453A76281H5067b38038k58021A54234b85388N9446l1183
18774b57125A06393a12282B8832a09093B1745b54301A8324b67340Q5430A77023
18763I7304h6926j75746m4573O4320A50714g0881j28213B36948e26553a44632
18752A15779m9111J4839Q5016c9857a5381j28904G8654H137a87934j83965a73953
18740F4930k9345e1736l575k54762g522A6266e4497n3675B28007j00346B6641
18728A42868c72401J43781g1835A84101a530j64685P9273M0736j13212A01668
$$ plain form
18717 -267530 150404 1833 -146800 82921 -227436 3352 36807 -176794 -200945 -128084 -242006
18706 -242006 -40136 83442 -354408 -112223 -240416 -45688 -216595 -45038 -383388 -53974
18695 50915 -192057 -107738 -74890 -206217 140201 -120678 56250 188424 -37156 -128707 37036
18683 -272220 -227876 -356711 181322 -46115 -115119 183862 -132398 -62251 -5504 42373 177979
18672 177979 79564 41860 -112791 318877 225834 -106526 -24248 141164 -83184 -63418 -89919
18661 -89919 -89466 31096 97960 133586 42928 -338547 -16887 188797 39273 118387 -75023 8063
18648 143786 -141348 -352418 114005 187980 -67660 -230930 -53514 -93630 -191726 -45410 -25645
18637 -25645 174244 -369535 -50389 184976 -200174 -179511 -109468 -156919 90889 -57295 -328455
$$ packed form
18717b67530A50404A833a46800H2921b27436C352L3455a76794k4151P2861j13922
18706b42006d0136H3442c54408a12223j28193d5688j70907d5038l38350e3974
18695E0915a92057Q4319L2848j31327A40201a20678E6250J32174c7156r1551C7036
18683b72220M4344j28835A81322d6115o9004A83862a32398f2251e504D2373J35606
18672A77979G9564l7704a12791C18877r3043a06526b4248A41164h3184J9766k6501
18661h9919M53C1096O6864L5626D2928c38547a6887A88797C9273P9114g5023H063
18648A43786a41348k11070A14005P3975f7660j63270e3514m0116r8096d5410J9765
18637b5645A74244c69535e0389A84976b00174K0663P0043m7451I0889e7295k71160
$$ plain form
18626 -328455 -169063 73458 -416433 -70876 210924 -227670 -214780 332539 17302 20437 -178231
18614 -126494 -340008 54987 -55139 -52559 109486 -239027 125877 -64177 -388163 -133562
18603 -94252 53618 -100504 138893 359514 8942 -151285 154822 -317024 -292257 55983 148945
18592 148945 -133107 -81823 -287320 -54980 -245136 -191574 -37986 -149517 -13337 -209519
18582 -209519 135562 180083 58172 151397 -161291 181853 264372 -141924 205759 247719
18572 247719 -8504 -171575 163350 60238 -253836 -83803 32644 -74367 18718 28426 -271673
18560 47816 382840 -307361 10672 171218 -130180 13906 -309781 36320 -41787 -177984
18550 -177984 -111119 -143802 185342 -70276 -45396 -193352 -126079 -6825 -50621 149028 -135116
$$ packed form
18626c28455J59392G3458d16433g0876B10924b27670J2890C32539A7302L135a78231
18614a26494k13514E4987e5139K580A09486b39027A25877f4177l23986a33562
18603i4252E3618a00504A38893K20621H942a51285A54822c17024K4767E5983R2962
18592A48945a33107N1284k05497e4980j90156N3562c7986j11531a3337j96182
18582b09519A35562M4521E8172R3225a61291A81853Q2519a41924B05759M1960
18572B47719h504j63071A63350F0238b53836h3803C2644g4367A8718R708b71673
18560D7816L35024c07361A0672J60546a30180A3906c09781C6320d1787j36197
18550a77984O6865l2683A85342g0276K4880j47956O7273f825m3796A49028a35116
$$ plain form
18538 -381283 233469 -243996 46376 -133584 92831 -192047 316620 -329785 -284342 -46454
18527 -170812 10594 -38662 -55900 100566 178256 40942 -110871 31510 -20571 -95714 -272504
18516 -272504 -180202 -32931 -227508 182051 97371 -306962 274280 78562 -13461 34324 118428
18505 118428 -317139 -29043 63687 -206825 30077 98820 -314464 -235392 218010 -50536 -76451
18494 -76451 241771 114514 -91690 -302720 270920 128750 -94926 157703 4842 -198953
18483 -112183 -49567 -161271 -299914 -68330 -1784 100024 100236 -194483 -103669 60545 239535
18472 239535 -25624 48418 -292523 323783 194703 -64215 -337965 73479 -537642 47008
18461 106160 -57172 -85753 -145472 -20674 -119322 -107483 -65732 224938 209071 -132530 76517
$$ packed form
18538c81283B33469b43996D6376a33584I2831a92047C16620c29785M5443d6454
18527a70812A0594c8662j7238A00566P7690D0942a10871C1510b0571p5143j76790
18516b72504R2302c2931j94577A82051q4680c06962B74280G8562a3461C4324Q4104
18505A18428c17139b9043F3687b06825C0077O8743c14464P9072B18010e0536k5915
18494g6451B41771A14514i1690k11030B70920A28750i4926A57703D842a98953
18483a12183d9567j11704j38643f8330a784A00024K12a94483R0814F0545J78990
18472B39535b5624D8418b92523C23783j29080f4215k73750G3479e37642D7008
18461A06160e7172k8581n9719b0674r8648J1839M1751B24938j5867a32530G6517
$$ plain form
18449 27405 -43869 -122527 116908 530253 85707 -95770 -129962 -155437 25195 247983 61285
18437 -56129 45610 27861 299205 -9933 -123834 -16601 44166 -60843 147546 108542 -4206
18425 -3961 -187990 -295927 150776 90529 -297656 105623 27596 -193100 -247131 -230191 -408460
18414 -408460 -135255 -285336 -251969 82845 64188 -56730 17787 -7228 224587 108727 301177
18403 301177 -363538 -116909 -377935 -103657 -118537 237785 121465 -183950 54370 256875
18393 256875 87394 -214936 168022 -426938 61588 75220 109457 -381834 -2314 87135 83385
18382 83385 185109 -111922 252613 157665 -278503 -11891 -62953 42180 -36680 -190788 -80292
18370 -45324 62207 87326 -55825 -2779 3819 171 -73065 -24540 25243 -118826 22188 144372
$$ packed form
18449B7405d3869p8658A16908M13345H5707i5770l4192k5475B5195K22788F1285
18437e6129D5610j7749K71344i933j13901a6601D4166f0843A47546l9004d206
18425c961j84029j07937A50776o0247b97656A05623B7596a93100n4031J6940j78269
18414d08460a35255j50081L3367H2845j8657e6730A7787g228B24587A08727J92450
18403C01177c63538a16909k61026a03657j4880B37785j16320a83950E4370K02505
18393B56875H7394b14936A68022d26938F1588J3632L4237c81834b314H7135l750
18382H3385J01724a11922B52613r4948b78503a1891n1062D2180c6680j54108h0292
18370d5324F2207K5119e5825b779C819A71g3065b4540B5243a18826B2188J22184
$$ plain form
18358 144372 -203137 -112250 45065 233997 116339 -255044 -322439 88477 121912 -42828 33998
18346 -211323 -28429 -241699 79911 -34669 83197 28870 -54445 -78963 -58145 -242665 -223383
18335 -223383 158086 -382524 -58444 -112467 -344429 117022 -68364 -258389 181626 333219
18325 333219 -117318 -46166 -62256 -115333 -34280 105351 -178274 144068 -343021 85296
18314 -224768 52685 291855 -25608 -67745 -119223 -174456 107028 132899 44839 83908 207152
18303 207152 -166409 -301004 -19783 8857 -74344 -91397 -97717 -249896 -238274 69486 -28345
18291 -56645 -220485 -8787 -13015 176264 -355584 -8268 -88250 -153793 6574 176071 121006 -226227
18278 10168 187715 -272117 2275 -146563 -257348 -305512 -176612 -254764 181261 109710 75292
$$ packed form
18358A44372b03137R0887D5065J88932A16339b55044o7395H8477L3435d2828C3998
18346b11323b8429k13270G9911c4669H3197B8870e4445k4518K0818j84520J9282
18335b23383A58086c82524e8444n4023k31962A17022f8364j90025A81626J51593
18325C33219a17318d6166j6090n3077c4280A05351a78274A44068c43021H5296
18314b24768E2685K39170b5608m2137n1478n5233A07028K5871D4839L9069J23244
18303B07152a66409j34595a9783H857g4344j7053o320j52179J1622F9486b8345
18291e6645j63840h787m228A76264c55584h268p9982o5543F574J69497n5065b26227
18278A0168J77547b72117B275a46563j10785m8164J28900p8152A81261p1551l4418
$$ plain form
18267 75292 268807 -175455 66960 -49232 191573 -13636 -7745 39342 286681 271320 163679
18256 163679 55563 121123 219958 -81082 85877 154714 -388793 33707 -226201 127596 24336
18244 52762 -171390 -21685 -512 -135996 148343 -81549 38561 -71198 19974 75388 -236459
18232 142028 -74017 -166575 115655 192672 -102499 -87619 24082 29288 65019 -156121 -198437
18221 -198437 -133469 -156536 -68646 283616 -67407 -209473 -51671 -225870 -103849 385182
18210 23847 -18875 -235920 -223923 9648 -177355 148091 -303129 -140425 6376 67364 -185040
18198 60503 -297247 80198 66060 210603 83473 288736 484041 -31830 -12859 125969 -145176
18186 -387870 -260595 -264110 -104417 197161 -188324 -336265 -116988 -164285 179230 41598
$$ packed form
18267G5292J93515a75455F6960d9232A91573a3636N891C9342K47339j5361j07641
18256A63679E5563O5560R8835h1082H5877O8837c88793C3707b26201A27596B4336
18244E2762a71390b1685e12j35484A48343h1549C8561g1198A9974N5414b36459
18232A42028g4017r2558A15655P7017a02499J4880B4082N206L5731a56121m2316
18221a98437O4968k3067f8646B83616f7407j42066e1671j74199a03849C85182
18210B3847a8875k17045J1997I648a77355A48091c03129a40425F376O0988a85040
18198F0503b97247H0198j4138J44543H3473K05263J95305c1830a2859A25969a45176
18186c87870J27275l515a04417A97161a88324j47941a16988m7297A79230D1598
$$ plain form
18175 274452 -70393 -101191 -236580 233901 84511 261380 46424 -113921 -112880 -340230 -122661
18163 -46610 -386173 -63716 -96533 -136887 76427 -234005 -350039 -62599 -91574 232049 125657
18152 125657 -58396 364438 -197066 -388219 -52549 -235460 -154788 100689 96706 211381
18142 211381 -398268 -58869 -189826 -133307 76179 -71443 121656 111522 -53936 -77037 -406470
18131 -406470 225420 -201141 98556 -266353 -140439 -16127 -191707 -99739 2087 158483
18121 158483 -496533 297732 -55146 221898 -25844 -343994 -158151 -207941 -134163 -163617
18111 -163617 -313024 89148 -87701 45558 -116857 -115558 148814 175930 -94200 143567 404195
18100 404195 171108 -49835 -351148 165081 78569 80239 173106 -346540 -97857 57320 188172
$$ packed form
18175B74452g0393l0798j35389B33901H4511J76869D6424a13921J041k27350a22661
18163d6610l39563f3716l2817m0354G6427b34005j16034f2599k8975B32049j06392
18152A25657e8396C64438a97066j91153e2549j82911Q0672A00689l983J14675
18142B11381c98268e8869j30957N6519G6179g1443A21656j0134e3936k3101l29433
18131d06470B25420b01141I8556b66353J25914a6127j75580R1968B087J56396
18121A58483d96533B97732e5146B21898b5844l18150a58151m9790P3778k9454
18111a63617j49407H9148h7701D5558a16857J299A48814K7116i4200A43567K60628
18100D04195A71108d9835l01313A65081G8569J670R2867c46540i7857E7320J30852
$$ plain form
18089 188172 -119134 -195143 -475157 -33292 -154049 67223 -115513 -166494 -282485 -232266
18079 -232266 -67294 -36431 -145127 228901 -36206 -165754 99503 221664 159892 242524 -244280
18067 -110823 -45765 952 -333883 -268403 -66038 407174 -26681 11822 47687 96708 -252136
18055 -147494 82318 118418 -11008 -139751 -95312 9424 57763 72823 -113174 285114 -401342
18043 150986 -16693 -40617 13761 -6261 -51818 203922 -109993 122433 -15031 112051 -217816
18031 -195967 -210408 87346 47851 -184788 -19877 -112535 262362 -242454 -161981 273200 59909
18019 15006 -323511 34828 -306238 196819 44257 -12537 152192 41154 10866 208655 95034
18007 -98221 94776 -184648 128335 105591 191889 -8655 144904 179484 110978 -158466 -296122
$$ packed form
18089A88172a19134p6009k80014c3292j20757F7223a15513n0981j15991N0219
18079b32266f7294L0863j08696B28901c6206j29548I9503J22161o1772Q2632b44280
18067a10823d5765I52c33883O5480f6038D07174b6681A1822L5865M9021b52136
18055a47494H2318L6100a1008j28743M4439I424M8339J5060a13174B85114d01342
18043A50986a6693k3924A3761f261m5557B03922a09993A22433a5031A12051b17816
18031a95967j4441H7346l9495a84788a9877r2658B62362b42454Q0473B73200E9909
18019A5006c23511C4828c06238A96819D4257a2537A52192D1154A0866J97789I5034
18007i8221I4776a84648A28335k2744Q6298h655A44904L4580o8506a58466j37656
$$ plain form
17996 -296122 -162193 -79474 -280861 -120444 -156043 -147852 72224 39487 -10613 15937 66400
17985 66400 -59954 -137142 -350618 -109318 203272 17979 -66276 87433 8101 283102 301611
17974 301611 -9751 -226804 282167 -25802 -168827 64417 170638 116944 32750 -354727 -132631
17962 81505 52261 54259 -73132 -265010 -103463 -269578 -138141 244160 -189544 -215657 120998
17950 26401 -77322 334135 -58635 -11913 -143888 109008 196046 -108988 194190 21867 48047
17939 48047 -290499 -81133 -202209 -65100 -100907 -1052 178311 -207947 -28268 258448 7428
17927 -80240 -276 419919 -132612 20449 -16295 32433 159885 -24832 -129797 -34930 -27682
17916 -27682 -24752 329096 -345239 58177 -226672 152545 -64533 48190 -317861 -248270 -218562
$$ packed form
17996b96122J33929g9474k01387a20444l5599Q191G2224l2737a0613A5937N0463
17985F6400e9954p7188k13476a09318B03272A7979f6276H7433H101K75001J8509
17974C01611i751k17053B82167b5802j43025F4417J06221n3694C2750c54727a32631
17962H1505k9244J998g3132j91878a03463j66115J31437B44160a89544k6113A20998
17950B6401g7322C34135e8635a1913j31975A09008Q7038a08988A94190B1867K6180
17939D8047b90499h1133j21076f5100l5807a052A78311b07947b8268B58448G428
17927h0240b76D19919a32612B0449a6295C2433J27452b4832j04965c4930P248
17916b7682K930C29096c45239E8177b26672A52545f4533D8190c17861O9591K9708
$$ plain form
17905 -218562 81281 181809 64951 118319 -262271 56042 13386 -1680 174340 -127515 270969
17893 -286029 -140084 232565 -245134 -145151 -51731 125264 -55077 -81329 150638 -36905
17882 215097 23997 13918 -201765 -413236 -52367 76767 94758 -150693 -45784 184517 76052
17870 83154 49106 104272 59913 -101297 87512 -23613 -58005 17966 76302 137152 -89561
17858 192076 -56595 -207754 97925 -109561 -140998 -192626 -141743 -186081 151705 -231184 -93392
17846 185945 -216923 -9893 410327 5993 -19411 244656 -123156 151532 -220050 -31235 153899
17834 75590 -80374 1595 -52944 129964 -43724 -88903 76598 -52562 121363 32251 8921 31910
17822 31910 208078 -87260 113135 303384 -65158 -75661 279206 -89980 118649 -206098
$$ packed form
17905b18562H1281J00528F4951N3368b62271E6042A3386a680A74340a27515B70969
17893b86029a40084B32565b45134R9983e1731A25264e5077k6252A50638c6905
17882B15097B3997j0079b01765k11471e2367G6767J7991a50693d5784A84517G6052
17870H3154l4048N5166m4359a01297H7512b3613l4392A7966N8336O0850h9561
17858A92076e6595j51159I7925a09561l1437n1628N0883m4338A51705b31184i3392
17846A85945b16923i893D10327E993a9411B44656a23156A51532b20050c1235A53899
17834G5590h0374A595e2944A29964d3724m5179G6598e2562A21363C2251H921K2989
17822C1910J76168h7260A13135J90249f5158j0503B79206h9980A18649b06098
$$ plain form
17811 80152 151054 14930 -151174 120375 73343 -73453 -96287 -131729 -176309 -184292 213509
17799 -262591 -67187 91308 -34275 98963 -276988 7219 -74883 134285 -192025 -95939 160838
17787 164423 -202825 61101 199241 135113 292274 -363153 -219539 -69114 -235551 -23051
17776 -36853 -215593 -80097 -255866 -449486 -142892 120346 126054 161560 1187 61869 32133
17765 32133 -28166 90994 -215761 -158365 -148521 66293 -78868 195621 -103571 -183264 146448
17753 -13000 -144687 215934 -54992 -168878 173392 -69321 103994 222409 302810 176843
17743 176843 -80955 -167200 9027 106084 86564 99874 250673 -363073 156255 -119166 -46469
17731 191159 239248 -159492 85137 25824 87274 158481 -273377 143412 -175212 -352780
$$ packed form
17811H0152P0902A4930a51174A20375m7032g3453k2834l5442m4580p983B13509
17799b62591f7187I1308c4275I8963b76988G219g4883A34285a92025i5939A60838
17787A64423b02825F1101J38140o4128J57161c63153J43614f9114j66437b3051
17776c6853j78740h0097j75769j93620a42892A20346N708L5506A187O0682k9736
17765C2133b8166I0994b15761N7396R844F6293g8868A95621a03571p9693A46448
17753a3000j31687B15934e4992j13886A73392f9321A03994J18415Q0401j25967
17743A76843h0955q6245I027R7057j9520J3310J50799c63073A56255a19166d6469
17731A91159M8089a59492H5137B5824O1450P1207b73377A43412a75212j77568
$$ plain form
17721 -352780 114934 -227947 -195070 -34279 -117130 33808 -229278 31676 -189343 -104396 40929
17709 379695 -108154 -91625 101404 -23708 -3055 96418 -90059 -17589 -251370 18909 277305
17698 277305 33900 -25419 -108208 336480 -192527 221627 -143854 517311 -173489 -97093
17688 -97093 136541 56470 42662 245862 -113095 -228410 -291036 -76347 171133 -14976 142856
17676 -5926 18267 74680 216211 -6273 289623 58479 171208 -233981 -65889 -43887 4836
17664 47333 -234049 -151237 41424 -181423 118184 -17975 -165911 -211263 -108961 120964
17653 -117041 33586 -142530 75989 -127100 -3084 21088 -101003 -6808 210712 138486 338966
17642 338966 -229157 180155 86182 301369 8000 -300594 161498 90585 20631 -301553
$$ packed form
17721c52780A14934b27947L2877c4279q2851C3808b29278C1676a89343Q4947D0929
17709C79695a08154J6529A01404b3708c055I6418i0059a7589k33781A8909K58396
17698B77305C3900b5419q2789C36480a92527B21627a43854E17311a73489P6396
17688i7093A36541E6470j3808K03200a13095j15315o2626g6347A71133a4976A42856
17676e926A8267N6413J41531f273B89623E8479J12729b33981f5889K2002D836
17664D7333b34049Q2812D1424a81423A18184a7975j47936m5352J02302A20964
17653a17041C3586a42530G5989a27100c084B1088a01003f808B10712p2226K00480
17642C38966b29157A80155H6182K15187H000c00594A61498p0913B0631c01553
$$ plain form
17631 -174576 394034 161485 -81372 217089 136909 -42290 30956 120437 30933 216646 -234027
17619 -28877 140340 23578 -43993 -253542 180524 165248 -100865 28658 -86839 158070 -204743
17607 123028 291521 124999 -457319 -233272 190938 87233 -276841 122463 -104711 564105
17596 179025 -40301 313295 265397 -277745 74245 -4356 163500 -166687 105965 384390
17586 384390 46906 -24855 18069 -85210 132458 165658 120128 25019 -272085 -73386 4969
17574 -98254 49801 297626 383209 333408 129204 -37142 -67976 -250701 -108862 295039 -108268
17562 -96779 -95683 55845 -33643 -53352 185892 199102 488347 127779 160230 305396 403008
17551 403008 420912 125686 -228400 -167999 141606 84754 -82381 -38853 440632 157840
$$ packed form
17631a74576C94034A61485h1372B17089q0180d2290C0956Q9481C0933J85713b34027
17619b8877A40340B3578d3993k09549A80524j5276a00865B8658h6839A58070b04743
17607A23028J68493A24999d57319K24047A90938H7233b76841A22463a04711E64105
17596A79025d0301C13295m7898b77745G4245d356A63500a66687A05965K78425
17586C84390D6906b4855A8069h5210A32458L3200m5530B5019b72085g3386D969
17574i8254D9801K47825Q5583m9801A29204c7142l0834j82725a08862B95039a08268
17562i6779J096E5845c3643j9709A85892J3210K89245A27779L2451J45166R7612
17551D03008J7904A25686b28400O0401A41606n6852h2381c8853D40632A57840
$$ plain form
17540 540343 -132735 284166 535601 78067 -41677 193081 5846 3575 434689 -268395 -36868
17528 -128752 116560 107544 -106385 28155 124260 -68971 396252 97938 -14746 8653 187856
17517 187856 201171 60862 73944 -65809 -2505 19567 9295 406242 -151118 -18925 198960
17505 383979 129930 -85784 213773 274749 39418 337328 214212 124905 47173 83407 -124732
17493 -187226 -181947 160727 387439 -121078 -83303 152783 110364 -48877 334678 119057
17482 131631 -45254 117882 71762 240300 100173 252860 -15393 391873 -52126 158412
17471 136694 -175805 270179 207791 119625 310400 148438 -4181 -366796 -18111 46155 15351
17459 408055 -151094 125308 -27603 21687 43564 187803 47690 16469 197621 520033
$$ packed form
17540E40343a32735B84166K51435G8067d1677A93081E846k271M31114b68395c6868
17528a28752A16560r016a06385B8155R6105f8971C96252I7938a4746H653J79203
17517A87856J3315F0862J3082f5809b505A9567I295L96947a51118a8925A98960
17505C83979A29930h5784B13773O0976C9418K97910j23116q9307D7173L6234a24732
17493a87226N279A60727K26712a21078L7775A52783m2419d8877C34678A19057
17482A31631d5254A17882m6120J68538A00173J52687a5393C91873e2126A58412
17471A36694a75805B70179o2388q8166J90775A48438d181l62615a8111D6155A5351
17459D08055a51094A25308b7603B1687K1877J44239D7690A6469J81152L22412
$$ plain form
17449 520033 192328 440458 477308 529150 480784 165961 383801 302113 171391 504141
17439 504141 519424 339591 220304 285315 473633 279562 388765 -58618 351813 312988
17429 312988 303953 25981 95888 277876 -61849 643675 636865 390732 -45693 380469 397100
17418 397100 368024 313846 302746 135733 227976 127325 366462 115102 317400 193668
17408 193668 339338 298982 -34998 262574 108890 156823 212020 125367 -120354 -7608 -127903
17397 -127903 148893 290042 164406 249588 120782 94864 339858 212574 -163678 337373
17386 275223 -105388 -143708 35564 -29203 246184 124584 182189 142608 131055 22760 -201688
17374 121349 -206704 325634 47866 367404 199926 116450 27801 32121 48345 195978 217890
$$ packed form
17449E20033A92328K48130L6850N1842m8366A65961K17840q1688j30722L32750
17439E04141J5283j79833j19287O5011J88318j94071J09203e8618C51813l8825
17429C12988r035B5981O9907J81988f1849F43675o810k46133d5693C80469J6631
17418C97100k9076n4178j1100A35733R2243j00651K39137A15102K02298j23732
17408A93668J45670m0356c4998B62574A08890M7933N5197q6653a20354g608j20295
17397a27903A48893J41149j25636Q5182A20782k5918K44994j27284a63678C37373
17386B75223a05388l8320C5564b9203B46184j21600N7605l9581j1553B2760b01688
17374A21349b06704C25634D7866L19538j67478q3476B7801M320J6224J47633K1912
$$ plain form
17363 217890 -51140 -94565 -86096 158853 48596 235209 32500 63349 20874 119504 153774
17352 153774 315523 -38048 190560 194304 323997 -242009 189845 197882 -124557 -159809 148404
17340 -136248 202076 571264 144456 165102 229373 -62032 133868 384275 -3451 132648
17329 197718 326524 197005 532347 231626 353806 256519 200037 237203 186630 314429
17319 314429 -4034 -185047 712 679966 48624 247228 182053 237731 -26270 -51600 256772
17307 -23035 132316 -293708 144525 90301 310147 197139 221857 218959 112824 6180 388636
17296 388636 211770 27183 292212 335789 328554 210688 -30610 231104 273473 385749 181855
17284 100462 315195 175893 60389 -29205 250646 145259 145182 192044 -158417 -522 284813
$$ packed form
17363B17890e1140m3425Q469A58853D8596J86613C2500L0849B0874R8630L4270
17352A53774J61749c8048A90560L744J29693b42009A89845Q037a24557l5252A48404
17340a36248B02076L69188A44456K0646O4271f2032A33868K50407c451A32648
17329A97718J28806j29519L35342B31626J22180r7287n6482L7166n0573J27799
17319C14429d034j81013G12O79254D8624J98604o5175N5678b6270k5330B56772
17307b3035A32316b93708A44525n4224K19846j13008K4718k898j06135F180L82456
17296C88636j76866B7183K65029M3577p235j17866c0610B31104M2369J12276A81855
17284A00462K14733j39302F0389b9205B50646j05387p7M6862a58417e22B84813
$$ plain form
17272 185513 490388 314512 176080 117799 240546 105851 100684 327075 28984 -56888
17261 299036 75780 2752 309650 173652 42124 -149467 84343 52544 236060 320119 218403
17250 218403 427594 -139101 326390 243696 250403 353094 340227 420802 194872 141517 74146
17239 74146 80574 30853 703930 213887 116708 413865 61232 -33123 237019 4835 305742
17228 305742 485471 335795 217793 163610 110885 96119 85419 142691 306690 -298138
17217 344176 215256 226028 381561 46351 461701 254842 10478 187745 -147915 3288
17206 159432 363047 -92559 219865 107718 288411 43410 166764 315567 492155 159650
17195 93692 117327 91930 212608 177960 193935 129859 218189 187061 254223 266421 241760
$$ packed form
17272A85513L04875j75876j38432n8281J22747A05851n167K26391B8984e6888
17261B99036G5780B752L06898j35998D2124a49467H4343l1799J83516Q4059j01716
17250B18403K09191a39101C26390q2694O707J02691j2867Q0575A94872n3355o7371
17239G4146O428C0853O73077B13887r7179K97157F1232c3123B37019D835L00907
17228C05742J79729j49676j18002n4183n2725j4766j0700N7272J63999b98138
17217C44176j28920J0772J55533D6351M15350k06859A0478J77267a47915C288
17206A59432K03615i2559B19865A07718J80693D3410J23354J48803J76588A59650
17195I3692K3635k5397J20678l4648J5975o4076Q8330l1128O7162J2198k4661
$$ plain form
17184 241760 390169 318000 302271 433732 186991 107243 335554 254242 254108 463151 365508
17173 365508 148107 529854 458307 320412 144762 307263 476475 120142 493602 363940
17163 363940 452840 264404 537511 261025 122344 548139 626142 51649 402822 164529
17152 112246 328788 357683 518674 282748 253294 760714 299392 340139 547476 72975
17141 144196 680103 94771 301442 108226 396690 -67445 255693 634830 164859 275505
17131 275505 493919 300982 804151 259292 277 112612 451073 281356 678432 476310
17121 476310 25093 258957 122345 585857 165076 340506 261536 144190 354512 162559
17110 537894 150826 401005 597718 326877 311463 457310 145511 196657 492599 413427
$$ packed form
17184B41760J48409p2169j5729J31461A86991p9748K28311q1312j34K09043r7643
17173C65508A48107L81747p1547j37895A44762J62501J69212A20142L73460j29662
17163C63940Q8900j88436K73107B61025A22344M25795P8003E1649L51173A64529
17152A12246K16542K8895J60991k35926k9454N07420B99392M0747K07337G2975
17141A44196N35907I4771K06671A08226K88464f7445B55693L79137A64859J10646
17131B75505K18414j92937N03169B59292B77J12335L38461j69717L97076k02122
17121D76310B5093K33864A22345M63512A65076J75430p8970j17346K10322A62559
17110E37894A50826K50179J96713k70841j5414J45847A45511N1146K95942p9172
$$ plain form
17100 413427 479659 331063 319915 565577 364289 656033 332454 429971 547004 265607
17089 169291 299475 575790 231064 709034 351959 161910 429987 307141 409611 217877
17079 217877 363086 169060 423354 585513 159087 506334 640721 491691 590158 351564
17069 351564 763872 649056 371803 141278 584681 788871 521226 391743 306579 278545
17059 278545 598050 657264 305392 419963 273522 178784 590518 290858 498863 439886
17049 439886 562524 715748 324390 703393 369470 622701 496836 650811 468635 609312
17039 609312 777439 236106 831908 599597 513825 584948 1097629 615801 888601 437670
17028 594868 712960 605549 687184 677270 670935 908710 380664 833351 585887 570990 587395
$$ packed form
17100D13427O6232j48596j1148K45662k01288K91744l23579R7517J17033B65607
17089A69291J30184K76315B31064M77970C51959A61910K68077j22846J02470j91734
17079B17877J45209A69060K54294J62159A59087L47247J34387j49030R8467k38594
17069C51564M12308j14816k77253A41278M43403K04190k67645j29483q5164k8034
17059B78545L19505N9214C05392J14571j46441r4738M11734B90858K08005n8977
17049D39886J22638J53224C24390L79003l33923K53231j25865J53975j82176J40677
17039F09312J68127B36106N95802k32311q5772P1123N12681m81828K72800D37670
17028E94868J18092j07411Q1635r914o335K37775C80664M52687k47464j4897J6405
$$ plain form
17017 587395 682288 913171 593576 691880 953655 658703 548857 657529 567234 629638
17007 629638 665222 827209 644995 697906 677848 696092 385976 710857 721020 692192 815094
16996 815094 1093059 733244 517497 583009 966447 1051486 918371 694835 541130 913819
16986 913819 899070 990861 882732 570011 677919 725642 1093701 911826 812246 699279
16976 699279 1206111 918896 836054 935738 788178 1296693 953257 858697 688784 806783
16966 806783 1158116 1154454 1018469 1040557 796341 1095238 774800 1195527 710801 1132695
16956 1132695 1146940 1480054 824379 992269 1226624 967091 1136084 1068964 1008607 1132553
16946 1132553 1270397 1154580 893582 1168500 1316692 1015784 1208269 1068130 1084034 1149066
$$ packed form
17017E87395R4893K30883l19595R8304K61775k94952j09846J08672r0295O2404
17007F29638L5584J61987j82214N2911k0058J8244l10116L24881J0163k8828J22902
16996H15094K77965l59815k15747O5512L83438Q5039j33115k23536j53705L72689
16986I13819j4749R1791j08129l12721J07908M7723L68059j81875r9580j12967
16976F99279N06832k87215q2842R9684j47560N08515l43436r4560j69913J17999
16966H06783L51333l662j35985K2088k44216K98897l20438M20727m84726M21894
16956A132695J4245L33114o55675J67890K34355k59533J68993o7120o0357J23946
16946A132553J37844j15817k60998K74918J48192l00908J92485j40139J5904O5032
$$ plain form
16936 1149066 1339372 999710 1195219 1264245 1371822 1151694 1302146 1342308 1244509 1454591
16926 1454591 1226145 1251993 1401473 1684862 1319683 1298744 1778154 1379238 1438995 1443901
16916 1443901 1482582 1674967 1432117 1172528 1809985 1386630 1681105 1636014 1525916 1551902
16906 1551902 1714801 1473009 1900165 1744610 1613951 1765897 1778893 2032474 1783699 1685618
16896 1685618 1946232 1850809 2150343 1749552 1657596 1729890 1759709 2085373 1652769 1910152
16886 1910152 1843660 2101749 1934900 2162945 2218576 1783556 1864644 2096866 2094029 2420640
16876 2420640 1992746 2361838 2553858 2361280 2443487 2541400 2582819 2550923 2651164 2467143
16866 2467143 2399999 2727743 2650718 2825935 2692311 2825918 3118123 2749580 3193651 2944298
$$ packed form
16936A149066J90306l39662J95509O9026J07577k20128J50452M0162r7799K10082
16926A454591k28446K5848J49480K83389l65179k0939M79410l98916N9757M906
16916A443901L8681J92385k42850k59589O37457m23355K94475m5091j10098K5986
16906A551902J62899k41792M27156j55555j30659J51946J2996K53581k48775r8081
16896A685618K60614r5423K99534m00791r1956P2294K9819L25664m32604K57383
16886A910152o6492K58089j66849K28045N5631m35020Q1088K32222k837L26611
16876B420640m27894L69092J92020j92578Q2207R7913M1419l1896J00241j84021
16866B467143o7144L27744p7025J75217j33624J33607K92205l68543M44071k49353
$$ plain form
16856 2944298 3017746 3129105 3094662 3109351 3192756 3096319 3294541 3431916 3074726 3362708
16846 3362708 3252759 3416089 3548532 3277617 3676424 3854575 3631645 3774575 3711082 4188234
16836 4188234 3966237 4176685 4156207 4009918 4239242 4346827 4415269 4664623 4539972 4637615
16826 4637615 4785996 4761015 4326034 4989965 4890907 5224430 4848945 5498480 5601251 5558657
16816 5558657 5605530 5621115 6098509 6029003 6460353 6414872 6477469 6786828 6523781 6790622
16806 6790622 6828409 7038747 7410891 7291876 7600786 7683960 8055944 8025216 8119928 8678182
16796 8678182 8695033 8879581 8763888 9298287 9446717 10024196 10074089 10438115 10704919 11004235
16786 11004235 10990514 11329097 11826108 12286182 12228460 12821038 13340104 13693504 14203079 14516673
$$ packed form
16856B944298P3448J11359l4443J4689Q3405r6437J98222J37375l57190K87982
16846C362708j09949J63330J32443k70915L98807J78151k22930J42930o3493M77152
16836D188234k21997K10448k0478j46289K29324J07585O8442K49354j24651R7643
16826D637615J48381k4981m34981O63931r9058L33523l75485O49535J02771m2594
16816E558657M6873J5585M77394o9506M31350m5481O2597L09359k63047K66841
16806F790622L7787K10338L72144j19015L08910Q3174L71984l0728R4712N58254
16796H678182J6851J84548j15693N34399J48430N77479M9893L64026K66804K99316
16786A1004235j3721L38583M97011M60074n7722N92578N19066L53400N09575L13594
$$ plain form
16776 14516673 14765086 15183662 15610496 16283446 17014202 17703549 18003703 18826285 19065110
16767 19065110 19806799 20570357 21426742 22086953 23298815 23717412 25021446 25963695 27081483
16758 27081483 27644166 29366266 30473690 31843813 33260449 34209575 35979239 37959212
16750 37959212 39467204 41438958 43687257 45807097 47810126 50277290 53160784 56105458
16742 56105458 58793486 62192990 66183353 69269528 73116722 77706580 82077777 86836839
16734 86836839 91798957 97519238 103657836 109463836 115837484 122722254 129499461 137241405
16726 137241405 144456940 151934015 159799102 167091444 173961826 180637794 186266619 191131264
16718 191131264 195124350 197795733 199407354 198966684 197450722 194645073 190461063 185251059
$$ packed form
16776A4516673K48413M18576M26834O72950P30756O89347L00154Q22582K38825
16767A9065110P41689P63558Q56385O60211J211862M18597J304034R42249J117788
16758B7081483N62683J722100J107424J370123J416636R49126J769664J979973
16750C7959212J507992J971754K248299K119840K003029K467164K883494K944674
16742E6105458K688028L399504L990363L086175L847194M589858M371197M759062
16734H6836839M962118N720281O138598N806000O373648O884770O777207P741944
16726A37241405P215535P477075P865087P292342O870382O675968N628825M864645
16718A91131264L993086K671383J611621m40670j515962k805649m184010n210004
$$ plain form
16710 185251059 178922901 171791316 164430896 156638530 148846636 140551498 132533526 125123112
16702 125123112 117340744 110060691 103443273 97158973 91235577 85546325 80526554 75614659
16694 75614659 71118152 66890221 62732261 59466281 56148106 53165898 49881729 47323824
16686 47323824 44862466 42285235 40432021 38356717 36543338 34674575 33101091 31514176
16678 31514176 30196685 28668463 27575377 26050208 24746029 24057272 23028329 21937551
16670 21937551 21302579 20562453 19890782 18893395 18022418 17344988 16496044 16389610 15947624
16661 15947624 14945424 14624924 13945480 13270724 13120516 12761117 12370761 11998990 11556532
16652 11556532 11481505 10891219 10262590 10195319 9833477 9550282 9462280 9198030 8750867 8590752
$$ packed form
16710A85251059o328158p131585p360420p792366p791894q295138q017972p410414
16702A25123112p782368p280053o617418o284300n923396n689252n019771m911895
16694G5614659m496507m227931m157960l265980l318175k982208l284169k557905
16686D7323824k461358k577231j853214k075304j813379j868763j573484j586915
16678C1514176j317491j528222j093086j525169j304179o88757j028943j090778
16670B1937551o34972p40126o71671r97387q70977o77430q48944j06434m41986
16661A5947624j002200l20500o79444o74756j50208l59399l90356l71771m42458
16652A1556532p5027n90286o28629o7271l61842k83195q8002k64250m47163j60115
$$ plain form
16642 8590752 8310560 7936107 8056893 7933293 7736450 7402013 7081397 6959308 6555998
16633 6555998 6731921 6750457 6258474 5848431 6306154 6387685 5966470 5566196 5308869 5187744
16623 5187744 5134395 5204837 5298787 4974205 4920789 4738032 4805943 4418812 4436114 4350713 4200468
16612 4200468 4509634 4093283 4106566 4082000 3664022 3802463 3286858 3367775 3393506 3457216
16602 3457216 3521478 3601176 3191780 3252739 3243183 3378592 3255518 2800336 2932110 3091793
16592 3091793 2872568 2545743 2576292 2834964 2399663 2854823 2746618 2300026 2240849 2552881
16582 2552881 2566772 2447148 2283820 2363626 2338733 2121100 2004755 1921287 2054927 2132914
16572 2132914 2163917 2389228 1857234 1948673 1846394 1917735 1731141 1673150 2054708 2035128
$$ packed form
16642H590752k80192l74453J20786j23600j96843l34437l20616j22089m03310
16633F555998J75923J8536m91983m10043M57723Q1531m21215m00274k57327j21125
16623E187744n3349P0442R3950l24582n3416j82757O7911l87131J7302q5401j50245
16612D200468L09166m16351J3283k4566m17978J38441n15605Q0917K5731O3710
16602C457216O4262P9698m09396O0959r556J35409j23074m55182J31774J59683
16592C091793k19225l26825L0549K58672m35301M55160j08205m46592n9177L12032
16582B552881J3891j19624j63328P9806k4893k17633j16345q3468J33640P7987
16572B132914L1003K25311n31994R1439j02279P1341j86594n7991L81558j9580
$$ plain form
16562 2035128 1778783 1888457 1857273 1733944 1343595 1356875 1740780 1712547 1620551 1648747
16552 1648747 1560205 1564357 1637241 1660116 1569968 1436182 1549071 1496616 1270593 1005623 1440826
16541 1440826 1348281 1401446 1588267 1291558 1309692 1025490 1070104 1545517 1106814 1264462
16531 1264462 1088383 1274196 1278939 911902 1018712 1167809 1184212 1250904 1107444 922315
16521 922315 1137506 1102894 1125594 985286 836256 1027508 751567 1075149 791963 942688
16511 942688 677604 620916 1004510 601286 834600 710828 903049 758623 730621 847632
16501 847632 847067 625208 634717 847795 657070 939960 770585 782270 542064 1011865 756364
16490 756364 597785 1215761 781377 470275 829324 625691 1008198 338095 535764 807045
$$ packed form
16562B035128k56345J09674l1184j23329l90349J3280L83905k8233r1996K8196
16552A648747q8542M152P2884K2875r0148j33786J12889n2455k26023k64970M35203
16541A440826r2545N3165J86821k96709J8134k84202M4614M75413m38703J57648
16531A264462j76079J85813M743l67037J06810J49097J6403O6692j43460j85129
16521I22315K15191l4612K2700j40308j49030J91252k75941L23582k83186J50725
16511I42688k65084n6688L83594m03224K33314j23772J92221j44426k8002J17011
16501H47632n65k21859R509K13078j90725K82890j69375J1685k40206M69801k55501
16490G56364j58579O17976m34384l11102L59049k03633L82507C38095J97669K71281
$$ plain form
16480 807045 638063 437220 591675 741827 761013 369900 748882 781663 490476 556029
16470 556029 442939 740426 443260 510971 511489 620141 284113 750386 573023 347012
16460 347012 348435 810639 526149 132066 583132 429050 418481 449135 237693 326401
16450 326401 439727 441781 661954 639592 335241 324393 616045 473359 972851 592593
16440 592593 333800 381097 569066 622657 110412 326386 334912 326604 574538 290724 455427
16429 455427 179908 195065 334684 49740 507208 669663 311840 83902 495410 489983
16419 489983 13857 313910 286217 169250 387488 132448 282059 251119 464853 293282
16409 293282 403931 471458 357898 331048 447535 27808 237411 302167 417327 320871
$$ packed form
16480H07045j68982k00843J54455J50152J9186C69900L78982L2781k91187O5553
16470E56029j13090K97487k97166O7711N18J08652B84113M66273j77363k26011
16460C47012J423M62204k84490A32066M51066j54082j0569L0654k11442Q8708
16450C26401J13326K054K20173k2362l04351j0848K91652j42686M99492l80258
16440E92593k58793M7297J87969N3591A10412K15974Q526q308K47934k83814J64703
16429D55427A79908J5157J39619D9740M57468J62455C11840H3902M11508n427
16419D89983A3857L00053k7693j16967K18238A32448J49611l0940K13734j71571
16409B93282J10649O7527j13560k6850J16487B7808K09603O4756J15160r6456
$$ plain form
16399 320871 2260 404756 -122066 69803 248524 45317 388244 201621 313601 614321
16389 614321 302525 -63594 356770 46999 37753 159924 157125 281522 -7090 223122 318488
16378 318488 161784 273059 166975 323122 38810 332608 415435 345895 370311 466642
16368 466642 248181 81058 310603 247813 247452 165236 163257 343256 53097 375473 148668
16356 515710 487801 311996 219063 211558 248162 41173 113335 332768 438608 158430 236404
16345 236404 249452 227449 -121914 214928 139892 -1335 271603 197820 7325 281809 265429
16334 265429 107823 131861 -153736 -103059 189932 -938 363726 92994 153299 417286 248299
16323 248299 26270 558216 432793 -183894 18166 30825 117064 28456 36654 105708 143360
$$ packed form
16399C20871B260M02496a22066F9803J78721D5317L42927j86623J11980L00720
16389F14321C02525f3594C56770D6999r246J22171k799J24397g090B23122R5366
16378C18488j56704J11275j06084J56147C8810K93798Q2827o9540K4416R6331
16368D66642k18461H1058K29545o2790l61q2216j979J79999E3097L22376A48668
16356E15710k7909j75805r2933p505L6604D1173P2162K19433J05840A58430P7974
16345B36404J3048k2003a21914B14928p5036a335B71603p3783G325K74484j6380
16334B65429A07823K4038a53736N0677A89932i38C63726I2994O0305K63987j68987
16323B48299B6270N31946j25423a83894A8166J2659Q6239B8456Q198O9054L7652
$$ plain form
16312 143360 202167 92417 307707 293492 94976 404969 345848 188388 159706 77704 162518
16301 162518 55375 -98566 144236 -107650 -37747 196264 -29877 165880 36932 92844 275154
16290 275154 36029 176343 120239 233552 82714 -146630 140815 164127 92637 -101948
16279 112782 408108 268350 191517 -150678 244043 166498 260531 244566 270630 223614 191730
16268 191730 162895 141700 -92003 -64023 142744 130182 173156 26717 62589 16777 92968
16257 92968 50065 75118 10886 237654 -553803 29327 260086 -141033 82366 156206 71724
16245 438141 -354142 3019 132544 125556 95127 -15784 -9506 202173 56458 149981 -129822
16233 8338 -47016 195395 283595 147128 57113 135518 230899 -43469 349466 -151580 -59856
$$ packed form
16312A43360N8807I2417K15290j4215I4976L09993n9121j57460k8682G7704Q4814
16301A62518E5375i8566A44236a07650c7747A96264b9877A65880C6932N5912J82310
16290B75154C6029J40314n6104J13313H2714a46630A40815K3312p1490a01948
16279A12782K95326j39758p6833a50678B44043p7545R4033j5965K6064m7016l1884
16268A91730k8835k1195i2003K7980A42744j2562M2974B6717L5872A6777P6191
16257I2968m2903K5053A0886K26768e53803B9327K30759a41033H2366P3840G1724
16245D38141c54142C019J29525o988l0429a5784O278B02173E6458R3523a29822
16233H338d7016A95395Q8200j36467E7113P8405R5381d3469C49466a51580e9856
$$ plain form
16221 177847 30722 -128029 32006 -198016 -15860 -268399 254689 231326 234918 233186 -75884
16209 -45894 -263335 -122841 177404 -26774 -277182 198819 319001 -15753 -83942 -66551
16199 -66551 174233 -138787 127005 348796 412533 230937 55875 56763 -58295 183876 61371
16187 29784 111492 -182174 33001 -245744 -11564 -381271 -16205 165281 -26720 426885 -134092
16175 61500 63064 326719 72495 -167888 -101843 -150858 -118045 153239 -140348 -16847 153082
16163 -47682 -108148 259522 -185079 -106522 -134126 247070 -111600 -36319 96178 90054 208730
16152 208730 -150054 297943 -106203 41456 123200 -31011 59950 -190326 95927 -261992
16141 -102067 401486 -148187 -65040 98591 -75429 103941 162038 -92422 -338209 -135948
$$ packed form
16221A77847C0722a28029C2006a98016a5860k52539B54689k3363L592j732g5884
16209d5894k17441a22841A77404b6774k50408A98819J20182a5753o8189J7391
16199f6551A74233a38787A27005K21791O3737j81596E5875Q88e8295A83876F1371
16187B9784Q1708a82174C3001b45744a1564l69707a6205A65281b6720D26885a34092
16175F1500J564K63655G2495a67888O6045m9015L2813A53239a40348a6847A53082
16163d7682o0466B59522a85079P8557k7604B47070a11600c6319I6178o124J18676
16152B08730a50054B97943a06203D1456Q1744c1011E9950a90326I5927b61992
16141a02067D01486a48187f5040I8591g5429A03941N8097i2422k45787a35948
$$ plain form
16130 24876 210466 131154 -115079 -12840 -90247 105408 31695 -12990 -100037 -447685 -103982
16118 -219925 43326 -65588 -212249 -255983 235240 -80039 173254 69038 -168053 -76568 119753
16106 -28258 -89551 -240361 22901 56397 206470 251537 125573 312869 176205 111622 -16844
16094 -1697 187815 -338906 -140322 20472 -99517 104447 31863 96912 -132772 -4215 -125953
16083 -125953 3809 374253 -225430 76477 -296135 73423 -102317 116675 -99152 -149924 203924
16071 -104676 -2521 -111025 233944 -191465 -192243 -99619 46208 -167293 -88740 22090 -130297
16059 360103 133937 -89701 -340351 -235124 95592 -97955 -6664 31365 -134446 88655 148822
16048 148822 146518 -74414 45511 94283 -183108 -930 132947 -180797 216923 132651 99748
$$ packed form
16130B4876J85590p9312a15079a2840p7407A05408C1695a2990q7047l47648a03982
16118b19925D3326f5588j46661m3734B35240h0039A73254F9038a68053g6568A19753
16106b8258o1293j50810B2901L3496J50073M5067A25573J87296j36664o4583a6844
16094a697A87815c38906a40322B0472i9517A04447C1863O5049a32772d215j21738
16083a25953C809L70444b25430G6477b96135G3423a02317A16675i9152n0772B03924
16071a04676b521j08504B33944a91465p78R2624D6208a67293P8553B2090a30297
16059C60103A33937h9701k50650J05227I5592i7955f664C1365a34446H8655O0167
16048A48822k304g4414D5511M8772a83108i30A32947a80797B16923q4272l2903
$$ plain form
16037 99748 127436 -28749 10325 -59894 -213780 -218862 -91492 71473 23813 -173456 132649
16025 -473595 -213715 19014 -348157 -172049 36732 -10947 -223484 -91953 129880 -81103
16014 -125506 275849 -7158 -66010 -75667 -130157 -2467 28702 -193085 118445 -75558 101785
16002 12850 -353520 -122413 124292 12256 101658 -96089 -65573 -93606 98798 -122830 28386
15990 -247629 268401 -176717 -142652 -11032 -96087 -102991 159001 -18790 622001 314389 396785
15979 396785 155431 177089 254773 -64484 -9432 -198579 -246245 134043 -341811 57185 -186037
15967 -65496 104309 30934 -85958 125222 -153082 193447 -260334 -125678 467373 98005
15956 -67326 -194725 94835 35636 -119148 98807 16266 -93414 -200921 -199342 -81330 35372
$$ packed form
16037I9748K7688b8749A0325e9894j53886n082i1492G1473B3813a73456A32649
16025d73595b13715A9014c48157a72049C6732a0947k12537i1953A29880h1103
16014a25506B75849g158n8852r657n4490b467B8702a93085A18445g5558A01785
16002A2850c53520a22413A24292A2256Q9402i6089L0516k8033I8798a22830B8386
15990b47629B68401a76717L4065a1032q5055o904A59001a8790F22001l07612Q2396
15979C96785A55431K1658P7684f4484i432j89147m7666A34043c41811E7185a86037
15967f5496A04309C0934h5958A25222a53082A93447b60334a25678D67373I8005
15956f7326j27399I4835C5636a19148I8807A6266i3414j07507J579h1330C5372
$$ plain form
15944 -20987 -148515 -133689 -172367 -92289 27018 -4658 -126713 -4744 194381 -180204 -390524
15933 -390524 -105026 -216486 343991 -40998 -48084 55926 -273976 211111 -60248 98776 108934
15922 108934 138519 -174780 -202939 105075 22897 -239363 171760 53284 -67305 100426
15911 176053 -8442 -172197 -253198 -150065 -239936 -15682 -301745 17951 595 -111578 56678
15899 -172592 -36618 -42538 -166070 -76070 -18782 -131729 221070 65289 -73812 -272305 88486
15887 -60052 15365 343026 114587 -78842 40704 -324717 561 -136409 -232717 223821 -412445
15875 -174395 73472 121103 -192911 -74913 18283 -173776 -185791 213758 -210534 -35480 -298614
15864 -298614 -165974 -158550 291431 -425190 38438 -15665 286927 -309497 65913 12891 172888
$$ packed form
15944b0987j27528J4826l8678Q0078B7018d658j22055d744A94381a80204k10320
15933c90524a05026j11460C43991d0998p086E5926b73976B11111f0248I8776J0158
15922A08934K9585a74780k8159A05075B2897b39363A71760E3284f7305A00426
15911A76053h442j63755q1001J03133q9871a5682k86063A7951E95a11578E6678
15899a72592c6618n920j23532g6070a8782j12947B21070F5289g3812j98493H8486
15887f0052A5365L27661A14587g8842D0704c24717E61a36409r6308B23821d12445
15875a74395G3472M7631a92911g4913A8283a73776j2015B13758b10534c5480k63134
15864b98614J32640P424B91431d25190C8438a5665B86927c09497F5913A2891J59997
$$ plain form
15853 172888 -15691 -49467 15700 -23310 20404 -211317 56221 -53732 -209137 -332761 67217
15841 28496 -153019 -76876 -74257 227359 -243672 -43290 271298 -134687 400779 -32700 -144523
15830 -144523 128401 75878 -62484 -202407 -300693 62332 -35454 -284222 -4584 1133 121555
15819 121555 -243689 130086 -136547 -245148 213296 22475 -44681 136910 270 -472836
15808 -266171 -23869 282554 -179922 -439506 -118425 -9839 67537 -34227 341846 210014
15798 210014 -373799 182564 -119467 -65389 -71801 287478 210473 164994 19312 -432651 -245653
15787 -245653 56856 97133 145146 35265 -37872 72600 157444 131307 264268 119449 37560
15775 -265549 125950 111994 -186429 -200948 -192138 142112 -241817 254940 -428981 -195314
$$ packed form
15853A72888a5691l3776A5700b3310B0404b11317E6221e3732j55405j23624F7217
15841B8496a53019P6143K619B27359b43672d3290B71298a34687D00779c2700j11823
15830a44523A28401n2523f2484j39923r8286F2332c5454k48768d584A133J20422
15819A21555b43689A30086a36547j08601B13296B2475d4681A36910B70d72836
15808b66171b3869B82554a79922k59584a18425i839F7537c4227C41846j31832
15798B10014c73799A82564a19467N4078o412B87478p7005m5479A9312d32651J86998
15787b45653E6856M0277M8013C5265c7872G2600Q4844k6137J32961A19449C7560
15775b65549A25950j3956a86429j4519Q810A42112b41817B54940d28981a95314
$$ plain form
15764 31706 -7406 77908 91998 128203 53196 231289 -60161 15750 171905 -265105 50899
15752 -373138 -8457 82115 -155276 -228772 147309 25247 -236209 -27565 54645 308149 -37191
15740 -135380 73766 -48349 342258 150180 -248862 119281 104609 53278 83321 -133294
15729 72020 317750 -67177 35491 151536 -411757 -336108 -163977 -266958 1890 49069 -262199
15717 -322328 -266259 232303 77985 103343 -457145 45739 -116174 73080 -484444 -336509
15707 -336509 139738 -429 72556 -30564 -41290 328748 -4199 -53160 99952 -224183 -13899
15695 20827 65197 -102934 408801 308656 229960 322763 293374 -117273 -273478 -129282
15684 -54216 9923 -53402 -513802 -423001 -175501 -188323 -151187 -97359 241027 -131217 115401
$$ packed form
15764C1706g406G7908J4090L6205E3196J78093f0161A5750J56155b65105E0899
15752c73138h457H2115a55276p3496A47309B5247b36209b7565E4645K53504c7191
15740a35380G3766d8349C42258A50180b48862A19281j4672n1331L0043a33294
15729G2020K45730f7177C5491J16045d11757P5649a63977j02981A890M7179b62199
15717c22328N6069B32303G7985K5358d57145D5739a16174G3080d84444J47935
15707c36509A39738d29G2556c0564j0726C28748d199m8961I9952b24183a3899
15695B0827M4370a02934D08801j00145p8696R2803k9389a17273j56205a29282
15684e4216I923e3402m60400R0801a75501j2822L7136N3828B41027a31217A15401
$$ plain form
15672 -180577 33090 163513 -145696 -97894 -260177 21712 -284259 -1996 -129318 -258865
15662 -258865 -186038 -171084 -179479 -56107 -57642 -37090 28865 3429 74410 -112955 -127414 -20395
15649 -43414 125987 -165739 -36329 -128428 43797 -396781 -46518 -26853 -149553 -337627 -50594
15637 -256325 8380 117932 -112555 -14347 58430 -1660 147473 156054 312531 240894 2418
15625 -27166 -249025 249890 1546 -83146 48624 -371798 -201856 28689 -110342 -55483 -452962
15614 -452962 -270380 106032 -138302 -12011 410789 -88371 -344641 -37392 -56482 -291587
15604 -291587 -377025 -284532 -237287 62862 -222643 -149066 -227922 53835 -89974 -139069 81551
15592 -131103 -345160 72093 -9321 -98725 98345 108695 131123 -144965 -22943 90961 40202
$$ packed form
15672a80577C3090J30423a45696M7802j62283B1712b84259a996j27322j29547
15662b58865P2827J4954q395e6107j535K0552B8865C429P0981a12955j4459b0395
15649d3414A25987a65739c6329r2099D3797c96781d6518J9665j22700j88074e0594
15637b56325H380J09552a12555a4347E8430a660A47473Q581J56477p1637B418
15625b7166k21859B49890A546h3146D8624c71798J69942B8689a10342N4859l97479
15614d52962J82582A06032a38302a2011D10789h8371k56270c7392j9090k35105
15604b91587q5438R2493M7245F2862b22643P3577p8856E3835h9974m9095H1551
15592a31103k14057G2093i321q9404I8345J0350K2428a44965b2943I0961D0202
$$ plain form
15580 -197624 76693 -17527 -144929 -28043 217999 -136029 -284140 246106 -114235 -464064
15570 -464064 -39603 449208 -1754 306922 -61493 280389 5106 257452 -123213 276888 252538
15559 252538 -83431 198002 198910 -65769 137201 -175180 -17502 155194 -287672 -14850 -43743
15548 -43743 -34721 58714 21385 15821 -235386 114914 -191636 74045 256187 -77215 80405
15536 10821 177951 -15776 193080 -66962 152374 -46079 110475 122458 -301379 -160225
15526 -160225 -165138 306612 -203642 -142916 -200018 178897 -6411 166870 215913 214687 -4201
15514 98366 -30752 -73123 303043 297769 186237 -152693 -18801 116511 194842 267843 136838
15503 136838 -395086 268969 -257845 -107400 44509 -41124 -50605 -15083 -3198 -230273 -137703
$$ packed form
15580a97624G6693a7527j27402b8043B17999a36029j48111B46106a14235l49829
15570d64064c9603D49208a754C06922f1493B80389E106K52346a23213B76888k4350
15559B52538h3431A98002R08f5769A37201a75180a7502A55194b87672a4850k8893
15548d3743R022E8714B1385n564b35386A14914a91636G4045J82142g7215H0405
15536A0821J67130a5776A93080f6962A52374d6079A10475J1983c01379J41154
15526a60225m913C06612b03642O0726n7102A78897f411A66870M9043j226d201
15514I8366c0752m2371C03043n274j11532a52693a8801A16511P8331P3001j31005
15503A36838c95086B68969b57845a07400D4509d1124r481a5083c198k27075R2570
$$ plain form
15492 -137703 43938 -76316 -178004 91045 -292467 93505 32911 -74276 -314040 236005 -32331
15480 42488 316032 132250 -259149 132179 -56498 41028 -128847 23601 34568 26457 -299554
15468 -43629 -366435 159807 -20064 -95313 50144 53319 -346594 -66145 -198984 414646 53158
15456 254438 128636 207139 -117912 228334 -208814 -215503 -66305 114594 -39887 149079
15445 -135672 308156 247147 -99762 -383086 122004 -287042 299028 -39360 -174700 20908
15434 -85366 151947 -9759 -29716 252563 -88091 195543 -184682 202970 -50517 70918 -147475
15422 -220097 -176882 22637 -262322 -132328 -204052 39501 331504 28758 52316 -131685 36717
15410 112545 -63291 -95982 63197 201918 -354020 259501 306296 213765 316292 -122325
$$ packed form
15492a37703D3938g6316j01688I1045b92467I3505C2911g4276k39764B36005c2331
15480D2488K73544A32250b59149A32179e6498D1028a28847B3601J0967q111b99554
15468d3629l22806A59807b0064p5249E0144L175c46594f6145j32839D14646E3158
15456B54438j25802P8503a17912B28334b08814o689f6305A14594c9887A49079
15445a35672C08156o1009i9762k83324A22004b87042B99028c9360j35340B0908
15434h5366A51947i759j9957B52563h8091A95543a84682B02970e0517G0918a47475
15422b20097M3215B2637b62322J29994p1724C9501K92003B8758K3558a31685C6717
15410A12545f3291l2691F3197J38721c54020B59501M6795r2531J02527a22325
$$ plain form
15399 171113 152231 -307936 -36412 -9319 -11324 -170786 221791 -379801 105450 -242482 -159978
15388 -159978 37436 -230721 -190212 71379 -76257 120803 -160331 -178812 77360 85697 -222329
15376 -139924 257511 44983 -30732 175176 105921 40760 135149 33495 81960 322514 -16956
15364 -308676 80512 112900 113710 159645 -340633 -256890 5688 89037 135678 -140028 89935 -309206
15351 158136 -3146 -229319 -100868 81232 110905 217070 147911 5953 -146055 -64209 -169076
15340 -169076 179849 113016 -133765 170690 238137 246079 40524 74210 292371 51997 156022
15329 156022 -137678 -118300 33549 -98490 40402 -86245 -244638 65038 79916 7254 -78606
15317 74277 8207 213000 -146573 174576 473850 132893 -65251 251537 130243 -74138
$$ packed form
15399A71113j8882c07936c6412i319k005j59462B21791c79801A05450b42482Q2504
15388a59978C7436b30721M0509G1379g6257A20803a60331j8481G7360Q337b22329
15376a39924B57511D4983c0732A75176o9255D0760R4389C3495M8465K40554a6956
15364c08676H0512L2388Q10M5935c40633Q3743E688Q3349M6641a40028H9935c09206
15351A58136c146k26173a00868H1232K9673J06165o9159E953a46055f4209j04867
15340a69076A79849o6833a33765A70690O7447P942D0524L3686K18161E1997J04025
15329A56022a37678J9378C3549i8490D0402h6245j58393F5038J4878G254g8606
15317G4277H207K04793a46573A74576K99274A32893f5251B51537j21294g4138
$$ plain form
15306 -4077 302029 -163491 -74186 -205355 -206148 -16197 111084 12530 22841 461522 -231934
15294 28461 72450 37010 -30880 -171279 -80046 -90529 -357369 180935 -158343 -92038 -31054
15282 202119 -32645 -240814 393143 313123 -39343 279154 330099 -134083 167409 68912
15271 -38781 92469 104860 -119899 266098 -133708 114936 -3989 182736 149997 193040 122848
15260 122848 244882 -6108 -125982 189954 268365 132853 -184668 26851 141776 301393
15250 301393 107311 449320 175383 699779 939003 1671170 1483064 1579414 1080196 357177
15239 640238 11451 -123782 151776 -111299 -145899 -123971 176425 8854 -337729 295479
15228 112430 -96136 197520 -48450 116054 -278480 13038 216730 369826 -22094 315671
$$ packed form
15306d077C02029a63491g4186j31169p93a6197A11084A2530J0311M38681b31934
15294B8461M3989l5440c0880j40399h0046j0483k66840A80935a58343O6305c1054
15282B02119c2645k08169C93143q0020c9343B79154N0945a34083A67409F8912
15271c8781I2469J2391a19899B66098a33708A14936c989A82736l2739M3043p0192
15260A22848J22034f108j19874A89954P8411A32853a84668B6851J14925J59617
15250C01393A07311L42009A75383N24396K39224P32167j88106R6350m99218C57177
15239F40238A1451a23782A51776a11299l4600K1928A76425H854c37729B95479
15228A12430i6136A97520d8450A16054b78480A3038K03692J53096b2094C15671
$$ plain form
15217 331421 246250 19381 154142 -239805 337424 132109 -19537 -96124 38178 -26178 -162701
15206 -162701 -37131 171616 210060 38142 378872 -106080 -137595 -189852 424246 23492 50456
15195 50456 282185 135621 251739 -6422 60978 -80099 332338 -32978 8195 236177 110087
15183 187315 27226 -62191 -130111 -63885 147899 -118907 -154009 182797 201561 -63839 -44113
15172 -44113 -29554 11669 -77775 179662 -233935 204104 43957 23337 292429 83513 74466
15161 74466 187348 36405 -6010 -33861 197035 -18462 -55396 1645 96889 52834 131690 -31646
15148 -110929 171538 -42098 -56775 -160968 447186 391716 18983 141514 -175834 19762
15137 3286 101736 -12654 -55175 -38828 344486 -107254 163332 220151 305418 222150 -94096
$$ packed form
15217C31421q5171A9381J34761b39805C37424A32109a9537p6587C8178b6178j36523
15206a62701c7131A71616L8444C8142L40730a06080l1515n2257D24246B3492K6964
15195E0456K31729A35621J16118f422F0978h0099C32338c2978H195K27982A10087
15183A87315B7226f2191o7920f3885A47899a18907l5102A82797J8764f3839J9726
15172d4113J4559A1669g7775A79662b33935B04104D3957k0620K69092H3513r047
15161G4466J12882C6405f010k7851A97035a8462l6934A645R5244m4055P8856c1646
15148a10929A71538d2098j4677j04193D47186n5470A8983J22531a75834A9762
15137C286R8450a2654m2521J6347C44486a07254A63332N6819Q5267q3268i4096
$$ plain form
15125 -56159 3907 478793 304434 16263 -79320 205853 63527 109943 214988 -96462 105507
15113 137154 93748 141596 -30531 79226 -232846 157545 -278614 -96041 378264 536735
15103 536735 304610 -10909 115015 -17832 114044 125498 -62680 99142 336349 218468
15093 218468 300860 112816 27325 -69180 158888 -18192 215761 62657 145216 98918 -6274
15081 189212 -114560 372058 -45200 224737 321793 242401 102085 290039 476149 -70401
15070 64768 150547 -57173 45233 240998 233267 286055 426575 63218 248485 253200 110488
15058 150219 151726 231980 -138660 119737 139963 -66554 17052 94280 208333 62680 385189
15047 385189 42755 268385 100197 275441 -170279 319976 -66624 303580 373552 -21576
$$ packed form
15125e6159C907M74886j74359A6263g9320B05853F3527M6416J05045i6462A05507
15113A37154m3406M7848c0531G9226b32846A57545b78614i6041C78264J58471
15103E36735k32125a0909A15015a7832A14044J1454f2680I9142K37207j17881
15093B18468Q2392A12816B7325f9180A58888a8192B15761F2657Q2559m6298f274
15081A89212a14560C72058d5200B24737R7056p9392A02085J87954J86110g0401
15070F4768Q5779e7173D5233J95765p731N2788J40520F3218J85267M715A10488
15058A50219J507Q0254a38660A19737K0226f6554A7052P7228J14053F2680L22509
15047C85189D2755K25630A00197J75244a70279C19976f6624C03580O9972b1576
$$ plain form
15036 -113905 317822 -164606 -58462 -49943 232301 277676 53349 275197 142650 320954
15026 320954 56309 -135700 159412 230472 259600 151584 84085 333801 61628 157623 98502
15015 98502 -27171 399735 312957 132947 328687 -110487 -81052 192544 67904 -123911
15004 163690 -78885 438776 328449 184058 -618 173440 130006 521744 124784 271195
14994 271195 31621 357566 509962 242285 297805 192773 43632 279120 405632 236378
14984 236378 259067 231210 188931 550089 133195 482891 -11929 396010 178271 216384
14974 216384 -19106 80086 -33596 142503 363080 254714 323781 -215941 40780 292103
14964 292103 544634 361823 78647 -57657 308996 171473 371874 259805 286620 380750
$$ packed form
15036a13905C17822a64606e8462Q519B32301M5375E3349K21848j32547J78304
15026C20954E6309a35700A59412P1060K9128j08016o7499K49716F1628R5995n9121
15015I8502b7171C99735q6778A32947J95740a10487K9435A92544F7904a23911
15004A63690g8885D38776j10327j44391f18A73440m3434L91738A24784J46411
14994B71195C1621L25945J52396B42285N5520j05032D3632K35488J26512j69254
14984B36378K2689k7857m2279L61158A33195L49696a1929C96010A78271L8113
14974B16384a9106H0086c3596A42503K20577j08366O9067b15941D0780K51323
14964B92103K52531j82811G8647e7657C08996j37523K00401j12069K6815R4130
$$ plain form
14954 380750 462429 272436 413996 -23920 476216 106364 342262 -138436 127002 333025
14944 333025 658518 427274 181227 209241 350730 186018 589362 147111 326154 418536
14934 418536 122186 466247 528192 442199 116531 7627 290667 240835 169854 368320 131564
14922 153826 407277 486686 367823 76193 178026 321679 260477 412228 193595 372356
14912 372356 192153 300218 169126 50977 406152 63816 708750 190320 -159240 250102
14901 297309 390567 427336 237956 181425 307099 82552 202686 480193 418998 289055
14891 289055 282078 530385 228634 23948 626369 431515 420698 297665 180562 286526
14881 286526 436769 458264 304543 388047 208490 346129 693357 190200 519380 453427
$$ packed form
14954C80750Q1679j89993J41560b3920D76216A06364K35898a38436A27002K06023
14944C33025L25493k31244A81227K8014J41489j64712M03344A47111J79043R2382
14934D18536A22186L44061O1945q5993A16531G627K83040m9832p0981J98466A31564
14922A53826K53451P9409j18863G6193J01833J43653o1202J51751A93595J78761
14912C72356j80203J08065j31092E0977L55175F3816O44934A90320a59240B50102
14901B97309R3258L6769j89380n6531J25674H2552J20134K77507o1195j29943
14891B89055o977K48307B28634B3948O02421j94854j0817j23033j17103J05964
14881B86526J50243K1495j53721Q3504j79557J37639L47228A90200L29180o5953
$$ plain form
14871 453427 404694 164346 72950 108991 248666 186869 273233 314587 612648 805330 307406
14859 394806 421301 606916 52128 137395 576064 442154 770248 725001 253541 242955
14849 242955 565207 320814 252628 365929 300372 178897 203328 420301 248751 537310
14839 537310 507316 195575 343636 396341 767664 359975 590486 551451 297404 558976
14829 558976 239595 358197 717659 478551 551064 272891 314788 722626 400121 256005
14819 256005 403304 591745 756726 211704 394435 229610 344233 498739 818227 557571
14809 557571 679052 649552 131252 557443 556164 636502 558982 518838 500459 852500 572281
14798 572281 253413 916093 496782 672296 714040 255267 673698 584058 352634 631064
$$ packed form
14871D53427m8733A64346G2950L6041J39675o1797Q6364M1354K98061J92682C07406
14859C94806K6495J85615E2128Q5267M38669j33910L28094m5247B53541j0586
14849B42955L22252k44393o8186J13301o5557j21475K4431K16973j71550K88559
14839E37310k9994A95575J48061N2705L71323C59975K30511l9035k54047K61572
14829E58976B39595J18602L59462k39108P2513B72891M1897M07838l22505j44116
14819B56005J47299J88441J64981B11704J82731j64825J14623J54506L19488k60656
14809E57571J21481k9500A31252M26191j279Q0338p7520m0144j8379L52041k80219
14798E72281B53413O62680m19311J75514M1744B55267M18431q9640k31424K78430
$$ plain form
14788 631064 459102 540076 497927 422626 581907 123079 713847 899498 601851 807062
14778 807062 709890 817285 632403 604007 701290 230078 422016 591080 461239 518082
14768 518082 610610 426651 389087 818305 820654 799681 869052 454062 717793 566514 540592
14757 540592 830670 852355 785866 929789 787711 328892 671790 611797 731084 780961
14747 780961 711771 492114 692363 456045 680265 492485 671238 763056 733302 544623
14737 544623 1004811 340109 714412 641529 962092 614302 693516 700273 694744 646796 831418
14726 831418 1023455 779392 523422 714568 743156 623813 853350 777058 790618 775439
14716 775439 1175030 795933 880130 856335 813997 872344 695349 803819 840033 882878 484879
$$ packed form
14788F31064j71962Q0974m2149p5301J59281A23079N90768J85651k97647K05211
14778H07062r7172J07395j84882k8396R7283B30078J91938J69064j29841N6843
14768E18082R2528j83959l7564M29218K349k0973O9371m14990K63731j51279k5922
14757E40592K90078K1685o6489J43923j42078C28892L42898n9993J19287M9877
14747G80961o9190k19657K00249k36318K24220j87780J78753R1818k9754j88679
14737E44623M60188C40109L74303p2883L20563l47790P9214O757n529m7948J84622
14726H31418J92037k44063k55970J91146K8588j19343K29537p6292J3560j5179
14716G75439L99591l79097Q4197k3795m2338N8347j76995J08470L6214M2845l97999
$$ plain form
14705 484879 518112 806557 647742 1010980 612950 653471 687287 704042 1169286 811702
14695 811702 983665 951381 804737 808376 990453 1010950 966463 968750 916984 1104764 502104
14683 584289 1063016 819207 1066669 854378 382928 988670 1276557 1041497 982265 1160858
14673 1160858 860113 913599 850050 836342 888164 939037 873054 1231459 780381 997993
14663 997993 1133995 1281404 1064725 1020242 1109355 1189447 1003100 1127377 1149305 1229297
14653 1229297 1217582 1059912 1473793 1564988 1166650 1399746 1210375 1424227 1138002 1126819
14643 1126819 1234197 1152610 1436859 1102573 1387043 1091257 1437492 1698189 1103099 1213098
14633 1213098 1156354 1089804 1258967 1377685 1429248 1395409 1162864 1121409 1571620 1344913
$$ packed form
14705D84879L3233K88445j58815L63238l98030M0521L3816J6755M65244l57584
14695H11702J71963l2284j46644L639J82077K0497m4487K287n1766J87780E02104
14683E84289M78727k43809K47462k12291C82928O05742K87887k35060n9232J78593
14673A160858l00745N3486o3549j3708N1822N0873o5983L58405m51078K17612
14663I97993J36002J47409k16679m4483Q9113Q0092j86347J24277K1928P9992
14653A229297j1715j57670M13881R1195l98338K33096j89371K13852k86225j1183
14643A126819J07378q1587K84249l34286K84470k95786L46235K60697n95090J09999
14633A213098n6744o6550J69163J18718N1563l3839k32545m1455M50211k26707
$$ plain form
14623 1344913 1585834 942501 1287161 1215063 1401225 1440265 1376889 1607736 1786355 1527162
14613 1527162 1637341 1520831 1647911 1555698 1632367 1262879 1473336 1431396 1202549 1701450
14603 1701450 1848660 1841735 1485025 1409093 1674912 1475024 1646797 1564493 1858527 1817140
14593 1817140 1688795 1757868 1634990 1599203 1762356 1885124 1871727 1678943 2173528 2101458
14583 2101458 1888347 1892737 2104808 1973784 2346937 1952176 1924904 2181759 1768507 2289530
14573 2289530 1978018 2211810 2172617 2125637 2181208 2492843 2192948 2260297 2580101 2762181
14563 2762181 2644387 2703159 2705948 2482033 2977139 2942104 3163901 3334543 3519661 3508912
14553 3508912 3688315 4296270 5162226 6461560 7637545 11278198 19443529 35785721
$$ packed form
14623A344913K40921o43333L44660p2098J86162L9040o3376K30847J78619k59193
14613A527162J10179j16510J27080r2213P6669l69488K10457m1940k28847M98901
14603A701450J47210o925l56710p5932K65819j99888J71773q2304K94034m1387
14593A817140j28345O9073j22878l5787J63153J22768j3397j92784M94585p2070
14583B101458k13111M390K12071j31024L73153l94761k7272K56855m13252N21023
14573B289530l11512K33792l9193m6980N5571L11635k99895O7349L19804J82080
14563B762181j17794N8772K789k23915M95106l5035K21797J70642J85118j0749
14553C508912J79403O07955Q65956J299334J175985L640653Q165331J6342192
$$ plain form
14545 35785721 49908922 20269774 7894993 5284695 5842395 3243160 2347835 2322190
14537 2322190 1976210 1851609 2231350 2061932 1976411 2156518 2303932 2106245 2271021 1940965
14527 1940965 2061724 2345087 2308630 2028948 2597246 2264644 2341469 2552807 2322818 2601926
14517 2601926 2738170 2683828 2598477 2789630 2629981 2447755 2767048 2910143 2870086 2371614
14507 2371614 2540932 2980478 2599137 2958888 2997399 2982883 2953760 3023755 3241066 3403444
14497 3403444 3319948 3147971 3245084 3356503 3317687 3322579 3740708 3507354 3502954 3706112 3463792
14486 3463792 3565057 3498011 3586907 3726613 3438124 4067577 3571038 3742397 4039177 3969990
14476 3969990 4016016 4175191 3997952 3792202 3999235 4342160 4282588 4402620 4389394 4393243
$$ packed form
14545C5785721J4123201B0269774G894993k610298N57700k599235q95325k5645
14537B322190l45980j24601L79741j69418q5521J80107J47414j97687J64776l30056
14527A940965J20759K83363l6457k79682N68298l32602P6825K11338k29989K79108
14517B601926J36244n4342q5351J91153j59649j82226L19293J43095m0057m98472
14507B371614J69318M39546l81341L59751L8511j4516k9123O9995K17311J62378
14497C403444q3496j71977R7113J11419l8816M892M18129k33354m400K03158k42320
14486C463792J01265o7046Q8896J39706k88489O29453m96539J71359K96780o9187
14476C969990M6026J59175j77239k05750K07033L42925n9572J20032j3226L849
$$ plain form
14466 4393243 4686105 4520333 4418017 4240627 4508288 4622263 4965777 4667041 4675260 5116445
14456 5116445 5093189 5030024 5075657 5078801 4937978 5254929 5733456 5233749 5216765 5700956
14446 5700956 5671896 6035185 5896057 6050402 6074144 5932124 5732873 6016895 6418735 6548858
14436 6548858 6874584 6324834 6409652 6592121 6441221 6839862 6984844 6732373 7172866 6929302
14426 6929302 7235793 7475075 7833005 7652872 7603230 7473174 8030106 7548957 8381517 8246441
14416 8246441 8651589 8751346 8477883 9032784 8841029 9042682 9214918 9443628 9504553 9480959
14406 9480959 9684858 9672942 9785160 9856978 10265326 10408054 10823416 10673220 11293351 11306120
14396 11306120 11498355 11837127 11430761 11814872 12116096 12271188 12608406 12592072 13137892
$$ packed form
14466D393243K92862j65772j02316j77390K67661J13975L43514k98736Q219M41185
14456E116445k3256o3165M5633L144j40823L16951M78527m99707j6984M84191
14446E700956k9060L63289j39128J54345K3742j42020j99251K84022M01840J30123
14436F548858L25726n49750Q4818J82469j50900L98641J44982k52471M40493k43564
14426F929302L06491K39282L57930j80133m9642j30056N56932m81149Q32560j35076
14416H246441M05148R9757k73463N54901j91755K01653J72236K28710O0925k3594
14406I480959K03899j1916J12218P1818M08348J42728M15362j50196O20131J2769
14396A1306120J92235L38772m06366L84111L01224J55092L37218j6334N45820
$$ plain form
14387 13137892 12981918 13438020 13283573 13935507 14111951 14308399 14488352 14930952 15278301
14378 15278301 15552789 15811333 15863137 16377220 16387032 16851835 17587398 17925382 17994170 18198754
14368 18198754 18798135 19006114 19752003 19949984 20234649 20798191 21324063 21612726 22348151
14359 22348151 22779527 23303734 23893381 24675466 25142198 25458171 25987837 26543370 27440102
14350 27440102 28029561 28506375 29283727 30241844 31016012 32008289 32666937 33736931 34678983
14341 34678983 35443310 36566233 37561581 38231569 39577610 40807018 41913777 43080657
14333 43080657 44304950 45495784 46824057 48471607 49999134 51683269 53117593 54765244
14325 54765244 56718056 58641734 60485456 62852030 65000025 66878366 69598911 72199335
$$ packed form
14387A3137892j55974M56102j54447O51934J76444J96448J79953M42600L47349
14378A5278301K74488K58544N1804N14083R812M64803P35563L37984O8788K04584
14368A8198754N99381K07979P45889J97981K84665N63542N25872K88663P35425
14359B2348151M31376N24207N89647P82085M66732L15973N29666N55533Q96732
14350B7440102N89459M76814P77352R58117P74168R92277O58648J069994R42052
14341C4678983P64327J122923R95348O69988J346041J229408J106759J166880
14333D3080657J224293J190834J328273J647550J527527J684135J434324J647651
14325E4765244J952812J923678J843722K366574K147995J878341K720545K600424
$$ plain form
14317 72199335 74952025 78053691 80711449 83948699 86907374 90918427 94547031 98732136
14309 98732136 102799777 106753615 111736929 116318269 121530490 127184335 132723856 138694303
14301 138694303 144339645 151177231 158341694 165680514 173480675 181796044 190652000 200120454
14293 200120454 209956648 220284565 231084969 242303290 254158113 265955510 278938237
14286 278938237 292098269 305765699 319677174 334228837 348658092 363220937 377432541
14279 377432541 391879286 405740849 419034238 431148580 441969172 450857012 457806616
14272 457806616 463080887 464617447 465621413 467402817 464964656 462678662 456040595 446744377
14264 446744377 434900037 421878573 407821641 392497156 376956736 360944414 344735321
$$ packed form
14317G2199335K752690L101666K657758L237250K958675M011053L628604M185105
14309I8732136M067641L953838M983314M581340N212221N653845N539521N970447
14301A38694303N645342O837586P164463P338820P800161Q315369Q855956R468454
14293B00120454R836194J0327917J0800404J1218321J1854823J1797397J2982727
14286B78938237J3160032J3667430J3911475J4551663J4429255J4562845J4211604
14279C77432541J4446745J3861563J3293389J2114342J0820592Q887840O949604
14272D57806616N274271J536560J003966J781404k438161k285994o638067r296218
14264D46744377j1844340j3021464j4056932j5324485j5540420j6012322j6209093
$$ plain form
14257 344735321 328764562 313333399 297986821 283028340 268705012 256170121 243846284
14250 243846284 231192285 219535935 208415388 197977942 188189388 179158206 170328419
14243 170328419 162309886 154623176 147522460 140418496 133921397 128179087 123003848 117312403
14235 117312403 112232602 107219596 102805867 98530844 95086664 91173484 87576666 84000884
14227 84000884 80801883 77993093 74932936 72094828 69417773 66942082 64978101 62513435
14219 62513435 60469956 58397852 56554967 54772945 52823642 51623883 50177192 48484012
14211 48484012 46655926 44988597 44070505 42877903 42376484 40772877 39404761 38076639
14203 38076639 36791077 36407738 35397172 34355089 33689086 32754229 31650868 31047563 30159821
$$ packed form
14257C44735321j5970759j5431163j5346578j4958481j4323328j2534891j2323837
14250B43846284j2653999j1656350j1120547j0437446r788554r031182q829787
14243A70328419q018533p686710p100716p103964o497099n742310n175239n691445
14235A17312403n079801n013006m413729m275023l444180l913180l596818l575782
14227H4000884l199001k808790l060157k838108k677055k475691j963981k464666
14219F2513435k043479k072104j842885j782022j949303j199759j446691j693180
14211D8484012j828086j667329r18092j192602n01419j603607j368116j328122
14203C8076639j285562l83339j010566j042083o66003r34857j103361o03305q87742
$$ plain form
14194 30159821 29694536 28840987 28164000 27407268 26815010 26092322 25415617 24838491 24408035
14185 24408035 23806613 23347799 22916243 22211087 21538070 21496649 20685872 20350019 20132062
14176 20132062 19511201 19255210 19266366 18535976 18149698 17569544 17644985 17104185 16635728 16606409
14166 16606409 16425310 15779257 16008305 15094675 15156278 14896140 14240309 14428906 13917643
14157 13917643 13938920 13562153 13523267 13103289 12859151 12452048 12409558 12057945 12012084 11573913
14147 11573913 11906879 11656464 11488727 11278566 10645247 11103450 10749028 10255488 10157052
14138 10157052 10330222 10229426 9868659 9833830 9462231 9414930 9168527 9149511 9112438 8769647
14128 8769647 8904508 8737183 8508022 8325912 8495858 8136103 8184902 8105594 7979332 7906526
$$ packed form
14194C0159821m65285q53549o76987p56732n92258p22688o76705n77126m30456
14185B4408035o01422m58814m31556p05156o73017m1421q10777l35853k17957
14176B0132062o20861k55991J1156p30390l86278n80154P5441n40800m68457k9319
14166A6606409j81099o46053K29048r13630O1603k60138o55831J88597n11263
14157A3917643K1277l76767l8886m19978k44138m07103m2490l51613m5861m38171
14147A1573913L32966k50415j67737k10161o33319M58203l54422m93540r8436
14138A0157052J73170j00796l60767l4829l71599m7301k46403j9016l7073l42791
14128H769647J34861j67325k29161j82110J69946l59755M8799p9308j26262p2806
$$ plain form
14118 7906526 7595104 7320554 7479115 7543499 7237612 7270787 7052656 6994937 7298301 6790070
14108 6790070 6673986 6496767 6720588 6982537 6476333 6700105 6304026 5955351 6467025
14099 6467025 6259147 6126523 6046838 5841283 5914529 5717108 5926496 5928716 5402687 5859935
14089 5859935 5393350 5279944 5429704 5138422 5148967 5339287 5155197 5123714 4915699 4796428
14079 4796428 4898026 4853890 4630811 4689181 4742451 4523386 4589285 4563565 4108796 4417397
14069 4417397 4105673 4375539 4108484 4459634 4106094 4382292 4146904 4059425 3990944 4271495
14059 4271495 3969334 3778809 3882837 3977009 4012301 3879787 3766185 3605895 3527196 3483039
14049 3483039 3415542 3716972 3543347 3473441 3663802 3283447 3011789 3021789 3237560 3465128
$$ packed form
14118G906526l11422k74550J58561O4384l05887L3175k18131n7719L03364n08231
14108F790070j16084j77219K23821K61949n06204K23772l96079l48675N11674
14099F467025k07878j32624p9685k05555P3246j97421K09388K220n26029M57248
14089E859935m66585j13406J49760k91282J0545J90320j84090l1483k08015j19271
14079D796428J01598m4136k23079N8370N3270k19065O5899k5720m54769L08601
14069D417397l11724K69866k67055L51150l53540K76198k35388q7479o8481K80551
14059D271495l02161j90525J04028R4172L5292j32514j13602j60290p8699m4157
14049C483039o7497L01430j73625o9906J90361l80355k71658J0000K15771K27568
$$ plain form
14039 3465128 2946869 3141652 3130212 3083037 3436521 3113031 3465565 3121138 3201436 3447787
14029 3447787 2978366 2814434 3234931 3090906 2710969 2569488 2681196 3089547 2885272
14020 2885272 2395318 2838058 2628966 2416310 2809984 2616528 2707542 2697936 2573533 2450692
14010 2450692 2603657 2382808 2309241 2649307 2080176 2301142 2279525 2304640 2141677 2231493
14000 2231493 2250231 2366769 2745456 2291044 2104835 2197886 2096849 2378379 2304965 2866802
13990 2866802 3426992 4333543 6191895 12990898 28940370 51786646 27168568 12672379
13981 7527300 5622939 4770248 3946818 3517432 3486415 3252789 3030645 2717222 2920805
13972 2920805 2597554 2528611 2198249 2736135 2207054 2357252 2513688 2337469 2424532 2261766
$$ packed form
14039C465128n18259J94783j1440m7175L53484l23490L52534l44427Q0298K46351
14029C447787m69421j63932M20497j44025l79937j41481J11708M08351k04275
14020B885272m89954M42740k09092k12656L93674j93456R1014r606j24403j22841
14010B450692J52965k20849p3567L40066n69131K20966k1617K5115j62963Q9816
14000B231493J8738J16538L78687m54412j86209R3051j01037K81530p3414N61837
13990B866802N60190R06551J858352O799003J5949472K2846276k4618078A2672379
13981G527300j904361q52691q23430m29386l1017k33626k22144l13423K03583
13972B920805l23251o8943l30362N37886n29081J50198J56436j76219Q7063j62766
$$ plain form
13962 2261766 2157084 2139179 2055783 2150149 1873010 2247092 2216521 2359883 1867078 2015424
13952 2015424 1966984 2270195 1980615 1741929 2052095 2057778 1941742 1693209 1853317 2016332
13942 2016332 1809804 1927543 1848288 1512881 1570567 1647437 1713437 1832656 1894193 1733797
13932 1733797 1988474 1819149 1909733 1475177 1371919 1693731 1495749 1577921 1600883 1555072
13922 1555072 1561748 1773201 1639893 1428211 1314645 1252187 1677633 1596727 1425815 1357819
13912 1357819 1486225 1674098 1489813 1762318 1232857 1222061 1193946 1310547 1526016 1218740
13902 1218740 1275045 1223288 1420305 1393278 1443343 1242561 1211294 1261357 1238440 1211544 1286373
13891 1286373 1267976 1196982 1521271 1197704 1420528 1461373 1365055 1005747 1243973 1230322
$$ packed form
13962B261766j04682j7905q3396R4366k77139L74082l0571J43362m92805J48346
13952B015424m8440L03211k89580k38686L10166N683j16036k48533J60108J63015
13942B016332k06528J17739p9255l35407N7686P6870O6000J19219O1537j60396
13932A733797K54677j69325R0584m34556j03258L21812j97982Q2172K2962m5811
13922A555072O676K11453j33308k11682j13566o2458M25446q0906j70912o7996
13912A357819J28406J87873j84285K72505n29461j0796k8115J16601K15469l07276
13902A218740N6305n1757J97017k7027N0065k00782l1267N0063k2917k6896P4829
13891A286373j8397p0994L24289l23567K22824M0845r6318l59308K38226j3651
$$ plain form
13881 1230322 1099336 1005401 1069614 1350804 1131110 1305459 1226944 1234117 1189262 954976
13871 954976 956230 1395279 951654 1129810 884693 942338 1105569 808822 951400 895597
13861 895597 1030368 1071059 1052013 1016617 781469 1251133 872075 889155 1190033 1019990
13851 1019990 1262179 1065004 686995 1004538 1414256 868937 1140977 1073624 1068402 1246304
13841 1246304 1458830 1216949 867708 1210421 1031587 1120312 1007115 1072745 901114 1068023
13831 1068023 906233 545644 540008 869939 751802 734684 942118 1055534 1064653 797685
13821 797685 1016179 843613 872091 819309 719557 831334 597660 884047 1150923 1259543
13811 1259543 870545 693774 1033312 1115201 776196 838786 458107 727941 572576 499716
$$ packed form
13881A230322j30986r3935O4213K81190k19694J74349p8515P173m4855k34286
13871I54976J254M39049m43625J78156k45117N7645J63231k96747J42578n5803
13861H95597J34771M0691j9046l5396k35148M69664l79058J7080L00878j70043
13851A019990K42189j97175l78009L17543M09718n45319K72040o7353n222J77902
13841A246304K12526k41881l49241L42713j78834Q8725j13197O5630j71631J66909
13831A068023j61790l60589n636L29931j18137j7118K07434J13416R119k66968
13821G97685K18494j72566K8478n2782r9752J11777k33674K86387K66876J08620
13811A259543l88998j76771L39538Q1889l39005O2590l80679K69834j55365p2860
$$ plain form
13801 499716 1070960 837481 1089972 1140541 1174096 528801 573224 735676 797437 595525
13791 595525 784284 1045180 674575 775772 260416 816766 951135 663725 457158 804209
13781 804209 875041 633009 1017085 817667 464244 750788 689335 667648 573763 851407
13771 851407 414714 911604 624668 1019284 823749 339088 607036 364076 500363 1080034
13761 1080034 460453 551251 765719 605609 680741 725006 744173 920677 531762 932698
13751 932698 585384 620328 637931 473195 621644 482403 492111 542273 943398 875947 542447
13740 542447 528522 426362 320458 752245 851168 518867 716099 592859 498208 474480
13730 474480 419343 603159 527856 707271 339484 616926 536408 691570 895879 431487
$$ packed form
13801D99716N71244k33479K52491N0569L3555E28801M4423J62452O1761k01912
13791E95525J88759K60896l70605J01197B60416N56350J34369k87410k06567L47051
13781H04209P0832k42032L84076j99418l53423K86544o1453k1687r3885K77644
13771H51407D14714M96890k86936L94616j95535C39088K67948k42960J36287N79671
13761A080034D60453R0798K14468j60110P5132M4265J9167J76504l88915M00936
13751I32698l47314L4944J7603j64736J48449j39241R708N0162M01125o7451l33500
13740E42447j3925j02160j05904M31787R8923l32301J97232j23240r4651k3728
13730D74480n5137J83816p5303J79415C39484K77442q0518J55162K04309D31487
$$ plain form
13719 110633 746975 217874 379898 531552 1058401 588592 364055 588133 927762 638905
13709 638905 610083 793893 337160 133116 705354 719920 447669 393412 417703 737709
13699 737709 676846 242865 775079 832266 512191 408637 577628 269114 575393 270591
13688 629192 99757 651494 327118 247875 336711 191424 305262 358615 506966 440271
13678 440271 531436 379400 424884 239999 505528 618345 424626 706760 498209 495833
13668 495833 535142 69314 232135 228999 223428 481281 497434 529877 470834 610397 551642
13657 551642 418327 528128 474489 644873 472000 9624 600317 430659 321657 600798
13647 600798 91734 385726 398738 422965 481345 529715 383833 319303 404319 157350 298516
$$ packed form
13719A10633O36342B17874J62024J51654N26849m69809k24537K24078L39629k88857
13709F38905k8822J83810C37160A33116N72238J4566k72251n4257K4291L20006
13699G37709o0863B42865N32214N7187l20075j03554J68991B69114L06279B70591
13688F29192I9757N51737l24376p9243Q8836j45287J13838N3353J48351o6695
13678D40271R1165j52036M5484j84885K65529J12817j93719K82134k08551k376
13668D95833L9309F9314J62821l136n571K57853J6153L2443n9043J39563n8755
13657E51642j33315J09801n3639J70384j72873I624N90693j69658j09002K79141
13647F00798I1734K93992J3012K4227N8380M8370j45882o4530Q5016A57350J41166
$$ plain form
13636 298516 13140 528625 342000 504722 243951 110999 678753 413563 449028 396369
13626 396369 299124 729387 455646 268620 458217 249259 508159 156884 88007 566004
13616 566004 533447 229181 382938 93400 -108292 284606 258348 378934 420483 510328
13606 510328 250097 407829 292312 564460 22929 205923 464382 593394 354862 378231
13596 378231 394035 236704 621604 512124 578789 154429 249947 319867 273070 192948 656919
13585 656919 455436 382335 653148 203136 118721 46588 325826 593645 380726 423011
13575 423011 356492 445625 292834 183536 366492 217504 381286 164444 196262 526679
13565 526679 335517 434950 172358 116462 280102 249208 307861 238547 570809 951 206482
$$ packed form
13636B98516A3140N15485j86625J62722B43951A10999N67754k65190L5465n2659
13626C96369r7245M30263k73741j87026J89597k08958K58900A56884o8877M77997
13616E66004l2557B29181J53757I3400a08292B84606k6258J20586M1549Q9845
13606E10328B50097J57732j15517K72148B2929J82994K58459J29012k38532K3369
13596C78231J5804j57331L84900j09480O6665A54429R5518O9920m6797q0122M63971
13585F56919k01483p3101K70813B03136q4415D6588K79238K67819k12919M2285
13575D23011o6519Q9133j52791j09298J82956j48988J63782A64444L1818L30417
13565E26679j91162R9433A72358n5896J63640l0894N8653o9314L32262I51K05531
$$ plain form
13554 206482 123772 460631 170300 471733 249332 585992 396259 549223 320552 322550
13544 322550 280851 178058 -89186 -59442 351582 508765 230891 431265 285192 63673
13533 114715 232352 502263 174893 245087 57441 165085 -161718 361712 36907 329160
13523 329160 277696 162707 369698 2556 753074 -183708 240401 34165 129102 392473
13513 392473 480067 582509 506310 -123653 167934 85644 187217 83187 -67501 350654
13502 346297 290841 517560 264532 181050 395767 383228 589000 70626 166753 -10085 239271
13490 6387 -80070 508359 335318 182739 15660 132914 274454 281389 73845 74845 207782
13479 207782 107150 363399 444389 -55462 440214 346727 138757 649947 247504 -52368
$$ packed form
13554B06482q2710L36859A70300L01433k22401L36660j89733J52964k28671J998
13544C22550m1699j02793h9186K9744C51582J57183B30891K00374j46073F3673
13533A14715J17637K69911A74893P0194E7441J07644a61718C61712C6907K92253
13523C29160n1464j14989K06991B556P50518a83708B40401C4165R4937K63371
13513C92473Q7594J02442p6199a23653A67934q2290J01573H3187f7501C50654
13502C46297n5456K26719k53028q3482K14717j2539K05772G0626R6127a0085B39271
13490F387h0070E08359j73041j52579A5660J17254J41540O935G3845J000J32937
13479B07782j00632K56249Q0990e5462D40214r3487A38757N11190B47504e2368
$$ plain form
13468 260544 320309 93728 194541 354423 326815 -12648 397434 331504 329767 99511 536480
13457 536480 518318 351836 82604 -34419 -40953 280407 65995 122212 200404 28891 261965
13446 261965 475806 250321 163278 -86270 168865 382478 248098 252079 135099 402776
13436 402776 353265 -150260 -4023 280886 354671 439081 301524 333424 -44565 159729 136083
13425 136083 542253 55456 99315 -33860 -25058 195892 325920 122370 340353 415902 203230
13413 175909 367064 1270 93285 368943 128216 275969 121717 207230 -32782 -169641
13403 -169641 425837 140746 159819 372094 138042 230458 96808 1126 223402 124040 220963
13392 220963 149234 49546 268397 216403 364847 605401 321694 222867 405448 100111
$$ packed form
13468B60544N9765I3728J00813J59882k7608a2648C97434o5930j737I9511M36969
13457E36480j8162j66482H2604c4419o534B80407F5995N6217P8192B8891K33074
13446B61965K13841k25485q7043h6270A68865K13613j34380L981j16980K67677
13436D02776m9511a50260d023B80886P3785Q4410j37557L1900d4565A59729k3646
13425A36083M06170E5456M3859c3860Q802A95892J30028A22370K17983P5549B03230
13413A75909J91155A270R2015K75658A28216J47753A21717Q5513c2782j36859
13403a69641D25837A40746J9073K12275A38042R2416I6808A126K22276r9362R6923
13392B20963p1729D9546K18851n1994J48444K40554k83707r8827J82581A00111
$$ plain form
13381 425573 68153 -18752 108747 329659 402208 -118243 220543 202358 297508 176594
13371 176594 330432 267492 45979 226771 315916 157073 -81472 435874 68961 402936
13361 402936 176844 467747 389794 120859 338033 119460 265745 257173 -243788 -48809
13350 216124 382696 249487 491037 371607 379559 343344 440466 364732 277094 210061 294035
13339 294035 -22825 523989 169293 79593 265361 237226 55312 523532 175963 348596
13329 348596 371723 137588 351368 109153 147107 117584 261329 158900 413145 428905
13319 428905 278386 -41772 83749 291986 250197 496846 240901 191151 246017 199259 272513
13308 272513 209615 155555 93961 -398522 37375 40743 182403 504131 107784 500456 -111836
$$ packed form
13381D25573F8153a8752A08747K20912P2549a18243B20543j8185R5150j20914
13371A76594J53838o2940D5979J80792Q9145A57073h1472D35874F8961L33975
13361D02936A76844K90903p7953A20859K17174A19460J46285q572b43788d8809
13350B16124J66572j33209K41550j19430P952l6215R7122p5734q7638o7033Q3974
13339B94035b2825E23989A69293G9593J85768k8135E5312M68220A75963J72633
13329C48596K3127A37588K13780A09153L7954k9523J43745j02429K54245J5760
13319D28905j50519d1772H3749K08237m1789K46649B40901m9750N4866m6758P3254
13308B72513o2898n4060o1594c98522C7375L368J41660L21728A07784L92672a11836
$$ plain form
13296 -100484 283869 206164 109326 -24558 45895 -114062 379041 -44497 219786 17435 -41028
13284 72443 -80235 -14358 81626 61777 252510 175209 236360 -91133 353930 89041 292258
13273 292258 154808 238456 126586 -119768 240155 143832 292929 240711 315188 430518
13263 430518 305427 599735 69004 207558 158398 -222587 35408 41630 145114 -159384
13252 213691 176494 -54878 -25606 341050 141035 311896 183580 171726 89504 119893 153619
13241 153619 460008 95814 -282981 119850 97124 14637 -149012 99419 -83152 210691
13230 22370 110463 97127 -56392 -108574 24581 60351 -279500 -38615 505768 243225 334680
13219 334680 72598 -251779 202458 98639 106781 -311580 4310 65145 335921 185604 -166675
$$ packed form
13296a00484B83869p7705r6838b4558D5895a14062C79041d4497B19786A7435d1028
13284G2443h0235a4358H1626j9849J90733p7301O1151i1133C53930H9041K03217
13273B92258j37450Q3648j11870a19768B40155r6323J49097n2218P4477J15330
13263D30518j25091K94308F9004J38554m9160b22587C5408O222J03484a59384
13252B13691l7197e4878b5606C41050A41035J70861j28316j1854q2222L0389L3726
13241A53619L06389I5814b82981A19850k2726A4637a49012I9419h3152B10691
13230B2370Q8093j3336e6392n2182B4581L5770b79500c8615E05768B43225R1455
13219C34680G2598b51779B02458I8639Q142c11580D310O0835K70776j50317a66675
$$ plain form
13207 55780 -147238 86834 45421 254197 8358 111377 259565 197929 -92678 211111 464007
13196 464007 429736 -94810 16973 372898 -52937 53706 141556 20075 -19502 106506 -253193
13184 182995 265625 254951 -229740 -86463 111107 -42265 -45336 297160 -201701 266658 72634
13172 -33104 -93998 189740 36032 -48938 3952 178608 -117813 -266234 82478 308667 109363
13160 -115552 421015 97668 -1944 231605 282158 164454 47045 -90852 165340 450557 -384073
13148 106519 111228 -199547 -50817 36625 9043 -270958 265630 -205209 209622 212504 179991
13137 179991 -80232 290403 -101794 -7059 405034 180621 138400 370837 224483 82655
13126 160060 -114598 228235 -146888 -101975 153469 61623 179164 235147 104071 -82448
$$ packed form
13207E5780a47238H6834m1413K08776H358J03019J48188o1636i2678B11111K52896
13196D64007l4271i4810A6973L55925e2937E3706Q7850B0075a9502A06506b53193
13184A82995Q2630j0674b29740h6463A11107d2265l071B97160b01701B66658G2634
13172c3104o0894A89740C6032d8938C952J74656a17813j48421H2478K26189A09363
13160a15552D21015I7668a944B31605N0553j17704D7045i0852A65340K85217c84073
13148A06519M709a99547e0817C6625I043b70958B65630b05209B09622K882l2513
13137A79991h0232B90403a01794g059D05034A80621m2221K32437j46354H2655
13126A60060a14598B28235a46888M4913A53469F1623J17541N5983A04071h2448
$$ plain form
13115 345527 -73864 341549 30216 -8462 -190117 82531 181052 -140465 -14963 79563 199396
13104 199396 141006 131501 261400 173262 -167101 112091 106648 145372 -52779 57615 -127850
13092 -21709 14619 514727 30634 334498 31650 107588 172074 -111440 -147659 320778 53986
13080 -236396 116803 318667 104173 193807 -83597 22618 217126 270389 22273 72635 261306
13069 261306 660981 14639 -282162 328379 332064 -88217 274509 285623 58775 40528 238859
13058 238859 5596 71186 270954 210092 355304 -161022 22764 98919 15915 122642 -180139
13046 199684 4504 288696 88685 105216 -190768 159477 -114228 56281 -163830 -5453 172287
13034 34347 127851 52953 144516 -315909 361479 -30343 178210 137261 -226139 -59565 31430
$$ packed form
13115C45527g3864C41549C0216h462j81655H2531R8521a40465a4963G9563J19833
13104A99396n8390r505J29899q8138a67101A12091n443L8724e2779E7615a27850
13092b1709A4619N00108C0634L03864C1650P5938O4486a11440l6219C20778E3986
13080b36396A16803K01864A04173Q9634h3597B2618J94508N3263B2273N0362J88671
13069B61306L99675A4639b82162C28379L685h8217B74509J1114E8775j8247J98331
13058B38859E596O5590J99768o0862J45212a61022B2764P6155A5915J06727a80139
13046A99684D504K84192H8685J6531a90768A59477a14228E6281a63830e453A72287
13034C4347R3504E2953R1563c15909C61479c0343A78210m0949b26139e9565C1430
$$ plain form
13022 281365 -10455 289827 165540 -175555 181775 41841 -180613 142677 96124 164910
13012 164910 219173 120523 105815 395603 234058 51270 205462 133333 38125 350520 -78554
13000 206108 -193880 88246 369411 -29608 287671 -35146 -199050 127805 520329 78022
12989 -7700 -191828 50933 -134836 -20042 -248090 181725 165865 122247 202065 -280860 74738
12977 129698 60828 222991 104576 86745 182643 455689 51526 -121595 383908 14574
12966 -186177 329457 -90832 205147 166045 -42634 -228157 77824 216853 323462 123010
12955 52182 26387 318296 111879 -74660 202392 128567 170405 -204366 -35660 189305 -23540
12943 208633 -95708 67203 -58694 -60862 -65343 -136458 261234 293223 275929 206981 178238 89354
$$ packed form
13022B81365a0455B89827j24287a75555A81775D1841a80613A42677m6553O8786
13012A64910N4263r8650j4708K89788j61545E1270J54192p2129C8125L12395g8554
13000B06108a93880H8246K81165b9608B87671c5146j63904A27805L92524G8022
12989g700j84128E0933a34836b0042k28048A81725j5860m3618P9818b80860G4738
12977A29698F0828J62163A04576j7831R5898K73046E1526a21595C83908A4574
12966a86177C29457i0832B05147l9102d2634j85523G7824J39029J06609A23010
12955E2182k5795K91909A11879g4660B02392p3825M1838b04366c5660A89305b3540
12943B08633i5708F7203e8694k168m481p1115B61234L1989j7294o8948k8743q8884
$$ plain form
12931 89354 211472 -127978 55339 23694 -96852 7178 166586 -71883 -96716 419197 -51206
12919 107000 -2070 182387 -7883 5872 -161962 419660 129237 -66947 -42727 60865 68053
12908 68053 23148 182089 9312 -300459 16821 -57714 299290 -7168 181466 -195130 72724
12896 96998 120056 -183699 318276 19776 369450 382811 -90250 -182951 239930 202504 160470
12885 160470 334750 -141025 -4444 -39290 274584 12643 -105051 -126584 -129463 -174486 68920
12873 105983 345177 63646 329591 229491 -43382 -216474 307966 81948 -292916 66028
12862 -42347 39061 -151075 -142096 138517 -319874 20667 161553 -87695 -5899 -309824 -47775
12850 31085 386725 -39245 -239771 177411 -98818 -109151 -238656 219777 -4407 -36551 29560
$$ packed form
12931H9354J22118a27978E5339B3694i6852G178J59408g1883k4833D19197e1206
12919A07000b070A82387g883E872a61962D19660A29237f6947K4220F0865P188
12908F8053B3148J58941I312c00459A6821e7714B99290g168A81466a95130G2724
12896I6998K3058a83699C18276A9776L49674J3361i0250r2701B39930l7426m2034
12885A60470J74280a41025d444l4846B74584A2643a05051k1533k879m5023F8920
12873A05983K39194F3646K65945j00100d3382j73092C07966H1948b92916F6028
12862d2347C9061a51075Q979A38517c19874B0667J40886h7695e899l03925d7775
12850C1085L55640c9245k00526A77411i8818j0333j29505B19777d407l2144B9560
$$ plain form
12838 -15335 54603 -117800 -172190 109251 265601 390149 276874 -25648 142735 -104510
12827 132114 81484 -187995 89549 -36373 371939 142747 -101328 238158 72956 228716
12817 228716 264042 -73900 -143383 -43440 195855 18561 -7095 10898 -89684 -63241 266233
12805 -435168 17473 -224509 -55163 32852 202642 -378137 -542050 120112 288061 91001
12794 -389345 -231167 -45872 31157 247878 114479 117919 -91401 183083 -93690 6115 -124470
12782 78467 41269 -225648 31476 -373253 3124 301319 69403 -147560 -22356 -118224 -89308
12771 -89308 -9773 50828 260182 -151079 -434124 -88571 237874 -17219 176879 -171674 -61682
12759 -34159 -65190 -153239 -101860 40484 81788 48897 -76194 -115850 71632 -10043 6868 -165141
$$ packed form
12838a5335E4603a17800n4390A09251J56350J24548j13275b5648A42735a04510
12827A32114n0630a87995H9549c6373C71939A42747a01328B38158G2956J55760
12817B28716L5326g3900o9483d3440A95855A8561g095A0898h9684K6443B66233
12805d35168A7473b24509e5163C2852J69790c78137j63913A20112J67949I1001
12794c89345J58178d5872C1157K16721A14479L440i1401A83083i3690F115a24470
12782G8467l7198b25648C1476c73253C124K98195F9403a47560b2356r5868K8916
12771h9308i773E0828K09354a51079k83045h8571B37874a7219A76879a71674f1682
12759c4159l1031q8049N1379D0484M1304l2891g6194l9656G1632a0043F868a65141
$$ plain form
12746 67638 330972 137774 -87598 -217137 -57992 -55494 -9894 215198 56786 -134007 117196
12734 94307 241244 410398 407172 257165 -12853 -95804 278077 -263942 45857 61917 -35523
12722 -115883 -21 155721 219696 224514 136908 37416 -97059 204366 -227754 -45402 -39146 423515
12709 215044 303768 272021 6356 158646 221102 116461 148020 79308 247290 -43531 175492
12697 -124966 147285 -33416 31734 333070 -11229 62037 790 -70745 117012 -161356 -16287
12685 49048 -35857 141101 -70993 280483 -893 -78900 -133873 -168548 38743 350383 34351
12673 81255 110347 365681 -32208 101153 331996 -300843 207713 -136721 18386 -186143
12662 463559 149940 -23299 367301 254955 17454 138626 30172 384788 246257 143575
$$ packed form
12746F7638K63334A37774h7598j29539e7992K498i894B15198E6786a34007A17196
12734I4307J46937J69154l226j50007a2853q2951B78077b63942D5857J6060c5523
12722a15883b1A55721O3975M818q7606C7416i7059B04366b27754d5402O256D23515
12709B15044Q8724l1747F356J52290O2456j04641L1559o8712J67982d3531A75492
12697a24966A47285c3416C1734L01336a1229F2037G90g0745A17012a61356a6287
12685D9048c5857A41101g0993B80483h93p8007n4973l4675C8743L11640C4351
12673H1255K9092K55334c2208A01153K30843c00843B07713a36721A8386a86143
12662D63559A49940b3299C67301j12346A7454J21172C0172L54616j38531j02682
$$ plain form
12652 143575 275629 50448 -115826 -155905 133909 51473 296545 -801 66150 -141263 110418
12640 166927 -226327 76212 175078 591657 211411 102971 126921 104398 82722 343890
12630 343890 369125 -38554 225467 22438 125346 -250176 207216 206231 375263 544920 20939
12618 367548 28672 -33981 300727 99725 349173 214898 12198 -74182 14980 108299 385659
12607 385659 371706 147772 -59465 -77491 331113 -50456 236437 60966 -273285 193278
12596 278092 -322181 15601 100753 234572 149062 97902 -90097 272341 -21722 -30978 -72575
12585 -72575 2575 -171972 -88580 -213128 224369 280177 105745 105267 -83444 368645 302684
12574 302684 -153590 -44619 -212925 -515945 263110 -435127 175972 -82623 -146021 -117075
$$ packed form
12652A43575J32054E0448a15826m0079A33909E1473K45072h01F6150a41263A10418
12640A66927b26327G6212R8866M16579B11411A02971K3950k2523k1676K61168
12630C43890K5235c8554B25467B2438J02908b50176B07216r85J69032J69657B0939
12618C67548B8672c3981C00727I9725K49448j34275A2198g4182A4980R3319K77360
12607C85659j3953A47772e9465j8026C31113e0456B36437F0966b73285A93278
12596B78092c22181A5601Q5152J33819q5510n1160i0097B72341b1722r256m1597
12585g2575B575a71972Q3392j24548B24369N5808A05745m78h3444C68645o5961
12574C02684a53590d4619j68306l03020B63110d35127A75972h2623o3398K8946
$$ plain form
12564 -117075 -5121 172462 -94183 192769 -28843 130665 14362 152867 222503 -32710 127392
12552 20840 -6129 -160396 -31182 -18444 291508 -215028 -111397 24972 126685 -201574 137675
12540 -39839 118134 -254967 -263531 103066 177203 -190057 -42126 24639 -71168 -149953 250247
12528 386954 333868 230101 293393 280675 259280 290986 332295 -27009 299723 169646 16578
12516 1715 111408 185064 -131351 9698 42579 132435 135258 -177270 -243037 -62626 63847 -101989
12503 -9492 -88570 -180394 -70221 -109419 38010 246715 130349 350407 234287 181424 -33796
12491 361147 177919 64649 -48298 89024 9406 -19405 -19455 -108533 -68408 27477 -196475 -46594
12478 -71489 129759 -79158 22702 149397 129548 -66562 -53248 386115 302830 -91161 202780
$$ packed form
12564a17075e121A72462i4183A92769b8843A30665A4362J38505O9636c2710A27392
12552B0840f129j54267c1182J2738B91508b15028J03631B4972J01713b01574A37675
12540c9839A18134b54967q564A03066P4137a90057d2126B4639g1168p8785B50247
12528C86954n3086j03767O3292j2718k1395L1706M1309b7009B99723j30077A6578
12516A715J09693P3656a31351I698L2881Q9856K823a77270o5767f2626F3847a01989
12503i492p9078r1824g0221l9198C8010K08705j16366K20058j16120n2863c3796
12491C61147A77919F4649d8298H9024I406a9405n0q9078M0125B7477a96475d6594
12478g1489A29759g9158B2702J26695j9849f6562J3314C86115q3285i1161B02780
$$ plain form
12466 87245 -35297 -385617 68489 -229629 225724 -257197 -106583 85351 143254 221561 136042
12455 136042 94330 183088 -74176 -140440 77083 -217981 -291188 48591 442785 386095 303768
12444 303768 57392 232468 74225 70231 328431 162990 -53441 -519815 9898 -157999 70582
12432 5479 80054 -25485 70700 -107229 879 -31842 -71762 -22780 27731 165682 -277390 -13060
12419 121957 98806 -140119 -212685 115731 22444 -155564 -13752 -126685 -224934 -98090 -225644
12408 -225644 -131012 -214265 -172498 13040 66955 252647 167291 -20877 -213865 -95616 -41368
12396 57263 -109172 15580 -81286 173957 -156300 106009 -61961 -45596 -10945 -89549 -62139
12385 -62139 -54422 203128 3139 -101173 -26454 311220 167894 48385 -64210 53830 35012
$$ packed form
12466H7245c5297l50320F8489b29629B25724b57197a06583H5351N7903P8307q5519
12455A36042m1712Q8758g4176o6264G7083b17981p3207D8591L94194n6690q2327
12444C03768E7392J75076G4225l994K58200A62990e3441m66374I898a57999G0582
12432E479P4575b5485G0700a07229H79c1842l9920b2780B7731J37951b77390a3060
12419A21957k3151a40119p2566A15731B2444a55564a3752j12933r8249i8090j27554
12408b25644R4632q3253M1767A3040N3915J85692q5356b0877j92988i5616d1368
12396E7263a09172A5580h1286A73957a56300A06009f1961J6365a0945p8604K7410
12385f2139P717B03128C139a01173b6454C11220j43326D8385f4210E3830j8818
$$ plain form
12374 35012 -77209 -36287 -314554 246691 -14777 195604 99688 -2798 -399868 -135807 20588
12362 -318243 -240575 -66652 34749 -155102 214347 -51708 5434 -300295 97836 224886 -134698
12350 98004 51197 236890 253393 215495 396443 241003 281710 82344 336632 -209253 277772
12338 -439492 71774 -126733 -83102 84205 142857 149313 -28347 252097 169042 52753 149752
12327 149752 318340 -419532 83983 -209130 122561 203792 -22933 -165306 -237039 159750
12316 177154 -14491 149438 -116201 104852 -25393 348108 73388 -52209 129661 -91356
12305 144571 127908 50828 164214 62357 199813 195491 7333 155454 25914 202969 -29350
12293 38307 353114 -328105 249778 76197 -215231 -17560 26475 2249 -239094 172847 52623
$$ packed form
12374C5012g7209c6287k78267B46691a4777A95604r5916b798l97070a35807B0588
12362c18243P7668f6652C4749a55102B14347e1708E434c00295I7836J27050a34698
12350I8004m6807J85693J6503l7898J80948j55440M0707H2344K54288b09253B77772
12338d39492G1774a26733M3631H4205N8652O456b8347B52097q3055E2753R6999
12327A49752J68588d19532H3983b09130A22561Q1231b2933j42373p1733A59750
12316A77154a4491A49438a16201A04852b5393C48108G3388e2209A29661i1356
12305A44571j6663E0828J13386F2357J37456m322G333J48121B5914J77055b9350
12293C8307L14807c28105B49778G6197b15231a7560B6475B249b39094A72847E2623
$$ plain form
12281 -96041 -105460 69441 120251 60697 217204 287263 134346 406105 218811 390710 174657
12269 186861 25565 28644 71496 23761 205185 99011 62735 37475 204590 -26426 -134403
12258 -134403 270313 -85672 -6914 -18258 150242 467074 -49573 101381 121749 181906 60293
12246 57873 -1143 27459 -23174 202694 60361 260349 209971 387920 6592 -72175 377792
12234 496221 5324 126107 314107 -12612 355019 392775 216833 217952 234979 190094 174799
12223 174799 -259512 159285 453279 276131 68449 365630 191526 39237 514670 3361
12212 416738 233564 80360 -26343 -5648 149689 155145 55743 261792 324246 280831 -18598
12200 297367 96495 147631 620701 -80418 426745 140156 40500 2491 248671 283555 312164
$$ packed form
12281i6041r419F9441N0810n9554J56507P0059A34346K71759j87294J71899A74657
12269A86861B5565L079M2852B3761J81424I9011l6276k5260J67115b6426j07977
12258a34403B70313h5672f914j1344A50242L16832d9573A01381K0368O0157F0293
12246E7873a143B7459b3174B02694F0361J99988n0378J77949F592g2175C77792
12234D96221E324J20783J88000a2612C55019L7756j75942J119J7027m4885j5295
12223A74799b59512A59285K93994j77148F8449K97181j74104C9237M75433C361
12212D16738j83174H0360b6343e648A49689N456E5743K06049O2454m3415a8598
12200B97367I6495N1136M73070h0418D26745A40156D0500B491K46180L4884K8609
$$ plain form
12189 312164 377739 -265798 46274 440122 -108753 -245586 -229829 -198142 430237 267755
12179 267755 260759 -29493 143810 258074 303180 106702 80053 148041 371072 -82247 -280317
12168 -280317 476749 302133 253058 74634 159856 245663 -272967 293945 61514 -66265 -180393
12157 -180393 43671 -243810 -124038 111882 322338 -137410 335206 -57840 -346616 209874
12146 -162333 -43944 -161116 71228 9880 -234519 -189445 142588 -99378 80505 -226663 293486
12134 79480 170167 160047 45747 35875 237558 206898 156572 -36120 139545 -145312 -40415
12122 71857 125064 142633 178993 209110 62266 6370 -66026 -12275 -146464 273310 17880
12110 -132581 139887 9975 -212046 -262131 51732 165749 -152720 -94775 -127906 20176 -187979
$$ packed form
12189C12164O5575b65798D6274L93848a08753j36833J5757L1687D30237j62482
12179B67755o996b9493A43810J14264M5106A06702k6649O7988K23031h2247j98070
12168b80317D76749j74616m9075G4634Q5222Q5807b72967B93945F1514f6265j14128
12157a80393D3671b43810J19772A11882K10456a37410C35206e7840k88776B09874
12146a62333d3944j17172G1228I880b34519M5074A42588i9378H0505b26663B93486
12134G9480R0687j0120D5747r872K01683l0660n0326c6120A39545a45312d0415
12122G1857N3207J7569L6360L0117F2266F370f6026a2275j34189B73310A7880
12110a32581A39887I975b12046n0085E1732J14017a52720N7945l3131B0176a87979
$$ plain form
12098 287478 90824 -155635 8069 262974 141758 26395 42624 59023 97079 59628 -69634
12086 -118276 -166988 56583 77162 -339567 -58855 12338 80145 116060 84382 -266960 230161
12074 55829 -30037 235925 293524 191222 874328 2479925 1246977 261630 81404 210114
12064 210114 90355 192941 281499 278436 -317437 45610 -159389 262874 349181 397132 163412
12052 -240408 134168 32446 -60042 57525 67448 -156088 151026 55822 -187573 19851 -111142
12040 -239114 196461 11233 632733 120463 33009 279787 -174756 44782 -149266 2687
12029 -216634 100457 -282830 -41589 236601 -431889 -240244 -142359 -40096 -152670 -35352
12018 -107163 136653 -201733 85813 385232 -59588 -227702 291643 -154271 197172 222614
$$ packed form
12098B87478I0824a55635H069K54905j21216B6395J6229J6399L8056l7451f9634
12086a18276m8712E6583K0579c39567e8855A2338O7807L5915l1678b66960B30161
12074E5829c0037B35925N7599j02302O83106J605597j232948B61630H1404J28710
12064B10114I0355J02586Q8558l063c17437D5610a59389B62874Q6307M7951A63412
12052b40408A34168C2446f0042E7525R923a56088A51026E5822a87573A9851a11142
12040b39114A96461A1233O21500A20463C3009K46778a74756D4782a49266B687
12029b16634A00457b82830d1589B36601d31889J91645R7885d0096j12574c5352
12018a07163A36653b01733H5813K99419e9588j68114B91643a54271A97172K5442
$$ plain form
12008 222614 -125224 -213576 94361 -92638 39668 -184565 181387 44811 13898 25302 -45849
11996 -148400 -431824 -164199 -30370 155242 317861 121293 -186001 -258704 359726 -75637
11985 25551 -60281 -226158 371781 263398 -167209 -156303 130784 157174 -166956 358820
11974 -41298 -37948 42555 -136408 -98316 -267367 -342530 16393 -27388 -219445 250158 156928
11963 156928 -164804 224532 -267646 -85263 54732 101028 -180121 145199 22851 -24494
11952 28598 221364 -289763 -207675 269439 -83601 48117 3768 116327 -184923 -113499 -33153
11940 -84132 126792 -10627 -74148 -124987 -174969 -186719 -128328 -196771 27437 5837 -257108
11928 233910 -113980 26017 -237821 100983 -221496 -24669 -55305 -159334 407843 -205457
$$ packed form
12008B22614a25224q8352I4361i2638C9668a84565A81387D4811A3898J1404d5849
11996a48400k83424a64199c0370A55242J62619A21293a86001p2703C59726g5637
11985B5551f0281j65877C71781j08383a67209J0906A30784K6390a66956C58820
11974d1298L350D2555a36408L8092j69051p5163A6393b7388j92057B50158r3230
11963A56928a64804B24532b67646h5263E4732M6296a80121A45199B2851b4494
11952B8598J92766b89763Q2088B69439h3601D8117C768J12559a84923P1424c3153
11940h4132A26792a0627o3521n0839m9982j1750N8391o8443B7437E837b57108
11928B33910a13980B6017b37821A00983b21496b4669l0636j04029D07843b05457
$$ plain form
11917 -229457 -135387 -54651 -35508 -197917 -178069 -41375 103041 195374 -39010 -68496 -103443
11906 -103443 -96217 172290 -98139 -260319 86130 -256864 -52776 -79487 -51000 -175480 -6609
11894 189210 19219 46952 127582 116485 200092 49666 -21502 -23014 108415 178080 284575
11883 284575 18074 -187230 -260899 16100 -175928 136090 141997 85533 64067 85139 101048
11872 101048 6414 -190456 -102291 -23844 93857 228199 232628 -410665 -193069 -180811 -5979
11860 -110777 20641 -73607 -81739 -116909 -207098 -131606 -191214 -79723 -75127 101352 120355 146437
11848 146437 164301 78859 -146393 -430874 -128886 195448 -51563 62374 65879 282551 252517
11837 252517 -136882 32662 -599314 -144303 -26812 -78011 124099 -234807 28699 -249143
$$ packed form
11917b29457R4070e4651J9143j62409J9848d1375A03041R2333c9010k9486l4947
11906a03443P226A72290i8139j62180H6130b56864e2776k6711K8487j24480f609
11894A89210A9219K7733Q0630j1097Q3607D9666b1502j512A08415O9665J06495
11883B84575A8074a87230p3669A6100a75928A36090N907n6464k1466K1072J5909
11872A01048F414a90456Q8165b3844I3857J34342M429d10665a93069J2258e979
11860a10777B0641g3607q132l5170r0189P5492n9608g9723M596A01352J9003K6082
11848A46437J7864G8859a46393k84481a28886A95448e1563F2374L505K16672l0034
11837B52517a36882C2662e99314a44303b6812n1199A24099b34807B8699b49143
$$ plain form
11826 254274 -9778 128643 304773 132055 -171517 31092 -168468 -118304 -208584 -84070 -391785
11815 -391785 -144835 -65040 150798 317879 -188629 51576 -235672 -115180 -169988 328733
11804 -60261 -139473 372497 208951 -107591 -181059 31999 262355 -227611 -146564 87303 82965
11793 82965 -88602 -255758 52282 -54111 913 126403 635 292796 -9736 145613 105462 -79485
11780 27620 280166 245870 187010 -127007 -59173 -172939 -91388 246465 65246 -161292 -373644
11769 -373644 -187728 -90286 12143 -73659 152978 -412657 -6327 1486 -80726 -164869 -125789
11758 -125789 -44150 188013 -16609 -184919 7010 302702 -31854 -51714 164199 -38956 -249809
11747 -249809 253022 -56200 45897 -79982 321828 -57898 -64938 -50597 -137828 132703 -162482
$$ packed form
11826B54274i778A28643J76130A32055a71517C1092a68468N0164r0280h4070l07715
11815c91785a44835f5040A50798J67081a88629E1576b35672a15180n4808C28733
11804f0261p9212C72497j63546a07591p3468C1999K30356b27611Q1047H7303m338
11793H2965h8602j67156E2282e4111I13J25490F35K92161i736A45613m0151g9485
11780B7620K52546l4296n8860a27007e9173j13766Q1551B46465F5246a61292k12352
11769c73644J85916i0286A2143g3659A52978d12657f327A486h0726q4143L9080
11758a25789d4150A88013a6609j68310G010K95692c1854j9860A64199c8956k10853
11747b49809B53022e6200D5897g9982C21828e7898p040J4341q7231A32703a62482
$$ plain form
11735 16889 91117 21051 -445513 -192098 134484 -207333 347684 -28039 308785 134777
11724 15473 -47222 129801 -27402 -298656 -5190 -161554 60795 17545 445683 262145 -98451
11712 -20829 39573 165287 -51221 398954 151056 -1874 -130627 196194 149743 -1941 -152964
11701 -152964 34925 218467 -106652 94851 -132176 261913 486921 -163807 -57911 378765
11690 290807 218456 205924 -65377 242355 -36540 184508 457978 245188 206585 -92518 -139735
11679 -139735 197083 209473 -201384 -17740 -10000 334734 -130782 225177 -71827 -307053
11669 -307053 -95788 546167 446634 1411 -33473 236813 -84513 81321 -102292 29736 -162891
11657 232943 227946 66365 334693 -339526 -22749 7507 288658 81057 153273 13829 60559
$$ packed form
11735A6889P4228B1051d45513a92098A34484b07333C47684b8039C08785A34777
11724A5473d7222A29801b7402k71254e190j56364F0795A7545M28138j83538i8451
11712b0829C9573J25714e1221C98954A51056a874j28753A96194m6451a941j51023
11701a52964C4925J83542a06652I4851a32176B61913K25008a63807e7911C78765
11690B90807p2351j2532f5377B42355c6540A84508K73470k12790l8603i2518m7217
11679a39735A97083J2390b01384a7740P740C34734a30782B25177g1827k35226
11669c07053i5788E46167r9533A411c3473B36813h4513H1321a02292B9736a62891
11657B32943m997F6365K68328c39526b2749G507K81151H1057P2216A3829M6730
$$ plain form
11646 60559 -36112 143356 53984 93569 -181612 351616 -106933 49132 20741 86718 -146578
11634 39949 -151664 -155929 310621 57891 116344 -37601 -77945 54890 -90788 51035 51605 114590
11622 114590 75233 416557 -176800 121950 419091 78187 47298 -160913 191665 274970
11612 274970 115794 213527 -106820 -120123 -46444 175769 181155 251911 261917 -101389 -87668
11601 -87668 177350 214403 -67056 321097 82591 318673 182855 322577 30503 -49434 101559
11589 -247657 17235 288692 51385 55110 -69125 -143563 58748 356086 -23926 566952 36941
11577 33514 175982 -317270 40895 432345 140518 74506 -142478 409969 438893 41879
11566 -76962 124834 175249 665142 -176164 -132133 -3279 286627 164890 108034 10858 84397
$$ packed form
11646F0559c6112A43356E3984L9585a81612C51616a06933D9132B0741O5977a46578
11634C9949a51664m265C10621E7891N8453c7601m0344E4890i0788E1035N70O2985
11622A14590l9357L41324a76800A21950K97141G8187l0889a60913A91665Q3305
11612B74970A15794R7733a06820j3303d6444A75769N386P0756J0006a01389J3721
11601h7668A77350L7053f7056C21097H2591K36082j35818J39722C0503d9434A01559
11589b47657A7235K71457E1385L725f9125p4438E8748K97338b3926E66952C6941
11577C3514J42468c17270D0895L91450A40518o6012a42478D09969K8924D1879
11566g6962A24834N0415M89893a76164M4031c279B86627j21737n6856A0858P3539
$$ plain form
11555 84397 -202724 9196 -121681 3050 -52849 333934 57415 -159673 581689 259275 64703
11543 444656 27652 245023 21377 316799 30360 -157927 241289 293696 -98042 -120616 205677
11531 137994 88013 310906 470111 5019 -180097 177358 -7699 -171671 76125 -151628 69675
11519 246333 387059 165181 52256 110084 120781 212505 49720 144872 27288 363501 289294
11508 289294 96414 327627 343500 299523 33077 -98746 181267 24223 76774 2155 94610
11497 94610 139500 239741 198936 383172 171773 69313 -145007 -70404 585 315470 332913
11486 332913 67755 170354 240780 30047 -111060 112945 191994 144687 75975 132233 373029
11475 373029 153122 57846 91566 80245 111321 296474 157554 188090 166086 59505 -84995
$$ packed form
11555H4397b02724I196a21681C050e2849C33934E7415a59673E81689B59275F4703
11543D44656B7652K17371B1377K95422C0360a57927B41289N2407i8042k2574B05677
11531A37994m9981K22893J59205E019a80097A77358g699j63972G6125a51628F9675
11519B46333J40726A65181E2256N7828J0697R1724D9720R5152B7288L36213p4207
11508B89294I6414K31213J5873m3977C3077i8746A81267B4223N2551B155R2455
11497I4610M4890J00241m0805J84236A71773F9313a45007g0404E85L14885J7443
11486C32913F7755J02599P0426C0047a11060A12945P9049m7307o8712N6258K40796
11475C73029A53122E7846L3720j1321L1076J85153j38920L0536k2004E9505h4995
$$ plain form
11463 255563 376460 607011 69278 420456 603964 137462 104556 233822 82239 -198349
11452 25434 -57859 37226 232512 291407 410621 -118553 151043 -265641 186613 -32887
11441 153203 321830 -5482 120257 268054 -88952 402474 -156706 5711 32405 -13085 88891
11429 175877 382422 217722 -39824 221751 61372 179379 72358 74965 99993 8994 127160
11418 127160 4086 296083 250028 232403 -96253 61336 106142 285308 177837 52723 84102
11407 84102 -34776 -5872 75421 501991 -37066 -34593 69575 -42100 86047 169198 22912 92736
11395 92736 -201179 21454 393963 -4596 58739 -22077 -7536 4371 -31596 -36812 96882 -97648
11382 -94282 66399 -13090 -56622 215647 -398074 42060 453750 376572 78766 -53196 -14342
$$ packed form
11463B55563J20897K30551F9278L51178J83508A37462l2906J29266H2239a98349
11452B5434e7859C7226J95286N8895J19214a18553A51043b65641A86613c2887
11441A53203J68627e482A20257J47797h8952D02474a56706E711K6694a3085H8891
11429A75877K06545j64700c9824B21751F1372J18007G2358K607K5028H994J18166
11418A27160D086K91997m6055j7625i6253F1336M4806J79166j07471E2723L1379
11407H4102c4776e872G5421M26570c7066K473F9575d2100H6047Q3151B2912O9824
11395I2736b01179B1454L72509d596E8739b2077g536D371c1596n216I6882i7648
11382i4282F6399a3090m3532B15647c98074D2060M11690p7178G8766e3196a4342
$$ plain form
11370 319539 134853 184218 9059 16988 -155598 184194 4015 -80190 -122254 304141 -224543
11358 -96785 54759 -204622 25737 -100453 216025 81454 31782 -109444 -84415 -227967 112638
11346 -68743 -70423 -324088 143042 -137265 -70496 71662 -206696 -48717 209454 -203025 -104571
11335 -104571 -154610 207988 158571 47786 142860 134785 77825 148944 -161597 -113878 -108009
11324 -108009 329815 -141024 324022 -289008 127438 90537 86519 118467 -4659 67366 153747
11313 153747 -58965 70721 30219 -214921 125452 -124581 -40119 -133015 -371793 -69325 -392868
11302 -392868 59412 349901 -164296 408154 -83579 268691 -109932 -381480 131057 -304295
11291 98473 139851 -96192 -13037 -137786 -54363 -210357 42786 -97137 -40219 125429 221859
$$ packed form
11370C19539A34853M9365I059P929a55598A84194D015h0190m2064C04141b24543
11358i6785E4759b04622B5737a00453B16025H1454C1782a09444K5029j43552A12638
11346f8743j680k53665A43042a37265O6769G1662b06696d8717B09454b03025R8454
11335a04571n0039B07988m9417D7786R5074q075n6960P1119a61597M7719N869
11324a08009C29815a41024C24022b89008A27438l6901m018L1948d659F7366Q6381
11313A53747e8965G0721C0219b14921A25452a24581d0119r2896k38778f9325l23543
11302c92868E9412K90489a64296D08154h3579B68691a09932k71548A31057c04295
11291I8473M1378i6192a3037j24749e4363j55994D2786i7137d0219A25429R6430
$$ plain form
11280 221859 -118818 -151045 -294112 -5400 -218786 157346 -174538 -132107 146051 -13656
11269 233055 -139057 113607 -107321 161253 54493 -145679 190871 60362 171927 291287
11259 291287 -201063 55951 179722 70741 -295666 17084 -299156 55293 27579 25204 -322155
11247 122353 -128537 -197605 98304 -204072 -184625 102136 -119629 -194493 -328907 83699
11236 -105547 -221230 -247507 -41117 18864 -89821 -99213 8358 368335 -78970 177970 -92365
11224 -140611 -321023 101069 -86970 174556 -94094 -357825 75654 -50850 319283 -117553
11213 11302 -86696 -88200 -55163 -239321 55128 -144226 122890 -371459 -98799 -38811 273382
11201 -280923 -45386 135810 -368678 -182291 -122479 87439 -73401 -18348 95868 -259023 -150791
$$ packed form
11280B21859a18818l2227j43067e400k13386A57346a74538M2431A46051a3656
11269B33055a39057A13607a07321A61253E4493a45679A90871F0362J11565J19360
11259B91287b01063E5951J23771G0741b95666A7084b99156E5293B7579k375c22155
11247A22353a28537o9068I8304b04072J9447A02136a19629p4864j34414H3699
11236a05547j15683k6277d1117A8864h9821r392H358L59977g8970A77970i2365
11224a40611j80412A01069h6970A74556i4094k63731G5654e0850C19283a17553
11213A1302h6696j504L3037j84158E5128a44226A22890c71459i8799c8811B73382
11201b80923d5386A35810c68678a82291N9812H7439g3401a8348I5868b59023J08232
$$ plain form
11190 -150791 -88792 75991 -166058 -147390 -54367 -201782 227469 231940 259217 177062 -180888
11178 -184543 17222 -61601 -57900 -184917 26216 -126583 -353774 199645 9624 397221 380073
11167 380073 -86058 -133065 297607 -459971 -132496 -102703 -76609 -198582 299045 149603
11157 149603 36544 -121306 -100009 249115 174770 -383300 132683 -161222 -294195 -64413
11146 166700 -396587 -278594 -204177 -43974 -197572 2649 12036 259728 -57907 -214202 93797
11134 -25913 -39143 327769 43678 148889 154185 31257 255017 -294220 -77705 135490 15067
11122 150623 159762 12230 187230 -106130 154089 516002 93040 -397369 166337 210550
11112 210550 20212 43884 69431 5191 240873 77814 233197 525526 262713 235135 313425
$$ packed form
11190a50791O1999G5991a66058J8668e4367j47415B27469M471K7277q2155a80888
11178a84543A7222f1601L701j27017B6216a26583k27191A99645I624L87597j7148
11167C80073h6058m7007B97607d59971a32496K9793K6094j21973B99045j49442
11157A49603C6544a21306K1297B49115p4345c83300A32683a61222j32973f4413
11146A66700c96587J17993P4417d3974j53598B649R387K47692e7907j56295I3797
11134b5913j3230C27769D3678J05211N296C1257K23760b94220g7705A35490A5067
11122A50623R139A2230J75000a06130A54089L61913I3040c97369A66337M4213
11112B10550B0212K3672K5547E191K35682G7814J55383K92329B62713k7578P8290
$$ plain form
11101 313425 36044 507395 148000 407221 268384 471253 396441 458019 92478 516971
11091 516971 179934 661482 -27275 162016 15831 432034 202154 424902 415029 96682
11080 249498 555617 531606 164024 412096 9354 443355 405482 135477 435933 447697
11070 447697 374945 641417 485276 294475 455324 544596 538227 541078 716635 626333 702692
11059 702692 589296 1028387 961342 754602 1279719 664093 1092514 948475 981121 1018632
11049 1018632 1105472 906693 1177974 1040897 1266847 1228092 1092734 1019433 901777 1145102
11039 1145102 1077060 855646 1048523 1225032 1364768 817544 848100 1374824 1116105 985140
11029 985140 1158212 956885 770804 1118577 956263 998721 1161957 998419 692421 1155209
$$ packed form
11101C13425C6044M71351A48000K59221j38837K02869p4812O1578I2478M24493
11091E16971A79934M81548b7275A62016A5831M16203B02154K22748r873I6682
11080B49498L06119k4011A64024K48072I354M34001l7873A35477L00456J1764
11070D47697p2752K66472j56141j90801J60849Q9272o369K851J75557r0302P6359
11059G02692j13396M39091o7045k06740N25117o15626M28421j44039L2646L7511
11049A018632Q6840j98779K71281j37077K25950l8755j35358p3301j17656K43325
11039A145102o8042k21414J92877J76509J39736n47224L0556N26724k58719j30965
11029I85140J73072k01327j86081L47773j62314M2458J63236j63538l05998M62788
$$ plain form
11019 1155209 806078 1116284 552872 805634 631984 755663 849968 1049945 826245 884121
11009 884121 1108376 783523 682362 817144 748428 1118216 897949 1170518 1155694 1084849
10999 1084849 877763 784947 1040634 942191 865257 789304 917738 611652 762779 1195414
10989 1195414 974445 1304754 786729 948284 1236412 1231245 1363993 1622327 1403274 1775771
10979 1775771 1754090 2409004 2334798 2350362 2664339 2897309 3484042 3834790 4120070 4096394
10969 4096394 4260613 4416489 4207920 3628343 3042713 2633114 2362751 2257901 2275769 2147337
10959 2147337 2320981 2351460 2096649 2088581 2346999 2111559 1666378 1628549 1812944 1175042
10949 1175042 1126148 874638 778692 849493 81967 513288 668412 36777 333130 607811
$$ packed form
11019A155209l49131L10206E52872K52762j73650J23679R4305J99977k23700N7876
11009H84121K24255l24853j01161J34782o8716L69788k20267K72569j4824p0845
10999A084849k07086r2816K55687r8443p6934p5953J28434l06086J51127M32635
10989A195414k20969L30309n18025J61555K88128n167J32748K58334k19053L72497
10979A775771k1681O54914p4206J5564L13977K32970N86733L50748K85280k3676
10969D096394J64219J55876k08569n79577n85630m09599k70363j04850J7868j28432
10959B147337J73644L0479k54811q068K58418k35440m45181l7829J84395o37902
10949A175042m8894k51510r5946P0801H1967M31321J55124C6777K96353K74681
$$ plain form
10939 607811 367753 357098 66018 413375 24688 -119504 525248 85051 -185483 15497
10928 168698 -93409 186799 217546 150277 61982 -69810 76987 462401 48322 188394 393714
10917 393714 192739 -165319 -172320 197897 330744 89195 299821 -57665 124726 27022
10906 -18194 -2214 -55481 -184125 25988 -46493 -122374 -127401 -74175 -270699 71195 -281606
10894 -63257 -15575 -180333 -139382 204889 64211 116921 -38069 63095 156649 10453 -79898
10882 248589 -65086 -12841 -126798 104988 -176332 -217646 152170 -67504 -297075 99432
10871 -247010 -244800 -106904 -358791 44749 -174895 32941 -98491 19582 -126297 94683 -61822
10859 -136144 193712 -439785 -13901 70125 -72555 -16836 180239 -37967 61688 77345 136235
$$ packed form
10939F07811k40058j0655F6018L47357B4688a19504E25248H5051a85483A5497
10928A68698i3409A86799L0747o7269F1982f9810G6987L85414D8322J40072K05320
10917C93714A92739a65319p001A97897J32847H9195K10626e7665A24726B7022
10906a8194b214n3267j28644B5988d6493p5881n027N3226j96524G1195b81606
10894f3257a5575j64758M0951B04889F4211N2710c8069F3095R3554A0453g9898
10882B48589f5086a2841j13957A04988a76332m1314A52170f7504k29571I9432
10871b47010K210a06904k51887D4749a74895C2941i8491A9582a26297I4683f1822
10859a36144A93712d39785a3901G0125g2555a6836A80239c7967F1688J5657N8890
$$ plain form
10848 136235 348883 -19806 116203 -142182 79740 93110 115003 162159 -38598 -264289 19901
10836 29941 -78928 195147 -201700 -252738 -239620 -182394 -15680 168112 -276292 -296920 146475
10824 -131871 146729 -60615 -60370 -236904 222335 122547 -222746 103278 -276413 -101107
10813 82999 -274870 -68354 -182904 182177 -8299 -30370 -102988 -340253 71478 55740 -153246
10801 46998 -235350 -129980 -126162 -204893 -186113 -13978 -213220 -105327 -180518 -139293 340718
10789 -263732 42396 -52517 140388 53532 288156 117726 46740 25302 89675 -2247 -33078
10778 -33078 220350 -193142 106674 203749 -98316 53127 -89875 155200 87524 164372 -48574
10766 -93306 134422 211239 -234480 -62987 74797 -94499 48815 -261801 -26091 -157777 -241867
$$ packed form
10848A36235K12648a9806A16203a42182G9740J3370K1893M7156c8598k25691A9901
10836B9941g8928A95147b01700n1038J3118N7226a5680A68112b76292k0628A46475
10824a31871A46729f0615K45j76534B22335r9788b22746A03278b76413a01107
10813H2999b74870f8354j14550A82177h299k2071p2618k37265G1478j5738a53246
10801D6998b35350J05370L818p8731J8780a3978j99242a05327p5191M1225C40718
10789b63732D2396e2517A40388E3532K34624A17726D6740k1438O4373b247l0831
10778c3078B20350a93142A06674R7075i8316E3127h9875A55200o7676P6848d8574
10766i3306A34422P6817b34480f2987G4797i4499D8815b61801b6091j31686q4090
$$ plain form
10755 -241867 45933 143981 160581 -223722 -63947 228204 -173017 -84737 69669 210968 18585
10743 35767 -66954 144956 -73137 46547 167671 -62641 -53874 -262294 50277 118598 -407657
10731 -233294 -64483 53383 -195349 123827 -350836 -62325 131500 143447 -5205 -4744 -254689
10720 -254689 320493 -730 -399896 67728 -81335 -290906 295117 129752 -44396 358467 -76685
10708 -209154 -187480 -264714 -240744 -115902 -87392 244733 -153129 -364656 81955 -200226
10697 -362260 163863 -64713 -159842 49630 267672 -184110 -60367 189648 197864 -151008 -210658
10686 -210658 -157378 -254450 -42608 -264122 -12620 7469 -225578 150842 -420749 50985 228135
10675 228135 17395 102759 355840 109736 30624 1726 -239718 15782 -171518 111346 -166095
$$ packed form
10755b41867D5933R8048J6600b23722f3947B28204a73017h4737F9669J41299A8585
10743C5767f6954A44956g3137D6547J21124f2641Q767k08420E0277O8321d07657
10731b33294f4483E3383a95349A23827c50836f2325A31500J1947e205M61k49945
10720b54689C20493g30l99166F7728h1335k09571B95117A29752d4396C58467g6685
10708b09154K1674p7234K3970a15902K8510B44733a53129k11527H1955b00226
10697c62260A63863f4713r5129D9630K18042a84110f0367A89648Q216a51008n9650
10686b10658N3280r7072d2608k21514a2620G469b25578A50842d20749E0985J77150
10675B28135A7395Q5364K53081A09736C0624A726b39718A5782a71518A11346a66095
$$ plain form
10663 68874 -114040 -54427 -289619 -80615 47776 130532 108769 16139 409009 127799 -269844
10651 -131806 -197518 -52789 -58777 -104476 128415 -591107 -206292 39871 -73150 -447863 -53218
10639 18358 -400835 -295122 -97449 62154 31960 -318567 202640 -16815 85857 105471 -204294
10627 14332 -71231 87160 -228592 72928 -245200 -400908 -168473 24165 -116943 -174908 -234372
10616 -234372 -182886 197926 -402787 -337150 -250668 -167851 -469723 219896 -318762 229295
10605 -495678 -236900 103196 -327222 -356904 91535 -258214 -55711 80594 -265035 39573
10594 -239859 134581 -162046 -120516 101981 -1389 187959 107005 -319323 193067 82046
10583 70434 -87054 -106502 -165760 180771 168377 -55426 84192 -277006 -106529 42469 140103
$$ packed form
10663F8874a14040e4427k35192h0615D7776Q2756k1763A6139L92870A27799b69844
10651a31806o5712e2789n988m5699A28415e91107b06292C9871g3150l74713e3218
10639A8358d00835J05713i7449F2154l0194c18567B02640a6815H5857J9614b04294
10627A4332g1231H7160b28592G2928b45200j55708a68473B4165a16943n7965n9464
10616b34372N1486A97926d02787O5637Q6482Q2817l01872B19896c18762B29295
10605d95678b36900A03196c27222k9682I1535b58214e5711H0594b65035C9573
10594b39859A34581a62046M1530A01981a389A87959q0954c19323A93067H2046
10583G0434h7054j9448n9258A80771j2394e5426H4192b77006a06529D2469R7634
$$ plain form
10572 140103 -229324 -3609 208949 61725 -185264 -36334 18142 73171 118247 -113086 -154896
10561 -154896 -51225 -307372 -31839 202763 -87099 51838 -78622 -113646 -105458 83475 50799
10550 50799 -95031 34543 -179650 -16312 -5769 11964 -159389 46117 202348 -176590 105629
10538 -112255 -30670 35472 -122517 -81289 -176286 36469 -222942 -315852 -232742 -263841 194072
10526 36235 234765 -191278 60400 -157090 54581 99407 -72178 97139 181502 125288 -281266
10514 2242 446617 49919 -108759 -106124 -85152 -245576 -41147 170239 88329 -114096 117246
10502 116392 151269 30285 -22974 -195262 -274380 -57128 79459 -166132 -284959 -148636 -96834
10491 -96834 255990 -352313 -259513 116537 422884 -125233 -197072 -119420 127784 215910
$$ packed form
10572A40103b29324c609B08949F1725a85264c6334A8142N5029M5076a13086m1810
10561a54896e1225k56147c1839B02763h7099E1838g8622l5024Q188H3475l2676
10550E0799i5031C4543a79650a6312e769A1964a59389D6117J56231a76590A05629
10538a12255c0670C5472a22517M1228r4997C6469b22942r2910Q3110l1099A94072
10526C6235J98530a91278F0400a57090E4581M4826g2178I7139Q4363n6214b81266
10514B242M44375D9919a08759K635K0972j60424d1147A70239q1910a14096A17246
10502A16392L4877C0285b2974j72288p9118e7128G9459a66132j18827J36323N1802
10491i6834B55990c52313R2800A16537L06347a25233p1839P7652A27784Q8126
$$ plain form
10481 215910 524386 727160 494457 363178 391074 367979 250187 32475 199711 -235015
10470 -29986 75726 -13284 -246684 -247485 68560 168770 -136387 262551 56110 -218786 157015
10458 443859 -12137 -19672 -144030 222837 26110 29454 -268234 -243620 205491 85804 -274156
10446 211702 73574 202115 91019 -72227 243377 -3335 202172 -120073 -95489 256803 -294076
10434 -443770 -294475 -245356 -417020 373934 170224 -31535 -12285 75038 -26544 24543 -84159
10422 -408187 265595 11358 203127 -49941 136379 -19068 211874 26888 -38467 -103795 92021
10410 109212 -516129 -410671 -268395 101403 -31646 102022 206763 -319297 162077 131554
10400 131554 167065 -16711 76246 -31353 40680 202005 -12218 51988 -90714 148248 24857
$$ packed form
10481B15910L08476K02774k32703j31279K7896k3095j17792C2475J67236b35015
10470b9986G5726a3284k33400q01F8560J00210a36387B62551E6110b18786A57015
10458D43859a2137p535j24358B22837B6110L344b68234K4614B05491H5804b74156
10446B11702G3574J28541I1019g2227B43377c335B02172a20073K4584B56803b94076
10434d43770J49295M9119j71664C73934A70224c1535a2285G5038b6544B4543h4159
10422d08187B65595A1358J91769d9941A36379a9068B11874B6888c8467o5328I2021
10410A09212e16129J05458J42276A01403c1646A02022J04741c19297A62077l0523
10400A31554L5511a6711G6246c1353D0680J61325a2218E1988i0714A48248B4857
$$ plain form
10388 -35209 263511 412649 -128270 215887 -12416 199993 73253 309643 400185 -183256
10377 96383 503666 102849 418373 304211 288045 113765 324394 450370 259189 454228
10367 454228 734644 997570 478267 488859 346337 613678 259338 393859 316076 524645
10357 524645 476673 -7728 606597 371906 231787 493216 725356 980164 699983 835442
10347 835442 520430 380317 156634 419511 608616 384092 464219 244618 221352 277970
10337 277970 719367 78286 23712 360159 -91810 439237 141401 475560 69107 109461
10327 109461 444434 78091 421629 675606 284323 334875 375020 147371 133579 657463
10317 657463 -126978 366340 -77591 393131 -85822 -369552 107564 -253513 -53886 -208577
$$ packed form
10388c5209B63511J49138a28270B15887a2416A99993G3253K36390R0542a83256
10377I6383M07283A02849L15524j14162j6166A13765K10629J25976j91181J95039
10367D54228K80416K62926D78267J0592j42522K67341B59338J34521p7783K08569
10357E24645m7972g728F06597k34691j40119K61429K32140K54808k80181J35459
10347H35442l15012j40113A56634K62877J89105k24524Q0127k19601k3266N6618
10337B77970M41397G8286B3712L36447i1810D39237A41401L34159F9107M0354
10327A09461L34973G8091L43538K53977B84323N0552M0145A47371j3792N23884
10317F57463a26978C66340g7591C93131h5822k83730A07564b53513e3886j54691
$$ plain form
10307 -208577 229007 -99296 90722 179531 -74684 91458 -40169 -302736 -66313 -142921 -226518
10296 -226518 -13300 -154337 49201 -123580 -99004 131533 88793 153916 -44455 -244715 -12675
10284 15151 -266168 -26088 144770 -167715 97883 220503 54557 -28525 -141298 -129780 66750
10272 -55766 -8941 -105685 228966 -268559 79766 -4296 26779 7913 55182 19071 82747 -8734
10259 -100888 273762 401775 461689 199908 141139 223373 169311 219445 263377 110250 -327053
10247 53023 16177 138641 195627 -56852 -80497 -168531 -132562 126965 75996 -42928 -4891
10235 15963 -125079 -91792 -154315 21657 -263003 79477 -150141 -106087 24184 -488679 -464621
10224 -464621 -226238 -281785 135021 -194370 -75869 -142121 67622 -61920 9458 -204219 20906
$$ packed form
10307b08577B29007i9296I0722Q8809g4684I1458d0169k62567f6313p6608q3597
10296b26518a3300j41037D9201a23580K4576A31533m2740O5123d4455k00260a2675
10284A5151b66168b6088A44770a67715I7883J22620E4557b8525j12773J1518F6750
10272e5766h941r6744B28966b68559G9766d296B6779G913M7269A9071O3676h734
10259a00888B73762J28013N9914A99908n8769Q2234n4062N0134M3932A10250c27053
10247E3023A6177J22464N6986e6852k3645q8034L5969A26965n0969d2928d891
10235A5963a25079L3287o2523B1657b63003G9477a50141M4054B4184d88679K4058
10224d64621b26238n5547A35021a94370g5869o6252F7622f1920I458b04219B0906
$$ plain form
10212 -152341 -347835 -117614 29415 104080 14408 240349 89728 -204636 -213688 -121131 -7980
10200 -1491 -102834 -123880 -129462 -289608 -166578 -110957 97069 -119841 284510 -251344 -72080
10188 -276265 -45452 203985 -285123 90371 -197395 -145820 -11728 9531 3175 172904 -36660
10176 -156997 -279654 214601 -367895 -402231 -327871 54752 -95695 -81879 -50047 -218848 -161184
10165 -161184 -207203 323036 -8204 48062 7782 -151001 -100141 -207155 -446627 -73450 -88231
10154 -88231 -93930 -110903 17937 107396 11604 -440606 -42980 -103315 -215171 -151612 -364734
10143 -364734 41155 163687 -55093 224212 39525 143884 -293746 220993 -88175 -117344
10133 -117344 -58530 -117337 -163731 67602 -157739 -190442 74699 -59147 -217353 207424 228776
$$ packed form
10212a52341j95494a17614B9415P4665A4408K25941H9728b04636r052R2557g980
10200a491j01343k1046n582j60146J23030N5621I7069a19841B84510b51344g2080
10188b76265d5452B03985b85123I0371a97395N1575a1728I531C175J69729c6660
10176a56997j22657B14601c67895l4336P4360E4752i5695J3816L1832j68801N7664
10165a61184m6019C23036h204D8062G782a51001N0860j07014k39472g3450j4781
10154h8231n699j6973A7937Q9459A1604d40606d2980o0335j11856O3559k13122
10143c64734D1155J22532e5093B24212C9525J04359b93746B20993h8175k9169
10133a17344e8530n8807m6394F7602a57739l2703G4699e9147j58206B07424K1352
$$ plain form
10122 228776 -92026 -65056 198 -250910 -41206 -460864 2282 -22875 -37151 59104 13712 81952
10110 81952 -270646 16242 130081 243131 -52952 -122075 -56076 -166850 -17344 -78367 219633
10098 117385 37369 -87646 -58517 56492 -26601 -211464 -150232 46792 68012 -328611 -295178
10087 -295178 114501 -69189 67709 17752 -178681 -285773 20423 263604 -16037 80243 2209
10075 -73706 -438666 -9299 118253 297349 23580 -8674 -88467 -178630 193906 -162244 -205735
10064 -205735 -86995 248027 133364 -101192 48941 129000 -55652 -13477 -126963 -43939 123129
10052 -15233 -353344 -45582 -15666 -346453 -49153 -162348 -132203 -226157 -138604 130970 -90355
10040 11756 -187632 8093 176326 -216956 -116939 -393916 71336 -8049 -302065 -31711 210025
$$ packed form
10122B28776i2026K6970A98b50910d1206m19658B282b2875j4276E9104A3712O8240
10110H1952b70646A6242J13839J13050e2952o9123e6076j10774a7344o1023B19633
10098A17385C7369h7646K9129E6492b6601j84863O1232D6792K1220c28611L3433
10087b95178A14501f9189F7709A7752a78681j07092B0423K43181a6037H0243B209
10075g3706l64960i299A18253J79096B3580h674p9793r0163A93906a62244m3491
10064b05735h6995B48027j14663a01192D8941Q0059e5652a3477j13486d3939A23129
10052a5233l38111d5582a5666l30787d9153j13195L0145r3954Q7553A30970i0355
10040A1756a87632H093J68233b16956J00017k76977G1336h049k94016c1711B10025
$$ plain form
10028 -144035 -13537 -421315 -270160 -54840 182647 223586 -217734 101301 66055 115791
10018 115791 -160168 -93319 17410 -61254 -60550 175884 18054 -184949 -32769 126211 -132255
10006 267591 -12263 -226559 -97541 -203302 -107589 -453993 -18106 -76056 55378 34227 -23321
9994 176180 -42405 -13224 -144498 -68235 -374073 -320852 -166278 235943 -68049 -9649 -81934
9983 -81934 -146365 -72027 308295 162837 -150294 -96129 7761 -245366 100183 -101 34491
9971 -175057 -33615 -185020 -12136 -188675 191530 -380193 -224551 -112094 -158545 -149692 127556
9959 26238 -186579 180830 -379521 59150 -191779 -120913 -68981 -292394 -217650 -137112 -42301
9947 119228 -90443 -24336 -171845 -236314 -45786 -117159 192248 35361 -140882 70200 296527
$$ packed form
10028a44035a3537m07778J51155e4840A82647M0939b17734A01301l5246M9736
10018A15791a60168O6849A7410f1254P04A75884A8054a84949c2769A26211a32255
10006B67591a2263k14296i7541j05761R5713l46404a8106n7950E5378k1151b3321
9994A76180d2405a3224j31274f8235l05838N3221J54574B35943f8049i649p2285
9983h1934o4431g2027C08295j45458a50294N4165G761b45366A00183a01C4491
9971a75057c3615j51405a2136j76539A91530c80193J55642a12094m6451Q853A27556
9959B6238a86579A80830c79521E9150a91779P0866N1932k23413P4744Q0538d2301
9947A19228i0443b4336j47509o4469d5786p1373A92248C5361a40882G0200K26327
$$ plain form
9936 296527 26566 21396 -5792 77199 -86870 306543 11521 127168 -39355 -150482 -92981
9925 -92981 34866 -148211 -237380 -464540 -338793 -103323 -343768 441420 92714 -299864
9914 81031 -25429 102334 -89246 -74879 -146899 -136029 20649 -157089 -220276 -54438 41361
9902 -60666 86108 -201236 96752 64838 -243424 -297782 218994 -116836 -276819 -167714 -546613
9891 -546613 -190926 -316819 -188247 316878 -209266 -46121 355856 225258 -41123 -93526
9881 -93526 -26664 -133935 -426137 96495 -126959 -370746 44917 28384 -23933 -333056 -60776
9869 -202620 -165289 52716 -232810 -149413 -275186 -112980 -300218 64665 57145 -174145 55591
9857 -126000 182932 44692 -627 -178223 -59473 -5130 -204947 195125 55117 53789 -204763
$$ packed form
9936B96527B6566n170e792G7199h6870C06543A1521J15647c9355j11127N7501
9925i2981C4866a48211q9169k27160J25747a03323k40445D41420I2714b99864
9914H1031b5429A02334h9246J4367p2020J0870B0649a57089o3187e4438D1361
9902f0666H6108b01236I6752l1914b43424n4358B18994a16836j59983J09105l78899
9891e46613a90926j25893J28572C16878b09266d6121C55856j30598d1123n2403
9881i3526b6664j07271k92202I6495a26959k43787D4917j6533b3933l09123f0776
9869b02620L7331E2716b32810Q3397j25773a12980j87238F4665p520a74145E5591
9857a26000A82932D4692f27j77596e9473e130j99817A95125E5117j328b04763
$$ plain form
9845 -181607 -119697 399569 -105609 -58807 170424 -217092 -274017 67491 -149016 -180051 24414
9833 -5089 11549 -50620 -333827 -66999 -335593 -53698 -131284 -158737 -258 -120764 42942 -155457
9820 -421939 -84304 -94770 78010 -418674 102121 60371 -67527 127719 85203 -508556 -237998
9808 13069 -64411 -149766 -125131 -131155 -152088 -118393 121113 39138 416240 -114339 -180376
9797 -180376 -145172 -2399 -165618 -15 62068 -359799 -143885 156202 -271481 -544774 -81103
9785 -25261 171238 42745 91787 89110 489848 18301 2960 -49981 -287287 -292882 -68963 -213861
9773 -213861 29531 -122832 57649 -346398 31599 -132315 -333315 53412 -153176 -141275 -225907
9762 -225907 -248 -137886 171571 -254435 75083 129486 -241581 -63572 78530 -56430 -94357
$$ packed form
9845a81607O1910C99569a05609M6802A70424b17092n6925F7491a49016l1035B4414
9833e089A1549e0620k83207f6999k68594e3698p7586k7453b58j20506D2942a55457
9820d21939h4304j0466G8010d18674A02121m1750f7527A27719m2516e08556b37998
9808A3069f4411q5355K4635o024k0933L3695A21113C9138L77102a14339o6037
9797a80376L5204b399j63219a5F2068c59799a43885A56202b71481k73293h1103
9785b5261A71238D2745M9042k677M00738A8301B960d9981k37306n595f8963j44898
9773b13861B9531a22832E7649c46398C1599a32315k01000E3412a53176J1901q4632
9762b25907b48j37638A71571b54435G5083N4403b41581f3572G8530e6430l7927
$$ plain form
9751 -94357 -126197 -166635 -297506 -146830 -120520 -103843 13726 36753 -138852 -160590 -82154
9740 -82154 -136836 -221009 339234 194773 -102111 -141702 -110649 -63168 -273921 -9643 -144838
9729 -144838 89635 -62805 -110044 -276719 63118 98615 -70184 -113025 -36822 56415 95623
9718 95623 -81199 9071 -258486 -192084 206594 -94853 135313 -277986 837 -130071 -137696 -17244
9705 -114093 49383 2004 -268153 237743 -21529 -93482 -313140 140606 -23637 60576 -179252
9693 251721 -209008 -40607 105000 161308 -45637 -277298 -192588 145539 100848 -95074 12837
9681 -24895 -10403 -59545 -23325 -20049 139554 124106 -133130 -84937 181054 -326918 239942
9669 330176 98303 29421 6965 -313279 46792 279653 108985 -193121 -37127 -28276 -135 -154714
$$ packed form
9751i4357l1840m0438j30871a46830K6310J6677A3726K3027a38852k1738P8436
9740h2154n4682q4173C39234j44461a02111l9591L1053M7481k10753i643j35195
9729a44838H9635f2805m7239j66675F3118L5497g0184m2841c6822E6415L9208
9718I5623h1199I071b58486O6402B06594i4853A35313b77986H37a30071p625a7244
9705a14093D9383B004b68153B37743b1529p1953k19658A40606b3637F0576a79252
9693B51721b09008d0607A05000N6308d5637k31661Q4710A45539m4691i5074A2837
9681b4895a0403m9142b3325L276A39554j5448a33130M8193A81054c26918B39942
9669C30176I8303B9421F965c13279D6792K32861A08985a93121c7127Q851a35j54579
$$ plain form
9657 -154714 -313121 -142990 182549 -202367 212803 5410 70916 -138996 23268 43941 158266
9646 158266 -87411 3370 189116 -18294 3465 -115982 76653 21808 -201617 -135758 153751
9634 -91119 -286083 74716 -147601 -205833 -196681 -305125 -167687 -26954 -194373 -127220 -82091
9623 -82091 4137 195377 -199708 -82174 -51257 125809 194752 101554 79835 83308 152621 -93997
9610 -217328 1353 -240045 -141994 -89708 -147272 -81043 73483 202061 54113 67177 78896
9599 78896 65402 -217021 -316607 58641 181650 -136894 -16748 56687 20649 23446 -140120
9587 -321821 118142 -31367 -220167 -94875 -114988 -145574 -274706 -334360 23432 38924 -108958
9575 -218965 -220564 156378 -85104 -286431 113691 105249 -157076 -188413 -202262 48822 -32487
$$ packed form
9657a54714j58407a42990A82549b02367B12803E410O5506a38996B3268K0673J14325
9646A58266h7411C370J85746a8294C465a15982G6653B1808b01617O5859A53751
9634i1119j94964G4716a47601n8232R152j08444J37438b6954j67419O7153M5129
9623h2091D137J91240a99708h2174L0917A25809O8943r3198k1719L473O9313i3997
9610b17328A353b40045R8051N2286n7564O6229G3483J28578E4113J3064J1719
9599G8896j3494b17021r9586E8641J23009a36894a6748E6687B0649K797a40120
9587c21821A18142c1367j88800i4875k0113l0586j29132n9654B3432J5492a08958
9575b18965j599A56378h5104k01327A13691q442a57076l1337j3849D8822c2487
$$ plain form
9563 -417435 -64234 144461 -3425 -63897 102575 -66554 65076 -71157 7314 -320897 302374
9551 -201453 -205679 144719 107614 -119335 -145674 -69958 39655 -265210 22482 121816 -138773
9539 -123352 51531 -76721 -532509 -83634 -11111 -79608 -109862 -376070 152115 -105492 142174
9527 -193072 141948 110115 181670 84029 -438960 -155338 134490 108352 -146983 -228963 -137447
9516 -137447 -110682 -218036 -110582 -210909 -107729 -103138 168678 89699 -307157 -178215
9506 -178215 11980 -68417 -15833 202385 -40787 93599 195377 -133138 44698 -39735 233086
9494 118848 -123460 180929 313783 124725 348784 -218573 7484 -23410 -15163 -122415 -45106
9482 -21732 -34851 -489749 -47118 45515 -161194 -213740 -173652 -34243 64828 -254746 -419932
$$ packed form
9563d17435f4234A44461c425o0472A02575f6554F5076g1157G314c20897C02374
9551b01453m226A44719l7105a19335k6339f9958C9655b65210B2482R9334a38773
9539a23352E1531g6721m55788h3634a1111o8497l0254k66208A52115a05492A42174
9527a93072A41948l1833P1555H4029d38960a55338A34490k6138a46983q1980R1516
9516a37447K6765j07354J07454j00327J03180M591A68678p8979c07157J28942
9506a78215A1980f8417a5833B02385d0787I3599J01778a33138D4698c9735B33086
9494A18848a23460A80929J32854A24725K24059b18573G484b3410Q247j07252d5106
9482b1732j3119m54898d7118D5515a61194n2546M0088c4243F4828b54746j65186
$$ plain form
9471 -419932 -191783 234245 -104674 195771 -25092 -141233 20106 -407353 170409 215249
9461 215249 256615 -1366 -266952 279761 -136690 71731 -8043 139695 -87918 80932 -399252
9449 -448027 37417 -171381 -13108 -1524 -34815 -61783 170656 74226 -69733 31311 -471247
9437 -34401 302580 -33371 165119 -90922 -251117 -197580 -149219 21006 226077 -87509 224825
9425 151377 -162060 2069 -181355 -114034 119284 -201016 -265695 -286521 50157 -142395 -255268
9414 -255268 85493 -17479 41463 149779 163212 -182571 -237899 -150629 -67372 137116 -79701
9402 -27764 194362 22711 -110517 -261802 -226490 81245 -37424 -305605 225554 -170259 -71921
9390 -327377 -152561 -131542 -174955 -260781 -88352 -16790 -60433 79517 -113516 -93748 -34673
$$ packed form
9471d19932a91783B34245a04674A95771b5092j16141B0106d07353A70409M4840
9461B15249M1366a366k65586B79761a36690G1731h043A39695h7918H0932c99252
9449d48027C7417a71381a3108a524l3291k6968A70656G4226f9733C1311d71247
9437c4401C02580c3371A65119i0922j60195N3537M8361B1006K05071h7509B24825
9425A51377a62060B069a81355O7321A19284b01016o4679k0826E0157a42395j12873
9414b55268H5493a7479D1463J08316J3433a82571n5328Q7270f7372A37116g9701
9402b7764A94362B2711a10517j51285L5312H1245c7424k68181B25554a70259g1921
9390c27377a52561K1019m3413q5826h8352a6790m3643G9517a13516J9768c4673
$$ plain form
9378 -290862 -172346 45314 237556 7069 120947 97300 26462 90795 -126601 -138927 58787
9366 -76308 69927 -13197 -186602 139552 -374608 44545 -88096 68825 -586985 -127541 28726
9354 59267 -41634 310134 -82666 -247110 -578068 33246 391595 -150981 292321 227605 -78635
9342 54719 -289075 -110048 -53058 316151 32727 -179780 -86429 -64153 -81308 -144797 -226851
9331 -226851 209276 -7693 91335 -393645 40837 -177493 -150762 -251329 -177367 59970 -329845
9319 189279 -282501 4259 -17674 -34375 -109151 3836 -212782 -48484 -142631 81027 -182436
9307 99993 74847 -249844 -159943 -248052 103160 165357 -307026 54431 -262566 -101957 -351105
9296 -351105 18041 -37808 -70839 -394493 117309 20476 -251616 -86088 173693 37189 -233296
$$ packed form
9378b90862J18516D5314J92242G069J13878k3647B6462O4333a26601j2326E8787
9366g6308F9927a3197j73405A39552c74608D4545h8096F8825e86985a27541B8726
9354E9267d1634C10134h2666j64444l30958C3246L58349a50981B92321o4716g8635
9342E4719b89075a10048e3058C16151C2727a79780h6429K2276j7155o3489q2054
9331b26851B09276g693I1335c93645D0837a77493K6731j00567P3962E9970c29845
9319A89279b82501D259a7674j6701p4776C836b12782d8484r4147H1027a82436
9307I9993k5146b49844Q9901q8109A03160O2197c07026E4431b62566a01957k49148
9296c51105A8041c7808l3031l23654A17309B0476b51616h6088A73693C7189b33296
$$ plain form
9284 -146813 -5627 -446216 -194600 -227517 -156380 -28321 -123618 121839 71547 -151299 -241889
9273 -241889 41131 141617 184695 153977 115646 22322 -438954 -3704 94330 53954 286586
9262 286586 -175476 -176183 123647 -352666 2917 187122 -129005 -300183 127877 -322366 87239
9250 47847 53459 -83124 -28162 -103038 210635 97867 249675 -41942 46115 -456951 -66641
9238 41323 -224197 272499 -359655 -416159 -116153 60566 279512 80664 103665 -309154 257113
9226 118438 216152 178826 -473456 -19803 -230377 297234 -266050 366950 -35796 -112004 137602
9214 -45293 -117481 133548 -146868 -158624 40995 461738 74671 -317929 -129251 -199382 -311152
9203 -311152 376648 174892 -145731 80401 -102696 56479 74514 -138526 -1876 -106998 -333327
$$ packed form
9284a46813e627m40589a94600l2917P1137b8321r5297A21839n0292a51299r0590
9273b41889D1131J00486M3078l0718l8331B2322d38954c704I4330m0376K32632
9262B86586a75476p07A23647c52666B917J84205a29005j71178A27877c22366H7239
9250D7847N612h3124b8162p4876B10635I7867J51808d1942D6115d56951f6641
9238D1323b24197B72499c59655n6504a16153F0566K18946H0664K3001c09154B57113
9226A18438R7714l7326d73456a9803k10574B97234b66050C66950c5796p6208A37602
9214d5293p2188A33548a46868j1756D0995M20743G4671c17929a29251p0131j11770
9203c11152C76648A74892a45731H0401a02696E6479J8035a38526a876j05122k26329
$$ plain form
9192 -333327 -171768 -105243 -106560 6376 178123 -93802 40913 90908 -163404 -9773 -151522
9181 -151522 40613 242966 57214 -363122 56866 301279 -188235 -84727 -3089 -311440 -148369
9169 -89384 215106 -210789 -286799 -17003 219698 -219951 -79504 -293648 -254464 -13257 -158846
9158 -158846 150332 523070 -21511 8798 265120 15132 -441738 200997 -226741 -199075 -284921
9147 -284921 -117991 109045 -174611 185511 256355 -123336 54562 -248517 -222935 -178656
9137 -178656 -54972 85552 -6483 51133 -21508 -35188 -11391 -355576 -165313 98032 -208133
9125 -137296 -123336 64899 -269629 -283489 -106298 -270687 -174438 314377 171964 -45578 -114367
9114 -114367 -4688 83815 -146935 160721 -161926 -10776 -232108 -104661 -14396 -26259 164228
$$ packed form
9192c33327J61559O6525j317F376J71747i3802D0913M9995a63404i773j41749
9181a51522D0613K02353E7214c63122E6866K44413a88235h4727c089l08351a48369
9169h9384B15106b10789p6010a7003B19698b19951g9504k14144L9184a3257j45589
9158a58846A50332L72738b1511H798K56322A5132d41738B00997b26741K7666q5846
9147b84921a17991A09045a74611A85511P0844a23336E4562b48517K5582M4279
9137a78656e4972H5552f483E1133b1508j3680a1391l44185a65313I8032b08133
9125a37296J3960F4899b69629j3860a06298j64389R6249C14377j42413d5578o8789
9114a14367d688H3815a46935A60721a61926a0776k21332a04661a4396j1863A64228
$$ plain form
9102 -124638 -194969 113899 -56163 93451 -95664 196074 -356414 -109026 -135790 -129031 -102193
9091 -102193 -41542 -432599 -95112 24926 -60811 -294826 -4610 -189104 -469958 85599 -54992
9079 172815 82727 -324812 -166846 -409336 -155627 -99347 -134888 -220689 -114397 -113145 -115788
9068 -115788 123719 -25826 -317724 -16777 -202400 191953 -324112 -181341 124771 117072
9058 117072 -238799 185042 -257898 138240 39517 -329168 -46858 -30672 316787 -287663
9047 -387550 -7160 -234026 -262504 -126001 -124303 9462 -222369 -19206 -258719 237949 60396
9035 122812 232359 248448 351730 216978 -62590 22983 20373 76003 -287418 -167201 -115431
9024 -115431 -215155 -242352 21006 139632 82993 -2243 -15064 -213892 -301038 -314899 231514
$$ packed form
9102a24638p0331A13899e6163I3451i5664A96074c56414a09026k6764O759K6838
9091a02193d1542l91057i5112B4926f0811k34015d610j84494k80854H5599e4992
9079A72815H2727c24812J57966k42490a55627N6280l5541q5801J06292J252k643
9068a15788A23719b5826k91898a6777j85623A91953c24112J42771A24771p699
9058A17072b38799A85042b57898A38240C9517c29168d6858J6186C16787b87663
9047c87550g160k26866k8478a26001J698I462b22369a9206k39513B37949F0396
9035A22812J09547J6089J03282j34752f2590B2983k610N5630b87418J20217N1770
9024a15431r9724k7197B1006J18626n6639b243j2821j98828q7146j3861B31514
$$ plain form
9012 160972 -430984 88330 -130325 -13139 186515 -248440 -112167 -213383 105368 -96994
9001 -3152 6179 -281965 -76904 -123260 259975 -200903 154322 30065 -7079 -107284 376362
8989 -176785 56799 -21433 112893 -279354 137380 -327852 -87730 -95604 -219312 -22569 74096
8977 20943 -78783 -151834 -146684 66293 109072 -12583 272924 267969 -70340 -10849 -140707 -69313
8964 -20924 292770 113903 -78607 -380747 -86482 -404942 -67378 -128639 60696 -226446 -123495
8953 -123495 -104769 -154623 -98925 198273 -241376 -55031 13205 -17789 275551 108743 230826
8942 230826 -339189 -156313 114577 66077 56311 -344369 -17000 231983 267540 73564 377349
8931 377349 -77147 -116197 -9997 -240975 326881 388966 205767 631484 2108981 5523471
$$ packed form
9012A60972d30984H8330a30325a3139A86515b48440a12167j01216A05368i6994
9001c152F179b81965g6904m6356B59975b00903A54322C0065g079j00205C76362
8989a76785E6799b1433A12893b79354A37380c27852h7730p874j23708b2569G4096
8977B0943g8783p3051N150F6293M2779a2583B72924m955g0340a0849j29858f9313
8964b0924B92770A13903g8607l02140h6482l18460f7378o1261F0696b26446J02951
8953a23495J8726m9854N5698A98273b41376e5031A3205a7789B75551A08743J22083
8942B30826c39189a56313A14577m8500r766c44369a7000B31983L5557G3564L03785
8931C77349g7147l9050i997k30978C26881O2085j83199M25717J477497L414490
$$ plain form
8921 5523471 12899988 3257078 835922 690463 180818 366567 373098 172326 73541 190896
8911 190896 106351 55867 199658 395425 21442 -97049 -22105 109527 -233750 -154800 140684
8899 126565 -210174 -93801 -399021 -127602 -152436 -126811 -957 -114942 54624 108793 -251164
8887 -319630 -210 -131243 -61976 -546441 292202 108954 17028 -63590 -159046 -29290 -176224
8876 -176224 -9519 -54723 -86534 53461 -257275 -69480 -105762 56371 -144569 -83225 135878
$$ packed form
8921E523471P376517C257078H35922j45459A80818J85749O531A72326G3541J17355
8911A90896q4545n0484J43791J95767B1442i7049b2105A09527b33750P8950A40684
8899A26565b10174i3801l05220a27602k4834K5625i57j13985E4624N4169b51164
8887c19630b10j31033f1976m84465B92202A08954A7028f3590r5456b9290j46934
8876a76224i519m5204l1811E3461b57275f9480l6282E6371a44569O1344A35878
$$ [...]
##END NTUPLES=NMR SPECTRUM
##END=
