##TITLE=AC1694_ROEFFECT0025_8636665_yRcWPYUucc
##JCAMPDX= 6.0         $$ Bruker NMR JCAMP-DX V2.0
##DATA TYPE= NMR SPECTRUM
##DATA CLASS= NTUPLES
##ORIGIN= BRUKER
##OWNER= Administrator
$$ 1.72 TOPSPIN		Version 2.1
$$ 2014-05-22 15:18:31.181 -0700  Administrator@X
$$ Compression mode = diff/dup
##.OBSERVE FREQUENCY= 400.02188249412
##.OBSERVE NUCLEUS= ^1H
##.ACQUISITION MODE= SIMULTANEOUS (DQD)
##.ACQUISITION SCHEME= undefined
##.AVERAGES= 64
##.DIGITISER RES= 22
##SPECTROMETER/DATA SYSTEM= spect
##.PULSE SEQUENCE= noesygpps1d.comp
##.SOLVENT NAME= COFFEE_meoh
##.SHIFT REFERENCE= INTERNAL, COFFEE_meoh, 1, 14.96103
##AUDIT TRAIL= $$ (NUMBER, WHEN, WHO, WHERE, PROCESS, VERSION, WHAT)
$$ ##TITLE= Audit trail, TOPSPIN		Version 2.1
$$ ##JCAMPDX= 5.01
$$ ##ORIGIN= Bruker BioSpin GmbH
$$ ##OWNER= Administrator
$$ $$ E:\/data/COFFEE/nmr/AC1694_ROEFFECT0025_8636665_yRcWPYUucc/12/pdata/1/auditp.txt
$$ ##AUDIT TRAIL=  $$ (NUMBER, WHEN, WHO, WHERE, PROCESS, VERSION, WHAT)
(   1,<2014-05-22 15:18:25.681 -0700>,<Administrator>,<X>,<go>,<TOPSPIN 2.1>,
      <created by zg
	started at 2014-05-22 15:06:56.746 -0700,
	POWCHK enabled, PULCHK disabled,
       configuration hash MD5:
       C8 4E 4E 5D D3 5C D8 9E 9F 52 82 E0 59 8A DE 15
       data hash MD5: 64K
       2E 45 39 01 2A 10 4C 5D 49 DF 6D B5 62 CB 81 AF>)
(   2,<2014-05-22 15:18:28.774 -0700>,<Administrator>,<X>,<proc1d>,<TOPSPIN 2.1>,
      <Start of raw data processing
       efp LB = 0.3 FT_mod = 6 PKNL = 1 PHC0 = 0 PHC1 = 0 SI = 128K 
       data hash MD5: 128K
       6E 96 C5 46 34 79 F2 36 40 9C 16 33 FC 07 49 40>)
(   3,<2014-05-22 15:18:29.899 -0700>,<Administrator>,<X>,<proc1d>,<TOPSPIN 2.1>,
      <pk PHC0 = -82.21619 PHC1 = 0 
       data hash MD5: 128K
       62 E4 E9 11 37 AB 6A 45 4C 15 AF 76 26 C2 3B 7B>)
(   4,<2014-05-22 15:18:30.431 -0700>,<Administrator>,<X>,<proc1d>,<TOPSPIN 2.1>,
      <abs ABSG = 1 
       data hash MD5: 128K
       44 15 10 14 40 FE 6F 23 9E 06 47 B5 35 D8 08 6B>)
(   5,<2014-05-22 15:18:30.571 -0700>,<Administrator>,<X>,<proc1d>,<TOPSPIN 2.1>,
      <abs ABSG = 2 
       data hash MD5: 128K
       DF 3B 9B F3 80 72 75 C8 38 C2 65 32 56 9E A3 38>)
(   6,<2014-05-22 15:18:30.665 -0700>,<Administrator>,<X>,<proc1d>,<TOPSPIN 2.1>,
      <abs ABSG = 3 
       data hash MD5: 128K
       E9 EE E9 20 EF ED D0 1F 84 70 E6 70 48 B0 24 81>)
(   7,<2014-05-22 15:18:30.806 -0700>,<Administrator>,<X>,<proc1d>,<TOPSPIN 2.1>,
      <abs ABSG = 4 
       data hash MD5: 128K
       66 84 D5 3C 27 AA A8 69 F6 DC 9D 3E CC C6 18 4E>)
(   8,<2014-05-22 15:18:30.931 -0700>,<Administrator>,<X>,<proc1d>,<TOPSPIN 2.1>,
      <abs ABSG = 5 
       data hash MD5: 128K
       6D C6 3F 26 44 F0 88 BB A8 69 C0 87 BB 94 A7 B9>)
$$ ##END=
$$ 
$$ $$ hash MD5
$$ $$ 5C C8 66 2F 83 52 36 E7 7B 6E 7F A4 46 AB 36 95
##$RELAX= 
##$RELAX= 
##$RELAX= 
##$RELAX= 
##$RELAX= 
##$RELAX= 
##$RELAX= 
##$RELAX= 
$$ Bruker specific parameters
$$ --------------------------
##$DU= <E:\>
##$EXPNO= 12
$$ [...]
##$TP07= 0
##$TPNAME0= <>
##$TPNAME1= <>
##$TPNAME2= <>
##$TPNAME3= <>
##$TPNAME4= <>
##$TPNAME5= <>
##$TPNAME6= <>
##$TPNAME7= <>
##$TPOAL= (0..7)
0.5 0.5 0.5 0.5 0.5 0.5 0.5 0.5
##$TPOFFS= (0..7)
0 0 0 0 0 0 0 0
##$TUNHIN= 0
##$TUNHOUT= 0
##$TUNXOUT= 0
##$USERA1= <user>
##$USERA2= <user>
##$USERA3= <user>
##$USERA4= <user>
##$USERA5= <user>
##$V9= 5
##$VALIST= <valist>
##$VCLIST= <CCCCCCCCCCCCCCC>
##$VD= 0
##$VDLIST= <DDDDDDDDDDDDDDD>
##$VPLIST= <PPPPPPPPPPPPPPP>
##$VTLIST= <TTTTTTTTTTTTTTT>
##$WBST= 1024
##$WBSW= 4
##$XGAIN= (0..3)
0 0 0 0
##$XL= 0
##$YL= 0
##$YMAX_a= 7484004
##$YMIN_a= -16367682
##$ZGOPTNS= <>
##$ZL1= 120
##$ZL2= 120
##$ZL3= 120
##$ZL4= 120
##$ABSF1= 14.96103
##$ABSF2= -5.597152
##$ABSG= 5
##$ABSL= 3
##$ALPHA= 0
##$AQORDER= 0
##$ASSFAC= 0
##$ASSFACI= 0
##$ASSFACX= 0
##$ASSWID= 0
##$AUNMP= <proc_prof1d_extract.lims>
##$AXLEFT= 0
##$AXNAME= <>
##$AXNUC= <1H>
##$AXRIGHT= 0
##$AXTYPE= 0
##$AXUNIT= <>
##$AZFE= 0.1
##$AZFW= 0.1
##$BCFW= 0
##$BC_mod= 0
##$BYTORDP= 0
##$COROFFS= 0
##$CY= 15
##$DATMOD= 1
##$DC= 0
##$DFILT= <>
##$DTYPP= 0
##$F1P= 0
##$F2P= 0
##$FCOR= 0.5
##$FTSIZE= 131072
##$FT_mod= 6
##$GAMMA= 0
##$GB= 0
##$INTBC= 1
##$INTSCL= 1
##$ISEN= 128
##$LB= 0.3
##$LEV0= 0
##$LPBIN= 0
##$MAXI= 10000
##$MC2= 0
##$MEAN= 0
##$ME_mod= 0
##$MI= 0
##$NCOEF= 0
##$NC_proc= -2
##$NLEV= 6
##$NOISF1= 0
##$NOISF2= 0
##$NSP= 0
##$NTH_PI= 0
##$NZP= 0
##$OFFSET= 14.96103
##$PC= 1
##$PHC0= -82.21619
##$PHC1= 0
##$PH_mod= 1
##$PKNL= yes
##$PPARMOD= 0
##$PPDIAG= 0
##$PPIPTYP= 0
##$PPMPNUM= 2147483647
##$PPRESOL= 1
##$PSCAL= 4
##$PSIGN= 0
##$PYNMP= <proc.py>
##$REVERSE= no
##$SF= 400.020009623989
##$SI= 131072
##$SIGF1= 0
##$SIGF2= 0
##$SINO= 400
##$SIOLD= 131072
##$SPECTYP= <>
##$SREGLST= <1H.CDCl3>
##$SSB= 0
##$STSI= 131072
##$STSR= 0
##$SW_p= 8223.68421052631
##$SYMM= 0
##$S_DEV= 0
##$TDeff= 65536
##$TDoff= 0
##$TI= <>
##$TILT= no
##$TM1= 0
##$TM2= 0
##$TOPLEV= 0
##$USERP1= <user>
##$USERP2= <user>
##$USERP3= <user>
##$USERP4= <user>
##$USERP5= <user>
##$WDW= 1
##$XDIM= 131072
##$YMAX_p= 372035184
##$YMIN_p= -12358
##$CURPLOT= <Network HP LaserJet P1505>
##$CURPRIN= <$Network HP LaserJet P1505>
##$DFORMAT= <normdp>
##$LAYOUT= <+/1D_H.xwp>
##$LFORMAT= <normlp>
##$PFORMAT= <normpl>
##$SURQMSG= 1
$$ End of Bruker specific parameters
$$ ---------------------------------
##NTUPLES= NMR SPECTRUM
##VAR_NAME=  FREQUENCY,     SPECTRUM/REAL,   SPECTRUM/IMAG
##SYMBOL=    X,             R,               I
##VAR_TYPE=  INDEPENDENT,   DEPENDENT,       DEPENDENT
##VAR_FORM=  AFFN,          ASDF,            ASDF
##VAR_DIM=   131072,        131072,          131072
##UNITS=     HZ,            ARBITRARY UNITS, ARBITRARY UNITS
##FACTOR=    0.0627417313425164, 1,          1
##FIRST=     8223.62146879497, 4543,         -86618
##LAST=      0,             7893,            -86135
##MIN=       0,             -12358,          0
##MAX=       8223.62146879497, 372035184,    0
$$ Real data points
##PAGE= N=1
##DATA TABLE= (X++(R..R)), XYDATA
$$ [...]
63782C22148k243k094k270k246j775r21L9O68N80k04j192j843j972j746j429j164
$$ 322148 319905 317811 315541 313295 311520 310599 310638 311306 311886 311682 310490 308647 306675 304929 303500 302336
63766C02336q31k12O15J098P61j36q04q55o57n99n31j55L42N23L58K01K37L64
$$ 302336 301505 301293 301908 303006 303767 303631 302827 301972 301315 300716 300185 300030 300372 300895 301253 301454 301691 302055
63748C02055N06P07Q77Q07N08K94N03J274K472L623M100L778L356L585M247M523
$$ 302055 302561 303268 304145 304952 305460 305754 306257 307531 310003 313626 317726 321504 324860 328445 332692 337215
63732C37215M296M375N154N841N574M727M426N039N883O272O190N961N841O010
$$ 337215 341511 345886 351040 356881 362455 367182 371608 376647 382530 388802 394992 400953 406794 412804
63718D12804O457O773O519N892N537N575N362M452L214K113R26q00k843m475n299
$$ 412804 419261 426034 432553 438445 443982 449557 454919 459371 462585 464698 465624 464824 461981 457506 452207
63703D52207n472n220m662m041l541k923j902q37m39o81o80O9R78J283J130J180
$$ 452207 446735 441515 436853 432812 429271 426348 424446 423609 423170 422489 421809 421878 422856 424139 425269 426449
63687D26449J567J883J970K072K222K022J169j06j178j431p00M61J132J039R29
$$ 426449 428016 429899 431869 433941 436163 438185 439354 439248 438070 436639 435939 436400 437532 438571 439500
63672D39500J522K398K590K084J863K512L551M352M817M888M228K890J639R32
$$ 439500 441022 443420 446010 448094 449957 452469 456020 460372 465189 470077 474305 477195 478834 479766
63658D79766K52r26k205l046l898n476p270q005p480o873o906o866n975m739m144
$$ 479766 480018 479092 476887 473841 469943 464467 457197 449192 441712 434839 427933 421067 415092 410353 406209
63643D06209m121l717k534j113O2J158K328L189L442L578M332N499O027N474M792
$$ 406209 402088 398371 395837 394724 394786 395944 398272 401461 404903 408481 412813 418312 424339 429813 434605
63628D34605N104O189O842O566O073O085O516P108P950Q909R417R493J0180J2016
$$ 434605 439709 445898 452740 459306 465379 471464 477980 485088 493038 501947 511364 520857 531037 543053
63614E43053J3901J4600J4783J6086J8468K0235K0814K1745K4250K7341K9380
$$ 543053 556954 571554 586337 602423 620891 641126 661940 683685 707935 735276 764656
63603G64656L0300L1020L1523L0947K9116K6721K3993K0321J5387R883M884R83
$$ 764656 794956 825976 857499 888446 917562 944283 968276 988597 1003984 1013867 1018751 1019734
63591A019734j869m042n785o904p098o859p535r922j3238j6080j8088j9837k1459
$$ 1019734 1017865 1013823 1008038 1001134 994036 987177 979642 969720 956482 940402 922314 902477 881018
63578H81018k2334k2151k1329k0300j9057j7628j6236j4826j3064j1001r067p265
$$ 881018 858684 836533 815204 794904 775847 758219 741983 727157 714093 703092 694025 686760
63566F86760n124k700q76j60J47J039K502L747M410M920N805P059Q226Q904R264
$$ 686760 681636 678936 678060 677900 678047 679086 681588 685335 689745 694665 700470 707529 715755 724659 733923
63551G33923J0164J2447J6005J9772K2803K5116K7397L0223L3735L7641M1254
$$ 733923 744087 756534 772539 792311 815114 840230 867627 897850 931585 969226 1010480
63540A010480M3795M4816M4050M0973L5088K6862J7815R399K382k639n146n721
$$ 1010480 1054275 1099091 1143141 1184114 1219202 1246064 1263879 1273278 1275660 1273021 1267875 1262154
63528A262154o200p830r915j1158j1795j3203j5886j9151k2635k6640l0778l3699
$$ 1262154 1255954 1248124 1238209 1227051 1215256 1202053 1186167 1167016 1144381 1117741 1086963 1053264
63516A053264l4858l5399l6502l7601l7193l4869l1734k9036k7069k5360k3353
$$ 1053264 1018406 983007 946505 908904 871711 836842 805108 776072 749003 723643 700290
63505G00290k0889j8328j6210j4692j3497j2437j1553j0660r318p620o447o389
$$ 700290 679401 661073 644863 630171 616674 604237 592684 582024 572706 565086 558639 552250
63493E52250o793o558n480m244l255k260j090o6N24P71Q59Q21Q23J231K187L314
$$ 552250 545457 538899 533419 529175 525920 523660 522570 522504 523028 523799 524658 525479 526302 527533 529720 533034
63477E33034M103M432M549M717M969N155N160N042M879M423L233J323o09j986
$$ 533034 537137 541569 546118 550835 555804 560959 566119 571161 576040 580463 583696 585019 584410 582424
63463E82424l029m176n131n262m826m881n759o440n888m367k918k084j693j478
$$ 582424 579395 575219 570088 564826 560000 555119 549360 542920 537032 532665 529747 527663 525970 524492
63449E24492j238o61L41J305J818K228L127M358N272N944P215R308J1279J2294
$$ 524492 523254 522593 522934 524239 526057 528285 531412 535770 541042 546986 554201 563509 574788 587082
63435E87082J2846J4060J6373J9484K3196K7414L1501L4464L5875L5979L4702
$$ 587082 599928 613988 630361 649845 673041 700455 731956 766420 802295 838274 872976
63424H72976L1389K5925J9555J4044J0292Q252P773Q792J0782J2884J4809J7089
$$ 872976 904365 930290 949845 963889 974181 982433 990206 998998 1009780 1022664 1037473 1054562
63412A054562K0051K3119K5532K7235K8411K8448K6185K1354J5192R340M583Q71
$$ 1054562 1074613 1097732 1123264 1150499 1178910 1207358 1233543 1254897 1270089 1279429 1284012 1284883
63400A284883j983m120n959q087j0726j3543j6044j8031j9698k1511k3949k7121
$$ 1284883 1282900 1278780 1272821 1264734 1254008 1240465 1224421 1206390 1186692 1165181 1141232 1114111
63388A114111l0479l3098l4317l4171l3167l1814l0341k8727k6840k4586k2041
$$ 1114111 1083632 1050534 1016217 982046 948879 917065 886724 857997 831157 806571 784530
63377G84530j9463j7030j4565j1630q051m321j283O93K089L639N475P132Q347
$$ 784530 765067 748037 733472 721842 713791 709470 708187 708880 710969 714608 720083 727215 735562
63364G35562R530J1234J3426J5541J7188J8593K0238K2298K4570K6891K9416L2244
$$ 735562 745092 756326 769752 785293 802481 821074 841312 863610 888180 915071 944487 976731
63352I76731L4924L6614L6938L6369L5509L4243L1973K8539K4330J9533J3947
$$ 976731 1011655 1048269 1085207 1121576 1157085 1191328 1223301 1251840 1276170 1295703 1309650
63341A309650P831K302j677m385o881r640j2113j3680j4501j5382j7105j9947
$$ 1309650 1317481 1319783 1318106 1313721 1306840 1297200 1285087 1271407 1256906 1241524 1224419 1204472
63329A204472k3529k7050k9816l1646l2689l3008l2573l1481k9861k7531k4203
$$ 1204472 1180943 1153893 1124077 1092431 1059742 1026734 994161 962680 932819 905288 881085
63318H81085k0047j5742j1856q500n769m268m829p709j2084j6401j9346k0641
$$ 881085 861038 845296 833440 824940 819171 814903 810074 802365 790281 773880 754534 733893
63306G33893k0932k0837k0321j9111j7467j6030j4981j3834j2206j0404r030q240
$$ 733893 712961 692124 671803 652692 635225 619195 604214 590380 578174 567770 558740 550500
63294E50500p663o896n926n118m860n132n441n350m950m601m289l640k622j811
$$ 550500 542837 535941 530015 524897 520037 514905 509464 504114 499164 494563 490274 486634 484012 482201
63280D82201j720k225k839l295l576l607l252k557j785j151p03l47P1O65J396
$$ 482201 480481 478256 475417 472122 468546 464939 461687 459130 457345 456194 455491 455144 455215 455880 457276
63265D57276K047K338K075J351O66O48J339K015K029J707J904K779L565L694L526
$$ 457276 459323 461661 463736 465087 465753 466401 467740 469755 471784 473491 475395 478174 481739 485433 488959
63250D88959L728M448N374O253O930P295P458P751Q246Q613Q692Q866R603J1003
$$ 488959 492687 497135 502509 508762 515692 522987 530445 538196 546442 555055 563747 572613 582216 593219
63236E93219J2986J5405J7656J8871J9041J9439K1177K3734K5663K6414K6686
$$ 593219 606205 621610 639266 658137 677178 696617 717794 741528 767191 793605 820291
63225H20291K7124K7637K7955K8071K7956K7529K7069K7030K7321K7369K7035
$$ 820291 847415 875052 903007 931078 959034 986563 1013632 1040662 1067983 1095352 1122387
63214A122387K6811K6907K6768K5789K3987K1601J8616J5019J1051O828K106l160
$$ 1122387 1149198 1176105 1202873 1228662 1252649 1274250 1292866 1307885 1318936 1325764 1327870 1324710
63202A324710q473j3421j8232k3187k7739l0884l2269l2442l1974l0812k8704
$$ 1324710 1316237 1302816 1284584 1261397 1233658 1202774 1170505 1138063 1106089 1075277 1046573
63191A046573k5844k2857k0170j7566j4460j0616o454k553J036M717Q610J2291
$$ 1046573 1020729 997872 977702 960136 945676 935060 928606 926053 927089 931806 940416 952707
63179I52707J5343J7799J9874K1615K3002K4120K4953K5306K5135K4673K4034
$$ 952707 968050 985849 1005723 1027338 1050340 1074460 1099413 1124719 1149854 1174527 1198561
63168A198561K2992K1469J9799J8215J6379J3896J0918P758M145m70n952j1471
$$ 1198561 1221553 1243022 1262821 1281036 1297415 1311311 1322229 1329987 1334132 1333662 1327710 1316239
63156A316239j6450k0956k5140k8889l2168l5147l7706l9282l9512l8645l7064
$$ 1316239 1299789 1278833 1253693 1224804 1192636 1157489 1119783 1080501 1040989 1002344 965280
63145I65280l4876l2306l0003k8433k7115k5065k1919j8303j5042j2491j0635
$$ 965280 930404 898098 868095 839662 812547 787482 765563 747260 732218 719727 709092
63134G09092r384q527p623o279m533k812j537p73k65K50Q27J318J634J903K394
$$ 709092 699708 691181 683558 677279 672746 669934 668397 667624 667359 667609 668436 669754 671388 673291 675685
63119F75685L230M239N122N740O135O222N640M216K571J835K421L313L103J644
$$ 675685 678915 683154 688276 694016 700151 706373 712013 716229 718800 720635 723056 726369 729472 731116
63105G31116J90k63l2R4J77Q06J802K131J280J6n78l20J93N40Q27J277J948K759
$$ 731116 731306 731043 731011 731105 731282 732088 733890 736021 737301 737317 736739 736419 736612 737152 737979 739256 741204 743963
63087G43963L486L729L243K315J474Q80K70m78j047j104p36k38L31J146K286L616
$$ 743963 747449 751178 754421 756736 758210 759090 759360 758882 757835 756731 755995 755757 756088 757234 759520 763136
63071G63136M954O202P333Q389R449J0540J1559J2416J3219J4294J5973J8340
$$ 763136 768090 774292 781625 790014 799463 810003 821562 833978 847197 861491 877464 895804
63059H95804K1075K3627K5671K7469K9637L2482L5682L8776M1769M5072M8904
$$ 895804 916879 940506 966177 993646 1023283 1055765 1091447 1130223 1171992 1217064 1265968
63048A265968N3008N6954O0515O3599O6011O7498O8028O7949O7769O7704O7504
$$ 1265968 1318976 1375930 1436445 1500044 1566055 1633553 1701581 1769530 1837299 1905003 1972507
63037A972507O6770O5489O4149O3187O2482O1532O0105N8370N6369N3571M9272
$$ 1972507 2039277 2104766 2168915 2232102 2294584 2356116 2416221 2474591 2530960 2584531 2633803
63026B633803M3241L5779K7134J7280O261n557j7716k9828m1280n1188n9163o5886
$$ 2633803 2677044 2712823 2739957 2757237 2763498 2757941 2740225 2710397 2669117 2617929 2558766 2492880
63014B492880p2213p7642q0440p9591p6058p1596o6847o1298n4651m7292l9436
$$ 2492880 2420667 2343025 2262585 2182994 2106936 2035340 1968493 1907195 1852544 1805252 1765816
63003A765816l0823k1559j2577m703K174Q655J4895K0582K5476K9525L2704L5178
$$ 1765816 1734993 1713434 1700857 1696154 1698328 1706983 1721878 1742460 1767936 1797461 1830165 1865343
62991A865343L7397L9605M1379M2103M1830M1242M0783M0239L9111L7049L3840
$$ 1865343 1902740 1942345 1983724 2025827 2067657 2108899 2149682 2189921 2229032 2266081 2299921
62980B299921K9341K3544J6545Q435o04j0046j9278k8119l6880m5740n4225o1532
$$ 2299921 2329262 2352806 2369351 2377786 2377182 2367136 2347858 2319739 2282859 2237119 2182894 2121362
62968B121362o7207p1370p4269p5795p5608p3776p1054o8257o5470o2206n8372
$$ 2121362 2054155 1982785 1908516 1832721 1757113 1683337 1612283 1544026 1478556 1416350 1357978
62957A357978n4601n1451m8673m5629m2137l8579l5369l2680l0539k8814k7254
$$ 1357978 1303377 1251926 1203253 1157624 1115487 1076908 1041539 1008859 978320 949506 922252
62946I22252k5768k4529k3522k2331k0734j9224j8406j8075j7453j6146j4370
$$ 922252 896484 871955 848433 826102 805368 786144 767738 749663 732210 716064 701694
62935G01694j2371j0268q408p208o614o255o099o301o478n957m846m058m000m064
$$ 701694 689323 679055 670647 663439 656825 650570 644471 638170 631692 625735 620889 616831 612831 608767
62921F08767l731l325l202k980k319j800k153l058l567l455l311l422l407l010
$$ 608767 605036 601711 598509 595529 593210 591410 589257 586199 582632 579177 575866 572444 569037 566027
62907E66027k529k254k002j505q86m69m28p29j197j555j591j404j273j271j215
$$ 566027 563498 561244 559242 557737 556851 556382 555954 555225 554028 552473 550882 549478 548205 546934 545719
62892E45719r99p83p41q61j067j374j728j847j416m81M25O83K06l97l65M58J529
$$ 545719 544720 543937 543196 542335 541268 539894 538166 536319 534903 534422 534847 535530 535736 535339 534974 535432 536961
62875E36961K218K307J892J063j02j365k317k549j922p96O2J30k92n09m23n93
$$ 536961 539179 541486 543378 544441 544339 542974 540657 538108 536186 535390 535452 535582 535290 534781 534358 533765
62859E33765j185j488r40j12J3n39p68j12Q87J430J362R93N32J41J20O19J266
$$ 533765 532580 531092 530152 530040 530053 529514 528746 528634 529521 530951 532313 533306 533838 533979 534099 534718 535984
62842E35984J534J424J395J584J453N18q05j504j096j03P14J211J663K008J859
$$ 535984 537518 538942 540337 541921 543374 543892 543087 541583 540487 540384 541098 542309 543972 545980 547839
62827E47839J215O59P34J470K593L791M664M823M336L807L734M013M212M060L579
$$ 547839 549054 549713 550447 551917 554510 558301 562965 567788 572124 575931 579665 583678 587890 591950 595529
62812E95529L094L168M146N476O041N466M642M574N217N965O741P809Q890R355
$$ 595529 598623 601791 605937 611413 617454 622920 627562 632136 637353 643318 650059 657868 666758 676113
62798F76113R270R454J0380J1649J2713J3545J4366J5245J6291J7804J9985K2707
$$ 676113 685383 694837 705217 716866 729579 743124 757490 772735 789026 806830 826815 849522
62786H49522K5709K8812L1881L4917L8294M2531M7671N3194N8645O4050O9565
$$ 849522 875231 904043 935924 970841 1009135 1051666 1099337 1152531 1211176 1275226 1344791
62775A344791P5013Q0105Q4813Q9298R3444R6728R8437R8098R5702R1568Q5909
$$ 1344791 1419804 1499909 1584722 1674020 1767464 1864192 1962629 2060727 2156429 2247997 2333906
62764B333906P8515O9025N7416M4034K9272J3475k845j9013l4441m8687o1257
$$ 2333906 2412421 2481446 2538862 2582896 2612168 2625643 2622798 2603785 2569344 2520657 2459400
62753B459400p1671p9797q5893r0304r3289r5083r5767r5053r2593q8612q3933
$$ 2459400 2387729 2307932 2222039 2131735 2038446 1943363 1847596 1752543 1659950 1571338 1487405
62742A487405p9240p4593o9772o4743n9543n4061m8271m2613l7745l3922l0744
$$ 1487405 1408165 1333572 1263800 1199057 1139514 1085453 1037182 994569 956824 922902 892158
62731H92158k7606k4285k1007j7996j5177j2419j0012q470p772p108n770l999
$$ 892158 864552 840267 819260 801264 786087 773668 763656 755186 747414 740306 734536 730537
62719G30537k570j610m20J497L679N304O222P178R035J1950J5185J7829J9718
$$ 730537 727967 726357 725937 727434 731113 736417 742639 749817 758852 770802 785987 803816 823534
62706H23534K1551K3995K6915K9787L2618L5878L9706M3747M7919N2613N7848
$$ 823534 845085 869080 895995 925782 958400 994278 1033984 1077731 1125650 1178263 1236111
62695A236111O2742O6409O9069P1867P5583P9786Q3229Q4799Q4117Q1467P7137
$$ 1236111 1298853 1365262 1434331 1506198 1581781 1661567 1744796 1829595 1913712 1995179 2072316
62684B072316P0947O2476N1810L9735K7046J3836j77j4693k8581m0871n1712o1927
$$ 2072316 2143263 2205739 2257549 2297284 2324330 2338166 2337989 2323296 2294715 2253844 2202132 2140205
62672B140205p1503p9070q3346q4794q5137q5321q4726q2578p9157p5098p0357
$$ 2140205 2068702 1989632 1906286 1821492 1736355 1651034 1566308 1483730 1404573 1329475 1259118
62661A259118o4747n8930n3848m9472m5143m0901l7394l4535l1386k7639k4178
$$ 1259118 1194371 1135441 1081593 1032121 986978 946077 908683 874148 842762 815123 790945
62650G90945k1779k0101j8369j6345j4215j2264j0972j0739j1076j0725r065o809
$$ 790945 769166 749065 730696 714351 700136 687872 676900 666161 655085 644360 635295 628486
62638F28486m960l759l058k887l022k719j618l56L15M76M61N4r67k010k341k124
$$ 628486 623526 619767 616709 613822 610800 608081 606463 606107 606422 606898 607359 607413 606446 604436 602095 599971
62622E99971j968j868j535j327j770k412k210j012L66J476K566L559L903L709
$$ 599971 598003 596135 594600 593273 591503 589091 586881 585869 586235 587711 590277 593836 597739 601448
62608F01448L959N108O368O909P021P459Q385R570J1108J3101J5087J6514J7702
$$ 601448 605407 610515 616883 623792 630813 638272 646657 656227 667335 680436 695523 712037 729739
62595G29739J9624K2737K6549L0317L3718L6736L9300M1372M3147M4899M6554
$$ 729739 749363 772100 798649 828966 862684 899420 938720 980092 1023239 1068138 1114692
62584A114692M7565M7361M5818M3162L9386L4075K6994J8576R631O98p959j5960
$$ 1114692 1162257 1209618 1255436 1298598 1337984 1372059 1399053 1417629 1427260 1427958 1419999 1404039
62572A404039k2836k8495l3235l7211m0263m2335m3652m4374m4354m3509m2108
$$ 1404039 1381203 1352708 1319473 1282262 1241999 1199664 1156012 1111638 1067284 1023775 981667
62561I81667m0466l8581l6260l3494l0479k7362k4193k1048j8055j5352j3135
$$ 981667 941201 902620 866360 832866 802387 775025 750832 729784 711729 696377 683242
62550F83242j1645j0922j0584j0029q986p722o665n844m918l726k579j809j278
$$ 683242 671597 660675 650091 640062 631076 623354 616689 610845 605927 602201 599622 597813 596535
62537E96535n99K78J055J586K002K322K401K357K576L145L769M446N610P304Q811
$$ 596535 595936 596214 597269 598855 600857 603179 605580 607937 610513 613658 617427 621873 627483 634787 643598
62522F43598R652J0405J1937J4217J6570J8686K0683K2558K4382K6799L0396L4668
$$ 643598 653250 663655 675592 689809 706379 725065 745748 768306 792688 819487 849883 884551
62510H84551L8517M1690M4819M8014N0415N1453N1620N1591N1324N0388M8477
$$ 884551 923068 964758 1009577 1057591 1108006 1159459 1211079 1262670 1313994 1364382 1412859
62499A412859M5247M0334L4028K7308K0776J4272P914K753l84j947k771k678q84
$$ 1412859 1458106 1498440 1532468 1559776 1580552 1594824 1602738 1605491 1605107 1603160 1600389 1597711 1596827
62486A596827K604O987J1871J7473K3647K9578L4685L9081M2953M5970M7466M6633
$$ 1596827 1599431 1606418 1618289 1635762 1659409 1688987 1723672 1762753 1805706 1851676 1899142 1945775
62474A945775M2627L5182K5414J5352O136k969j3499k6035l9717n2974o4334p2942
$$ 1945775 1988402 2023584 2048998 2064350 2070486 2067517 2054018 2027983 1988266 1935292 1870958 1798016
62462A798016p8909q3068q5980q7307q6529q3957q0497p6426p1200o4627n7610
$$ 1798016 1719107 1636039 1550059 1462752 1376223 1292266 1211769 1135343 1064143 999516 941906
62451I41906n1212m5429l9548l3477k8046k3873k0613j7583j4665j2197j0291
$$ 941906 890694 845265 805717 772240 744194 720321 699708 682125 667460 655263 644972
62440F44972q790p703p081o529n347l419j588p90j017j388j224q05r56k048l512
$$ 644972 636182 628479 621398 614869 609522 606103 604515 603725 602708 601320 600096 599291 598335 596287 592775
62425E92775m440m518m211m050l988l643k952k342k292k923l947m817n021m481
$$ 592775 588335 583817 579606 575556 571568 567925 564973 562631 560339 557416 553469 548652 543631 539150
62411E39150l617k847k198j612j361j727k368k578k207j777j570j173k28Q29J274
$$ 539150 535533 532686 530488 528876 527515 525788 523420 520842 518635 516858 515288 514115 513887 514716 515990
62396E15990J065Q84J307K261L310M090M439M330L890L468L513M202N116N617
$$ 515990 517055 517939 519246 521507 524817 528907 533346 537676 541566 545034 548547 552749 557865 563482
62382E63482N631N867O856Q049Q374P630O717O467O797P274P935R110J0750J2347
$$ 563482 569113 574980 581836 589885 598259 605889 612606 619073 625870 633144 641079 650189 660939 673286
62368F73286J3343J3502J3111J2991J3953J5992J8319K0358K2374K4902K8017
$$ 673286 686629 700131 713242 726233 740186 756178 774497 794855 817229 842131 870148
62357H70148L1513L5348L9526M3826M8005N1890N5015N6625N6582N5763N4950
$$ 870148 901661 937009 976535 1020361 1068366 1120256 1175271 1231896 1288478 1344241 1399191
62346A399191N3617N0529M5197L8139L0037K1412J2990N461j243p705j4101k0149
$$ 1399191 1452808 1503337 1548534 1586673 1616710 1638122 1651112 1656573 1655330 1647625 1633524 1613375
62334A613375k5953l1933l7746m2203m4618m5530m5712m5277m4218m3004m1922
$$ 1613375 1587422 1555489 1517743 1475540 1430922 1385392 1339680 1294403 1250185 1207181 1165259
62323A165259m0505l8393l6277l5036l4342l3052l0884k8692k7056k5506k3510
$$ 1165259 1124754 1086361 1050084 1015048 980706 947654 916770 888078 861022 835516 812006
62312H12006k1334j9517j8084j6785j5613j4534j3146j1207r223p852o900n640
$$ 812006 790672 771155 753071 736286 720673 706139 692993 681786 672563 664711 657811 652171
62300F52171m040k957k834k906k214q62K92Q47J144J455J578J390J227J443J941
$$ 652171 648131 645174 642340 639434 637220 636358 636650 637497 638641 640096 641674 643064 644291 645734 647675
62285F47675K448K915L396L732L691L319K907K673K641K746K918L181L750M830
$$ 647675 650123 653038 656434 660166 663857 667176 670083 672756 675397 678143 681061 684242 687992 692822
62271F92822O082O659O096N092M967O333Q649J1051J3270J5561J8155K1028K4022
$$ 692822 698904 705563 711659 716751 721718 728051 736700 747751 761021 776582 794737 815765 839787
62258H39787K7019L0074L3484L7546M2123M6634N0580N3945N6888N9220O0380
$$ 839787 866806 896880 930364 967910 1010033 1056667 1107247 1161192 1218080 1277300 1337680
62247A337680N9875N7499N3179M6963L9278L0922K2485J3858M622n030j4095k1719
$$ 1337680 1397555 1455054 1508233 1555196 1594474 1625396 1647881 1661739 1666361 1661331 1647236 1625517
62235A625517k8090l4084m0098m5591m9782n2310n3193n2629n1164m9609m8243
$$ 1625517 1597427 1563343 1523245 1477654 1427872 1375562 1322369 1269740 1218576 1168967 1120724
62224A120724m6297m2793l7859l2672k8158k4306k0857j7953j5702j3560j0865
$$ 1120724 1074427 1031634 993775 961103 932945 908639 887782 869829 854127 840567 829702
62213H29702p771n176l609k681j667l38R64J853K248K366K419K355J931J130M61
$$ 829702 821931 816755 813146 810465 808798 808460 809424 811277 813525 815891 818310 820665 822596 823726 824187
62198H24187M74J025J370J124P61Q43J182J307J466K401M106N619O386P077Q444
$$ 824187 824661 825686 827056 828180 828941 829784 830966 832273 833739 836140 840246 845865 852251 859328 867772
62183H67772R994J0624J0196R550R014Q004O266M583L714L362K854K271K178K691
$$ 867772 877766 888390 898586 908136 917150 925154 931420 936003 939717 943079 945933 948204 950382 953073
62169I53073L565N019P598J1234J5155J8908K2832K7276L1804L5593L8285M0178
$$ 953073 956638 961657 969255 980489 995644 1014552 1037384 1064660 1096464 1132057 1170342 1210520
62157A210520M1623M2434M1864L9197L4459K8564K2561J6776J0854M560j812p828
$$ 1210520 1252143 1294577 1336441 1375638 1410097 1438661 1461222 1477998 1488852 1493412 1491600 1483772
62145A483772j3358j8574k3714k8823l3490l6862l8368l8390l7836l6920l5039
$$ 1483772 1470414 1451840 1428126 1399303 1365813 1328951 1290583 1252193 1214357 1177437 1142398
62134A142398l1961k8546k5748k3437k0822j7765j4847j2299r623o496l359p28
$$ 1142398 1110437 1081891 1056143 1032706 1011884 994119 979272 966973 957350 950854 947495 946767
62122I46767J565L935O165P615Q192Q537R139R773J0062J0163J0408J0554J0007
$$ 946767 948332 952267 958432 966047 974239 982776 991915 1001688 1011750 1021913 1032321 1042875 1052882
62109A052882Q803P747P446P550P287O325M800K830N63j446k410j914j18K575
$$ 1052882 1061685 1069432 1076878 1084428 1091715 1098040 1102840 1105670 1106233 1104787 1102377 1100463 1100345 1102920
62095A102920N588Q003Q964Q498P513O804O356N874N520N718O504P521Q532R577
$$ 1102920 1108508 1116511 1125475 1133973 1141486 1148290 1154646 1160520 1166040 1171758 1178262 1185783 1194315 1203892
62081A203892J0641J1601J2494J3550J4886J6414J8109K0070K2173K3927K4868
$$ 1203892 1214533 1226134 1238628 1252178 1267064 1283478 1301587 1321657 1343830 1367757 1392625
62070A392625K5051K4863K4451K3569K2098K0440J9160J8363J7759J7332J7487
$$ 1392625 1417676 1442539 1466990 1490559 1512657 1533097 1552257 1570620 1588379 1605711 1623198
62059A623198J8402J9580K0375K0652K0550J9815J7962J5018J1530P811L701p67
$$ 1623198 1641600 1661180 1681555 1702207 1722757 1742572 1760534 1775552 1787082 1794893 1798594 1797827
62047A797827n118r160j3443j8561k4320l0021l5238l9878m3791m6856m9267n1243
$$ 1797827 1792709 1783549 1770106 1751545 1727225 1697204 1661966 1622088 1578297 1531441 1482174 1430931
62035A430931n2538n2699n1713m9983m7765m5094m2167l9214l6065l2444k8709
$$ 1430931 1378393 1325694 1273981 1223998 1176233 1131139 1088972 1049758 1013693 981249 952540
62024I52540k5634k3278k0827j7907j5368j4167j4000j3757j3025j2363j2162
$$ 952540 926906 903628 882801 864894 849526 835359 821359 807602 794577 782214 770052
62013G70052j2055j1633j1090j0759j0350r175p034m572k688j671r95J36K057
$$ 770052 757997 746364 735274 724515 714165 704990 697956 693384 690696 689025 688030 688166 690223
62000F90223M423O638Q325R367R720R376Q458P121N445L536J583m12k760n624
$$ 690223 694646 701284 709609 718976 728696 738072 746530 753651 759096 762632 764215 763803 761043 755419
61986G55419q409j0172j0670j0661j0966j1605j2058j1947j1196r850q251p115
$$ 755419 747010 736838 726168 715507 704541 692936 680878 668931 657735 647885 639634 632519
61974F32519o896p120o774n357l283j272J80Q54Q73Q15J299K225K798K566J973
$$ 632519 625623 618503 611729 606372 603089 601817 601997 602851 603724 604539 605838 608063 610861 613427 615400
61959F15400J712J886K143K303K507K939L760N031O423P254P234O920P095P952
$$ 615400 617112 618998 621141 623444 625951 628890 632650 637681 644104 651358 658592 665512 672607 680559
61945F80559R318J1353J4291J7645K0385K2111K3443K5052K6903K8671L0326L1874
$$ 680559 689877 701230 715521 733166 753551 775662 799105 824157 851060 879731 910057 941931
61933I41931L2965L3227L2782L2023L1040K9668K7900K5931K3791K1318J8425
$$ 941931 974896 1008123 1040905 1072928 1103968 1133636 1161536 1187467 1211258 1232576 1251001
61922A251001J5173J1560P512L187q78m083o198p487q335q689q013n883k641Q95
$$ 1251001 1266174 1277734 1285246 1288433 1287555 1283472 1277274 1269787 1261452 1252763 1244750 1238867 1236226 1237121
61908A237121M280P694J1232J4409J6612J7761J8116J7714J6304J3735J0127N689
$$ 1237121 1241401 1249095 1260327 1274736 1291348 1309109 1327225 1344939 1361243 1374978 1385105 1390794
61896A390794P16m363r110j3298j6900k0003k2817k5510k7786k8992k8958k8392
$$ 1390794 1391510 1387147 1378037 1364739 1347839 1327836 1305019 1279509 1251723 1222731 1193773 1165381
61884A165381k8030k7660k6617k5026k3838k3564k3673k3406k2631k1646k0586
$$ 1165381 1137351 1109691 1083074 1058048 1034210 1010646 986973 963567 940936 919290 898704
61873H98704j9418j8139j6614j4587j2078r579p497n636l505r61J753M394O942
$$ 898704 879286 861147 844533 829946 817868 808289 800792 795156 791651 790690 792443 796837 803779
61860H03779R478J2081J4748J7362J9930K2832K6461L0543L4265L7315M0302M3730
$$ 803779 813257 825338 840086 857448 877378 900210 926671 957214 991479 1028794 1069096 1112826
61848A112826M7112M9672N1473N3115N4534N4939N3950N1909M8912M4377L8008
$$ 1112826 1159938 1209610 1261083 1314198 1368732 1423671 1477621 1529530 1578442 1622819 1660827
61837A660827L0548K3056J5883Q889K292l289p511j0453j2142j2357j1016q437
$$ 1660827 1691375 1714431 1730314 1739203 1741495 1738206 1730695 1720242 1708100 1695743 1684727 1676290
61825A676290n080j272K745O607R795J1748J2035J0482P175K364l569j0143j7003
$$ 1676290 1671210 1669938 1672683 1679290 1689085 1700833 1712868 1723350 1730525 1732889 1729320 1719177 1702174
61812A702174k4189l1897l9789m6756n1628n4082n4718n4411n3727n2772n1323
$$ 1702174 1677985 1646088 1606299 1559543 1507915 1453833 1399115 1344704 1290977 1238205 1186882
61801A186882m9167m6420m3454m0336l6690l2460k8490k5811k4336k2909k0701
$$ 1186882 1137715 1091295 1047841 1007505 970815 938355 909865 884054 859718 836809 816108
61790H16108j8096j5957j4528j3398j2224j1025r932r005q259p565o686n628m903
$$ 816108 798012 782055 767527 754129 741905 730880 720948 711943 703684 696119 689433 683805 678902
61777F78902m987n547n586m545l004k035k027k406k419j904j181n03J20N98O57
$$ 678902 673915 668368 662782 658237 655233 653198 651171 648765 646346 644442 643261 642758 642878 643476 644133
61762F44133K71m6L04J262K203K788L387M350N196M983L587K055J413J517J418
$$ 644133 644404 644358 644662 645924 648127 650915 654302 658652 663848 668831 672418 674473 675886 677403 678821
61747F78821O94k43j107k257l796m806m268k569j214j008j289j184p91n70l87
$$ 678821 679515 679272 678165 675908 672112 667306 663038 660469 659255 658247 656958 655774 654983 654413 654026
61732F54026L6L03l7l48M83K193L112K367J166J203K536L858M414M674N256O011
$$ 654026 654062 654365 654328 653980 654463 656656 659768 662135 663301 664504 667040 670898 675312 679986 685242 691253
61716F91253O409O272N772N072M186L039J486n75k926m974o139o396o368o717
$$ 691253 697662 703934 709706 714778 718964 722003 723489 722914 719988 715014 708875 702479 696111 689394
61702F89394p459q018p979p594p314p066o380n211m120l562l367l120k716k361
$$ 689394 681935 673917 665938 658344 651030 643964 637584 632373 628253 624691 621324 618204 615488 613127
61688F13127k244k456k972l569l918l894l628l235k732k218j819j449j046r50
$$ 613127 610883 608427 605455 601886 597968 594074 590446 587211 584479 582261 580442 578993 577947 576997
61674E76997j523k349k614k322k378l109l594k988j695n82J49N46K11r22j758
$$ 576997 575474 573125 570511 568189 565811 562702 559108 556120 554425 553843 553992 554538 554749 553827 552069
61659E52069j187K52J056Q49O05R41J422J690K033K571K976L290M024N075N547
$$ 552069 550882 551134 552190 553039 553644 554585 556007 557697 559730 562301 565277 568567 572591 577666 583213
61644E83213N115M569M509M436L811L190L397M184M540L985K903J764O55n37j844
$$ 583213 588328 592897 597406 601842 605653 608843 612240 616424 620964 624949 627852 629616 630271 629734 627890
61629F27890l032l656l524l190l402m048m289l868l419l226k668j419k63J7k57
$$ 627890 624858 621202 617678 614488 611086 607038 602749 598881 595462 592236 589568 588149 587886 587903 587646
61614E87646n38j077k208l330l844m438o065q105q943q284p414p173p050o631
$$ 587646 587108 586031 583823 580493 576649 572211 566146 558041 549098 540814 533400 526227 519177 512546
61600E12546o506p065p553p125o082n281m941m728m571m589m539m054l270k674
$$ 512546 506040 498975 491422 484297 478215 472934 467993 463265 458694 454105 449566 445512 442242 439568
61586D39568k468k490k712l233l802l761k752j280m17p79j826k377j940j294j380
$$ 439568 437100 434610 431898 428665 424863 421102 418350 417070 416653 415874 414048 411671 409731 408437 407057
61571D07057j911j771p64p2o02j676k034j543r95o06J83J342J795Q81n25j025
$$ 407057 405146 403375 402611 402539 401937 400261 398227 396684 395689 395083 395266 396608 398403 399284 398759 397734
61555C97734m19L40O54R17J574K305K504K084J345M75l49o37L3J350K490L094
$$ 397734 397315 397655 398309 399226 400800 403105 405609 407693 409038 409513 409164 408527 408560 409910 412400 415494
61539D15494L588M361N124N302M779L961L291K979L035L247L253K811J968R11
$$ 415494 419082 423443 428567 433869 438648 442609 445900 448879 451914 455161 458414 461225 463193 464104
61525D64104k55j423k388l005l292l264k924k532k593l177l525k797j251j85m91
$$ 464104 463849 462426 460038 457033 453741 450477 447553 445021 442428 439251 435726 432929 431678 431493 431002
61510D31002j572k032j344m39m35j152j358m77N47M46p67j989k441k207j515m22
$$ 431002 429430 427398 426054 425615 425180 424028 422670 422193 422740 423186 422419 420430 417989 415782 414267 413845
61494D13845P22J293J202J027R56M62n87j284q65R5M96K71K21O02R07R24J134
$$ 413845 414567 415860 417062 418089 419045 419507 418920 417636 416771 416866 417362 417633 417854 418456 419363 420287 421421
61477D21421J781K338K200J538J129J532K493L132K780J762J072J067J004K04
$$ 421421 423202 425540 427740 429278 430407 431939 434432 437564 440344 442106 443178 444245 445249 445453
61463D45453q01r85k91L68L65r6o29j119j445j340o73M34J644K360J992Q31J87
$$ 445453 444652 443667 443376 443744 444109 444013 443384 442265 440820 439480 438807 439241 440885 443245 445237 446068 446255
61446D46255R25K279K894K673K570K871K981K871L351M543N365N069M342M238
$$ 446255 447180 449459 452353 455026 457596 460467 463448 466319 469670 474213 479578 484647 488989 493227
61432D93227M775N178M897L868K382J113P42J146J464J257R46R66J234J705K568
$$ 493227 498002 503180 508077 511945 514327 515440 516182 517328 518792 520049 520995 521961 523195 524900 527468
61417E27468L496L604K740J931J926K117J625O15l04j185k276l103l081k617k588
$$ 527468 530964 534568 537308 539239 541165 543282 544907 545522 545218 544033 541757 538654 535573 532956 530368
61402E30368l054l455l701m052m176l405j935q41p77j364j882j917j338l74L00
$$ 530368 527314 523859 520158 516106 511930 508525 506590 505749 504972 503608 501726 499809 498471 498097 498397
61387D98397J37n49r66q47m64P3Q34J465J358N83o3j7N90J394K146K539K404K062
$$ 498397 498534 497985 497019 496172 495708 495781 496615 498080 499438 500021 499958 499941 500531 501925 504071 506610 509014 511076
61369E11076J968K016J843J672K069K811L002K457K067K429K996L107L081L579
$$ 511076 513044 515060 516903 518575 520644 523455 526457 528914 530981 533410 536406 539513 542594 546173
61355E46173M496N198N532O001P075Q776J0799J2657J3942J4703J5351J5950J5964
$$ 546173 550669 555867 561399 567400 574475 583251 594050 606707 620649 635352 650703 666653 682617
61342F82617J5020J3548J2268J1324J0427R583R046Q625P626N645L115Q25q82
$$ 682617 697637 711185 723453 734777 745204 754787 763833 772458 780084 785729 788844 789669 788787
61329G88787k273l688n017n854o070o040o161o372o355o122o002o096o156n985
$$ 788787 786514 782826 777809 771955 765885 759845 753684 747312 740957 734835 728833 722737 716581 710596
61315G10596n521m508k693n41Q95J247J482K654M457N731O225O932Q562J0446
$$ 710596 705075 700567 697874 697333 698228 699475 700957 703611 708068 713799 720024 726956 735518 745964
61301G45964J1444J1330J0738J0030Q829O710L782M57k939o018q187r130r402
$$ 745964 757408 768738 779476 789506 798335 805045 808827 809284 806345 800327 792140 783010 773608
61288G73608r923j0804j1081j0001q144o766o275n930n043l799k655j538l4J836
$$ 773608 763685 752881 741800 731799 723655 716889 710614 704684 699641 695842 693187 691649 691615 693451
61274F93451L566M728N329N679O134O928P965Q801R071Q906Q802R101R769J0604
$$ 693451 697017 701745 707074 712753 718887 725815 733780 742581 751652 760558 769360 778461 788230 798834
61260G98834J1473J2420J3685J5517J7694J9355J9701J8891J7846J7026J5818
$$ 798834 810307 822727 836412 851929 869623 888978 908679 927570 945416 962442 978260
61249I78260J3417J0014O589L738J149j653m614p365r741j1719j3066j3413j2721
$$ 978260 991677 1001691 1008280 1012018 1013167 1011514 1006900 999535 989794 978075 965009 951596 938875
61236I38875j1448j0265r647r570r456q663p268o169n980o019m941k366O10K660
$$ 938875 927427 917162 907515 897945 888489 879826 872558 866389 860409 854390 849449 847083 847693 850353
61222H50353L478L625L601L441K938J862K17j472k340j967q17L21J041J277R90
$$ 850353 853831 857456 861057 864498 867436 869298 869515 868043 865703 863736 862919 863240 864281 865558 866548
61207H66548L12k87m75n30q40j125p12N74K318M190O205Q314J0378J2569J5265
$$ 866548 866860 866573 866098 865568 864728 863603 862891 863465 865783 869973 876178 884492 894870 907439 922704
61192I22704J8365K1270K3651K5666K7182K7372K5581K2279J8692J5746J3627
$$ 922704 941069 962339 985990 1011656 1038838 1066210 1091791 1114070 1132762 1148508 1162135
61181A162135J2093J0781R325P563N642L796K069M48r77k227l686n770q395j0962
$$ 1162135 1174228 1185009 1194334 1201897 1207539 1211335 1213404 1213852 1212875 1210648 1206962 1201192 1192797 1181835
61167A181835j2975j4425j5572j6527j7196j7577j7904j8373j8861j9112j9159
$$ 1181835 1168860 1154435 1138863 1122336 1105140 1087563 1069659 1051286 1032425 1013313 994154
61156I94154j9249j9259j8582j6852j4491j2148r885p445n052l244j973o26Q88
$$ 994154 974905 955646 937064 920212 905721 893573 883688 876243 871191 867947 865974 865348 866236
61143H66236J803J496K71j261k988n017p013q397q946q755p849o280m406k642
$$ 866236 868039 869535 869806 868545 865557 860540 853527 845130 836184 827429 819580 813300 808894 806252
61129H06252j031O15K351M162O199Q550J0996J3356J5813J8495K1025K2983K4634
$$ 806252 805221 805836 808187 812349 818548 827098 838094 851450 867263 885758 906783 929766 954400
61116I54400K6605K8907L0858L1939L2203L1886L1183L0433K9951K9544K8654
$$ 954400 981005 1009912 1040770 1072709 1104912 1136798 1167981 1198414 1228365 1257909 1286563
61105A286563K7109K5252K3304K1126J8723J6314J3610R691M138k157p818j2409
$$ 1286563 1313672 1338924 1362228 1383354 1402077 1418391 1432001 1441692 1445830 1443673 1435855 1423446
61093A423446j6544k0781k4822k7872k9499l0167l0932l2387l3888l4178l2891
$$ 1423446 1406902 1386121 1361299 1333427 1303928 1273761 1242829 1210442 1176554 1142376 1109485
61082A109485l1013k9627k8725k7582k5831k3671k1417j9363j7798j6586j5052
$$ 1109485 1078472 1048845 1020120 992538 966707 943036 921619 902256 884458 867872 852820
61071H52820j2864j0723r452q732p570n840m317l228j887o1J365J765J898K884
$$ 852820 839956 829233 819781 811049 803479 797639 793322 790094 788207 788146 789511 791276 793174 796058
61057G96058M661O309P524Q889J0750J2582J3672J3989J4241J5195J6967J8945
$$ 796058 800719 807028 814552 823441 834191 846773 860445 874434 888675 903870 920837 939782
61045I39782K0578K2136K4255K6784K8780K9846L0644L1723L2645L2947L3136
$$ 939782 960360 982496 1006751 1033535 1062315 1092161 1122805 1154528 1187173 1220120 1253256
61034A253256L3791L4354L3953L2964L2494L2543L2005L0598K9485K9689L0907
$$ 1253256 1287047 1321401 1355354 1388318 1420812 1453355 1485360 1515958 1545443 1575132 1606039
61023A606039L2303L3531L4588L5573L6957L9370M2647M5826M8439N0975N3899
$$ 1606039 1638342 1671873 1706461 1742034 1778991 1818361 1861008 1906834 1955273 2006248 2060147
61012B060147N7151O1142O7096P5692Q6271R8078J11376J26454J42628J59388
$$ 2060147 2117298 2178440 2245536 2321228 2407499 2505577 2616953 2743407 2886035 3045423
61002C045423J77838J99889K26635K58916K98946L49950M14124M91977N83426
$$ 3045423 3223261 3423150 3649785 3908701 4207647 4557597 4971721 5463698 6047124
60993F047124O88451Q06912R38848J084800J245222J419996J607738J799108J962559
$$ 6047124 6735575 7542487 8481335 9566135 10811357 12231353 13839091 15638199 17600758
60984A7600758K037578J956789J693207J293980Q63628N06369K77106J75994J71170
$$ 17600758 19638336 21595125 23288332 24582312 25445940 25952309 26229415 26405409 26576579
60975B6576579K12355K28408J37417j13929n09355r63702j371078j660146j815170
$$ 26576579 26788934 27017342 27154759 27040830 26531475 25567773 24196695 22536549 20721379
60966B0721379j859789j829748j755650j657346j544114j418272j280844j135546
$$ 20721379 18861590 17031842 15276192 13618846 12074732 10656460 9375616 8240070
60958H240070r88781q47543p17764o03254n05194m22856l54965k99975k55523
$$ 8240070 7251289 6403746 5685982 5082728 4577534 4154678 3799713 3499738 3244215
60949C244215k18992j88940j64913j45698j29082j13821j00534q9935q1264p3362
$$ 3244215 3025223 2836283 2671370 2525672 2396590 2282769 2182235 2092300 2011036 1937674
60939A937674o6361o1096n7567n4925n2571n0300m7740m4581m1175l8124l5405
$$ 1937674 1871313 1810217 1752650 1697725 1645154 1594854 1547114 1502533 1461358 1423234 1387829
60928A387829l2556k9476k6451k3593k0799j8157j5810j3579j1229q960p114n592
$$ 1387829 1355273 1325797 1299346 1275753 1254954 1236797 1220987 1207408 1196179 1187219 1180105 1174513
60916A174513m008k327q25M37J727L258M997O766Q262R205R648R905J0014R683
$$ 1174513 1170505 1168178 1167353 1167790 1169517 1172775 1177772 1184538 1192800 1202005 1211653 1221558 1231572 1241255
60902A241255Q951Q329P993P430O353N213M234K683pk944m704n218n643o560p508
$$ 1241255 1250206 1258535 1266528 1273958 1280311 1285524 1289758 1292441 1292434 1289490 1284786 1279568 1273925 1267365 1259857
60887A259857q269r366j0897j2006j2057j1653j1758j2451j3165j3758j4628j5829
$$ 1259857 1251588 1242222 1231325 1219319 1207262 1195609 1183851 1171400 1158235 1144477 1129849 1114020
60875A114020j6719j6667j5872j5157j5003j5005j4504j3623j3140j3289j3231
$$ 1114020 1097301 1080634 1064762 1049605 1034602 1019597 1005093 991470 978330 965041 951810
60864I51810j2287j1104j0866j1498j1616j0324q362p126p126p751q197q182p914
$$ 951810 939523 928419 917553 906055 894439 884115 875753 868627 861501 853750 845553 837371 829457
60851H29457p670p440p012o441o231o774p644p908p222o174n516n344n308n281
$$ 829457 821787 814347 807335 800894 794663 787889 780245 772337 765115 758941 753425 748081 742773 737492
60837G37492n545o318p374q178q483q644r167r916j0113r305p956o773n837m869
$$ 737492 731947 725629 718255 710077 701594 692950 683783 673867 663754 654449 646493 639720 633883 629014
60823F29014l995l567l447l115k456j815j248m01P02J400J180K73p19j347j331
$$ 629014 625019 621452 618005 614890 612434 610619 609371 608970 609672 611072 612252 612525 611806 610459 609128
60808F09128o38J79K62n58j451j607j180q36p46n96l09k10m92j014j639k332k846
$$ 609128 608490 608669 608931 608373 606922 605315 604135 603299 602553 601957 601648 601438 600946 599932 598293 595961 593115
60791E93115k737j915r56o02j054j938k895l845m707n190n148m883m735m540l899
$$ 593115 590378 588463 587507 586905 585851 583913 581018 577173 572466 567276 562128 557245 552510 547970 544071
60776E44071l041k756l314l949l805k986k206j794j548j305j052o07J81R72J250
$$ 544071 541030 538274 534960 531011 527206 524220 522014 520220 518672 517367 516315 515708 515889 516861 518111
60761E18111J054Q80R31R84J001J232J585J588J185J006J520K399L002L081K728
$$ 518111 519165 520045 520976 521960 522961 524193 525778 527366 528551 529557 531077 533476 536478 539559 542287
60746E42287K086J427J136J210J113M79l42q00r94j452k296l077l500l839m419
$$ 542287 544373 545800 546936 548146 549259 549738 549396 548596 547602 546150 543854 540777 537277 533438 529019
60731E29019m992m980m278l560l571m209m584m076l050k321k185k343k489k516
$$ 529019 524027 519047 514769 511209 507638 503429 498845 494769 491719 489398 487213 484870 482381 479865
60717D79865k260j624r73q54j176j229p12l16p53j695k087j489o20m77j125j609
$$ 479865 477605 475981 475008 474154 472978 471749 471037 470721 469968 468273 466186 464697 464077 463600 462475 460866
60701D60866j099J7N05j43r76p95K59J002R25P38J065J432J101K78j41K42J013
$$ 460866 459767 459784 460289 460146 459170 458375 458634 459636 460561 461299 462364 463796 464897 465175 465034 465276 466289
60684D66289J690K203K671L046L175L057K896K933L218L557L777L983M389M988
$$ 466289 467979 470182 472853 475899 479074 482131 485027 487960 491178 494735 498512 502495 506884 511872
60670E11872N587O052O217N700M258K377J007N58N56M37J70j10o08j564k687l307
$$ 511872 517459 523511 529728 535428 539686 542063 543070 543628 544184 544621 544791 544681 544073 542509 539822 536515
60654E36515l029k069j020m05k62j15M13J016J065N44J04P0j09j031k440l558
$$ 536515 533486 531417 530397 529992 529730 529615 530028 531044 532109 532653 532757 532827 532718 531687 529247 525689
60638E25689l986l919l678l455l318l273l294l389l429k991j827m78J34r6l07
$$ 525689 521703 517784 514106 510651 507333 504060 500766 497377 493948 490957 489130 488652 488786 488690 488383
60623D88383O9N07L25k38m34n8N75J227J773J888J409P38L76K61O8j08j4J09j93
$$ 488383 488452 488959 489284 489046 488612 488554 489129 490356 492129 494017 495426 496164 496540 496801 496869 496761 496747 496856 496663
60604D96663q24j210j065n30K43J039J336Q45J90L23J214J895J810J404J225J245
$$ 496663 495839 494629 493564 493034 493277 494316 495652 496497 496687 497010 498224 500119 501929 503333 504558 505803
60588E05803J318J620K232K779K933K840K768K699K551K397K166J589P57L13O58
$$ 505803 507121 508741 510973 513752 516685 519525 522293 524992 527543 529940 532106 533695 534452 534765 535423
60573E35423J309J541J417J669K702M152N440O331O952P603Q633J0202J2014J3489
$$ 535423 536732 538273 539690 541359 544061 548213 553653 559984 566936 574539 583172 593374 605388 618877
60559F18877J4312J4662J4759J4401J3169J1011Q367N662K930Q6k612m694n979
$$ 618877 633189 647851 662610 677011 690180 701191 709558 715220 718150 718236 715624 710930 704951
60546G04951o672o892o449n206l488j869o74K09J117K426M374O879R512J1808
$$ 704951 698279 691387 684938 679732 676244 674375 673701 673910 675027 677453 681827 688706 698218 710026
60532G10026J3581J4954J6130J7162J7716J7148J5084J1953Q644N580K520n60
$$ 710026 723607 738561 754691 771853 789569 806717 821801 833754 842398 847978 850498 849938
60520H49938l061m516n249n801o122n923n463n298n461n544n449n327m874l478
$$ 849938 846877 842361 837112 831311 825189 819266 813803 808505 803044 797500 792051 786724 781850 778372
60506G78372j224R23K219K923L837N440P624R944J1972J3836J6398K0396K5439
$$ 778372 777148 778071 780290 783213 787050 792490 800114 810058 822030 835866 852264 872660 898099
60493H98099L0436L4988L9550M4103M7620M9484N0532N1802N2706N1430M7033
$$ 898099 928535 963523 1003073 1047176 1094796 1144280 1194812 1246614 1299320 1350750 1397783
60482A397783M0298L2437K3769J3927K904q595j9583k9384l7819m4945n0631n4459
$$ 1397783 1438081 1470518 1494287 1508214 1511118 1502523 1482940 1453556 1415737 1370792 1320161 1265702
60470A265702n6123n5851n4297n2075m9481m6481m2884l8664l4295l0516k7531
$$ 1265702 1209579 1153728 1099431 1047356 997875 951394 908510 869846 835551 805035 777504
60459G77504k4730k1523j8280j5920j4693j3874j2792j1603j0750j0107r178p908
$$ 777504 752774 731251 712971 697051 682358 668484 655692 644089 633339 623232 614054 606146
60447F06146o820o275o013n585m939m355l916l382k556j541o09K8K23j37r61j838
$$ 606146 599326 593051 587038 581453 576514 572159 568243 564861 562305 560764 560155 560183 560406 560269 559308 557470
60431E57470k303k208j739j140n96l33n47j137j640j651j153m16L26R36J230J059
$$ 557470 555167 552959 551220 550080 549484 549151 548604 547467 545827 544176 543023 542607 542933 543869 545099 546158
60415E46158N86K87M86R96J338J304J106J011J031J149J584K470L348L444K604
$$ 546158 546744 547031 547517 548513 549851 551155 552261 553272 554303 555452 557036 559506 562854 566298 568902
60400E68902J588J202J428J685J678J521J264Q72P02J313K635L785M049L674L326
$$ 568902 570490 571692 573120 574805 576483 578004 579268 580140 580842 582155 584790 588575 592624 596298 599624
60385E99624L218L184L296L726M168M036L377K946L208L752M006M016M073M007
$$ 599624 602842 606026 609322 613048 617216 621252 624629 627575 630783 634535 638541 642557 646630 650637
60371F50637L503K895K914L575L943L286J988J023Q73J279J706J736J178K78l02
$$ 650637 654140 657035 659949 663524 667467 670753 672741 673764 674637 675916 677622 679358 680536 680814 680512
60356F80512n6Q36J781K444K940L458M098M987O193P493Q556R316R929J0390J0534
$$ 680512 680456 681292 683073 685517 688457 691915 696013 701000 707193 714686 723242 732558 742487 752877 763411
60341G63411J0390J0150R758Q883P292N021K174r76l804n767p109q561j0220j1269
$$ 763411 773801 783951 793709 802592 809884 814905 817079 816103 812299 806532 799423 790862 780642 769373
60327G69373j1037r858q613p881p756p996p994p136n544m143l601l611l542l193
$$ 769373 758336 748478 739865 731984 724228 716232 708238 701102 695558 691415 687814 684203 680661 677468
60313F77468k544j343L77J921K739L295M397O029P657R319J1487J4030J6264J8137
$$ 677468 674924 673581 673958 675879 678618 681913 686310 692339 699996 709315 720802 734832 751096 769233
60299G69233K0445K3574K6770K8853K9127K7430K3895J8972J3190O707m38p630
$$ 769233 789678 813252 840022 868875 898002 925432 949327 968299 981489 988196 987758 980128
60287I80128j3798j8417k1774k4024k4711k3623k1509j9416j7729j6317j5165
$$ 980128 966330 947913 926139 902115 877404 853781 832272 812856 795127 778810 763645
60276G63645j4345j3555j2355j0804r442q643q272p959p442o642n669m759m110
$$ 763645 749300 735745 723390 712586 703144 694501 686229 678270 670828 664186 658517 653758 649648
60263F49648l684l281k751k177j884k157k789l073k515j474p68o37n82k99k20
$$ 649648 645964 642683 639932 637755 635871 633714 630925 627852 625337 623863 623095 622458 621876 621577 621357
60248F21357p89j612j800j077j14K76J8k35J27J033J862K122J844J281N62r3j72
$$ 621357 620568 618956 617156 616079 615965 616241 616259 616024 616151 617184 619046 621168 623012 624293 624855 624762 624590
60231F24590O16J752K454K744L452M899O263O542N755M776M267M235M436M742
$$ 624590 625206 626958 629412 632156 635608 640507 646770 653312 659067 663843 668110 672345 676781 681523
60217F81523N135N607O135O626O932P045P103P246P532Q092R063J0233J0981J0770
$$ 681523 686658 692265 698400 705026 711958 719003 726106 733352 740884 748976 758039 768272 779253 790023
60203G90023R668Q273P286P068P389P480O699N303M270M125M201L378J421p62
$$ 790023 799691 807964 815250 822318 829707 837187 843886 849189 853459 857584 861785 865163 866584 865822
60189H65822k164k672k948l566m458n164n387n203m880m704m930n564o134n997
$$ 865822 863658 860986 858038 854472 850014 844850 839463 834260 829380 824676 819746 814182 808048 802051
60175H02051n156m411m424m896n076m772m380m069l522k520j292k90J54n1n13
$$ 802051 796895 792484 788060 783164 778088 773316 768936 764867 761345 758825 757533 757243 757397 757346 756833
60160G56833n41P7O41M88M8K36R99J417J266J389K211K929K706J857J258J241
$$ 756833 756292 756369 757010 757498 757546 757782 758781 760198 761464 762853 765064 767993 770699 772556 773814 775055
60144G75055J645K365L182L607L526L582M335N388N956N952N922O199O669P142
$$ 775055 776700 779065 782247 785854 789380 792962 797297 802685 808641 814593 820515 826714 833383 840525
60130H40525P373O962N845M658M065L870L325K231J181P82J041J555J952K099
$$ 840525 847898 854860 860705 865363 869428 873298 876623 878854 880035 880817 881858 883413 885365 887464
60116H87464K118K203K313K221J969J870J939J660O47r01k569m112n140n116m216
$$ 887464 889582 891785 894098 896319 898288 900158 902097 903757 904404 903503 900934 896822 891682 886566 882350
60101H82350l600m159n323n862n447m717m054l243k221j368r45q01p12m76K06
$$ 882350 878750 874591 869268 863406 857959 853242 849188 845945 843724 842356 841411 840610 839898 839422 839628
60086H39628J384K481K868K712K641K637K045P45m82r78j001j224j959l052m154
$$ 839628 841012 843493 846361 849073 851714 854351 856396 857141 856659 855681 854680 853456 851497 848445 844291
60071H44291m899n218n570o511p880q886r064q716q352q154q078q015p696o911
$$ 844291 839392 834174 828604 822093 814213 805327 796263 787547 779195 771041 762963 754948 747252 740341
60057G40341n957n362n033m313l086k153k077k217j484K73K210L594M349M671
$$ 740341 734384 729022 723989 719676 716590 714437 712360 710143 708659 708932 711142 714736 719085 723756
60043G23756M707M736N142O005O903P355P254O751N926M772L420K091P89p32k507
$$ 723756 728463 733199 738341 744346 751249 758604 765858 772609 778535 783307 786727 788818 789607 788875 786368
60028G86368m094n049n559o238p294q304q934r462j0262j1103j1326j0632r363
$$ 786368 782274 777225 771666 765428 758134 749830 740896 731434 721172 710069 698743 688111 678748
60015F78748q102p262o910o813o645o295n846n280m474l603l022k597j668p0J306
$$ 678748 670646 663384 656474 649661 643016 636721 630875 625595 621121 617518 614496 611899 610231 610161 611467
60000F11467J506P54Q3R0O03J274J850K036J824J870K841M435N606N837N582N472
$$ 611467 612973 613727 613810 613900 614503 615777 617627 619663 621487 623357 626198 630633 636239 642076 647658 653130
59984F53130N657N913N861N036L305J233m28j557k491l217l479l511l821m241
$$ 653130 658787 664700 670561 675597 678902 680135 679707 678150 675659 672442 668963 665452 661631 657390
59970F57390m090l443l219l653l699k570j028m09q57j397j322p62q0O26J375K130
$$ 657390 653300 649857 646638 642985 639286 636716 635688 635279 634422 633025 631703 630941 630861 631487 632862 634992
59954F34992K830L321L384L018K615K656L248M068M566M256L105J763J048J022
$$ 634992 637822 641143 644527 647545 650160 652816 656064 660132 664698 668954 672059 673822 674870 675892
59940F75892R18J74q47j410j384j317j694k399k900k845k476k336k446k075p32
$$ 675892 676810 676984 676137 674727 673343 672026 670332 667933 665033 662188 659712 657376 654930 652855 652123
59925F52123Q87J629J384J132J424J721J581J537K263L487M440M922N276N648
$$ 652123 653010 654639 656023 657155 658579 660300 661881 663418 665681 669168 673608 678530 683806 689454
59911F89454N876N862N580M895L881L004K546K107J201P4o31q67j201j867k339
$$ 689454 695330 701192 706772 711667 715548 718552 721098 723205 724406 724480 723849 722982 721781 719914 717575
59896G17575j924n12J351K816L319L111L129M010N298N925N436M424L794L827
$$ 717575 715651 715139 716490 719306 722625 725736 728865 732875 738173 744098 749534 753958 757752 761579
59882G61579M060L906L354L008L276L697L445K569K075K527L150K819J438k87
$$ 761579 765639 769545 772899 775907 779183 782880 786325 788894 790969 793496 796646 799465 800903 800616
59868H00616j966l674n169n906n922n974o537p184p208o509n576m897m547m125
$$ 800616 798650 794976 789807 783901 777979 772005 765468 758284 751076 744567 738991 734094 729547 725422
59854G25422l065j336K02N47j48n24M73K391M003M886N641O731P778Q313Q598
$$ 725422 722357 721021 721223 721770 721622 721098 721571 723962 727965 732851 738492 745223 753001 761314 769912
59839G69912R152R803R922R521R362R668R465P831N342L508K993L092L020K859
$$ 769912 779064 788867 798789 808310 817672 827340 836805 844636 849978 853486 856479 859571 862591 865450
59825H65450L016L352L255K129l71m100q102j0995j2144j2157j1937j1646j0976
$$ 865450 868466 871818 875073 877202 876831 872731 864629 853634 841490 829333 817396 805750 794774
59812G94774r979r075q387p626o599n439m382l596l169l079l193l371l435l091
$$ 794774 784795 775720 767333 759707 753108 747669 743287 739691 736522 733443 730250 726879 723444 720353
59798G20353k233j346j105j430j493r19l98o83j569k435l203m068m698m474l407
$$ 720353 718120 716774 715669 714239 712746 711827 711429 710746 709177 706742 703539 699471 694773 690299 686892
59783F86892k148j239r02j268k199k972k926k290j842j803j730j413j132j005
$$ 686892 684744 683505 682603 681335 679136 676164 673238 670948 669106 667303 665573 664160 663028 662023
59769F62023p37j96L37O59R51J403J980K539K892K856K620K885M031N345N809
$$ 662023 661286 661090 661427 662086 663037 664440 666420 668959 671851 674707 677327 680212 684243 689588 695397
59754F95397N458N227N477N679N611N749O132N931M795L709L730M452M598L744
$$ 695397 700855 706082 711559 717238 722849 728598 734730 740661 745456 749165 752895 757347 761945 765689
59740G65689K660K166K315K599K454J685P14K40M25O65N09K82M07O59P08Q88J615
$$ 765689 768349 770515 772830 775429 777883 779568 780282 780522 780947 781612 782121 782403 782810 783469 784177 785065 786680
59723G86680K354K185J249P31J280K282K916L107L111K930K645K702L291L831
$$ 786680 789034 791219 792468 793199 794479 796761 799677 802784 805895 808825 811470 814172 817463 821294
59709H21294L634K833K140J976K283L003M108N241N858N808N356M671L721K745
$$ 821294 824928 827761 829901 831877 834160 837163 841271 846512 852370 858178 863534 868205 871926 874671
59695H74671K317K635L149L156K558J743R54J38p90j829k980m110m797m676l952
$$ 874671 876988 879623 882772 885928 888486 890229 891183 891321 890531 888702 885722 881612 876815 872139 868187
59680H68187l272k992k916k861l073l786m671n166n262n502o118o593o356n611
$$ 868187 864915 861923 859007 856146 853073 849287 844616 839450 834188 828686 822568 815975 809619 804008
59666H04008n140n319n743n834n482m887m046k821j437m67j43K9O67J724K538
$$ 804008 798868 793549 787806 781972 776490 771603 767557 764736 763299 762832 762689 762718 763385 765109 767647
59651G67647K630K214J947K272K947L113K047J5j770k437k458l016m416n739o142
$$ 767647 770277 772491 774438 776710 779657 782770 784817 784832 783062 780625 778167 775151 770735 764996 758854
59636G58854n920n937o359o507n807m470l203k468k200k037j801j661j878k444
$$ 758854 752934 746997 740638 734131 728324 723854 720651 718183 715983 713946 712145 710484 708606 706162
59622G06162l172l967m806n377n160m028k521j373q77r08j232j578j637j239n00
$$ 706162 702990 699023 694217 688840 683680 679652 677131 675758 674881 673973 672741 671163 669526 668287 667787
59607F67787M06J483K682L652M012L803L390K973K470J849J298R49O96L63n9n26
$$ 667787 668193 669676 672358 676010 680022 683825 687215 690188 692658 694507 695805 696754 697450 697813 697754 697228
59591F97228j084j772k320k198j139L78J420J473R57O11N75L88j93q33j186j405
$$ 697228 696144 694372 692052 689854 688715 689093 690513 691986 692943 693554 694129 694517 694324 693491 692305 690900
59575F90900j808k324k675k894l252l695l733l073k160j791k219k893l157l013
$$ 690900 689092 686768 684093 681199 677947 674252 670519 667446 665286 663495 661276 658383 655226 652213
59561F52213k863k703k047q37J84M16K50M19Q33Q36M57N22J388K378K813K904
$$ 652213 649350 646647 644600 643763 643947 644363 644613 645032 645865 646701 647158 647680 649068 651446 654259 657163
59545F57163L194L688M111M577N444O679P873Q869R935J1418J3391J5684J8029
$$ 657163 660357 664045 668156 672733 678177 684856 692729 701598 711533 722951 736342 752026 770055
59532G70055K0056K1094K0128J6542J1294O853N169N822O838P057O814O498N784
$$ 770055 790111 811205 831333 847875 859169 866022 871191 877013 883851 890908 897722 904220 910004
59519I10004M619L590K775J253j411m271o319p879r708j1625j3044j4196j5621
$$ 910004 914623 918213 920988 922241 920830 916559 910240 902361 892653 881028 867984 853788 838167
59506H38167j6920j7150j6152j4534j2684j0789r405q961q887q281p180o243n470
$$ 838167 821247 804097 787945 773411 760727 749938 740533 731572 722685 714404 707224 700981 695511
59493F95511m345l013k145j722j131m14k27m69j87R08J969K353K451K792L274
$$ 695511 691166 688153 686008 684286 683155 682741 682514 682045 681858 682766 684735 687088 689539 692331 695605
59478F95605L608L821L930L878L929M443N103N221M879M853N272N413N059M908
$$ 695605 699213 703034 706964 710842 714771 719214 724317 729538 734417 739270 744542 749955 755014 759922
59464G59922N225N244M476L652L635M249M901N590O567P650Q556R397J0267J0831
$$ 759922 765147 770391 774867 778519 782154 786403 791304 796894 803461 811111 819667 829064 839331 850162
59450H50162J0863J0568R992Q704O646M604L212K068M34j762m190o719r172j0992
$$ 850162 861025 871593 881585 890289 896935 901539 904751 906819 907253 905491 901301 894582 885410 874418
59436H74418j1887j2263j2423j1921j0337q196o300m757l311k151j480p22Q79
$$ 874418 862531 850268 837845 825924 815587 807391 801091 796334 793023 790872 789392 788670 789549
59423G89549L101N076O587Q251J0492J3079J5556J7533J8621J8736J8382J8117
$$ 789549 792650 797726 804313 812564 823056 836135 851691 869224 887845 906581 924963 943080
59411I43080J7921J7514J6964J6290J4792J1529O446M38n463j0396j3560j4627
$$ 943080 961001 978515 995479 1011769 1026561 1038090 1044536 1044974 1039511 1029115 1015555 1000928
59399A000928j4155j2864j0678p270l413q21o17k677o315j0698j4575j6717j7102
$$ 1000928 986773 973909 963231 955961 952548 951727 951110 948433 942118 931420 916845 900128 883026
59386H83026j6803j6423j5423j3355j0892r016p835o821n681m349k580l03J865
$$ 883026 866223 849800 834377 821022 810130 801114 793279 786458 780777 776428 773848 773545 775410
59373G75410L096L345L339L663M309N070N905O760P458P950Q412Q951R355R396
$$ 775410 778506 781851 785190 788853 793162 798232 804137 810897 818355 826305 834717 843668 853023 862419
59359H62419R285R551J0457J1685J2786J3743J4897J6341J7677J8503J8872J9196
$$ 862419 871704 881255 891712 903397 916183 929926 944823 961164 978841 997344 1016216 1035412
59347A035412J9773K0561K1221K1331K0719J9657J8543J7252J5145J1855P747
$$ 1035412 1055185 1075746 1096967 1118298 1139017 1158674 1177217 1194469 1209614 1221469 1229216
59336A229216L403r48n212r096j2407j5367j8091k0088k0865k0835k0888k1214
$$ 1229216 1232619 1231671 1226459 1217363 1204956 1189589 1171498 1151410 1130545 1109710 1088822 1067608
59324A067608k1238k0683j9898j9035j7734j5944j4218j2798j1108q765o531n448
$$ 1067608 1046370 1025687 1005789 986754 969020 953076 938858 926060 914952 906187 899656 894208
59312H94208n453n515m958l976k999k348k389l228m089l811k229m91L34L62K93
$$ 894208 888755 883240 878282 874306 871307 868959 866570 863342 859253 855442 853213 852722 853056 853418 853711
59297H53711M05O45J172K079L012L767M917P042R584J1391J2337J3286J4330J4118
$$ 853711 854116 854761 855933 858012 861024 864791 869708 876750 886334 897725 910062 923348 937678 951796
59283I51796J1457O811J734k486n143n897n026l425j696K65K355L778M234M877
$$ 951796 963253 970064 971798 969312 964169 958272 953246 949821 948125 948390 950745 954523 958757 963634
59269I63634O893R602J1184J0997R985Q885P312M811J630j836n402q633j0951
$$ 963634 970527 980129 991313 1002310 1012295 1021180 1028492 1033303 1034933 1033097 1027695 1019062 1008111
59256A008111j2549j4220j5927j6527j5428j3609j2394j1953j1604j0924r863
$$ 1008111 995562 981342 965415 948888 933460 919851 907457 895504 883900 872976 863113
59245H63113q325o282l990j623Q90L373N270O313O835P099P011O784P028P648
$$ 863113 854788 848506 844516 842893 843783 847156 852426 858739 865574 872673 879684 886468 893496 901144
59231I01144P479N754L252J290J01j029k566m449o514q415r511r597r391r571
$$ 901144 908623 914377 917629 918919 919020 917991 915425 910976 904462 896047 886536 876939 867548 857977
59217H57977r685q772o803m686l135k158j564j141n53L92J346J832J840J648J349
$$ 857977 848292 839520 832717 828031 824896 822738 821174 820033 819480 819872 821218 823050 824890 826538 827887
59202H27887R83Q06Q71P59K37j78NM03L66J12M07J381K357K745K483J804J150
$$ 827887 828870 829676 830547 831306 831543 831365 831370 831773 832139 832251 832658 834039 836396 839141 841624 843428 844578
59185H44578J001J250J149M19j01L56J305J893K315L179M032L904L142L235M740
$$ 844578 845579 846829 847978 848397 848296 848652 849957 851850 854165 857344 861376 865280 868422 871657 876397
59170H76397O661Q065R126J0229J1224J1960J2625J3075J2735J1555J0245R172
$$ 876397 883058 891123 900249 910478 921702 933662 946287 959362 972097 983652 993897 1003069
59158A003069P800N664L133P76j463l880o375q641j0587j2192j3258j3662j3597
$$ 1003069 1010869 1016533 1019666 1020442 1018979 1015099 1008724 1000083 989496 977304 964046 950384 936787
59145I36787j3374j3221j3245j3327j3054j2158j0941r864q962q096p481p230
$$ 936787 923413 910192 896947 883620 870566 858408 847467 837603 828641 820545 813064 805834
59133H05834o758n460l860l014k874k283o68J324L050M561N823O390O424O971
$$ 805834 799076 793616 789756 786742 783868 781585 780917 782241 785291 789852 795675 802065 808489 815460
59119H15460Q593J0491J1664J2165J2647J3383J4353J5626J6902J7403J6841J6066
$$ 815460 824053 834544 846208 858373 871020 884403 898756 914382 931284 948687 965528 981594
59107I81594J5967J6250J6035J5239J4526J4135J3559J2388J0820R213P623N943
$$ 981594 997561 1013811 1029846 1045085 1059611 1073746 1087305 1099693 1110513 1119726 1127349 1133292
59095A133292M264K859J875J018k30j912l227l333k423j577j579k375l716n620
$$ 1133292 1137556 1140415 1142290 1143308 1143078 1141166 1137939 1134606 1132183 1130606 1129027 1126652 1122936 1117316
59081A117316q019j0421j2300j3463j4025j4353j5040j6274j7326j7254j6150
$$ 1117316 1109297 1098876 1086576 1073113 1059088 1044735 1029695 1013421 996095 978841 962691
59070I62691j4943j3984j2784j1262j0181r910r780r188q452q016p576o819o202
$$ 962691 947748 933764 920980 909718 899537 889627 879847 870659 862207 854191 846615 839796 833594
59057H33594o243o619o731o606o473o041n039l952l362k936k051j031q15j453
$$ 833594 827351 820732 814001 807395 800922 794881 789842 785890 782528 779592 777541 776510 775695 774242
59043G74242j936j558o57R7M99O85Q00R90J367J874K426L196M421N939P293Q288
$$ 774242 772306 770748 770091 770188 770687 771372 772172 773162 774529 776403 778829 782025 786446 792385 799678 807966
59027H07966R166J0257J1661J3307J5041J6731J8392K0071K1493K2023K1250J9430
$$ 807966 817132 827389 839050 852357 867398 884129 902521 922592 944085 966108 987358 1006788
59015A006788J7175J4821J2320R638O995M734K997J535j3j423j736l30K030L860
$$ 1006788 1023963 1038784 1051104 1060742 1067737 1072471 1075468 1077003 1076990 1075567 1073831 1073501 1075531 1079391
59001A079391M725N571P081Q674R478R510R180Q269O274L386L88k192m196n469
$$ 1079391 1084116 1089687 1096768 1105442 1114920 1124430 1133610 1141879 1148153 1151539 1151927 1149735 1145539 1140070
58987A140070o151p196r605j3011j5681j6280j5235j3998j3329j2679j1250r163
$$ 1140070 1133919 1126723 1117118 1104107 1088426 1072146 1056911 1042913 1029584 1016905 1005655 996492
58975I96492p285o000m709k714j95K193M258O170P681Q372Q639R425J0804J1725
$$ 996492 989207 983207 978498 975784 975589 977782 982040 988210 995891 1004263 1012902 1022327 1033131 1044856
58961A044856J1568J0981J0686J0235Q671N819K225j644n452q757j1396j3745
$$ 1044856 1056424 1067405 1078091 1088326 1096997 1102816 1105041 1103397 1097945 1089188 1077792 1064047
58949A064047j6000j7644j8209j8131j8085j7880j6813j4915j2981j1467j0072
$$ 1064047 1048047 1030403 1012194 994063 975978 958098 941285 926370 913389 901922 891850
58938H91850q416o572m814l346k304j715j468j558k180l320m524n338n775o015
$$ 891850 883434 876862 872048 868702 866398 864683 863215 861657 859477 856157 851633 846295 840520 834505
58924H34505o032n829n708n836n826n222m116k963k028j389j102r47l66Q52K172
$$ 834505 828473 822644 816936 811100 805274 800052 795936 792973 790945 789556 788454 787507 787141 787993 790165
58909G90165L004L500M238N384O677P908R039J0043J1040J2243J3521J4443J5081
$$ 790165 793169 796669 800907 806291 812968 820876 829915 839958 850998 863241 876762 891205 906286
58896I06286J6187J8157K0353K1937K2828K3299K3338K3087K3257K4322K5752
$$ 906286 922473 940630 960983 982920 1005748 1029047 1052385 1075472 1098729 1123051 1148803
58885A148803K6763K7277K7317K6118K2969J8573J4464J1191P972L973r30o453
$$ 1148803 1175566 1202843 1230160 1256278 1279247 1297820 1312284 1323475 1331447 1335420 1334490 1328037
58873A328037j2026j6747k0042k2296k4109k5245k5163k4260k3477k2956k2136
$$ 1328037 1316011 1299264 1279222 1256926 1232817 1207572 1182409 1158149 1134672 1111716 1089580
58862A089580k1069k0360j9846j8606j6592j4965j4450j4356j3740j2640j1610
$$ 1089580 1068511 1048151 1028305 1009699 993107 978142 963692 949336 935596 922956 911346
58851I11346j0869j0377j0198j0194r957r388q863q534q093p463p150p461p981
$$ 911346 900477 890100 879902 869708 859751 850363 841500 832966 824873 817410 810260 802799 794818
58838G94818q163p979p586o908n987n262n033m959m515l662k722j847r89j35P00
$$ 794818 786655 778676 771090 764182 758195 752933 747900 742941 738426 734764 732042 730195 729206 729071 729771
58823G29771J522K150K251J815J388J498K003K350K324K271K521K863K709J782
$$ 729771 731293 733443 735694 737509 738897 740395 742398 744748 747072 749343 751864 754727 757436 759218
58809G59218M99l81m38J18P38R51N21m08j240j397r92p54j103j731k246k737l298
$$ 759218 759717 759336 758898 759016 759754 760705 761226 760818 759578 758181 757189 756435 755332 753601 751355 748618 745320
58792G45320l535l062k174j473j130r10n92O6J439L482N362O254O267O099O019
$$ 745320 741785 738723 736549 735076 733946 733036 732444 732510 733949 737431 742793 749047 755314 761413 767432
58777G67432N811N407M947M323L363K271J360M47r30k753m519n850o625o744o288
$$ 767432 773243 778650 783597 787920 791283 793554 794914 795361 794431 791678 787159 781309 774684 767940 761652
58762G61652n717n425n193m634l834l067k170q46O55J785K438K886L240L531M020
$$ 761652 755935 750510 745317 740683 736849 733782 731612 730766 731421 733206 735644 738530 741770 745301 749321
58747G49321M836N631O141O738P733Q667R008R058R398R894J0200J0659J1636
$$ 749321 754157 759788 765929 772667 780400 789067 798075 807133 816531 826425 836625 847284 858920
58734H58920J2476J2375J1883J2172J3069J3216J2142J0675R298P538N361L666
$$ 858920 871396 883771 895654 907826 920895 934111 946253 956928 966226 973764 979125 982791
58722I82791K934K542J962J582J750K047K084K155K496K675K307J668J108M10
$$ 982791 985725 988267 990229 991811 993561 995608 997692 999847 1002343 1005018 1007325 1008993 1010101 1010511
58708A010511p39k188l663n274p279r710j2341j4770j6504j7427j8117j9154k0247
$$ 1010511 1009772 1007584 1003921 998647 991368 981658 969317 954547 938043 920616 902499 883345 863098
58695H63098k0681k0397j9868j9064j7509j5371j3546j2477j1646j0427q743o913
$$ 863098 842417 822020 802152 783088 765579 750208 736662 724185 712539 702112 693369 686456
58683F86456n486n093n673o141n677m968n033n252m096j680J17L62K51J092K586
$$ 686456 680970 675877 670204 664063 658386 653418 648385 643133 639037 637357 637474 637836 638087 639179 641765
58668F41765L878N047O638Q638J0630J2300J3331J3460J2951J2225J0933Q428
$$ 641765 645643 650690 657328 665966 676596 688896 702227 715687 728638 740863 751796 760224
58656G60224N170K441M67j789m627o899p898q460r363r974r485q315p257o232
$$ 760224 765394 767835 768302 766513 761886 754987 747089 738629 729266 719292 709807 701492 694235 688003
58642F88003m876l574k889k600k168j480n69O99K048K743K630K475K657K525J687
$$ 688003 683127 679553 676664 674064 671896 670416 669847 670546 672594 675337 677967 680442 683099 685624 687311
58627F87311Q88Q17R34M35m28q58o03K04J565L190M301M596M850N828P264Q513
$$ 687311 688199 689016 689950 690385 689957 689099 688496 688700 690265 693455 697756 702352 707202 713030 720294 728807
58611G28807R393R808R383Q199P078O385N364L455J351m4q80j698k357k518k579
$$ 728807 738200 748008 757391 765590 772668 779053 784417 787872 789223 789179 788299 786601 784244 781726 779147
58596G79147l108l904m366m290l683k359m22J457K806L890N097O521Q400J0974
$$ 779147 776039 772135 767769 763479 759796 757437 757015 758472 761278 765168 770265 776786 785186 796160
58582G96160J3513J4708J4520J4382J4915J4960J3693J2197J1716J1769J1367
$$ 796160 809673 824381 838901 853283 868198 883158 896851 909048 920764 932533 943900
58571I43900J0896J1274J2274J3258J4701J7384K0779K3735K6198K8840L1507
$$ 943900 954796 966070 978344 991602 1006303 1023687 1044466 1068201 1094399 1123239 1154746
58560A154746L3397L4344L4586L3752L1370K7981K4473K0648J5652R581L605j283
$$ 1154746 1188143 1222487 1257073 1290825 1322195 1350176 1374649 1395297 1410949 1420530 1424135 1422852
58548A422852m822p208r139j1512j4306j6379j7251j8171k0386k3335k5719k7457
$$ 1422852 1418030 1410822 1401683 1390171 1375865 1359486 1342235 1324064 1303678 1280343 1254624 1227167
58536A227167k9214l0738l1235l0727k9755k8230k5936k3497k1456j9080j5629
$$ 1227167 1197953 1167215 1135980 1105253 1075498 1047268 1021332 997835 976379 957299 941670
58525I41670j2072r935q966p657n688m079l163k154q50q6l17j026j683k211k467
$$ 941670 929598 919663 910697 903040 897352 893273 890110 887956 887106 887020 886703 885677 883994 881783 879316
58510H79316k316k173k528l098l279l101k860k317j338p07j149k071k475k467
$$ 879316 877000 874827 872299 869201 865922 862821 859961 857644 856306 855599 854450 852379 849904 847437
58496H47437k608k475j372J59J075J540K342L187L337L447M895P513R813J1305
$$ 847437 844829 842354 840982 841141 842216 843756 846098 849285 852622 856069 860964 868477 878290 889595
58482H89595J2869J4913J6922J8788K0861K2683K3309K2827K2017K0582J7477
$$ 889595 902464 917377 934299 953087 973948 996631 1019940 1042767 1064784 1085366 1102843
58471A102843J2876Q023L172k306p780j1378j2610j3024j3717j3995j3152j1711
$$ 1102843 1115719 1123742 1126914 1124608 1116828 1105450 1092840 1079816 1066099 1052104 1038952 1027241
58459A027241j0159p945m711j191J884M662P271R148R907R907R387P983N550K583
$$ 1027241 1017082 1009137 1004426 1003235 1005119 1009781 1017052 1026200 1036107 1046014 1055401 1063384 1068934 1071517
58445A071517n38l862p158r804j1612j2855j3383j2704j1061r415q148o726m767
$$ 1071517 1070979 1067117 1059959 1050155 1038543 1025688 1012305 999601 988540 979125 970977 964251 959484
58432I59484k505j21K403M791O736Q572J0714J2706J3888J4676J5838J6745J5888
$$ 959484 956979 956858 959261 964052 970788 979360 990074 1002780 1016668 1031344 1047182 1063927 1079815
58419A079815J3044R478N995K344j354m190n877p246q953j0746j2244j3369j3861
$$ 1079815 1092859 1102337 1108332 1110676 1109322 1105132 1099255 1092009 1083056 1072310 1060066 1046697 1032836
58406A032836j3465j2613j1970j1419j0435r185q052o522l944j041Q17J628K519
$$ 1032836 1019371 1006758 994788 983369 972934 963749 955697 949175 945231 944190 945007 946635 949154
58393I49154L783M687M967M891M131K260J57q50r80j451k228k237j514j052p36
$$ 949154 952937 957624 962591 967482 971613 973873 974030 973180 972200 970749 968521 966284 964770 963718 962982
58378I62982L82J798J908Q42O43K245M375N894P186Q690R967J0850J1814J2826
$$ 962982 963364 965162 967070 967912 968555 970800 975175 981069 988255 996945 1006912 1017762 1029576 1042402
58364A042402J3350J3629J4346J5148J5305J5500J6747J7857J6530J3019J0014
$$ 1042402 1055752 1069381 1083727 1098875 1114180 1129680 1146427 1164284 1180814 1193833 1203847
58353A203847Q694P603N827M402L787K808J136L57J448L323M899O489Q284R547
$$ 1203847 1212541 1220144 1225971 1230373 1234160 1236968 1238104 1238461 1239909 1243232 1248131 1254620 1262904 1272451
58339A272451J0215J1281J2878J3943J4396J5475J7372J8741J9055J9165J9084
$$ 1272451 1282666 1293947 1306825 1320768 1335164 1350639 1368011 1386752 1405807 1424972 1444056
58328A444056J7713J5323J3648J2872J1211Q185N543M099K533L36r41m65N54J398
$$ 1444056 1461769 1477092 1490740 1503612 1514823 1523008 1528551 1532650 1535183 1535519 1534578 1534113 1534667 1536065
58314A536065K944N175O484O604P392R508J1225J1767J2782J5117J7117J7722
$$ 1536065 1539009 1544184 1550668 1557272 1564664 1574172 1585397 1597164 1609946 1625063 1642180 1659902
58302A659902J8219J9449K0198J9963K0284K1662K2142K0713J9177J8944J8957
$$ 1659902 1678121 1697570 1717768 1737731 1758015 1779677 1801819 1822532 1841709 1860653 1879610
58291A879610J8495J8860K0461K1415K0921K0900K2370K3493K3274K3731K6188
$$ 1879610 1898105 1916965 1937426 1958841 1979762 2000662 2023032 2046525 2069799 2093530 2119718
58280B119718K8742K9790L0699L2730L4696L6177L9405M5146N0273N2443N3838
$$ 2119718 2148460 2178250 2208949 2241679 2276375 2312552 2351957 2397103 2447376 2499819 2553657
58269B553657N7140O1178O3852O6242P0187P4596P7620P9984Q3002Q5712Q6893
$$ 2553657 2610797 2671975 2735827 2802069 2872256 2946852 3024472 3104456 3187458 3273170 3360063
58258C360063Q7497Q8366Q8213Q6329Q4536Q4078Q3676Q2948Q4152Q8200R2710
$$ 3360063 3447560 3535926 3624139 3710468 3795004 3879082 3962758 4045706 4129858 4218058 4310768
58247D310768R6554J02119J10338J18032J23295J28909J37068J45547J52744J61456
$$ 4310768 4407322 4509441 4619779 4737811 4861106 4990015 5127083 5272630 5425374 5586830
58237E586830J73586J86078J96430K07292K21108K35384K48064K62253K80483
$$ 5586830 5760416 5946494 6142924 6350216 6571324 6806708 7054772 7317025 7597508
58228G597508K99644L17048L36152L60502L87386M13599M42135M76829N15709
$$ 7597508 7897152 8214200 8550352 8910854 9298240 9711839 10153974 10630803 11146512
58219A1146512N56065O00820O53396P11855P74720Q46748R32221J028937J135895
$$ 11146512 11702577 12303397 12956793 13668648 14443368 15290116 16222337 17251274 18387169
58210A8387169J259955J407461J576722J766965J986777K245039K542079K879521
$$ 18387169 19647124 21054585 22631307 24398272 26385049 28630088 31172167 34051688
58202C4051688L270652L732303M278090M932069N738750O745626P982390R464232
$$ 34051688 37322340 41054643 45332733 50264802 56003552 62749178 70731568 80195800
58194H0195800J1199733J3182391J5388833J7796617K0387802K3130213K5969660
$$ 80195800 91395533 104577924 119966757 137763374 158151176 181281389 207251049
58187B07251049K8779807L1144682L2082928L0169459K4332230J4827854L447175
$$ 207251049 236030856 267175538 299258466 329427925 353760155 368588009 372035184
58180C72035184p382294j5855076k1398220k4395328k5569852k5567460k4816932
$$ 372035184 364652890 348797814 327399594 303004266 277434414 251866954 227050022
58173B27050022k3526802k1756681j9545538j7019999j4419221j2050559j0199986
$$ 227050022 203523220 181766539 162221001 145201002 130781781 118731222 108531236
58166A08531236r007173q377868q040401p726377p310069o798034o240464n681319
$$ 108531236 99524063 91146195 83105794 75379417 68069348 61271314 55030850 49349531
58158D9349531n154715m676212m232415l800289l375716k971111k594676k248464
$$ 49349531 44194816 39518604 35286189 31485900 28110184 25139073 22544397 20295933
58150B0295933j939234j674016j448466j252794j085411r49230q39169p45233
$$ 20295933 18356699 16682683 15234217 13981423 12896012 11946782 11107613 10362380
58142A0362380o64444n99056n46076m98756m55779m19735l88791l58229l28049
$$ 10362380 9697936 9098880 8552804 8054048 7598269 7178534 6789743 6431514 6103465
58133F103465l01431k77811k54495k32564k14514j98661j82399j68263j60093
$$ 6103465 5802034 5524223 5269728 5037164 4822650 4623989 4441590 4273327 4113234
58124D113234j55704j49712j41472j34063j27731j20439j12988j07635j03253
$$ 4113234 3957530 3807818 3666346 3532283 3404552 3284113 3171125 3063490 2960237
58115B960237r7223r0515q5817q2431p7972p3132o9776o6386o0451n3647m9566
$$ 2960237 2863014 2772499 2686682 2604251 2526279 2453147 2383371 2316985 2256534 2202887 2153321
58104B153321m7950m6047m3944m3662m4441m3889m2552m2515m2720m0442l6401
$$ 2153321 2105371 2059324 2015380 1971718 1927277 1883388 1840836 1798321 1755601 1715159 1678758
58093A678758l3724l2665l0925k8491k7532k7871k6949k4278k2033k1236k0911
$$ 1678758 1645034 1612369 1581444 1552953 1525421 1497550 1470601 1446323 1424290 1403054 1382143
58082A382143k0852k1828k3219k3545k3111k3305k3827k3370k2376k2196k2365
$$ 1382143 1361291 1339463 1316244 1292699 1269588 1246283 1222456 1199086 1176710 1154514 1132149
58071A132149k1551k0381k0318k0669j9690j7817j6795j6500j5558j4301j3951
$$ 1132149 1110598 1090217 1069899 1049230 1029540 1011723 994928 978428 962870 948569 934618
58060I34618j3841j2468j0591j0123j0737j0635r889r874j0167r348q139q387
$$ 934618 920777 908309 897718 887595 876858 866223 856334 846460 836293 826945 818806 810419
58048H10419r465r112p460o758p344p327o236n618n845n620m960n463p174q081
$$ 810419 800954 791842 784382 777624 770280 762953 756717 751099 745254 739634 734674 729211 722037 713956
58034G13956p307o188n717n514n579o534p781p905p255p568q832r138p981p045
$$ 713956 706649 700461 694744 689230 683651 677117 669336 661431 654176 646608 637776 628638 620657 613612
58020F13612p124o916n642m423m129m028l505l153l252k980k000j264j453j989
$$ 613612 606488 599572 593930 589507 585378 581350 577845 574692 571440 568460 566460 565196 563743 561754
58006E61754k176k063j776j279r11r98r75j60R16J355J540K260K805K044Q75J242
$$ 561754 559578 557515 555739 554460 553549 552551 551576 551416 552332 553687 555227 557487 560292 562336 563211 564453
57990E64453K891L635K826K024J906J193p21k450k886k755l009l535m121m997
$$ 564453 567344 570979 573805 575829 577735 578928 578207 575757 572871 570116 567107 563572 559451 554454
57976E54454n724n265l815k899l124l522l514l658l943l378j996j327j920k303
$$ 554454 548730 543465 539650 536751 533627 530105 526591 522933 518990 515612 513616 512289 510369 508066
57962E08066j401k07N5k25k59m05j161j791j354j66P61J005O79l8n87j87J029
$$ 508066 506665 506458 506513 506288 506029 505624 504463 502672 501318 501152 501913 502918 503597 503559 502972 502785 503814
57945E03814J949K157K616M071N862P066P785Q492R024R161R436J0557J2433J4389
$$ 503814 505763 507920 510536 514607 520469 527535 535320 543812 552836 561997 571433 581990 594423 608812
57931F08812J5818J6328J5800J4649J3374J1739R167N955L106Q76j505m321o778
$$ 608812 624630 640958 656758 671407 684781 696520 705687 711642 714748 715624 714119 709798 703020
57918G03020q250r062r615r794r687r902j0617j1214j1348j1468j1816j1787j0863
$$ 703020 694770 685708 676093 666299 656612 646710 636093 624879 613531 602063 590247 578460 567597
57905E67597r401q027o864n829n066m702m692m970n267m872l366j509m49j47M70
$$ 567597 558196 550169 543305 537476 532410 527708 523016 518046 512779 507907 504541 503032 502583 502436 502906
57890E02906J785L083L867M454N025N256N100M957M915M749M671M950M883L483
$$ 502906 504691 507774 511641 516095 521120 526376 531476 536433 541348 546097 550768 555718 560601 564084
57876E64084J200m57j103j755k738l070k435k029k667l494l549l187l091l021
$$ 564084 565284 564827 563724 561969 559231 556161 553726 551697 549030 545536 541987 538800 535709 532688
57862E32688k540k029j966k013j617q31N9R72J712K012K286L318M841N472M600
$$ 532688 530148 528119 526153 524140 522523 521692 521751 522723 524435 526447 528733 532051 536892 542364 546964
57847E46964L200K327J883J438J045N91m79k137l471m062m541n229n521n282n440
$$ 546964 550164 552491 554374 555812 556857 557448 556969 554832 551361 547299 542758 537529 532008 526726 521286
57832E21286o284o522n174l211k084j680j008j2O39Q88J145J346J261J303K003
$$ 521286 515002 508480 503306 500095 498011 496331 495323 495311 495950 496838 497983 499329 500590 501893 503896
57817E03896L083L818L912L348K005J92j085j240r78j263j992k379k085j347n38
$$ 503896 506979 510797 514709 518057 520062 520254 519169 517929 516951 515688 513696 511317 509232 507885 507347
57802E07347k53j109k798m023m044l510l205k876k142j513j529j687j252m60Q2
$$ 507347 507094 505985 503187 499164 495120 491610 488405 485529 483387 481874 480345 478658 477406 476946 477028
57787D77028M61R46J120O08N4L70J484K728L928N178O158O639P064P711P940P231
$$ 477028 477489 478435 479555 480163 480217 480587 482071 484799 488727 493905 500063 506702 513766 521477 529417 536648
57771E36648O245N766N388M397L209K547J881J96k115l707m359n098o313p256
$$ 536648 542893 548659 554047 558444 561653 564200 566081 566277 564162 560455 556096 550998 544685 537429
57757E37429p463p343p102o346n032l753k862k163j587j328j211q25l26k50n03
$$ 537429 529966 522623 515521 509175 504143 500390 497528 495365 493778 492450 491239 490414 490088 489838 489335
57742D89335m81k76o47j635k201j647o33k67q60j950k973l529l419k817k163j731
$$ 489335 488854 488578 487931 486296 484095 482448 481815 481548 480688 478738 475765 472236 468817 466000 463837 462106
57726D62106j515j456j470j238n14L90Q07M54l10r94j450j826k301k818k983k460
$$ 462106 460591 459135 457665 456427 455913 456303 457110 457564 457254 456260 454810 452984 450683 447865 444882 442422
57710D42422j602j263j775k523k853k876k907k723k005j127p54r42j226j321j191
$$ 442422 440820 439557 437782 435259 432406 429530 426623 423900 421895 420768 420014 419072 417846 416525 415334
57695D15334p58o8M52M64J64j12k77j18Q72K632M057M172L348K661K646L337M948
$$ 415334 414576 414508 414960 415424 415588 415476 415199 415081 415953 418585 422642 426814 430162 432823 435469 438806 443754
57678D43754P514J0332J2819J5512J9253K3791K8193L2336L6853M1906M7174N2781
$$ 443754 451268 461600 474419 489931 509184 532975 561168 593504 630357 672263 719437 772218
57666G72218N8872O4232O6365O3090N3384L7194J6000o473k5684l9210m7603n2453
$$ 772218 831090 895322 961687 1024777 1078161 1115355 1131355 1124882 1099198 1059988 1012385 959932
57654I59932n4704n4929n3768n1356m7288m1724l5841l0624k6019k1674j7863
$$ 959932 905228 850299 796531 745175 697887 656163 620322 589698 563679 542005 524142
57643E24142j5038j3043j1270r294p142n256m250m193m159l169j530m65l53k77
$$ 524142 509104 496061 484791 475497 468355 463099 458849 454656 450497 447328 445798 445333 444980 444703
57629D44703M44J242J325Q56N22M75L22j81q37j214r47j76K92k35j353j898j425
$$ 444703 445147 446389 447714 448570 449092 449567 449889 449708 448871 447657 446710 446534 446826 446591 445238 443340 441915
57612D41915o80n02q86j439k008k499k639k353j927j533j001l36N5j04o08j166
$$ 441915 441235 440733 439847 438408 436400 433901 431262 428909 426982 425449 424448 424112 424167 424063 423455 422289
57596D22289j646j796j316m86j31o62j600k318k725k894k609j733o45P3J77k09
$$ 422289 420643 418847 417531 417045 416914 416252 414652 412334 409609 406715 404106 402373 401728 401801 401978 401769
57580D01769p24q46k72N56P75J14q73j674k268k567k172j162m10n72j199j432
$$ 401769 401045 400199 399927 400483 401258 401372 400499 398825 396557 393990 391818 390656 390246 389674 388475 387043
57564C87043j150q39o91m09J98R66J634J991J901J472J127J260J912K893L970
$$ 387043 385893 385054 384363 383954 384152 385118 386752 388743 390644 392116 393243 394503 396415 399308 403278
57549D03278M773M834M077L107K678K945L402L471K979K159J405J016J050J386
$$ 403278 408051 412885 416962 420069 422747 425692 429094 432565 435544 437703 439108 440124 441174 442560
57535D42560J752J764J158K10l33k9P48J339J561J611J514J234J042J240J634
$$ 442560 444312 446076 447234 447444 447111 447082 447830 449169 450730 452341 453855 455089 456131 457371 459005
57520D59005J880K165K919L913M427M263L928L804L837M014M416M700M335L481
$$ 459005 460885 463050 465969 469882 474309 478572 482500 486304 490141 494155 498571 503271 507606 511087
57506E11087K911K845K728K269J941K058K144J683R29N05O76J216J573J125r8
$$ 511087 513998 516843 519571 521840 523781 525839 527983 529666 530595 531100 531776 532992 534565 535690 535592
57491E35592r92m66R55J674J260R76J667K412K106J228R78J448J879K143K770
$$ 535592 534600 534134 535089 536763 538023 538999 540666 543078 545184 546412 547390 548838 550717 552860 555630
57476E55630L753M373M229L587K817K076J583J549J787J850J588J269J266J793
$$ 555630 559383 563756 567985 571572 574389 576465 578048 579597 581384 583234 584822 586091 587357 589150
57462E89150K758L663L911L475K914K567K256J956K139L009L996M509M694M896
$$ 589150 591908 595571 599482 602957 605871 608438 610694 612650 614789 617798 621794 626303 630997 635893
57448F35893M898M366L620L273L444L850M345M838N010M762M577M898N410N545
$$ 635893 640791 645157 648777 652050 655494 659344 663689 668527 673537 678299 682876 687774 693184 698729
57434F98729N312N097M973M844M905N333N797N903N810N818N715N259M867N062
$$ 698729 704041 709138 714111 718955 723860 729193 734990 740893 746703 752521 758236 763495 768362 773424
57420G73424N566N744N645N738N836N393M683M696N665O707P084O967O787O630
$$ 773424 778990 784734 790379 796117 801953 807346 812029 816725 822390 829097 836181 843148 849935 856565
57406H56565O628P142Q118Q831Q701P956P205O777O692O836O944O812O729P250
$$ 856565 863193 870335 878453 887284 895985 903941 911146 917923 924615 931451 938395 945207 951936 959186
57392I59186Q333R178R255R057R431J0441J1396J1760J1660J1519J1588J1939
$$ 959186 967519 976697 985952 995009 1004440 1014881 1026277 1038037 1049697 1061216 1072804 1084743
57380A084743J2596J3411J3895J3527J2368J1215J0799J0928J0799J0088R285
$$ 1084743 1097339 1110750 1124645 1138172 1150540 1161755 1172554 1183482 1194281 1204369 1213654
57369A213654Q855Q643Q452Q597R431J0646J1619J2166J2506J2700J2713J2813
$$ 1213654 1222509 1231152 1239604 1248201 1257632 1268278 1279897 1292063 1304569 1317269 1329982 1342795
57357A342795J3289J3873J3990J3613J3305J3343J3375J3108J2924J3481J4821
$$ 1342795 1356084 1369957 1383947 1397560 1410865 1424208 1437583 1450691 1463615 1477096 1491917
57346A491917J6125J6415J5494J4205J3597J3915J4610J5206J5711J6126J6207
$$ 1491917 1508042 1524457 1539951 1554156 1567753 1581668 1596278 1611484 1627195 1643321 1659528
57335A659528J5938J5704J5745J5921J6284J7126J8183J8620J8320J8320J9277
$$ 1659528 1675466 1691170 1706915 1722836 1739120 1756246 1774429 1793049 1811369 1829689 1848966
57324A848966K0392K0790K1005K1945K3060K3096K2206K1801K2420K3214K3578
$$ 1848966 1869358 1890148 1911153 1933098 1956158 1979254 2001460 2023261 2045681 2068895 2092473
57313B092473K3873K4322K4535K4490K4771K5440K5823K5768K6030K6930K7827
$$ 2092473 2116346 2140668 2165203 2189693 2214464 2239904 2265727 2291495 2317525 2344455 2372282
57302B372282K8369K9032K9863K9911K8826K7868K8251K9371K9870K9727L0007
$$ 2372282 2400651 2429683 2459546 2489457 2518283 2546151 2574402 2603773 2633643 2663370 2693377
57291B693377L0979L1792L1953L1953L2347L3052L3810L4654L5689L6861L8032
$$ 2693377 2724356 2756148 2788101 2820054 2852401 2885453 2919263 2953917 2989606 3026467 3064499
57280C064499L9010L9551L9635L9681M0148M1043M2060M3059M4005M4697M4994
$$ 3064499 3103509 3143060 3182695 3222376 3262524 3303567 3345627 3388686 3432691 3477388 3522382
57269C522382M5254M6003M7192M8181M8572M8739M9411N0826N2457N3487N3586
$$ 3522382 3567636 3613639 3660831 3709012 3757584 3806323 3855734 3906560 3959017 4012504 4066090
57258D066090N3302N3568N4872N6896N9003O0835O2504O4381O6729O9255P1109
$$ 4066090 4119392 4172960 4227832 4284728 4343731 4404566 4467070 4531451 4598180 4667435 4738544
57247D738544P1702P1532P1727P2724P3840P4371P4525P5010P6094P7480P8768
$$ 4738544 4810246 4881778 4953505 5026229 5100069 5174440 5248965 5323975 5400069 5477549 5556317
57236E556317P9704Q0225Q0610Q1329Q2471Q3544Q4162Q4643Q5616Q7238Q9174
$$ 5556317 5636021 5716246 5796856 5878185 5960656 6044200 6128362 6213005 6298621 6385859 6475033
57225F475033R1180R3338R5674R7808R9058R8933R7578R5749R4095R2527R0512
$$ 6475033 6566213 6659551 6755225 6853033 6952091 7051024 7148602 7244351 7338446 7430973 7521485
57214G521485Q7917Q5209Q2698Q0046P6783P3155P0256O9271P0513P3053P5603
$$ 7521485 7609402 7694611 7777309 7857355 7934138 8007293 8077549 8146820 8217333 8290386 8365989
57203H365989P7836Q0414Q3391Q5378Q5055Q2972Q0708P8646P5934P2502O9531
$$ 8365989 8443825 8524239 8607630 8693008 8778063 8861035 8941743 9020389 9096323 9168825 9238356
57192I238356O7605O5843O3480O0995N9035N7436N6168N5985N7156N8612N9383
$$ 9238356 9305961 9371804 9435284 9496279 9555314 9612750 9668918 9724903 9782059 9840671 9900054
57181I900054N9953O1076O2260O2694O2759O3230O3687O3269O2495O2686O3946
$$ 9900054 9960007 10021083 10083343 10146037 10208796 10272026 10335713 10398982 10461477 10524163 10588109
57170A0588109O5211O6241O7913P0403P2531P3236P2497P0489O6987O2055N6407
$$ 10588109 10653320 10719561 10787474 10857877 10930408 11003644 11076141 11146630 11213617 11275672 11332079
57159A1332079N0505M4091L6953K9537K2408J5608Q762J522o143j3739k0559k6702
$$ 11332079 11382584 11426675 11463628 11493165 11515573 11531181 11539943 11541465 11535322 11521583 11501024 11474322
57147A1474322l3468m2117n2473o3272p3406q2099q8417r1601r1520q7996q0343
$$ 11474322 11440854 11398737 11346264 11282992 11209586 11127487 11039070 10947469 10855949 10767953 10687610
57136A0687610o8690n5098m2063l0421k0196j2794j0358j3034j8798k5967l4033
$$ 10687610 10618920 10563822 10521759 10491338 10471142 10458348 10447990 10434956 10416158 10390191 10356158
57125A0356158m1963m7821n0696n1386n0705m8792m6308m4430m3037m0510l5925
$$ 10356158 10314195 10266374 10215678 10164292 10113587 10064795 10018487 9974057 9931020 9890510 9854585
57114I854585k9792k2282j2607m76J3776L0967N2768P9168J08601J41199J79408
$$ 9854585 9824793 9802511 9789904 9789428 9803204 9834171 9886939 9966107 10074708 10215907 10395315
57103A0395315K24585K75826L33260L99691M77894N69386O77251Q06812R61835
$$ 10395315 10619900 10895726 11228986 11628677 12106571 12675957 13353208 14160020 15121855
57094A5121855J143420J354016J597913J875261K180054K506625K852716L212798
$$ 15121855 16265275 17619291 19217204 21092465 23272519 25779144 28631860 31844658
57086C1844658L574703L927560M265992M581241M857783N084747N248805N285789
$$ 31844658 35419361 39346921 43612913 48194154 53051937 58136684 63385489 68671278
57078F8671278N047642M367528L199841J696224J25502j286310k443624l346565
$$ 68671278 73718920 78086448 81286289 82982513 83108015 81821705 79378081 76031516
57070G6031516m016155m465722m716776m810954m798627m720299m596586m429602
$$ 76031516 72015361 67549639 62832863 58021909 53223282 48502983 43906397 39476795
57062C9476795m213379l946756l638663l303538k955876k609992k280098j976765
$$ 39476795 35263416 31316660 27677997 24374459 21418583 18808591 16528493 14551728
57054A4551728j704546j464556j257124j080654r30848q03505o96503o07550n32393
$$ 14551728 12847182 11382626 10125502 9044848 8114000 7310495 6613992 6006442 5474049
57045E474049m67244m11102l63718l23162k87324k56090k29829k07205j86465
$$ 5474049 5006805 4595703 4231985 3908823 3621499 3365409 3135580 2928375 2741910
57036B741910j67691j51689j37790j24676j12401j01696r2084q2595p3544o5842
$$ 2741910 2574219 2422530 2284740 2160064 2047663 1945967 1853883 1771288 1697744 1631902
57026A631902n9072n1928m4053l5931k7584j8899j0568l084M761J4646K6285L7586
$$ 1631902 1572830 1520902 1476849 1440918 1413334 1394435 1383867 1380783 1385544 1400190 1426475 1464061
57014A464061M6746N2443N2307M3465K5464J687k2584m3005n7524o6353p1054
$$ 1464061 1510807 1563250 1615557 1659022 1684486 1686173 1663589 1620584 1563060 1496707 1425653
57003A425653p3015p2586o9833o5505o0458n4716m8046m1103l4921k9667k4888
$$ 1425653 1352638 1280052 1210219 1144714 1084256 1029540 981494 940391 905470 875803 850915
56992H50915k0690j7579j5333j3134j0684q296o108m055k397j329m78K72j30k851
$$ 850915 830225 812646 797313 784179 773495 765199 759091 755036 752639 751310 750832 751104 750974 748123
56978G48123p494j2547j7180k1294k4268k5205k4454k3369k2412k0824j8391j6110
$$ 748123 740629 728082 710902 689608 665340 640135 615681 592312 569900 549076 530685 514575
56966E14575j4640j3332j1347q717n785k465J348N310Q933J1849J3605J3783J2356
$$ 514575 499935 486603 475256 466539 460754 458289 459637 464947 473880 485729 499334 513117 525473
56953E25473R358M474k115q707j3212j5362j6654j7995j8697j8056j6502j4636
$$ 525473 534831 539305 537190 528483 515271 499909 483255 465260 446563 428507 412005 397369
56941C97369j2280r181n704k265J162M521P560J0590J4358J8751K2642K5291K6748
$$ 397369 385089 375908 370204 367939 369101 373622 381182 391772 406130 424881 447523 472814 499562
56928D99562K6344K2365J4282M176n119j2527j8373k2668k5038k5819k5873k5538
$$ 499562 525906 548271 562553 566729 561610 549083 530710 508042 483004 457185 431312 405774
56916D05774k4693k3466k1971j9770j6571j3198j0822r491q327o976n896n258
$$ 405774 381081 357615 335644 315874 299303 286105 275283 265792 257465 250489 244593 239335
56904B39335m605l697k861k318j746q11L88J559K545L265L710M097M839O215Q196
$$ 239335 234730 231033 228172 225854 224108 223297 223685 225244 227789 231054 234764 238861 243700 249915 258111
56889B58111J0492J2719J4661J6374J7831J8401J7137J3825R344M801O54l073
$$ 258111 268603 281322 295983 312357 330188 348589 365726 379551 388895 393696 394350 391277
56877C91277o213q503r787r877q608o363m053k137o0K831O284R603J2757J6318
$$ 391277 385064 376561 366774 356897 348289 341926 337873 335736 335676 338507 344791 354394 367151 383469
56863C83469K0530K5012K9426L3801L8041M1229M1626L7579K8852J7179N167n388
$$ 383469 403999 429011 458437 492238 530279 571508 613134 650713 679565 696744 701911 696523
56851F96523j3833j9689k2428k2457k1226j9723j7493j3805q930l548K370R124
$$ 696523 682690 663001 640573 618116 596890 577167 559674 545869 536939 533391 535761 544885
56839E44885J6277K3190L0172L8054M6669N4655O0670O3798O2796N6034M2840
$$ 544885 561162 584352 614524 652578 699247 753902 814572 878370 941166 997200 1040040
56828A040040K4566M156j5131l0825m1863m8570n1881n2562n1176m8330m4435
$$ 1040040 1064606 1068762 1053631 1022806 980943 932373 880492 827930 776754 728424 683989
56817F83989l9376l2901k5225j6859q096Q50R424J7068K3901L0470L6761M1779
$$ 683989 644613 611712 586487 569628 561532 562382 571806 588874 612775 643245 680006 721785
56805G21785M3947M1639L3726K0492M144j2127k5869l6014m2327m4987m4834m3214
$$ 721785 765732 807371 841097 861589 865733 853606 827737 791723 749396 704409 659575 616361
56793F16361m1039l8205l4168k8920k3218j7841j2852p729k198L284Q143J2492
$$ 616361 575322 537117 502949 474029 450811 432970 420118 412389 410191 413475 421618 434110
56781D34110J6761K0514K2285K0783J5892Q375p03r953j7799k3285k6505k8049
$$ 434110 450871 471385 493670 514453 530345 538720 538017 528064 510265 486980 460475 432426
56769D32426k8431k8199k7821k7059k5185k2219j9217j6924j4955j2892j1176
$$ 432426 403995 375796 347975 320916 295731 273512 254295 237371 222416 209524 198348
56758A98348j0087q860o862m883m027l976l598k740k104j761j194n67n66r84q30
$$ 198348 188261 179401 172539 167656 163629 159653 156055 153315 151211 149450 148256 147689 147123 146139 145309
56743A45309J06R62J233J241J112M93m13o93p4N47M47K6o7Ol10r73j360r14L30
$$ 145309 145415 146377 147610 148851 149963 150456 150043 149350 149276 149823 150270 150296 150229 150235 149925 148952 147592 146678 147008
56724A47008J738K499K497K491L046L559L112J925J109J064J186J102J128J379
$$ 147008 148746 151245 153742 156233 159279 162838 165950 167875 168984 170048 171234 172336 173464 174843
56710A74843J382R33M53K46J70J99N71J129J335J107R58J096J139Q76N38J93l40
$$ 174843 176225 177158 177611 177857 178027 178226 178797 179926 181261 182368 183326 184422 185561 186437 186975 187168 186828
56693A86828r02j056q89r30j162j027m89k29n42r68j198j372j383q11J45P14P51
$$ 186828 185926 184870 183981 183051 181889 180862 180373 180144 179602 178634 177436 176064 174681 173870 174015 174729 175480
56676A75480Q87J248J168N03O2K74N32M14L91P50Q77M12O2N05J317J848K219K710
$$ 175480 176367 177615 178783 179286 179348 179622 180154 180568 180959 181709 182586 182998 183060 183565 184882 186730 188949 191659
56658A91659K923K462J786J522J581J634J869K516L223L610L813L870L251J749
$$ 191659 194582 197044 198830 200352 201933 203567 205436 207952 211175 214785 218598 222468 225719 227468
56644B27468J92n05m72l36j41M04J087J392J200P27J27l77m56k42l85j194k211
$$ 227468 227660 227155 226683 226347 226206 226610 227697 229089 230289 231016 231143 230766 230310 230068 229683 228489 226278
56627B26278l000l599l896l452k458j819j812j672j147j243k491l703l579k524
$$ 226278 223278 219679 215783 212331 209873 208054 206242 204570 203423 202180 199689 195986 192407 189883
56613A89883j622q49L00J227R59q5n96l84m70j285k096k240j807j095l10K70N84
$$ 189883 188261 187412 187712 188939 189898 189813 189217 188833 188363 187078 184982 182742 180935 179840 179530 179800 180384
56596A80384J047J756J927R79l25q18n30k52j9O40J399J397P06K27L00N66J031
$$ 180384 181431 183187 185114 186093 185768 184950 184420 184168 184149 184789 186188 187585 188291 188518 188818 189384 190415
56579A90415J943K754K595J845J899L143M395M554L810K959K592L032M104M901
$$ 190415 192358 195112 197707 199552 201451 204594 208989 213543 217353 220312 222904 225936 230040 234941
56565B34941M833M821O312R090J1399J2391J3045J4289J5605J6070J5564J4270
$$ 234941 239774 244595 250907 259997 271396 283787 296832 311121 326726 342796 358360 372630
56553C72630J2053R068O159L977K422J302P33M32l95j950l369l945l988m027m048
$$ 372630 384683 393751 399910 403887 406309 407611 408344 408776 408381 406431 403062 399117 395129 391102 387054
56538C87054m047m454n265n652n209m826n419o499o938o616o332o405o445o312
$$ 387054 383007 378553 373288 367636 362427 357601 352182 345683 338745 332129 325797 319392 312947 306635
56524C06635o316o414o046n029l972l506l490l337k890k634l009l674l789l070
$$ 306635 300319 293905 287859 282830 278858 275352 271862 268525 265635 263001 259992 256318 252529 249459
56510B49459k213j959k030j639q89p77j691k645k577j735j141j066q83l14L3l98
$$ 249459 247246 245287 243257 241618 240729 239952 238261 235616 233039 231304 230163 229097 228214 227900 227933 227535
56494B27535j180j442j074q15j087j346r31j31K16kp0L41O89N29K32K68M74N50
$$ 227535 226355 224913 223839 223024 221937 220591 219660 219529 219745 219743 219673 220014 220703 221232 221464 221732 222206 222756
56476B22756O49Q40O94J22k9Q95K152K579K250K097K225J857Q43J4q9J62K72J27
$$ 222756 223405 224245 224939 225061 225032 225927 228079 230658 232908 235005 237230 239087 239930 239944 239855 240017 240289 240416
56458B40416l39j099j598j247l79J97M83J081J742J436Q9j024j029m21J11O54
$$ 240416 240077 238978 237380 236133 235754 235951 236434 237515 239257 240693 240782 239758 238729 238308 238419 239073
56442B39073J243J274N55k9K50P74N28l86j060j101q20m75q6K08K55K06K48K24
$$ 239073 240316 241590 242145 242116 242366 243140 243668 243282 242222 241121 240301 239826 239740 239948 240203 240409 240657 240881
56424B40881r3n14o07k08M54R96J074O09r7n95o88l68L98J413J987J573O08P9
$$ 240881 240788 240274 239667 239459 239913 240909 241983 242592 242495 241900 241212 240844 241242 242655 244642 246215 246823 246902
56406B46902K93P36J074J450J746J490O97N9K1L66Q39J457K075K363K392K463
$$ 246902 247195 247931 249005 250455 252201 253691 254388 254447 254468 254834 255673 257130 259205 261568 263960 266423
56390B66423K397J850J291J559K389K553J736R37P68O41J77JL86M37m09j253j107
$$ 266423 268820 270670 271961 273520 275909 278462 280198 281135 281903 282544 282721 282722 283108 283545 283136 281883 280776
56373B80776l90JK03P52J279J058L57J2J72M10P65J486K182K189J652J293J302
$$ 280776 280386 280387 280590 281342 282621 283679 284036 284048 284220 284630 285395 286881 289063 291252 292904 294197 295499
56356B95499J258J012Q40Q03O12J08o15j365j765j324q7J129J630J613J644J848
$$ 295499 296757 297769 298609 299412 300024 300132 299517 298152 296387 295063 294976 296105 297735 299348 300992 302840
56340C02840K046K250K447K388K099K105K636L169L326L560M221M652M076K943
$$ 302840 304886 307136 309583 311971 314070 316175 318811 321980 325306 328866 333087 337739 341815 344758
56326C44758K393K734L285L564L719L875L752L047J757J75j193j922k139k388
$$ 344758 347151 349885 353170 356734 360453 364328 368080 371127 372884 373059 371866 369944 367805 365417
56312C65417k839l063k805k320j728p86L74J096J265J629K511L178L188L276L996
$$ 365417 362578 359515 356710 354390 352662 351876 352250 353346 354611 356240 358751 361929 365117 368393 372389
56297C72389M510L906K845K602L114L398L348L633M110L897K971K395K710L293
$$ 372389 376899 380805 383650 386252 389366 392764 396112 399745 403855 407752 410723 413118 415828 419121
56283D19121L543L716M249N044N751O203O367O271O064N772N242M648M749N966
$$ 419121 422664 426380 430629 435673 441424 447627 453994 460265 466329 472101 477343 481991 486740 492706
56269D92706P545Q314Q080P687P860Q639R779J1063J2229J3133J3947J4951J6309
$$ 492706 500251 508565 516645 524332 532192 540831 550610 561673 573902 587035 600982 615933 632242
56256F32242J8215K0832K3781K6378K8711L1778L6021M0479M4096M7098N0253
$$ 632242 650457 671289 695070 721448 750159 781937 817958 858437 902533 949631 999884
56245I99884N3500N6297N8669O0953O2903O4052O4459O4224O2691N9197N4127
$$ 999884 1053384 1109681 1168350 1229303 1292206 1356258 1420717 1484941 1547632 1606829 1660956
56234A660956M8204M1209L2493K2498J2566L423n192j3469k1110k7936l4127l9802
$$ 1660956 1709160 1750369 1782862 1805360 1817926 1821349 1816157 1802688 1781578 1753642 1719515 1679713
56222A679713m4818m8842n1346n1999n1456n1043n1105n0585m8779m6480m4500
$$ 1679713 1634895 1586053 1534707 1482708 1431252 1380209 1329104 1278519 1229740 1183260 1138760
56211A138760m2258l9082l5858l3867l2830l1571k9916k8344k6499k3734k0667
$$ 1138760 1096502 1057420 1021562 987695 954865 923294 893378 865034 838535 814801 794134
56200G94134j8485j7088j5571j4062j3379j3114j2006j0059q504p652o561n035
$$ 794134 775649 758561 742990 728928 715549 702435 690429 680370 671866 664214 657653 652618
56188F52618m095m126m119l242j866o25L94J213J757K200K596K383J317N34J258
$$ 652618 648523 644397 640278 637036 635170 634545 634939 636152 637909 640109 642705 645088 646405 646939 648197
56173F48197K859L687L562L703M424M817M754N266O652Q030R078J0465J2103J2916
$$ 648197 651056 654743 658305 662008 666432 671249 676003 681269 687921 695951 705029 715494 727597 740513
56159G40513J2815J3221J4896J6830J8078J9105K0607K2346K3994K5893K8268
$$ 740513 753328 766549 781445 798275 816353 835458 856065 878411 902405 928298 956566
56148I56566L0832L3699L7577M2585M8086N4072O1428P0385Q0064R0031J00880
$$ 956566 987398 1021097 1058674 1101259 1149345 1203417 1264845 1335230 1415294 1505325 1606205
56137A606205J12699J24485J35631J46477J56463J63145J64118J59010J48963
$$ 1606205 1718904 1843389 1979020 2125497 2281960 2445105 2609223 2768233 2917196
56128B917196J35460J20528J06782R5823Q7082P8856O9739N8647M4535K7330Q687
$$ 2917196 3052656 3173184 3279966 3375789 3462871 3541727 3611466 3670113 3714648 3741978 3750665
56117C750665q830k3316l4416m3490n3033o5111p9992r6657j14104j31188j45676
$$ 3750665 3741835 3718519 3684103 3640613 3587580 3522469 3442477 3345820 3231716 3100528 2954852
56106B954852j55146j58980j58244j53736j45582j34718j22964j11225r9082q6476
$$ 2954852 2799706 2640726 2482482 2328746 2183164 2048446 1925482 1814257 1715175 1628699
56096A628699p4381o3511n3668m4718l6889l0008k3708j8432j4769j1877q315
$$ 1628699 1554318 1490807 1437139 1392421 1355532 1325524 1301816 1283384 1268615 1256738 1248423
56085A248423m338j594m64L21J320J769J676K363M325O419P718Q476Q973R232
$$ 1248423 1244085 1242491 1242027 1242348 1243668 1245437 1247113 1249476 1253801 1260220 1267938 1276414 1285387 1294619
56071A294619J0070J2332J4906J5770J5215J5547J7258J8221J7470J6860J7890
$$ 1294619 1304689 1317021 1331927 1347697 1362912 1378459 1395717 1413938 1431408 1448268 1466158
56060A466158J9523K0431K0954K1494K1247K0035J9193J9297J9059J7770J6776
$$ 1466158 1485681 1506112 1527066 1548560 1569807 1589842 1609035 1628332 1647391 1665161 1681937
56049A681937J7174J8038J8246J8166J8412J8840J9712K1719K4053K4761K3985
$$ 1681937 1699111 1717149 1735395 1753561 1771973 1790813 1810525 1832244 1856297 1881058 1905043
56038A905043K4309K6840K9643L1200L2608L4969L7408L9297M1767M5353M8761
$$ 1905043 1929352 1956192 1985835 2017035 2049643 2084612 2122020 2161317 2203084 2248437 2297198
56027B297198N1442N4685N8657O1361O2250O3735O7199P0597P2198P3592P6599
$$ 2297198 2348640 2403325 2461982 2523343 2585593 2649328 2716527 2787124 2859322 2932914 3009513
56016C009513Q0068Q2332Q4234Q7270R1078R5017R9724J05144J09615J12895J17207
$$ 3009513 3089581 3171913 3256147 3343417 3434495 3529512 3629236 3734380 3843995 3956890 4074097
56005D074097J23471J29559J34180J39120J45616J52185J58242J66012J76365
$$ 4074097 4197568 4327127 4461307 4600427 4746043 4898228 5056470 5222482 5398847
55996E398847J86773J96044K06913K20987K35457K48092K61192K77215K94706
$$ 5398847 5585620 5781664 5988577 6209564 6445021 6693113 6954305 7231520 7526226
55987G526226L12112L31252L53478L76889M01074M29792M65013N03338N42437
$$ 7526226 7838338 8169590 8523068 8899957 9301031 9730823 10195836 10699174 11241611
55978A1241611N85737O36384O92342P52364Q20957R02091R94051J096213J214714
$$ 11241611 11827348 12463732 13156074 13908438 14729395 15631486 16625537 17721750 18936464
55969A8936464J355411J517675J701444J913890K162446K448393K774392L151562
$$ 18936464 20291875 21809550 23510994 25424884 27587330 30035723 32810115 35961677
55961C5961677L593353M112602M733606N498346O451409P624945R040742J0710956
$$ 35961677 39555030 43667632 48401238 53899584 60350993 67975938 77016680 87727636
55953H7727636J2628582J4773002J7131768J9698338K2448035K5337681K8272519
$$ 87727636 100356218 115129220 132260988 151959326 174407361 199745042 228017561
55946B28017561L0894990L2280942L0997459K5843555J6845074N573594n619456
$$ 228017561 258912551 291193493 322190952 348034507 364879581 370453175 364833719
55939C64833719j4820169k1241158k5068513k6920554k7432340k7076404k6114854
$$ 364833719 350013550 328772392 303703879 276783325 249350985 222274581 196159727
55932A96159727k4644631k2721189k0460808j8037225j5618608j3333626j1272076
$$ 196159727 171515096 148793907 128333099 110295874 94677266 81343640 70071564
55925G0071564r480113p955992o671591n600107m717845l993589l394562k899163
$$ 70071564 60591451 52635459 45963868 40363761 35645916 31652327 28257765 25358602
55917B5358602k492836k157306j874513j635844j437370j270516j125772j000626
$$ 25358602 22865766 20708460 18833947 17198103 15760733 14490217 13364445 12363819
55909A2363819q95328q05147p24320o53144n93652n42454m94790m51555m15426
$$ 12363819 11468491 10663344 9939024 9285880 8692228 8149774 7654984 7203429 6788003
55900F788003l83973l53247l24411l00349k79112k57247k36344k19981k06933
$$ 6788003 6404030 6050783 5726372 5426023 5146911 4889664 4653320 4433339 4226406
55891D226406j93454j79717j68240j58360j47886j37885j30416j23608j14412
$$ 4226406 4032952 3853235 3684995 3526635 3378749 3240864 3110448 2986840 2872428
55882B872428j04246r6670r1200q4603p6775p0251o5132n9421n3371m8957m5758
$$ 2872428 2768182 2671512 2580312 2495709 2418934 2348683 2283551 2224130 2170759 2121802 2076044
55871B076044m1766l7634l6047l7416l9815m2502m5939m9080n0155m9702m9658
$$ 2076044 2034278 1996644 1960597 1923181 1883366 1840864 1794925 1745845 1695690 1645988 1596330
55860A596330n0064m9558m8184m6741m4356l9809l4412l0552k8233k5997k4239
$$ 1596330 1546266 1496708 1448524 1401783 1357427 1317618 1283206 1252654 1224421 1198424 1174185
55849A174185k4447k5958k6645k6340k6597k7600k8080k7788k7444k6709k4778
$$ 1174185 1149738 1123780 1097135 1070795 1044198 1016598 988518 960730 933286 906577 881799
55838H81799k2439k1091k0320j8787j6746j5241j3845j1696r834r720j0316r516
$$ 881799 859360 838269 817949 799162 782416 767175 753330 741634 731800 722080 711764 702248
55826G02248p697o972p545p875p820q584r778r728q592q220q865q871p798o970
$$ 702248 694551 687579 680034 672159 664339 655755 645977 636249 627657 619437 610572 601701 593903 586933
55812E86933o675n616l560j938j222k37J431K669L094L755M976N721N756O252
$$ 586933 580258 574642 571082 569144 567922 567685 569116 571785 574879 578634 583610 589331 595087 601339
55798F01339P411P557N587K539k16k683n323p911j0156j2215j3802j4078j3086
$$ 601339 608750 616307 621894 624433 624217 621534 616211 608300 598144 585929 572127 558049 544963
55785E44963j2047j1628j1097r772q059o514m999l551k982l882n677p276q082
$$ 544963 532916 521288 510191 500419 492360 485846 480847 477296 474314 470432 464755 457479 449397
55772D49397q055p450o795o500o287n558m342l283k773k698k902l233l374l339
$$ 449397 441342 433892 427097 420597 414310 408752 404410 401127 398354 395656 392754 389521 386147 382808
55758C82808l794n055o198o138n207m627m751m916m779m620m560m523m747n321
$$ 382808 379014 373959 367761 361623 356416 351789 347038 342122 337343 332723 328163 323640 318893 313572
55744C13572n570n021m479m903n682n524m642m400m913m782l400j858j178j085
$$ 313572 308002 302981 298502 293599 287917 282393 277751 273351 268438 263656 260256 258398 257220 256135
55730B56135j029j119j507j908k195k607l038k970k386j900j790j687j375j065
$$ 256135 255106 253987 252480 250572 248377 245770 242732 239762 237376 235476 233686 231999 230624 229559
55716B29559q62o88p93j455k207k232j497o57J3P05J254J335J330J929K862L100
$$ 229559 228697 228009 227216 225761 223554 221322 219825 219168 219181 219886 221140 222475 223805 225734 228596 231696
55700B31696K314J122m7j300k486l153l336l431l257k301q18L52R61J402J712
$$ 231696 234010 235132 235085 233785 231299 228146 224810 221379 218122 215821 215003 215355 216316 217718 219430
55685B19430J725K018L302M922N391M589M004M575N576O024N853N304M300K997
$$ 219430 221155 223173 226475 231397 236788 241377 245381 249956 255532 261556 267409 272713 277013 280010
55671B80010J890J001j55j480k221k222k124k073j414l5J056J133O82M43M30M43
$$ 280010 281900 282901 282746 281266 279045 276823 274699 272626 271212 271177 272233 273366 274048 274491 274921 275364
55655B75364O70J230J787J975J685P68p67k208k714k562k868l983n204o119o997
$$ 275364 276034 277264 279051 281026 282711 283479 282712 280504 277790 275228 272360 268377 263173 257054 250057
55640B50057p688p439o277n286n100n181n038m858m501l345j760j285k365l270
$$ 250057 242369 234930 228653 223367 218267 213086 208048 203190 198689 195344 193584 192299 189934 186664
55626A86664k451q16k34p95j106p62p96j727k575k266j068j67k51r70j565j691
$$ 186664 184213 183397 183163 182368 181262 180500 179704 177977 175402 173136 172068 171901 171650 170680 169115 167424
55610A67424j514j163n17K43L92m42j512j861j637j625j739j173m8M71q1p84q89
$$ 167424 165910 164747 164230 164473 164865 164423 162911 161050 159413 157788 156049 154876 154828 155299 155218 154434 153545
55593A53545p99r71j017o51m53p58p59K72J525J581M42m42o4J026J592J099J05
$$ 153545 152746 151775 150758 150107 149654 148896 148137 148409 149934 151515 151957 151515 151451 152477 154069 155168 155273
55576A55273m07KR17J725K314K873L320L478L593L956M191L712K806K296K253
$$ 155273 154866 154868 155785 157510 159824 162697 166017 169495 173088 177044 181235 184947 187753 190049 192302
55561A92302J989J368R87Q76K28j209k506k837k476k169k301k870l473l192j588
$$ 192302 194291 195659 196646 197522 197750 196541 194035 191198 188722 186553 184252 181382 177909 174717 173129
55546A73129J55M11m75n30P93J791J378P93J282J935J431M15K37M73k30j579j906
$$ 173129 173284 173695 173220 172690 173483 175274 176652 177445 178727 180662 182093 182508 182745 183218 182988 181409 179503
55529A79503p86M09N27k35j260k201k670k428k008k225k975l448l395l303l362
$$ 179503 178717 179126 179653 179418 178158 175957 173287 170859 168851 166626 163651 160203 156808 153505 150143
55514A50143l166k564j914j503j383j750k692l570l510k516j425p39k54J60K15
$$ 150143 146977 144413 142499 140996 139613 137863 135171 131601 128091 125575 124150 123411 123157 123317 123532
55499A23532j57n35o51p35r86j119p68l6N64O57M16L93Q22J169O77n53j511j469
$$ 123532 123375 122840 122189 121454 120468 119349 118581 118545 119109 119766 120182 120575 121397 122566 123243 122690 121179 119710
55481A19710p15J20Q35J392J506J130Q23J031J348J093K93m74q89r75p28k40K7
$$ 119710 118995 119115 119950 121342 122848 123978 124801 125832 127180 128273 128566 128092 127203 126228 125500 125260 125287
55464A25287k98r93j602k013k259k097j342l08N28J085J475J621J465J167P81
$$ 125287 124989 123996 122394 120381 118122 116025 114683 114375 114903 115988 117463 119084 120549 121716 122497
55449A22497J68l91k24O26J039L00p17p08K87J114J059L30o21j341j292m02M77
$$ 122497 122665 122274 122050 122676 123715 124015 123298 122590 122877 123991 125050 125380 124759 123418 122126 121724 122201
55432A22201M79j64n91n95n68n89m08j08P2L58R85J455J143L74j6O9J60L19Q79
$$ 122201 122680 122516 121925 121330 120762 120173 119765 119657 119729 120087 121072 122527 123670 124044 124028 124097 124257 124576 125455
55413A25455J329P92l30o10K60Q96L19o41p53k05q4o78j311j464j306j101q02
$$ 125455 126784 127576 127246 126636 126896 127792 128111 127470 126717 126512 126428 125750 124439 122975 121669 120568 119766
55396A19766k84L44Q27J050J096J049Q17L50o4n4J89L7o24j023n24M77J143J223
$$ 119766 119482 119826 120653 121703 122799 123848 124665 125015 124951 124897 125086 125123 124499 123476 122952 123429 124572 125795
55378A25795R95N87N9k62k08k12o32j003p09n6J73l0J1M76Q84R88R57O79j50j221
$$ 125795 126790 127377 127436 127174 126966 126754 126122 125119 124410 124354 124527 124497 124508 124984 125868 126856 127813 128492 128342 127121
55358A27121j772j635j350j190q90m16j26rL89J063J330Q42J26j87m0L19P60J142
$$ 127121 125349 123714 122364 121174 120284 119868 119742 119733 120122 121185 122515 123357 123483 123296 123256 123575 124335 125477
55340A25477J253J054O32o7r82j606j501r89o79n03k5M96M15k2J45R61J310O57
$$ 125477 126730 127784 128416 128349 127367 125761 124260 123271 122592 122089 122064 122560 122975 122953 123098 124059 125369 126026
55322A26026j23j93K2j80m95j82O52J204J053M58j65n41n42l37l86r47j749k285
$$ 126026 125903 125710 125732 125552 125057 124875 125527 126731 127784 128242 128077 127536 126994 126657 126271 125324 123575 121290
55304A21290k191j318J20J361J598Q83J49J36P09J358J762J699R99o1p58o48k2
$$ 121290 119099 117781 117901 119262 120860 121743 121892 122028 122737 124095 125857 127556 128555 128494 127736 127088 127066
55287A27066N86R11R03N93K41J83L84M45J96j32l75o14q39q72o84l71P2N64O99
$$ 127066 127652 128563 129466 130059 130300 130483 130867 131312 131508 131376 131001 130387 129548 128676 127992 127621 127693 128257 128956
55268A28956K89p1J96N47j0j267j904j350m44m0K4J67L49N14Q23J036O38n7L0
$$ 128956 129245 129174 129370 129917 129907 128640 126736 125386 124942 124902 124926 125093 125442 125956 126779 127815 128453 128396 128426
55249A28426J025J549N89j043j862j469m71N47J166J045M36J10K19L0o43p93J59
$$ 128426 129451 131000 131589 130546 128684 127215 126744 127291 128457 129502 129938 130048 130267 130297 129654 128861 129020
55232A29020J155J052L18R2L45K92p7k51l42o26m95N89J637J247q7n90k4j9j306
$$ 129020 130175 131227 131545 131637 131982 132274 132197 131946 131604 130978 130483 131072 132709 133956 133869 133279 133255 133236 131930
55213A31930k456k109q69n2J85L82M60N9l96j27P86J524J687J633J693J701J384
$$ 131930 129474 127365 126496 126444 126629 127011 127471 127530 127134 127007 127793 129317 131004 132637 134330 136031 137415
55196A37415P27p5p86j143j010n24n4J18Mj33n6J70K81J73L0l8j98n35p18m04
$$ 137415 138142 138067 137281 136138 135128 134604 134550 134668 134672 134539 134483 134653 134934 135107 135137 135099 134901 134366 133648 133244
55176A33244J84M96L49J1k88n28o22m43j35N2K34P79J560J844J148j04r91r93
$$ 133244 133428 133924 134273 134284 133996 133468 132846 132403 132268 132320 132554 133333 134893 136737 137885 137781 136790 135797
55158A35797l31L09L48k16p64p02j56K21R3k40m18m79n39m17N6O06Q36Q00Q90
$$ 135797 135466 135775 136123 135907 135143 134441 134285 134506 134599 134359 133941 133462 132923 132506 132562 133168 134004 134804 135694
55139A35694J145J091L93o18j267j194n50K69Q16P16k3p29o11K88J022Q97K55
$$ 135694 136839 137930 138323 137705 136438 135244 134694 134963 135779 136495 136472 135743 135132 135420 136442 137339 137594
55122A37594j77k99m83p28o93m37l63m65l15J08L35K98M60Q14O77p5m61K18J205
$$ 137594 137417 137118 136635 135907 135214 134777 134414 133949 133634 133742 134077 134375 134835 135649 136326 136251 135790 136008 137213
55103A37213J380R43R15J366J360O49K67R90K094K257J221n4o80o76n15k76L32
$$ 137213 138593 139536 140451 141817 143177 143826 144093 145083 147177 149434 150655 150601 149921 149245 148730 148454 148786
55086A48786J193J503O14r57j926j622o44Lo2n75j095j179n85K91N84Ro52o09
$$ 148786 149979 151482 152096 151139 149213 147591 146947 146950 146888 146313 145218 144039 143454 143745 144329 144338 143686 143077
55068A43077j44q6n61r32p95l12L09R23J096L68r37j783j493m37M95P56M22n9
$$ 143077 142933 142847 142286 141354 140559 140247 140556 141479 142575 142943 142006 140223 138730 138293 138788 139544 139966 139907
55050A39907k15J00N99Q93Q51N58J60r5R8O37Q99M81j10o3O39J170Q94L3p17q59
$$ 139907 139692 139792 140391 141284 142135 142693 142853 142758 142856 143493 144392 144873 144763 144700 145339 146509 147403 147436 146719 145860
55030A45860m68o4j20m89n06J06Q29J119J087J015O87r6p79o19K04Q04P26J98
$$ 145860 145392 145328 145208 144719 144213 144319 145148 146267 147354 148369 149056 148960 148181 147562 147766 148570 149296 149494
55012A49494n06j185j357p24P6J06m78o09J30J024J470J641J655J145J73m31j93
$$ 149494 148988 147803 146446 145722 145798 145904 145426 144817 144947 145971 147441 149082 150737 151882 152055 151624 151431
54995A51431L34N64P84J375J881J730J294J339J733J656Q72pm67o26p27p34n38
$$ 151431 151765 152329 153113 154488 156369 158099 159393 160732 162465 164121 164993 164986 164519 163893 163166 162432 161894
54978A61894j47L49P69Q16M08k3L7N16Q41P21M48M03N49N97M12Q8k34m65m69m4
$$ 161894 161747 162096 162865 163681 164089 164066 164103 164619 165460 166181 166629 167032 167581 168178 168590 168678 168444 167979 167510 167466
54958A67466P44J330J033l8p36m9J575K597K118P33n01j251j693j721j125k89
$$ 167466 168210 169540 170573 170535 169799 169750 171325 173922 176040 176773 176272 175021 173328 171607 170482 170193
54942A70193Q6q8j30M43J312J862J930J741J429R61M68L67J000K179L164L211
$$ 170193 170279 170191 170061 170504 171816 173678 175608 177349 178778 179739 180207 180574 181574 183753 186917 190128
54926A90128K299J333J415K829M762O171O768O985P106O872O056M979M060L105
$$ 190128 192427 193760 195175 198004 202766 208937 215705 222690 229796 236668 242724 247703 251763 254868
54912B54868J600l59k011k923l560m557n868o927p332o995n978m593l447k919
$$ 254868 256468 256109 254098 251175 247615 243058 237190 230263 222931 215936 209958 205365 201918 198999
54898A98999k758k525k168j842j441q27k75j37k23p8K17J57l21o58l77N02J805
$$ 198999 196241 193716 191548 189706 188265 187438 187163 187026 186803 186725 186942 187099 186778 186120 185743 186245 188050
54881A88050L376M877N924O514O879O938O436N604N066M996M885M289L191J575
$$ 188050 191426 196303 202227 208741 215620 222558 228994 234598 239664 244660 249545 253834 257025 258600
54867B58600o38l088n037o163o770o998o590n672n014n013n064m476l464k713
$$ 258600 257962 254874 249837 243674 236904 229906 223316 217644 212630 207617 202553 198077 194613 191900
54853A91900k441k436k541k595k285j657j345j718k189j990j318r91j269j697
$$ 191900 189459 187023 184482 181887 179602 177945 176600 174882 172693 170703 169385 168394 167125 165428
54839A65428j949k098k080j661r71m65k66k9M32Q36R02O78L09j09l54j09N79J230
$$ 165428 163479 161381 159301 157640 156669 156204 155938 155909 156341 157177 158079 158757 159066 158957 158603 158494 159073 160303
54821A60303J490J450J255P28l17j534k206j974j243p31o92p07k35P45J651J899
$$ 160303 161793 163243 164498 165226 164909 163375 161169 159195 157952 157221 156529 155822 155587 156332 157983 159882
54805A59882J438P34L56N29R99J249R94M30j1p8K34Q36J473J705J355Q52P62R59
$$ 159882 161320 162054 162410 162939 163938 165187 166181 166611 166600 166522 166756 167592 169065 170770 172125 172977 173739 174698
54787A74698P97J09m03o0R64J871K002J280K76m5Q69K390L200K786J996J887K573
$$ 174698 175495 175604 175201 175141 176105 177976 179978 181258 181534 181489 182358 184748 187948 190734 192730 194617 197190
54770A97190L516M405N208N856O396P099P889Q059P136N685M653M151L526K424
$$ 197190 200706 205111 210319 216175 222571 229670 237559 245618 252754 258439 263092 267243 270769 273193
54756B73193J089k82j785l396m831n910o636o894o585n980n512n227m875m476
$$ 273193 274282 274000 272215 268819 263988 258078 251442 244548 237963 231983 226471 221244 216369 211893
54742B11893m302m266l881k927j722o57R1L81J44k16n9O91J424J788K225L169
$$ 211893 207591 203325 199444 196517 194795 194138 194229 194610 194754 194538 194479 195170 196594 198382 200607 203776
54726B03776M202M578M376M475N305O191O259N599N095N140N056L983J985j42
$$ 203776 207978 212556 216932 221407 226712 232903 239162 244761 249856 254996 260052 264035 266020 265878
54712B65878j917l512n053o202o644o587o416o210n879n481n038m319l190j965
$$ 265878 263961 260449 255396 249194 242550 235963 229547 223337 217458 211977 206939 202620 199430 197465
54698A97465j054n38m02q15j659k181j805j049q49j113q49J08N51m35j986k441
$$ 197465 196411 195873 195471 194656 192997 190816 189011 187962 187113 186000 185151 185259 185810 185375 183389 180948
54682A80948j370L9N42J04n01p33o63n59n13m72m20l83k91l0L88P64Q82O87K80
$$ 180948 179578 179617 180159 180263 179762 179029 178366 177807 177294 176822 176402 176019 175728 175698 176086 176850 177732 178419 178699
54663A78699j88n84q17q59p22m47j97j91l34j27P24J680J872J241O11M71L30l18
$$ 178699 178511 177927 177110 176251 175529 175082 174885 174694 174360 174233 174957 176637 178509 179750 180361 180832 181162 180844
54645A80844j021r70k22L74K72k58o42n63l4N68O63M0p79j074p00m8N50R38R16
$$ 180844 179823 178853 178631 179005 179277 179019 178377 177814 177780 178348 179011 179051 178272 177198 176498 176450 177000 177938 178854
54626A78854L98k40m90k84LL1l30j019j550j163J67J298J131P7n73m59l98q33
$$ 178854 179252 179012 178522 178238 178241 178272 177942 176923 175373 174210 174377 175675 176806 176883 176310 175851 175453 174620
54608A74620j165q72k85J45N19R35R83M59p8k2M38P67R97J518K221K475J877P05
$$ 174620 173455 172583 172298 172443 172962 173897 174880 175339 175261 175239 175677 176444 177441 178959 181180 183655 185532 186237
54590A86237l86q35m97K71R11J136J024O55O5m35l74J54L99j13r08j209r35n93
$$ 186237 185851 185016 184519 184790 185701 186837 187861 188516 188581 188146 187772 187926 188325 188212 187304 186095 185160 184567
54572A84567m77m08j97Q0K85L73L42K17J01Q8J90M02P32J078J225J068P08K93
$$ 184567 184090 183682 183485 183565 183850 184223 184565 184782 184883 184971 185161 185563 186295 187373 188598 189666 190374 190667
54554A90667n9k17q8K17M87O61P37N74J42q4M53J549K310K207J586J029P29O92
$$ 190667 190608 190391 190303 190520 191007 191668 192405 192979 193121 193037 193490 195039 197349 199556 201142 202171 202900 203592
54536B03592R24J135Q92L61L29J045J662J406P48O68J243J687J555J083M94k15
$$ 203592 204516 205651 206543 206904 207233 208278 209940 211346 212094 212762 214005 215692 217247 218330 218824 218609
54520B18609q16r26o85p15j215j692j704j437j287j291j217r45m53K50R33J129
$$ 218609 217793 216867 216182 215467 214252 212560 210856 209419 208132 206841 205624 204679 204226 204476 205409 206538
54504B06538O10j92n20j06N78Q31M79n7k74j04J74L02J95j21m84n73k42K17M26
$$ 206538 207148 206956 206436 206330 206908 207739 208218 208161 207887 207783 207957 208259 208454 208333 207849 207276 207034 207251 207677
54485B07677N02Q54J387J429O79k50n33%R00J671J962J618Q99L56K29K70M03R59
$$ 207677 208179 209033 210420 211849 212528 212278 211745 211745 212645 214316 216278 217896 218795 219151 219380 219650 220053 221012
54467B21012J860K227J549O98Q30J631J720P13k24r8O17Q86N25R0r2j65k48k64
$$ 221012 222872 225099 226648 227346 228176 229807 231527 232240 232016 231918 232535 233421 233946 234036 233944 233779 233531 233267
54449B33267j53M2K58L77K84Q3P5L47O30O45M06M3l77o79n90j27J85j14q63j440
$$ 233267 233114 233156 233414 233791 234075 234158 234233 234580 235210 235855 236261 236304 235927 235248 234658 234531 234716 234602 233739 232299
54429B32299j445j002m87j74n7O5L82P95R84P89M17J98K43L90L64l9p80j484j696
$$ 232299 230854 229852 229365 229191 229134 229199 229581 230376 231360 232149 232566 232764 233007 233397 233761 233722 232942 231458 229762
54410B29762j342p68k89K6J09j86o78p46m4R23J368J220J071J217J374J364J478
$$ 229762 228420 227652 227363 227389 227498 227312 226634 225888 225844 226767 228135 229355 230426 231643 233017 234381 235859
54393B35859J852K032J545N93k32o62p33m04K88Q65Q49M80L54L69j75j243j719
$$ 235859 237711 239743 241288 241881 241649 240987 240254 239850 240138 241003 241852 242332 242686 243055 242880 241637 239918
54376B39918r94j08m80j931k896k465j212k8R37J779K167J754Q79K70K51N88Q99
$$ 239918 238924 238816 238336 236405 233509 231044 229832 229804 230741 232520 234687 236441 237320 237590 237841 238429 239328
54359B39328R56P27M27L58N62P80Q01O42L23j36m25r3P83J524J658J420J143O92
$$ 239328 240284 241011 241438 241796 242358 243138 243939 244581 244904 244768 244343 244250 245033 246557 248215 249635 250778 251470
54341B51470p8p57q49n64m79o63p03n37n93j108j719j924j634j230j219j722k167
$$ 251470 251392 250635 249786 249222 248743 248080 247377 246840 246247 245139 243420 241496 239862 238632 237413 235691 233524
54324B33524j729l85P98Q29m0q23j128j304j482j235l40Q26J745K160J919J035
$$ 233524 231795 231410 232208 233037 232997 232174 231046 229742 228260 227025 226685 227511 229256 231416 233335 234370
54308B34370k9p00r96j393j846j718q64j39l01r63j160n69L23R49J075P06O7m25
$$ 234370 234341 233641 232645 231252 229406 227688 226824 226685 226384 225421 224261 223692 224015 224964 226039 226745 226812 226387
54290B26387n49n64p63r33o23Q9N79M55Ok99m24o18q40o80rO19M98k87q35m80
$$ 226387 225838 225274 224511 223578 222955 223044 223623 224078 224084 223785 223361 222743 221903 221223 221214 221833 222331 222044 221209 220729
54270B20729M56J207J518J677J827J732J265N82j95j003j523j303l82N92J073
$$ 220729 221185 222392 223910 225587 227414 229146 230411 230993 230798 229795 228272 226969 226587 227179 228252
54255B28252J081Q66N09J09m8J71N07O43N79M68L53K52K56L28K66ql56p40j258
$$ 228252 229333 230199 230708 230817 230769 230940 231447 232090 232669 233137 233490 233742 233998 234326 234592 234584 234228 233488 232230
54236B32230j704j593r18m33p08j261j158k72O05P65K37n40j177j412j105l39
$$ 232230 230526 228933 228015 227582 226874 225613 224455 224183 224788 225553 225790 225250 224073 222661 221556 221217
54220B21217O16J495K056K060J466O37J07P9K61J88k82q20r37n90l91r20j867
$$ 221217 221833 223328 225384 227444 228910 229547 229654 229733 229994 230182 229900 229080 228143 227553 227162 226242 224375
54203B24375k253j653o51L3L89P44J064J161J176J307J306R28N72Q07J378J369
$$ 224375 222122 220469 219818 219851 220240 220984 222048 223209 224385 225692 226998 227926 228498 229305 230683 232052
54187B32052M38p99j648j982j879j267k54P00J249J423J223M08r61k195k616k301
$$ 232052 232490 231691 230043 228061 226182 224915 224661 225361 226610 228033 229256 229664 228703 226508 223892 221591
54171B21591j800j338p25K7N03M25M4j58n9P5L6q6j42k38m72n84k19L79M60k66
$$ 221591 219791 218453 217728 217755 218258 218683 218727 218569 218510 218585 218621 218535 218393 218155 217683 217099 216880 217259 217719 217453
54151B17453j099j210o51o6K89O34R47Q77L86o4j37R1N49J303K095K344J809Q99
$$ 217453 216354 215144 214493 214427 214716 215350 216297 217174 217560 217496 217359 217450 217999 219302 221397 223741 225550 226449
54133B26449O9n82j028j124r51q02n89R6J058J334N49k96q9Q47J353J099P29O20
$$ 226449 226518 225936 224908 223784 222833 222031 221442 221538 222596 223930 224479 224183 224094 224941 226294 227393 228122 228742
54115B28742N39M61P44J289J474J143Q59Q87P22J02l95k84kq0j11N25J333J162
$$ 228742 229281 229742 230486 231775 233249 234392 235251 236138 236860 236962 236567 236283 236281 236201 236090 236615 237948 239110
54097B39110o5j083r36j36K59L2k58k97k80l02o0O47J431J611R51j0m20J24J246
$$ 239110 239045 237962 237026 236890 237149 237181 236923 236626 236346 236044 235984 236631 238062 239673 240624 240614 240194 240318 241564
54078B41564K199K533K359K113K146K472K786K773K479K305K543L056L606M349
$$ 241564 243763 246296 248655 250768 252914 255386 258172 260945 263424 265729 268272 271328 274934 279283
54064B79283N586P052P949P897P500P544P920P736O433M368K226L12j458l105
$$ 279283 284869 291921 299870 307767 315267 322811 330731 338467 344900 349268 351494 351806 350348 347243
54050C47243m456n340n664n352m440l273k471k435k844k831j889m76M97Q85J562
$$ 347243 342787 337447 331783 326431 321991 318718 316247 313812 310968 308137 306248 305772 306269 307154 308716
54035C08716L146M903N444M533L461L535M708N962O578O560O206N850N813O088
$$ 308716 311862 316765 322209 326742 330203 333738 338446 344408 350986 357546 363752 369602 375415 381503
54021C81503O102N282L856K654K108J932J778J605J259K77j407l053l863l903
$$ 381503 387605 392887 396743 399397 401505 403437 405215 406820 408079 408356 406949 403896 400033 396130
54007C96130l848m029m287m532m895n284n336m985m646m647m820m827m609m236
$$ 396130 392282 388253 383966 379434 374539 369255 363919 358934 354288 349641 344821 339994 335385 331149
53993C31149l645k873k257k054j958j464o86l65q69j589j615q16J08O18R14J433
$$ 331149 327504 324631 322374 320320 318362 316898 316212 315847 314978 313389 311774 310958 311066 311684 312598 314031
53977C14031K126K565K621K635K833K935K507J567N99Kk53m83r88j847k897l775
$$ 314031 316157 318722 321343 323978 326811 329746 332253 333820 334419 334421 334168 333685 332697 330850 327953 324178
53961C24178m110l747k883j990j597j880k388k334j403j42O59Q41Q69J123J602
$$ 324178 320068 316321 313438 311448 309851 307971 305583 303249 301846 301704 302363 303204 304073 305196 306798
53946C06798K282L262M381N136N238M987M845M946N267N957O978P727P454O134
$$ 306798 309080 312342 316723 321859 327097 332084 336929 341875 347142 353099 360077 367804 375258 381392
53932C81392M536L389K824K585K429K259K130K238K702L346L843M123M383M697
$$ 381392 385928 389317 392141 394726 397155 399414 401544 403782 406484 409830 413673 417796 422179 426876
53918D26876M924N089N545O586Q100R660J0842J1375J1293J1089J1471J2678J4219
$$ 426876 431800 436889 442434 449020 457120 466780 477622 488997 500290 511379 522850 535528 549747
53905E49747J5377J5892J5952J5744J5267J4398J2845J0130O004R62l928p829
$$ 549747 565124 581016 596968 612712 627979 642377 655222 665352 671356 672318 668390 660561
53893F60561j0633j2584j3719j4051j4059j4530j5590j6343j5887j4556j3580
$$ 660561 649928 637344 623625 609574 595515 580985 565395 549052 533165 518609 505029
53882E05029j3471j3393j2430j0911r911r770r775r214q097o799n593m729m501
$$ 505029 491558 478165 465735 454824 444913 435143 425368 416154 408057 401258 395665 390936 386435
53869C86435m926n631o167o197n475m158l087l146m152m942m763l959l074k077
$$ 386435 381509 375878 369711 363514 358039 353881 350794 347648 343496 338554 333791 329832 326758 324681
53855C24681j008n78j353k686l354k981k205j629j351j350j635j950j987j817
$$ 324681 323673 323095 321742 319056 315702 312721 310516 308887 307536 306186 304551 302601 300614 298797
53841B98797j653j317n37K69L54k49o54l97m5k42p06o42K61J498K216J855O49
$$ 298797 297144 295827 295290 295559 295913 295664 295010 294613 294568 294326 293620 292978 293239 294737 296953 298808 299457
53824B99457m09m51K90P70M16l54r10j112j011n27K57R00J197J499K121K772L016
$$ 299457 299048 298597 298887 299657 300073 299719 298809 297697 296686 296159 296416 297316 298513 300012 302133 304905 307921
53807C07921K943L013L454M184N056N839O183N893N156M272L528L356M212N861
$$ 307921 310864 313877 317331 321515 326571 332410 338593 344486 349642 353914 357442 360798 365010 370871
53793C70871P260P568P035O466O213O104N974N734N111L973K743J990J709J458
$$ 370871 378131 385699 392734 399200 405413 411517 417491 423225 428336 432309 435052 437042 438751 440209
53779D40209J017M02n69k043l556m421m735n338o547p616p750p125o510o224o013
$$ 440209 441226 441628 441059 439016 435460 431039 426304 420966 414419 406803 399053 391928 385418 379194 373181
53764C73181n696n429n274m885l913k578j608j488j942k355k571k899l340l408
$$ 373181 367485 362056 356782 351897 347984 345406 343798 342310 340368 338013 335442 332543 329203 325795
53750C25795k915k399k272k106j373n53o16j553k345k385k098j879j378l19P19
$$ 325795 322880 320481 318209 316103 314730 314177 313561 312008 309663 307278 305180 303301 301923 301604 302323
53735C02323J075J008J233J748J850J209L35q1J78Q48J405J360P00J48N35J828
$$ 302323 303398 304406 305639 307387 309237 310446 310781 310700 310878 311726 313131 314491 315191 315339 315874 317702
53719C17702L049L310K687J975J850K304K689K252R06l72l02J308L171L909L501
$$ 317702 320751 324061 326748 328723 330573 332877 335566 337818 338724 338352 338050 339358 342529 346438 349939
53704C49939K971K864K717K128J622J987L187M451N224N535N622N648N752N921
$$ 349939 352910 355774 358491 360619 362241 364228 367415 371866 377090 382625 388247 393895 399647 405568
53690D05568N795N057M068L501L323K721J331o8n15l2O16Q98P33R4r22j727j688
$$ 405568 411363 416420 420488 423989 427312 430033 431364 431296 430781 430749 431365 432263 432996 433090 432168 430441 428753
53673D28753r72m75p52j437j805j545q33k1N63O89L33l21r77j375j459j510j808
$$ 428753 427781 427306 426554 425117 423312 421767 420934 420913 421476 422165 422498 422177 421200 419825 418366 416856 415048
53656D15048k067j606m17M38Q2q60j014j12P28O37K1k85j49Mj19n35j098j391
$$ 415048 412981 411375 410958 411396 411478 410618 409604 409492 410220 410857 410878 410593 410444 410448 410329 409794 408696 407305
53638D07305r49P7R03J062R94J269J763J993J964K041K298K473K472K413K332
$$ 407305 406356 406433 407336 408398 409392 410661 412424 414417 416381 418422 420720 423193 425665 428078 430410
53623D30410K269K484L137L829L946L496L170L512M349N090N311M964M346L959
$$ 430410 432679 435163 438300 442129 446075 449571 452741 456253 460602 465692 471003 475967 480313 484272
53609D84272M238N154O163O606O245N466M973N131N570N624N127M555M316M273
$$ 484272 488510 493664 499827 506433 512678 518144 523117 528248 533818 539442 544569 549124 553440 557713
53595E57713M099L785L453L052K565K267K361K540K347J877J663J906K187K019
$$ 557713 561812 565597 569050 572102 574667 576934 579295 581835 584182 586059 587722 589628 591815 593834
53581E93834J402P63N34P52R20L89r32k403l387l936m427m838m895m695m624m667
$$ 593834 595236 595999 596533 597285 598205 598594 597662 595259 591872 587936 583509 578671 573776 569081 564457 559790
53565E59790m441l965l757l909l710k621j198n02p87j249j052k10O47J103J301
$$ 559790 555349 551384 547627 543718 540008 537387 536189 535687 534900 533651 532599 532389 533036 534139 535440
53550E35440J582J927J989J625J163J052J376J899K437K904L159L176L274L865
$$ 535440 537022 538949 540938 542563 543726 544778 546154 548053 550490 553394 556553 559729 563003 566868
53536E66868M843N622N889O020O578P664Q877R798J0359J0830J1543J2548J3596
$$ 566868 571711 577333 583222 589242 595820 603484 612361 622159 632518 643348 654891 667439 681035
53523F81035J4523J5508J6702J7780J8286J8285J8346J8809J9600K0682K2140
$$ 681035 695558 711066 727768 745548 763834 782119 800465 819274 838874 859556 881696
53512H81696K3747K5049K6141K7686K9794L1533L2134L2112L2487L3301L3767
$$ 881696 905443 930492 956633 984319 1014113 1045646 1077780 1109892 1142379 1175680 1209447
53501A209447L3644L3553L3822L4020L3894L3973L4688L5446L5241L3967L2479
$$ 1209447 1243091 1276644 1310466 1344486 1378380 1412353 1447041 1482487 1517728 1551695 1584174
53490A584174L1446L0696K9819K8905K8336K8096K7671K6696K5421K4360K3718
$$ 1584174 1615620 1646316 1676135 1705040 1733376 1761472 1789143 1815839 1841260 1865620 1889338
53479A889338K3329K3080K3006K2998K2777K2278K1686K0864J9159J6261J2929
$$ 1889338 1912667 1935747 1958753 1981751 2004528 2026806 2048492 2069356 2088515 2104776 2117705
53468B117705J0320Q603O831M162O76l182p263j1400j4861j6864j7543j7930j8853
$$ 2117705 2128025 2136628 2143459 2147621 2148297 2145115 2137852 2126452 2111591 2094727 2077184 2059254 2040401
53455B040401k0258k1682k3072k4828k7159k9588l1276l1792l1452l0910l0500
$$ 2040401 2020143 1998461 1975389 1950561 1923402 1893814 1862538 1830746 1799294 1768384 1737884
53444A737884l0134k9725k9386k9167k8841k8112k6804k4797k2059j8942j6118
$$ 1737884 1707750 1678025 1648639 1619472 1590631 1562519 1535715 1510918 1488859 1469917 1453799
53433A453799j3924j2050j0158q461p237o039m022j045K144M858P053Q919J0528
$$ 1453799 1439875 1427825 1417667 1409206 1401969 1395930 1391908 1390863 1393007 1397865 1404918 1413837 1424365
53420A424365J2177J4409J7223J9715K1104K1766K2752K4550K6819K9180L1603
$$ 1424365 1436542 1450951 1468174 1487889 1508993 1530759 1553511 1578061 1604880 1634060 1665663
53409A665663L4057L6360L8479M0589M2768M5013M7474N0250N2949N5066N6841
$$ 1665663 1699720 1736080 1774559 1815148 1857916 1902929 1950403 2000653 2053602 2108668 2165509
53398B165509N9113O2133O5156O7506O9497P1776P4232P6186P7397P8250P9071
$$ 2165509 2224622 2286755 2351911 2419417 2488914 2560690 2634922 2711108 2788505 2866755 2945826
53387B945826P9748Q0026P9792P9030P7864P6509P4888P2476O8955O4865O1097
$$ 2945826 3025574 3105600 3185392 3264422 3342286 3418795 3493683 3566159 3635114 3699979 3761076
53376C761076N7791N4359N0628M7168M4228M1027L6616L1001K4862J8508J1642
$$ 3761076 3818867 3873226 3923854 3971022 4015250 4056277 4092893 4123894 4148756 4167264 4178906
53365D178906L927m836j4835k5931l7104m6902n4666o0946o6514p1405p5227p7969
$$ 4178906 4182833 4177997 4163162 4137231 4100127 4053225 3998559 3937613 3871099 3799694 3724467 3646498
53353C646498p9971q1346q1934q1843q1522q1110q0119p8062p5334p3113p2319
$$ 3646498 3566527 3485181 3403247 3321404 3239882 3158772 3078653 3000591 2925257 2852144 2779825
53342B779825p2700p3038p2247p0309o8064o6086o3909o0688n6501n2553m9741
$$ 2779825 2707125 2634087 2561840 2491531 2423467 2357381 2293472 2232784 2176283 2123730 2073989
53331B073989m7455m4320l9996l5542l1958k9058k6283k3893k2617k2302k1857
$$ 2073989 2026534 1982214 1942218 1906676 1874718 1845660 1819377 1795484 1772867 1750565 1728708
53320A728708k0672j9317j8490j7841j6473j4231j1850j0006q727p734o828n789
$$ 1728708 1708036 1688719 1670229 1652388 1635915 1621684 1609834 1599828 1591101 1583367 1576539 1570750
53308A570750m378k629r02O45K315M387O635Q631J0334J2050J3876J5675J7535
$$ 1570750 1566372 1563743 1562841 1563486 1565801 1570188 1576823 1585454 1595788 1607838 1621714 1637389 1654924
53295A654924J9848K2686K5454K7531K9111L1022L3591L6088L7511L7776L7782
$$ 1654924 1674772 1697458 1722912 1750443 1779554 1810576 1844167 1880255 1917766 1955542 1993324
53284A993324L8235L8698L8108L6071L3382L1179K9841K8855K7468K5249K2136
$$ 1993324 2031559 2070257 2108365 2144436 2177818 2208997 2238838 2267693 2295161 2320410 2342546
53273B342546J8297J4085R917O035K419j100m692q481j2552j6953k1735k6785
$$ 2342546 2360843 2374928 2384845 2390880 2393299 2392199 2387507 2379026 2366474 2349521 2327786 2301001
53261B301001l1567l5300l7759l9713m2075m4690m6501m7041m7028m7192m7182
$$ 2301001 2269434 2234134 2196375 2156662 2114587 2069897 2023396 1976355 1929327 1882135 1834953
53250A834953m6256m4630m3291m2617m1958m0696l9082l7891l7679l8520l9947
$$ 1834953 1788697 1744067 1700776 1658159 1616201 1575505 1536423 1498532 1460853 1422333 1382386
53239A382386m1003m0871l9758l8720l8319l7911l6575l4352l2008k9901k7675
$$ 1382386 1341383 1300512 1260754 1222034 1183715 1145804 1109229 1074877 1042869 1012968 985293
53228I85293k5050k2338k0045j8273j6798j5502j4594j4341j4646j4980j4910
$$ 985293 960243 937905 917860 899587 882789 867287 852693 838352 823706 808726 793816
53217G93816j4605j4622j5089j5488j5360j4917j4655j4673j4700j4585j4350
$$ 793816 779211 764589 749500 734012 718652 703735 689080 674407 659707 645122 630772
53206F30772j3927j3241j2545j2225j2243j2035j1113r584q107p415p762q617
$$ 630772 616845 603604 591059 578834 566591 554556 543443 533859 525752 518337 510575 501958
53194E01958r032q569p706p123o819o350n721n392n438n328m709l913l474l487
$$ 501958 492926 484357 476651 469528 462709 456359 450638 445246 439808 434480 429771 425858 422384 418897
53180D18897l737m050m204l834k764j398m49l37r04j619j947j739j360j227j244
$$ 418897 415160 411110 406906 403072 400308 398910 398461 398124 397220 395601 393654 391915 390555 389328 388084
53165C88084r45k47L30M14K58J69q3q05j604j730j143o38q32j431j767j675j566
$$ 388084 387139 386892 387222 387636 387894 388063 387980 387175 385571 383841 382698 382060 381228 379797 378030 376355 374789
53148C74789j775k103k070j493q22p29j369k127k282j818j334j184j050m95L16
$$ 374789 373014 370911 368841 367348 366526 365797 364428 362301 360019 358201 356867 355683 354633 354138 354454
53133C54454P33M79J14M08J322J938J548O00J39M98R97J020Q07Q99J323J777K253
$$ 354454 355187 355666 355780 356188 357510 359448 360996 361596 361735 362233 363230 364250 365057 365956 367279 369056 371309
53116C71309K817L057K466J356P16R82J525J626J321J016P11J76n02j050j504
$$ 371309 374126 377183 379649 381005 381721 382703 384228 385854 387175 388191 388902 389078 388576 387526 386022
53101C86022k086k665k845k586k291k276k451k600k570k106r94L95J101N61o10
$$ 386022 383936 381271 378426 375840 373549 371273 368822 366222 363652 361546 360552 360947 362048 362609 361999
53086C61999j240r39m15m37r36j301j214q08k08O07J442J824J484O99l2m63n98
$$ 361999 360759 359820 359405 358968 358032 356731 355517 354709 354501 355108 356550 358374 359858 360557 360525 360062 359464
53069C59464m86k76l02p39j212j166o27k15l23o78q52p81n13R5R68J466J007o5
$$ 359464 358978 358702 358400 357661 356449 355283 354656 354441 354118 353440 352588 351807 351294 351389 352357 353823 354830 354765
53051C54765q28r51r30j133j247r53n59m73m87j05O00J044R01M03j84q49j537
$$ 354765 353937 352986 352056 350923 349676 348723 348164 347691 347204 347099 347699 348743 349644 350047 349863 349014 347477
53034C47477j924j720j007j50M83P00N28J95o5k19l94o41r23j205j373j113k30
$$ 347477 345553 343833 342826 342676 343159 343859 344387 344582 344517 344298 343904 343263 342340 341135 339762 338649 338419
53017C38419Q78J417J023J81l07q9O16J337J626J300P41O62J257J744J254L5o82
$$ 338419 339297 340714 341737 341918 341611 341522 342138 343475 345101 346401 347142 347804 349061 350805 352059 352094 351412
53000C51412j80Q46J184O02j4J11P29J064R17Q62J408K287K790K559J831J048
$$ 351412 351232 352078 353262 353864 353850 353961 354690 355754 356671 357533 358941 361228 364018 366577 368408 369456
52984C69456N27M29P48J269J764K268K900L456L508L027K517K309K090J391K94
$$ 369456 369983 370412 371160 372429 374193 376461 379361 382817 386325 389352 391869 394178 396268 397659 397953
52969C97953o63j073q66j62P43J376J527J527J761K018J762J034N20O35R32O71
$$ 397953 397290 396217 395351 395189 395932 397308 398835 400362 402123 404141 405903 406937 407457 408092 409024 409695
52953D09695k70j331j868j704j218r72j233j744k076k140k108k016j756j466j453
$$ 409695 409425 408094 406226 404522 403304 402332 401099 399355 397279 395139 393031 391015 389259 387793 386340
52938C86340j585j286m75k7q18k430l423k971j752j008j114j421j295q92p51j052
$$ 386340 384755 383469 382994 382967 382149 379719 376296 373325 371573 370565 369451 368030 366735 365843 365092 364040
52922C64040j478j703j632j246n49J75M02m5o52p51l07J22J99J62K74K94k56j292
$$ 364040 362562 360859 359227 357981 357432 357607 358009 357964 357312 356561 356254 356376 356575 356737 357011 357305 357049 355757
52904C55757k030j722m72Q42J444J275P25P8m92o43j51N57P65N12O34J480K238
$$ 355757 353727 352005 351533 352375 353819 355094 355819 355897 355405 354762 354611 355168 355933 356445 357079 358559 360797
52887C60797K077J334Q38N75l9q28r15j76M16J49n49r56j035j118j218j177j038
$$ 360797 362874 364208 365046 365621 365582 364754 363839 363663 364079 364228 363679 362723 361688 360570 359352 358175 357137
52870C57137q17l06N36J332J734J790J653J435J549K554M158N017M174K295Q55
$$ 357137 356320 356014 356550 357882 359616 361406 363059 364494 366043 368597 372755 377772 381946 384241 385096
52855C85096M05L16p9q15j614k217k355k035j828k325l319m009m099m082m356
$$ 385096 385501 385817 385738 384923 383309 381092 378737 376702 374874 372549 369230 365221 361122 357040 352684
52840C52684m582m239l453k801k480k033j047Q6M88p7o60k27R37J562J150O22
$$ 352684 348102 343863 340410 337609 335129 333096 332049 332135 332623 332546 331886 331659 332596 334158 335308 335930
52824C35930Q70J489J577J097N99J21o11j282j293r45j170j992k294j413k0J047
$$ 335930 336800 338289 339866 340963 341562 341683 341072 339790 338497 337552 336382 334390 332096 330683 330663 331710
52808C31710J856K704L124K502J254N08O92J137J071M71k35q09j360j987k536
$$ 331710 333566 336270 339394 341896 343150 343658 344350 345487 346558 347029 346794 345985 344625 342638 340102
52793C40102k680k197j261m13k15q31j792k269j757o38J49J55j54k14j84m28n37
$$ 340102 337422 335225 333964 333551 333336 332505 330713 328444 326687 326049 326198 326353 326199 325985 325801 325373 324836
52776C24836K85J861K906K559J430O81O06O22L29NM8M34P92Q25N78L00J34j5j95
$$ 324836 325121 326982 329888 332447 333877 334558 335164 335786 336115 336120 336168 336602 337394 338219 338797 339097 339231 339216 339021
52757C39021j54L10Q75R45M14k05m47l35r9J43K74J73%R1M17N18J43m05p07n82
$$ 339021 338867 339177 340052 340997 341411 341206 340759 340424 340325 340468 340742 340915 340915 341006 341423 341941 342084 341679 340972 340390
52737C40390P1J236K346K561J852J256J540K209K357J984J767J876J872J544J134
$$ 340390 340461 341697 344043 346604 348456 349712 351252 353461 355818 357802 359569 361445 363317 364861 365995
52722C65995Q10N16L00K63K66J64J52K92N7r55k031k004q83L2j43r41j489j540
$$ 365995 366805 367321 367621 367884 368150 368314 368466 368758 368815 367860 365829 363825 362942 362974 362831 361890 360401 358861
52704C58861j215n82jj14r44j601j524j294j538j650o24J241K546K609K096J702
$$ 358861 357646 357064 357063 356949 356005 354404 352880 351586 350048 348398 347774 349015 351561 354170 356266 357968
52688C57968J223L24n18n38K53R97R11M6p37m89R16K425K755J747M65j33j66k72
$$ 357968 359191 359515 358997 358459 358712 359709 360620 360666 359929 359440 360356 362781 365536 367283 367748 367615 367449 367177
52670C67177o24r52j113j151r85n58j51p1j57n1J58Q5j82q9M88R21O76M4k89n7
$$ 367177 366553 365601 364488 363337 362352 361794 361643 361572 361415 361364 361522 361607 361425 361336 361824 362745 363421 363465 363176 363119
52650C63119M98J140J819K464K889K943K591J926J103K50n49j142j285j028q30
$$ 363119 363617 364757 366576 369040 371929 374872 377463 379389 380492 380742 380193 379051 377766 376738 375908
52635C75908r41q56j1J124J444Q55N67J331K341K571K330K521L021K979K315J731
$$ 375908 374967 374111 374100 375224 376668 377523 378090 379421 381762 384333 386663 389184 392205 395184 397499 399230
52619C99230J272K02j578l076l610l609l613l361k518j520j013r92j099j346j870
$$ 399230 400502 400704 399126 396050 392440 388831 385218 381857 379339 377819 376806 375814 374715 373369 371499
52604C71499k335k210j472n59K09Q07J251J531J610J345O96J46L90J280J739J221
$$ 371499 369164 366954 365482 364923 365132 365939 367190 368721 370331 371676 372372 372518 372908 374188 375927 377148
52588C77148N97Q86J621J485K99p09n99K23Q60J002P94L24k41m53k9P04J143J037
$$ 377148 377745 378631 380252 381737 382036 381327 380728 380951 381811 382813 383607 383931 383690 383237 383208 383912 385055 386092
52570C86092N49o0n33n95j30M89N85j54j208j605r12J99N60k16j360j856j503
$$ 386092 386641 386581 386048 385453 385323 385812 386397 386243 385035 383430 382518 382717 383277 383061 381701 379845 378342
52553C78342q38l41j13j53m86r82j324j307r94o25m26m40l88J08R26J392J087
$$ 378342 377504 377163 377050 376897 376411 375429 374105 372798 371804 371179 370753 370313 369925 370033 370959 372351 373438
52536C73438M70K93N55O17K10k37l49l22m25n20l48jK45L61N40Q10R38P39M00
$$ 373438 373908 374201 374756 375373 375583 375346 374997 374675 374250 373730 373382 373381 373626 373987 374527 375337 376275 377014 377414
52517C77414M12J096K187L004L202L150L373L837M126M129M092M002L462K320
$$ 377414 377826 378922 381109 384113 387315 390465 393838 397675 401801 405930 410022 414024 417486 419806
52503D19806J004M2n06r60j610k486l360l909m055m046m033l738k959k226k251
$$ 419806 420810 420852 420346 419386 417776 415290 411930 408021 403966 399920 395887 392149 389190 386964 384713
52488C84713k765k641j469j70L23L09N41Q64N81j39l09L97J109J076P46R93J798
$$ 384713 381948 379307 377838 377668 377991 378300 378841 379705 380286 380147 379838 380235 381344 382420 383166 384159 385957
52471C85957K393K416K282K362K464K317K129K213K394K262J901J857K234K332
$$ 385957 388350 390766 393048 395410 397874 400191 402320 404533 406927 409189 411090 412947 415181 417513
52457D17513J529J65q83j320j636k233k860l105l010k940l078l264l251k866k138
$$ 417513 419042 419207 418324 417004 415368 413135 410275 407170 404160 401220 398142 394878 391627 388761 386623
52442C86623j340q86r11j111j039o42l39n80j371k154k261j540n51K2P5J1J03
$$ 386623 385283 384397 383486 382375 381336 380694 380355 379775 378404 376250 373989 372449 371898 371920 371995 372006 372109
52425C72109K53L59N55Q41Q90M94J6L3N84J114J163R17Q87J320K003K590K888
$$ 372109 372362 372721 373276 374117 375007 375501 375517 375550 376134 377248 378411 379328 380215 381535 383538 386128 389016
52408C89016K900K761K747L184M128N234O184P253R077J1695J4067J4894J3764
$$ 389016 391916 394677 397424 400608 404736 409970 416154 423407 432484 444179 458246 473140 486904
52395D86904J1290Q290N170J950j377m563p014q175q185p868p762p435o288m640
$$ 486904 498194 506484 511654 513604 512227 507664 500650 492475 484290 476422 468660 461225 454937 450297
52381D50297l374k694k059j268o81k36P19K253L359L333K903L159L940M166L504
$$ 450297 446923 444229 442170 440902 440221 439985 440704 442957 446316 449649 452552 455711 459651 463817 467321
52366D67321K760K603K715K426J586N66k39o70p94q48j042j324j421j076k86O34
$$ 467321 470081 472684 475399 477825 479411 479977 479738 479068 478274 477426 476384 475060 473639 472563 472277 472911
52350D72911J199J222J137J560K407K867K528K066K348L218L762L575L182L177
$$ 472911 474110 475332 476469 478029 480436 483303 485831 487897 490245 493463 497225 500800 503982 507159
52336E07159L543L906M114M429N274O795Q493R551R805J0062J1046J2353J3083
$$ 507159 510702 514608 518722 523151 528425 535220 543713 553264 563069 573131 584177 596530 609613
52323F09613J3242J3681J4658J5341J5064J4296J3928J4124J4455J4749J5244
$$ 609613 622855 636536 651194 666535 681599 695895 709823 723947 738402 753151 768395
52312G68395J6091J7121J8078J8815J9346J9945K1026K2652K4307K5332K5544
$$ 768395 784486 801607 819685 838500 857846 877791 898817 921469 945776 971108 996652
52301I96652K5246K4812K4471K4251K3912K3107K1882K0807K0196J9440J7569
$$ 996652 1021898 1046710 1071181 1095432 1119344 1142451 1164333 1185140 1205336 1224776 1242345
52290A242345J4490J1174Q506O469M685L191K127J110m08k156l191l191k998l485
$$ 1242345 1256835 1268009 1276515 1282984 1287669 1290860 1292987 1294097 1293689 1291533 1288342 1285151 1282153 1278668
52276A278668m412m923m755m318l780k917j824j062p87m13N65J940L300M680O247
$$ 1278668 1274256 1269333 1264578 1260260 1256480 1253563 1251739 1250677 1249890 1249477 1250042 1251982 1255282 1259962 1266209
52261A266209P794R051J0114J1161J2105J2996J4339J6325J8172J8923J8669J8207
$$ 1266209 1274003 1283054 1293168 1304329 1316434 1329430 1343769 1360094 1378266 1397189 1415858 1434065
52249A434065J7720J6757J5411J4449J4063J3402J1807R701P848O395N116M019
$$ 1434065 1451785 1468542 1483953 1498402 1512465 1525867 1537674 1547375 1555223 1561618 1566734 1570753
52237A570753L121K118P68p63k335m088n861o933p054p157q187r651j0211r610
$$ 1570753 1573874 1575992 1576760 1575997 1573662 1569574 1563713 1556780 1549726 1542569 1534382 1524731 1514520 1504910
52223A504910r001r285j0015j0264r875r375r081q796q181p147n928m878m062
$$ 1504910 1495909 1486624 1476609 1466345 1456470 1447095 1438014 1429218 1421037 1413890 1407962 1403084 1399022
52210A399022l085j592R9J250J672K008K885M176N340O147O714P063P114P038
$$ 1399022 1395937 1394345 1394444 1395694 1397366 1399374 1402259 1406435 1411775 1417922 1424636 1431699 1438813 1445851
52196A445851P229P830Q516Q847Q738Q511Q546Q876R135Q971Q430P775O923N375
$$ 1445851 1453080 1460910 1469426 1478273 1487011 1495522 1504068 1512944 1522079 1531050 1539480 1547255 1554178 1559553
52182A559553K953L35j485k263k756l883n834q048r762j0529j0467j0137j0022
$$ 1559553 1562506 1562841 1561356 1559093 1556337 1552454 1546620 1538572 1528810 1518281 1507814 1497677 1487655
$$ [...]
##END NTUPLES=NMR SPECTRUM
##END=
