##TITLE=AC1695_ROEFFECT0025_8637688_yrz5u0WGUz
##JCAMPDX= 6.0         $$ Bruker NMR JCAMP-DX V2.0
##DATA TYPE= NMR SPECTRUM
##DATA CLASS= NTUPLES
##ORIGIN= BRUKER
##OWNER= Administrator
$$ 1.72 TOPSPIN		Version 2.1
$$ 2014-05-22 18:44:04.877 -0700  Administrator@X
$$ Compression mode = diff/dup
##.OBSERVE FREQUENCY= 400.02188249412
##.OBSERVE NUCLEUS= ^1H
##.ACQUISITION MODE= SIMULTANEOUS (DQD)
##.ACQUISITION SCHEME= undefined
##.AVERAGES= 8
##.DIGITISER RES= 22
##SPECTROMETER/DATA SYSTEM= spect
##.PULSE SEQUENCE= zg30
##.SOLVENT NAME= COFFEE_meoh
##.SHIFT REFERENCE= INTERNAL, COFFEE_meoh, 1, 14.98509
##AUDIT TRAIL= $$ (NUMBER, WHEN, WHO, WHERE, PROCESS, VERSION, WHAT)
$$ ##TITLE= Audit trail, TOPSPIN		Version 2.1
$$ ##JCAMPDX= 5.01
$$ ##ORIGIN= Bruker BioSpin GmbH
$$ ##OWNER= Administrator
$$ $$ E:\/data/COFFEE/nmr/AC1695_ROEFFECT0025_8637688_yrz5u0WGUz/10/pdata/1/auditp.txt
$$ ##AUDIT TRAIL=  $$ (NUMBER, WHEN, WHO, WHERE, PROCESS, VERSION, WHAT)
(   1,<2014-05-22 18:43:57.830 -0700>,<Administrator>,<X>,<go>,<TOPSPIN 2.1>,
      <created by zg
	started at 2014-05-22 18:42:51.948 -0700,
	POWCHK enabled, PULCHK disabled,
       configuration hash MD5:
       C8 4E 4E 5D D3 5C D8 9E 9F 52 82 E0 59 8A DE 15
       data hash MD5: 64K
       52 4C 41 00 D9 C2 1D 69 F4 85 27 9B C7 F6 A4 70>)
(   2,<2014-05-22 18:44:00.893 -0700>,<Administrator>,<X>,<proc1d>,<TOPSPIN 2.1>,
      <Start of raw data processing
       efp LB = 0 FT_mod = 6 PKNL = 1 PHC0 = 0 PHC1 = 0 SI = 32K 
       data hash MD5: 32K
       D4 E4 F5 D8 BD 34 42 78 09 74 76 50 51 01 B3 81>)
(   3,<2014-05-22 18:44:01.237 -0700>,<Administrator>,<X>,<proc1d>,<TOPSPIN 2.1>,
      <pk PHC0 = 95.58655 PHC1 = 0 
       data hash MD5: 32K
       6C 11 E3 F0 8F 2A 7B 66 1C 51 16 3C 71 F9 16 53>)
(   4,<2014-05-22 18:44:01.362 -0700>,<Administrator>,<X>,<proc1d>,<TOPSPIN 2.1>,
      <abs ABSG = 1 
       data hash MD5: 32K
       35 B7 80 75 71 34 67 B7 11 45 B8 68 07 DF 2B 8D>)
(   5,<2014-05-22 18:44:01.440 -0700>,<Administrator>,<X>,<proc1d>,<TOPSPIN 2.1>,
      <abs ABSG = 2 
       data hash MD5: 32K
       E5 2F 7C FE 01 58 F8 D2 9E 84 15 A0 79 43 DA C3>)
(   6,<2014-05-22 18:44:01.518 -0700>,<Administrator>,<X>,<proc1d>,<TOPSPIN 2.1>,
      <abs ABSG = 3 
       data hash MD5: 32K
       12 8E 84 ED 1C A9 EF 23 C7 94 FA 77 90 50 22 17>)
(   7,<2014-05-22 18:44:01.627 -0700>,<Administrator>,<X>,<proc1d>,<TOPSPIN 2.1>,
      <abs ABSG = 4 
       data hash MD5: 32K
       3F 06 64 01 01 D5 E8 D8 61 2A E4 17 82 34 E2 23>)
(   8,<2014-05-22 18:44:01.690 -0700>,<Administrator>,<X>,<proc1d>,<TOPSPIN 2.1>,
      <abs ABSG = 5 
       data hash MD5: 32K
       42 7A CA 39 65 B7 A6 2E 5B 77 67 AF AF 2E 33 F2>)
$$ ##END=
$$ 
$$ $$ hash MD5
$$ $$ 61 13 FB 81 55 A9 80 79 6D 50 57 95 9B 09 60 18
##$RELAX= 
##$RELAX= 
##$RELAX= 
##$RELAX= 
##$RELAX= 
##$RELAX= 
##$RELAX= 
$$ Bruker specific parameters
$$ --------------------------
##$DU= <E:\>
##$EXPNO= 10
$$ [...]
150 150 150 150 150 150 150 150
##$TP07= 0
##$TPNAME0= <>
##$TPNAME1= <>
##$TPNAME2= <>
##$TPNAME3= <>
##$TPNAME4= <>
##$TPNAME5= <>
##$TPNAME6= <>
##$TPNAME7= <>
##$TPOAL= (0..7)
0.5 0.5 0.5 0.5 0.5 0.5 0.5 0.5
##$TPOFFS= (0..7)
0 0 0 0 0 0 0 0
##$TUNHIN= 0
##$TUNHOUT= 0
##$TUNXOUT= 0
##$USERA1= <user>
##$USERA2= <user>
##$USERA3= <user>
##$USERA4= <user>
##$USERA5= <user>
##$V9= 5
##$VALIST= <valist>
##$VCLIST= <CCCCCCCCCCCCCCC>
##$VD= 0
##$VDLIST= <DDDDDDDDDDDDDDD>
##$VPLIST= <PPPPPPPPPPPPPPP>
##$VTLIST= <TTTTTTTTTTTTTTT>
##$WBST= 2048
##$WBSW= 25
##$XGAIN= (0..3)
0 0 0 0
##$XL= 0
##$YL= 0
##$YMAX_a= 614971
##$YMIN_a= -522368
##$ZGOPTNS= <>
##$ZL1= 120
##$ZL2= 120
##$ZL3= 120
##$ZL4= 120
##$ABSF1= 14.98509
##$ABSF2= -5.573092
##$ABSG= 5
##$ABSL= 3
##$ALPHA= 0
##$AQORDER= 0
##$ASSFAC= 0
##$ASSFACI= 0
##$ASSFACX= 0
##$ASSWID= 0
##$AUNMP= <proc_prof1d_extract_pilot.lims>
##$AXLEFT= 0
##$AXNAME= <>
##$AXNUC= <1H>
##$AXRIGHT= 0
##$AXTYPE= 0
##$AXUNIT= <>
##$AZFE= 0.1
##$AZFW= 0.1
##$BCFW= 0
##$BC_mod= 0
##$BYTORDP= 0
##$COROFFS= 0
##$CY= 15
##$DATMOD= 1
##$DC= 0
##$DFILT= <>
##$DTYPP= 0
##$F1P= 0
##$F2P= 0
##$FCOR= 0.5
##$FTSIZE= 32768
##$FT_mod= 6
##$GAMMA= 0
##$GB= 0
##$INTBC= 1
##$INTSCL= 1
##$ISEN= 128
##$LB= 0
##$LEV0= 0
##$LPBIN= 0
##$MAXI= 10000
##$MC2= 0
##$MEAN= 0
##$ME_mod= 0
##$MI= 0
##$NCOEF= 0
##$NC_proc= -8
##$NLEV= 6
##$NOISF1= 0
##$NOISF2= 0
##$NSP= 0
##$NTH_PI= 0
##$NZP= 0
##$OFFSET= 14.98509
##$PC= 1
##$PHC0= 95.58655
##$PHC1= 0
##$PH_mod= 1
##$PKNL= yes
##$PPARMOD= 0
##$PPDIAG= 0
##$PPIPTYP= 0
##$PPMPNUM= 2147483647
##$PPRESOL= 1
##$PSCAL= 4
##$PSIGN= 0
##$PYNMP= <proc.py>
##$REVERSE= no
##$SF= 400.02
##$SI= 32768
##$SIGF1= 0
##$SIGF2= 0
##$SINO= 400
##$SIOLD= 32768
##$SPECTYP= <>
##$SREGLST= <1H.CDCl3>
##$SSB= 0
##$STSI= 32768
##$STSR= 0
##$SW_p= 8223.68421052631
##$SYMM= 0
##$S_DEV= 0
##$TDeff= 65536
##$TDoff= 0
##$TI= <>
##$TILT= no
##$TM1= 0
##$TM2= 0
##$TOPLEV= 0
##$USERP1= <user>
##$USERP2= <user>
##$USERP3= <user>
##$USERP4= <user>
##$USERP5= <user>
##$WDW= 1
##$XDIM= 32768
##$YMAX_p= 468014266
##$YMIN_p= -731930
##$CURPLOT= <Network HP LaserJet P1505>
##$CURPRIN= <$Network HP LaserJet P1505>
##$DFORMAT= <normdp>
##$LAYOUT= <+/1D_H.xwp>
##$LFORMAT= <normlp>
##$PFORMAT= <normpl>
##$SURQMSG= 1
$$ End of Bruker specific parameters
$$ ---------------------------------
##NTUPLES= NMR SPECTRUM
##VAR_NAME=  FREQUENCY,     SPECTRUM/REAL,   SPECTRUM/IMAG
##SYMBOL=    X,             R,               I
##VAR_TYPE=  INDEPENDENT,   DEPENDENT,       DEPENDENT
##VAR_FORM=  AFFN,          ASDF,            ASDF
##VAR_DIM=   32768,         32768,           32768
##UNITS=     HZ,            ARBITRARY UNITS, ARBITRARY UNITS
##FACTOR=    0.250966925370066, 1,           1
##FIRST=     8223.43324360094, -142630,      -118841
##LAST=      0,             270984,          -69670
##MIN=       0,             -731930,         0
##MAX=       8223.43324360094, 468014266,    0
$$ Real data points
##PAGE= N=1
##DATA TABLE= (X++(R..R)), XYDATA
$$ [...]
23864 -218511 -16441 54096 -327526 -198916 225572 -137732 319910 261450 261613 106039 16582
23852 101463 -121448 64861 -90393 -58661 152996 -224506 50839 109862 -136799 150350
23841 114436 -132430 -192222 140673 348242 32784 154924 -382910 138490 -96396 -107733
23831 -107733 -84825 20701 -5622 -6032 135230 -14817 85450 -304251 -165409 -118194 -4903 -162171
23819 -162171 -194227 -111029 -263290 -156520 -163921 81951 -354380 -189831 -24869 -30644 29397
23807 -64974 -195090 -284086 -32096 -12431 -3886 279786 -163095 -113443 -142892 -70832 326007
23795 77452 -119505 189134 -620045 -230270 112960 253371 -54356 84100 -35708 109944
23784 -149008 111045 -179471 104613 -36902 -143562 -13252 115433 63534 109787 38030
23773 -43546 -73078 -80267 -105308 -485201 327012 -53050 -118417 -89598 93904 19780 191268
23762 191268 -164915 462596 -169359 -181834 -120377 20539 -25445 45749 85068 -8619 205802
23750 209454 210156 73334 -90094 244391 94486 10651 -64979 -98045 33533 -83022 84805 56852
23738 56852 31457 -124538 348206 -248900 104804 -286800 -269995 -193012 -362450 -171957
23727 -182073 271439 -71305 88799 162477 -242760 101243 247962 78295 -13023 -353711
23717 -353711 154084 215282 -128744 91044 -157273 86819 -29881 168885 -201830 -31234
23706 -691 -62067 -213901 -256947 310705 -207651 50531 -83401 151586 8894 65874 -221589
23694 103037 -228128 67895 -304943 -26906 -40771 8843 -198117 -167297 459504 -51279 -272561
23683 -272561 -10327 -120380 183303 -142643 19477 -171958 435094 -254366 25533 45064
23673 45064 243436 27426 23526 -102368 -39870 -72129 101636 189885 111553 168002 -109998
23661 96184 -262546 -225710 274143 3412 25951 32328 19047 76279 29963 9061 -228347 27591
23648 148004 -110617 91949 -110319 -204899 101688 -66525 -326714 142216 -3938 73051 12074
23636 -400605 33547 -233878 658 176341 103405 -182238 391924 148022 186994 -15589 216656
23624 -78701 145694 -126133 127703 -165205 -185086 22436 35699 -19012 220321 -139703
23613 83816 -213023 465571 109357 148097 -67160 -13907 -197078 -246982 173656 -128779
23602 -45354 -22501 -17698 -80171 -39153 -188126 20171 -151420 49257 240068 -136107 44009
23590 25472 75656 141861 -16470 -202995 -285964 -47882 106137 -251264 68168 -246322 -175253
23579 -175253 -232610 3221 -94274 -283415 162624 31943 107621 159022 -60471 274832 84491
23567 113189 73541 -218855 57081 163964 -105949 -208035 227222 20522 -192948 198632
23556 251113 -184417 -237271 150025 -396288 -267790 -291429 156616 158107 -227045 -74074
23545 -34967 -109387 -405381 262297 -200581 151559 22592 218565 -30216 -248381 44411
23534 -353973 313479 47816 140607 8824 331358 -263897 39860 85671 -202541 -254159 -190871
23523 -190871 -283328 -68264 -389165 35387 -99273 -109288 -201434 -169949 259443 49069 140194
23512 140194 -96878 -202727 191023 169802 -115493 -72969 36405 -109162 19623 -55103 34508
23500 -109293 -95332 16857 87893 152845 13944 23435 -163699 -8462 -373559 86505 -174994
23488 -77270 95907 -65212 124462 -100357 -296499 21469 -156710 121442 309242 -1725 -84095
23477 -84095 -58685 -333079 -220313 3939 294288 18588 7168 123634 112540 224651 213934
23466 213934 -58927 80543 -114887 -280745 -81498 -235356 -174476 -29691 40813 68093 -187662
23454 165778 -101250 144490 -254326 -107499 -174334 -11278 -125661 187885 -279642 183654
23443 -13728 -33616 114268 267274 40066 -59896 129004 -81463 27784 -267960 -70213 -263906
23432 -263906 37211 214495 -104011 125348 169594 -70676 35595 -150243 -64713 40553 -124259
23420 211328 -76288 -94928 -336338 -260692 -85457 -13116 -59814 -24733 -178726 -110772 -58794
23409 -58794 26828 -28915 -93647 79503 -1793 -203860 68298 -248666 -74618 7478 192439
23398 192439 195302 143921 -287152 -59865 -169265 -134462 -12209 -40744 -25485 139453 -33852
23386 -135727 11924 -41146 82934 -278246 141268 -435169 140082 -60341 67087 116339 326973
23375 326973 -188789 -92764 42576 64303 44529 -262634 -189876 -75419 38300 70222 33645
23363 121244 143609 -3202 228658 35164 25466 170045 311965 62662 -420405 -298752 -47296
23351 -65190 -10279 -196313 37904 -153865 60046 -135728 239905 -23248 -299337 93110 -342989
23339 102598 -509068 -282885 -108633 170493 80347 -61867 297129 278917 59005 216608
23329 216608 179781 11480 -202797 -32542 -111499 84123 178870 -177158 -141302 130401 157625
23318 157625 -13523 585190 -375223 197802 213140 -29155 182637 171944 105141 184920 153677
23307 153677 171869 190362 -4529 120243 -104674 -394932 -124157 -123248 -287540 224040 31877
23295 -121534 55353 -163884 -54159 -16053 -97508 -93611 -107474 -56711 -14758 -187607 -81204
23283 151829 -128984 137950 -119931 -95975 -186956 194287 497245 24907 188510 -144172
23272 281675 -108185 -5255 -71033 -61326 -236790 206537 46405 251274 163166 141504 -45663
23260 56604 101868 271906 -175212 270425 -73009 75387 43159 113751 -65166 -240306 114937
23248 56037 279103 -29848 -198538 111162 -384989 -276775 -43964 1470 -199603 549363
23237 68188 19760 -72531 7596 204643 115283 -60153 -294092 -178792 291153 491391 -180009
23225 -116093 -167793 -111960 56775 226349 -463723 -304137 -38686 211134 22752 -149724
23214 -139952 -361553 127810 3305 -202176 124153 -263356 453188 -409941 -55936 7797
23203 158992 68624 -166559 5248 -89395 -42453 -131850 53089 -190860 -211936 79957 89537
23192 89537 76986 -203355 63541 141433 -309820 -107779 -368769 -204554 -193356 36775 -99596
23180 -308007 36740 -294001 -64880 -29169 62690 -162423 -81514 -31900 58638 193037 204992
23169 204992 33552 111405 116696 78646 75588 32954 470482 60382 -177586 162876 -400198
23157 9978 -7996 10509 -82004 26798 -193384 133299 131635 -56746 11100 -119785 279243
23145 -150600 -234279 184495 -156517 3987 204133 -114486 -27593 -284456 69735 -117698
23134 -99695 244718 72821 435613 -31539 -235721 -93078 -4880 108085 62330 141708 23399
23122 -115841 19351 246545 1401 -79096 127595 171076 -151724 -15595 -188389 -167597 -79898
23110 -6484 215660 -52154 -24461 -116987 31810 -28543 73491 -138004 103191 -108187 -201861
23099 -201861 192497 -123993 -12150 187318 184731 -240346 148403 -72987 -170777 149006
23088 38742 -2528 -209708 -210055 210773 -169648 -373601 -4286 -132542 -167329 -380440 73696
23076 40798 -96412 -32676 -143690 360834 -281490 -248967 -158448 67840 -98207 -194774 160874
23064 -96838 -118172 -200719 -29085 -44928 266928 -75888 140006 73848 235357 -144436 51377
23052 -248125 -415945 -140867 231497 166903 237341 -289174 58500 -48317 138551 -246812
23041 79112 129513 126734 20028 -115551 -347853 124592 152616 -75980 -81682 195393 -170357
23029 3302 -42004 226393 32952 -40435 -310796 275484 165015 -241081 243785 8698 -165949
23017 148232 265159 90436 -130396 -81707 -420187 83234 121534 49080 -17711 169718 -74881
23005 120353 31450 34864 161893 -94391 160792 63128 -6721 -43349 208631 144275 -226237
22993 7795 -286702 16146 -79439 -115573 -169092 -86526 -320390 -80445 -118809 -137432 170835
22981 -117197 163316 -50465 84217 -12772 -155608 -177113 -328775 36841 26057 -119533 -17380
22969 -65633 14040 95651 -11567 -102307 -164208 -101083 -114883 108766 -86574 -64385 17919
22957 1620 16803 -78575 57487 -168863 -61505 -85665 -157549 183431 -45653 106590 -181521
22945 122952 106186 154009 -377931 -110645 -86549 -66415 186921 19918 -50431 1578 -144940
22933 -6547 147837 -77011 170027 -30381 -189546 -302024 75005 -169982 186379 -133924
22922 94612 -340286 198161 48156 -199969 218511 -44360 -46997 53767 -92564 -308199 220836
22910 -105753 -68455 -251893 -250397 -79828 -273982 100946 -50195 227427 -337322 20119 -118171
22898 -171117 274836 -325719 180383 113784 -316423 241678 108520 -107881 233123 -89938
22887 -22406 -239686 -233683 -98936 267003 59073 170905 -150862 291709 77564 150043 142930
22876 142930 100885 281365 118811 -83705 -387258 -43071 -213457 93327 -92152 304231
22865 -184776 41171 43202 -161050 -42634 47626 12395 95508 -32899 -58671 -174406 214042
22853 -157744 -207496 -100864 45869 41791 -148236 172739 -31729 34767 -99367 202891 29257
22841 -64538 188864 34326 -257911 -160538 197386 -89654 -189598 -178600 -101951 154085 -57933
22829 -117975 -141998 29010 -356452 -396863 214284 -115930 394392 99633 245061 -81612
22818 194687 -47051 47155 -222294 -19886 -102669 -178438 -107450 -16230 337553 164287 257384
22807 257384 -199304 -79849 170827 -174316 -143944 171727 -141344 -278571 -131820 -1063
22796 -125371 104632 -93884 -108506 118863 -95092 -49714 -27621 16429 -54241 81926 38409
22784 -3704 -27710 184804 57659 -274548 153329 121058 302114 -161830 146603 200259 -359355
22772 70577 50804 -169325 -28095 -362993 -263136 84941 155971 223484 -123099 24151 -199738
22760 -339790 77317 -97730 353631 118397 -227024 236072 -431895 26797 -177540 -162117
22750 -162117 -246480 -149084 20828 -160206 -149742 -286226 352748 -205261 191026 -368452
22739 -28566 111862 -222230 -126137 90674 -150678 -55453 -214390 69521 -215652 74038 -185635
22727 165336 -420240 65748 -63020 -253510 -292862 105231 113354 -78988 -100184 -257334 136664
22715 365328 -80285 136488 218282 204386 -6410 -14988 245434 183893 -33039 213309 -189268
22703 79128 -142037 -134922 263929 205507 29996 126816 82606 -205777 -412193 48175 197816
22692 197816 -29627 -200564 233412 -30748 -323877 49096 -110691 227928 36296 -88773
22681 185570 97030 88261 -207791 -91095 -80721 -130805 53039 -89433 -104596 121366 -224342
22669 -37898 -94075 100263 -55398 12681 -359087 77573 -90641 328379 -20176 -30237 -92721
22658 -92721 -218639 182760 106104 -139118 87098 -272353 -275638 -17688 65058 219979 -43804
22646 175240 157590 -440516 -159594 -269185 -329319 217936 -139952 -65260 44468 -186936
22635 33964 -17970 70467 -30837 41118 97216 -57923 -142193 -204237 179502 -102913 376675
22623 -192448 194522 73088 -272004 -74316 -333567 122241 20774 -105935 145000 -60231
22612 64332 153100 85794 320762 57547 -44969 201292 245766 -332329 11628 -144250 -69403
22600 120201 9200 66871 91894 65836 -424470 113173 -163051 -286151 -31771 -232528 -5846
22588 190970 -175920 118465 18017 206600 -211323 -33707 125232 -69390 22329 -21734
22577 153975 121790 -200676 -145123 -97421 14491 43067 -197713 145030 -128845 223086
22566 -202931 -165824 203022 -8733 -305743 -222103 -151683 -84800 97753 -13178 -413908 230695
22554 49304 -23906 -126449 287124 -3128 18657 39021 326306 -2246 -238601 -298611 -104385
22542 -22395 -34585 -233876 -266572 179489 -158560 263277 58558 -163455 12031 199432
22532 199432 222754 -64286 -115699 -89121 128217 182260 -240108 -161190 26178 -31578 1541
22520 177428 -154453 -19961 236402 -80297 -363430 81237 -38355 -271013 -83858 -100716 58796
22508 426244 51127 -49471 202117 213657 -48655 -133812 -53361 -219776 -44023 158681 212624
22497 212624 -316770 74791 -157014 -48133 141177 -27687 -287145 -258723 73617 -89068 87187
22485 234091 144847 98484 -254041 -339295 30501 -350000 -133069 -179600 -171042 -213731 23811
22473 145090 141163 -119947 -21270 15336 381013 -266561 82929 -297480 -164006 24803 246459
22462 246459 -216133 -125661 -283402 -30549 181927 -51100 66693 20650 95598 104369 93196
22451 93196 -45490 255643 106484 -168177 -378957 -6765 13761 74901 -317230 -225660 -204683
22440 -204683 -5019 -144866 -167231 -246812 -211620 -261626 60692 45540 -126733 -199486 152238
22428 -121481 -49093 -82575 -128623 -208122 -134208 128515 114339 81469 3635 -174765 58695
22416 -146643 -27772 -8212 -220628 165047 78613 -70906 -224671 -117357 -82030 37845 -29763
22404 185985 -271566 -85736 -57597 43343 -208650 -156634 -403966 2983 42239 -166271 131943
22392 -8272 -85316 71110 -48510 193559 -111588 -271755 -18129 191529 -67247 -115797 266775
22380 130956 12857 -1538 83991 172635 -121414 -287044 -374274 -15417 -131860 -35457 -214107
22369 -214107 -220400 124127 -15236 148509 41374 -9524 -162731 15069 47069 -121041 -149279
22358 -149279 -107006 -39630 124309 -213795 224322 -83947 -81007 -138142 -90569 -64876 -83563
22347 -83563 -591619 159641 104830 -285299 -48684 19697 -150885 -236677 120544 51952 -349500
22335 -196084 24909 -264653 74693 -155915 -16062 -2170 -263312 -30163 9672 -384994 -66569
22323 20882 108999 193277 179919 3372 -134425 38378 193505 -129154 56036 -27081 -24729
22312 -24729 220727 -45157 -52251 -148194 13776 -21322 -336941 -76660 -244387 -381677 -222388
22301 -222388 -9696 9242 51766 2902 125425 271182 -246753 -97790 -35928 126396 -411 198157
22288 -175724 17300 -7194 203702 360088 -50249 27256 -257341 58672 -52704 11952 -262999
22276 64062 56287 143144 26454 -128915 -149685 77391 21944 -90809 -165106 25559 -283172
22264 44826 365919 337605 21790 -96306 213515 42964 -143205 93110 48140 -311690 92208
22252 -89830 -19842 161213 143081 -62046 -261132 -114772 -120543 -222780 71793 -79916 -125646
22241 -125646 71397 -124386 91303 -205424 26798 31451 -115364 -111952 -21478 -29106 -347517
22230 -347517 -40158 -63466 182885 -93243 -236775 -247907 227106 126205 21896 -45238 -56041
22219 -56041 188872 -146596 162657 41182 -501549 356998 -105915 -131269 -236646 351719
22208 197405 106729 -120755 -136501 -50463 -32136 -29480 150221 -63724 -182753 57565 -124268
22196 -178593 -166281 -8004 222094 38190 -275034 -357943 48374 -86507 24647 106086 -308091
22184 -8185 -11773 206653 136587 -66760 -62121 -24024 -238742 -162918 87869 180990 -65244 -157215
22172 -157215 60925 -146540 224988 -407902 124826 -133290 -157644 -100053 -259525 128748
22161 -64803 -242892 5011 -126955 -131252 -110741 -10081 -39949 -262126 -106254 261706 67931
22149 200117 37771 91670 134170 -101808 -79248 -12863 -166343 45158 -5001 -181362 -147203
22138 -147203 79855 61043 190143 96018 41647 -35402 32467 -391668 -65339 47756 67818
22127 67818 164947 51233 -211137 -77818 -99309 -155018 -244968 -58098 662535 -119446 -132843
22116 -132843 30253 -89306 447407 -112924 -98979 -310790 65303 -203438 -180467 -79529 76191
22104 -177730 -50843 -280949 -250601 -361694 61513 -131489 16104 -23101 -109900 162106 -45323
22092 116520 -208165 65183 -25043 -34351 68217 217901 -274276 118409 -21333 35105 169021
22081 169021 101655 55716 -289054 -370855 -362637 -161921 -106513 100791 -17596 -252623 -6112
22069 -85673 169404 -24550 218415 117179 -65221 -289791 38057 161367 33943 -146674
22058 -20186 91185 94231 81831 -4305 302867 177150 -107206 -82158 315145 78848 40809
22047 40809 -150243 -304946 71312 -108954 -151838 152199 125872 -445239 -42185 -83515 10203
22035 -30660 -3471 8493 63022 -62881 220671 -282633 -3393 -210788 20075 75676 -48616 39824
22022 -62469 -292700 126040 -213327 -19390 -22644 -124435 6681 -122937 -47255 -312184 -68719
22010 -188018 -119004 55124 86173 -154874 -2267 -187428 -87292 -223319 92590 -232401 90906
21998 -401590 -182089 97816 270266 -35032 77270 68569 173988 -245126 -168215 -32510 -61755
21987 -61755 -126347 -302152 -344654 -64391 93785 -269692 -122258 -91297 232120 -65689 -18547
21975 5611 81397 47953 666887 -235093 151468 -41878 -233304 -72102 -248481 69316 -57322
21963 -64811 -85552 142093 132342 -11915 -228607 134420 65905 2383 36798 -48268 -49616 1443
21950 -31540 133257 -121011 -245591 -221695 -36188 241838 -287448 67961 -29787 84369 672
21938 -302456 176589 294650 -37201 62667 -148207 120949 161216 -194426 -190409 -41633 -152078
21927 -152078 -291259 128798 -256753 12150 -83813 -64899 -181934 912 27070 -95958 -26848
21915 -25260 -89650 40275 -61834 -422142 95635 50259 -121583 273668 64243 85796 209785
21904 209785 275010 -2510 -84825 -268704 -300645 13932 -235530 154630 -18191 190915 124430
21893 124430 -221833 -272171 102740 -218499 -170356 -342352 -69084 -38041 -100135 68499 119702
21882 119702 -105062 -151750 -203596 -35507 156806 -160092 6881 -124383 -14995 -118319 174147
21870 156376 -248445 -17149 612555 40577 -31207 154926 100717 -37398 165078 -220655
21859 -16787 140416 139745 337394 -313490 58537 -60023 -231519 140827 124686 -154761 -39694
21847 -144848 -156643 141908 -188005 98034 -306199 -361473 -200833 138568 80913 -116258
21836 -211599 -27985 88067 75312 -222983 -129378 111409 136081 -80923 175045 262631 151331
21825 151331 -254198 -185875 -41875 35098 -71796 -18600 -115753 -121316 11263 -282508 185928
21813 41712 367911 170588 -164054 -322033 -279475 188302 -125179 -309230 -145584 108552
21802 234043 -5249 -125326 30366 116369 -91963 -210767 -214056 -206473 103763 -36828 -111697
21791 -111697 310015 -144515 -167205 -261476 217373 -145858 -98657 -153520 -176746 -133079 -51583
21779 -36410 49901 66104 86296 155880 -126509 -119824 218252 -86204 192179 108744 -52448
21767 -86694 -100090 -125666 387642 -35930 -29905 -110347 80059 -49976 -24854 -351776 -46817
21755 104856 127936 -100324 -173209 -23595 -188122 -48095 -34848 -124979 125145 -19041 18155
21743 -90489 54589 -100593 -113932 125094 -75536 -50830 202936 23800 -139019 95124 132540
21732 132540 -249574 316715 -101976 -24846 -10329 34086 -156808 -353336 -70117 -30692
21721 -130250 -196810 -305864 -10576 -181999 -144320 188877 -67484 36369 -39073 77590 -200652
21709 -8715 -75543 -29897 124683 160412 -283187 -73171 -108857 -200925 -96084 64940 -116799
21697 -23671 114305 -274801 50483 -14841 -76079 108832 134785 63332 71478 -389448 306053
21685 48811 -194646 113104 10100 -127398 -358711 199154 -105046 -184935 20423 -112810
21674 -135665 1645 -160427 77769 -53512 -60820 179735 -2676 63780 -216293 -40068 162270
21662 -120398 164907 -177313 156479 317294 52 -105965 54365 107785 -129192 -274873 51371
21650 2652 76424 86154 -30062 -172049 -105981 -62764 -121235 -246723 71063 83458 -316811
21638 32707 -43343 20343 -193443 -74736 235046 -83034 -12803 -200533 -103873 -127462 -65088
21627 -65088 101691 -66676 -169752 -49395 -225071 -138831 -218624 -29874 38146 -27119 -143806
21616 -143806 174465 94157 210375 17567 49926 -94742 82709 -96655 -295313 -146806 -93368
21605 -93368 -184889 49388 -121315 -79570 -203505 92985 179778 166860 114827 -257681 -191334
21594 -191334 402924 52311 87977 -22609 17025 100729 32332 -42936 -198736 -23452 -408184
21583 -408184 94683 -174795 -165688 -203761 154574 -232099 63371 -104489 208043 -270433
21572 -56655 -65851 -144519 109942 -134581 -79086 -13278 -15175 -8950 -214864 -398400 284174
21560 68995 -144905 -58167 -346188 108128 -173849 269122 -343012 36344 68369 -426597
21549 -277692 -74324 -159839 -195885 -116368 84679 -316913 -81618 -163977 -153513 -254698 -2595
21537 65023 -81481 152492 168904 244502 -65257 173158 -84586 -142581 62834 177807 160759
21526 160759 241454 -26157 107091 42334 -283255 -143399 80551 -8757 -93158 -51238 -1811
21514 19041 -67874 250188 87054 173779 -32056 92196 -10748 82443 85703 80445 47270 -460097
21501 -48059 -95179 94997 -449465 34578 -23386 73772 -169967 -204877 -36911 179775 -461274
21489 20431 133802 -430053 5638 -284288 -113246 -189241 -163769 257435 29470 -197789 -964
21477 -97099 95650 69940 -106970 -209013 -80212 94936 434157 47519 93825 -168263 162527
21465 -89598 -150377 40704 -273933 70846 -205319 -240454 37463 -27034 61535 -227566 97696
21453 -50684 -143218 -139721 -17267 -48887 -169175 19485 86250 -53501 101290 -18819 127944
21441 -264709 -45267 347184 249393 -34972 62341 388820 218220 69265 401429 387226 205248
21430 205248 -22913 -127551 -83311 -139084 317768 4146 -64822 -95381 -40909 -115145 123229
21418 117807 84946 -34466 -48194 101696 63422 -9282 110424 -107535 73213 -165613 122044
21406 358301 -129412 140854 -45011 -66782 10434 2335 -55471 40061 -377212 101676 -23764
21394 -368447 62927 -39516 -132982 -129808 -25580 282830 59918 -165899 80761 -391529 -191484
21382 -238749 -184897 -62576 106480 109928 -160592 -224275 -415552 -316434 143382 -308622 -21248
21370 -135384 5154 -185528 47446 -240676 -94504 -262967 50872 85793 113804 23330 53255
21359 53255 216262 70544 182038 117495 27989 -123025 -153430 -258392 212235 134728 -8409
21347 78376 -248304 -41548 384186 -114909 -70524 -323998 -10027 94828 220824 92122 117380
21336 117380 -155700 -118712 90292 252988 38478 144113 -157362 -91804 11312 -49173 -284101
21325 -284101 142496 -188905 35027 35329 -244790 171179 -7657 369028 -146366 176099 -243609
21313 -210150 -171709 -33398 -195728 -172610 -311038 -37954 -263533 -124970 112222 -29378
21302 -184034 158418 -279631 -203487 75596 -133658 -92438 -136243 -297197 17852 -537535
21291 -294249 -216674 -50308 -71630 -227441 -76268 -335230 -87042 57016 -324775 -278383 52232
21279 122913 58666 -154088 218885 131112 9893 -210326 -351651 -130344 -225014 -31466 -200203
21268 -200203 -268168 391772 -14322 -340060 41630 -166899 70891 -74058 -271597 -550310
21258 -550310 -113395 -115690 -196967 -159585 123659 -269576 -49568 -97946 54232 -110735 61410
21246 248797 17070 -164654 129373 -210587 75399 78482 137625 118020 -68863 -79820 -241826
21235 -241826 -313945 52949 -200348 -8555 -13845 -160657 -281989 -147812 362056 -490956 358777
21223 -16697 177410 -48111 152074 -203979 25935 -182936 14021 -46492 88458 -108900 -32655
21211 -200158 -159152 243264 147916 -180292 65238 -54648 190447 -63376 379165 -100288
21200 143393 -258860 -282757 45513 -68304 -102928 -61938 47869 -355673 -157887 -61324 -88218
21189 -88218 -318322 56404 -2547 243837 -96512 17543 176993 -149462 -48890 -109537 101503
21177 -176082 -147148 172505 75937 146040 153873 -190009 100355 -225152 -359683 -133467
21166 164174 3576 405247 -80123 52135 -211811 146509 36504 -93070 -41034 39232 -79144
21154 -110023 -530298 -311804 47618 -6022 -43199 203273 -267416 -15647 94596 103619 -117977
21142 -110224 48989 81970 -553771 29959 299678 37948 3921 72949 -172734 2037 98922
21131 98922 20530 -128424 -117474 108077 -65195 144217 -419464 53003 -247754 -39785 100267
21119 -271 -7612 -189026 -253604 -14554 -13438 -99674 -356 -430443 141128 134605 120512 -237058
21106 -186213 -20001 -128959 93539 -117276 -7745 -41989 28713 -165838 268057 -162311 60145
21094 -3235 -462696 245590 257707 340060 5733 46931 144642 21421 90284 245828 28713
21082 -59443 -39403 -69036 -130456 346323 98491 327120 -24572 -3814 -51204 145987 88974
21071 88974 -255787 -61441 -90521 -72379 132192 186175 3836 161811 -3461 -233198 -295515
21060 -295515 62168 -65164 -74576 -133591 -117512 -172219 -468049 -144111 -57042 -365136 214923
21048 -9221 -60194 -22571 -267113 -165036 -126324 -166448 -74054 -21853 -99535 -80095 -196425
21037 -196425 72347 -155554 117953 -207285 36295 235472 161829 -2834 174399 -123507
21026 -150573 -135108 61577 -246245 330895 154900 98239 254791 -110890 -52056 -44463 -33042
21015 -33042 80935 28228 -316877 258350 -44529 41443 18153 14554 73000 -130288 -30406
21003 -84328 314478 133727 -118359 35687 -175448 85823 -18877 232818 23496 -26815 -81519
20992 -81519 22303 136303 51097 -429511 -57971 25633 -219417 128467 94750 198073 -42550
20980 -122566 -25894 -256199 -477150 -32617 164003 5016 201796 208558 -182195 -104339 -106319
20969 -106319 305568 117038 -249732 -199962 267520 4053 136033 -459184 96591 -242474
20958 -78919 115145 49737 27281 -129628 223501 -217536 -231672 -321556 26893 -99512 5726
20946 136772 138403 -145482 46064 -110379 -193652 -161285 -72653 106195 22423 -86302 85759
20934 -43271 22186 21716 -223125 83276 -178959 -36022 34607 -283437 -112172 -234556 -58793
20922 -251181 71301 -337492 -223795 -75171 104250 -11000 -136851 277185 303724 65491
20911 -347205 -154786 -361504 46600 45793 -159693 -217241 -415721 104344 -123527 -162745 -2051
20899 -98232 347497 -152102 -19753 -138175 -194565 47465 -156266 -123634 192725 -196227
20888 -163478 49137 202412 169001 -154835 -102332 53878 -218664 -128833 -285637 122535
20877 -31939 3539 -127724 31738 -50598 -260943 -28879 55267 -54558 -32641 -104329 -135796
20866 -135796 -19546 108237 -207151 116115 -6080 77840 -17097 217537 88458 -7961 -272894
20855 -272894 -132613 -135716 -119868 -111200 143531 -85839 -82901 -34527 254539 -47112 -257009
20844 -257009 -180442 -43413 -197926 -251614 -28697 -198547 89041 -38504 58700 -324657 56305
20832 -294653 403475 108962 -75989 -74584 -104238 -372113 30895 -19543 -90499 105842 102791
20821 102791 39247 3323 -283713 -16727 333435 -463500 71998 7385 -147872 -31744 -82853
20810 -82853 -274322 -142705 -3976 81585 328256 -152768 97 127088 -39864 55488 -85358
20798 -114509 4100 -90944 -127361 8606 -101509 129906 -49814 -186737 22891 317734 9362
20786 -162986 -85789 -69062 186297 -7564 53035 -139755 -176598 98202 56359 -48812 269737
20774 -23450 121604 100550 135867 196328 -160857 72326 150132 -75542 -146644 -201977 -121439
20763 -121439 -42982 -215789 -24634 -121764 -310897 -326756 71722 -137863 33697 -131613 35
20751 132824 -173212 -198301 151258 -139014 75132 175755 -52053 -246385 30685 -502355
20740 -327634 381602 -128509 -148257 133114 -225094 -20161 199425 64120 -212583 -80301
20729 182627 -63239 -72995 46 40788 -75221 -584678 -295190 63431 -374878 -88783 -89023 -101609
20717 -101609 143990 261982 -242094 244192 275280 -294811 -160222 -105552 -160889 217508
20706 153439 323064 -22996 386920 -350369 -196546 -167149 151073 -60919 -167367 -21640
20695 -120861 -171354 -98240 -176137 -71341 70757 -42515 -314197 41860 177200 -96249 -272331
20684 -272331 -297135 70982 142487 -121898 -119450 -164536 -104246 -381907 -20277 -8311 -66644
20673 -66644 250751 101390 -12659 -104033 -53974 -315143 -682179 185692 -436905 -148193
20662 -191109 47475 -460959 -95059 -236826 -317306 -297240 106894 225009 -12003 64883 -185835
20650 -1333 50643 -297622 -212351 36884 129863 116008 -226693 -171301 -130389 -142192 -90475
20639 -90475 145011 49812 -124070 -162258 -26631 -246378 336757 -64596 174082 154836 71609
20627 -35113 -105429 149721 134140 2640 -257153 -241710 -111256 -29446 -148103 -151511 140451
20615 -146230 28232 -165331 -9051 -241717 5439 37958 25380 -7788 205946 -235367 -72029
20603 -5118 -57903 -79228 -309745 -78628 -58133 -154252 -447461 -112628 -68103 -158805 -93921
20592 -93921 64381 -97349 155055 -258116 315012 407817 -51453 130029 -156788 -270713
20582 -270713 -164467 121513 -124468 -165514 212858 34599 366345 90478 -529565 -27272
20571 -87141 -293845 100496 215079 44452 17918 -306523 -298706 62900 -232314 8951 -134400
20559 17563 -10082 39801 83731 61671 -195806 -167143 -174236 108207 -252874 291648 202013
20548 202013 -87014 -296348 -15719 28522 -368080 -374324 127383 84648 -405826 -138440 -157977
20537 -157977 -40714 19921 151890 -21342 219617 -114567 -45385 -61055 63866 -61056 -325791
20526 -325791 19351 23930 60347 -331652 128671 -329195 -126834 -45739 -173078 -280293
20516 -280293 27903 -135136 -18275 414862 -344001 -234912 -110174 -212413 -66193 66233
20505 -177392 456318 54211 200145 -57936 274717 -363379 -166743 -71886 287304 35590
20494 -246533 -83188 -377258 -146070 419481 33800 -202944 -210966 -44009 193124 -165941
20483 -51261 -76356 12496 27812 165185 -487932 -56845 -16124 41752 -290910 -321414 358441
20471 -52950 -143251 -99268 173351 150811 213053 -366520 -27416 210596 127234 49455 -116904
20459 97068 109959 -64780 -203908 -178872 -193454 114628 8559 61794 173280 640267 80268
20447 -64583 -112579 -38078 346853 130020 -40431 -70502 -25719 -210478 24561 -335988 -397221
20436 -397221 -274206 -221764 -231659 -35761 308265 -135059 -86633 43774 129845 12830 -182135
20424 -92773 -60837 -174087 90744 -120051 -9012 -369809 -17323 197472 123231 -199494 70774
20412 73483 -106595 165381 -320162 -286618 -144049 132826 214607 324675 -3467 -236904
20402 -236904 -32726 -317747 -35439 -187381 212958 -2996 -171460 176606 -127720 -277993
20392 -277993 -68981 130009 -368350 -179614 -92897 81362 -182473 98212 -224734 -227170 -17613
20380 181389 -284851 23446 251089 -288480 -85113 317935 88642 -38324 92269 147663 -46919
20368 -85421 39887 -294188 -48502 -276934 -149313 69642 -160990 -30934 130786 131627 -153698
20356 -301974 -3545 93910 -292239 -128915 -243962 -91502 327042 123693 53787 -26230 -221851
20345 -221851 -1551 376359 122148 2216 -4508 -163451 1478 -169760 -214600 125012 44334
20333 -175123 -159502 150935 39875 111551 -258196 -163975 1537 -218823 -123025 -134073 -326694
20322 -326694 -52446 5133 -41609 138442 36638 -28426 -223060 -164571 63113 -285602 -173792
20311 -173792 -46927 143188 -98274 -221632 43135 -62614 21782 -45019 121863 -357139 -111670
20299 -320134 -319134 80372 141869 -263686 -372933 -216464 -39590 -181416 49095 46809 -235358
20287 127803 -137550 172713 -101004 42220 46701 271132 86361 106159 -14743 -143394 -193198
20276 -193198 -164088 11942 -12981 -69432 -344872 57169 -117090 -165532 -21897 -69028 -162058
20265 -162058 -147088 -90512 10659 258876 253310 -204637 -260871 -95565 294641 -308794 119012
20253 -138052 -184905 87104 139285 156114 -57790 -134892 128611 -44966 36189 -406023 -204986
20242 -204986 -324007 76818 -251867 -451366 12927 19807 -265594 -326852 -215004 9268 -246289
20230 -12737 -245486 -102511 198738 -256888 -6119 14485 -87179 134675 -17990 -7018 -284442
20219 -284442 49594 316697 -211787 -180334 221023 -87260 -33240 55414 -279267 -36728 90290
20207 24123 -489664 143225 -79478 55978 65935 -136888 -262270 18670 -117022 -310781 27146
20195 -129233 -162579 -240096 -220773 172498 -59402 19584 -67731 -3029 -91507 -187427 -19161
20183 395254 -223745 32748 12069 50272 -219708 -27127 -73108 124943 287847 397281
20173 397281 -424149 232111 -131347 131302 71892 17040 154715 -335438 122195 -76278
20162 191025 -275797 -185989 -233205 -226838 -55498 114568 29162 -66193 -245153 -77615 -267232
20151 -267232 -129039 79015 -304120 -276395 23578 318568 -55675 -185026 300575 -15607
20140 -51139 -159708 196523 184667 -266473 464580 -417223 349957 104502 120339 -74982
20129 -373176 -89334 -104066 91636 -491652 177960 4563 309972 115495 -83588 207755 192889
20118 192889 95157 39101 99084 -141313 79366 7168 -202641 -87254 -353273 -111503 -99314
20107 -99314 -74550 74430 204306 -223124 -274043 3609 -236091 -6263 36147 104482 81980
20096 81980 -215401 276477 216987 -324616 -79965 4678 -103106 -228909 -173186 112413 -33886
20084 -338269 -75998 1809 -46730 234991 236104 -61213 93105 -139998 -411687 -51904 -375309
20073 -375309 95981 -94285 -140250 122749 -340369 -270433 -12440 10957 -142154 277978 102263
20061 -62796 -155579 -249548 -142209 -176344 19594 54788 -313125 168549 -286679 -101421 238928
20049 101129 -53616 -117596 -89754 -142546 30761 79211 10845 -111817 -250178 99544 -27067
20037 -121322 -10865 155722 75578 82040 -165929 -96795 132861 -157852 -444539 -191870
20026 -3371 117219 231392 124320 21590 72300 -19837 -377905 -49416 -113742 -18896 -210589
20015 -210589 -91852 159944 -299836 325374 -298579 91403 122293 -265814 207654 7753
20004 45185 -241798 -297416 284873 -31904 -125424 232345 -28977 -380257 189006 -195782
19993 -46257 38743 -97895 -53451 -259868 -64460 176847 502077 -122093 28629 -19270 63732
19981 -173571 -182712 158430 185023 22621 -154094 -183524 -363451 -237238 155906 164600 -182877
19969 40437 -156330 72196 86082 -57212 -59894 28342 -79828 -166000 162694 109804 36895
19957 -182201 333520 -209050 -436814 122733 -269857 170481 189189 202997 -5388 -125676
19947 -125676 67498 -16044 -181487 127709 -93454 45026 130603 -204506 -11338 -34046 47286
19935 76120 10369 -64158 98246 -129764 -66107 -188495 -198130 -245089 -152989 -52047 239440
19923 43403 -286046 -18259 -101382 -85623 -476751 99533 -30797 -118762 62712 -63217 -38753
19912 -38753 81109 -159119 97472 -8400 294258 -217643 -22166 -22511 -61017 -188892 -83368
19900 -232848 -29934 -61049 -33185 -89836 217935 -127302 -27909 -88740 -227693 -134727 110717
19888 -16745 -341620 -111772 96457 100511 103403 -269057 -102326 156425 -109224 -312527 80197
19876 -118247 -288690 -94661 86346 -552831 -97039 -167243 -181829 97485 -52188 -360288 -63734
19864 182840 -40317 137567 -85905 21919 -44758 -168031 -175812 -43651 -132005 -477063 -19440
19852 -150793 -364943 -354113 5298 -301459 -35454 -464512 72861 -20019 30520 141913 -19165
19840 -10854 -15163 -345879 52826 67779 -206551 136633 203197 -26452 -34248 -85674 111720
19828 446129 -302847 -159038 -48569 -151129 -103458 10243 -293688 -83171 156732 182747
19818 182747 -137919 88728 -118238 89222 -100115 98460 -362252 -21992 -138772 119964
19807 -191105 56395 -31499 -274923 -304654 -97258 71300 -147831 -132952 -37353 -39908 -264609
19796 -264609 -139526 60733 -8988 109879 -245819 -141233 110904 -231448 -116546 -7005
19785 -71343 158864 -327986 -1650 -198878 -340999 84551 -127894 -235218 30420 -66529 -64971
19774 -64971 200830 127822 -26635 -96326 -80554 159535 -124366 142256 89294 -242094 20699
19762 70013 -191654 233258 -55619 -201578 -117998 298419 -274785 -37952 104491 1218 -92623
19750 -207172 -211322 -38468 -228430 10156 121856 -285469 4888 5666 -58069 76412 -81513 144897
19737 162328 -357395 282399 171488 -181625 210923 -52963 -85064 169145 -231506 -205359
19727 -205359 -50460 191555 -42796 27617 102296 383682 -127923 4380 -268530 -45593 82604
19715 -30516 -128136 -137496 -428294 -377302 -405576 -21118 14951 11857 198373 -285126 158144
19703 -291112 -134261 108657 10749 -32110 -493392 81928 -76825 -332034 -127898 -239981
19693 -239981 -153604 57101 -125968 -24825 153065 -150929 -109606 -150354 101731 -9967 95381
19681 130949 54631 -40280 -264519 -45011 -22547 -66006 197258 255979 -66205 -134097 -109237
19670 -109237 49761 -62791 -4888 -231084 -226849 -2668 199726 99918 18732 123988 -79895
19658 36393 -187310 -119958 64771 63413 -114029 -294439 230475 -354699 277765 -145321
19647 -87655 63777 -59940 334389 250421 -254709 -121941 208790 -209767 30134 -226558
19636 -7432 -84102 -173897 -148734 -101283 -272089 139900 -156970 191102 -145534 -20097 -68369
19625 -68369 209985 -140372 50687 118618 -137438 -208453 -386396 -87526 142060 -74356 -155317
19614 -155317 169389 150652 155205 -153729 10280 -23359 -91179 -145792 -54982 -426374 -51616
19602 92199 174488 -97917 263850 7674 230912 18657 -30430 232065 -3135 -206618 60638
19590 49534 -386004 -168557 -372596 -9711 96635 56209 13671 -447213 144318 -248759 -69512
19578 -218866 13735 76627 -159718 -16322 78819 -12666 -182167 -271196 168078 -320288 -179394
19567 -179394 -360365 13426 -101274 -115779 152005 -141429 -374995 -195227 77032 -138224
19556 -21798 -37618 73177 196100 89437 -546190 -53621 298838 154826 266662 -189183
19545 -69566 147715 -226396 180752 -25127 -57129 -110619 304904 46811 -195444 -98067 -229549
19534 -229549 294498 -79187 -445649 -32226 -65530 -153792 -82561 -215122 5182 123007 86645
19523 86645 57915 -89403 -211185 -65352 76069 -73947 -254339 90590 -56224 -2130 -212544
19512 -212544 -16583 12235 196543 103557 -124199 112065 -337780 91480 -247498 21232
19501 83275 190892 100330 -107686 79746 -263222 -137289 -287078 -11722 -47693 192699
19490 -271354 15853 24620 34192 43756 -165338 160869 -58419 80080 -284347 173395 -45952
19478 272886 -138806 54611 -255556 -226932 -72814 -113436 -390979 -201662 -327476 -132318
19467 38278 -234552 233530 138282 -273155 -255872 60973 41265 -65702 -122467 -238201 -53491
19455 424455 -378112 -112001 186754 30067 22596 -156595 -205264 43349 157044 214710 -90145
19443 47772 -338272 -301616 -215359 -188765 -258829 210245 44398 18558 -272508 184159 -108573
19431 235473 160153 156179 -135385 -367990 -126217 123589 -210648 -54752 -588721 272936
19420 -459906 59324 95936 131113 -89400 178116 59950 73718 117883 -519 -57865 131999
19408 -23644 119751 -4207 -72583 -80280 -232372 -127097 -83008 -57605 -156829 -191584 -204756
19397 -204756 -255153 196239 -220801 149828 -135262 -122183 86163 -137216 -147573 -196326
19387 -196326 -231678 15424 -160651 -106899 -343357 34013 -371203 -182972 1633 -248224 -137879
19376 -137879 66970 -85546 148776 -99201 233953 -36202 -196315 -227536 16097 198160 -193736
19364 -1840 286492 -187814 -91008 -59017 -266333 -240104 -44016 -322977 -128426 -161903 -326066
19353 -326066 44037 56626 -256614 -15182 44360 21839 -25152 19027 -283355 -12467 -134375
19342 -134375 -200824 -115658 26236 325382 6928 -290136 -243636 11730 -301276 68655 -440147
19330 -178987 -240085 -304986 -621 -192381 -185935 -84770 -74612 -315032 -37147 -12850 238156
19318 -317211 83340 -210486 -22184 -15711 36766 36403 -134163 -104190 452170 162665 -234112
19306 -2038 -11015 39711 84437 253623 57029 -233331 -78996 -198696 8121 55958 99521 -133331
19293 250132 -361677 7090 -96502 11075 -95390 -77224 -135858 -3225 -226242 275102 -21313
19281 964 -86468 205515 -159446 -83279 9352 166750 -297692 188258 -10698 1292 201322
19270 201322 -59752 228024 -108914 271145 -135576 -123731 -2617 -121471 -46728 407292
19259 -266658 128416 -29669 -21265 -112197 -294523 324687 -76396 -75713 -218927 -63886 215833
19247 -144923 -103637 968 -321852 -98440 2819 -36885 147300 12129 -216840 164658 -115083
19235 148972 -322688 -273578 -202498 143908 -24499 -253334 -80441 -216674 -97238 67769 -157013
19223 -102398 -35478 -27939 115693 -18489 -187388 200142 -50298 -46284 -199537 -166442 70421
19211 -164546 -389376 121412 34599 -15761 -177900 -189735 79296 153689 192941 126070 -101109
19199 -280271 348363 18545 -64323 90523 -128212 47058 -502561 -73068 -76101 -283979 -137354
19187 -144257 -75097 -158591 -150440 -51845 17284 -112874 22781 -175324 -6573 -100509 113914
19175 -159777 -285233 -125650 17718 -117647 27149 -739 109459 -9069 -44512 -53589 -135441
19164 -135441 121549 -46880 -54274 -142052 21502 -189543 -127702 56313 -171619 -89404 -357845
19153 -357845 -143915 95649 -119182 51442 23432 45983 -121640 -37509 -32950 -160999 87152
19141 55462 70579 -194748 74445 130335 -108509 -101569 26216 14147 -274365 -260241 -119169
19129 -141574 280323 -17028 -20720 -141381 173282 369964 -60797 80526 -272389 140613
19118 -21390 -144419 119502 97843 -255168 -268667 -280631 -126608 87602 -92149 51325 -283835
19106 -249389 162282 -128138 215689 -136214 -146707 -162504 156565 -389088 -168983 -220216
19096 -220216 85181 98040 -13996 22561 128606 -106270 -434556 -38937 -29370 -230282 -251840
19085 -251840 -20651 170001 -125990 -142823 -197232 -79364 -23241 -103164 212238 98366 146337
19074 146337 309348 186778 -79414 -106387 159034 -40743 -94663 -147166 -61195 -365738 17185
19062 30533 -299005 6785 -82496 117108 -148658 -158763 -152050 -54164 -94004 -102014 -165688 15638
19049 273291 -48136 -353675 24746 30351 5700 -208509 305906 -114912 179647 -73503 153798
19037 62110 -145352 -114827 -143324 97650 -103217 158485 273209 -37667 -212436 91060 -51245
19025 -116 5434 -498594 27898 260008 -119246 -56228 160100 -217069 51482 -161235 154131
19013 -44115 -205302 -156273 -10517 -305631 -10616 -23591 -239236 -444600 50131 -208636 -53217
19001 34863 -132201 68345 221513 -138351 131329 -28882 -100931 -105140 -264373 -150392 196454
18989 -6233 -63625 48365 66538 -262893 103243 125780 34080 -69474 152050 172769 30180
18977 -76443 107871 -111113 -189931 46521 -132122 -155489 47738 -275269 -73621 66315 -182023
18965 215878 -89309 153196 -10577 108670 19749 -119427 161665 -57090 57360 149819 -214106
18953 3534 -44363 57559 -436419 -69190 30996 -63499 64641 283732 -239906 29358 -58794
18941 -58633 86116 68669 34128 89668 -177990 128691 249649 -112080 -70671 -106174 84312
18929 -173010 -6559 -90636 -17333 212351 66860 -2435 -113505 -18428 -243559 -229624 27477
18917 -29318 20847 -253517 -141576 -101006 192870 -600 -118544 -178829 10501 -4269 -242535
18906 -242535 113500 21347 128803 47704 -128574 -113696 -122474 -103438 67887 72856 148247
18895 148247 242790 91465 31070 75641 5256 -94221 224805 -304560 -127971 -268601 -154647
18884 -154647 119789 282318 -46592 -49382 83236 -50797 -278763 -134046 44521 239853 182052
18873 182052 210129 -228279 9365 -15524 -223038 -70842 -83497 -158847 -8924 -50557 -112839
18862 -112839 -191955 318705 11656 88218 -201160 -135834 215968 -117925 18279 93093 -78594
18850 279259 -197815 263141 363857 -97889 6016 -299646 53510 80707 -198367 -40577 11900
18838 -46127 84534 -262628 -53847 69426 -150304 313567 78003 240707 -198920 -257872 -65037
18826 -355241 99008 -181730 -165026 175123 183231 -187207 24515 -159481 213326 57167 4546
18814 -48438 285758 7119 273462 -252149 87236 117613 25208 224660 132453 306258 189332
18803 189332 -66980 -328042 -283144 -229391 -82319 46182 -87455 -5753 77756 -240071 -465860
18792 -465860 -357878 -52803 -86239 53535 -267253 124811 317543 -81815 -35202 60630 -156775
18780 -1817 -183727 -67593 -32601 -241187 -88183 -122141 -1270 -112221 -229711 265161 -221359
18768 -127012 -6270 141990 150432 71763 211560 84524 201196 297471 157182 -420939 259387
18756 -70028 -171375 95384 42052 -132610 -168561 64864 -53766 -322614 -82622 -189998 156581
18744 -18487 63497 -125853 -32334 -115834 -241724 242490 142644 -12539 -134470 942 -143515
18732 4273 167927 -104207 184829 79838 -54879 374025 -38108 -162096 -102985 -28998 -373163
18721 -373163 -199027 121624 -193924 -6832 35783 -58544 26942 16034 65338 195092 46205
18709 -163270 -182833 -387263 153337 98144 -56979 -11805 79714 242886 -196379 82230 -230321
18697 -64207 -193811 -17956 -119110 -244076 -368548 62999 -178075 -204372 211254 -109451
18686 -22529 -518609 26390 -118480 -284991 316006 218377 -252626 171948 -401117 234047
18675 -62197 -180277 7364 -288487 112016 -214369 -18684 -103611 39704 23826 -144719 -131344
18664 -131344 -29656 -14307 150254 156677 49793 -231523 -17745 -241991 -109954 -350441 162564
18652 -19519 -331139 -69711 -129998 -69988 -153380 108813 132619 59271 -120025 -111581 4629
18640 -93131 -24594 125702 119644 -176656 437263 133507 -104430 128849 -45064 -99553 -340400
18629 -340400 340767 -179590 -167467 -157774 -50142 -157773 -174340 -108562 -87998 -192636 133380
18617 -358625 -386728 158046 40253 -195094 -208221 -123258 157036 -179094 20001 -12329 -136826
18606 -136826 -197128 183723 -311337 183820 -153555 80878 302954 88590 -233910 -73790
18595 -14177 -181672 141892 -222609 61132 88893 -8586 -16790 -225159 12961 -60132 144200
18583 37264 -150904 216264 -64596 -35982 -35349 -141373 35141 205683 284032 327556 -285159
18571 -302941 -173428 81894 -36039 160653 -120838 182766 -117168 146529 17961 -119178
18560 -359869 -52414 -16457 -131379 -306359 -219509 127552 -89916 -122921 44337 -185935 53718
18548 -131736 81670 -242407 -174523 64207 213202 331581 -251143 -75865 306636 66145
18537 -14986 35907 85988 10957 -111364 -214957 -277668 -289727 626909 -69471 60303 -155069
18525 163188 40094 -137626 -138048 17271 35763 57609 -81384 -137231 -16078 -71994 -14558 277507
18512 104665 37004 -6594 22928 -412123 -26824 -168592 -159654 122737 305616 -134076 36518
18500 -2368 -594661 -102718 -97403 -476847 79468 113610 -293659 -146646 -147402 -191422 -75758
18488 -190204 -123634 -174687 136062 150917 379610 -50540 -229982 86246 217334 317444
18478 317444 -10331 -203226 176382 -31477 -50530 -131529 -137558 -107953 141911 -530914 179597
18466 185830 -220715 -121142 -277644 1256 -53983 -188713 105428 108915 -121847 126451 -123407
18454 -70583 -425437 -305570 -185692 -278871 -178249 -115491 48583 103305 12273 -31007 230677
18442 -190243 -45221 173514 -788 36774 -156145 -73591 133826 218113 119666 -19150 -233552
18431 -233552 -45357 339579 -275008 -86294 -221410 -76212 -463298 -276326 -143034 51422
18420 44359 -85263 -215873 91926 348224 -312393 -335873 -103721 -172968 -251732 -145698 -13926
18408 -3349 -360198 126289 224601 376029 -49323 -24611 -68053 219212 63583 -229072 -62206
18396 -80232 107873 49512 -78887 -224637 -248110 13948 -130742 190616 78384 -6676 -214504
18385 -214504 -163794 44256 -208965 -231949 -113263 -182238 -47154 -124820 -58378 -81840 -3633
18373 -154201 -230872 141984 -199120 -168964 282653 -225965 180900 180724 -74081 -196475 179982
18361 -40500 -58751 425360 -163548 -171717 75155 41572 -226517 23000 -30344 77054 -308419
18349 -146974 -147025 -111155 -41767 -437647 56753 48156 -63629 173057 -113746 154451 -117762
18337 280826 1490 -45032 76512 -301844 258295 -218777 -115285 -82727 -133301 -165911 -171715
18326 -171715 25457 102719 245084 235650 113560 -157613 -53762 184934 85819 -111907 -320752
18315 -320752 -174954 25879 -27395 -158788 -287995 55827 68776 73265 -56491 -36551 -249429
18304 -249429 -422414 -77080 15006 147066 61594 -16826 -72263 -113883 -173630 -86388 -152771
18293 -152771 25616 -72818 -184161 -470372 -2332 -38880 -24387 -22211 -192955 1879 51401
18282 51401 -84591 -116196 -248033 91026 -290480 142009 124296 34812 -209477 18576 -319780
18270 -38665 237430 65374 -164413 -55097 96769 33871 -118270 -105708 -45130 -240857 -93973
18258 -6292 -21559 173690 -10318 -135306 26482 -23574 91940 303335 115731 -114483 -116567
18247 -116567 -4108 -440174 4944 -234790 109074 -264498 144701 172376 -116906 -260711
18237 -260711 121445 -34008 -79855 16690 -197092 -167923 -94683 243403 43679 143208 148319
18226 148319 161151 -107458 110327 -67212 -73246 -140634 -18563 79422 -53984 36307 -28381
18214 231394 -118424 222719 152041 60623 42709 -40071 -44272 -380060 220057 -118024 -97698
18203 -97698 -81203 -188491 -129896 -310204 129811 -127090 -15376 -10889 -66073 -124968 -154212
18192 -154212 -175356 -127698 -72987 144257 132578 -112923 -261741 110003 -116289 -377030
18182 -377030 -102550 -146512 178620 157509 322184 -63735 283530 -306435 -118066 -92121
18172 -92121 -92884 -240583 163353 -308347 -360933 387059 -12747 -300787 288889 141475 109218
18161 109218 -138323 13708 286652 147185 -126784 12075 211438 -47196 -250369 -45913
18150 -107996 -103109 -276406 278934 61998 180427 75567 -62884 -88985 -253157 -53178 67513
18138 224100 86498 -61585 -182558 -17507 29638 -9509 -53393 132611 -153125 348215 68821
18126 -29089 88670 -206512 -152152 -159411 -168339 -156981 -72451 -44773 -188577 142402 -214039
18114 -276188 -43142 -114412 -81808 -154958 -415737 -336419 110269 -209373 130338 -288267
18103 -72989 -272563 89593 -65847 140946 253190 -427224 -81680 -140744 -79689 -238245 -256505
18092 -256505 38589 -116789 -43873 -194447 -300290 -130577 134590 -240415 122615 -129246
18081 -3631 -129872 277650 63567 -249669 78021 -23101 286779 -325295 20128 132149 161783
18070 161783 27399 245121 -261250 12735 -22749 -185717 -57692 -476878 -124642 116032
18059 -394463 -180515 -161057 -349286 286420 -164 43175 -52114 -244121 -288061 -290268 -216303
18048 -216303 -57742 143373 -171528 -161834 -442 -15195 170479 -107260 359047 -35153 -60020
18037 -60020 -255962 -29631 -35058 74951 -238808 92220 -46435 121644 283291 -129992 -103186
18026 -103186 61981 -161770 -55382 116827 -73210 99940 223147 330860 189101 36194
18015 159453 -175895 -437721 334704 202536 251373 -129196 -70874 -189775 -240047 -152309
18005 -152309 -317142 -26557 -40475 -265281 -126548 -206902 125426 137466 -21436 -272158
17995 -272158 -278854 58345 85320 -62180 -174543 -33399 -178583 -75282 -259545 -247363 -255995
17984 -255995 -14007 74494 -313873 -31359 361530 5619 85210 -151035 76603 40591 159367
17973 159367 35787 -77130 104921 166208 1213 80385 46017 -192214 -67535 -111056 82466
17961 97552 52115 -140998 148427 -100389 92847 -32257 -144312 167838 -13396 -129197
17951 -129197 -64089 -3989 -78183 504889 -77591 -53521 120104 -271113 -17474 -341770 254506
17939 7890 83118 103888 261495 -210308 38656 105320 -138030 163778 -74522 -33756 -158050
17928 -158050 -135158 -54184 -153192 -258559 146371 81576 75584 -556154 -39319 72631 93186
17917 93186 -72241 -193130 830 -10164 44471 14823 -88951 244046 -28194 -10845 -333402
17906 -333402 369617 -54576 -6141 39267 41395 -4016 -15043 76882 -145586 114277 141282
17895 141282 -71520 61660 -10945 48091 271134 49680 87358 -46448 -34607 -80377 34103
17883 -138281 -110377 32967 -74344 26302 -61587 60155 17343 34109 147698 -269495 -1806
17871 -190598 -18420 57305 -181500 60786 294593 -120555 -25525 155513 -110327 132949
17860 118853 -156144 -349941 -71698 165965 215032 138641 -231721 -228683 184386 -163301
17849 -183526 -116202 -12698 -24692 141955 115858 276585 -187245 -79985 109408 -262543
17838 34530 -38679 -125334 148493 -296059 22544 -81354 -180364 -197285 -71322 -355680 55078
17826 81860 66178 266282 167438 -48686 -165907 63861 -167618 231619 -61570 -114210 -94999
17815 -94999 -49920 41404 -149658 -217706 -277918 271345 -123456 3977 166914 110635 -56317
17803 245649 -999 -176944 180222 80940 -287824 -41414 -24108 -147726 -287326 11031 238049
17792 238049 -39657 -446232 -210491 51121 88641 -479551 -326770 35279 -56427 -88058 -13317
17780 -102024 -7322 14869 -18812 145604 295313 316508 133803 -205124 20779 457043 23357
17768 119342 -186153 -32861 235939 4499 -121499 266938 -119610 60014 92008 15611 -126875
17756 32665 31599 333772 179788 97111 131015 170624 -74648 -11506 -35577 -304599 -236363
17745 -236363 -120113 139615 -265593 264758 147353 -69004 338538 -62648 27587 56182
17735 56182 -235526 60802 4534 80350 221502 47056 33932 -258026 52292 73329 -308683
17723 10852 -68484 104020 116589 118166 70690 -76474 145056 -247806 -166378 218704 124575
17712 124575 -255490 149813 2941 25966 -42723 271192 220789 -46303 -114553 -444729 -165419
17700 214539 169179 96012 -157264 -106577 91790 86024 268162 -174740 11600 349617 -386190
17688 -101947 171582 -61558 -168091 -1120 61487 135629 78915 142108 -204621 21296 -63499
17676 -42433 76814 32186 -96854 48334 376085 273169 -43712 -330905 45971 45979 -38843 67423
17663 -63625 -28411 -42866 -88078 -271406 263828 -232090 -141193 -356867 287941 -367786
17652 206853 19974 -46497 -2997 -141919 124214 83946 15022 123636 -40232 -150279 -206607
17641 -206607 380611 12375 131611 -7684 -105613 157595 -12520 225731 198425 -366205 -168968
17629 354022 181859 -21623 152200 44467 -173537 27333 62841 207894 -72540 -274156
17619 -274156 -193155 352704 -28505 219798 -105835 314088 -140654 165836 131078 -58521
17608 -129695 -26827 43213 7125 -34297 222543 -119510 -200719 121700 88299 78576 -214528
17596 134345 282449 80211 -113944 -143585 121674 -216042 45967 71512 -102866 19603
17585 132817 -221549 37647 -58658 193263 -27661 -88727 -113578 161711 66308 240464 -247604
17573 243238 -108061 -13639 -156095 230919 69065 531745 343502 220805 204811 -18616
17562 249887 -19361 -44950 -93479 231171 -418948 55355 168143 305262 -319242 14824
17551 105891 36225 121184 125567 -38234 161321 -328621 6037 66053 172849 -41915 -122627
17540 -122627 -58233 10449 320626 173555 229695 -96625 227450 298051 -81971 199270 -391349
17528 -8437 39563 42222 -187418 370700 323424 15360 -189319 -378170 338030 17030 -16211
17516 184715 240648 90215 -125585 -97270 26769 151675 203967 -49221 -59093 318013 100969
17504 198939 47817 86492 -47262 18349 -55978 -49904 -107968 245523 201455 -78527 335262
17492 110391 46497 359126 -54248 581010 -59189 -168188 134842 -139099 138118 219451
17482 219451 251337 109751 287923 222037 301336 -146484 190070 313871 42640 160216
17472 160216 86110 182667 122717 307863 -74376 -5254 26541 -104209 139142 -166109 29912
17460 -64823 39437 -196668 374599 515022 189244 264414 247213 185588 290966 149581
17450 149581 330270 149258 656318 -118369 465158 435268 441109 309443 52625 332738
17440 332738 322302 -38180 339916 -127944 282156 6102 -122594 247350 182734 233755 308274
17429 308274 175784 405939 128983 291160 190960 551530 285109 308205 263409 -58728
17418 244760 201683 536564 295685 286824 471652 492885 401050 -118647 500072 105104
17407 -97389 187631 31778 36970 356812 113944 112482 -107988 279015 -88507 275619 -80237
17395 242107 163224 188436 104752 237235 359369 100280 368079 149374 370829 325039
17385 325039 401897 275498 23184 91147 156950 322849 -4290 -89403 -244055 -9407 22728
17373 230648 82690 137494 141553 191566 54194 414454 370672 77535 -261221 160159 398932
17362 398932 -85682 3435 48313 117613 83800 15537 105264 -54340 15882 258089 98977
17350 188371 618246 364002 217909 -165318 86300 -198300 46396 138982 64132 73278 537909
17339 537909 159216 46198 369865 80916 2438 93213 182075 18164 135070 -78169 286730
17327 84640 184508 109533 -81968 -5167 -18931 -10456 -151800 282777 161973 224915 247653
17316 247653 286093 205642 81672 238282 85442 164198 594492 290396 209983 283081 207668
17305 207668 69718 134343 161686 -11777 146446 90865 114172 80192 151594 240166 72997
17293 344738 332562 382549 203963 100248 78008 -7940 -8917 181996 79346 58882 -172454
17281 -44402 420937 311022 376982 -105714 -180932 -154855 -22851 -103187 -60138 211974 -57532
17269 104514 -202704 -64300 157477 54332 123571 75048 68443 -46475 72727 -16596 197337
17257 206116 168765 92468 415831 416318 291577 -155164 266258 43857 -204959 92009 -73038
17245 114399 245653 166899 323186 42080 153388 295866 138806 183563 437487 487720
17235 487720 335345 343114 140381 357469 166307 182538 198428 -420 261366 85830 115574
17224 115574 220550 150795 216366 345625 -7729 350954 105944 150848 295380 199038 427342
17213 427342 110920 78035 111964 12402 564048 88504 202264 117725 73544 242533 4226
17201 176776 240007 66607 305179 261893 441454 -80266 470479 -53012 41987 -127107 15128
17189 10474 -166434 296793 436712 307900 180847 192864 514032 18581 240135 247001
17179 247001 503716 296076 173696 521596 465249 263207 17862 301879 -206521 304474
17168 44849 431719 237133 -163836 -6332 210223 333817 449804 335698 223362 386621
17158 386621 540629 126599 118507 278685 301129 210290 165643 295846 201484 110416 219065
17147 219065 381770 446153 224250 370347 299614 191105 205746 467932 52842 269872
17137 269872 378767 111308 218384 260250 279871 37349 333375 345967 39488 391078
17127 391078 353822 190819 496103 538608 125703 527502 393162 410728 34582 248387
17117 248387 422344 293379 12636 304867 169355 278552 509528 49789 434906 220004
17107 220004 395596 231592 495399 127778 537826 232854 510334 504143 50489 191362
17097 191362 293810 276341 247852 81530 455297 171746 508392 247041 310466 438897
17087 438897 455773 251366 223916 326465 594024 224573 614746 483705 595020 471112
17077 471112 789854 94415 735827 384678 246620 421641 438493 325574 489540 394497
17067 394497 487904 626233 725622 279037 112600 428886 263920 369036 698891 427526
17057 427526 418188 555278 453494 488487 220700 479483 491415 499760 423960 370440 702924
17046 702924 358653 561334 632170 574413 104263 366596 575806 499466 625384 615914
17036 615914 484044 520088 20587 552116 583847 570894 748802 636049 686127 810072
17026 810072 553390 437520 459824 665730 302541 293347 434709 443806 706698 758011 568823
17015 568823 521140 305557 512145 682564 633029 554976 689516 590628 497067 576683 879027
17004 879027 525340 555945 554418 747396 1040755 555823 863778 738621 701826 1135202
16994 1135202 556483 871498 810318 717658 721357 757677 732036 917314 709755 268490
16983 600795 633261 1075858 1103901 789265 637628 647564 653266 857094 960782 1012900 718494
16972 718494 872403 747200 815120 916579 1126355 1099963 763190 596882 699639 705848
16962 705848 987233 694928 1160703 903995 1066825 765399 1076680 841158 952207 1010233
16952 1010233 877075 1172170 978889 877045 1328955 1024000 970643 1161054 1335964 888293
16942 888293 1013807 1305768 1367962 1171821 1203107 1065814 1470172 1208320 1006447 1402211
16932 1402211 1390849 1382295 1293957 1362653 972146 1077585 1448383 1335292 1411664 1479777 1508408
16921 1508408 1313715 1264042 1343547 1478752 1410457 1210306 1017276 1167729 1525929 1429456
16911 1429456 1360053 1552835 1467894 1438599 1378397 1366455 1563407 1523465 1605965 1506072 1544798
16900 1544798 1477860 1514324 1332954 1557917 1766994 1621241 1957413 1631538 1566198 1692540
16890 1692540 1992908 1589012 1848631 2013805 2041911 2099189 1893963 2134371 1975709 2233145
16880 2233145 2100901 1865215 2218420 2013882 2015076 1970063 2343606 2154895 1959206 2386030
16870 2386030 2246462 2298768 2342807 2560289 2308504 2369348 2421149 2635105 2655356 2322745
16860 2322745 2335817 2647546 2839650 2542611 2429845 2724751 2950420 2745093 2881914 2867692
16850 2867692 3097517 2794675 2830250 3001157 3189767 3428074 3093821 3273504 3061028 3312274
16840 3312274 3300238 3713582 3741363 3714676 3533846 3917112 3926563 3975381 4291571 4172097
16830 4172097 3961981 3974474 3977686 4535404 4685294 4509944 4716959 4350952 4737093 4305493
16820 4305493 5019041 4893651 5187762 5286376 5295600 5281039 5695744 5557520 5421753 5645677
16810 5645677 5973598 6212835 6470066 6239058 6829449 6407772 6807100 6590872 7147691
16801 7147691 7269777 7436277 7476544 7644248 7750410 8175683 8261858 8583927 8756975 9025504
16791 9025504 9240140 9417374 9625730 9694053 10101801 10261660 10532475 11082097 11583658 11676362
16781 11676362 11696328 12314717 12823676 13044615 13318468 13619066 14147775 14464684 15087022
16772 15087022 15712430 16392019 16269548 17372292 18130802 18481158 18990906 19919905 20424617
16763 20424617 21609442 22020014 22857433 23909979 24912176 25921379 26798314 27868738
16755 27868738 29414101 30674293 32233827 33382506 35100437 36350782 38402078 40241684
16747 40241684 42369988 43999507 46495462 48937797 51214066 54124053 56952096 60291697
16739 60291697 63825525 67378289 71238392 75241240 79577005 84349135 89382326 94530288
16731 94530288 100450871 106719367 113013136 119535897 126412081 133203389 140963041 148207274
16723 148207274 155319896 162287147 168951909 174704507 180200836 184322274 187582651 189382963
16715 189382963 190089355 189339507 187203251 183874795 179189551 173626362 167349363 160566813
16707 160566813 153075145 145302205 137550006 130123324 122294856 114858914 107864201 101447920
16699 101447920 94956467 89120297 83557139 78577632 73845532 69374308 65231238 61519474
16691 61519474 58157332 54497283 51270377 48809896 45950413 43574723 41041539 38956157
16683 38956157 37058313 35287551 33352051 31778756 30514671 29098716 27908287 26475605
16675 26475605 25226678 24413523 22859239 22208944 21500270 20439216 19956193 18917228 18121932
16666 18121932 17687826 16770055 15686266 15274323 15073634 14464502 14236868 13334709 13239677
16657 13239677 12697156 12078065 11744414 11447301 11104346 10570525 10735376 10226644 9565004
16648 9565004 9533720 9159334 8815964 9124153 8230059 8384043 8048666 7827452 7627674 7226812
16638 7226812 7381847 6882427 6911832 6781925 6622358 6301360 6333189 6221321 5708105 5840462
16628 5840462 5784474 5606161 5544857 5354724 5289896 4888247 4914064 4910608 4941534 4380287 4571276
16617 4571276 4266114 4267716 4186639 4036399 3904305 3890402 3971412 4060932 3758974 3771184 3369084
16606 3369084 3523309 3534229 3676425 3130126 3543528 3190888 2976316 2744460 3247559 3276718
16596 3276718 3183504 2658026 2736000 3037494 2837719 2726644 2840244 2828011 2209045 2508626
16586 2508626 2395283 2624317 2390496 2230359 2605235 2080115 2338555 2267483 2504561 2240099
16576 2240099 1858671 1937159 1987424 1888702 1860822 1789077 1663597 1822326 1890009 1905609 1831537
16565 1831537 1459497 1565235 1675544 1742679 1821922 1637843 1693492 1936413 1633644 1507677
16555 1507677 1662616 1505509 1466031 1589410 1405663 1513999 1023697 1491959 1348619 1285190
16545 1285190 1338656 1111188 1422521 1338717 836295 1087102 855486 1310910 1428620 1202016
16535 1202016 1151394 1443437 1327933 1506040 1276185 1014523 1137668 974908 965791 893790
16525 893790 1045339 1109419 1153253 1104736 738845 984839 1138003 666379 852873 924513
16515 924513 831389 884836 833230 929507 902039 1055394 608098 849483 809806 739453 829933
16504 829933 992524 761778 920409 620081 668827 835029 620001 786807 471370 716911
16494 716911 729876 895774 594707 726562 715898 510872 825493 389895 810620 545928
16484 545928 628954 553359 678363 564779 682255 694069 678611 338352 348558 451227
16474 451227 235756 449397 424525 461522 119420 597642 446296 905395 450605 461974
16464 461974 354700 280100 403782 804360 605717 400822 242542 794228 487149 554296
16454 554296 588161 542835 332648 527088 490127 500474 355985 523774 629552 446812
16444 446812 553512 424016 470739 293997 370891 185054 303645 463396 492732 414316
16434 414316 491739 303849 457848 280297 309118 509455 42300 79629 399925 202454
16424 202454 400174 190703 485772 605215 332612 357229 158046 141074 203633 512061
16414 512061 440556 268510 22891 738545 116096 311434 121101 390150 -135787 71962
16403 252503 428237 81797 483777 504143 574415 360186 411600 36396 186329 289120
16393 289120 442617 1200 -51837 247962 288835 204451 83695 106488 637959 211074 173305
16382 173305 276639 245675 250292 230131 166196 238445 379206 304547 56189 548857 -72900
16370 93160 316110 369416 101006 497386 141006 3609 428297 91478 387915 66608 155934
16359 155934 -45401 196982 -151711 162558 104345 55422 241192 109137 404854 108906
16348 413069 260666 171488 138217 182821 284091 34033 177406 254208 29844 201086 168155
16337 168155 -2344 3008 -92532 -419716 -17245 -57053 295333 -17315 -8227 95072 188176 245973
16325 245973 275522 -245871 284623 -26753 182806 140588 379326 326189 24794 293254
16315 293254 -53253 411883 43756 80257 -83297 162385 110270 188468 325533 236192 152863
16304 152863 -65742 345065 535934 -144354 -110269 49139 -268090 68040 219976 -178569
16293 129268 357974 -95266 139660 12108 86284 80089 121923 278275 -209396 310923 -293600
16281 176550 -26339 48891 610615 76150 -124306 136206 266215 -202672 43911 89275
16271 89275 95044 66260 -115087 -69430 123454 78756 31018 182736 661 80011 307743
16260 307743 103789 -69741 137890 134862 -229859 291040 131881 -54481 -28507 -200640
16250 -200640 -107806 -445803 408981 -45805 197246 -119888 -146311 288552 -17801 154585
16239 -418133 -9834 54194 28282 142994 178422 152759 -87100 229237 -12689 374650 210112
16228 210112 222827 -73649 -163910 29791 90251 199343 -159183 143478 -125358 166350
16217 192570 -276211 -192583 355511 292926 192699 -348647 -181457 188348 97900 254732
16207 254732 128145 -109026 145362 -85432 62647 15736 -256602 368141 -178896 -65186
16196 -30214 36589 251799 112892 276280 24595 -179215 17490 -72655 219853 -406496
16185 -91048 101779 -86860 169920 193254 -65082 238190 69904 -59459 -97615 -62543 -225175
16174 -225175 -57508 -166124 -183410 -274056 211616 -117896 155682 -346056 53436 124480
16164 124480 -284029 -174097 100791 239149 22031 292770 -62207 101833 -111771 22072
16153 -37919 -83148 216030 191268 28274 197029 42959 -90389 231995 -38940 57227 -118288
16141 158481 94084 -347773 203418 274633 28586 -193897 325201 -2732 71431 1762 -340626
16129 66299 -174536 -44659 -4959 -52406 4427 -72894 160177 49026 -209840 46068 -214902
16117 198034 -85809 24853 -68350 272947 -102255 155895 190411 -351447 -134448 78820
16106 164814 59898 26537 -177666 -112468 102923 15161 114502 -69565 -72536 65022 297680
16095 297680 190854 -93999 410696 22004 -47544 76473 -374917 -224654 89259 -120690
16084 201118 -113358 230839 2356 -287077 456687 229053 155521 -49199 -21380 -111064 -172845
16073 -172845 -70417 -128805 -253360 -344063 73899 -199237 50995 -61928 -50465 -268506 142212
16061 -62641 -49371 196982 396218 10947 -122270 -124140 441174 -55956 242995 254728 79553
16049 353663 153610 36533 77794 123554 -178748 -178387 -10906 -59226 121465 -164894 -339573
16038 -339573 2487 -28749 284071 -116399 -175368 184583 294742 88531 -27264 -108752 -121200
16027 -121200 -193865 -302704 -38004 142754 -225342 263456 141381 21981 -318423 -95070
16016 -170533 -213970 13979 -53652 130853 -237833 -300622 -71674 -178364 41534 -131000 248624
16004 -235732 20076 -58672 -67235 -82858 113018 224005 -64677 -28938 50820 260258 10941
15992 50013 169057 9671 -60945 -33181 -77539 463385 79927 -62829 175753 382478 300196
15981 300196 253898 542139 -177224 -109250 38762 -63437 -146618 -5556 -304080 -75717 30709
15969 -25933 15614 -295320 -68543 -407078 -245521 -63010 -146414 280862 65427 161516 106612
15958 106612 -253621 -223750 -316096 -306151 -316629 132220 -350189 108321 63920 -140881 -64388
15946 -249830 84926 162478 -14090 31621 45830 325056 -376460 285555 -22037 193494 343097
15935 343097 300527 297997 -316678 62051 150704 -167138 79019 160987 -305750 372412 -193518
15923 125117 -163907 67509 -188434 -69895 51558 -28966 -35007 25619 -196600 360235 82354
15911 98684 -454234 -453061 -37901 -199515 -207324 -126490 -146066 158401 101943 -123019 65831
15899 -42707 -178274 -27667 -184738 -323251 -213986 93360 -103803 -9795 -430955 186004
15888 143093 82344 -256175 80431 251473 59241 -36029 -37655 31527 215012 -167266 246833
15876 -148234 -156156 -38590 9160 32385 -316203 -40200 123351 10777 161912 -240755 -144114
15865 -144114 -52309 -129947 -323579 -178719 -18256 155333 -178656 -105381 1177 -56165 -63547
15854 -63547 -44240 -22676 89417 -251290 89133 -784 74185 125389 280107 136361 279316
15843 279316 -140423 38400 -105149 8815 79907 134962 -66893 327450 -158735 211496 34523
15831 122230 -140759 -78835 -118556 127792 -87031 -249130 -167155 121595 -234032 113821
15820 -384399 123378 -1581 16287 76750 -120298 -259494 165322 287063 -380231 -303210
15810 -303210 -108513 210295 -160650 102527 -19682 -457 16999 222125 305291 -227122 -268370
15799 -268370 50151 -97418 -120043 44755 -26054 -71379 -136995 -374966 92406 356032 -186249
15787 -114103 -156156 -3365 -160744 -134801 -192530 10673 96174 -39840 -162179 134519 39390
15775 16544 249989 107395 2806 -99786 61890 4691 -294942 -291048 -44634 131810 371555
15764 371555 -43563 118080 224103 6460 -100499 283822 -35747 314801 196552 -27073
15753 -177921 472042 261141 96392 3148 8829 -208459 220507 -108840 267371 98906 -245245
15741 35097 239183 -287148 -449876 82076 -135233 63315 33094 -139739 11759 -186561
15730 -103225 101320 3670 60966 164695 -110418 -120518 -422148 115924 -148896 -224123
15720 -224123 -89519 -339872 -18263 -64678 135337 -48414 -495994 -441157 240734 -30642 11269
15708 124397 -119081 35179 -13531 -173929 -128347 -17049 2350 -28853 -1815 -142648 -33239
15696 288880 90835 59371 298235 -217441 -95856 -29370 129980 -27302 229154 153340 -424481
15684 -234648 -55283 107160 -56513 72151 283885 -155475 -40650 -271160 -272106 -137864 27962
15672 78142 131570 264586 201159 247362 159425 -360497 120522 221946 -12448 -232822 -4898
15660 -115629 -96548 -193054 -153760 -369932 178496 19189 -334492 76301 373965 -165524
15649 109723 118196 401615 -78218 -231497 248252 125433 -73631 -42709 357367 144084
15638 -115896 218408 -97818 -226329 -25759 -233914 -340219 186486 7789 124005 -120895
15627 6504 219257 -65478 101405 -283416 -124224 31020 127522 1771 -91366 212122 336184
15616 336184 140059 -25593 278521 -96005 -9182 149298 -29525 132841 -144321 -34740 -77524
15605 -77524 -93815 -141279 -120935 -396926 -74112 22749 78890 -244401 -226703 -127192 -27379
15593 287324 82128 -127806 194938 -202715 -255416 251307 58892 -34901 -55845 -219134
15583 -219134 65297 -127462 31627 -52418 -34608 -355782 23685 247204 -319886 -251793 -237601
15572 -237601 -307286 -194912 -74701 99185 -106759 -340806 -95674 -105261 -5470 100976 93461
15561 93461 68020 1408 -88685 31947 71314 -422783 -79551 -79160 -44808 -111751 -340150 -38838
15548 -53482 40424 138136 -206381 158185 224743 -117588 -110667 -22614 -75404 -283401 307589
15536 -4082 252552 39153 67617 8701 191603 -163075 -14650 -155257 110468 3490 52947
15525 52947 -48795 174191 182256 -31559 207722 115814 136145 -389509 39650 102273 -197855
15513 -207804 185207 -45281 181464 2635 176363 63432 67402 103759 -108780 -30433 -38054
15502 -38054 282900 62427 -232914 -242457 158719 39269 2931 -243613 -112229 -159118 45613
15490 -56030 35976 41350 -108350 342134 -263129 -33406 -144864 84792 -155191 -238082 -104365
15478 143986 -383796 140478 -41641 -36333 -252641 -53415 122800 80412 145806 -35621 -211582
15467 -211582 -12199 -274082 -40573 76790 -133054 -6065 61160 225719 -279602 -51610 111938
15455 -8363 -103325 -239022 -181732 -59515 -136063 74481 -156758 -213596 297376 121517 -47100
15443 175713 -28619 137383 -133585 -223535 197020 -210336 1170 -141463 -28764 269416
15432 102579 -271680 -61 -72935 -109471 141140 142036 161152 45814 27532 -114131 -40578 13692
15419 -192717 548354 157058 57734 -220506 -242432 -327459 35194 106966 177405 6614 90102
15408 90102 31370 141364 46345 -171297 -32545 -39442 -109151 -133272 71610 -158591 -1885
15396 153043 22504 -106331 -29513 146931 190349 115254 65301 -149272 -194295 -301463 363535
15384 -183320 -77419 248921 -157323 -190510 -278908 -146426 82488 -277748 162493 276236
15374 276236 -163086 268998 -248691 -169789 -249778 87226 18788 10676 -116191 36442 382002
15363 382002 -78459 13021 -223377 -119971 -119014 12924 317373 59610 -72811 -131723 -113569
15352 -113569 51089 183820 -179992 -167833 -71554 346742 200558 8509 51219 -153471 -87056
15341 -87056 33198 161397 64627 126560 -198261 -121332 300990 -209534 136370 -153855
15330 119373 158174 -115168 196356 92431 -484870 -92523 55695 -194547 34944 -132378
15319 367224 154382 -124093 317007 21234 -76584 -47734 -127738 404486 138814 -430247
15308 92262 183068 -95132 265974 212225 81821 -123522 -98744 60726 121802 16726 -17154
15296 286003 -31735 48441 516750 159751 -50790 -39452 -330652 113175 -69848 -181648
15286 -181648 -175633 307066 -157472 28545 63042 -180770 -9696 -42417 338241 71988 -88153
15274 -54709 -70510 194720 119774 46219 -300805 6352 -11306 72604 35859 -102564 355313
15262 422912 -179004 342193 18806 -277421 121492 196349 48521 -245068 205640 -79857
15251 120588 212289 -111288 355835 303892 802460 1591018 1212126 1388212 1355645 762818
15241 762818 475658 191125 -523549 343711 -55350 -42182 -41004 160039 174590 98693 -460372
15229 354067 16915 -406674 -88503 -126708 147835 -43379 140359 44436 133383 63636 -277439
15217 437557 208094 90062 73202 73187 72939 29684 -116048 -237533 24728 68707 95204 -113389
15204 -32248 -226988 126701 169840 -170780 -184667 -87185 48285 -28775 162597 -199828 -97282
15192 -72774 -100132 333323 21498 121809 122265 112359 -30392 -345971 197167 288284 142688
15180 227247 308015 47700 -111767 173663 -107201 -122017 -123192 40135 26616 -99818 -1018
15168 -110252 455489 -12730 92910 41781 62941 74358 -86391 144667 -14726 -67106 347358
15156 139774 269657 -89716 321772 511745 132627 102480 125418 19765 -43466 -181210
15146 -181210 -154242 24175 265403 354733 45691 212262 124217 280621 411124 -136313
15135 253656 203572 -149314 -85409 149261 -210068 225645 71293 -94280 29277 157752
15125 157752 149717 20558 237450 342719 92671 435645 4652 247830 68650 42311 -148232
15113 -326213 8046 -4622 -7191 241383 -148491 182052 279969 96466 153101 103856 409511
15102 409511 284607 103914 -75214 -125923 151329 -108640 293681 110075 236491 338440
15092 338440 153451 207754 -112483 218890 164000 -26146 477089 83505 121152 -286794
15081 379071 2232 -180626 180414 67792 -145453 293509 -33795 185345 151980 105463 166129
15070 166129 215176 -45095 189782 254339 101041 227920 558381 -172467 64800 193792
15060 193792 164411 149446 141236 153491 -45513 491041 -19064 -178838 68368 121908 -113314
15048 -66706 -7060 -3692 162212 168835 197194 107130 3966 -88048 319609 -6029 283343 236443
15036 236443 275626 298174 137924 267574 142207 152443 215860 141163 179889 105659 -218
15024 35482 120572 241483 163069 189129 70046 -137457 28578 -112631 85079 -135684 -80281
15013 -80281 83353 32843 81646 95120 185448 128749 -71120 48922 160886 99349 51066
15002 51066 561788 158256 183073 -66875 -190445 516888 64804 2908 69849 269040 109314
14990 -212228 213074 -98479 -3813 283606 156538 -105562 112414 121915 232411 327005 345380
14979 345380 49642 -107200 59156 60335 226324 375748 405539 503972 298716 250798 165758
14968 165758 250350 243917 207155 26179 166222 358782 265172 97824 -269347 371397 250667
14957 250667 34644 9513 -48576 383534 -180406 -135198 334226 373888 401890 235369 132899
14946 132899 476967 -31864 191279 20192 158815 424358 361633 211131 614834 477172
14936 477172 224617 56057 3336 455979 282755 304739 168639 395079 375454 474530 267981
14925 267981 189924 304769 218855 506883 -77883 37597 74441 293920 385328 17109 208190
14914 208190 248814 418423 321686 383191 372196 257584 470847 254026 127359 472165
14904 472165 302229 305998 316428 280103 310131 137408 396743 246167 310820 239749 215863
14893 215863 475883 268068 131226 205628 497698 189828 306516 522136 233769 470813
14883 470813 544970 241219 132834 305157 410944 337912 151916 337444 372331 409459
14873 409459 455603 267890 348716 382205 538317 306373 480754 287730 352928 211107
14863 211107 293782 225496 273939 -29470 415566 773164 60829 477302 91389 518862 283034
14852 283034 -115075 187564 113794 199474 315774 476194 381138 450606 466582 239850
14842 239850 239672 785019 339025 533359 404802 608796 569063 367114 317186 408487 477376
14831 477376 361908 390311 515654 231130 152369 566254 391288 242644 455769 61262
14820 190663 659538 686648 611919 595177 158607 8338 418726 375028 365647 116221 147616
14809 147616 579861 655455 463600 351203 591362 169476 23070 412612 431513 322431
14799 322431 650368 532119 322667 433731 494953 601505 544993 280827 557731 497746
14789 497746 440586 683009 390665 512337 784655 223311 567033 691530 496333 458878
14779 458878 443407 495645 538745 544395 376917 832579 621534 675357 317964 429453 743314
14768 743314 758260 222443 304386 399972 464886 294350 486776 247707 558080 565956 615791
14757 615791 626299 517149 611589 758578 694290 624960 492818 595644 473840 709417
14747 709417 243778 583388 504984 392871 762000 275715 510136 438908 382668 666918
14737 666918 428260 342845 826707 627266 561303 500106 659064 394348 708532 1000842
14727 1000842 487126 506703 660987 782120 541223 656992 1002723 1162226 323360 930135
14717 930135 624010 544733 684807 452772 609310 637250 869560 356069 731677 940413
14707 940413 917629 577580 831211 786787 1115885 1046462 751264 845837 733222 829065
14697 829065 1051431 375120 656902 1190089 679354 835409 617037 562942 497071 1008322
14687 1008322 1116762 854945 847379 698151 546286 748430 922386 807410 751648 693160
14677 693160 586313 804264 1045960 1096166 862152 932554 1287393 671552 1080570 614941
14667 614941 723234 772192 985535 1023579 1002256 839260 1429507 912981 1030689 1041825
14657 1041825 756436 1047655 1198631 1076590 983613 1041759 882395 1278026 890187 529551
14647 529551 1033891 981308 1091971 1253296 948356 993399 730021 1056736 1091879 1320603
14637 1320603 948065 1393047 1249905 1201257 1086658 1166667 1276504 1177037 1433896 890787
14627 890787 1306675 1223722 1345116 1263922 1247230 1076507 1464842 1281765 1107697 888118
14617 888118 1048622 1253536 1156624 1484605 1233730 1108397 1464095 1164753 1292091 1140589
14607 1140589 1627781 1148944 1279055 1318247 1347069 1768875 1460216 1574853 1421310 1511453
14597 1511453 1246289 1709866 1384487 1398747 1441293 1345709 1234677 1323316 1500456 1469989
14587 1469989 1711351 1767617 1889393 1793254 1889898 1853823 1704272 1885770 1999004 1564989
14577 1564989 2049199 1884625 1777255 1728031 2267307 1896983 2072494 2231158 1719372 2095262
14567 2095262 2013174 2250056 2238601 2554825 2205748 2255037 2130099 2785252 2776058 2796958
14557 2796958 2960663 3031761 3275553 3464617 3211273 3984598 4326246 5615350 7326710
14548 7326710 12142270 22254821 36473477 38812400 19182276 9021488 5947430 4233229
14540 4233229 2503712 2046590 1817332 1767622 1543591 1506182 1542551 1894438 1967355 1972248
14530 1972248 1979752 1911241 1816502 2094053 2241435 2281793 2179309 2089933 2398888 2318182 2411244
14519 2411244 2398717 2478244 2296175 2055017 2526868 2636286 2341105 2300644 2172326 2360675
14509 2360675 2484792 2772549 2573439 2891571 2641918 3061142 2869006 2714205 2716740 2957975
14499 2957975 2862705 2981668 2731182 3032274 2908442 2603552 3182072 2896458 2722574 3144159
14489 3144159 3162305 3626893 3180852 3220785 3094220 3261118 3217766 3189471 3745839 3483408
14479 3483408 3439044 3480716 3358734 3719136 3827958 3636200 3885234 3758519 3873598 3765674
14469 3765674 3819499 3895085 4050896 4330240 4211458 4477846 4176643 4467415 4740700 4551091
14459 4551091 4108466 4334724 4626605 4645722 4643799 4270343 4549144 4693272 5030923 4978454
14449 4978454 5012302 4884177 5251828 5375073 5186234 5310693 5304128 5268460 5422922 5485936
14439 5485936 5416885 5583323 5609839 5784679 5541139 5738512 6020300 6037920 6093287 5778114
14429 5778114 6687368 6045411 6307036 6513685 6362981 6894143 6643024 6999224 7013917 7171547
14419 7171547 7041644 7011832 7535625 7401936 7501943 7674566 7636699 7909029 7868735 8373534
14409 8373534 8237712 8375675 8672015 8943258 8670016 8692502 9000092 9071959 9289908 9582480
14399 9582480 9599358 10087492 10290688 10247435 10208139 10175393 10842226 10722069 11105076 10986757
14389 10986757 11343865 11622149 11748526 12040413 12163011 12291078 12654899 13092726 13087640 13317372
14379 13317372 13533162 13828162 13830023 13921129 14521532 14714274 15387123 15322031 15810085 16163352
14369 16163352 16468568 16731904 17632946 17487989 17854613 18320122 19045162 19550378 19539079
14360 19539079 20039347 20558657 20820856 21172903 21841729 22280971 22886103 23251312 23958446
14351 23958446 24842766 25192296 25952053 26294716 27364975 27750204 28545678 29407346 30076333
14342 30076333 30682641 31639210 32755891 33362787 34384183 35314443 36690903 37553257 38870392
14333 38870392 40083566 41145657 42879865 43979848 45142892 46574884 48218885 49874324
14325 49874324 51242117 53085232 55111134 56737665 58786166 61071683 63354519 65517614
14317 65517614 68130699 71139905 73620578 76473831 79041985 82442125 86016055 89957131
14309 89957131 93697764 97570268 101895831 106532592 111494165 116925976 122250172 128411920
14301 128411920 134495389 140976360 147382247 154541467 162187634 170279113 178878724 188049222
14293 188049222 197838177 208025234 218795521 230164063 242316991 255032331 268171499
14286 268171499 281878378 295275135 309721428 325418064 340864254 356663852 372666871
14279 372666871 388560373 403973591 418886176 432992821 445821996 456944567 465345443
14272 465345443 468014266 464772725 464772586 463655505 465632447 462193588 456621034 446833477
14264 446833477 433510544 417935026 401504695 384179889 366745216 349231550 331932062
14257 331932062 314903164 298364267 282294089 267093564 253206134 240206413 227297325
14250 227297325 215053916 203499728 192687253 182503795 173108796 164381789 156233968
14243 156233968 148516261 140730571 133918488 127779925 121656674 116107403 111289749 106233215
14235 106233215 101264964 96502487 92815007 88991522 85787105 81959861 78174063 75165452
14227 75165452 72745193 69458520 66949702 64432015 62193297 59944123 57767555 55596781
14219 55596781 54029419 52105261 49945035 48559939 47246074 45724972 44471609 43229346
14211 43229346 41816594 40174567 39526942 38263173 37340298 36461983 34860987 33872078 33121513
14202 33121513 32360607 31477564 30580965 29852591 29055447 27940638 27720643 26904545 26475474
14193 26475474 25552303 25056244 24298833 23680273 22766493 22429526 21968070 21658467 20848691
14184 20848691 20570717 20223467 19797366 19547678 18705343 18535121 17875793 17571521 17478373
14175 17478373 17114990 16662822 16452773 15930127 15919571 15429176 15096104 14688266 14774198 14266021
14165 14266021 14067709 13886658 13579441 13168651 13281469 12636101 12508318 12203660 12349280
14156 12349280 11856895 11740434 11238301 11349203 11155508 11020404 10604274 10816138 10561897
14147 10561897 10522106 10094870 10185734 10007626 9692169 9461927 9421397 9157707 9452967 9056954
14137 9056954 8848241 8728311 8514700 8824791 8368554 8332915 8340125 7957115 7854397 7874859
14127 7874859 7617441 7824299 6803981 7480624 7047172 7234521 7296381 6990327 7089885 6654509
14117 6654509 6650381 6828673 6595146 6873743 6582264 6228317 6280339 6196829 6301037 6332891
14107 6332891 5856595 5720323 5765564 5455638 5719270 5607119 5388691 5319571 5522143 5433185
14097 5433185 5164242 5039114 5147840 4820905 5167910 4682619 4867672 5073364 4495892
14088 4495892 4596972 4465586 4676691 4521154 4311145 4559539 4323011 4476564 4047061
14079 4047061 4355956 4252920 4109359 4146510 4128229 4263292 4116094 4051988 3777908 3692807
14069 3692807 3669212 3502433 3761494 3575134 3419214 3337119 3781345 3713699 3448127 3517253
14059 3517253 3586084 3508121 3490310 3253332 3558521 3131953 3171881 3329031 2918522 3276787
14049 3276787 2781364 3023730 3144101 2786510 3115797 3065201 3043594 2820271 2958654 2968144
14039 2968144 2742395 2808443 2681955 2727467 2550279 2782986 2631441 2694924 2565761 2763860
14029 2763860 2811750 2552960 2836500 2619742 2795354 2356712 2175811 2338944 2397298 2071376
14019 2071376 2229985 2511542 2366635 2134515 2133006 1915808 2059761 2088311 2314695 2212111
14009 2212111 2052032 2218458 2179469 2335344 2389729 2168097 2092749 1775445 1666680 1740447
13999 1740447 2018991 2141580 1948537 2011863 1778020 2362798 2108255 2085481 2549131 2862496
13989 2862496 3713029 7582095 16642153 31143396 40702990 24574090 12314106 6906277
13981 6906277 4880437 3782423 3174349 3197776 2653622 2482646 2475226 1852826 2527880 2581567
13971 2581567 2228288 2167302 1966593 2247708 2041702 2083505 1835542 1584858 1708428 1973268
13961 1973268 2305836 1667823 1781621 1782817 1764464 1953502 1688947 1789390 1902041 1747433
13951 1747433 1936891 1479360 1709343 1769253 1806331 1723276 1537894 1709586 1469136 1384793
13941 1384793 2010408 1513505 1304693 1587058 1435742 1468219 1533565 1324756 1454011 1428964
13931 1428964 1314078 1662153 1425659 1571718 1752808 1551242 1761301 1339193 1629723
13922 1629723 1436844 1537426 974846 1251061 1413442 1104582 1466077 1452207 1202500 1334705
13912 1334705 1430110 1152091 1460279 1224695 1271390 1085547 1320226 1286311 1291897 1402528
13902 1402528 1217987 1319349 1145540 1215546 1017042 1213204 1504588 1094294 1165609 1305656
13892 1305656 1298470 1043460 1148911 1280341 1379242 1087270 1323944 1157359 1193239 1237849
13882 1237849 1206924 907061 1006687 1022468 1049237 1177868 1023028 1033058 918061 991062
13872 991062 883751 862771 1109533 950754 647786 1097869 924837 1027821 1044851 810973
13862 810973 1018823 1021465 797118 1248440 1071765 909765 1123099 907942 880409 870083
13852 870083 765448 727662 875883 922382 707392 806997 807128 1090388 802182 992486 784736
13841 784736 747458 1008109 876063 542767 1051368 679517 858586 753634 976023 684745
13831 684745 842817 865647 956374 316468 920619 723656 681894 689271 735970 673690 609435
13820 609435 883823 710784 329096 814124 678197 885943 662341 792468 1048347 838239
13810 838239 506371 743480 633648 678715 586991 814412 970393 697912 723170 549599
13800 549599 686534 806200 1028111 816626 647760 758410 427224 591885 876608 654250
13790 654250 753006 878363 1140126 932903 746564 242837 785529 741534 637362 685549
13780 685549 784366 592532 703564 710904 502866 753185 681281 585755 439710 523513 595384
13769 595384 628777 718752 529053 536327 716954 651715 474830 643664 772388 724783 446137
13758 446137 435137 835873 566404 527206 682969 481903 614219 544736 524746 702676
13748 702676 710583 419799 346400 553469 491347 534309 494595 618003 397771 648894 613052
13737 613052 174117 563011 498915 562398 434251 494660 450427 266929 202930 363568
13727 363568 524928 480100 525773 710888 842911 289740 576910 178602 460464 436444
13717 436444 513879 582714 790734 551385 58111 692599 549296 324285 498545 529589
13707 529589 396629 680720 649875 617400 477605 282630 483845 593113 631989 367689
13697 367689 576602 368124 552379 468444 668767 403367 146152 446739 149207 712474
13687 712474 339857 703183 556501 359194 465266 268814 471987 373216 316413 724766
13677 724766 371287 341053 535311 484436 293153 640285 624404 298700 572368 314295
13667 314295 575401 198831 483247 575948 358113 431455 330898 667354 454822 149193
13656 189247 482263 593556 210459 538788 339938 497900 656995 562449 597812 427298
13646 427298 95488 535540 232617 62972 654918 301196 566775 491559 436409 157853
13635 233862 360438 245831 543669 680996 252718 268247 277241 342840 323976 316916 503998
13624 503998 343894 260052 302359 283698 541662 503078 129668 293298 413249 371290
13614 371290 426593 536259 290559 514137 -30349 31740 493520 358445 16171 235791
13604 235791 27563 293049 328372 209248 148698 371352 310394 358470 621534 448633
13594 448633 353894 443152 83168 95759 184373 183578 306855 313839 279627 506640 304205
13583 304205 473533 156638 296492 183992 54146 127957 159351 355941 181593 323435
13573 323435 278417 353806 172073 463183 471233 521586 462914 327536 227716 251400 245040
13562 245040 418344 109306 337932 184891 224597 104285 133445 -32511 726703 38784
13551 378061 81730 221459 465014 175950 80638 244039 321387 308854 253879 355688
13541 355688 283830 330209 132070 402507 316504 -46231 364815 142557 70998 488239
13531 488239 96028 368685 184866 189235 278149 575753 233569 282352 240740 219868 417582
13520 417582 288463 458561 230396 270754 583307 272106 -5238 366053 357768 78114 92804
13509 92804 120137 232372 392241 289110 89031 278754 462819 389260 164088 199952
13499 199952 -36907 570265 154128 159610 284612 361605 459482 128899 -85444 397160 8671
13487 276765 619967 81697 244616 -27756 233813 191817 195169 -693 234925 534533 7475
13475 248164 361232 207560 -71512 148276 191502 293936 62400 15273 601969 95419
13464 115571 127342 163306 322038 598939 343554 373055 179922 330773 -223295 128590
13453 -61303 184282 127738 569965 46267 5576 104686 477868 68017 73019 239402 303656
13442 303656 379898 192911 182698 424041 -91413 35620 -59674 -18631 234577 53295 56449
13431 56449 264056 305896 1607 187272 260009 296246 -72617 -42470 222702 90765 338683
13420 338683 295350 406705 247635 182770 135409 108643 273195 308962 295374 70664 203921
13409 203921 311845 291946 392681 -10319 204406 628165 -3198 160751 49541 469767
13399 469767 456688 215984 -70061 31972 263034 132101 712904 46405 -5543 329828 -213554
13387 -12801 -238654 116392 137251 99749 407958 17528 55109 -1394 11870 112286 157438
13376 157438 191197 332453 51628 122482 248745 428028 207206 395244 343079 -2238 83945
13364 264585 -9098 -64189 135729 -18008 493114 304449 230466 335921 224254 245778 -98216
13352 1567 128695 -178403 243369 343217 350058 357072 98768 162612 234786 287500 8231 237760
13340 237760 -5820 382566 160859 688121 -43470 94618 111654 280004 64045 274504 132409
13328 370164 356278 167838 206450 334391 265708 239439 -95222 41490 83387 317321 184398
13317 184398 303084 10122 295057 395931 491036 200294 -92980 50263 247778 -58504
13306 146964 -86951 15028 13976 232227 254124 170298 109965 297712 31514 253177 82778
13294 -118811 -383499 216494 50643 -4615 -72573 -234132 -33875 121022 89512 55452 -22358
13282 46830 275378 119349 90380 332594 69495 305295 71122 172256 203537 237406 238551
13271 238551 21112 27228 111068 -68070 31432 -94623 -280604 -42129 346370 223716 -26220
13259 -37848 339844 352812 -2341 195217 293600 -48514 44259 19950 72829 313428 -391848
13247 98619 267725 342617 -39625 203062 74668 156605 192588 105601 22912 123893 -24274
13235 -12679 214387 29234 84169 68323 10326 412086 16228 -43624 13320 186077 -90284
13223 128219 211394 405345 503071 -159019 246587 459009 21891 357280 176368 351144
13213 351144 -75225 -200147 -177623 -13025 53815 -205766 -115385 -162861 -128370 169321 -100096
13201 124136 -225280 -57541 230631 -252142 372375 -8558 30735 17417 333265 341222 60039
13189 159981 -57486 99562 272897 -29061 -159204 -45766 155102 58835 306228 91268 344825
13178 344825 -75630 -39795 66771 -135046 -133444 91633 38916 134952 168773 -137310 291608
13166 296806 224044 -99626 32076 102992 445649 60957 559431 478260 260381 317927 268852
13155 268852 40492 221444 105238 492028 -42406 351218 159705 70206 -255759 134948
13144 -251648 -82663 71623 149888 48031 -226282 166796 2982 77365 393746 243461 253406
13133 253406 -61872 -185306 150654 -74390 15378 4685 -102880 296690 -4215 79114 -30101
13121 38354 166731 51425 260836 117521 -95517 -229312 73545 182959 -184336 -259682
13111 -259682 -161115 -5284 141537 408461 40739 211187 125600 4237 7569 -40695 -54519
13100 -54519 -311670 -27291 -162392 -34291 -222521 296538 66187 28060 -19462 255151 -9078
13088 12084 -236210 -64405 218641 51219 160328 95680 87545 129600 199860 106058 -24999
13076 225279 77873 94016 -7661 96202 291466 -123993 -37721 288337 152680 12794 281999
13065 281999 151392 19223 -70223 151348 329803 319901 161198 39880 -113356 243860
13054 -152145 64827 30734 105106 100823 84354 -57900 119983 40424 -82866 384382 258518
13043 258518 74927 -38485 125604 282187 168345 157711 135396 -113311 93847 200536
13033 200536 146573 103578 94848 143656 346969 92739 -118577 -213498 128102 73955 11216
13021 81908 32498 100604 -182208 -121961 -156394 -45812 443866 179192 50760 249562 -50354
13009 -173355 -258173 125893 407547 303604 -282396 149538 87870 352901 -141182 157256
12998 156778 22669 398544 -226703 70122 289740 -13187 268693 148917 -28859 192832
12987 -100498 -75289 -28950 15031 113209 174725 -152105 -170910 -37808 -97440 17652 12805
12976 12805 139411 -33916 -29341 -31107 94679 12385 96985 140385 226926 85633 11512 -30295
12963 39950 -17102 -74216 191256 -270575 185147 79065 28939 66677 130545 100442 301203
12952 301203 -936 50612 87497 -23181 -37244 17496 -58600 -22304 285174 -6839 -112083 464462
12939 -66683 375708 -58187 233088 190811 -2701 -7763 -77398 195748 78198 106453 159200
12928 159200 -337111 -100757 -424368 -96186 79393 140070 -84517 -103312 -83893 -11098 51053
12916 364742 -80655 -62550 -93656 325774 91620 -23142 -223879 15981 168926 380945 -268513
12904 -122608 -105373 25636 -222057 246681 283781 13544 125162 68167 -192779 -36432 408502
12892 107559 116907 -281076 27119 34549 119848 41017 50595 124797 10473 69715 27724 72946
12880 72946 48725 -53841 62569 69008 118903 54296 110924 309196 -86704 -109587 -275056
12869 -275056 -192205 -210212 89680 119383 49353 385063 -194207 233263 109203 195862 67399
12857 -138582 513017 -47220 -106184 150079 -283982 93561 340826 12966 -27870 -56982 -22903
12845 202512 -77166 -37753 -1062 -323799 110309 421077 94225 -60877 -70900 -61069 -69858
12834 -69858 340126 -244022 -62092 44311 95876 376086 -106262 85828 -322232 150053
12823 -7598 58610 47992 -455435 -77954 27416 321262 -23166 -141235 -12684 -116278 -159443
12812 -159443 -263628 365173 -181850 217623 -188349 -113700 -147538 74797 168584 -191932
12801 224425 -43901 -165285 271908 118142 15113 93960 319919 -14037 -38683 38964 -56575
12789 214525 -77975 -128545 -218377 -51310 -16559 32171 287516 220828 68384 223896 42717
12777 23092 76046 -120280 -40800 162591 85725 -408311 -23415 -279224 -320462 -77706 88645
12765 153571 -340907 -173033 194071 -145409 94845 52070 -233756 -357135 -207465 -9369
12754 -192561 20602 -85787 -196750 -22615 -100601 -291899 -7468 67760 194288 117079 113660
12743 113660 459633 139672 -85944 132211 115771 159933 -269903 60383 -70333 164567
12732 153246 157742 108003 193327 124662 206963 4131 -245594 318076 46909 -333663 206288
12720 121697 36398 27046 337379 -294577 -231980 -170579 368322 -126201 -35700 25579 57302
12709 57302 327934 244566 226154 406820 256594 137921 237249 196480 79781 -13232 247439
12697 85743 165063 -84929 174912 117476 -99893 246295 -207931 123723 147093 -284858 69139
12685 -130318 -297473 -11367 19185 206825 -5361 -58894 26399 273472 -224068 110970 174528
12674 174528 158627 24296 291147 -217628 -385533 1266 -117683 45749 132203 216888 33122
12662 4196 -54507 172229 -12679 -186633 458429 267313 375641 196193 -134150 305601
12651 -67863 164291 -128651 -461080 -41183 272824 55286 -81980 157110 180641 32064 303032
12640 303032 -253012 122716 -59626 123234 120832 285413 -3716 196794 204782 508238 414503
12629 414503 363125 258939 145684 146556 301059 389426 129868 244715 221485 141274 282835
12618 282835 22799 79705 -224585 322683 -146207 105654 -109223 -39382 256230 62552
12607 -144404 79560 246723 -64235 14407 -345445 -179145 -142688 294363 321017 180568
12597 180568 299380 300760 211852 8893 282500 306105 -73954 201770 167146 -75007 38937
12585 -89277 -32864 126902 -251934 -54394 -19859 -235493 -91127 118590 -164757 141214
12574 63781 -56980 79327 224443 238674 -230467 63660 120744 -45260 86262 133629 -94338
12562 153053 231534 26608 44283 360173 29977 -49528 349065 14157 89720 -114370 -236132
12551 -236132 57731 114849 76992 211571 237590 -280262 186556 -141392 -4592 319589 -119500
12539 101108 181393 188427 155294 459261 281907 41210 -101323 188242 -84848 537027 -441892
12527 245926 83501 397492 -115996 95196 211313 132210 -167106 59740 -3225 -152286 -82549
12516 -82549 62711 237314 -90492 7556 -137671 85799 176899 63073 197739 235989 159445
12505 159445 -119577 92284 -30283 -266617 110038 -251634 19374 6183 -302289 58755 -340360
12493 10561 229217 243172 -217540 -372493 -50482 173996 71851 51471 141965 -96507 196097
12481 35240 -372487 -139420 -74653 -262298 80227 344286 96888 337326 145998 38560
12470 -9896 -66806 214570 -52912 -167184 439887 18040 -237934 -45674 263202 -121633 -164624
12459 -164624 -200349 83572 -306783 299016 -48555 70447 75970 29971 282455 244021 -323132
12447 -159203 41310 83787 -63030 -127366 -128950 -16729 162962 -181667 -155812 31929 146412
12436 146412 -259086 -179294 92987 295883 -311762 317460 -53394 137247 -335896 342099
12425 375769 62539 -120103 -133256 172139 -403334 -290330 35464 427615 -64881 -101017
12415 -101017 101632 -196923 345149 -47899 120732 -214893 -274012 75570 219952 -124038
12404 -106745 -56281 1729 -258002 201030 -140290 -174763 -64461 -77252 -190069 -237836 -175747
12393 -175747 117071 -15948 42423 40278 285666 81284 -102000 13110 11731 -126816 46140
12381 160862 -232801 175756 -235641 420311 400226 -296356 7590 75585 77429 -196836 45072
12369 -92661 -169756 -59625 208241 165738 -64269 -84078 43812 146090 63259 252143 10708
12357 -225495 -248016 17132 -131133 234493 300965 -150768 307936 17674 -90173 -128859 -5619
12345 -123773 -202181 159917 67129 29010 -48211 24910 -194836 200182 18974 88974 -218316
12333 167813 155931 -93237 231457 13902 135272 74843 34668 28923 205960 -58796 14817
12321 18634 138690 -69206 52986 -38844 -76076 -27222 -274852 282341 266821 -200420 -145906
12310 -145906 -174133 -16962 80085 -47701 -173189 -347450 184272 150794 -24796 -36961 186670
12298 30010 -255297 36831 215510 -114826 268557 235246 -105012 100290 359953 126247
12287 73038 196661 -178095 -125498 -46107 469153 -405477 -105007 263778 119266 228305
12277 228305 430162 176121 223967 249949 -8629 423495 -311040 286839 221640 273186 61147
12265 -42873 29465 34635 444642 -9750 169855 81300 -34827 239553 -22534 152995 189165
12254 189165 59187 207675 39375 -257947 55271 218819 247309 311967 244528 -319386 117273
12242 201253 -220298 195853 -253225 290525 57 245401 198804 85159 131624 144471 374061
12231 374061 101145 31282 -150180 217104 26547 357796 328524 444910 149099 287558
12221 287558 379372 15501 121783 434619 291421 527154 -268785 -275311 74473 287421
12211 287421 390113 201394 -146828 -78264 35982 323741 -15971 128174 93664 129190
12201 129190 123333 468962 487166 450211 324742 -11560 244870 113315 115931 387503 -17696
12189 53822 122038 430800 318168 127305 -70104 174236 266952 17524 -54291 -35034 205615
12177 21141 226434 265599 -151106 53831 208236 305353 84375 -30344 160338 31952 300114
12166 300114 22288 -15223 42493 346363 166944 116915 175751 -238097 -61955 16593 -33610
12154 -233539 5093 184331 -25814 175346 180179 -220118 16423 -66427 9775 138053 -23853
12142 99994 57187 170819 -11179 -99100 19363 -119676 -187701 289567 60236 128257 110347
12131 110347 -117018 -11639 93931 106078 103001 1026 -85397 240120 141004 -135722 -39632
12119 231887 -158728 -74654 69024 -112853 384658 43425 300480 -93857 45853 -10862 -85079
12108 -85079 -65467 22850 90982 141055 39572 176388 213112 -131777 -103306 81558 -271699
12096 -439873 271282 -83843 -557093 152079 13766 198795 105589 -146284 -333756 -138490
12085 74166 -118985 -17285 -110449 -164521 212873 97026 36464 410176 400847 393676 849071
12074 849071 1861739 1683174 789325 126087 -42139 99024 69787 102279 178861 196547
12064 196547 -29795 180356 71364 -33081 -23497 211969 -71790 211754 -49258 249499 123523
12052 -248034 254259 -228722 151462 202118 -65041 124150 23805 145785 -190654 52719
12041 11896 442653 349423 8117 -146580 87719 46577 -74229 -93091 40248 -265598 -284853
12030 -284853 254214 187532 -181167 -263249 -159769 -158169 155919 123727 223756 -38332 102444
12018 -170063 -260465 -66188 -211889 161847 221322 34023 173167 57899 -40859 -127478 182096
12006 227376 54196 -213501 -244889 301976 320180 115617 192251 149329 -155542 106844
11995 -172956 -16559 219911 19723 -41736 -181152 130344 -290474 52549 -141605 24602
11984 177939 15603 6355 127314 -46556 -148839 -299056 26428 -49863 -303124 379325 -364234
11972 -15156 264106 -93404 -47544 30223 102243 -301898 -268082 -239658 18276 -34836 -93644
11961 -93644 -64868 22480 -10033 5215 25881 212135 122403 -339783 102015 122192 -108714
11949 387114 -47544 -227080 -323397 -176004 -441393 -126953 32187 45315 -127808 -5238 34538
11937 50295 -187652 -345112 102096 70791 -122883 28579 33963 -60271 133447 87768 178677
11926 178677 -106467 44943 21456 58385 -228200 -365648 14597 105054 107855 30218 -236900
11914 -351624 219778 200270 120249 188365 64231 -15028 -257520 -79565 83485 191617 222500
11903 222500 -220028 -61397 -197562 -100862 54490 -86527 -4009 26656 -2215 -32528 95794
11891 -262843 78886 -164888 -48533 -55831 155044 -330503 -34409 177735 -290603 17971 322412
11880 322412 -337619 -155355 -58475 74547 163013 262321 -396149 -123143 -129830 215401 40526
11868 32176 -122211 -46039 -30889 -174131 234956 -171015 -95208 -45848 -171664 77052 -406791
11856 -50870 98980 -194116 -248698 113011 -83041 180723 -124311 -111046 -248133 126748
11845 127959 -116259 55165 143669 317760 -8783 179753 178278 -71155 14576 -289291 114511
11833 -79657 -111488 -28836 77223 103671 -363913 29562 43595 -73947 -119547 -165540 142713
11821 -217016 -401352 -206297 -77984 -194277 -290615 95051 -74915 -249584 11432 162287
11811 162287 35385 -87367 -222369 30913 97294 -205183 -219996 -290839 -203504 250850 -273132
11799 216881 49662 -486898 -23368 -280735 110092 8686 8657 -121234 -34716 239437 -72150
11787 36243 -270782 -94718 -169381 243904 -26901 -329607 121175 152778 131061 74482 -129856
11775 143540 -283245 29150 -188615 -77356 239032 96774 -155330 96664 334794 -171273
11764 118560 -109393 -6783 144146 180912 130663 142618 -137235 136668 150036 24642 245526
11753 245526 56310 -78240 -225208 17221 -86931 -174402 -29403 -89653 -123821 -141269 -173901
11742 -173901 -36506 -24058 48360 -122520 -128674 -97710 54707 2827 173463 -61549 84515
11730 248994 -87656 167959 96581 246132 -102871 -184432 90746 285750 -183035 39914
11719 10166 192699 189298 -163620 62486 58350 38129 -83524 323247 -77392 88206 166730
11708 166730 106147 -173834 -428609 -131784 -112940 88497 208910 111673 -183724 7054 70498
11697 70498 33533 299414 -316728 -23190 82153 -69034 76781 166160 -74163 50062 83991
11686 83991 41812 -183554 91073 127813 -108726 95164 130152 -16537 -104964 59083 116346
11675 116346 360636 220017 136775 198247 -129341 41431 121624 -2250 -124616 -67890 -196177
11664 -196177 -77031 114234 -28164 88304 -204212 168078 -51092 129809 183442 -149463
11653 -108503 281835 144859 -81201 24168 17859 133618 68794 -1419 -199016 -96363 201696
11641 83235 90466 -237394 213067 -2029 -287234 51756 -110404 49273 9864 -58675 251530
11629 263272 71751 12393 65129 433212 31220 -4708 12893 -7995 155899 50710 -220911
11617 90653 203950 49669 -81456 23213 -183225 218998 -53567 -101919 230408 71781 -15646
11605 105177 65003 -53286 -50586 38882 60034 31150 5110 -63847 45139 46910 286838 -1176
11592 160559 183952 -80436 337073 72599 -166290 343670 142631 188018 93522 82644 -55608
11580 76473 69646 192423 193914 245626 331297 -28294 -20965 418402 230451 35855 187114
11569 187114 116483 64884 87187 186430 142184 343528 153507 -139973 -179365 5900 -120888
11557 112884 451653 -172886 98409 80173 29917 292911 72504 175673 123402 95585 -60195
11545 199308 352474 -12052 473807 77552 93689 -10051 -281738 -201792 230457 69960 328665
11534 328665 -219954 177752 116186 319270 -195509 20250 -76357 -46779 45599 -59615 127122
11522 38871 310017 125429 318154 5761 64588 -166437 118186 -144676 45110 322568
11512 322568 -32419 -85868 333133 258005 96522 -61311 92432 49651 88414 243692 351664
11501 351664 245148 167905 -35554 -109847 -73479 168977 419466 144822 113238 30097 178666
11490 178666 -69001 268184 467317 94583 219622 201143 722121 319876 246388 317593
11480 317593 348291 331608 -54714 412376 500508 -73506 315316 560350 70961 -83325 140574
11468 246677 -55777 181424 206469 121331 -173720 211190 254275 310282 -188331 269481
11457 210984 25861 -38344 251613 405507 -35426 8302 100481 -26651 94343 213524 24090
11445 -108320 332171 57788 -55720 -263319 409423 -36205 571248 -192380 44036 130773
11435 130773 -100248 286107 38136 76570 114025 -175934 63390 -246400 9689 178213 26615
11423 -181189 165201 -79029 73886 -124268 71489 25445 234771 -207985 216634 322228
11413 322228 -1270 214019 58866 -100996 44749 -93383 -46864 -42582 -140034 -79254 85482
11401 369058 63468 245120 177935 -166685 -134207 5830 295597 60673 -307258 33466 -38101
11389 121170 116934 43347 -131106 -124997 203650 329871 198098 -85571 -238 -305011 363293
11377 -64561 243831 365923 118510 26952 -182646 8228 -226425 14581 217020 -169352
11366 -129989 -122043 -421082 -220804 -274778 -260679 -55263 139953 -1862 52716 -246400 157106
11354 -58698 -208688 -285102 -40950 444929 -246305 45246 -82620 -50103 243748 231655 -76798
11342 -109982 232268 -282064 120299 -142183 69858 222035 125632 -4753 -170523 -189074
11332 -189074 -52335 237949 23916 -141746 -169951 250674 -103656 32094 124265 -172149
11321 266207 190335 -2427 -49040 19085 -97660 -178382 460272 -60703 -74157 120590 181834
11310 181834 -140921 133416 47519 -221838 86839 110130 156133 -70305 429324 -288847
11299 190615 126881 157367 -79823 -114300 81894 267700 -340423 127499 160812 -111269 89665
11287 17041 98871 2898 -223411 -171474 -80905 -257490 -200592 143 203471 -205486 -1899 -152849
11275 -152849 172564 -16492 18146 86319 89380 17491 -84624 -82346 285707 238726 -87202
11263 -199141 -27475 308665 198526 52366 -3718 73148 74463 -240456 300343 -77915 -262311
11252 -262311 -99200 -116645 -237936 33782 213568 90474 306223 46589 -278573 84699 -251148
11240 -49411 3051 -213708 -239943 -392174 -100491 251294 -33064 -314543 13204 -102173 -139988
11229 -139988 90332 36388 -114530 -185000 27366 -301719 162438 -241058 5727 220590 -121099
11217 43844 -113044 -223692 163292 99081 -179317 -398717 91030 -131142 -100606 -188834
11207 -188834 -362771 -167675 129600 -8672 -272567 66029 -270620 -588716 -212148 256001
11196 -438932 -17296 -177325 -69363 -241662 -145217 -46483 -28729 -203186 -117475 -132323 -88557
11185 -88557 -11456 122191 39355 38601 343466 102017 97417 -49446 -21978 -3969 -82908 -242532
11173 -242532 -439095 -273935 129475 -185577 69044 216617 -198301 284003 156056 -60598
11162 -72522 -113763 215639 -70212 -56313 -20554 -253755 -157286 289372 76938 49351 -150386
11150 -111689 -4632 -26319 207302 -412460 -158977 -127933 214164 -269667 -48424 118787
11139 -412799 -128253 -20605 292571 173493 -384146 -80971 -64830 175469 -21548 77867
11128 97916 -19618 119620 57900 -5438 10526 -140467 256421 -85948 155562 -127806 267298
11116 418459 339993 -39146 100635 63177 186021 247960 440496 423296 241654 104568
11105 198707 -33694 9333 185815 205721 519862 320203 280859 46171 23368 120893 23956
11093 171649 292643 407143 298406 224762 197096 6336 194098 326392 251030 215367 357306
11082 357306 165581 81864 201144 204730 858386 488561 321422 585250 117642 145011
11072 145011 366364 226966 280243 599009 202045 720670 382937 613922 430712 482569
11062 482569 714135 818659 712603 706345 448254 829572 756592 781251 1117916 1077571
11052 1077571 826145 793225 1111555 822690 1232061 808355 924143 940895 1025575 859733
11042 859733 822703 854467 971781 1099341 903239 1037844 1472254 933859 923478 1037026
11032 1037026 890372 547411 953866 1009671 721942 940370 796072 723878 1015254 1099849
11022 1099849 871747 886043 689736 846726 738092 821234 719429 1069998 1281239 582770
11011 772533 783371 929833 568219 794776 727089 795909 959115 654403 866674 1118972
11001 1118972 612026 925161 978196 881984 935864 1377103 753151 910543 866343 613273
10991 613273 732438 952449 788624 1086733 832583 1118880 1236942 1225988 1223066 1273213
10981 1273213 1073639 1875459 1743070 1684205 2108930 2226968 2542810 2828357 2848846 3508408
10971 3508408 3889467 3810750 3777471 3932178 3551359 3275751 2649473 2464823 2362854 2147651
10961 2147651 2046679 2162322 2375702 2010402 2050798 1978246 2053011 2008828 1680175 1502273
10951 1502273 1019333 882078 1265821 675021 835862 452396 782595 321331 188722
10942 188722 240644 321718 321708 384016 374499 48352 72351 146586 357974 -124506 13653 349256
10930 349256 191148 57285 248494 -34102 -183276 -13058 -329111 580336 53802 395063
10920 395063 219653 289939 106303 -45686 66434 -358288 13639 -234504 -16740 9671 113358
10909 113358 -154895 280737 85154 209522 138436 -47395 -159234 -38734 107070 -282002
10898 -2979 118930 -51256 199804 -3445 -245555 -76009 407766 -335532 62997 -160671 267140
10886 197970 80392 -56607 26170 -230581 -269730 335069 -99200 -75628 69348 235721 176613
10875 176613 -17208 73549 -118177 74921 260768 19394 -11364 102976 -148175 54848 47307
10864 47307 90102 212677 321415 196408 -198885 -206753 -39119 -136719 3191 -63287 97869
10852 340663 -26306 380063 -16066 220467 -12669 212602 -125881 56755 -86566 266784
10841 -185561 -49324 -8499 -49362 82006 117149 215970 -135917 -35770 43289 -379735 -105125
10829 -159853 -343201 -172419 6299 60790 -56973 -363908 -114815 -314327 -256185 104472
10818 -154924 -172978 32636 94178 -137784 -12432 8160 226132 -252933 -171431 -189619 -214407
10807 -214407 -358794 -53538 320347 -163180 -203739 -139592 -364023 7344 73265 -266659 -51625
10795 -74219 128687 165362 -112040 188587 43102 84250 79393 -564884 -263935 -139311 -220335
10784 -220335 -398496 -100665 33662 -84619 -221407 -93587 207053 -74569 -157615 -64960 -270258
10773 -270258 127923 -187375 -12001 -249201 -103854 370447 177108 -322700 -242828 -68577
10762 -80589 -65233 20239 160877 76593 -112008 -285877 -173719 -179213 -73038 -75159 -42634
10751 -42634 -214787 -73942 3433 -111310 -107637 88937 -114539 -159872 -21043 -273214 10703
10739 98648 191534 -129451 -179203 -271566 1743 -172026 239408 14132 -227578 -182661 -11416
10727 32467 -47964 30251 -53676 115877 261320 -207638 -217356 231635 -106843 113545 170158
10716 170158 36210 -33536 -149247 31974 334290 -185927 -5206 -17812 75858 -30775 -247364
10705 -247364 67292 15160 -89984 -122844 -183851 202354 -143044 44620 -78896 11005 -177200
10693 63442 304278 506164 -142508 147171 -247488 -242844 -243402 -224435 -190068 65074 440045
10682 440045 -25356 -141238 -254871 166100 -467667 37032 124694 -176962 -118191 -171142
10672 -171142 166160 123527 -13278 -41439 11250 -138680 6432 196909 -116204 -97097 151143
10660 -464104 -265419 -482480 94555 188694 -183279 -9874 -284453 -953 79116 -57637 -157343
10649 -157343 -157347 44390 54358 293751 -141354 -261731 -39096 125246 -303751 104565 38059
10637 25127 -71216 -503009 22314 129223 -237469 -52934 -208199 221452 -84799 -71780 -49709
10626 -49709 41060 -184018 -273082 -301254 432906 -136743 32926 -33148 -372277 -78323 -79142
10615 -79142 -515785 80881 84745 185022 -3890 -272697 101321 -188112 -46675 -34568 -172178
10604 -172178 73059 199535 64246 388225 499436 6185 146882 -12392 -37010 92439 307964
10593 307964 -48578 -158766 -313039 -10847 -21672 -215437 1244 -203017 -92156 -105170 -370334
10582 -370334 109211 -36589 -225196 82385 107686 -389487 -239128 306945 -413198 -16849
10571 111509 -20861 -137078 -149059 -243570 -288876 60712 -8682 -315119 -124238 89347 -106278
10559 638896 -217639 -140425 205393 -350318 185474 340422 -48712 -329426 148861 -163106
10548 247286 -482484 -57956 281825 -170998 183953 274907 -16212 57839 -226791 96871
10537 68738 171578 -532282 138416 25584 348542 -174146 -28514 219032 -151505 -9914
10526 -28994 -157769 -352889 56342 -52648 285 -50648 112135 -114891 -121331 -46257 -171583
10515 -171583 -328340 77368 -149962 98726 16872 141643 -343434 29197 -24440 -138417
10505 -138417 155527 325025 429995 -231334 -173527 -238504 65263 -213425 -21849 -65675
10495 -65675 96993 -98316 131678 28643 198469 -73263 -269955 -33109 28802 326577 -83779
10483 77366 155101 98002 426693 367384 274454 228508 334352 142596 126495 -103288 -18783
10471 164369 -134689 198347 -176933 83294 185707 273729 75422 -134234 29 -102885 -429970
10460 -429970 -156429 -214740 7829 -173152 -123108 274387 -4792 -93357 -353980 -171090 314530
10448 -176790 -19194 -483058 -158741 -154834 194512 -193456 -141754 70880 -46701 -115034 -54234
10436 -107527 -74433 110217 433170 -286446 -814 -175409 130138 42245 -312064 -385781 -50585
10424 -359624 -245145 15574 145971 195523 324448 8899 21577 -222118 -203885 46463 43989
10413 43989 -187517 -133306 -79827 -104235 87491 -126830 -314601 -402196 -264537 87370 158590
10402 158590 8901 33744 -73681 24924 -399858 156951 -373400 203751 170101 -61801 249929
10390 122198 426728 331054 231703 60723 232967 -113543 130788 20572 24981 225928 234031
10379 234031 187304 145809 133360 768101 501295 51756 286205 414314 77591 400145
10369 400145 107786 413196 549882 315864 576648 816838 596510 274627 490227 28915
10358 533786 159109 538417 202571 293579 128224 296673 594405 812199 744554 940409
10348 940409 535535 635255 681558 406298 16461 417281 399798 351968 246113 71007 473550
10337 473550 459092 380784 -11381 252134 442081 -38781 209331 -164259 11738 338030
10327 338030 207658 -83284 2446 51301 198536 371076 578441 80259 84065 35293 225378
10316 225378 206571 405825 123670 227974 73652 -19242 133179 -7851 24711 -122606 228207
10304 -79796 28448 316636 83181 -177713 -83881 141092 -178692 -80584 60256 27294 146660
10293 146660 287271 -134648 33640 -178387 -22213 -191634 -75837 -345342 -202359 319696
10282 78927 -125441 -17094 134513 -280142 62973 109267 -167345 -40407 -180325 96981 98720
10271 98720 -51133 174766 196738 114351 318080 -233846 51156 328182 279847 213804 444033
10260 444033 100867 259440 -59755 160625 361946 137426 644870 -293413 233223 226184
10250 226184 -96594 -65303 -197075 -10415 -142531 37945 -112705 11852 -33105 -14159 250740
10238 -202071 142426 52167 -196342 56150 156295 154983 -34521 12378 -206038 -296842 -54771
10226 -204010 60193 -60236 198582 -126045 39654 -198541 -69929 -140919 277407 177962 -68093
10214 -197104 -187296 -110355 91050 -125327 -103210 333850 -346539 -127666 -346269 -180213
10204 -180213 -97451 -133442 -79290 -177996 84521 -77387 20674 -229894 -169530 138529 261116
10193 261116 -170910 169299 -135354 -47256 -128177 216995 -65173 -299047 -174302 -502795
10183 -502795 29406 -169807 -94981 350642 34608 35073 -145863 -298807 128892 -310525 -46035
10171 30960 -51425 -196701 -275774 95915 -32451 -106407 242383 -259397 29638 -427461 -65519
10159 84432 -503314 -64683 162181 -224689 -219289 -201798 229438 -309157 -232021 -136539 162962
10147 -350965 40382 122249 -102264 -126599 -93965 -164820 327361 -300633 440763 58744 -412686
10135 -65349 -87877 -243253 -86574 -186197 244888 -20507 -99984 63871 -379128 122700 -278999
10123 -54912 -149312 -32931 137354 -73982 356612 323117 -7120 -19591 239385 -92612 -224417
10112 -224417 -133675 -23587 127090 -108050 86537 -112107 154761 -99578 268220 -115766
10101 74233 -69603 -22322 -126062 143931 259677 -213690 -49987 -224039 -352294 2423 199233
10090 199233 171859 77662 -298588 -375945 125174 48647 4075 -54768 12284 -169791 -642477
10079 -642477 -147951 -285559 -143933 -118578 -536509 97409 194653 -190103 -192000 107385
10068 192118 174128 -218586 -151163 -254047 -203653 -276992 262909 168474 -144222 -63063 -112306
10057 -112306 -241048 147926 -394960 -52900 108751 333996 179753 -266958 -221345 -249306
10047 -249306 -89903 -31938 -241703 -366515 -107999 -71178 -54994 -69999 155554 -252 232383
10035 -34820 -205428 -136956 91286 -149199 -128992 -179864 104158 88039 -372999 7804 -263211
10023 225931 -64853 101770 135333 -6457 -204555 -20601 -278 -72515 27783 -82654 225131
10011 -199556 -216200 -234758 -101145 149400 -77363 -3777 206779 -7254 -126894 -234746 127357
9999 -149531 -88245 239872 186289 -105925 -94116 -183821 -78152 38072 -183841 -45695 379
9987 7812 -14132 -40214 2182 -107459 102017 -247677 -58735 -190993 85601 336092 24186
9975 -96959 -192889 -223301 68580 -339552 -29239 -91506 -97316 150734 -30861 -99492 -226268
9964 -226268 -261402 229694 141950 -97822 109368 -168728 421100 -196569 -114011 -53235 -232666
9953 -232666 -119839 47772 -50379 -78907 92892 55545 287893 -190987 -97889 51877 4536
9941 -524343 -374816 38817 151083 16059 -328004 80363 -248809 -165946 -16243 -7518 121867
9929 216932 211575 181384 -225269 -92755 29851 -28031 -320989 -24373 224612 -61191 -285520
9918 -285520 -49679 100922 8636 -178817 192989 161647 46891 -296594 351655 -258268 342783
9906 -76471 65440 -308029 -103256 285758 -103500 -214792 158989 101420 -189651 -147458
9896 -147458 -368970 -106463 300797 -205552 -155690 -143041 111551 -118230 -305961 192311
9885 -58316 -30078 -236035 -320697 -32082 -53658 51457 -222350 -196449 173355 -78424 52705
9873 25384 62212 -308396 -343040 2682 -169409 -201668 40035 -67980 -119734 -9420 -143041 -97855
9861 -97855 -549962 -7070 -190583 -224869 -20963 -222829 -101477 -316157 -11867 -34499 -261484
9850 -261484 -96018 267546 -197261 -98588 -216944 -90705 178297 -288226 -145381 11248
9839 -105301 105088 163387 -77758 -248690 -292682 87634 237984 4583 23515 266657 164843
9828 164843 -111378 -230143 -111908 -254552 34213 -71691 -139069 198240 -86994 19509 129719
9817 129719 -405500 49782 237917 28668 -327563 -183355 29745 231017 -193666 -148287
9807 -148287 82035 -102333 -350571 329554 -68367 -14860 -306894 -49693 472241 -239430
9796 -45828 147818 143095 -353299 -89186 -115506 186670 178261 -325857 -293502 -80837 86049
9784 -72714 -167619 -176925 -168493 63077 27444 -10355 -221440 165466 -230495 -269155 -97673 -445271
9772 -445271 42558 54164 -59821 -6935 -24564 213442 -336929 -24912 -310454 169939 -151898
9760 27945 309657 -82864 -86208 -256430 -86320 -254751 224650 -239459 123525 -133718 -389975
9749 -389975 -180302 -206164 249784 200391 125086 -208928 -347162 -78563 42996 -463582 129033
9737 72387 -156759 -212781 -54857 -280735 -104242 -204812 -8141 23664 -76194 256792 -215224
9725 -92879 -187738 -180130 -22529 170598 -155490 278044 -213855 57911 -444631 -66615 154594
9713 -370698 107707 13797 -92949 -135565 -326688 -43276 159471 304716 160902 -109398
9702 78716 -62635 110708 -88953 9254 219189 54216 21834 -332445 -117159 25644 -166801
9690 41229 26303 93388 272662 -397800 -96347 -351124 72588 -20477 197503 -22850 157070
9678 206133 -66140 -136112 -384479 2169 -164928 -107649 127747 -150122 -308908 -199198 -4150
9666 56636 -188963 -183901 51820 -237892 253294 128935 112039 -153062 -261143 102877 81760
9655 81760 258061 -339241 -158043 87435 122122 8958 -91018 -35262 -120209 -66086 169316
9643 -415121 18342 -35234 -191324 -244384 -118013 -147718 -85718 333577 15082 -72739 301038
9631 -249016 -197090 -67703 135947 -109993 60069 -110082 58067 -88714 118305 -29446 39620
9619 89670 -44798 -166113 -150369 -301350 -91046 9289 -110891 87888 -200212 -14554 118022
9607 -120618 44899 14851 -223613 -165680 -107299 -238160 169471 -147995 -82086 -50934 178425
9595 -370448 192286 -43182 -241843 111936 -123236 -232028 121915 -38894 175445 -140400
9584 -14353 -392041 93225 -53991 -138397 -347719 105214 -253722 -69457 -346 -87156 -317725
9573 -317725 -60045 -11997 -306691 -321788 -30630 116636 171656 271490 -54228 -208149 -53422
9561 298621 -155578 -11445 -192001 -265419 112960 -224915 136220 16512 -374173 74052
9550 -147017 -71127 6468 7176 -175953 -247821 95807 -173932 -14689 -327673 -19283 -158855
9539 -158855 -55504 240391 -149838 -234424 -76693 -109468 -147653 543242 90978 157154 -244474
9527 5592 215988 -165163 -131210 98284 26618 -318021 293167 94433 25584 24069 210619
9516 210619 -4183 123839 74002 -146638 -136504 -65410 286433 -226829 18008 238660 -110448
9504 156256 -112966 -134771 -258564 -29838 -77158 69945 -205701 -80585 -118839 146204 -40637
9492 139616 -30143 121741 47177 43389 97827 -30143 -43295 4988 -209066 -36154 -39470 -150648
9480 -150648 141465 160501 85576 -81871 22531 66405 -332188 242450 -15978 80084 510539
9469 510539 -80311 15433 -108536 -96229 -147114 -133209 55091 -314643 31727 -198497 -54405
9457 -110661 193761 -89289 225309 -202401 -10525 57368 122396 -291063 -98681 49129 -4690
9445 -171281 61619 194415 -180937 -265126 -170142 221949 -104353 -332046 27290 6666 -111963
9433 -309262 -201771 138084 -106421 -288360 -371291 189098 337134 -50122 116028 -203724
9422 63304 182749 -159987 -211275 -96703 167718 84002 37817 -314469 -424470 -87786 200071
9410 65082 -39907 -134257 -140732 -230308 -308910 -146698 -74870 -209758 -291665 12572 73027 144345
9398 144345 216046 115777 31457 105396 -221313 -264060 -69194 85299 -197279 -14462 -137169
9387 -137169 110956 47947 -19317 -262695 24236 -6265 -175780 12902 -329583 -38442 233461
9375 17890 42393 -44033 -51487 -10203 -129636 -447766 -13042 -133328 -76211 -166484 129485
9363 99010 273839 -37759 -15227 197127 -294988 -130531 -409735 -249486 76626 -214659
9352 -183544 75265 -40492 168399 346842 -63668 -190752 301326 -235545 -25000 -205587
9342 -205587 31195 77229 -163334 250936 -85876 402772 -69852 296959 53627 95042 323448
9331 323448 -346664 122189 -20116 183192 -32871 -63945 -121416 -108884 -205856 -150252 -167189
9320 -167189 24888 -239820 5822 75787 16910 63251 -89772 -134674 -140984 -57211 -129080 -152501
9308 -152501 196476 -105878 -344708 26089 -34341 134052 144418 33880 148335 120111 -75106
9296 67296 -121673 -164551 63180 120366 -226283 -254286 81614 210371 -113835 -57110 -59519
9285 -59519 -320926 125854 -73469 -1461 114981 -143823 -60968 312088 37349 -118524 14400
9273 1803 -303042 -51561 202595 93060 258040 -241710 18309 52635 -270581 -120495 34204
9261 -175541 260352 -127057 77381 -21469 217208 -224876 -123371 6419 -26065 -112199 -268719
9250 -268719 -77676 -242313 -274209 -190578 -177697 -237553 2085 -321608 -278064 -112823 -22538
9238 -221891 -30907 -65564 213396 94081 -77985 -119399 21212 98626 -299204 -3534 -34416
9227 -34416 -80272 -9041 188219 -87557 -183983 46944 -131951 -195582 -132225 -120325 108311
9215 -95808 151842 -82168 -119105 -124911 96283 -387724 -20191 -68768 -184957 257085 -88600
9203 -90729 -61497 240109 59680 -111675 226063 -483544 -182129 -139605 -278495 -82398 116981
9191 43558 135345 157872 -92163 -301201 -247291 -278719 5058 -250293 -46960 -229970 65969
9179 -122294 -231060 -145031 -108639 68639 -315750 -158329 45081 -153339 -89506 121978 -153381
9167 131018 331846 -174240 47522 -141671 160066 -103400 22069 -301245 -318549 21065
9156 -120549 -85181 -230280 74695 -231500 227850 -53476 -35993 -147211 58690 -82248 189661
9144 -292700 -57279 -72908 87903 -51049 -143934 80964 -2434 -147189 -186504 -186723 -87980 51743
9131 -42494 -302009 81291 27705 -86756 -217953 -345410 -309098 176353 4846 54518 -33599
9119 11416 220205 85647 -219511 -12051 274415 -6887 -124524 -340797 69497 -80063 -27552
9107 17174 148284 48007 191216 -94485 -210093 44797 -231150 -215314 122466 108001 -187929
9095 -143973 -218372 92529 -60213 -16036 -132318 -11285 249264 -1016 55778 201405 164087
9084 164087 -197683 -220952 26924 42831 104897 -238754 -62837 -131422 -212193 -6095 192755
9072 226919 -48071 341845 -62215 -32371 -165977 101819 -211474 7633 37311 76709 -118776
9060 -193654 -126695 -124409 143407 18659 -376352 86045 -34632 4588 38630 13475 -123547
9048 -30202 -193937 -154890 -14322 -304001 -92370 -214040 274038 -113675 -62277 -29461 -201354
9037 -201354 -104023 -224773 169552 -429899 -18525 -103913 -108794 -498968 222410 94591 301576
9026 301576 -123501 39836 -170721 -61900 -329949 158217 -153659 -16370 -89491 -24203 -366042
9015 -366042 -140408 197038 170031 -132535 165967 -128860 -116142 51092 107308 312527
9005 312527 13568 -173917 -133393 -36776 -27618 -72455 -169401 -182432 160254 170544 -69214
8993 -100421 -4305 -435253 -249614 -102908 149142 -83535 -189491 -58016 -40790 -147290 62467
8981 -322485 -6502 -29576 161759 18469 42230 142741 43667 -102570 91064 -267654 -3050
8969 -151155 -147961 124797 20657 -169604 -193756 -396852 121323 131122 -242271 -221654 -178564
8958 -178564 -8351 50586 -145519 -182608 71912 -18499 -26986 85334 -144371 -236772 119243
8946 -168745 120060 126673 -56322 111029 203474 142490 182410 189219 -275769 13674 -31316
8934 189630 -191890 134086 -108083 103022 -155546 371304 156326 20331 488876 216753
8923 1210564 3265973 6864173 8134646 2665521 1034572 137555 354508 -228920 7863
8913 -285957 -131900 -376458 -196566 -255222 144581 268453 -58858 -37021 76314 -105286
8902 -21917 -134663 -163128 -3445 -98661 73552 -188553 -326545 -85020 258162 36223 -102824
8890 -2096 84880 -247941 -142034 239887 -129145 335629 -488419 -123503 -285403 78980
8879 -83722 -270688 1656 -36772 -324971 -82508 -226679 -220741 -221019 164664 55673 356926 -3225
8866 -50351 -263941 89405 171825 -1149 -127276 -65649 173686 -248855 -14888 -57866 -211597
8855 -211597 -194152 69797 -166196 159905 21352 -196546 -65937 100220 -238784 -109383
8844 -131408 43791 -8591 -133627 -145301 125445 -138385 -185058 -37856 -218765 -362436 -149707
8832 -148322 -60818 -174306 -162668 -17285 -67997 -119246 -44176 -197367 -151863 -46771 -32177
8821 -32177 -101469 269116 -414567 64240 -108800 -236888 -21378 -64211 -9931 227247 -121459
8809 86319 -117180 200675 -6470 117441 -37429 40843 7505 344207 -56050 -252316 -136854
8798 -136854 160944 159684 -438730 56507 -104691 22441 -430843 -31223 -242120 141801 -118993
8786 85109 -21871 -213673 257455 -141135 171283 65290 -246527 -454304 -200646 -142231
8776 -142231 -96544 16742 -293975 13490 -55608 -36193 407983 -115416 -341423 -156073 -198157
8765 -198157 114997 183130 -67193 118506 57327 -155226 31056 20953 -19238 -35248 -37223
8754 -37223 -266004 -121045 20804 184141 -294637 -214462 -240767 -31358 44269 -12669 57918
8742 75162 -89311 237006 -50711 -257177 -200902 -267890 -160605 154713 44720 179184 -74547
8730 -34776 204184 -89922 -558825 144297 -137172 -114857 -39758 146941 -287263 1180 -230435
8718 288495 -41896 -22028 -70774 321172 -162672 148261 76457 -271055 18072 41049 -26125
8706 -193537 64676 -188015 -133619 -169639 134038 24199 -154328 359112 -136899 -275816
8696 -275816 86113 -54685 -42851 12113 22073 -203280 -15533 127802 -112704 58814 263834
8685 263834 58817 -201921 -315631 -339756 833 -142716 -326601 147704 -52975 222934 30139
8673 248809 170005 148245 -82002 117267 -78359 -124745 -202993 -47106 44592 -1722 -271643
8662 -271643 90186 25515 -232233 -124321 330130 -49208 -68662 -222400 -260853 -99858 -257253
8651 -257253 -270775 -113660 -275562 -216439 251848 -7577 383928 65041 155489 -244484 -205606
8640 -205606 2794 -241359 -124165 -176146 -186423 -147619 -130654 -106113 -305259 -11428 -127289
8629 -127289 -217767 -103656 -172527 27305 177077 -76283 -223287 -275765 285798 292717 -130613
8617 -265015 16574 -50919 -119774 -104564 52749 -101055 153457 38705 -198261 3334 -249428
8605 -187809 48154 -119527 3485 99616 -141720 66806 -64565 -138731 -207372 8013 230110
8594 230110 122649 50337 52357 237790 -114446 -2635 -54445 -194381 129195 -61454 -357876
8583 -357876 115204 -28830 25825 226101 -234533 -87387 185396 139419 -450812 -184332
8572 -47133 -187661 11257 77540 231156 88069 -271599 -8100 102617 -161149 200573 17984
8560 124890 -185325 -213707 -364775 98117 66221 -341167 -24773 52108 -91823 153398 26776
8548 -220592 100087 18333 -255691 -66868 8967 -276436 -292781 -283754 124994 -96685 -140047
8537 -140047 -230408 -120025 -9211 -41003 -19794 -199514 166055 -48218 -13583 -192036 86081
8525 140263 -158752 264735 -22716 -1298 -121631 -11571 22499 -6666 -134937 27176 -82473
8513 168706 -229187 -53433 -333869 1857 260205 -114555 -214444 -251856 -205612 31636 61199
8502 61199 -42610 -93221 -328040 -107904 21001 190434 -64134 100899 984 -106124 -56658
8491 -56658 -218797 -3037 -86239 -30439 259808 -23559 125711 -69427 -229562 -302346 80658
8479 -101911 10618 -28727 -64796 -110251 -185231 -441119 -320484 171827 40025 73697 -27253
8467 16727 72766 28280 97920 -69714 70440 21527 -116564 -69790 -418322 97358 -116379
8455 44232 169447 -20029 -13672 -235771 -125433 -399595 -173313 -224205 -220646 -115741 117753
8443 432264 -62250 32811 -91469 -65449 81500 207002 -235993 -49508 139628 63887 -269713
8431 -176148 -260966 -289706 -118854 171205 257787 -207845 177092 -18151 -82693 33569 -119454
8419 -421 -89118 9320 121467 201672 -281834 -65029 -135474 -243963 11603 -87698 -47940 -45936
8407 -45936 -46791 -211016 165591 138586 83200 281887 -20149 11063 -50004 -409612 104163
8395 61520 5634 -66863 20799 -162906 -187392 180308 134998 -46812 104934 -132705 99768
8383 -111084 -13888 -22865 68832 -145548 148833 -89420 38278 -73282 137301 -121027 -264736
8372 -264736 83089 -112177 58484 -375765 211519 112205 -50656 25756 161834 -55498 16213
8360 234777 -131761 160049 241354 -231914 -77585 -55495 -333501 -73914 7671 128793 -292264
8348 -97510 -268764 -29490 -108244 -474345 106145 29825 -27182 -61889 -111485 398948 -156688
8336 -180504 186116 -231537 -127505 50708 -125760 40082 155119 33741 194008 -4838 -418120
8325 -418120 -71261 -85952 220060 161661 -12666 158893 132256 265007 -229454 11134 -474720
8313 -275242 -197815 -147326 -302807 -52892 -206673 -430689 173186 -132892 -147917 -97223 -157528
8302 -157528 119962 -273812 -157560 -57181 -170264 340976 -17138 -147218 32586 52409
8292 52409 -205015 -494773 -16466 -108412 -67650 -65221 35068 -181574 -27892 -396728 -110125
8280 -40194 153404 19427 -208576 -116233 239384 180827 -120443 -150254 -255103 -170618 -2291
8268 -260632 85937 -55437 56768 -264995 -43652 -214482 -333473 -95491 -1132 -206999 62032
8256 -414174 -383825 25220 28655 42465 -137604 -48224 -264089 -127530 44970 327803 -78498
8244 -269781 -330967 -32652 156396 -157087 56375 -128622 -149554 3359 2643 -111248 51794
8232 181152 118108 3432 -67852 50767 -211324 -79704 -52770 -202740 -307188 89393 -56360
8220 -74577 245398 -127095 -40579 260450 344075 -61593 -101020 175599 -3714 -265805 -117565
8208 -86340 -271076 -4890 -311550 -212218 -76936 -232268 -316513 -249718 -530251 328928 -130085
8196 -65685 -156533 -187510 41895 -289702 69699 -125885 170665 -291537 28565 160177 -137793
8184 -74458 -33560 -362404 -146881 33877 -60901 -39471 -255899 -189108 99576 -152244 -321432
8173 -321432 -23582 -110315 -195124 207392 107170 268990 11676 -246851 -82591 -146481 -216487
8162 -216487 -198906 114843 218646 36153 281562 -76344 323434 -46500 -108207 -33680 -42060
8151 -42060 -265311 -150052 -107634 171386 -146366 25615 163100 117418 65921 -59835 -119667
8140 -119667 105755 -207119 -241327 -83790 -323957 -34680 -42113 101094 125380 -57525 -339585
8129 -339585 143105 91483 -342634 -56286 2777 211723 -222673 229489 155200 223283 -77696
8117 -160777 -96820 -141097 166330 59200 -89636 -424137 -40915 69315 -155118 -83295 151100
8105 -81954 185958 -294381 -192149 -91511 166528 34909 25916 -11379 -5570 -241664 -193531
8094 -193531 -327312 -37236 -357809 -310144 -24319 -151469 -309736 155798 -274498 28090
8083 -443358 -176390 153958 -88871 37924 -11920 -316308 -67433 -18999 3456 31678 65660
8072 65660 17094 219282 106779 -309304 -46592 -174362 89200 16041 -186117 3711 -179669
8060 178150 -67206 -88958 -136427 -41169 27131 69239 338287 -55662 137078 -243686 19509
8048 396770 47208 -46239 176683 -69910 -193083 452086 -239431 25669 -16559 -326650 -128960
8036 78036 300099 186733 43432 166070 -72057 -262913 -135644 -75725 -41069 -29445 -238258
8025 -238258 168444 -145000 -481141 12119 7231 349939 -20635 90166 -314858 -471961 -78429
8013 -104571 -142214 -121724 337065 -123763 104181 -314686 -57241 179374 182180 -188350 -101728
8002 -101728 3279 -210525 -13663 125429 -188723 -16791 593965 -337309 -109359 24016 96628
7991 96628 -5763 -88748 -3252 -37929 -34227 -133822 -88432 280894 53301 -170881 -93742 6939
7978 147199 252286 269461 314861 -274074 -239955 192765 -363169 221921 279590 57438 -74993
7966 16641 -177807 174561 69929 -404382 -192226 22046 -83761 251845 -132297 127945
7955 -13350 -310153 90140 263674 213410 -314678 -169976 -38769 -258827 -13089 -32806 -207283
7944 -207283 96749 135752 -205778 -36866 14023 -249059 -148700 -229385 -107433 110208 -203823
7932 -68136 202509 -175693 384845 13447 20745 -113794 -249032 -205419 -236526 2435 -136290
7920 -256832 62486 -62760 336585 675 -135968 31096 -213350 62118 -7318 81201 146541 78099
7908 78099 -158118 -271239 -225148 150909 -66295 -123201 -259653 -217925 -27452 224426 -144520
7896 8854 76607 -231864 -213513 -49519 90969 -38992 5479 -69639 62333 76112 145505 224210
7884 224210 -141695 -141741 28115 -86232 -251860 64367 67310 -4687 -108110 -356406 -94189 -91267
7872 -91267 -38507 -34166 -173657 -274660 -91940 -185843 -153161 -100342 -85196 -228739 183237
7860 -172063 -49365 -88562 -9517 -257774 -145116 -190681 25495 -130362 -95036 75317 -213120
7848 17357 148352 -127496 -143027 -106814 -659945 -22188 106040 -29543 -181108 132697 -61627
7836 -133037 -59861 183726 87829 64266 -126333 -169333 -60672 -167432 -278811 -32940 -373834
7825 -373834 35033 49632 130509 -32523 -57749 -83942 128012 -61757 -159125 524419 -269764
7813 17961 -381876 149154 -12963 -88951 -132258 141499 -239997 -51721 92448 -51421 351626
7801 -14092 -199160 458163 -78457 -95637 1740 -407760 -221226 -7852 33259 -305409 104819
7789 -68581 -195793 -149426 -131783 196166 -117425 62057 31943 379606 40333 -106108 98952
7777 149253 59354 59430 -153058 -204238 -146582 -101817 174772 15381 27778 -241457 -352993
7766 -352993 16769 -30636 -88993 22349 120121 86063 68835 -208670 -94123 142538 -204351
7754 4081 255036 209532 -200146 -178401 118481 -375819 -24458 -126991 347859 -308783 -202293
7743 -202293 92325 -249497 -154972 4361 151597 139727 223791 38471 -27876 -137765 -286832
7732 -286832 -96331 -185121 -119837 80201 -180291 387813 257048 -178930 -143960 9325 -2472
7720 -22518 196708 -98200 -171397 -405329 -28557 44968 12330 -113579 -18273 43410 -84622
7708 -298916 49873 74153 -100397 -174158 -63798 50972 154919 -209507 -153523 60719 -297004
7696 -132729 -413353 60974 -302012 -105660 173150 71411 -184524 9534 -175438 -91365 112370
7684 -106049 -461602 -137868 8948 317784 -61359 -359571 -48097 -110194 8608 37982 -426054
7672 -146712 -70588 -145736 -157864 -18338 105934 155350 3971 119282 -62702 182887 -168256
7660 89914 -95616 65026 -120166 -109053 190763 17227 238098 -105322 -259229 36895 -407515
7648 -197610 12919 -138033 -289101 110319 17469 207243 -409016 370244 100079 -266457
7637 -108039 -245433 17902 -220447 255499 431483 -992 -139107 -118337 14824 -1429 -109875
7626 -109875 -198211 147686 -284983 -239597 -62780 51402 -394505 -259400 -367623 -201231
7616 -201231 125629 74948 -323058 -124387 -17805 291597 52557 26558 -57497 -119527 -141070
7605 -141070 224834 134868 -308080 99237 -278874 78937 1837 219351 181585 -69424 -4292
7593 254851 2199 -40734 -268406 -7233 -57373 -94618 46943 -44814 55932 65390 -253909 221277
7580 163991 101315 56614 -137125 -111553 129634 -11455 -215598 146284 -215697 -203727 -18250
7568 142164 227040 -290857 -281278 -179823 -113570 84442 63779 -4854 -45644 -95160 267330
7556 -159774 235115 91250 85329 -105729 -119579 -138242 -40918 -60021 30549 51301 238224
7545 238224 -278755 275722 254641 -115418 24883 -39040 -32686 143936 54464 296772 -299838
7533 325492 -123352 -40253 -119949 24625 -72604 -22111 -291533 -357672 -139115 155109 -59658
7521 15948 -37687 140395 -161605 -38840 -149911 -44670 -21503 -5629 -117477 73379 11363
7509 -285649 -108183 -412080 -1816 265641 -205879 75735 76600 -23277 -373567 -49596 -85798
7498 -85798 -14091 -25507 -99300 -65057 191405 -345668 -36970 -239556 -313234 -280580 23988
7486 -288190 48668 -205843 5324 -26431 62551 -87503 15920 -141979 581462 -387073 280433
7474 744 311184 -26677 -309000 88413 -407783 -56303 -15618 -20503 -46393 -94509 -55603 232965
7461 120400 -117837 -173362 -55053 -12131 -215757 -207012 289121 4509 10932 -396096 -117796
7449 29955 30006 -33097 -275533 210990 -16111 -349388 181862 -228572 346092 15594 56279
7438 56279 -56795 -15979 -113238 209354 99790 2539 -205382 -43574 -71632 -41003 -195930
7427 -195930 229516 147961 -359434 69311 -209598 -147049 -235993 -248275 16193 -146968 -572906
7416 -572906 -194692 -69567 -441583 -1890 -83124 -21217 206819 -13972 375582 387956 -135520
7404 112351 -55767 220095 135200 -236742 9112 -234822 22879 -235495 -235997 -181961 -2760 97309
7391 245220 -36277 -21546 216650 -4172 306250 47012 -57396 240011 206522 53214 -64596
7379 -235882 182592 -293278 100889 -9129 -327860 218415 77140 309695 -147853 -27484
7368 -161248 320708 -29095 -213709 -68927 -207108 278820 -294396 378141 103969 8153
7357 -129775 -208098 112987 131643 19282 -24349 -245449 120148 87025 -88585 -213630 326362
7345 -53111 101241 50996 205425 77908 -11004 -311461 167339 128018 226634 -6572 74877
7333 -285319 -76820 -310725 -211471 -123013 -100211 -118674 -188504 155350 -235074 136025 -88231
7321 -34579 -67626 -201622 205009 427159 -15886 -178487 -121810 6425 106381 161040 -215077
7309 -291651 -271809 41661 92377 -75216 305803 -3708 -143897 202141 32809 1035 -245532
7297 130252 223197 45894 -282852 207366 3124 -155847 -64640 -377788 38110 63038 56529
7286 56529 -256552 -36736 40033 -172061 -18512 -73132 -231855 -257840 38841 -3624 -99332
7275 -99332 -40853 -134755 -11966 -345030 197286 -284217 -302412 -117837 -181995 234841 15173
7263 -85849 87670 21158 74529 -82344 187564 -412303 167175 18684 105246 9381 -135787
7251 -8561 153572 110531 -116444 -75539 -187963 -52158 154630 261714 17474 -254257 -214703
7240 -214703 -188063 -104242 -173481 117823 231803 -23974 -397782 624774 15647 179108 -68025
7228 89579 315734 -115445 266248 32468 -231661 -98708 -110774 -50805 -45476 184514 -201149
7216 265685 127625 -265951 -15362 -75288 293350 -87766 -149898 -44674 86189 -131853 -96083
7205 -96083 -82260 -180797 -182376 -26733 -84436 72461 -269866 -305209 55412 -83738 -122982 -47916
7192 -233558 -76153 -239215 -354725 101327 92759 136491 -136814 -54831 188796 -330921 202806
7180 -332872 -73344 -1282 170812 136122 107621 -54216 -167150 112932 44828 16626 -136323
7168 -183649 183648 218989 -34304 199686 36905 -150286 136232 103330 -15134 -174590 -45232
7156 -122212 -85891 188389 88238 -11785 -204420 204370 -5165 226206 111834 85370 -50723
7144 237429 -57536 -435378 -186925 -47631 31648 64352 -84080 99593 183741 -53111 -79322
7133 -79322 3635 -117491 -164284 -77710 185665 -183294 -54086 -173083 -145187 -330229 -132427
7121 67534 129696 -408288 -414948 -254791 -54128 104735 92075 244176 -364906 -73566 128275
7109 -376837 -218197 -201244 -87174 -13962 -69280 553 194983 9483 -1009 79663 -249380 326974
7096 51472 76794 -303473 -135882 64853 -164782 49994 -2655 114303 135091 139395 42569
7084 58606 27377 -133216 -152208 -77235 -138764 -29823 89051 140771 360845 121524 57277
7072 243530 -78702 -53613 73689 198729 187442 -150876 -143285 289242 407615 -196424 10364
7060 -522971 -188797 -11168 358451 -138023 -38417 -12882 -180101 -107951 -1948 -185261 -210415
7049 -210415 10667 -209936 -106523 120924 -146244 -12219 -394491 50854 273594 -197406
7038 -307780 564131 159882 81893 -28469 -228809 176116 -95389 16850 163738 45430 -199380
7026 102779 58767 80491 64565 67831 -43175 -52877 -22334 -170298 -174825 -46623 205675 164730
7014 164730 86281 229492 -69621 232394 201815 -101054 41450 -12547 414546 51303 72418
7003 72418 406165 89883 5474 -161325 15237 -269592 -66661 109 150673 109862 -80107 203682
6990 -139245 57404 -136267 -232228 28896 -78058 200793 -144169 -286503 -67837 -115419 138018
6978 -381609 57162 -63934 -128741 -51413 283901 -171903 -150325 55379 -151648 95311 140688
6967 140688 29564 -320060 -112541 -4477 113070 94560 41302 -23028 109147 -49702 13388
6955 -34327 8022 -229443 350693 128436 -49768 -64574 -256417 -239583 -67579 -415578 -124042
6943 286392 -68562 76368 53973 -101823 -314518 -63574 -291699 -305476 -220901 33175 -71338
6931 -11224 99344 -238282 -129303 257887 -175278 -164905 311733 39418 5185 152025 -260779
6919 -115520 185944 -182880 169256 77710 -303091 -100828 -198922 -70339 195154 -95663
6908 31516 -140286 29035 409581 -121709 -143604 -7895 -51131 -383447 9267 94607 -82513
6896 105646 -13460 1954 149849 164442 -48839 -3903 -77186 -48291 -150943 -265980 173947
6884 -165605 65497 -158860 -301638 85091 15156 5074 260516 -182007 131440 -66086 56215
6872 222890 -13706 319539 251094 -10696 59312 100868 -87999 -305781 -201844 -32716 -140974
6861 -140974 16806 102480 -58247 124275 115854 267932 -115871 221793 265535 27914 -179263
6849 210955 -57828 -188903 -374381 -186093 246751 298218 -113846 -3 110269 -337073 -65848
6837 137772 -386503 -111201 274291 248530 123677 -108551 -21782 -95360 -290410 -11344
6826 183909 -226416 41190 -395401 -64300 -120624 69869 48986 11739 46208 3861 -139523
6814 -52022 -126192 -284724 -70015 285342 93975 72011 177732 -367037 -55027 60033 32292
6803 32292 -87379 61092 -82001 -115706 -43764 142971 -105767 -12605 -23884 -67849 -118453
6792 -118453 -41680 -279275 -75509 56630 223618 -172028 70076 119284 103775 -126649 -62565
6780 46605 -178764 -93599 -63926 -183892 39107 -77890 -445481 -117903 -167671 -54099 109338
6768 -118158 241383 9320 -59613 296137 -73186 109423 186688 236250 -199093 -230021 88398
6756 90611 338628 428508 -283675 -231087 214453 74993 -251694 -236555 11036 78650 51732
6745 51732 168107 156241 405715 -142234 -12988 177249 -95115 -275522 -215316 -125092 278092
6733 -192106 -45684 -173581 -48797 -127349 -37701 -3011 39605 -167 -74867 -148287 19448 -128546
6720 -78251 -187368 99294 19280 -89071 -180589 -78746 195268 -159405 -238589 -231996 -170712
6709 -170712 -423177 -34308 -235911 88770 -38068 201533 29457 -221947 163614 -77702 -366153
6698 -366153 -231873 -69404 -34429 -122854 72474 235115 -95839 110218 -59233 -95274 76657
6686 -155345 -164300 -183658 -70893 -189746 218446 -145994 -124169 -11859 -413938 -66698 -43349
6675 -43349 44320 -33918 77970 -1417 -24485 69391 -84978 26556 -82471 -381626 -135811 226845
6662 -198467 137937 -406097 -279042 -44012 -231962 -41943 77005 -15813 -244038 -267290 130730
6650 182974 -165777 -119023 -90578 -137768 -43018 -326450 285039 -35665 231799 -257198 219681
6638 109276 -179253 -154507 -206658 317582 -213263 68360 -124715 54209 -107954 -4848 -84869
6627 -84869 334043 26575 47326 -128723 77894 53064 48134 132015 -100178 -195034 -128549
6616 -128549 151896 81094 61767 173590 61330 125430 143329 253846 -162150 -228616 -10942
6604 202847 160241 -25946 -198290 -105953 128198 -215136 -75583 -10683 141339 -156312 37513
6592 -16051 205253 -14015 299119 480706 -43402 -102556 -6994 -73681 111634 -76903 -52153
6581 -52153 -9540 115209 46838 9823 -330615 -12979 301147 -71933 22796 -110039 -8599 268676
6568 -94649 -106563 267488 80753 235513 -47047 17586 -56291 -9487 10771 257148 -7188 164898
6555 164525 -8103 37834 -179521 78829 24906 -203747 -274942 -141415 36412 55400 222810
6544 222810 274162 -36235 -184614 132232 20447 -51998 390318 -248016 -11301 -295853 138985
6532 156558 -10864 -87686 56792 -4815 67343 157965 -82588 70470 167103 284580 -343270
6520 -314049 -43796 7744 -503923 -148669 45166 140116 4544 109927 -10481 167580 -24257
6508 -72260 30150 -59292 -208206 -271827 -29745 -149510 12430 -143057 -291522 -78704 313990
6496 -11952 -148544 119171 32956 -16812 60520 86089 -53680 185768 -88746 -162821 -113613
6485 -113613 -102014 203794 126086 8255 -517708 -162256 -93116 -44409 -184699 -326499 -180855
6474 -180855 -47409 -43133 -337867 -27183 233806 31962 -205055 117367 71285 -76136 -205998
6463 -205998 -40559 169477 336284 135181 112752 189874 -6581 -79502 134763 -222309 -5622
6451 106800 13791 -220413 -234580 -25343 -154719 131506 -57248 68548 -33818 246039 -226245
6439 -137925 -331592 128139 134158 -183432 163211 280086 99096 -10242 -10208 241012 -235178
6427 11107 -291349 -56158 112834 -83480 -62124 296418 -27793 -142124 -303498 -200741 59158
6415 -67277 151049 63611 152076 -192378 -6050 67642 387338 -194202 54065 174903 -159928
6403 -77369 168958 28597 36170 266778 -73019 24549 -184335 -528805 -101930 -60573 -11598
6391 4454 -21955 13474 406312 -104684 -57495 198752 80198 38323 -130305 -367954 -72822
6379 -154963 -169038 310583 22895 -108233 -3143 -218761 168932 40838 72480 187922 -414251
6367 -383111 141684 -299884 168004 -163815 -67682 84425 229031 -166746 -201797 -113056
6357 -113056 -33673 -65731 -192001 222768 -260417 103806 -31738 91768 190286 -202555 117324
6345 89898 49768 -336707 -62274 -49595 -39857 -41603 -58481 76841 131312 -75872 211231 43527
6332 278530 193333 -5732 -122803 3708 -126472 213727 138541 84264 -179572 -211098 -12780
6320 89325 -9427 204038 250395 -177590 358535 -1920 -61803 286371 42596 -56072 246956
6308 32220 23644 -365129 44714 305011 -325480 105965 -37142 -163461 -395621 -121282 275590
6296 44324 -60753 62841 47809 -70119 -123012 -314247 -125809 -405563 -282957 129749 305112
6285 305112 144464 82172 -125984 -33599 100436 -227265 132378 -293056 66994 -62894
6274 -93495 -16231 227787 -316237 -43720 -227320 172545 120927 -240578 -91528 -36000 -296779
6263 -296779 -17438 467220 -188143 100914 -72787 -218910 -109698 17562 183794 188280 -402430
6251 101656 162527 -269591 -39449 -82508 -30633 163103 248838 -223231 249571 -58814 -36722
6240 -36722 14179 183949 4034 -235005 25857 57021 61676 33106 73063 -97831 6360 -239440
6227 -280082 58959 14940 -752 113761 -122082 -335554 -87264 306376 -121018 -95039 -91437
6216 -91437 162577 22510 106484 -136850 -56751 -54745 151672 66509 43765 70505 77500 468697
6204 468697 70744 48018 -114141 -27036 313274 408637 129153 -139006 28577 195466 325494
6193 325494 -58070 -102668 62134 -134424 -382686 -143580 -82160 168935 -201248 49090 -185592
6181 -69592 -7736 83885 413818 -328310 -108236 -229471 -205249 -296487 -93440 -1217 -169551
6170 -169551 -499934 -149767 87886 177665 60164 -202751 113938 261626 -2152 -34367 -27860
6159 -27860 -222435 -52547 140120 -8352 351052 -339822 217382 -76703 79823 144855 373475
6148 373475 31907 -184746 -84505 -231449 63561 62236 -174355 145184 231834 -330938 -315449
6137 -315449 54475 159101 -228515 380468 -67372 133698 -358551 -131618 175802 -226542
6126 4558 327078 -6438 246105 392981 81699 -244376 -170487 -260661 -51769 237488 -295377
6114 -284994 351734 -6136 76261 153269 -68558 170331 -46613 -416056 128887 139251 2934
6102 121529 82991 -173904 -441432 118241 35041 50879 -70666 17000 -219379 30469 -177188
6090 127660 -310489 198992 -27269 4116 -134073 -104001 -5151 67690 106091 -49809 53880
6078 176373 -267217 295251 -19413 132702 -68501 -162599 -129226 187065 54026 156348 -252108
6066 114526 -136801 275558 254971 -239665 110552 374799 -38765 -305547 322024 -89884
6055 -130431 104286 44902 -326766 -1572 -111637 -280823 95886 -58130 -97839 -141781 16534
6043 -94766 -275643 352521 67129 136124 -208925 -213252 -147640 90487 177956 -172499 -43098
6031 -291780 -64678 79372 -29423 -16258 48313 -240294 425219 31893 226178 -76521 33680
6019 144850 246884 -328223 -198316 235485 -93162 1862 -251385 158308 -104585 -125361
6009 -125361 294720 -111314 80608 112522 219730 217032 81508 304446 53984 -26772 -46726
5998 -46726 -224152 138774 -82647 -132789 -71870 -192941 -196644 -266753 -361524 -201720 1791
5986 -74388 -47502 28579 -103374 224678 210949 13054 -23451 194406 -199264 -171205 36791
5974 -182062 17744 167357 96093 32345 -100188 -81453 26486 -45586 -14990 -66498 -123399
5963 -123399 111398 -204471 16497 92129 -32486 -274722 557530 52128 3438 -64795 297507
5951 107967 -149209 -214491 15165 359878 112587 -210070 -48476 294194 126696 165907
5941 165907 148805 45906 98861 29888 267591 13320 86024 -171472 -84118 72360 -99232
5929 95893 24285 -73530 388505 -287027 107525 -291717 -30282 -100662 82341 -151149 -152757
5918 -152757 -48515 -212697 -66157 -22284 296923 -180786 -195829 -54101 129048 49559 88055
5907 88055 -5878 11691 138479 -369 -280978 -175500 376578 -156270 -5954 -85192 252928
5895 83642 -244943 -1740 -168247 115455 173113 59260 -10186 295466 74531 -103347 -182383
5884 -182383 280474 -74836 -37281 -416834 -181466 -190469 314702 259875 -3578 97863 159814
5873 159814 101627 19818 -282941 36797 -65631 110907 -16348 -144360 -360922 199303 -245188
5861 44292 328384 -77475 -78221 -37413 -296754 -100446 74475 -360867 -150200 -191414 162688
5849 156446 53958 -178309 315167 325711 104497 -56140 179117 273445 226264 212271 8308
5837 -236030 -391342 426912 188232 1156 5822 -22804 104405 -64480 -99671 -22369 -161112
5826 -161112 -32675 37618 124342 -12073 213807 -124330 164943 -226966 -221129 40806 -313438
5814 -172772 -462517 124703 39852 138664 61216 -113989 -3681 -82476 100027 -184826 -85272
5802 -94931 70474 100937 -19433 101659 37272 -118424 -41412 12544 -241502 -41007 -104209
5791 -104209 -85062 -238549 -161625 180347 236365 198550 15600 -171104 349830 26670 183556
5780 183556 -144239 91557 -122530 -115758 306395 183008 -195549 43812 -228406 10475 24773
5769 24773 168283 -201737 335934 132661 -7368 175272 42673 -126775 -318759 -22109 -1764
5757 -138712 -137258 72606 -378520 -45015 -191949 92887 15316 309505 33963 -167364 170598
5745 -63997 -41928 -372364 -155495 -208707 -72566 -66753 121996 -143779 26839 -108933 195644
5733 -55577 53810 -123714 -155865 -11401 -117721 -17994 13521 55161 144095 94332 24785
5721 41881 -10877 -82582 -90059 -249069 101922 46466 -261335 -81892 219085 -171004 -7329
5709 -380802 -97740 55166 -92079 417072 -56099 169618 -283868 -58672 336206 14494 -105550
5697 24640 420706 91425 32705 174070 -8789 189234 -283304 -44805 -426961 18992 29715
5686 29715 3951 32195 166284 60834 -33236 40866 -211634 55330 -34961 -71190 -207141
5675 -207141 -179471 165934 387135 -29035 -188395 178937 14504 132306 48234 -117777
5664 11134 384457 93887 201561 247159 72379 59467 -184329 35269 -5957 -52204 -56357 -86312
5652 -86312 -266464 36081 178313 -101768 -62904 -420900 177432 63698 103303 -323328 -31483
5640 280325 49813 235163 10901 -238120 196121 -1123 -18904 -194788 -10908 -51077 -163900
5629 -163900 -113875 329459 -377786 57466 -218503 192281 -165049 69659 281839 310819
5619 310819 -145885 59152 245929 -228896 -228741 63429 -71587 -111385 -106092 101119 -102278
5607 79036 -48770 82259 96443 -40314 226740 -15988 -144889 -287776 -159852 -65605 -62794
5596 -62794 37053 -85676 -150499 55304 304963 206642 -112717 199889 229090 -234718 2753
5584 -129042 -401983 -395640 12731 -191183 -90107 132363 312383 11845 -293016 84019 -152656
5572 -141338 192488 214839 108570 -59590 -68187 -77927 293426 -16307 -271612 -196971 -126945
5561 -126945 -26752 -28899 -108914 144446 94631 -99209 3102 -299902 113453 197388 187676 -29794
5548 -25307 -77032 -81542 34676 -57690 182683 -22808 -47773 -321423 -17159 155350 107241
5537 107241 -67310 17686 -2632 32207 212016 -17574 -75525 -135225 14012 8103 -66850 -43121
5525 -43121 -491897 219046 251060 -68202 380377 78180 137327 141732 -176185 -19119 116479
5513 210289 27376 -25707 20544 -11171 203550 255620 -189338 55062 77770 -112989 -282506
5502 -282506 -91075 15081 154312 64222 257246 -166332 -225166 -142688 -46537 196758 -23453
5490 75001 258285 -18191 -7190 -217690 80455 -140099 243200 330899 447868 110667 -37768
5478 151214 111794 -207232 13607 -394328 -118586 196426 342541 154223 -294224 -126202
5467 188433 193900 37430 -94715 65532 -133097 112063 -177002 99996 -114573 239894 -44452
5455 253120 99386 133737 110126 -443993 -210732 53404 62485 70297 224166 -63558 200142
5443 111804 -189779 120230 367822 247665 61106 -108314 152709 20890 66456 135553
5433 135553 58273 7964 12611 104637 37105 -97687 -190366 -47322 109954 -13748 -281442 485180
5420 -5246 -146007 158027 154732 41827 -233984 143811 -526617 -13876 104232 -164294 95903
5408 -347811 -280140 58710 13185 271594 -8393 17586 49917 63804 183277 240427 18421
5396 121232 -196873 -169680 -15899 359133 312790 200802 27852 385996 52719 -327313 -89384
5384 -113171 152916 -111637 110018 90664 90306 -264431 10068 -107408 -284115 -65460 247439
5372 129615 202777 5835 -48791 -187283 -425643 4499 100376 -10043 -12590 306588 -233680
5360 -189102 -115600 251693 78566 -25051 223480 118926 -82827 -141893 -37713 -116884 104269
5348 172944 -138452 -181330 123103 213088 -260661 -100061 215273 51774 -359202 149328
5337 18819 -184069 -149927 -204213 -164891 -75047 96115 -102626 -24006 -93127 -73456 24815
5325 -160188 -223965 70551 -154222 -122128 23637 -341964 202185 106336 44082 35135 -133758
5313 -40619 -95536 84723 44563 -133440 195672 -35831 -153806 -36132 39365 175416 77608
5301 254031 -114952 14042 4461 -5959 54828 438704 -44873 -137172 280118 -29324 -69070
5290 -69070 108219 -88553 -354688 156730 122251 -32220 216850 55647 65216 -122174 168192
5278 -159865 202406 35854 136149 -179943 214204 -15518 -164929 209951 213647 37081 37066
5267 37066 74614 -137905 -88417 -209573 -417736 54204 154924 110366 253605 218122 172136
5256 172136 206963 -238480 339325 429263 -120196 156119 -23183 114192 -36975 -14328 227728
5244 93047 -116048 19906 -29890 -175397 47832 483645 -51206 60101 283075 300115 -64177
5232 177119 52967 -62951 -10490 23177 -364525 76784 -15033 46229 -42341 -253612 207325
5220 -66485 199264 368809 -170816 42056 -85890 71373 15716 -413356 152150 361489 1257
5208 30389 -75349 -112509 -54512 -103794 -20854 86464 131370 -434474 142401 -74292 174725
5196 -163685 159138 -89067 377895 56478 -155987 177399 -316829 40892 335822 -221174
5185 126954 -19844 155387 -202201 -218862 1002 -95179 -193974 347288 138589 22225 38162
5174 38162 -71297 -76453 -59000 58776 95166 -53231 -30608 -76593 -159084 124845 -175522 83589
5161 205922 -149744 -67963 -153207 22011 -50437 270359 136098 -203746 156409 -116346
5150 -205658 72399 -17090 -183700 108850 -176865 56657 -54325 -14913 -166245 -1891 -507886
5139 -507886 137951 -2907 177914 196365 303538 81148 -259659 90070 325034 -480076 -100903
5127 -5772 -89191 274076 172212 -123225 -150766 254655 -96169 60733 -172675 -111159 213243
5115 193712 200540 -224081 -120406 57678 -171533 -240950 -13694 2267 -156167 -334969 -210703
5104 -210703 171256 95051 -145341 -191663 99437 -62987 -409455 427007 98895 86997 -77886
5092 80444 -308327 -107760 -238423 -67610 85562 -140642 101862 174818 -32294 141494 -6322
5080 -135592 35082 -34170 45412 200082 186606 -53241 -307345 112562 187782 25345 -41655
5068 25556 -148792 178451 -178676 206826 203365 -120935 -300226 -62849 337128 116766
5057 -42537 2716 -89525 -144552 -279249 227240 -120075 -191743 257310 34410 354883 -157730
5045 83390 -211384 -3820 106102 -63289 -5785 80022 43800 80171 -58129 140042 202618 148374
5033 148374 118057 33142 40043 -349620 -246563 -494301 -53703 -190504 -147695 166224 -84221
5021 49889 151376 164458 176644 -266 136687 16888 -90661 232578 -251391 -97292 -137828
5010 -137828 -117280 115497 294661 -86310 112138 212803 46221 -66483 19134 4765 203101
4999 203101 64136 255293 112222 120701 114941 -85183 -29152 -256711 -170200 -372548 266201
4987 -392646 305472 197596 -237858 -158632 -10153 -9281 62701 194959 127928 -117479 -214634
4976 -214634 -38951 6746 97615 -78914 183954 -61447 -51421 282769 35820 92026 -267063
4964 21860 131710 214431 9281 -21079 -17331 -177769 -36771 250784 20255 -209445 -228517
4953 -228517 147151 365872 -88754 206248 266874 344865 204752 -35250 -325253 -267875 -131323
4941 212555 100868 -91590 -294111 -245278 -134477 226888 66029 -97670 3760 123779 66843
4930 66843 -208783 197782 -88549 62178 310878 201387 -129389 131156 373941 56768
4919 250472 36067 67560 398537 -142224 143861 -146550 -225482 327718 109799 -46957
4908 32384 -49884 -113567 -517800 195807 131226 -386132 146113 18055 226614 126536 -23122
4896 527897 304149 121577 -181435 -47207 192477 73725 12681 268595 105845 141917
4886 141917 -164535 -110595 -140738 77480 274622 352898 351404 93424 -74677 -34218 -217767
4875 -217767 60185 126825 -151025 -88871 -289008 12809 -291327 -115137 -113736 -288422 -208328
4864 -208328 96581 44721 138404 203164 -73272 179395 -191135 141532 -122998 187990 39894
4852 -119381 7891 7217 24361 45726 147497 64928 154623 -84976 67563 152922 -300547 133696
4839 21247 261010 -184731 -70553 -250205 -73691 73500 -20815 -230527 -220457 71316 -47804
4827 -62679 133653 132107 -38506 153124 230476 75698 -417334 17306 -280922 84738 -110670
4815 81141 156928 -36805 73343 -95230 -58614 -44561 298649 -391697 -238283 -82742 -263203
4804 -263203 -166065 -207238 -21162 -96958 -368876 -63300 231503 63050 189264 16084 -304699
4792 -85153 -33708 -259654 -102022 40010 -90210 290302 12409 246653 -345593 -172931 117750
4780 -17281 -30904 12691 -63490 115783 -53100 -174820 -23666 115929 206035 -100982 25652
4768 33144 239202 -305398 92971 41482 258393 -156349 1435 -106866 348087 322384 -192965
4756 18897 80621 -294713 -176995 -63006 35985 -143207 -260452 -121103 178638 -138087
4745 403517 26253 -51919 244677 199172 324118 79330 94290 115640 -161313 -80570 -282234
4734 -282234 23450 -136086 -64216 -141713 -152983 -105906 -440070 -115791 232101 11390 20916
4723 20916 138989 -78222 17031 -273288 -106202 -248439 122554 -123939 134608 -11298
4712 65653 8588 -9912 38464 -363693 240138 18140 -79836 -93841 -99354 152311 186933 265749
4700 265749 46702 -166128 -129892 135978 39099 1959 -152184 150768 35222 91005 181147
4689 181147 369784 -249436 -323403 -155507 -142535 -126466 -12990 -174248 104854 -96754 261041
4677 327209 54801 153449 -19395 -169786 -79920 -396225 12205 -245635 144943 -125482 -164633
4666 -164633 103617 32518 -84629 -188903 -116883 247295 -27053 93224 74128 -40381 27988
4654 -126658 445922 168122 -111566 211826 188735 -1794 -350704 3938 153717 -157364 -152904
4643 -152904 -118082 199643 -198519 224815 137681 -292640 69654 69957 -52215 -160994 -201780
4632 -201780 70588 -105774 92890 -52148 159179 -46954 342277 -136899 -167148 27671 -154096
4620 -28271 551711 44257 -119590 78453 -182448 -121532 -239460 -97194 140570 107580 8764
4608 293239 24208 200381 10501 165241 102325 -69830 108230 46184 -70942 -72877 126606
4596 -136049 -134104 -60437 16366 -119429 -104395 42012 -63908 215774 57426 51797 1241 34068
4584 34068 -24954 -53820 220905 15011 -70995 -250003 173401 48796 -125378 69942 -159555
4572 39004 133264 206138 -106942 486565 -15509 111114 -424521 159815 -207005 68797 12790
4560 113023 -64602 140727 -70697 -88634 145338 125071 84113 -5618 321856 -418871 304507
4548 191847 -327838 95826 -43570 331476 -49265 204867 -137086 73575 42341 -328764 -295587
4537 -295587 -195938 45182 -4192 -109905 25767 -182538 158198 237455 293817 25425 171599
4526 171599 142583 -22055 294371 -16652 27937 -70196 -65303 185879 -188123 -86302 -169770
4515 -169770 44353 4593 99085 54005 94601 -107676 115525 -67071 20791 -89438 -190862
$$ [...]
##END NTUPLES=NMR SPECTRUM
##END=
