##TITLE=AC1695_ROEFFECT0025_8637688_yrz5u0WGUz
##JCAMPDX= 6.0         $$ Bruker NMR JCAMP-DX V2.0
##DATA TYPE= NMR SPECTRUM
##DATA CLASS= NTUPLES
##ORIGIN= BRUKER
##OWNER= Administrator
$$ 1.72 TOPSPIN		Version 2.1
$$ 2014-05-22 18:57:09.577 -0700  Administrator@X
$$ Compression mode = diff/dup
##.OBSERVE FREQUENCY= 400.02188249412
##.OBSERVE NUCLEUS= ^1H
##.ACQUISITION MODE= SIMULTANEOUS (DQD)
##.ACQUISITION SCHEME= undefined
##.AVERAGES= 64
##.DIGITISER RES= 22
##SPECTROMETER/DATA SYSTEM= spect
##.PULSE SEQUENCE= noesygpps1d.comp
##.SOLVENT NAME= COFFEE_meoh
##.SHIFT REFERENCE= INTERNAL, COFFEE_meoh, 1, 14.96104
##AUDIT TRAIL= $$ (NUMBER, WHEN, WHO, WHERE, PROCESS, VERSION, WHAT)
$$ ##TITLE= Audit trail, TOPSPIN		Version 2.1
$$ ##JCAMPDX= 5.01
$$ ##ORIGIN= Bruker BioSpin GmbH
$$ ##OWNER= Administrator
$$ $$ E:\/data/COFFEE/nmr/AC1695_ROEFFECT0025_8637688_yrz5u0WGUz/12/pdata/1/auditp.txt
$$ ##AUDIT TRAIL=  $$ (NUMBER, WHEN, WHO, WHERE, PROCESS, VERSION, WHAT)
(   1,<2014-05-22 18:57:01.922 -0700>,<Administrator>,<X>,<go>,<TOPSPIN 2.1>,
      <created by zg
	started at 2014-05-22 18:45:31.815 -0700,
	POWCHK enabled, PULCHK disabled,
       configuration hash MD5:
       C8 4E 4E 5D D3 5C D8 9E 9F 52 82 E0 59 8A DE 15
       data hash MD5: 64K
       79 22 C9 3E E5 92 5C C8 36 FA 90 80 3D DD 0F 82>)
(   2,<2014-05-22 18:57:05.688 -0700>,<Administrator>,<X>,<proc1d>,<TOPSPIN 2.1>,
      <Start of raw data processing
       efp LB = 0.3 FT_mod = 6 PKNL = 1 PHC0 = 0 PHC1 = 0 SI = 128K 
       data hash MD5: 128K
       58 DF AA 19 9A 3C 8D 05 B6 2D 25 95 D2 F5 74 53>)
(   3,<2014-05-22 18:57:07.954 -0700>,<Administrator>,<X>,<proc1d>,<TOPSPIN 2.1>,
      <pk PHC0 = -82.41394 PHC1 = 0 
       data hash MD5: 128K
       E2 CF 31 32 EB C9 A6 83 6C ED F0 10 3F C7 2F DE>)
(   4,<2014-05-22 18:57:08.860 -0700>,<Administrator>,<X>,<proc1d>,<TOPSPIN 2.1>,
      <abs ABSG = 1 
       data hash MD5: 128K
       BD FF 21 AF 2F 4C 48 35 07 93 AD 4B 11 7E FC 15>)
(   5,<2014-05-22 18:57:08.975 -0700>,<Administrator>,<X>,<proc1d>,<TOPSPIN 2.1>,
      <abs ABSG = 2 
       data hash MD5: 128K
       D2 86 A2 3F 18 44 B7 62 22 68 A6 4B 89 F4 E6 F3>)
(   6,<2014-05-22 18:57:09.113 -0700>,<Administrator>,<X>,<proc1d>,<TOPSPIN 2.1>,
      <abs ABSG = 3 
       data hash MD5: 128K
       88 25 1C 78 3E E0 70 7F BA 5B 45 41 DF A9 75 A2>)
(   7,<2014-05-22 18:57:09.233 -0700>,<Administrator>,<X>,<proc1d>,<TOPSPIN 2.1>,
      <abs ABSG = 4 
       data hash MD5: 128K
       65 05 DC 85 F1 2D 93 13 96 7E 1C DD D6 B9 F1 AB>)
(   8,<2014-05-22 18:57:09.336 -0700>,<Administrator>,<X>,<proc1d>,<TOPSPIN 2.1>,
      <abs ABSG = 5 
       data hash MD5: 128K
       8B 56 9E D9 53 C0 5F BE 48 10 A9 01 DB C6 64 21>)
$$ ##END=
$$ 
$$ $$ hash MD5
$$ $$ E4 D1 07 3C 00 82 21 F8 33 BE F8 25 96 28 BD 18
##$RELAX= 
##$RELAX= 
##$RELAX= 
##$RELAX= 
##$RELAX= 
##$RELAX= 
##$RELAX= 
##$RELAX= 
$$ Bruker specific parameters
$$ --------------------------
##$DU= <E:\>
##$EXPNO= 12
$$ [...]
##$TP07= 0
##$TPNAME0= <>
##$TPNAME1= <>
##$TPNAME2= <>
##$TPNAME3= <>
##$TPNAME4= <>
##$TPNAME5= <>
##$TPNAME6= <>
##$TPNAME7= <>
##$TPOAL= (0..7)
0.5 0.5 0.5 0.5 0.5 0.5 0.5 0.5
##$TPOFFS= (0..7)
0 0 0 0 0 0 0 0
##$TUNHIN= 0
##$TUNHOUT= 0
##$TUNXOUT= 0
##$USERA1= <user>
##$USERA2= <user>
##$USERA3= <user>
##$USERA4= <user>
##$USERA5= <user>
##$V9= 5
##$VALIST= <valist>
##$VCLIST= <CCCCCCCCCCCCCCC>
##$VD= 0
##$VDLIST= <DDDDDDDDDDDDDDD>
##$VPLIST= <PPPPPPPPPPPPPPP>
##$VTLIST= <TTTTTTTTTTTTTTT>
##$WBST= 2048
##$WBSW= 25
##$XGAIN= (0..3)
0 0 0 0
##$XL= 0
##$YL= 0
##$YMAX_a= 6767387
##$YMIN_a= -14743437
##$ZGOPTNS= <>
##$ZL1= 120
##$ZL2= 120
##$ZL3= 120
##$ZL4= 120
##$ABSF1= 14.96104
##$ABSF2= -5.597142
##$ABSG= 5
##$ABSL= 3
##$ALPHA= 0
##$AQORDER= 0
##$ASSFAC= 0
##$ASSFACI= 0
##$ASSFACX= 0
##$ASSWID= 0
##$AUNMP= <proc_prof1d_extract.lims>
##$AXLEFT= 0
##$AXNAME= <>
##$AXNUC= <1H>
##$AXRIGHT= 0
##$AXTYPE= 0
##$AXUNIT= <>
##$AZFE= 0.1
##$AZFW= 0.1
##$BCFW= 0
##$BC_mod= 0
##$BYTORDP= 0
##$COROFFS= 0
##$CY= 15
##$DATMOD= 1
##$DC= 0
##$DFILT= <>
##$DTYPP= 0
##$F1P= 0
##$F2P= 0
##$FCOR= 0.5
##$FTSIZE= 131072
##$FT_mod= 6
##$GAMMA= 0
##$GB= 0
##$INTBC= 1
##$INTSCL= 1
##$ISEN= 128
##$LB= 0.3
##$LEV0= 0
##$LPBIN= 0
##$MAXI= 10000
##$MC2= 0
##$MEAN= 0
##$ME_mod= 0
##$MI= 0
##$NCOEF= 0
##$NC_proc= -2
##$NLEV= 6
##$NOISF1= 0
##$NOISF2= 0
##$NSP= 0
##$NTH_PI= 0
##$NZP= 0
##$OFFSET= 14.96104
##$PC= 1
##$PHC0= -82.41394
##$PHC1= 0
##$PH_mod= 1
##$PKNL= yes
##$PPARMOD= 0
##$PPDIAG= 0
##$PPIPTYP= 0
##$PPMPNUM= 2147483647
##$PPRESOL= 1
##$PSCAL= 4
##$PSIGN= 0
##$PYNMP= <proc.py>
##$REVERSE= no
##$SF= 400.020009620068
##$SI= 131072
##$SIGF1= 0
##$SIGF2= 0
##$SINO= 400
##$SIOLD= 131072
##$SPECTYP= <>
##$SREGLST= <1H.CDCl3>
##$SSB= 0
##$STSI= 131072
##$STSR= 0
##$SW_p= 8223.68421052631
##$SYMM= 0
##$S_DEV= 0
##$TDeff= 65536
##$TDoff= 0
##$TI= <>
##$TILT= no
##$TM1= 0
##$TM2= 0
##$TOPLEV= 0
##$USERP1= <user>
##$USERP2= <user>
##$USERP3= <user>
##$USERP4= <user>
##$USERP5= <user>
##$WDW= 1
##$XDIM= 131072
##$YMAX_p= 361856637
##$YMIN_p= -11983
##$CURPLOT= <Network HP LaserJet P1505>
##$CURPRIN= <$Network HP LaserJet P1505>
##$DFORMAT= <normdp>
##$LAYOUT= <+/1D_H.xwp>
##$LFORMAT= <normlp>
##$PFORMAT= <normpl>
##$SURQMSG= 1
$$ End of Bruker specific parameters
$$ ---------------------------------
##NTUPLES= NMR SPECTRUM
##VAR_NAME=  FREQUENCY,     SPECTRUM/REAL,   SPECTRUM/IMAG
##SYMBOL=    X,             R,               I
##VAR_TYPE=  INDEPENDENT,   DEPENDENT,       DEPENDENT
##VAR_FORM=  AFFN,          ASDF,            ASDF
##VAR_DIM=   131072,        131072,          131072
##UNITS=     HZ,            ARBITRARY UNITS, ARBITRARY UNITS
##FACTOR=    0.0627417313425164, 1,          1
##FIRST=     8223.62146879497, 761,          -72387
##LAST=      0,             2805,            -72699
##MIN=       0,             -11983,          0
##MAX=       8223.62146879497, 361856637,    0
$$ Real data points
##PAGE= N=1
##DATA TABLE= (X++(R..R)), XYDATA
$$ [...]
61523D20381q68j544k603l652l945l366k512k061k232k646k593j716m40N44J041
61508C91788J181Q24j79j309j759j473j097r43p51m91m73n58j43Q02J519J609
61492C88547J636K134K707K577J576J91r38j301p50K36R26J136J279J600J885
61477D03441K080K482L078L336L027K618K446K110J137j26r36j098j076j295j737
61462D19487k115k173j890j538j404j405j161n38J16M19M48O70J463K656L484
61447D16519L247K170J323J455K306L287M236M962M877L940L364M153N438N583
61433D66860M633M032M069L451J796O93J308K489K480J353M18J75K48O40J646
61418D96291K782L080K413J544R33L60l28r25j367j837k398l002l810m887n754
$$ plain form
61523 420381 419513 417969 415366 411714 407769 404403 401891 399830 397598 394952 392359 390643 390203 390747 391788
61508 391788 392969 393793 393614 392305 390546 389073 387976 387033 386282 385791 385318 384760 384617 385419 386938 388547
61492 388547 390183 392317 395024 397601 399177 399368 398430 397129 396379 396615 397541 398677 399956 401556 403441
61477 403441 405521 408003 411081 414417 417444 420062 422508 424618 425755 425629 424693 423595 422519 421224 419487
61462 419487 417372 415199 413309 411771 410367 408962 407801 407263 407379 407798 408246 408916 410379 413035 416519
61447 416519 419766 421936 423259 424714 427020 430307 434543 439505 444382 448322 451686 455839 461277 466860
61433 466860 471493 475525 479594 483045 484841 485534 486842 489331 491811 493164 493582 493757 494005 494645 496291
61418 496291 499073 502153 504566 506110 507043 507403 507075 506150 504783 502946 500548 497546 493736 488849 483095
61403D83095n828n299m892m844m687m068l167k229j266m00qk62p61r01m85J28
61387D44126M43L92L95Q50J611K244K656L022L156K620J696J480K483L749M024
61372D74947L356K812K929L244L251L018K805K668K631K805L175L553L804L872
61358E18870L754L696M218N503O971P946Q563R489J0828J2017J2741J3292J3781
61345F31669J3737J2781J1244R686Q271O975O031N632N371M557L089J610O79O2
61331G21394q83k402m134n606o739p704q512q928q754q048p058o054n220m534
61317F36818l743k659j471n67Q1J029K587M210N052N074N183O137P652Q842R282
61302F83507R198Q737P539N303K417m05k935n411p789r531j0331j0521j0469r977
$$ plain form
61403 483095 477267 471968 467076 462232 457545 453477 450310 448081 446815 446415 446407 446145 445384 444483 443998 444126
61387 444126 444569 444961 445356 446206 447817 450061 452717 455739 458895 461515 463211 464691 467174 470923 474947
61372 474947 478303 481115 484044 487288 490539 493557 496362 499030 501661 504466 507641 511194 514998 518870
61358 518870 522624 526320 530538 536041 543012 550958 559521 569010 579838 591855 604596 617888 631669
61345 631669 645406 658187 669431 679117 687388 694363 700394 706026 711397 715954 719043 720653 721332 721394
61331 721394 720511 718109 713975 708369 701630 693926 685414 676486 667732 659684 652626 646572 641352 636818
61317 636818 633075 630416 628945 628378 628459 629488 632075 636285 641337 646411 651594 657731 665383 674225 683507
61302 683507 692705 701442 708981 714284 716701 716296 713361 707950 700161 690630 680299 669778 659309 649332
61288F49332q729p029n585m711m170l662k971j817r4J739L035L776M589N805P051
61273F36559P824Q122Q279Q529Q904R285R493R526R653J0023J0298J0173J0149
61260G56817J1181J3423J5864J7390J7715J7131J5894J4126J1927R282O209L088
61248I10047M55j672l833o334q847j0900j2290j2859j2523j1675j1057j0886j0641
61235G96985r924q953q029p154o473o328o440n788l917j730k94N31J444K286K194
61220G38410J020l90j279j657j797j769j567j242p55k3Q17J369J313O39k83q27
61204G31979n97J13P43J395K825N272P970J0263J2465J5010J7427J9012J9972
61191H43849K0912K1578K1091J9316J7011J4611J1829Q620N674L667K631K290
$$ plain form
61288 649332 640603 633574 627989 623278 619108 615446 612475 610658 610564 612303 615338 619114 623703 629508 636559
61273 636559 644383 652505 660784 669313 678217 687502 696995 706521 716174 726197 736495 746668 756817
61260 756817 767998 781421 797285 814675 832390 849521 865415 879541 891468 900750 906959 910047
61248 910047 910502 908830 904997 898663 889816 878916 866626 853767 841244 829569 818512 807626 796985
61235 796985 787061 778108 770079 762925 756452 750124 743684 737896 733979 732249 731955 732486 733930 736216 738410
61220 738410 739430 739040 737761 736104 734307 732538 730971 729729 728974 728951 729768 731137 732450 733089 732806 731979
61204 731979 731382 731495 732238 733633 736458 741730 749700 759963 772428 787438 804865 823877 843849
61191 843849 864761 886339 907430 926746 943757 958368 970197 978817 984491 988158 990789 993079
61179I93079K374K343J458m80k797m642n750o384o897p560q480r538j0516j1376
61165I24834j2212j2981j3550j3936j4233j4337j4050j3390j2532j1522j0375
61154G81716r310q444p373n507k907l56J406K216K297J906J144j94k416n313p957
61139G40908r593j0540j1542j2409j2008r778o542l554j269O77K712M872O867
61126F78801Q381R521J0936J3128J5674J7566J8449J9076K0333K2248K4098K5179
61114H83390K5240K4525K3603K2918K2411K1752K0895K0053J9185J7983J6469
61103A118424J5048J3792J2110R398N644J185l709q715j3332j7240k0533k3309
61091A088763k5273k6105k5989k5464k4876k4234k3464k2569k1472j9929j7760
$$ plain form
61179 993079 995453 997796 999254 998774 995977 991335 985585 979201 972304 964744 956264 946726 936210 924834
61165 924834 912622 899641 886091 872155 857922 843585 829535 816145 803613 792091 781716
61154 781716 772406 763962 756589 751082 748175 747819 749225 751441 753738 755644 756788 756594 754178 748865 740908
61139 740908 731315 720775 709233 696824 684816 675038 668496 664942 663673 664350 667062 671934 678801
61126 678801 687182 696703 707639 720767 736441 754007 772456 791532 811865 834113 858211 883390
61114 883390 908630 933155 956758 979676 1002087 1023839 1044734 1064787 1083972 1101955 1118424
61103 1118424 1133472 1147264 1159374 1168772 1174416 1175601 1171892 1163177 1149845 1132605 1112072 1088763
61091 1088763 1063490 1037385 1011396 985932 961056 936822 913358 890789 869317 849388 831628
61080H31628j5184j2868j1425j0708r816q106o003m478l822l418k700j735p71
61067G40594K30J358K449L356M217N202O231P156P978Q775R630J0698J2088J3634
61053H33596J5046J6277J7405J8230J8571J8893J9993K1919K3834K5214K6436
61042A055414K7850K9069K9669K9953L0374L0777L0862L0870L1165L1500L1453
61031A388956L1172L0980L0681L0077K9787L0610L2291L3864L5134L6802L9239
61020A749593M2102M5192M8657N2275N5505N8477O1973O6296P1249P7417Q6187
61009B414923R7979J11675J26499J43292J63126J85919K11667K42040K79473L25369
60999D301962L80351M45379N21323O08321P07022Q19066R44388J079609J222224
$$ plain form
61080 831628 816444 803576 792151 781443 771627 763521 757518 753040 749218 745800 743100 741365 740594
61067 740594 740824 742182 744631 747987 752204 757406 763637 770793 778771 787546 797176 807874 819962 833596
61053 833596 848642 864919 882324 900554 919125 938018 958011 979930 1003764 1028978 1055414
61042 1055414 1083264 1112333 1142002 1171955 1202329 1233106 1263968 1294838 1326003 1357503 1388956
61031 1388956 1420128 1451108 1481789 1511866 1541653 1572263 1604554 1638418 1673552 1710354 1749593
61020 1749593 1791695 1836887 1885544 1937819 1993324 2051801 2113774 2180070 2251319 2328736 2414923
61009 2414923 2512902 2624577 2751076 2894368 3057494 3243413 3455080 3697120 3976593 4301962
60999 4301962 4682313 5127692 5649015 6257336 6964358 7783424 8727812 9807421 11029645
60990A1029645J374068J533626J682198J783073J799597J712330J517439J218795
60982B3650771Q37726M33152R4512j06649j66158j46424j27850j65584k87091
60973B4016405n07997q26622j201047j549598j791237j890678j865741j758236
60965A2625249j604583j428689j247499j073120r11613p65349o36894n28503m39224
60956C989775l65623l05235k57187k19880j90423j66560j47304j31498j17523
60947B088542j04759r3861q5066p7492p0501o4526n9986n6453n3437n1091m9640
60936A321730m8786m8031m6966m5090m2115l8608l5505l2871k9999k6811k4076
60925I02872k1981j9725j6970j4634j3544j3180j2514j1285r856q459p216o374
$$ plain form
60990 11029645 12403713 13937339 15619537 17402610 19202207 20914537 22431976 23650771
60982 23650771 24488497 24921649 25016161 24909512 24743354 24596930 24469080 24303496 24016405
60973 24016405 23508408 22681786 21480739 19931141 18139904 16249226 14383485 12625249
60965 12625249 11020666 9591977 8344478 7271358 6359745 5594396 4957502 4428999 3989775
60956 3989775 3624152 3318917 3061730 2841850 2651427 2484867 2337563 2206065 2088542
60947 2088542 1983783 1889922 1804856 1727364 1656863 1592337 1532351 1475898 1422461 1371370 1321730
60936 1321730 1272944 1224913 1177947 1132857 1090742 1052134 1016629 983758 953759 926948 902872
60925 902872 880891 861166 844196 829562 816018 802838 790324 779039 769183 760724 753508 747134
60913G47134n903n359m546l806l304k706j923j455j554j745j638j542j850k429
60899G07374l032l638m075m119m200n059o301o453n108l760l694m245m157l621
60885F45912l674m353m863n019n205n391n278n146n375n552n121m643n171o541
60871E74580p388o830n293l733k830k818l333l508k853j810r40j68O18R47O60
60856E35301O93J779L062L257K636K446K826K840K355K179K379K118J366J173
60842E66410J799K107J365L41j82p48k201m102n223n092m447m264m781n284m786
60827E30912l163j442o06m40k08j3n23j563k218k327k660l437l850l443k936l131
60811D98952l794m134l790l012k383k491l346m090l962l429l496m058m059l245
$$ plain form
60913 747134 741231 735872 731326 727520 724216 721510 719587 718132 716578 714833 713195 711653 709803 707374
60899 707374 704342 700704 696629 692510 688310 683251 676950 670497 665389 661629 657935 653690 649533 645912
60885 645912 642238 637885 633022 628003 622798 617407 612129 606983 601608 596056 590935 586292 581121 574580
60871 574580 567192 560362 555069 551336 548506 545688 542355 538847 535994 534184 533244 533076 533694 534641 535301
60856 535301 535994 537773 540835 544092 546728 549174 552000 554840 557195 559374 561753 563871 565237 566410
60842 566410 568209 570316 571681 572022 571840 571092 568891 564789 559566 554474 550027 545763 540982 535698 530912
60827 530912 527749 526307 525701 525261 525053 525040 524517 522954 520736 518409 515749 512312 508462 505019 502083 498952
60811 498952 495158 491024 487234 484222 481839 479348 476002 471912 467950 464521 461025 456967 452908 449663
60797D49663k539k479k569k475k575k845k521j515r82j612k407k097q94J22O01
60782D22876R22J153R97N06N0j79j76P9M21N29N40J057K106K698K063P84P8L38
60764D36842J023J611K006K234K373K663L237L780L753K952J672M77j86l61n80
60749D63496j248k042k335k019j491r41l66r2n46j496k269k734l241l719l745
60734D35212l532l760m318m371l844l617l856l517k135q40p34j330j528j266j129
60719C95435j108p79k39Q5K24M85Q39J100J364J719J881J645J264J019Q29O82
60703D06445Q82J498K091K331K296J977J225M85N80J390J726J115N83J033J853
60688D27510K067J872J959K105J652Q31N09R04J467J741J674J339R75R37J155
$$ plain form
60797 449663 447124 444645 442076 439601 437026 434181 431660 430145 429163 427551 425144 423047 422153 422275 422876
60782 422876 423798 424951 425948 426454 426504 426325 426149 426228 426649 427178 427718 428775 430881 433579 435642 436426 436504 436842
60764 436842 437865 439476 441482 443716 446089 448752 451989 455769 459522 462474 464146 464623 464437 464076 463496
60749 463496 462248 460206 457871 455852 454361 453420 453054 452962 452416 450920 448651 445917 442676 438957 435212
60734 435212 431680 427920 423602 419231 415387 411770 407914 404397 402262 401422 400688 399358 397830 396564 395435
60719 395435 394327 393548 393309 393394 393618 394103 394942 396042 397406 399125 401006 402651 403915 404934 405763 406445
60703 406445 407327 408825 410916 413247 415543 417520 418745 419230 419810 421200 422926 424041 424624 425657 427510
60688 427510 429577 431449 433408 435513 437165 437996 438505 439409 440876 442617 444291 445630 446605 447542 448697
60673D48697J156R05R12J173R37M4o00n94q63k058l297l610l490l736l841l036
60657D28699j964j676j685p42Q93J743J421R44Q97Q52O57P87J212J251P57L06
60641D34352O7m47j371k201k642k759k342j202k8R0q70j842k109j784r76L62J628
60624D15926J857J058K86J55K18M5r9OO7q0m2M59J090J353J095N04O8M32J687
60605D26085K921L151K520J818J134rj313j752j019L9O47Q54R07Q18Q28J364K267
60588D41260K826K792K622K589K532K545L003L606L352J927L29k80K28J213K078
60573D72622K547K712L082M122N576O748P455Q124Q975R778J0409J0899J1011
60560E64060J0525R947J0000J0346R812Q055N944M052J819j221m355o446p217
$$ plain form
60673 448697 449853 450758 451670 452843 453780 453824 453224 452630 451767 449709 446412 442802 439312 435576 431735 428699
60657 428699 426735 425059 423374 422632 423525 425268 426689 427633 428530 429382 430039 430826 432038 433289 434046 434352
60641 434352 434419 433972 432601 430400 427758 424999 422657 421455 421427 421517 420647 418805 416696 414912 413936 414298 415926
60624 415926 417783 418841 419127 419282 419500 419545 419446 419452 419519 419439 419397 419856 420946 422299 423394 423898 423966 424398 426085
60605 426085 429006 432157 434677 436495 437629 437620 436307 434555 433536 433575 434222 435076 435983 436801 437629 438993 441260
60588 441260 444086 446878 449500 452089 454621 457166 460169 463775 467127 469054 469383 469103 469331 470544 472622
60573 472622 475169 477881 480963 485085 490661 497409 504864 512988 521963 531741 542150 553049 564060
60560 564060 574585 584532 594532 604878 614690 622745 628689 632741 634560 633339 628984 622538 615321
60547F15321p099o412n195l564j787j03J427L064N187P554R230R869J0676J3010
60533F51178J6296J8550J8947J8603J8569J8461J7530J5789J3328R658M690m11
60521H21188m295o792q579r972j0766j0890j0564j0043r577r314q986q101o615
60508G06694m970l269j125J446L715N259O639Q690J1616J5144J8966K2720K6111
60495H17636K9397L3147L7269M0936M3766M6292M8828N0677N0944M9468M6427
60484A294787M1736L5528K8492K1075J2900L611o210j5707k4776l3646m1807m8269
60472A267714n2671n5423n6817n6702n5059n2338m9078m5505m1668l7691l3858
60461G30904l0403k7288k4193k0929j7728j4983j2841j1319j0508j0230r781q638
$$ plain form
60547 615321 608222 601810 596615 593051 591264 591161 592588 595652 600839 608393 617623 627492 638168 651178
60533 651178 667474 686024 704971 723574 742143 760604 778134 793923 807251 816909 821599 821188
60521 821188 816893 810101 801522 791550 780784 769894 759330 749287 739710 730396 721410 713309 706694
60508 706694 701724 698455 697330 698776 702491 707750 714389 723079 734695 749839 768805 791525 817636
60495 817636 847033 880180 917449 958385 1002151 1048443 1097271 1147948 1198892 1248360 1294787
60484 1294787 1336523 1372051 1400543 1421618 1434518 1438129 1431919 1416212 1391436 1357790 1315983 1267714
60472 1267714 1215043 1159620 1102803 1046101 991042 938704 889626 844121 802453 764762 730904
60461 730904 700501 673213 649020 628091 610363 595380 582539 571220 560712 550482 540701 532063
60449E32063p211o175n326l932k189j216j491k229k610k656k553k062j114k94
60435D91005j10l65n78n02n3O13Q44Q1j111j549j099q08j111j209o56k39n07p28
60417D81918k53K55J20J22J281K905L379K436J368J103J354J519J430J156Q86
60402E00979R96J562K063K158K462L601M923N100L952K652K066J922J747J733
60388E37916K243L066L669L852L803L644L243K495J759J786K900M291M671L770
60374E83108K689K461K883L177L156L156L259L276L215L126K714J739O29J21M37
60359F19146J194J983K584K871K971L345M245N260N848O088O484P213Q012Q671
60345F85915R218R635R730R199P750N372K594J29j886l854n829p257p882q278
$$ plain form
60449 532063 524852 518677 513351 509419 507230 506014 504523 502294 499684 497028 494475 492413 491299 491005
60435 491005 490895 490530 489952 489450 489397 490010 490854 490935 489824 488275 487176 486368 485257 484048 483392 483153 482646 481918
60417 481918 481665 481920 482040 482162 483443 486348 489727 492163 493531 494634 495988 497507 498937 500093 500979
60402 500979 501975 503537 505600 507758 510220 513821 518744 523844 527796 530448 532514 534436 536183 537916
60388 537916 540159 543225 546894 550746 554549 558193 561436 563931 565690 567476 570376 574667 579338 583108
60374 583108 585797 588258 591141 594318 597474 600630 603889 607165 610380 613506 616220 617959 618588 618709 619146
60359 619146 620340 622323 624907 627778 630749 634094 638339 643599 649447 655535 662019 669232 677244 685915
60345 685915 695133 704768 714498 723697 731447 736819 739413 739542 737656 733802 727973 720716 712834 704556
60331G04556r019r914j0485j0645j0375r348p532n664m495l928l448k987k749
60318F13967k597k290j880j385m89Q34J968K631L632N727Q293J0118J1203J2667
60304F62399J5054J7744K0044K1821K2964K3107K2168K0422J7915J4392R948N109
60292H73087Q8n347j1077j6229j9880k1832k2485k2266k1407j9984j8040j5749
60280F78879j3491j1632j0244r188q345p651p050o539o053n367m426l763l972
60267E81158m621m487l205j973j896k456k415j730j418j847k240j978j458j312
60253E48122j489j461r76k81K08K79Q3p2n2P4K62M72M44j1m06NJ087J767J455
60234E49510Q63R17J576K312L055L959M715M935M842M935N249N531N737N880N766
$$ plain form
60331 704556 695537 685623 675138 664493 654118 644770 637238 631574 627079 623151 619703 616716 613967
60318 613967 611370 609080 607200 605815 605326 606160 608128 610759 614391 620118 628411 638529 649732 662399
60304 662399 677453 695197 715241 737062 760026 783133 805301 825723 843638 858030 867978 873087
60292 873087 873175 867828 856751 840522 820642 798810 776325 754059 732652 712668 694628 678879
60280 678879 665388 653756 643512 634324 625979 618328 611278 604739 598686 593319 588893 585130 581158
60267 581158 576537 572050 568845 566872 564976 562520 560105 558375 556957 555110 552870 550892 549434 548122
60253 548122 546633 545172 544196 543915 544123 544402 544485 544413 544361 544435 544697 545169 545613 545602 545196 545201 546288 548055 549510
60234 549510 550373 551290 552866 555178 558233 562192 566907 571842 576684 581619 586868 592399 598136 604016 609782
60219F09782N482N592O277O866O904O982P731Q622Q795Q489Q567R023R117Q739
60205G16968Q454Q337P813O772N842N495N571N689N502M709L437K365J791R49
60191G89694q75l000m116m082l850l887l887l922m561n698o499o655o629o446
60177G25587n494l907k968l487m631n000m245l064k170j760j619j339o94J3K78
60162F85500J15pM1j32p30j369j509r54J06J179J708J582J312J329J418J330J505
60145F92424K424L595M034L594K990K717K742L096L772M194L815L191L457M639
60131G40684N508N298M573M135M034L971L870L699L347L020L113L516L643L285
60117G95696K791K380K029K019K723L620L500K022K82o01q64j540l048m767n819
$$ plain form
60219 609782 615264 620856 627133 633999 640903 647885 655616 664238 673033 681522 690089 699112 708229 716968
60205 716968 725422 733759 741572 748344 754186 759681 765252 770941 776443 781152 784589 786954 788745 789694
60191 789694 788819 785819 781703 777621 773771 769884 765997 762075 757514 751816 745317 738662 732033 725587
60177 725587 720093 716186 713218 709731 705100 700100 695855 692791 690621 688861 687242 685903 685209 685222 685500
60162 685500 685615 685608 685649 685517 684787 683418 681909 680955 681061 682240 683948 685530 686842 688171 689589 690919 692424
60145 692424 694848 698443 702477 706071 709061 711778 714520 717616 721388 725582 729397 732588 736045 740684
60131 740684 746192 751490 756063 760198 764232 768203 772073 775772 779119 782139 785252 788768 792411 795696
60117 795696 798487 800867 802896 804915 807638 811258 814758 816780 817062 816461 815597 814057 811009 806242 800423
60102H00423n938n666n704o006n859m952l817k874j796n17M0p14j660j308L4Q19
60086G54505O28M04N16L02m32j037j416k152l096l339k999l360m777o056o471
60071G21220o782p524p911p474p153p620p920p092n919n629n831n258l887k823
60057F32397k532k420j969j161m1J269K245K435K069J715J679K152L353M929N890
60042F52010N870N807O633P834Q178P308N778L999K015P1j498k726l768m520n033
60027F87958n881p369q823r301q784p988p422p261p693q639r363r130q106p056
60013E75142o377o019n965o098n872m818l253j948j197p26k99P6M23P53R20Q79
59997E35621R05J278J946K712L376L591L169K696L167M534N503N302M838N242
$$ plain form
60102 800423 794485 788819 783115 777109 771250 766298 762481 759607 757811 757294 757334 756620 754960 753652 753686 754505
60086 754505 755133 755537 756053 756355 755923 754886 753470 751318 748222 744883 741884 738524 733747 727691 721220
60071 721220 714438 706914 699003 691529 684376 676756 668836 661744 655825 650196 644365 639107 635220 632397
60057 632397 629865 627445 625476 624315 624274 625543 627788 630223 632292 634007 635686 637838 641191 646120 652010
60042 652010 657880 663687 670320 678154 686332 693640 699418 703417 705432 705503 704005 701279 697511 692991 687958
60027 687958 682077 674708 665885 656584 647800 639812 632390 625129 617436 608797 599434 590304 582198 575142
60013 575142 568765 562746 556781 550683 544811 539993 536740 534792 533595 532869 532570 532646 533069 533822 534742 535621
59997 535621 536526 537804 539750 542462 545838 549429 552598 555294 558461 562995 568498 573800 578638 583880
59983E83880O044N844M290K305N99r61k515l760m510n015n520n972o202o024n236
59968E57247l940k711k060j877j764j629j517j191m41L98P91O87M78M53P40J473
59952E45137K490L128K908K238J883J945J841J189J74p91j336j226p11n30j063
59937E57276j696j596r57p33j187j431n63J239L042M155M593M784N080N539O112
59922E83657O927Q100R224R472Q495O912N598M692L764K719K015J934K080J821
59908F57410J061L61L16R03J518J593J013J6j028j592j257k92M26N78R60K276
59892F64262L762L993K832J571J212J588K155K702L000K803K424K483K914L127
59878G00828L236L933M967N028L698K179J456R44j83j490k137k363k933l825m475
$$ plain form
59983 583880 589924 595768 600058 602363 602962 602001 599486 595726 591216 586201 580681 574709 568507 562483 557247
59968 557247 553307 550596 548536 546659 544895 543266 541749 540558 540117 540515 541306 541993 542471 542924 543664 545137
59952 545137 547627 550755 553663 555901 557784 559729 561570 562759 562933 562142 560806 559580 558869 558339 557276
59937 557276 555580 553984 553027 552294 551107 549676 549113 550352 553394 557549 562142 566926 572006 577545 583657
59922 583657 590584 598684 607908 617380 625875 632787 638385 643077 646841 649560 651575 653509 655589 657410
59908 657410 658471 658832 659148 660051 661569 663162 664175 664191 663163 661571 660314 660022 660448 661026 661986 664262
59892 664262 668024 672017 674849 676420 677632 679220 681375 684077 687077 689880 692304 694787 697701 700828
59878 700828 704064 707997 712964 717992 721690 723869 725325 726269 726086 724596 722459 720096 717163 713338 708863
59863G08863m784m930m679l809k808k337k300k118j511m78R15K168K467J813J374
59848F87846J973K993L489L605L996M509M646M675N275O338P125P294P004O370
59834G57138N559M965M585L758K293J150J139J608J454P60K77j61j406l495n572
59819G74052p112q183q726q636q322q224p995p076n809m963m515l917l229k882
59805F84463k629j896r91p16r01o24J60L86n15j877k845l301l524l719l966m071
59789F53434l588k601k093k729l701l810l243l065l320l028j938q78k75K99R76
59774F20440J249J119J323K148L029L625M200M698M667M382M810N971O601O070
59760F74332N472N952O968P231O665O337O805P459P399O408N052M126L959M069
$$ plain form
59863 708863 704079 699149 694470 690661 687853 685516 683216 681098 679587 679109 680024 682192 684659 686472 687846
59848 687846 689819 692812 696301 699906 703902 708411 713057 717732 723007 729345 736470 743764 750768 757138
59834 757138 762697 767662 772247 776005 778298 779448 780587 782195 783649 784409 784686 784525 783119 779624 774052
59819 774052 766940 758757 750031 741395 733073 724849 716854 709778 703969 699006 694491 690574 687345 684463
59805 684463 681834 679938 678947 678231 677330 676706 676866 677252 676737 674860 672015 668714 665190 661471 657505 653434
59789 653434 649846 647245 645152 642423 638722 634912 631669 628604 625284 622256 620318 619440 619165 619464 620440
59774 620440 621689 622808 624131 626279 629308 632933 637133 641831 646498 650880 655690 661661 668262 674332
59760 674332 679804 685756 692724 699955 706620 712957 719762 727221 734620 741028 746080 750206 754165 758234
59746G58234L748K966K336K123J850J067L3p09j012j110j164j130r58p63q02j270
59730G63439j970k364k153j641j294j148r00l38N78J744K691K765J911R48O11
59715G62879P61R80J343K024K677K934L080L504L978M268M906O375P974Q536P994
59700H24213P282O864O446N934N601N410N101M842M923M909M094K610J154k21
59686H89162j977l870m977m998m589m321m251m522n378o558p491q148q802r109
59672H10171q449p171o461o790p435p598p099n973m320k668j642j154o52l8M23
59657G43144R84K157L736M929N456N543N116L964K546J521O54o84k222l200l868
59642G69776n147o929q126q451q615q735q075o654n610n479n453m766l716k939
$$ plain form
59746 758234 761982 764948 767284 769407 771257 772324 772357 771648 770636 769526 768362 767232 766274 765511 764709 763439
59730 763439 761469 759105 756952 755311 754017 752869 751969 751631 752209 753953 756644 759409 761320 762268 762879
59715 762879 763640 764620 765963 767987 770664 773598 776678 780182 784160 788428 793334 799709 807683 816219 824213
59700 824213 831495 838359 844805 850739 856340 861750 866851 871693 876616 881525 885619 888229 889383 889162
59686 889162 887185 883315 878338 873340 868751 864430 860179 855657 850279 843721 836230 828082 819280 810171
59672 810171 801722 794551 788090 781300 773865 766267 759168 753195 748875 746207 744565 743411 742759 742721 743144
59657 743144 744128 746285 750021 754950 760406 765949 771065 775029 777575 779096 779750 779066 776844 773644 769776
59642 769776 764629 757700 749574 741123 732508 723773 715698 709044 703434 697955 692502 687736 684020 681081
59628F81081k761l446m993o438o631n808n311n577n738n283m674m137l345k498
59614F14441k277k452k064j213j019j466j192J56J204J219J310K259L008K498
59600F14412J474J175J498J693J753J914J802J205P64R23J102P91N33R20J529
59585F33488J712J531J176L88p82j680k127k724l498l497k559k059k991m498n321
59570F06559n404n155m383l154k403k474k248r81J84j22j367k033j714r46M5J110
59554E75514J530J046P15J486K600K769K131J722J855K283L230M804O143O515
59540F14343O663P765R722J1768J3878J6133J7576J7374J6452J6147J5795J3562
59528G77178R431N426K953J659R99J110J752J920J159J72l66p30j533l003n088
$$ plain form
59628 681081 678320 674874 669881 663443 656812 651004 645693 640116 634378 629095 624421 620284 616939 614441
59614 614441 612164 609712 607648 606435 605416 603950 602758 602914 604118 605337 606647 608906 611914 614412
59600 614412 615886 617061 618559 620252 622005 623919 625721 626926 627690 628613 629715 630506 631039 631959 633488
59585 633488 635200 636731 637907 638295 637513 635833 633706 630982 627484 623987 621428 619369 616378 611880 606559
59570 606559 601155 596000 591617 588463 586060 583586 581338 580357 580541 580419 579052 577019 575305 574359 574404 575514
59554 575514 577044 578090 578805 580291 582891 585660 587791 589513 591368 593651 596881 601685 607828 614343
59540 614343 621006 628771 638493 650261 664139 680272 697848 715222 731674 747821 763616 777178
59528 777178 786609 792035 794988 796647 797646 798756 800508 802428 803587 803759 803393 802663 801130 798127 793039
59513G93039p620j0188j2345j3919j4763j4569j3528j2685j2783j3096j2284j0115
59501F45144p564n491m123l456l269k963k158j284p95l36N32J309J307R26J094
59486F18873J722J906J489J272J716K434L019L434L619L475L294L502M048M592
59472F58395N072N520N602M988L927K861J905J204J194J843K273K011J912K928
59458G01635M595N786O404P154Q131Q759Q834Q594Q060P285O831O903O512M593
59444H00076J603j110l154n100p059q497r292r755r747q906p589o529n735m754
59430G14452l721l030k282q08J076K531L704N468P823R923J1548J3203J4732J5300
59416G89919J4922J4733J5365J6214J6540J6270J5463J4056J2297J0465P924L542
$$ plain form
59513 793039 785419 775231 762886 748967 734204 719635 706107 693422 680639 667543 655259 645144
59501 645144 637580 632089 627966 624510 621241 618278 616120 614836 614041 613705 614237 615546 616853 617779 618873
59486 618873 620595 622501 623990 625262 626978 629412 632431 635865 639484 642959 646253 649755 653803 658395
59472 658395 663467 668987 674589 679577 683504 686365 688270 689474 690668 692511 694784 696795 698707 701635
59458 701635 706230 712016 718420 725574 733705 742464 751298 759892 767952 775237 782068 788971 795483 800076
59444 800076 801679 800569 797415 792315 785256 776759 767467 757712 747965 739059 731470 724941 719206 714452
59430 714452 710731 707701 705419 704611 705687 708218 711922 717390 725213 735136 746684 759887 774619 789919
59416 789919 804841 819574 834939 851153 867693 883963 899426 913482 925779 936244 944168 947710
59404I47710k579q644j2734j4130j3033r927n628j226K425M827N473L959M96m116
59390H92873q988j3261j6087j7112j6720j5300j2744r242n855l398j423P39K565
59377G76047L254L397M271N729O344N603M555M147M215M241M008L374K391J772
59363H33348K221L335M056M212M566N445O411P225Q068Q851R356J0007J1456J3406
59349I31963J4893J5671J6319J7020J7308J6968J6208J5012J3271J1345R519P199
59337A102696L761j44l339n822q391j0902j2440j3092j3942j5292j6335j6643
59325I90115j6534j5972j4590j2889j1952j1812j1519j0841j0419j0220r510q483
59313H45374q223q789q986q438q166q685r127q921q694q819q509p146n228l319
$$ plain form
59404 947710 945131 936487 923753 909623 896590 886663 881035 879809 882234 887061 892534 896493 896989 892873
59390 892873 883885 870624 854537 837425 820705 805405 792661 783419 777564 774166 772743 773482 776047
59377 776047 779301 782698 786969 792698 799042 804645 809200 813347 817562 821803 825811 829185 831576 833348
59363 833348 835569 838904 842960 847172 851738 857183 863594 870819 878887 887738 897094 907101 918557 931963
59349 931963 946856 962527 978846 995866 1013174 1030142 1046350 1061362 1074633 1085978 1095497 1102696
59337 1102696 1106457 1106313 1102974 1097152 1088761 1077859 1065419 1052327 1038385 1023093 1006758 990115
59325 990115 973581 957609 943019 930130 918178 906366 894847 884006 873587 863367 853857 845374
59313 845374 837151 828362 819376 810938 802772 794087 784960 776039 767345 758526 750017 742871 737643 734324
59299G34324j359M92J561J907K582M016N418O299P340R069J0943J2363J3373J3693
59285H22021J2324Q965M756R25k315m905o253o090n013l447j052K234N614Q405
59271H36169J0561J1825J1636J0405R535R424Q731O478L570J266o19k940n661
59258I10380q135j0088j1412j1728j1127j0545j0535j0341q997o751m648l275
59246H02798k564k187j616l11J603L396M663N596O201O226N974O133O580O521
59232H49013N935N578N286L880J193j365k917m188n743o852p049p272q250r181
59218H18068r167q708q470p935o574n210m762m707m151l478l456l646l232k643
59204G41929k766l188k761j471l33K94Q50J339J286Q91R74J761K667L330L971
$$ plain form
59299 734324 732965 733457 735018 736925 739507 743523 748941 755240 762580 771649 782592 794955 808328 822021
59285 822021 834345 843310 848066 848991 846676 841771 835518 829428 824415 820968 819916 822150 827764 836169
59271 836169 846730 858555 870191 880596 890131 899555 908286 914764 918334 919600 918981 916041 910380
59258 910380 902245 892157 880745 869017 857890 847345 836810 826469 817472 810721 806073 802798
59246 802798 800234 798047 796431 796120 797723 801119 805782 811378 817579 823805 829779 835912 842492 849013
59232 849013 854948 860526 865812 869692 870885 869520 866603 862415 856672 849820 842771 835499 827249 818068
59218 818068 808901 800193 791723 783788 777214 772004 767242 762535 758384 754906 751450 747804 744572 741929
59204 741929 739163 735975 733214 731743 731410 731704 732554 733893 735179 736070 737044 738805 741472 744802 748773
59189G48773M691N174N194M961M846N036N305N095M163L240L344M331M975M720
59175H13848M415M842N594N928N915N973O097O189O400O627O411N794N328M849
59161H94210L345O80j809l251m461o350q309r398j0057j1302j2963j4055j4317
59148H01963j4205j3858j3180j2483j2026j1320r825q078p134p187p425p026n814
59135F72402m183k793j992j378m30N11P99R08K013L981N315N526N986P700R821
59120G04186J1274J2324J3530J4580J5244J6133J7314J7617J6541J5457J5597
59109H69797J6176J5928J5165J4738J4299J3190J1963J1271J0390Q479O309M911
59097A012616L642J416j099k510l022l697m168l339j802j261j784j839j035q19
$$ plain form
59189 748773 753464 758638 763832 768793 773639 778675 783980 789075 793238 796478 799822 804153 809128 813848
59175 813848 818263 823105 828699 834627 840542 846515 852612 858801 865201 871828 878239 884033 889361 894210
59161 894210 897555 898235 896426 893175 888714 882364 874055 864657 854600 843298 830335 816280 801963
59148 801963 787758 773900 760720 748237 736211 724891 715066 706988 699854 692667 685242 678216 672402
59135 672402 668219 665426 663434 662056 661626 662137 662936 663844 665857 669838 675153 680679 686665 694365 704186
59120 704186 715460 727784 741314 755894 771138 787271 804585 822202 838743 854200 869797
59109 869797 885973 901901 917066 931804 946103 959293 971256 982527 992917 1001396 1007705 1012616
59097 1012616 1016258 1017674 1016575 1014065 1011043 1007346 1003178 999839 998037 996776 994992 993153 992118 991299
59083I91299k235m774p628j0440j2667j3778j4314j5258j6285j6043j4323j2541
59071H51013j1769j1641j1454j1135j0802j0379r938r604r035p876o625o181o581
59058G27993p036p037o658n952m988m211l902l562k663j613j105r59n95j54p6
59043F77482q3L13P56O55L97P56J538K041K426L291M339M832N024N793P151Q455
59027G25166R786J1695J3837J5302J6148J7203J8463J9017J8622J7974J7384J6327
59015I16924J4413J1777Q558M974J783l23j549k313k210p14J441K932L567M157
59001I63417M980N621O039O491O536N450L458J393n87k807n004o727q383j0551
58987I69326j2589j3410j3268j3261j3348j2480j0578q717p351n920m252k812
$$ plain form
59083 991299 989064 984290 976662 966222 953555 939777 925463 910205 893920 877877 863554 851013
59071 851013 839244 827603 816149 805014 794212 783833 773895 764291 755256 747380 740755 734574 727993
59058 727993 720957 713920 707262 701310 696322 692111 688209 684647 681984 680371 679266 678307 677712 677558 677482
59043 677482 677399 677712 678468 679123 679520 680276 681814 683855 686281 689572 693911 698743 703767 709560 716711 725166
59027 725166 734952 746647 760484 775786 791934 809137 827600 846617 865239 883213 900597 916924
59015 916924 931337 943114 951672 956646 958429 958106 956557 954244 952034 951320 952761 955693 959260 963417
59001 963417 968397 974018 980057 986548 993084 998534 1001992 1003385 1002798 999991 994987 988260 979877 969326
58987 969326 956737 943327 930059 916798 903450 890970 880392 871675 864324 858404 854152 851340
58975H51340j484M73K952M861N724O201O885P631Q224Q692Q877Q619Q276Q128
58961I35399P614O161M324K913J484r82m330p551j0364j3036j5050j5700j5611
58948H75271j5947j6368j5559j3625j2045j1268j0214q382o622n479m401l038
58936G52323j834j058n19l83j040k038k567k912m040n738o713o524n919n227m119
58921G01692k955k659l050k907j899r18l32M49J522K270K773L835N303O022N852
58906G14998O072P373Q955J0066J1051J2346J3743J5033J6227J6985J6921J6577
58894H66347J6833J7460J7536J7162J7278J7986J8522J8757J9083J9062J7852
58883A063878J5861J4207J2659J0021O295K610p86m440p836r941j1419j3866j6799
$$ plain form
58975 851340 849856 850329 853281 858142 863866 870067 876952 884583 892807 901499 910376 918995 927271 935399
58961 935399 943013 949174 953498 956411 957895 956913 952583 945032 934668 921632 906582 890882 875271
58948 875271 859324 842956 827397 813772 801727 790459 780245 771863 765241 759762 755361 752323
58936 752323 750489 749431 748912 748529 747489 745451 742884 739972 735932 730194 723481 716957 711038 705811 701692
58921 701692 698737 696078 693028 690121 688222 687304 686972 687421 688943 691213 693986 697821 703124 709146 714998
58906 714998 721070 728443 737398 747464 758515 770861 784604 799637 815864 832849 849770 866347
58894 866347 883180 900640 918176 935338 952616 970602 989124 1007881 1026964 1046026 1063878
58883 1063878 1079739 1093946 1106605 1116626 1122921 1125531 1124745 1120305 1112469 1102528 1091109 1077243 1060444
58870A060444j8071j7473j7144j7912j8041j6452j4543j3666j3213j2424j1925
58859H89580j2206j2499j2309j2283j2565j2150j0792r714r496r142q099p293
58847G61032p182o819n853n548o626p991q592q844r114q747p609o737o370n258
58833F59742l010j238j098j565j366p91l82L00J288J485O61L60J446K576K499
58818F60907K025K191K324J638J057J582K337K006R78L83J91j76m71l39l75j128
58802F75130k022k421k640k889k511j319l58k92m21l17p86k063k730j709J08J512
58786F54272K677M026M948N090N401O515P451P177O121N035L848K715K360K388
58772G20024J168j430l344l679m318o515q327p735o058n737o523o513n502m627
$$ plain form
58870 1060444 1042373 1024900 1007756 989844 971803 955351 940808 927142 913929 901505 889580
58859 889580 877374 864875 852566 840283 827718 815568 804776 795062 785566 776424 768325 761032
58847 761032 753850 747031 741178 735630 729004 721013 712421 703577 694463 685716 678107 671370 665000 659742
58833 659742 656732 655494 654396 652831 651465 650674 650292 650592 651880 653365 654026 654386 655832 658408 660907
58818 660907 662932 665123 667447 669085 670142 671724 674061 676067 677045 677428 677619 677443 676972 676633 676258 675130
58802 675130 673108 670687 668047 665158 662647 661328 660970 660678 660257 659940 659154 657091 654361 652652 652760 654272
58786 654272 656949 660975 665923 671013 676414 682929 690380 697557 703678 708713 712561 715276 717636 720024
58772 720024 721192 719762 716418 712739 708421 701906 693579 685844 679786 674049 667526 661013 655511 650884
58758F50884l853k367n92M62J087K097L003K910K378K494L018L211L554M830O492
58743F79608P634Q618J0000J0954J0552R605R399R677R574R470J0027J0496R853
58730H05467Q637P879P281O199N255N117M819L234J095k42q74j406j245R7J296
58715H52609R59j01l85k92r85j985k267k653m583p434r484j0748j2503j4697j6178
58700G69273j6828j7332j7486j6856j6258j6470j6424j4842j2685j1584j0915
58689F01593r053o599n553n876n721m677m097m353m366l768l159k420r73M64O73
58674E42115J54M78J647K410K780L927N807P190P919Q938J0275J1073J1346J1635
58660F27694J1301R331O438M087J881j570n589p909q096p912q244q201p474p092
$$ plain form
58758 650884 647031 644664 644072 644534 645621 647718 650721 653631 656009 658503 661521 664732 668286 673116 679608
58743 679608 687242 695860 705860 716814 727366 736971 746370 756047 765621 775091 785118 795614 805467
58730 805467 814104 821983 829264 835463 840718 845835 850654 853888 854983 854741 853867 852461 851216 851313 852609
58715 852609 853568 853467 853082 852790 851805 849820 847553 844900 840317 832883 823399 812651 800148 785451 769273
58700 769273 752445 735113 717627 700771 684513 668043 651619 636777 624092 612508 601593
58689 601593 592540 585941 580388 574512 568791 564114 560017 555664 551298 547530 544371 541951 540978 541442 542115
58674 542115 542269 542747 544394 546804 549584 553511 559318 566508 574427 583365 593640 604713 616059 627694
58660 627694 638995 648326 654764 658851 660732 659162 653573 645664 637568 629656 621412 613211 605737 598645
58646E98645p359p299o556n875n381m308k757j791j536r74K19J279J926K611L230
58631E64074L176K659K316J767K81j516k289k047j727j221J95J904K562K401K884
58616E75419M262N504O299P060P352O458N234N118N617N010L342K325K373K171
58602F43544J223N31N14L95j61o45j038j649j862q79N72J218J569L137N732P858
58586F60059R357J1288J3363J3978J2893J1613J1003J0643J0408J0642J0904J0471
58574G96622R874R979J0195R729R772J1947J5341J7815J9572K2458K6205K8622
58562I88131K9361L0268L1878L2576L1499K9370K6218K1110J4576Q637M051l0
58550A247645l733o303q225j0804j3680j5385j6172j7511j9169j9835k0316k2701
$$ plain form
58646 598645 591286 583987 577431 571556 566175 561867 559110 557319 555783 554809 555028 556307 558233 560844 564074
58631 564074 567250 569909 572225 573992 574273 572757 570468 568421 566694 565473 565668 567572 570134 572535 575419
58616 575419 579681 585185 591484 598544 605896 612354 617588 622706 628323 633333 636675 639000 641373 643544
58602 643544 644767 645298 645812 646207 646046 645401 644363 642714 640852 639973 640545 641763 643332 646469 652201 660059
58586 660059 669416 680704 694067 708045 720938 732551 743554 754197 764605 775247 786151 796622
58574 796622 806496 816475 826670 836399 846171 858118 873459 891274 910846 933304 959509 988131
58562 988131 1017492 1047760 1079638 1112214 1143713 1173083 1199301 1220411 1234987 1243624 1247675 1247645
58550 1247645 1243912 1237609 1229384 1218580 1204900 1189515 1173343 1155832 1136663 1116828 1096512 1073811
58538A073811k6414k8644k8789k8903k9460k8548k5823k3492k2339k0379j6672
58527G94348j3140j1236r846p845n995n008m288l579l515l758l014j497q72j275
58513G19480j126k71l18j391j637o20j53j047j948k083k148j966m11J739K114
58498G08214O32j54P38J535J374J683L031M055M507N930Q375R936J0483J2172
58484G72511J5167J6729J5947J5580J7484J9804K0527K0426K0548J9959J7856
58473I72538J5069J1787O687j87o495j0805j3932j6137j6352j5129j4770j5224
58461H97050j3536q770l790o10K225N958R077J0490J1592J3089J3185J0908P950
58448I54818N322J584l725q341j0910j2918j5170j5899j4311j2447j1511r865
$$ plain form
58538 1073811 1047397 1018753 989964 961061 931601 903053 877230 853738 831399 811020 794348
58527 794348 781208 769972 760126 752281 746286 741278 736990 733411 729896 726138 723124 721627 720755 719480
58513 719480 718354 718083 717765 716374 714737 714117 713964 712917 710969 708886 706738 704772 704361 706100 708214
58498 708214 708846 708692 709430 710965 712339 714022 717053 721108 725615 731545 739920 749856 760339 772511
58484 772511 787678 804407 820354 835934 853418 873222 893749 914175 934723 954682 972538
58473 972538 987607 999394 1006081 1005894 999399 988594 974662 958525 942173 927044 912274 897050
58461 897050 883514 874744 870954 870344 872569 878527 887604 898094 909686 922775 935960 946868 954818
58448 954818 960140 961724 957999 949658 938748 925830 910660 894761 880450 868003 856492 846627
58436H46627o617l649k046j86K664M609N051O383R539J1808J1508J0878J1847
58423I08416J2764J1983J0824J0273Q496M479M34k135n035r379j2805j3552j3537
58410I11226j4509j4900j3439j2014j1892j0916p583m215k933k200m06R57Q17
58397H17993J279L622N456N068M608N657N861L538J391J749K267M28j723j504
58383H55690m45q89j486k41J411J698K173M252N763M943M162N654P393P296P494
58368I04868J0005J2308J1864J1047J2702J4722J4122J2766J3782J5689J5356
58357A049231J3598J2718J1630Q444M906L449K841J266L85J795L096K126J397
58344A116882L502O064O181N932Q245J1351J2643J3889J7078J9332J7812J5520
$$ plain form
58436 846627 840010 836361 834315 834129 836793 841402 846453 852836 862375 874183 885691 896569 908416
58423 908416 921180 933163 943987 954260 962756 967235 967669 965534 960499 951120 938315 924763 911226
58410 911226 896717 881817 868378 856364 844472 833556 825973 821758 818825 816625 816219 817176 817993
58397 817993 819272 822894 828350 833418 838026 843683 849544 853082 854473 856222 858489 858917 857194 855690
58383 855690 855245 854356 852870 852629 854040 855738 857911 862163 867926 872869 877031 882685 890078 897374 904868
58368 904868 914873 927181 939045 950092 962794 977516 991638 1004404 1018186 1033875 1049231
58357 1049231 1062829 1075547 1087177 1095621 1100527 1103976 1106817 1108083 1108468 1110263 1113359 1115485 1116882
58344 1116882 1120384 1126448 1132629 1138561 1146806 1158157 1170800 1184689 1201767 1221099 1238911 1254431
58332A254431J6218J7644J5972J2891J1816J1088P669L815L244M134K708L42M85
58319A362457J925J728J411L527N838N479N165Q314J2085J2351J1470J3692J6925
58306A462367J6963J5813J7718K0635K0029J7589J7837J9452J8297J5731J5662
58295A658093J6709J5561J4509J7217K0782K0609J9313K1821K5739K5946K4664
58284A880963K7243L1894L3632L4433L9134M5053M6438M5722M9388N6021N9415
58273B349336O0115O2795O5584O3524N9361N9368O1799O1037N9470O3013O8706
58262C034108O9521O7752P0471P5371P4931P1023P1150P3601P1119O6120O7046
58251C812213P2457P4231P3781P9177Q8796R4163R6563J04185J15254J21148J23782
$$ plain form
58332 1254431 1270649 1288293 1304265 1317156 1328972 1340060 1347729 1351544 1354788 1358922 1361630 1361972 1362457
58319 1362457 1364382 1366110 1367521 1371048 1376886 1382365 1387530 1395844 1407929 1420280 1431750 1445442 1462367
58306 1462367 1479330 1495143 1512861 1533496 1553525 1571114 1588951 1608403 1626700 1642431 1658093
58295 1658093 1674802 1690363 1704872 1722089 1742871 1763480 1782793 1804614 1830353 1856299 1880963
58284 1880963 1908206 1940100 1973732 2008165 2047299 2092352 2138790 2184512 2233900 2289921 2349336
58273 2349336 2409451 2472246 2537830 2601354 2660715 2720083 2781882 2842919 2902389 2965402 3034108
58262 3034108 3103629 3171381 3241852 3317223 3392154 3463177 3534327 3607928 3679047 3745167 3812213
58251 3812213 3884670 3958901 4032682 4111859 4200655 4294818 4391381 4495566 4610820 4731968 4855750
58240D855750J32270J44783J51971J55894J66526J81966J91880J98165K11568
58231F390773K30152K42752K51686K69365K94193L13491L28709L53177L86126
58222I060424M14618M40174M76528N22077N62916O02356O57460P26836P93708
58213A4257097Q60802R48390J057724J172643J298180J458740J656867J875851
58205B4586294K125734K442333K838282L303419L855441M534920N346352O265467
58197E5298242P310530Q538086R963364J1565041J3371219J5433126J7696420
58190A39176028K0027831K2391678K4792787K6902798K7910275K6958720K3668303
58183C11828420J8087323J0345585P87540r487396j8638621k5018518k8111769
$$ plain form
58240 4855750 4988020 5132803 5284774 5440668 5607194 5789160 5981040 6179205 6390773
58231 6390773 6620925 6863677 7115363 7384728 7678921 7992412 8321121 8674298 9060424
58222 9060424 9475042 9915216 10391744 10913821 11476737 12079093 12736553 13463389 14257097
58213 14257097 15117899 16066289 17124013 18296656 19594836 21053576 22710443 24586294
58205 24586294 26712028 29154361 31992643 35296062 39151503 43686423 49032775 55298242
58197 55298242 62608772 71146858 81110222 92675263 106046482 121479608 139176028
58190 139176028 159203859 181595537 206388324 233291122 261201397 288160117 311828420
58183 311828420 329915743 340261328 341048868 331561472 312922851 287904333 259792564
58176B59792564k8504935k7120322k4659404k1610915j8407698j5399976j2784858
58169A11304456j0661569r105511q134585p643524p420857p233631o912896o408167
58161D7783716n781568n129490m501983l904053l347206k857035k438080k072742
58153A7751559j756282j499171j295133j120197r65458q40698p44251o58943n80086
58144H291340n19160m76482m36869l95743l64007l43304l20756k92384k68547
58135D874088k51913k32181k07087j87353j76055j63420j46649j35279j32079
58126C242072j27609j18691j13956j15831j14714j06639r9884r8456r5015q5998
58116B165279p8328p5437p1061o2646n6935n6685n5181m9280m5080m5460m4627
$$ plain form
58176 259792564 231287629 204167307 179507903 157896988 139489290 124089314 111304456
58169 111304456 100642887 91537376 83402791 75759267 68338410 61104779 54191883 47783716
58161 47783716 42002148 36872658 32370675 28466622 25119416 22262381 19824301 17751559
58153 17751559 15995277 14496106 13200973 12080776 11115318 10274620 9530369 8871426 8291340
58144 8291340 7772180 7295698 6858829 6463086 6099079 5755775 5435019 5142635 4874088
58135 4874088 4622175 4389994 4182907 3995554 3819499 3656079 3509430 3374151 3242072
58126 3242072 3114463 2995772 2881816 2765985 2651271 2544632 2444748 2346292 2251277 2165279
58116 2165279 2086951 2011514 1940453 1877807 1820872 1764187 1709006 1659726 1614646 1569186 1524559
58105A524559m0103l7849m0291m1140l7303l4519l6005l6622l3202l0055k9323
58094A128147k6432j9842j5096j4429j2476o841l013m056n221l541l219o572r049
58081I98360q223q720j3190j7017j7002j6917j9511k1166j9416j7893j8985j9164
58069H01156j6322j4223j5124j5350j2693j0914j2278j2837r835o908p291q458
58057F58923p901p725r173r233o864o127q891j0899r299p514q294q576n928l623
58043E48876m433n427l942k796m672o780o145m897n527n982m318l198m979p024
58029D78756o535n483o268p043n826m774n932p039n921m814n971p183n987m262
58015C95718m369m670l080j298j368j772q16k17j500k589j723q62j521j313J459
$$ plain form
58105 1524559 1484456 1446607 1406316 1365176 1327873 1293354 1257349 1220727 1187525 1157470 1128147
58094 1128147 1101715 1081873 1066777 1052348 1039872 1033031 1030018 1025962 1020741 1017200 1013981 1007409 998360
58081 998360 990137 981417 968227 951210 934208 917291 897780 876614 857198 839305 820320 801156
58069 801156 784834 770611 755487 740137 727444 716530 704252 691415 681580 674672 667381 658923
58057 658923 651022 643297 634124 624891 618027 611900 603009 592110 582811 575297 567003 558427 552499 548876
58043 548876 544443 539016 535074 532278 527606 520826 514681 509784 504257 498275 493957 490759 485780 478756
58029 478756 472221 466738 460470 453427 447601 442827 436895 429856 423935 419121 413150 405967 399980 395718
58015 395718 391349 386679 383599 382301 380933 379161 378345 378128 376628 374039 372316 371454 369933 368620 370079
58000C70079L845L081J463K132L721L522K499K720L143K121J137J836K446J031
57986D04776p36q35q29k668m680m728m183m908n432m088k823l690m594k860j76
57971C57546L28p38r88q50j868k786j672J74M96J39R38J761O74j060j174n37j175
57954C49208k193j685p43j421k521j582N62J331J039J880L560L997L377L699N040
57939C63548N855O227P501R357J0412J0879J1786J2463J1549R542P818O175L879
57926D76991J776Q16q0k173m481n703o746q700j0230r868q972r301r581p802n178
57911C90768m266m587l761j779o34o52n43k88p86j369p03N39O71o6j12P09J550
57894C74691K529L946M688L875K830L008L458K836K211K944L566J910j051k803
$$ plain form
58000 370079 373924 377005 378468 380600 384321 387843 390342 393062 396205 398326 399463 401299 403745 404776
57986 404776 404040 403205 402376 399708 395028 390300 386117 381209 375777 371689 368866 365176 360582 357722 357546
57971 357546 357874 357136 356148 355298 353430 350644 348972 349146 349642 349781 350719 352480 353154 352094 350920 350383 349208
57954 349208 347015 345330 344587 343166 340645 339063 339625 340956 341995 343875 347435 351432 354809 358508 363548
57939 363548 369403 375630 383131 392488 402900 413779 425565 438028 449577 459119 466937 473112 476991
57926 476991 478767 479583 479503 477330 472849 467146 460400 451700 441470 431602 422630 413329 403748 395946 390768
57911 390768 386502 381915 378154 376375 375741 375089 374546 374258 373472 372103 371400 371939 372610 372544 372432 373141 374691
57894 374691 377220 381166 385854 389729 392559 395567 399025 401861 404072 407016 410582 412492 411441 408638
57880D08638l326m332n654n801n064m898n038m392l703m265m937l717j363j93
57866C51955j40P37K541L625L834M456N387N447N145O123Q169R555R959J0312
57852D27105J0356R092P147N957N166L465J336K69o2j098k693l733m616o289p795
57837D43607p658o761o876p345o459m975m832n276m037j655q25j808k228j336
57823C81536p08p75l15M94M1j428j987j627k261l922m559l960m245n826o451n226
57807C38781m152m539n017m341l360k943k551j983k174l153l547k842k088j696
57793B94395q04N79J242J182J945L888N424N698N747O302O691O684P221Q546R602
57778C64342R976J0510J1417J1656J0743R311P676N578L512K319J442l91k843
$$ plain form
57880 408638 405312 400980 395326 389525 384461 379563 374525 370133 366430 362165 357228 353511 352148 351955
57866 351955 351815 352552 355093 358718 362552 367008 372395 377842 382987 389110 397279 406834 416793 427105
57852 427105 437461 446553 453700 459657 464823 468288 469624 469893 469831 468733 466040 462307 457691 451402 443607
57837 443607 435949 429188 422312 414967 408508 403533 398701 393425 389388 387733 386908 385100 382872 381536
57823 381536 380828 380053 379738 380232 380273 378845 376858 375231 372970 369048 364489 360529 356284 350458 344007 338781
57807 338781 334629 330090 325073 320732 317372 314429 311878 309895 307721 304568 301021 298179 296091 294395
57793 294395 293591 294170 295412 296594 298539 302427 307851 313549 319296 325598 332289 338973 346194 354740 364342
57778 364342 374318 384828 396245 407901 418644 427955 435631 441209 444721 447040 448482 448091 445248
57765D45248m424n086o004p063p167o837p609q931q717p078o267o677o175m094
57751C53119k468k386k379j522j014j293p67J115K369J738P86J036J547J137O76
57736C51694J324K409K876L059L464L520K953K713L264L605L155K866L321L571
57722C93794K968K336K178J627L11o06m93m35j170j732j429j260k037k851k841
57707C88360k709l135l421l049k926l643m105l304j974j084k15J127K059J681
57693C63662O65J46J48J98K95K67n89k178l196k885j948r25P67L325N740P460
57677C70952R438J2508J6153J9802K3776K8153L2255L6152M1002M7029N2698N6644
57665G46562N8527N7250N0533L7526K0009J70k0710m0340n4838o1936o2979o0368
$$ plain form
57765 445248 440824 435738 429734 422671 415504 408667 401058 392127 383410 376332 370065 363388 357213 353119
57751 353119 350651 348265 345886 344364 343350 342057 341290 342405 344774 346512 347298 348334 349881 351018 351694
57736 351694 353018 355427 358303 361362 364826 368346 371299 374012 377276 380881 384036 386902 390223 393794
57722 393794 396762 399098 401276 402903 403214 402608 402115 401680 400510 398778 397349 396089 394052 391201 388360
57707 388360 385651 382516 379095 376046 373120 369477 365372 362068 360094 359010 358795 359922 361981 363662
57693 363662 364327 364473 364621 364819 365114 365381 364792 362614 359418 356533 354585 353660 354427 357752 363492 370952
57677 370952 380390 392898 409051 428853 452629 480782 513037 549189 590191 637220 689918 746562
57665 746562 805089 862339 912872 950398 970407 970577 949867 909527 854689 792753 729774 669406
57653F69406n5062m7935m1130l5908l0985k5138j9660j6260j4210j1823r239p531
57641C54525o338m622k755j822j665j440j146j071p07J85O36J70P7J244K125R11
57625C38307j488k774k559k197k146j774j231j385k081k244j613q71l51J37M62
57610C16192L77J98L31N20L95J08k04p30j173q02M7K0r52j177rQ39J85n43J59
57591C13781J169Q01k48l87r1q13k072k179j101j87K65R34J490J027n2o27q62
57574C10848j641k507k250j171p27j205j553j311r48o28k92m48j239j403N2J845
57558B95422K117J399J708L208M158L934L674L897L830L346L440M272M663M010
57544C43078L096K496J787P65R8K29P55J239J694K117K448K884L427L382K338
$$ plain form
57653 669406 614344 566409 525279 489371 458386 433248 413588 397328 383118 371295 362056 354525
57641 354525 348187 343565 340810 338988 337323 335883 334737 333666 332959 333144 333780 333950 334027 335271 337396 338307
57625 338307 336819 334045 331486 329289 327143 325369 324138 322753 320672 318428 316815 315944 315593 315730 316192
57610 316192 316569 316767 317098 317618 318013 318121 317917 317187 316014 315212 315259 315279 314327 313150 313141 313980 314165 313622 313781
57591 313781 314950 315751 315503 315116 315025 314212 312140 309961 308860 308673 308938 309872 311362 312389 312337 311710 310848
57574 310848 309207 306700 304450 303279 302552 301347 299794 298483 297535 296907 296615 296167 294928 293525 293577 295422
57558 295422 297539 298938 300646 303854 308012 311946 315620 319517 323347 326693 330133 334405 339068 343078
57544 343078 346174 348670 350457 351222 351320 351549 352304 353543 355237 357354 359802 362686 366113 369495 371833
57529C71833J135Q02J019Q77N86R23J562J553J122J396K562L735M402M625M181
57514D02313L070K431L315M819N114M052L117L045L238L396L832M222L755K647
57500D52366J896J563Q76j2p2P14J267J280J528K131K194J524J102J476K100K552
57484D74485L086L606L453K543J573R63O58R44K186L728M400M118L766L597L187
57469E16293K757K960L426L120K258K144K974L451K989K637L329M576N448N652
57455E64014N226M343L726M096N017N331M884M623M934N195N068N021N343N853
57441F32674O579P612Q297P909P029O898P442P395O405N493N331N578O032O914
57427G27588P851Q026P573P440P763P736P155O603O104N194M353M625N759O471
$$ plain form
57529 371833 372968 373770 374789 375666 376252 377175 378737 380290 381412 382808 385370 389105 393507 398132 402313
57514 402313 405383 407814 411129 415948 421062 425114 428231 431276 434514 437910 441742 445964 449719 452366
57500 452366 454262 455825 456701 456689 456617 457331 458598 459878 461406 463537 465731 467255 468357 469833 471933 474485
57484 474485 477571 481177 484630 487173 488746 489709 490367 491311 493497 497225 501625 505743 509509 513106 516293
57469 516293 519050 522010 525436 528556 530814 532958 535932 539383 542372 545009 548338 552914 558362 564014
57455 564014 569240 573583 577309 581405 586422 591753 596637 601260 606194 611389 616457 621478 626821 632674
57441 632674 639253 646865 655162 663071 670100 676998 684440 691835 698240 703733 709064 714642 720674 727588
57427 727588 735439 743465 751038 758478 766241 773977 781132 787735 793839 799033 803386 808011 813770 820241
57413H20241O651P433Q836R430Q820Q424R097R824R666R205R174R205Q870Q581
57399I43457Q581Q354P816P812Q665R446R431R126R247R823J0768J2123J3288
57386A067937J3332J2510J2192J2827J3432J3435J3479J3862J3808J2991J2211
57375A212016J1872J1324J0415J0166J0986J1751J1542J0985J0936J1229J1546
57364A334768J2215J3225J3704J3304J2870J3067J3532J4053J5139J6625J7278
57353A489780J6659J6004J6224J6572J6297J6133J6884J7890J8199J8066J8050
57342A676758J7757J6795J5994J6314J7356J8112J8403J8577J8581J8399J8603
57331A871649J9467K0265K0370K0253K0595K1218K1726K2327K3145K3591K3267
$$ plain form
57413 820241 826892 834325 843161 852591 861411 869835 878932 888756 898422 907627 916801 926006 934876 943457
57399 943457 952038 960392 968208 976020 984685 994131 1003562 1012688 1021935 1031758 1042526 1054649 1067937
57386 1067937 1081269 1093779 1105971 1118798 1132230 1145665 1159144 1173006 1186814 1199805 1212016
57375 1212016 1223888 1235212 1245627 1255793 1266779 1278530 1290072 1301057 1311993 1323222 1334768
57364 1334768 1346983 1360208 1373912 1387216 1400086 1413153 1426685 1440738 1455877 1472502 1489780
57353 1489780 1506439 1522443 1538667 1555239 1571536 1587669 1604553 1622443 1640642 1658708 1676758
57342 1676758 1694515 1711310 1727304 1743618 1760974 1779086 1797489 1816066 1834647 1853046 1871649
57331 1871649 1891116 1911381 1931751 1952004 1972599 1993817 2015543 2037870 2061015 2084606 2107873
57320B107873K2700K2415K2166K1854K2206K3599K5087K5540K5084K4650K4787
57309B367961K5516K6577K7216K6629K5232K4585K5498K7189K8705L0004L1134
57298B666246L1677L1702L2064L3001L3596L3321L2899L2917L2937L2681L2717
57287C025758L3217L3412L3152L3491L4871L6159L6461L6425L6773L7058L6995
57276C413772L7386L8577L9517L9554L9658M0520M1077M0431L9653M0045M0978
57265C851168M1167M0836M0928M1299M1411M1714M2669M3464M3277M2831M3097
57254D313861M3514M3124M2402M2292M2566M2754M3569M5526M7228M7076M5796
57243D799708M5342M6076M6930M7614M8534M9227M8911M8333M9059N1210N3570
$$ plain form
57320 2107873 2130573 2152988 2175154 2197008 2219214 2242813 2267900 2293440 2318524 2343174 2367961
57309 2367961 2393477 2420054 2447270 2473899 2499131 2523716 2549214 2576403 2605108 2635112 2666246
57298 2666246 2697923 2729625 2761689 2794690 2828286 2861607 2894506 2927423 2960360 2993041 3025758
57287 3025758 3058975 3092387 3125539 3159030 3193901 3230060 3266521 3302946 3339719 3376777 3413772
57276 3413772 3451158 3489735 3529252 3568806 3608464 3648984 3690061 3730492 3770145 3810190 3851168
57265 3851168 3892335 3933171 3974099 4015398 4056809 4098523 4141192 4184656 4227933 4270764 4313861
57254 4313861 4357375 4400499 4442901 4485193 4527759 4570513 4614082 4659608 4706836 4753912 4799708
57243 4799708 4845050 4891126 4938056 4985670 5034204 5083431 5132342 5180675 5229734 5280944 5334514
57232E334514N5647N7942O0492O2767O4780O6828O8436O8998O9015O9304O9433
57221F048156O8423O6475O4588O2959O1374O0615O1836O4800O8144P1122P3798
57210F772290P6085P7949Q0120Q3237Q6793Q9996R2975R5872R7677R7379R5412
57199G745785R2555Q8452Q2875P7306P3348P0507O7522O4888O3861O3756O2671
57188H553526O0369N8162N6365N4118N1492M9422M7762M5533M3056M1706M1608
57177I103119M1553M1180M1302M2094M2794M3152M3346M2698M0318L6831L3579
57166I551966L0393K6089K0718J5171Q879L68r950j9933k8788l7693m7005n5230
57154I454985o1373o6353p0864p2721o6886m8791k0112P062J5176m165l9783o8763
$$ plain form
57232 5334514 5390161 5448103 5508595 5571362 5636142 5702970 5771406 5840404 5909419 5978723 6048156
57221 6048156 6116579 6183054 6247642 6310601 6371975 6432590 6494426 6559226 6627370 6698492 6772290
57210 6772290 6848375 6926324 7006444 7089681 7176474 7266470 7359445 7455317 7552994 7650373 7745785
57199 7745785 7838340 7926792 8009667 8086973 8160321 8230828 8298350 8363238 8427099 8490855 8553526
57188 8553526 8613895 8672057 8728422 8782540 8834032 8883454 8931216 8976749 9019805 9061511 9103119
57177 9103119 9144672 9185852 9227154 9269248 9312042 9355194 9398540 9441238 9481556 9518387 9551966
57166 9551966 9582359 9608448 9629166 9644337 9653216 9653584 9643634 9623701 9594913 9557220 9510215 9454985
57154 9454985 9393612 9327259 9256395 9183674 9116788 9067997 9047885 9054947 9070123 9065958 9026175 8957412
57142H957412p6082o5031m9453m0135l9524m4751n1772n7793o2266o5914o8899
57131H335792p1118p3827p8654q4821q9695r2453r4648r6639r6148r1421q3537
57120G382831p4549o5604n7889n3203n2054n2874n3931n4322n2449m5674l2609
57109F787673j4125Q406L4073O1558Q9875J20770J58200K05207K63826L37835
57099H053298M31436N43873O69357Q05277R58703J143667J374261J660177K003375
57090A7643424K394743K815361L242687L653886M024205M327491M538463M626127
57082D7266387M543698M242502L717307L039621K328671J673811J081068M92867
57074F8385932j46658q45647j568043k264872k897799l441778l876904m183972
$$ plain form
57142 8957412 8881330 8816299 8766846 8726711 8687187 8642436 8590664 8532871 8470605 8404691 8335792
57131 8335792 8264674 8190847 8112193 8027372 7937677 7845224 7750576 7653937 7557789 7466368 7382831
57120 7382831 7308282 7242678 7184789 7131586 7079532 7026658 6972727 6918405 6865956 6820282 6787673
57109 6787673 6773548 6781954 6816027 6877585 6967460 7088230 7246430 7451637 7715463 8053298
57099 8053298 8484734 9028607 9697964 10503241 11461944 12605611 13979872 15640049 17643424
57090 17643424 20038167 22853528 26096215 29750101 33774306 38101797 42640260 47266387
57082 47266387 51810085 56052587 59769894 62809515 65138186 66811997 67893065 68385932
57074 68385932 68239274 67393627 65825584 63560712 60662913 57221135 53344231 49160259
57066D9160259m348761m369293m258469m040584l745708l404738l045115k687801
57058A9259790k346980k031858j747808j496533j277056j087527r25846p89068
57050G557114o73519n75973m94105m25893l69392l23001k85144k53783k26925
57041C929379k03471j82983j64947j48986j35266j23803j13675j03894r4621q6534
57031B571199p9398p2388o5413n8955n2784m6117l8911l1748k4527j6505p576
57020B076877J796J1925K3625L5931M5497M9154M6193L7161K1390k620l3949o7379
57008B245601r5609j13541j20511j18925j11674j01023q8997p7457o7361n8587
56998A291916n0745m3796l7824l2781k8594k5116k1851j8333j4826j2080j0260
$$ plain form
57066 49160259 44811498 40442205 36183736 32143152 28397444 24992706 21947591 19259790
57058 19259790 16912810 14880952 13133144 11636611 10359555 9272028 8346182 7557114
57050 7557114 6883595 6307622 5813517 5387624 5018232 4695231 4410087 4156304 3929379
57041 3929379 3725908 3542925 3377978 3228992 3093726 2969923 2856248 2752354 2657733 2571199
57031 2571199 2491801 2419413 2354000 2295045 2242261 2196144 2157233 2125485 2100958 2084453 2076877
57020 2076877 2078673 2090598 2114223 2150154 2195651 2244805 2290998 2328159 2349549 2346929 2312980 2245601
57008 2245601 2149992 2036451 1915940 1797015 1685341 1584318 1495321 1417864 1350503 1291916
56998 1291916 1241171 1197375 1159551 1126770 1098176 1073060 1051209 1032876 1018050 1005970 995710
56987I95710q729o929m844k628m91J014J473J226N73j394n770j1581j6157j8092
56973I23381j8400j8231j7207j4845j2022r784p911n807l773k177l16K666O447
56960H22021J0096J3219J5667J6875J6483J4867J2219P819J196o788j4748k1822
56948H87104k7167k9605k8873k6381k3634k0698j7104j3226r630o015k034J700
56936F84437M652P570J1329J5392J8704K1326K3673K4798K2989J7766J0001N28
56924H63165r939j9837k7173l1106l2276l1695l0138k8238k6236k3846k0954j8072
56912E63655j5579j3193j0814r113q410p901o845n686m986m205k739j298r50j425
56898D70511j562r53M6J270K682L949N013O427Q278R736J0573J1993J4700J7276
$$ plain form
56987 995710 986981 980052 975208 972580 972089 973103 974576 975802 976375 974981 969211 957630 941473 923381
56973 923381 904981 886750 869543 854698 842676 832892 824981 819174 815401 813224 812908 815574 822021
56960 822021 832117 845336 861003 877878 894361 909228 921447 929266 930462 923674 908926 887104
56948 887104 859937 830332 801459 775078 751444 730746 713642 700416 690786 684771 682737 684437
56936 684437 689089 696659 707988 723380 742084 763410 787083 811881 834870 852636 862637 863165
56924 863165 853226 833389 806216 775110 742834 711139 681001 652763 626527 602681 581727 563655
56912 563655 548076 534883 524069 514956 506546 498645 491800 486114 481128 476923 474184 472886 471936 470511
56898 470511 468949 467996 468042 469312 471994 475943 480956 487383 495661 505397 515970 527963 542663 559939
56884E59939J7942J6780J4700J1366O054k31n513r174j1724j2902j1929r338o617
56871E59353m129j069K680O291R523J2937J6671K0403K4382K9045L3731L7093
56859G46911L8711L8953L7458L3068K5172J4132Q03j3078k4658l1610l3909l2925
56847G99028k9445k3901j7634j1940o361L60P988J5242K2074K9548L7624M5096
56835H67679N1615N7738O2820O4773O2181N4949M2613K4133K81k5074m6925o1776
56823A155007o8584o8502o4042n7487m9719m1043l2375k4469j6609p696J693R914
56811G36088J6679K3233L0208L6771M1856M4671M4139L9270L0098J7093L06j9196
56799A041216l7620n0456n6359n7314n5250n0524m3669l6268k9382k2896j6797
$$ plain form
56884 559939 577881 594661 609361 620727 626781 626550 621037 611863 600139 587237 575308 565970 559353
56871 559353 555224 554155 556835 563126 572649 585586 602257 622660 647042 676087 709818 746911
56859 746911 785622 824575 862033 895101 920273 934405 935208 922130 897472 865862 831953 799028
56847 799028 769583 745682 728048 716108 709747 710107 718095 733337 755411 784959 822583 867679
56835 867679 919294 977032 1039852 1104625 1166806 1221755 1264368 1288501 1288782 1263708 1216783 1155007
56823 1155007 1086423 1017921 953879 896392 846673 805630 773255 748786 732177 724481 726174 736088
56811 736088 752767 776000 806208 842979 884835 929506 973645 1012915 1043013 1060106 1060412 1041216
56799 1041216 1003596 953140 896781 839467 784217 733693 690024 653756 624374 601478 584681
56788E84681j1481o549j070M650R186J2271J5209J8616K1390K2318K1060J7142
56776G07423R744p99j2470k3069l1184l5791l6516l4599l2046k9534k6346k2409
56764D32404j8827j6269j4355j2775j1545j0183q262o597o236o375n304l287k343
56751C10046l032l733l415k783k342j546n53n00j300j338j89N11k10j138j158
56736B87320r67j327j521q63r7J0M4P20J526J713J429J026M57M7N49J793K546
56719B94405K316J921J809J422P54Q11J788K425J948J063L79n42j689j903n82
56704C06325J232K252K221J291l14j656j660p80m87q89p35N7J17p46j016k04L13
56687C05321p1k05K84N9j219j834r16Q6K23O88K099K787J699N50J025K059K018
$$ plain form
56788 584681 573200 566651 565581 570231 579417 591688 606897 625513 646903 669221 690281 707423
56776 707423 717167 716368 703898 680829 649645 613854 577338 542739 510693 481159 454813 432404
56764 432404 413577 397308 382953 370178 358633 348450 340188 333591 327355 320980 315676 312389 310046
56751 310046 307014 303281 299866 297083 294741 293195 292642 292142 290842 289504 289315 289826 289616 288478 287320
56736 287320 286353 285026 283505 282642 282545 282555 282599 283319 284845 286558 287987 289013 289470 289517 290066 291859 294405
56719 294405 296721 298642 300451 301873 302627 303438 305226 307651 309599 310662 311041 310499 308810 306907 306325
56704 306325 307557 309809 312030 313321 313007 311351 309691 308911 308424 307535 306800 306857 306974 306228 305212 305008 305321
56687 305321 305250 305045 305329 305388 304169 302335 301419 301505 301728 302416 304515 307302 309001 309551 310576 312635 314653
56670C14653J470J565J665Q77J49N19R80L35m39mP15J04j205j479p88m30m15K00
56652C18472J230J742J742J762J515O52j23k64o07j726k378j458j75k45j101j046
56636C17992j85j6r47k193l355m214l892k141n71o48j414j204n19r25k076k248
56620B91444j298o94r25j088q87r25j181j008n72n84q29n27J51M36L90N09L92
56603B82804n80j747j933j300q77p52k77L92N81N03Q25J233Q75k8m41m6O55J318
56585B81205J804J820J541J764K505K493J157k02m31k15k90L08K267L970L779
56570C03475K909L499N010N382M878N744Q308J0424J0927J1124J2332J4143J5554
56557D13709J6128J5633J3988J1758R506O839L354k9k031k776l143l068k216j575
$$ plain form
56670 314653 316123 317688 319353 320230 320379 320898 321878 322213 321774 321770 322485 322589 321384 319905 319117 318687 318272 318472
56652 318472 319702 321444 323186 324948 326463 327115 326992 326728 326121 324395 322017 320559 320384 320139 319038 317992
56636 317992 317807 317791 316844 314651 311296 307082 303190 301049 300478 299830 298416 297212 296693 295768 293692 291444
56620 291444 290146 289452 288527 287439 286552 285627 284446 283438 282866 282282 281453 280926 281077 281513 281903 282412 282804
56603 282804 282224 280477 278544 277244 276367 275615 275338 275730 276311 276814 277639 278872 279747 279719 279278 279232 279887 281205
56585 281205 283009 284829 286370 288134 290639 293132 294289 294087 293656 293441 293151 293459 295726 299696 303475
56570 303475 306384 309883 314893 320275 325153 330897 339205 349629 360556 371680 384012 398155 413709
56557 413709 429837 445470 459458 471216 480722 487561 490915 490886 488855 486079 482936 479868 477652 476077
56543D76077k398m038m719m187l766m223n165o263p303p513o536n600n998p032
56529D01336p120o326n913o019n775n212n036n020m447l704l525l343k324j408
56515C36164k032l483l853l141l008l734l939l198k595k553k339j780j488j322
56501B97699n70L57L37m46p50m65n71j164j395j241j406j677j267n40m44o29m5
56484B85783R12J019M81M13N41k79j560j754j025r64j629j476k18P22Q44J141
56468B82951J801J795J042P11J039J015M87M13P73M42n81r36k52L39K74K32M77
56451B92022M83L35O57J133R70O82J420K751L191K628K063J383j94j789j726n00
56435C05509k66j418k361k519k773k943j864q7M89r6P4J214J422L38r3Q47J427
$$ plain form
56543 476077 473679 469641 464922 460735 456969 452746 447581 441318 434015 426502 419966 414366 408368 401336
56529 401336 394216 387890 381977 375958 370183 364971 359935 354915 350468 346764 343239 339896 337572 336164
56515 336164 334132 330649 326796 323655 320647 316913 312974 309776 307181 304628 302289 300509 299021 297699
56501 297699 297129 297486 297823 297377 296627 296162 295591 294427 293032 291791 290385 288708 287441 286901 286457 285828 285783
56484 285783 286695 287714 288195 288608 289149 288870 287310 285556 284531 283567 281938 280462 280244 280966 281810 282951
56468 282951 284752 286547 287589 288300 289339 290354 290841 291254 292027 292469 291888 290952 290700 291039 291313 291545 292022
56451 292022 292505 292840 293497 294630 295600 296282 297702 300453 303644 306272 308335 309718 309524 307735 306009 305509
56435 305509 305243 303825 301464 298945 296172 293229 291365 291278 291767 291671 291745 292959 294381 294719 294626 295473 296900
56418B96900P44K46R16J627J412R21O33L7o80m51M87O54Q1L82J632J959Q87J00
56400C08487K12k13j501j856o83Q0o48j219j91J407K196K369K224J237r1mJ629
56383C13435K597J767P25P47P51k27j022m46P12J279J333J083J45r44p34O36J203
56366C23040L99jQ32J297M53j51O56J586J302O54P70J116J006R65J228R68K80
56349C36400O93K383L217K000L13k43l04p19o89M32J551J713J658K155K621K601
56333C55782K671K994K953K994M311O082N821L388J660K091K743K089J458J983
56319C99020K271J181P5K44O64K13l22l01p26j978k552j740r64q88m5J986L073
56302C99211K126J280K419M350N419O030O560N770L486J965K378K797J855J291
$$ plain form
56418 296900 297644 297890 298806 300433 301845 302766 303399 303436 302756 302305 302792 303446 303527 303909 305541 307500 308387 308487
56400 308487 308699 308486 306985 305129 304446 304526 303878 302659 302468 303875 306071 308440 310664 311901 311810 311806 313435
56383 313435 316032 317799 318524 319271 320022 319795 318773 318327 319039 320318 321651 322734 322879 321935 321201 321837 323040
56366 323040 323439 323438 324270 325567 326020 325869 326525 328111 329413 330067 330837 331953 332959 333924 335152 336120 336400
56349 336400 337093 339476 342693 344693 345006 344763 344459 343740 343051 343483 345034 346747 348405 350560 353181 355782
56333 355782 358453 361447 364400 367394 371705 377787 383608 386996 388656 390747 393490 395579 397037 399020
56319 399020 401291 402472 402547 402791 403455 403668 403346 403045 402319 400341 397789 396049 395085 394197 394152 396138 399211
56302 399211 401337 402617 405036 409386 414805 420835 427395 433165 436651 438616 440994 443791 445646 446937
56288D46937K484L636L086K394L373M813N002M788N306N409M173L357M449N797
56274E05004N590N163O373Q146Q676Q698R625J0623J0508J0419J1789J3722J4952
56261F29288J6142J7890J8931J8907K0159K4050K8317L0928L3628L8478M3878
56250I20596M7483N0330N4414N8654O1041O2477O4741O6766O6603O5112O4070
56239A582287O2474N8247N1878M5032L7358K7940J8059R218K99j0100k0409k8360
56227A833923l4545m0593m5883m9190n1506n4037n5558n4892n3691n3547n2815
56216A287666m9728m6085m4252m3048m0371l7441l6424l6180l4395l1795l0167
56205H57780k8457k4908k1104j9587j9312j7539j4539j2484j1415j0094r048r052
$$ plain form
56288 446937 449421 453057 456143 458537 461910 466723 471725 476513 481819 487228 491401 494758 499207 505004
56274 505004 510594 515757 522130 530276 538952 547650 557275 567898 578406 588825 600614 614336 629288
56261 629288 645430 663320 682251 701158 721317 745367 773684 804612 838240 876718 920596
56250 920596 968079 1018409 1072823 1131477 1192518 1254995 1319736 1386502 1453105 1518217 1582287
56239 1582287 1644761 1703008 1754886 1799918 1837276 1865216 1883275 1892493 1892792 1882692 1862283 1833923
56227 1833923 1799378 1758785 1712902 1663712 1612206 1558169 1502611 1447719 1394028 1340481 1287666
56216 1287666 1237938 1191853 1147601 1104553 1064182 1026741 990317 954137 919742 887947 857780
56205 857780 829323 804415 783311 763724 744412 726873 712334 699850 688435 678341 669293 660241
56193F60241q519o084l682l353l463j881k99j062k335j078J452J938P36O33J768
56178F35012K332K594L714M371K977J404K181L981M263M095N790Q031Q240P646
56164F96631R033J1436J2096J1719J2866J4975J5897J6451J8607K1204K2258K3366
56152H86539K6942L1410L4260L7215M3081N0113N5209O0096O8379P8908Q8282
56141A460434R7543J09965J24288J36535J46576J56368J63752J64620J59555J51789
56131B871425J40620J23757J04332Q8365P6578O5438N4663M6423L8664K6832J1384
56120C648481l406j7022l2091m7587o0062p0727q4013j00037j15416j30244j46690
56109B841186j61881j69927j70247j66600j59205j45629j28186j12271r8197q2632
$$ plain form
56193 660241 651722 645638 641956 638603 635140 633259 632960 631898 629563 628485 629937 631875 632611 633244 635012
56178 635012 637344 639938 643652 648023 651000 652404 654585 658566 662829 666924 672714 680745 688985 696631
56164 696631 705664 717100 729196 740915 753781 768756 784653 801104 819711 840915 863173 886539
56152 886539 913481 944891 979151 1016366 1059447 1109560 1164769 1224865 1293244 1372152 1460434
56141 1460434 1557977 1667942 1792230 1928765 2075341 2231709 2395461 2560081 2719636 2871425
56131 2871425 3012045 3135802 3240134 3328499 3405077 3470515 3525178 3571601 3610265 3637097 3648481
56120 3648481 3645075 3628053 3595962 3548375 3488313 3417586 3333573 3233536 3118120 2987876 2841186
56109 2841186 2679305 2509378 2339131 2172531 2013326 1867697 1739511 1627240 1529043 1446411
56099A446411o6914n5554m7605l8284k8291k2582k0616j6989j1356q468q529o828
56087A114395l003j334j729J83L849M252J903K628O820Q704P103P135J0105J1510
56073A172521J0343J0773J3300J3744J2173J3303J6940J7711J5344J5303J8233
56062A329688J8863J6449J5967J7693J6326J1816J0369J3092J4342J2863J3633
56051A491101J7118J7925J5740J6345K0116K1194J9611K2036K8697L2132L1182
56040A733197L3248M0100M4622M4629M6611N2302N4863N2250N1167N3770N3679
56029B260438M9185M7138M9644N0166M6930M6633N0861N2659N0618N2230N9155
56018B815657O3630O3575O6308P3296P6723P5434P8065Q5975Q9855Q8072R0774
$$ plain form
56099 1446411 1379497 1323943 1276338 1238054 1209763 1187181 1166565 1149576 1138220 1129752 1121223 1114395
56087 1114395 1111392 1110058 1108329 1108512 1112361 1116613 1118516 1121144 1127964 1136668 1143771 1150906 1161011 1172521
56073 1172521 1182864 1193637 1206937 1220681 1232854 1246157 1263097 1280808 1296152 1311455 1329688
56062 1329688 1348551 1365000 1380967 1398660 1414986 1426802 1437171 1450263 1464605 1477468 1491101
56051 1491101 1508219 1526144 1541884 1558229 1578345 1599539 1619150 1641186 1669883 1702015 1733197
56040 1733197 1766445 1806545 1851167 1895796 1942407 1994709 2049572 2101822 2152989 2206759 2260438
56029 2260438 2309623 2356761 2406405 2456571 2503501 2550134 2600995 2653654 2704272 2756502 2815657
56018 2815657 2879287 2942862 3009170 3082466 3159189 3234623 3312688 3398663 3488518 3576590 3667364
56007C667364J00657J07665J08449J12457J22670J29426J29965J34484J45944
55998D759081J54055J56402J64494J81239J94224J99475K09317K27981K43156
55989F489424K51065K65297K90449L12552L26595L47147L79886M10268M33112
55980I505795M64609N11289N57127N96109O46068P14563P84235Q49125R30526
55971A5559446J038656J155865J277726J430880J628476J850854K095339K400103
55963B8437345K792420L262186L814921M495433N325486O278243P352072Q603209
55955G0361315J0064893J1713488J3560195J5672461J8034954K0510862K3031760
55948A82949928K5644437K8146760K9778700K9544099K6837062K1558651J3755045
$$ plain form
56007 3667364 3768021 3875686 3984135 4096592 4219262 4348688 4478653 4613137 4759081
55998 4759081 4913136 5069538 5234032 5415271 5609495 5808970 6018287 6246268 6489424
55989 6489424 6740489 7005786 7296235 7608787 7935382 8282529 8662415 9072683 9505795
55980 9505795 9970404 10481693 11038820 11634929 12280997 12995560 13779795 14628920 15559446
55971 15559446 16598102 17753967 19031693 20462573 22091049 23941903 26037242 28437345
55963 28437345 31229765 34491951 38306872 42802305 48127791 54406034 61758106 70361315
55955 70361315 80426208 92139696 105699891 121372352 139407306 159918168 182949928
55948 182949928 208594365 236741125 266519825 296063924 322900986 344459637 358214682
55941C58214682L641955p791005j8584488k6704182l1224454l2557371l1700158
55934B13294979k9511683k6585439k3374813k0189136j7170520j4399136j1972397
55927G0091855r941403q259593o857460n710581m796106m049863l415815k888834
55919B4172200k469879k124629j821382j566664j369159j206008j055374r27080
55911A1632025q31793p52083o71008n99258n48252n04364m54127m08722l80021
55902F482397l56670l26081k97175k80156k65350k42391k20141k08291j98353
55893D087789j81236j65147j58476j52643j39016j25808j21636j18699j08374
55884B816754r7745r4839r2675q3398p3799p1608p0248o1991n2994n0826m9818
$$ plain form
55941 358214682 361856637 354065632 335481144 308776962 277552508 244995137 213294979
55934 213294979 183783296 157197857 133823044 113633908 96463388 82064252 70091855
55927 70091855 60150452 51890859 45033399 39322818 34526712 30476849 27061034 24172200
55919 24172200 21702321 19577692 17756310 16189646 14820487 13614479 12559105 11632025
55911 11632025 10800232 10048149 9377141 8777883 8229631 7725267 7271140 6862418 6482397
55902 6482397 6125727 5799646 5502471 5222315 4956965 4714574 4494433 4286142 4087789
55893 4087789 3906553 3741406 3582930 3430287 3291271 3165463 3043827 2925128 2816754
55884 2816754 2719009 2624170 2531495 2448097 2374298 2302690 2232442 2170451 2117457 2066631 2016813
55873B016813m3004l6417l7586m1427m0989m0971m7288n4079n4104n1839n3733
55862A515376n5431n1006m5176m4197m3849l8233l1460k9106k6930j9580j1913
55851A118495j0343j1162q511n877q605j2783j2592j1327j4419j8558j8264j6449
55839I69605j8102k0153j7754j4262j4968j6992j5168j1996j2204j3268j0793
55828H03945p681q601j0805r507p081p986r843q405o218p590r943q763o254o613
55814F88655p628n370k384k762l846j263K442K619J376L171N975N380L373M454
55800F94192O777N615K126N14k14l576p929r440r624j2243j5564j5419j3118j2839
55786F09258j3792j2375r561q850r318p714n112m783n804n326m570o099p857o508
$$ plain form
55873 2016813 1973809 1937392 1899806 1858379 1817390 1776419 1729131 1675052 1620948 1569109 1515376
55862 1515376 1459945 1408939 1363763 1319566 1275717 1237484 1206024 1176918 1149988 1130408 1118495
55851 1118495 1108152 1096990 1088479 1082602 1073997 1061214 1048622 1037295 1022876 1004318 986054 969605
55839 969605 951503 931350 913596 899334 884366 867374 852206 840210 828006 814738 803945
55828 803945 796264 787663 776858 767351 760270 752284 742441 734036 727818 720228 710285 701522 695268 688655
55814 688655 681027 675657 673273 670511 666665 665402 667844 670463 671839 675010 680985 686365 689738 694192
55800 694192 700969 706584 708710 709224 709010 705434 697505 688065 678441 666198 650634 635215 622097 609258
55786 609258 595466 583091 573530 564680 555362 547648 542536 537753 531949 526623 522053 515954 508097 501589
55772E01589m014m261n850m942k568k336l391k491q08j810m492n285m724n764
55758D48853p515p030n356n479o315m953k847l359n149m497k361k637n043o072
55744C80240n541o002p091o530n269n730o529m845k300k392l885l015n72l90k102
55729C18047k023j34K35j126j387n32j071k556k299q59j093k432j938k06l65j904
55713B98357j493O71J289K42M33J707J056j176j361Q86K033R26K21R25Q47p95
55697C04768k116k508l265l958k701j77J008Q92J664K974K568J191J724L643L563
55682C09270J418P80K656M162L970M031N030M975L292J924J463L61j362j768q86
55667C39316q47j775j611l39j66j172j072L37P88m4k4J117J222n0o98m88j265
$$ plain form
55772 501589 497575 493314 487464 482522 479954 477618 474227 471736 470928 469118 464626 459341 454617 448853
55758 448853 441338 434308 428952 423473 417158 412205 409358 405999 400850 396353 393992 391355 386312 380240
55744 380240 374699 368697 361606 355076 349807 344077 337548 332703 330403 328011 324126 321111 320539 320149 318047
55729 318047 316024 315890 316125 314999 313612 313080 312009 309453 307154 306295 305202 302770 300832 300626 300261 298357
55713 298357 296864 297535 298824 299066 299499 301206 302262 301086 299725 300611 302644 303570 303791 304716 305563 304768
55697 304768 302652 300144 296879 292921 290220 290043 291051 291943 293607 296581 299149 300340 302064 305707 309270
55682 309270 310688 311468 314124 318286 322256 326287 331317 336292 339584 341508 342971 343332 341970 340202 339316
55667 339316 338469 336694 335083 334744 334578 333406 332334 332671 333459 333415 333391 334508 335730 335680 334982 334494 333229
55650C33229k846l012k099k965n714p088o028n265o208o779n725m802n054m850
55636B64794l352k282k686l203k947k860l107k248k48Q67L22l34k95n35j229j190
55620B39467n50q77k106k462j801j745k307j837o12p70k292k810j878j595k385
55605B13440k212o90l3r27j413q45j061k415k628r19M86L38J85Q28O58q54j571
55588B00367k94J286J809K215L056L035J856J337K229K819K210K007L250M614
55574B31796N089N641O813P475P250P470Q540R069Q659Q632R008P882M858K035
55560C30217M70j212l606n245n716o697q579r400q504p805q047p327m961l232
55546B50356l404l473j957n52q12j341o47J45j86n03L03R64J82j047j509j831
$$ plain form
55650 333229 330383 327371 325272 322307 316593 309505 303477 298212 292004 285225 279500 274698 269644 264794
55636 264794 261442 259160 256474 253271 250324 247464 244357 242109 241861 242728 243050 242716 242421 241886 240657 239467
55620 239467 238917 238040 235934 233472 231671 229926 227619 225782 225170 224400 222108 219298 217420 215825 213440
55605 213440 211228 210538 210505 209578 208165 207320 206259 203844 201216 200297 200783 201121 201306 202134 202792 201938 200367
55588 200367 200073 201359 203168 205383 208439 211474 213330 214667 216896 219715 221925 223932 227182 231796
55574 231796 236885 242526 249339 256814 264064 271534 280074 289143 297802 306434 315442 323324 328182 330217
55560 330217 330687 329475 325869 320624 314908 308211 299632 290232 281728 273923 265876 258549 253588 250356
55546 250356 246952 243479 241522 240970 240158 238817 238170 238315 238129 237626 237929 238893 239075 238028 236519 234688
55530B34688k622k945k487k728m174m920l856k709l034l711l425l052l504l700
55516A87821k771j883j868j479n5N78r19k862l170k328j665r48J15L22q63j703
55500A66322r65j13o31j340p22K75J24n40m50j79o98j194n76M02N94M65P76R25
55482A62475M53L75J258J784J051K95N68Q28K03j43N76Q93k32j232q14n11j751
55465A66076k777j560M24N84n00m90N00N36m19p06j60p7n30m38J32J98j44j15
55447A60534m4o21j113m62N91N74k67n68k07m5j35l9j42p91j014k4R98N54o66
55428A57113r51k76J79K84O82R82M18m17m16R7Q7j85K08R59J112Q92J162J617
55410A63547J336N34J26Q5j92m27L0Q90J347J278P90m03k016k707j880p95o11
$$ plain form
55530 234688 232066 229121 226634 223906 219732 214812 210956 208247 205213 201502 198077 195025 191521 187821
55516 187821 185050 183167 181299 179820 179765 180343 179424 176562 173392 171064 169399 168451 168566 168888 168025 166322
55500 166322 165357 165244 164613 163273 162551 162826 162950 162410 161960 161781 161083 159889 159313 159715 160309 160774 161550 162475
55482 162475 162928 163303 164561 166345 167396 167691 168259 169087 169290 169147 169723 170616 170384 169152 168338 167827 166076
55465 166076 163299 161739 162163 162747 162247 161757 162257 162793 162374 161668 161508 161431 160901 160463 160595 160793 160649 160534
55447 160534 160490 159869 158756 158294 158885 159459 159192 158624 158417 158372 158237 158198 158056 157265 156251 156227 157225 157779 157113
55428 157113 156162 155886 156065 156349 157031 158013 158431 158014 157598 157695 157782 157597 157805 158764 159876 160768 161930 163547
55410 163547 164883 165417 165543 165628 165436 165009 165039 165929 167276 168554 169344 168941 166925 164218 162338 161543 160932
55393A60932p07k88ml32o3J569K895K128L43k47L00L56j98j31O18R68P12M98L06
55374A69655k52q01r96j553k782l307k135p01q19j823j966j395j307j305l16Q73
55358A49070P07j89M4J214J399K31q14j105j320j443q06P4K9m66L2J248J524P50
55340A50179M97J180J508R83O27Q83Q75J95m37o49q32r42n06O4j65r71j215p08
55322A50566k30R0P16J281J018L28K13M25N6m04L14J792K230J249K95J57O9n21
55304A59644j141j500j787j695p76K95M43N3L02R53P51j55l64K22K07p03j161
55287A53588n36J65K58K96O26P24M74N09Q57Q21L97K53K40m00j274j149j48K15
55269A55916n54j354j553j660j689q68N23J031L47j59J59K48n04j008l37Q17J468
$$ plain form
55393 160932 160225 159937 159933 159601 159538 161107 164002 166130 166473 166226 166526 166882 166684 166553 167171 168139 168851 169349 169655
55374 169655 169403 168602 167606 166053 163271 159964 157829 157128 156309 154486 152520 151125 149818 148513 148197 149070
55358 149070 149777 149588 149632 150846 152245 152476 151662 150557 149237 147794 146988 147062 147091 146625 146657 147905 149429 150179
55340 150179 150676 151856 153364 154347 154974 155857 156732 156927 156490 155841 155009 154067 153561 153625 153460 152489 151274 150566
55322 150566 150336 150426 151142 152423 153441 153769 153982 154407 154463 154059 154373 156165 158395 159644 159939 160096 160165 159644
55304 159644 158503 157003 155216 153521 152745 153040 153483 153536 153838 154791 155542 155387 155023 155245 155452 154749 153588
55287 153588 153052 153217 153475 153771 154397 155121 155595 156104 156961 157782 158179 158432 158672 158272 156998 155849 155701 155916
55269 155916 155362 154008 152455 150795 149106 148238 148761 149792 150139 149980 150139 150387 149883 148875 148538 149355 150823
55252A50823J723J890J637Q90M10N94Q24O05K60Nn22j230j316n98L4K6j31p8k52
55233A55594q29j105o24Q2L79K63p5n56q33n56j94m81j084r57r8L85J63J66Q26
55214A50466J302Q99J01l54l33O6P18R90K50r15j129j07J032J476J523J481J128
55197A58594N85M15N18J74n66p76k57J04p9j37L24P42P39O62O56L70p4k8M35M51
55177A62852j98p76j024j477k109k031j070k17r5k67m08q24j280p87Q02K225K484
55160A55800J968J355O40j72n70l82j22JL72R15R17L61J78P36J195Q86K27k88
55142A64017p87j176p69N33J664J605M98q14j637j599q95m29p75j095k47J183
55126A59277J458L09o92o08k52l96n64k72O3J70M81R86R19J65k98J6M25M99O96
$$ plain form
55252 150823 152546 154436 156073 156963 157373 157967 158791 159396 159656 159661 159139 157909 156593 155995 156029 156055 155924 155846 155594
55233 155594 154765 153660 153036 153118 153497 153760 153685 153129 152296 151740 151546 151065 149981 149024 148926 149311 149474 149640 150466
55214 150466 151768 152667 152768 152414 152081 152147 152865 153855 154105 153190 152061 151954 152986 154462 155985 157466 158594
55197 158594 159179 159594 160112 160286 159720 158944 158687 158791 158712 158575 158899 159641 160380 161042 161698 162068 161994 161966 162401 162852
55177 162852 162654 161878 160854 159377 157268 155237 154167 153950 153855 153588 153180 152356 151076 150289 151091 153316 155800
55160 155800 157768 159123 159763 159591 159021 158639 158517 158518 158890 159805 160722 161083 161261 161997 163192 164078 164305 164017
55142 164017 163230 162054 161285 161818 163482 165087 165585 164771 163134 161535 160640 160211 159436 158341 158094 159277
55126 159277 160735 161044 160352 159744 159492 159096 158532 158260 158323 158493 158974 159960 160879 161044 160746 160762 161187 161686 162382
55107A62382J026O60m00p90J47J200J127M06P9J23k3l01m04m17l74o6J97l36j409
55088A62827j658n46P74J221J114J070Q34J48m63n98o09n96J9J102J322K8j496
55071A64493j741q99j27J54K45L18M75R52J538J543Q41J20k97q18j387j258m59
55054A63693r3n06n81L17J150R44L21K19L59J16j48R1L91J36l35m23l13l88m31
55035A64519k02j2l3M2J61k92j185j358l63P28J000Q78R04O56j13o00j77N68R12
55016A66033R32O92k27j514j955j300q21j110j051oQ43O70O52J814L005K838K062
54999A71557K014K205J501M80L48O14O2p86n19N58Q79K42j55J0j07o66q64n08
54981A76865j69J22P54J231O26o88j259o04L12O46N28K83pj46RJ13p2l1O66J383
$$ plain form
55107 162382 163408 164068 163668 162878 163025 164225 165352 165758 165837 165960 165937 165636 165232 164815 164441 164375 164572 164236 162827
55088 162827 161169 160623 161397 162618 163732 164802 165636 165784 165321 164723 164114 163518 163537 164639 165961 165989 164493
55071 164493 162752 161853 161726 161880 162125 162443 162918 163870 165408 166951 167792 167912 167615 166797 165410 164152 163693
55054 163693 163600 163094 162513 162830 163980 164924 165245 165464 165823 165939 165791 165882 166273 166409 166074 165651 165338 164950 164519
55035 164519 164317 164305 164272 164314 164475 164183 162998 161640 161277 162005 163005 163883 164787 165443 165330 164730 164553 165121 166033
55016 166033 166965 167657 167430 165916 163961 162661 161840 160730 159679 159673 160516 161186 161838 163652 166657 169495 171557
54999 171557 173571 175776 177277 177757 178105 178719 178781 177995 177476 178034 178913 179155 179000 179010 178903 178237 177373 176865
54981 176865 176696 176818 177572 178803 179429 178741 177482 176878 177190 177836 178364 178647 178640 178494 178503 178616 178544 178513 179179 180562
54961A80562J316Q69R53J406J389R35P99R85P62lo67q69p77n07k03l47j092j664
54943A83847j408q91r46j206p60K40Q75J022J293J756J912J766J809K143K564
54928A94016L237M273N039M903M356M385N099N851O349O672O637O055N178M133
54914B66183K493J82j947l301m421n745o584o466o306o890p249o113m085k730
54900B07021k337k178k172k554k729k208j836k324k462q48J476K394K020K222
54886A93485L292L764L371L483M486N152N103N447O488P020O529O037O018N532
54872B65207M141K743J648k79l486o477p772p762p553p283o641n877n276m543
54858B10790l536k752k413j948j036k40j02l83p38j276k015k565k759k807k674
$$ plain form
54961 180562 181878 182747 183700 185106 186495 187430 188229 189214 189976 189973 189306 188437 187660 187153 186950 186603 185511 183847
54943 183847 182439 181548 180602 179396 178636 178876 179751 180773 182066 183822 185734 187500 189309 191452 194016
54928 194016 197253 201526 206565 211468 215824 220209 225308 231159 237508 244180 250817 256872 262050 266183
54914 266183 268676 268858 266911 263610 259189 253444 246860 240394 234088 227198 219949 213836 209751 207021
54900 207021 204684 202506 200334 197780 195051 192843 191007 188683 186221 185373 186849 189243 191263 193485
54886 193485 196777 200541 203912 207395 211881 217033 222136 227583 234071 241091 247620 253657 259675 265207
54872 265207 269348 272091 273739 273460 269974 263497 255725 247963 240410 233127 226486 220609 215333 210790
54858 210790 207254 204502 202089 200141 199105 198865 198763 198380 197642 196366 194351 191786 189027 186220 183546
54843A83546k126j527j519j831j589r19r07j687j971j011K92Q59Q11O99M81Pl66
54826A71242l62k85m35p07j063j557j642n57J321K482K143J116M31J39m7O8O37
54809A72924J227J423J337J208J108J294K000K720K568J558O32K96J49p7j75k90
54793A89902r11j745j829j094n45n27j91Q18J586J523J390J843K228J849J317
54778A95614J551K325K891L227L700M110M158M282M957N743N890N600N743O534
54764B56325P275P322O620N445M016K400N48j453l171m228m940n962p231p960
54750B55006p805p405p365p311o434m592k524j234j142j629j550o10J83l6n96
54735B04956l00O92J285J387J979L240M182M387M568N021N029M417M241N140O192
$$ plain form
54843 183546 181420 179893 178374 176543 174954 174035 173128 171441 169470 168459 168751 169610 170421 171120 171601 171608 171242
54826 171242 170880 170595 170160 169453 168390 166833 165191 164634 165955 168437 170580 171696 172127 172266 172219 172287 172924
54809 172924 174151 175574 176911 178119 179227 180521 182521 185241 187809 189367 189999 190295 190444 190367 190192 189902
54793 189902 188991 187246 185417 184323 183778 183251 183060 183878 185464 186987 188377 190220 192448 194297 195614
54778 195614 197165 199490 202381 205608 209308 213418 217576 221858 226815 232558 238448 244048 249791 256325
54764 256325 263600 270922 277542 282987 287003 289403 289951 288498 285327 281099 276159 270197 262966 255006
54750 255006 247201 239796 232431 225120 218686 214094 211570 210336 209194 207565 206015 205405 205588 205552 204956
54735 204956 204656 205348 206633 208020 209999 213239 217421 221808 226376 231397 236426 240843 245084 250224 256416
54720B56416O251N341M022K376N17r34j757k758m622o756q049q146p462o462n466
54705B22511m628l710k559j814k230l171l045j609m77p36j464j385p59n59q66
54690A93499j208j568k024k106j569j041j040j061n51mo4l24m7M81M80K5j59J32
54672A81851N03Q26J243J544J330O10k46r27j224j053p67q87j256j185o43l61
54656A79358m58j26P66J121M89J57J094K110J518k54j385j305r41p51j90Q05J449
54639A83457J416J320J521J552J022L03o0pJ87K37j10q96j717j987j452l51P95
54622A85230J380J062K72j17J08K44k00p11o08n8M04P02R28P70J4p75q86m36p7
54603A87246j9LJ18L12P21J321J608J176L63k23m57n31m36j69n8k97m85j72M52
$$ plain form
54720 256416 262667 268008 272030 274406 274923 273989 272232 269474 264852 258096 250047 241901 234439 227977 222511
54705 222511 217883 214173 211614 209800 207570 204399 201354 199745 199268 198532 197068 195683 194924 194365 193499
54690 193499 192291 190723 188699 186593 185024 183983 182943 181882 181331 181327 181263 180939 180892 181373 181853 181878 181719 181851
54672 181851 182354 183180 184423 185967 187297 187907 187661 186734 185510 184457 183690 182803 181547 180362 179719 179358
54656 179358 178900 178774 179540 180661 181150 181307 182401 184511 186029 185775 184390 183085 182144 181393 181203 182008 183457
54639 183457 184873 186193 187714 189266 190288 190591 190531 190524 190711 190948 190838 189942 188225 186238 184786 184435 185230
54622 185230 186610 187672 187944 187827 187935 188179 187979 187268 186660 186602 187006 187708 188636 189406 189420 188645 187759 187323 187246
54603 187246 187227 187230 187348 187660 188381 189702 191310 192486 192849 192626 192169 191638 191202 191033 190975 190678 190193 190021 190473
54584A90473Q92R76P46J71n36q23m49J66O20R83J199Q66P1l21J21O92P56P37J152
54565A98492J476J039L07J63M77M87J34n0J2N6K04O24Q15K77m68n37n1J60q4k40
54545B03293o5K95R21J833K419K194J814K182K824K472J081j2p9J95P0k49l88
54528B20800n14q30j094j086r24p15l83r5j78n43p16n38k55O9N93J077R55J84
54510B15807o19j024j172j232j026m36K83Q07J034R47N67M1m70r41j309j275o66
54493B09316J89Q05J109J263J201P82K26q5j10m1J27N49J137J608J743J451Q40
54476B22110M04O69J422J838J620J414J691J978J708J092N74J81M6O42J728J984
54460B41101P41o93o95M00R76N09j08k51j82j60j90n14j220j593j029k32k73p35
$$ plain form
54584 190473 191365 192341 193087 193258 192722 191899 191450 191616 192236 193219 194418 195284 195355 195034 195155 195847 196603 197340 198492
54565 198492 199968 201007 201314 201477 201954 202441 202575 202525 202537 202593 202797 203421 204236 204513 204045 203508 203457 203617 203533 203293
54545 203293 203228 203523 204444 206277 208696 210890 212704 214886 217710 220182 221263 221251 221172 221367 221437 221188 220800
54528 220800 220286 219456 218362 217276 216352 215637 215254 215159 214981 214438 213722 213184 212929 212998 213591 214668 215623 215807
54510 215807 215188 214164 212992 211760 210734 210298 210581 211388 212422 213369 213936 213977 213507 212566 211257 209982 209316
54493 209316 209505 210310 211419 212682 213883 214665 214891 214806 214696 214655 214782 215331 216468 218076 219819 221270 222110
54476 222110 222514 223183 224605 226443 228063 229477 231168 233146 234854 235946 236520 236701 236747 237389 239117 241101
54460 241101 241842 241149 240454 240854 241830 242339 242231 241980 241798 241638 241448 240934 239714 238121 237092 236860 236587 235852
54442B35852l72O36P92k52j095q40l30m61p39m27J04J14k73m87m72m11j18N51
54424B31772J111J034N90M43O64P14L20j23j07L16N62J96n10q72o62k87q0P7J58
54405B35316k41j012j145rJ464J871J182O22Q84J500J780J504P80J5j48L52O29
54388B45344M8o01k47O81Q33N0n86o20o51q34n51J16J13q40j534r85K66J153J384
54369B42539J124L95n08p69kJ196K092K627K986L026K643K123J765J591J589J672
54353B66089J362K67j012j452j119j154k015k850k967k785k797k708k202j644
54339B43013j313q63j71J51k09n85m28k29n39q62n39j0j56p73p39L83J745K183
54321B40059J268m59j946k428k094j720j570j196m26K04L20L03M53L47l38j051
$$ plain form
54442 235852 235480 236116 236908 236656 235561 234721 234391 233930 233191 232764 232868 232982 232709 232222 231750 231339 231221 231772
54424 231772 232883 233917 234507 234950 235614 236328 236648 236525 236418 236734 237296 237492 236982 236110 235448 235161 235081 235158 235316
54405 235316 235075 234063 232918 232909 234373 236244 237426 238048 238932 240432 242212 243716 244496 244511 244363 244715 245344
54388 245344 245392 244791 244544 245225 246058 246108 245522 244902 244251 243417 242866 242982 243095 242255 240721 239736 240002 241155 242539
54369 242539 243663 244058 243550 242781 242779 243975 246067 248694 251680 254706 257349 259472 261237 262828 264417 266089
54353 266089 267451 267718 266706 265254 264135 262981 260966 258116 255149 252364 249567 246859 244657 243013
54339 243013 241700 240837 240666 240817 240608 240023 239595 239366 238827 237965 237426 237416 237260 236487 235748 236131 237876 240059
54321 240059 241327 240868 238922 236494 234400 232680 231110 229914 229488 229692 230012 230315 230768 231115 230777 229726
54305B29726j139q46p92r01o90k66j87n19p67p21p07r85j299j160l31Q39J528
54288B20783J136R7m47jP53J007P94N10J16n42j037q24j53K02j1l44m24l16r1
54269B21208L11P03O61J56j80K20J067J491J083M03K47O43R55R09R57J412J756
54252B34002J439Q75Q88J380J366M35o73j169j195j341j731k014j976j784j714
54237B26788j822j783j183j22P26R63J057J490J777J101k14q94m05M23O72M10
54221B28984J41l4k60m25k46L72J234J857J666N83o59j295j412j532j635j355
54205B25984q93p76q27m34K57M43M5j93k8l8l68l90J20N57N73M97L86j63r11r59
54185B22882k79J9m64o55R7P53K12q92j102j08J244K157K215J268j52r14n63J24
$$ plain form
54305 229726 228587 227741 226949 226048 225358 225092 224905 224386 223619 222898 222191 221206 219907 218747 218416 219255 220783
54288 220783 221919 222016 221569 221568 222321 223328 224122 224632 224748 224206 223169 222345 222192 222394 222383 222039 221615 221299 221208
54269 221208 221519 222222 222883 223039 222859 223079 224146 225637 226720 227123 227370 228013 228968 229877 230834 232246 234002
54252 234002 235441 236316 237204 238584 239950 240385 239712 238543 237348 236007 234276 232262 230286 228502 226788
54237 226788 224966 223183 222000 221878 222604 223567 224624 226114 227891 228992 228778 227884 227479 227902 228574 228984
54221 228984 229125 229091 228831 228406 228160 228532 229766 231623 233289 233872 233213 231918 230506 228974 227339 225984
54205 225984 225091 224315 223488 223054 223311 223754 223799 223606 223578 223540 223172 222782 222902 223459 224032 224529 224915 224752 223841 222882
54185 222882 222603 222622 222158 221503 221600 222353 222565 221673 220571 220463 221707 223864 226079 227347 227195 226281 225718 225842
54167B25842M71Q09J368J408M93l89k07L97J33r11j606j635j624j691j242j63
54151B21453Q73J339J284R02M51L90Q73J324J185P98P93R73O56j25n95l54K42
54134B32462O61O15Q2n49o48j66J20l13q70o85J58R04J149R33K93n03q08l89R1
54115B32537K8j78Q8O22R60J300J881K119J501P73R37J569J440N17k4L16P76P64
54097B47926O50R59J676K530L238L473L249L174L656M128L911L364L144K864J644
54082B89586k50j758k762l978n147n068l619k213j708j393o67k85r05j662j340
54067B56831j41P89J011R32P85M81K37M28Q61R39N64L21O16J227J806K466L476
54050B73629M608N172M827M110L832M030L865K772J266M03O24J492K309K749K926
$$ plain form
54167 225842 226313 227122 228490 229898 230391 230002 229795 230192 230325 229414 227808 226173 224549 222858 221616 221453
54151 221453 222326 223665 224949 225851 226302 226692 227565 228889 230074 230872 231665 232638 233294 233169 232574 232220 232462
54134 232462 233123 233738 233820 233271 232623 232457 232577 232264 231394 230709 230867 231771 232920 233853 234146 233643 232835 232446 232537
54115 232537 232565 232387 232475 233097 234057 235357 237238 239357 240858 241631 242568 244137 245577 246094 246070 246386 247162 247926
54097 247926 248576 249535 251211 253741 256979 260452 263701 266875 270531 274659 278570 281934 285078 287942 289586
54082 289586 289336 287578 284816 280838 275691 270623 267004 264791 263083 261690 261023 260738 259833 258171 256831
54067 256831 256690 257479 258490 259422 260207 260688 260925 261353 262214 263153 263717 264038 264654 265881 267687 270153 273629
54050 273629 278237 283409 288236 292346 296178 300208 304073 306845 308111 308514 309138 310630 312939 315688 318614
54035C18614L148L551L995M397N102O361P543P602O476N219M516L946L209K947
54021C86626L558M111L548K257J292O51l86j645k188j962j984k795l838m590n175
54006C77480n727n980n869n731n686n465m974m525m364m497m809m947m291k817
53992C07798j650j893l039l536k803j729j200j172j269j312j054l15L87K00p91
53977B86622j487j177l06L64O15N43K32o9l3K26K87J44K36P29J328J848K235K184
53959B94521J461O47O38J385J948J899J795K111K558K807L059L660M692O154P909
53944C37244R448J0363J1001J1872J2670J2751J2399J2361J2245J0693P405L619
53932D64071L07k711n424o909o753n980n582n193m041k384r49K62J673L185M421
$$ plain form
54035 318614 321762 325313 329308 333705 338807 345168 352711 360313 366789 372008 376524 380470 383679 386626
54021 386626 390184 394295 397843 400100 401392 402043 401657 400012 397824 395862 393878 391083 387245 382655 377480
54006 377480 371753 365773 359904 354173 348487 343022 338048 333523 329159 324662 319853 314906 310615 307798
53992 307798 306148 304255 301216 297680 294877 293148 291948 290776 289507 288195 287141 286826 287213 287413 286622
53977 286622 285135 283958 283652 284016 284631 285174 285406 285337 285304 285530 285817 285961 286197 286926 288254 290102 292337 294521
53959 294521 295982 296629 297267 298652 300600 302499 304294 306405 308963 311770 314829 318489 323181 329335 337244
53944 337244 346692 357055 368056 379928 392598 405349 417748 430109 442354 453047 460452 464071
53932 464071 464378 461667 456243 449334 442581 436601 431019 425826 421785 419401 418452 418714 420387 423572 427993
53917D27993N397O213O586O418O309O721P206P129O759O780P100P023O339N487
53903E19460M744L930K900J838R34J39p52j942l418m847n850o466o964p266p079
53888D89361o663o850p985r416j0282j0372r911r108q173p417o944o583o194n719
53874C77744m995m087l677m312n304n310m160l081k877k999k836k768l220l691
53860C24427l601l308l419l702l532k872k102j355p48p08j343j946j874j426j217
53845B91274j121o79q6K7l80p35p11m68k47k11m94r31r82l79M24Q56R41R72R06
53826B87976N64Q0l03n89p56m52N50J916L029L431K837J357m8j24J139K263K147
53809C05017J463J479K305L174L823M573N392N868N932N777N430M990N004N758
$$ plain form
53917 427993 433390 439603 446189 452607 458916 465637 472843 479972 486731 493511 500611 507634 513973 519460
53903 519460 524204 528134 531034 532872 533806 533945 533193 531251 527833 522986 517136 510670 503706 496440 489361
53888 489361 482698 475848 467863 458447 448165 437793 427882 418774 410601 403184 396240 389657 383463 377744
53874 377744 372749 368662 364985 360673 355369 350059 345899 342818 339941 336942 334106 331338 328118 324427
53860 324427 320826 317518 314099 310397 306865 303993 301891 300536 299788 299080 297737 295791 293917 292491 291274
53845 291274 290153 289474 289388 289415 289035 288300 287589 287121 286874 286663 286169 285238 284256 283877 284301 285157 286098 287070 287976
53826 287976 288540 288620 288317 287728 286972 286520 287070 288986 292015 295446 298283 299640 299592 299468 300607 302870 305017
53809 305017 306480 307959 310264 313438 317261 321834 327226 333094 339026 344803 350233 355223 360227 365985
53795C65985O544O531O002N818N925N497M451L721L833M135L740K558J075l06
53781D25509j403k172k700l093l335l474l792m487n317n905o176o148n615m548
53767C67344l541l267l613l901l830l693l739l854l862l649l090k250j591j513
53753C21951j807j971j956k139k595k940k851k380j749j152p85p43q75q88o37
53738B96483k00K05L43K07J45L89O00L54L4M35J398J767J095L85N81J269J596
53721C07086J630J867K185K279K482L063L283K395J147R76J881K425J882J083
53707C35664R60J406J962K646L571M387M651M329L734L233L129L417L728L838
53693C80655M112M892N705N688M688L298J986Q32M4j04J48K33J10K20N47M83k10
$$ plain form
53795 365985 372529 379060 385062 390880 396805 402302 406753 410474 414307 418442 422182 424740 425815 425509
53781 425509 424106 421934 419234 416141 412806 409332 405540 401053 395736 389831 383655 377507 371892 367344
53767 367344 363803 360536 356923 353022 349192 345499 341760 337906 334044 330395 327305 325055 323464 321951
53753 321951 320144 318173 316217 314078 311483 308543 305692 303312 301563 300411 299626 298883 298008 297120 296483
53738 296483 296283 296488 296831 297038 297183 297572 298172 298526 298560 298995 300393 302160 303255 303640 304221 305490 307086
53721 307086 308716 310583 312768 315047 317529 320592 323875 326270 327417 328393 330274 332699 334581 335664
53707 335664 336624 338030 339992 342638 346209 350596 355247 359576 363310 366543 369672 373089 376817 380655
53693 380655 384767 389659 395364 401052 405740 409038 411024 411856 411900 411796 411944 412177 412287 412507 413054 413537 413327
53676D13327r54j159r26p25p79r51r39n37N3K61j60o67n44K25J070J558J518Q33
53658D10504k37r50r46q72j421k122k101j576j467j706j261P8J213J315Q18M75
53642C99744L95M48P29J120J166Q14N96Q03J109J340J774K422K770K633K518K731
53626D23112K893K685K399K297K209K179K725L921M881M839M114L557L602M315
53612D69728N663P087P548O729N687N519N974O127N878N814N956N672M803L894
53598E52079L288K733K064J529J244Q69J70n91j074j356j691k012j958j426q15
53583E53053o46r56j277j278j279j817k789l367k950j923j246j457k232k835k817
53568E24184k400k163k334k467k030j154m17k7L42Q01R66O36K79M37R68J303J184
$$ plain form
53676 413327 412373 411214 410288 409563 408784 407833 406894 406357 406410 406671 406511 405844 405300 405525 406595 408153 409671 410504
53658 410504 410267 409317 408371 407499 406078 403956 401855 400279 398812 397106 395845 395923 397136 398451 399269 399744
53642 399744 400139 400587 401316 402436 403602 404416 405012 405815 406924 408264 410038 412460 415230 417863 420381 423112
53626 423112 426005 428690 431089 433386 435595 437774 440499 444420 449301 454140 458254 461811 465413 469728
53612 469728 475391 482478 490026 496755 502442 507961 513935 520062 525940 531754 537710 543382 548185 552079
53598 552079 555367 558100 560164 561693 562937 563806 563976 563385 562311 560955 559264 557252 555294 553868 553053
53583 553053 552407 551451 550174 548896 547617 545800 543011 539644 536694 534771 533525 532068 529836 527001 524184
53568 524184 521784 519621 517287 514820 512790 511636 511219 511192 511534 512335 513301 513937 514216 514653 515621 516924 518108
53551E18108Q64O13M37K52R2R6L81R09J523K075K588L140L712M252M781N282N561
53534E54666N535N551O094P204Q398R208R590R822J0259J1101J2196J3201J4061
53521F76886J5140J6565J7874J8650J9199J9976K0734K1035K1330K2549K4613
53510H94551K6382K7247K7897K9096L0571L1596L2004L2036L1813L1461L1342
53499A225996L1565L1666L1233L0495K9874K9321K8621K8041K7997K8323K8296
53488A551428K7464K6046K4569K3425K2688K2201K1835K1763K2207K2883K2998
53477A809507K2042K0318J8521J7064J6007J5249J4462J3051J0633P489M297J498
53465A970138r98l584o526r685j2623j5061j7148j9047k0429k0881k0718k0859
$$ plain form
53551 518108 518972 519585 520022 520274 520366 520462 520843 521752 523275 525350 527938 531078 534790 539042 543823 549105 554666
53534 554666 560201 565752 571846 579050 587448 596656 606246 616068 626327 637428 649624 662825 676886
53521 676886 692026 708591 726465 745115 764314 784290 805024 826059 847389 869938 894551
53510 894551 920933 948180 976077 1005173 1035744 1067340 1099344 1131380 1163193 1194654 1225996
53499 1225996 1257561 1289227 1320460 1350955 1380829 1410150 1438771 1466812 1494809 1523132 1551428
53488 1551428 1578892 1604938 1629507 1652932 1675620 1697821 1719656 1741419 1763626 1786509 1809507
53477 1809507 1831549 1851867 1870388 1887452 1903459 1918708 1933170 1946221 1956854 1964343 1968640 1970138
53465 1970138 1969140 1965556 1959030 1949345 1936722 1921661 1904513 1885466 1865037 1844156 1823438 1802579
53453A802579k1794k3233k4820k6533k8151k9055k8962k8448k8189k8085k7562
53442A507747k6466k5197k4148k3323k2419k0993j8771j6006j3309j0989q803
53431A297323o495m259k424r98K05J275K357L812N974Q803J1879J4666J6797J8394
53417A367309K0024K2038K4072K5622K6923K8569L0482L2054L3333L5020L7190
53406A682636L9049M0445M2364M5265M8023M9545N0555N2540N5582N8515O0845
53395B225364O3180O5760O7936O9305P0368P1569P2537P2747P2396P2134P2228
53384B995524P2268P1560O9692O6888O3805O0825N7686N4060N0253M6806M3616
53373C652983M0029L5767L1201K6589K1633J5936R428K124o075j5107k4523l3852
$$ plain form
53453 1802579 1780785 1757552 1732732 1706199 1678048 1648993 1620031 1591583 1563394 1535309 1507747
53442 1507747 1481281 1456084 1431936 1408613 1386194 1365201 1346430 1330424 1317115 1306126 1297323
53431 1297323 1290828 1286569 1284145 1283147 1283352 1284627 1286984 1290796 1296770 1305573 1317452 1332118 1348915 1367309
53417 1367309 1387333 1409371 1433443 1459065 1485988 1514557 1545039 1577093 1610426 1645446 1682636
53406 1682636 1721685 1762130 1804494 1849759 1897782 1947327 1997882 2050422 2106004 2164519 2225364
53395 2225364 2288544 2354304 2422240 2491545 2561913 2633482 2706019 2778766 2851162 2923296 2995524
53384 2995524 3067792 3139352 3209044 3275932 3339737 3400562 3458248 3512308 3562561 3609367 3652983
53373 3652983 3693012 3728779 3759980 3786569 3808202 3824138 3833566 3835690 3829615 3814508 3789985 3756133
53361C756133m2923n1582n9360o5637p0098p2873p4364p5128p5733p6383p6689
53350C015363p6037p4338p2205p0278o8554o6744o5089o4337o4645o5036o4346
53339B263754o2454o0104n7782n5330n2505m9311m5775m1924l7997l4174l0265
53328A736133k6253k3019k1572k1467k1049j9544j7953j7313j7158j6433j5181
53317A519191j4227j3733j3074j1884j0418q963p580o258m807k800k46K045L405
53304A430651M304N741P877J0071J1992J3891J5817J7464J8851K0403K2206K3871
53292A603139K5279K6829K8767L0804L2560L3909L4774L5017L4684L3967L2840
53281A952569L1196K9339K7819K6625K5064K2647J9623J6429J3004R048M649L47
$$ plain form
53361 3756133 3713210 3661628 3602268 3536631 3466533 3393660 3319296 3244168 3168435 3092052 3015363
53350 3015363 2939326 2864988 2792783 2722505 2653951 2587207 2522118 2457781 2393136 2328100 2263754
53339 2263754 2201300 2141196 2083414 2028084 1975579 1926268 1880493 1838569 1800572 1766398 1736133
53328 1736133 1709880 1686861 1665289 1643822 1622773 1603229 1585276 1567963 1550805 1534372 1519191
53317 1519191 1504964 1491231 1478157 1466273 1455855 1446892 1439312 1433054 1428247 1425447 1425201 1427246 1430651
53304 1430651 1434955 1440696 1448573 1458644 1470636 1484527 1500344 1517808 1536659 1557062 1579268 1603139
53292 1603139 1628418 1655247 1684014 1714818 1747378 1781287 1816061 1851078 1885762 1919729 1952569
53281 1952569 1983765 2013104 2040923 2067548 2092612 2115259 2134882 2151311 2164315 2173363 2178012 2178359
53269B178359l388o586r725j3298j7381k1648k5791k9715l3279l6157l8224l9756
53257A903411m0971m1698m1893m2009m2338m2408m1743m0869m0683m0906m0243
53246A447650l8248l6093l5106l5288l5757l5988l5988l5732l5147l4444l3888
53235A055971l3235l1879k9648k7096k4920k3295k1863k0236j8376j6521j4878
53224G94024j3525j2496j1814j1414j1213j1349j2078j3323j4516j5102j4999
53213F52195j4528j4052j3863j4007j4078j3514j2370j1359j0832j0241r077p832
53201E06442p378p767q297q486q276p611o642o124o623p441p266n984m846m635
53187D09066m713m326l840l960m419m315l464k621k508l080l781m123l962l483
$$ plain form
53269 2178359 2174971 2168385 2158660 2145362 2127981 2106333 2080542 2050827 2017548 1981391 1943167 1903411
53257 1903411 1862440 1820742 1778849 1736840 1694502 1652094 1610351 1569482 1528799 1487893 1447650
53246 1447650 1409402 1373309 1338203 1302915 1267158 1231170 1195182 1159450 1124303 1089859 1055971
53235 1055971 1022736 990857 961209 934113 909193 885898 864035 843799 825423 808902 794024
53224 794024 780499 768003 756189 744775 733562 722213 710135 696812 682296 667194 652195
53213 652195 637667 623615 609752 595745 581667 568153 555783 544424 533592 523351 514274 506442
53201 506442 499064 491297 483000 474514 466238 458627 451985 445861 439238 431797 424531 418547 413701 409066
53187 409066 404353 400027 396187 392227 387808 383493 380029 377408 374900 371820 368039 363916 359954 356471
53173C56471k915k346j819j535j623j764j433n61L64Q78Q40J99r55k015k140j210
53157C38436j33J56l92j173j638j549r84m29m42r84j373j181p63o04n74k76K65
53140C26362O75P47N10J4n09n81J9Q09J111Q33M60L55M90O84Q15Q45R62J485K381
53121C38467L066L042K571K298K369K399K192J970J813J435O78j81q48j361j821
53106C58089k079j972j653j405j299j320j604k196k706k661k151j764j736j649
53092C31894j213q39j014j450j496j169j102j376j207j03J318K129K190J923J444
53077C29929O59r2k64M1J49j71m02j50K62L26Ol88p03j019j431j926k328k321
53059C20177j773r96l84Q3O01R25O33Pp0O72J441J563J405J531J596Q57m68j278
$$ plain form
53173 356471 353556 351210 349391 347856 346233 344469 343036 342475 342839 343717 344557 344756 343801 341786 339646 338436
53157 338436 338303 338459 338067 336894 335256 333707 332723 332294 331852 330868 329495 328314 327551 326947 326373 326097 326362
53140 326362 327037 327784 328294 328308 327799 327218 327237 328046 329157 329990 330450 330805 331295 331979 332794 333639 334601 336086 338467
53121 338467 341533 344575 347146 349444 351813 354212 356404 358374 360187 361622 362300 362119 361271 359910 358089
53106 358089 356010 354038 352385 350980 349681 348361 346757 344561 341855 339194 337043 335279 333543 331894
53092 331894 330681 329842 328828 327378 325882 324713 323611 322235 321028 320925 322243 324372 326562 328485 329929
53077 329929 330588 330496 330232 330273 330422 330251 329849 329699 329961 330287 330293 329905 329202 328183 326752 324826 322498 320177
53059 320177 318404 317408 317024 317107 317708 318633 319266 319273 319203 319875 321316 322879 324284 325815 327411 328268 327800 326522
53041C26522r69j02M74N36L33L6l64q63j359j638j429p14M7K92P2K3M56R07Q75
53022C23135O50Q52J361J367O22m5J38P45P57O5l52J84J159J646J456J094R41
53005C35775R52R56Q90P91Q26J195J732J867J313N45K22L30L59J36r2k49m50m53
52987C46645K09J388K216K146J662J602K111K629K616J976R53j5m94l66P5M17
52971C65770N13N35P47J251J854K210K204K061J874J293J52q49p42L55J132O50
52955C81010n45j290j244j021j198j744k290k460k059j285p60r23j460j659j347
52940C59725j074j284j688j736j429j283j572j981k130k039j870j478o97J32M18
52925C40014J51j12j91n40j232j404l63J220K025J654Q02O5n37r38q87n36l79
$$ plain form
53041 326522 325553 325451 325925 326461 326794 326830 326466 325603 324244 322606 321177 320463 320510 320802 320874 320897 321353 322260 323135
53022 323135 323785 324637 325998 327365 327987 327942 328080 328825 329582 329647 329295 329479 330638 332284 333740 334834 335775
53005 335775 336727 337683 338573 339364 340190 341385 343117 344984 346297 346842 347064 347394 347753 347889 347797 347548 347098 346645
52987 346645 346854 348242 350458 352604 354266 355868 357979 360608 363224 365200 366153 366138 365644 365278 365353 365770
52971 365770 366283 366818 367565 368816 370670 372880 375084 377145 379019 380312 380464 379615 378873 379228 380360 381010
52955 381010 380465 379175 377931 376910 375712 373968 371678 369218 367159 365874 365114 364191 362731 361072 359725
52940 359725 358651 357367 355679 353943 352514 351231 349659 347678 345548 343509 341639 340161 339464 339596 340014
52925 340014 340165 340053 339862 339322 338090 336686 336323 337543 339568 341222 342024 342089 341552 340614 339727 339191 338812
52908C38812l85LP89J181P49Q8j68k26m79o53l72o3m01j115j195l40N82O86J07
52889C37600l77l23P0M24O00O59O10L95J17Q2M49R26J087Q97P15P52Q40Q11Q19
52870C47153J124J796K586L096L067K715K537K595K238J027l65q55m03l5l69j012
52854C66895j534k157l077l817l888l505l133k846k580k573k986l421l381k918
52840C25079k408k046j884j982k123j847j174q07j099j338p13L92Q62L32n45j015
52824C07684p71K01J498K159J502J21o86m72L5K16K77M96O18M56M32R03J450J435
52806C17554J024R75J488J840J330J98p10r10o95o18q85j318j662j773j648j424
52790C12766j249j046o17j36j72q81j480j142j60M36L20J73M69Q55R90J117J378
$$ plain form
52908 338812 338427 338430 339219 340400 341149 341237 341069 340843 340364 339711 339339 339276 338875 337760 336565 336225 336807 337493 337600
52889 337600 337223 336900 336970 337394 337994 338653 339263 339658 339775 339857 340306 341232 342319 343216 343931 344683 345523 346334 347153
52870 347153 348277 350073 352659 355755 358822 361537 364074 366669 368907 369934 369569 368714 368311 368276 367907 366895
52854 366895 365361 363204 360127 356310 352422 348917 345784 342938 340358 337785 334799 331378 327997 325079
52840 325079 322671 320625 318741 316759 314636 312789 311615 310808 309709 308371 307658 308050 308912 309244 308699 307684
52824 307684 306913 307114 308612 310771 312273 312394 311708 311236 311271 311487 311764 312260 312878 313334 313766 314669 316119 317554
52806 317554 318578 319553 321041 322881 324211 324409 323699 322789 322094 321476 320591 319273 317611 315838 314190 312766
52790 312766 311517 310471 309854 309718 309546 308665 307185 306043 305883 306319 306639 306812 307281 308136 309126 310243 311621
52773C11621J292O21R1N14J593K269J990J060kq21j123r03n72n04o15p09q76j179
52755C13747j302j010n97l24J44J091J927J838J030N79J041J930K552K694K486
52740C27826K159J969J965J869J557J400J607J605P61m66q95j36J022J714J818
52725C45775J653J550J769K189K108R77o89j847k284k628l025k861j976j166j011
52710C38534j101r11o28n31k59N29J296J226L93l64n22l03j43j96m15p08r21q72
52692C34104m49K71R18J014N19J42N88J575K095J708R47L48k12q91j354j356j293
52675C38674j519j672j241n02j38k19k48j19k27o29p93m02J31K43m4k93k77r8
52657C30627J44N20J079J746K429L117L742M040L799L199K724K576K399J840J156
$$ plain form
52773 311621 312913 313534 313625 314139 315732 318001 319991 321051 321049 320228 319105 318202 317630 317126 316511 315802 314926 313747
52755 313747 312445 311435 310838 310514 310658 311749 313676 315514 316544 317123 318164 320094 322646 325340 327826
52740 327826 329985 331954 333919 335788 337345 338745 340352 341957 342718 342252 341357 341221 342243 343957 345775
52725 345775 347428 348978 350747 352936 355044 356021 355332 353485 351201 348573 345548 342687 340711 339545 338534
52710 338534 337433 336522 335894 335363 335104 335633 336929 338155 338548 338184 337662 337359 337216 337020 336605 335897 334976 334104
52692 334104 333655 333926 334844 335858 336377 336519 337107 338682 340777 342485 343432 343780 343568 342677 341323 339967 338674
52675 338674 337155 335483 334242 333740 333602 333383 333135 333016 332789 332160 331367 330965 331096 331339 331295 331002 330725 330627
52657 330627 330771 331291 332370 334116 336545 339662 343404 347444 351243 354442 357166 359742 362141 363981 365137
52642C65137R31J189J233M64r17k147k554j947o80M88Q89N97L56P07J404J891
52626C67041K093K300K484K227J409M30m41j529l186m924n743n302m350l691l251
52611C45567k537j671j194j058n43N61J554J873J829J792J415M36l67q4P95Q32
52595C49200l20j411j324m24K27K22p4k13K8N92J016P35j24o55k69N34R17Q22
52577C49479Q13J046J132R32Q78J241J531J018k74j427j560p86j6Q3l70r64j603
52560C51153k238k432j809q14l22m91o48m21k77n75q05m03K25J91o13j392j581
52543C36748j385j128o86J61J156J789J887J701J426R72L02k48k61K61R08J356
52527C44959J586J601J291P48M26O88J383K073K515K640K353J718J154J068J397
$$ plain form
52642 365137 366068 367257 368490 368954 368037 365890 363336 361389 360709 361197 362086 362683 363039 363746 365150 367041
52626 367041 369134 371434 373918 376145 377554 377984 377543 376014 372828 367904 362161 356859 352509 348818 345567
52611 345567 343030 341359 340165 339107 338564 339125 340679 342552 344381 346173 347588 348024 347657 347573 348368 349200
52595 349200 348880 347469 346145 345721 345948 346170 346096 345883 345911 346503 347519 348254 348130 347475 347206 347740 348657 349479
52577 349479 350292 351338 352470 353402 354280 355521 357052 358070 357796 356369 354809 354023 354007 354090 353720 352756 351153
52560 351153 348915 346483 344674 343860 343538 343047 342399 341978 341701 341126 340321 339918 340143 340334 339721 338329 336748
52543 336748 335363 334235 333549 333710 334866 336655 338542 340243 341669 342641 342943 342695 342434 342695 343603 344959
52527 344959 346545 348146 349437 350185 350611 351299 352682 354755 357270 359910 362263 363981 365135 366203 367600
52512C67600J855K448L303M126M344L778K719J416o5j484k430k762k699k503k393
52497C77253k658l312l820l623k953k506k428k265j837j417j007l14M56O58L46
52482C50573L93J082J442O89m90q75l29L68Q01J188J584J747J783K159K954L630
52466C68699L703L291K835K635K730K977L125K899K123Q04p90k206l042l281l232
52451C83270l214l397l785m109l892l047k247k187k616k649j980j148o15l83n44
52436C47457j211j757j184L12J177N52m80n20K03N23K75K69P27R91P60N90R12
52419C49596J453J753J770J727J856K274K787K828K081J065P16J464L034M919
52405C79323O625P666P924P956Q405R196R651R336Q344O901N078K821kl345o483
$$ plain form
52512 367600 369455 371903 375206 379332 383676 387454 390173 391589 391524 390040 387610 384848 382149 379646 377253
52497 377253 374595 371283 367463 363840 360887 358381 355953 353688 351851 350434 349427 349113 349569 350227 350573
52482 350573 350966 352048 353490 354179 353689 352814 352485 352853 353654 354842 356426 358173 359956 362115 365069 368699
52466 368699 372402 375693 378528 381163 383893 386870 389995 392894 395017 395821 395031 392825 389783 386502 383270
52451 383270 380056 376659 372874 368765 364873 361826 359579 357392 354776 352127 350147 348999 348384 348001 347457
52436 347457 346246 344489 343305 343617 344794 345346 344866 344346 344549 345072 345347 345616 346343 347334 348094 348684 349596
52419 349596 351049 352802 354572 356299 358155 360429 363216 366044 368125 369190 369906 371370 374404 379323
52405 379323 385948 393614 401538 409494 417899 427095 436746 446082 454426 461327 466405 469226 469224 465879 459396
52390D59396q262q264p372o625o042n207m395m135m016l096j453k18L3k3L95J222
52374D01938K051K842L694M492N040N179M693L611K584K309K535K363J573Q33
52360D45737M19k25j275j828j184j11Q2o85j173m16J255K780L466L398L022K523
52344D55785J757P86K39P18J996L265M081M537M658M391M263N124O930Q596R401
52329E16527R825J0410J0700J0148R381R624J1087J2756J3643J3582J2935J2289
52317F52907J2326J3305J4599J5321J5400J5576J6337J7506J8797K0149K1408
52306H33631K2262K2742K3230K3769K3876K3340K2679K2475K2583K2402K1601
52295A084590K0206J8294J5948J3430J0958Q450N831L469J883J061M62k72j028
$$ plain form
52390 459396 451134 442870 435498 428873 422831 417624 413229 409094 405078 401982 400529 400311 400344 400321 400716 401938
52374 401938 403989 406831 410525 415017 420057 425236 429929 433540 436124 438433 440968 443331 444904 445737
52360 445737 446156 445931 444656 442828 441644 441533 441615 440930 439757 439341 440596 443376 446842 450240 453262 455785
52344 455785 457542 458328 458567 459285 461281 464546 468627 473164 477822 482213 486476 491600 498530 507126 516527
52329 516527 526352 536762 547462 557610 566991 576615 587702 600458 614101 627683 640618 652907
52317 652907 665233 678538 693137 708458 723858 739434 755771 773277 792074 812223 833631
52306 833631 855893 878635 901865 925634 949510 972850 995529 1018004 1040587 1062989 1084590
52295 1084590 1104796 1123090 1139038 1152468 1163426 1171876 1177707 1181176 1183059 1184120 1184582 1184310 1183282
52282A183282j634k188k758l206l538m102n083n998o094n135l491j618J76J540
52268A140153K296K852L866N299O309O469O507P331Q660R438R485R965J1838J4555
52254A245023J6742J7820J8329J8799J8987J8392J7079J5534J3955J2121R943
52243A422724P767N999M707L705K777J587k12k438m212m914n132o038p789r228
52229A409303r437q913q760r295j0032j0645j1137j1264j0576r212p997p543p604
52216A286888p562p149o428n424m152k819j677o83L98J524K289K434K316K599
52202A262554L476M480N150N638O382P325P884P755P328P171P449P996Q601Q932
52188A358121Q521P220N489L868K348O05j311k962m161n230o500p847q837r230
$$ plain form
52282 1183282 1181648 1179460 1176702 1173496 1169958 1165856 1160773 1154775 1148681 1143546 1140055 1138437 1138613 1140153
52268 1140153 1142449 1145301 1149167 1154466 1160775 1167244 1173751 1181082 1189742 1199180 1208665 1218630 1230468 1245023
52254 1245023 1261765 1279585 1297914 1316713 1335700 1354092 1371171 1386705 1400660 1412781 1422724
52243 1422724 1430491 1436490 1441197 1444902 1447679 1449266 1449054 1446616 1442404 1437490 1432358 1426320 1418531 1409303
52229 1409303 1399866 1390953 1382193 1372898 1362866 1352221 1341084 1329820 1319244 1310032 1302035 1294492 1286888
52216 1286888 1279326 1272177 1265749 1260325 1256173 1253354 1251677 1250994 1251392 1252916 1255205 1257639 1259955 1262554
52202 1262554 1266030 1270510 1275660 1281298 1287680 1295005 1302889 1310644 1317972 1325143 1332592 1340588 1349189 1358121
52188 1358121 1366642 1373862 1379351 1383219 1385567 1386172 1384861 1381899 1377738 1372508 1366008 1358161 1349324 1340094
52174A340094r139q831q335p460o251n262n019n169m668l034j042J68L49J72L66
52159A276939J147K229K952K679J532M65J84K89jn61n59J72P67N12j94l54N30
52142A288728K048L253L337K290R45K14L24R42J859L004M072M697N058N736O900
52127A333407Q152R266J0559J2344J4518J6746J8662J9785J9824J9276J9099J9572
52115A521210J9911J9423J8473J7932J8055J8390J8521J8367J7931J7261J6661
52104A722135J6529J6950J7667J8480J9371K0157K0263J9098J6688J3737J0940
52093A912015Q314N404K033j403m515p371j0180j2781j4800j6083j6673j6581
52081A827379j5920j5102j4453j3797j2805j1616j0704j0150r517q444p015n556
$$ plain form
52174 1340094 1330955 1322124 1313789 1306329 1300078 1294816 1289797 1284628 1279960 1276926 1275884 1276052 1276401 1276573 1276939
52159 1276939 1278086 1280315 1283267 1285946 1287478 1287943 1288127 1288416 1288415 1287854 1287295 1287467 1288234 1288746 1288552 1288198 1288728
52142 1288728 1290776 1294029 1297366 1299656 1300601 1300815 1301139 1302081 1303940 1306944 1311016 1315713 1320771 1326507 1333407
52127 1333407 1341559 1350825 1361384 1373728 1388246 1404992 1423654 1443439 1463263 1482539 1501638 1521210
52115 1521210 1541121 1560544 1579017 1596949 1615004 1633394 1651915 1670282 1688213 1705474 1722135
52104 1722135 1738664 1755614 1773281 1791761 1811132 1831289 1851552 1870650 1887338 1901075 1912015
52093 1912015 1920329 1925733 1927766 1926363 1921848 1914477 1904297 1891516 1876716 1860633 1843960 1827379
52081 1827379 1811459 1796357 1781904 1768107 1755302 1743686 1732982 1722832 1713315 1704871 1697856 1692300
52069A692300m340l379k269m48K096M602O442P917R659J1633J3338J4613J5574
52056A767738J6044J5950J5920J6529J7091J6334J4249J2072J0369Q402N674K853
52044A919225N57j573l924o045p563r006j0847j2512j3259j3370j3561j3784j3638
52031A800700j3472j3999j5103j6016j6475j6768j6874j6493j5882j5675j5842
52020A628101j5717j5189j4971j5454j5991j5752j4724j3475j2365j1357j0426
52009A472680r746r571j0041j1073j2420j3881j5377j6834j8148j9435k0956k2497
51997A292701k3193k2436k0819j9565j9083j8696j7951j7459j8053j9488k0599
51986A075359k0667k0167k0015k0427k0795k0523j9674j8768j8236j8212j8498
$$ plain form
52069 1692300 1687960 1684581 1682312 1681864 1683960 1688562 1695004 1702921 1712580 1724213 1737551 1752164 1767738
52056 1767738 1783782 1799732 1815652 1832181 1849272 1865606 1879855 1891927 1902296 1910698 1916372 1919225
52044 1919225 1919782 1918209 1914285 1908240 1900677 1891671 1880824 1868312 1855053 1841683 1828122 1814338 1800700
52031 1800700 1787228 1773229 1758126 1742110 1725635 1708867 1691993 1675500 1659618 1643943 1628101
52020 1628101 1612384 1597195 1582224 1566770 1550779 1535027 1520303 1506828 1494463 1483106 1472680
52009 1472680 1462934 1453363 1443322 1432249 1419829 1405948 1390571 1373737 1355589 1336154 1315198 1292701
51997 1292701 1269508 1247072 1226253 1206688 1187605 1168909 1150958 1133499 1115446 1095958 1075359
51986 1075359 1054692 1034525 1014510 994083 973288 952765 933091 914323 896087 877875 859377
51975H59377j8569j7801j5999j3617j1255r141p283n708m183k152M86K824L994
51962G60973M408N144O212O458N251L191R61j405l721n260n757n899o093n698
51948G58765m251k565j583q17J026M217P776J0666J2409J2883J2431J1895J1795
51935H34647J1677J0957R891Q855P279M474J146j230k364l282m495n402n730o187
51921H60236p247q361r025r722j1133j3053j4748j5849j6401j6445j6010j5131
51909G07111j3620j1265q491o210m712l274j326N75J517J440R65L03q94k736m770
51894F54613o545q080r636j1229j2433j2715j1931j0535r089p673o028m217k601
51881E41901j114Q63L536O088P582Q110Q516R158R613R595R494R641R454P887
$$ plain form
51975 859377 840808 823007 807008 793391 782136 772995 765712 760004 755821 753669 754155 756979 760973
51962 760973 765381 770525 776737 783195 788446 791637 792598 791193 787472 782212 776455 770556 764463 758765
51948 758765 754514 751949 750366 749549 750575 754792 762568 773234 785643 798526 810957 822852 834647
51935 834647 846324 857281 867172 876027 883306 887780 888926 887696 885332 882050 877555 872153 866423 860236
51921 860236 852989 844628 835603 825881 814748 801695 786947 771098 754697 738252 722242 707111
51909 707111 693491 682226 673735 667525 662813 659539 658213 658788 660305 661745 662710 663013 662119 659383 654613
51894 654613 648068 639988 630352 619123 606690 593975 582044 571509 562420 554747 548719 544502 541901
51881 541901 540787 541650 545186 551274 558856 566966 575482 584640 594253 603848 613342 622983 632437 640324
51867F40324M719J039j727l094l659m122m483m323l546k528j602p56L4M47R2q87
51851F15928j743j854j413j231j863l086m314n182n608n670n733o368p540q148
51837E56175p152n068l537l237l176k294q72K21Q08J185J308J086R18J050Q92
51822E38307p5j100j043j39L18n8l22J07O23O53N41N99L77l86r53n70K89N55J6
51803E37739o68j109j495j862j874j448r48n75rJ013K128K647K331J561P97R7
51787E38325o98j479j856j636j091n99k61k7O5M8K10P95J586K134K335K574L305
51770E43730M711O622Q516R726R969R550Q862P891O443M563K353k35k962n055
51756F14684o057o613p647q995r663r402r009q932q574p373n806m741m325l940
$$ plain form
51867 640324 645043 646082 644355 641261 637602 633480 628997 624674 621128 618600 616998 616242 616276 616723 616815 615928
51851 615928 614185 612331 610918 609687 607824 604738 600424 595242 589634 583964 578231 571863 564323 556175
51837 556175 549023 543955 540418 537181 534005 531711 530839 531060 531868 533053 534361 535447 536365 537415 538307
51822 538307 538232 537132 536089 535950 536268 536210 535888 535995 536618 537271 537812 538411 538788 538402 537449 536879 537168 537723 537739
51803 537739 537071 535962 534467 532605 530731 529283 528335 527760 527751 528764 530892 533539 535870 537431 538228 538325
51787 538325 537627 536148 534292 532656 531565 530966 530705 530678 530743 530791 531001 531796 533382 535516 537851 540425 543730
51770 543730 548441 555063 563579 573305 583274 592824 601686 609577 616020 620583 622936 622701 619739 614684
51756 614684 608627 602014 594367 585372 575709 566307 557298 548366 539792 532419 526613 521872 517547 513607
51742E13607k971j261Q03K430L048K978L181M143N437O466P111P403P154O315
51728E65844N230M224L207K056R84L13K31R10K335L755L961K520L18j539k891
51713E91458m060m812m542l361k285k200l010l897m140l614k692j788r78j01Q89
51698E50867J777K262K096J133l71j693k186j907j321n67M24J284J362O04m43
51683E53321j534k849m125m593m114l507l292k973k082j020k51N33J560K110J575
51668E28759Q28J324L168N124O492P779R439J0952J1498J0810R105O764M305K142
51654F18489J05k288m858o594o744n661m257k910j394K84J486J460J06j981m136
51639E81107o097p781q819q722p632o476o028n946n153l201r71K28J29j83M31
$$ plain form
51742 513607 510636 509375 510178 512608 515656 518634 521815 525958 531395 537861 544972 552375 559529 565844
51728 565844 571074 575298 578505 580561 581545 581858 582089 582999 585334 589089 593050 595570 595888 594349 591458
51713 591458 587398 582586 578044 574683 572398 570198 567188 563291 559151 555537 552845 551057 550079 549978 550867
51698 550867 552644 554906 557002 558135 557764 556071 553885 551978 550657 550090 550514 551798 553160 553764 553321
51683 553321 551787 548938 544813 540220 536106 532599 529307 526334 524252 523232 522981 523514 525074 527184 528759
51668 528759 529587 530911 534079 539203 545695 553474 562913 573865 585363 596173 605278 612042 616347 618489
51654 618489 618594 616306 611448 604854 598110 592449 588192 585282 583888 584172 585658 587118 587224 585243 581107
51639 581107 575010 567229 558410 549688 542056 535580 529552 523606 518453 515252 514281 514509 514638 514455 514886
51624E14886J744K454J877P81K20J63r8o72j130j526k247k916k642j657j446k676
51608E05115m060m096l024k137j895j799j564j313q71J47J628L099M381N460O008
51593E05079N920N989P114Q884R872R378Q036O585M966K945Q62o91j533j832j700
51578E69874j110j5J579L578N846Q426J1467J4710J7395J9089K0303K1840K3775
51565G16757K5649K7421K9454L1575L2864L2701L1540L0539L0562L1497L2229
51554A052788L1381K8344K3539J7512J0292J935o833j5260k3349l1172l7823m1972
51542A009382m3385m2989m1526l9051l5760l2307k9053k5791k2386j9098j6074
51531F61962j3214j0602q432o468m351k458j553j512j324o23k42q76k093l127
$$ plain form
51624 514886 516630 519084 520961 521742 521962 522125 522027 521355 520225 518699 516452 513536 510894 509237 507791 505115
51608 505115 501055 496959 493935 491798 489903 488104 486540 485227 484356 484503 486131 489230 493611 499071 505079
51593 505079 510999 516988 524102 532986 542858 552236 560272 566857 571823 574768 575630 574939 573406 571574 569874
51578 569874 568764 568749 570328 573906 579752 588178 599645 614355 631750 650839 671142 692982 716757
51565 716757 742406 769827 799281 830856 863720 896421 927961 958500 989062 1020559 1052788
51554 1052788 1084169 1112513 1136052 1153564 1163856 1165791 1158958 1143698 1120349 1089177 1051354 1009382
51542 1009382 965997 923008 881482 842431 806671 774364 745311 719520 697134 678036 661962
51531 661962 648748 638146 629714 623246 618895 616437 614884 613372 612048 611425 611183 610307 608214 605087
51517F05087l883m639n421o165o886p300o943o011n352n294n232m854m787n421
51503E26899n978n600m603l720k842j535k18K94J29Q4K77J40l41m81j10Q8k70
51486E02213o98p44o97r35j189j029o54o18j010j358j333j143j145j301j235p96
51470D86328m14o57j461k168k358k331k514k778k728k370j978j518o97L48R59
51455D63663P12j03q26r89m61O14J823K643K834K675K697L268M376N761P140Q385
51439E04212R453J0192J0350R907R180Q443P511O003L994K157J117P75M00n84
51425E83110k055l446m434n122n542n406m680m082m390n312n684m901l577k573
51411E21906k043j748j665j676j202J04J574K189J860J382J333J652K270L226
$$ plain form
51517 605087 601204 596565 591144 584979 578093 570793 563850 557839 552487 547193 541961 537107 532320 526899
51503 526899 520921 515321 510718 506998 504156 502621 502403 502697 502826 502910 503187 503327 502986 502505 502395 502483 502213
51486 502213 501515 500771 500074 499139 497950 496921 496267 495649 494639 493281 491948 490805 489660 488359 487124 486328
51470 486328 485914 485257 483796 481628 479270 476939 474425 471647 468919 466549 464571 463053 462356 462704 463663
51455 463663 464375 464272 463446 462457 461996 462610 464433 467076 469910 472585 475282 478550 482926 488687 495827 504212
51439 504212 513665 523857 534207 544114 553294 561737 569248 575251 579245 581402 582519 583294 583694 583110
51425 583110 581055 577609 573175 568053 562511 557105 552425 548343 543953 538641 532957 528056 524479 521906
51411 521906 519863 518115 516450 514774 513572 513676 515250 517439 519299 520681 522014 523666 525936 529162
51397E29162M125M374M215M751O457Q421R614J0263J1285J2818J4289J5656J7691
51384F53121K0868K4741K8724L2868L7448M2219M6561N0043N2439N3437N2832
51373A095301N0914M8099M4131L8073K9348J8363N998p089k0217l2216m1896m8981
51361A179828n4023n7273n8305n6956n4126n1049m7997m4310l9630l4509k9668
51350F51982k5171k0806j6886j4120j2698j1948j1082r948q886q158p770p635
51338D96874p529p004n751m128k940k573k575k279j570q62n77q01j253j396q33
51323D54803J69Q48R00R88J815L032L638L371K965L003L104K615J606P36M22M91
51307D84506N32K99j78p54j347j999k616k859k548k119k247k978l645l746l490
$$ plain form
51397 529162 533287 537661 541876 546627 553084 561505 571119 581382 592667 605485 619774 635430 653121
51384 653121 673989 698730 727454 760322 797770 839989 886550 936593 989032 1042469 1095301
51373 1095301 1146215 1194314 1238445 1276518 1305866 1324229 1330227 1323138 1302921 1270705 1228809 1179828
51361 1179828 1125805 1068532 1010227 953271 899145 848096 800099 755789 716159 681650 651982
51350 651982 626811 606005 589119 574999 562301 550353 539271 529323 520437 512279 504509 496874
51338 496874 489345 482341 476590 472462 469522 466949 464374 462095 460525 459663 459086 458285 457032 455636 454803
51323 454803 454972 455820 456720 457708 459523 462555 466193 469564 472529 475532 478636 481251 482857 483593 484015 484506
51307 484506 485038 485337 485159 484405 483058 481059 478443 475584 473036 470917 468670 465692 462047 458301 454811
51292D54811l249k945k336j547r05n04k42p1J58Q32K110L518M445M957N622O535
51276D71189P058O683N781N159N142N311M959L712J766j80j299j202k23Q68J503
51261E16227J670J657J570J217M91l30q12q65q32j067j597k232k912l696m438
51246E04051m677m060k988k567l493n049n644m617l018k212k174j860r51k53k97
51231D60191m86j48L30J44o18j048o33K94J204J909K371K515K406K245K086J834
51215D74596J550J463J536J405R41N72P29J184J288Q02K16J43O99J553K355K902
51199D93934L045K752K246J885J846K001K109J918J210jj237j861j774j462j261
51184E05350r91n21j90k87n47o24o57q17p14l3O16M07l30m09L80Q65K20q58j229
$$ plain form
51292 454811 451562 448617 446281 444734 443829 443325 443083 443012 443170 444002 446112 449630 454075 459032 464654 471189
51276 471189 478247 484930 490711 495870 501012 506323 511282 514994 516760 516580 515281 514079 513856 514724 516227
51261 516227 517897 519554 521124 522341 522832 522502 521690 520825 519993 518926 517329 515097 512185 508489 504051
51246 504051 499374 495314 492326 489759 486266 481217 475573 470956 467938 465726 463552 461692 460741 460488 460191
51231 460191 459705 459557 459887 460031 459413 458365 457732 458026 459230 461139 463510 466025 468431 470676 472762 474596
51215 474596 476146 477609 479145 480550 481491 482063 482792 483976 485264 486066 486282 486425 487124 488677 491032 493934
51199 493934 496979 499731 501977 503862 505708 507709 509818 511736 512946 512945 511708 509847 508073 506611 505350
51184 505350 504359 503838 503648 503361 502814 502190 501533 500716 500002 499969 500585 500992 500662 500253 500633 501498 501718 500860 499631
51165D99631p70j55K69O72J251K085L183M296M928M889M471L878K933J624L28
51150E33513q45k281l919m795m255l022k278k154k014j773j934k467k707k352
51136D96717j785j257n56L63J146J636K120K756L199L062K415J770J753K689M134
51121E20162M993M591L493K804K833L022K978K831K628K216J721J434J159M41
51107E57306m46o83k12P4k00k69L90R83N75m05p62k11M64P35Q07Q42N39k48j116
51088E58163j567j542j276r88p95o70m45oM51O11M97M52O46Q85R89J096J412J906
51070E59819K428K961L587M303N059N888O829P769Q589R473J0789J2620J4635
51057F54749J6568J8454K0187K1203K0993J9791J8173J6207J3632J0900R223R273
$$ plain form
51165 499631 498861 498706 498975 499647 500898 502983 506166 510462 515390 520279 524750 528628 531561 533185 533513
51150 533513 532668 530387 526468 521673 517418 514396 512118 509964 507950 506177 504243 501776 499069 496717
51136 496717 494932 493675 493119 493482 494628 496264 498384 501140 504339 507401 509816 511586 513339 516028 520162
51121 520162 525155 529746 533239 536043 538876 541898 544876 547707 550335 552551 554272 555706 556865 557306
51107 557306 556860 556177 555965 556039 555839 555570 555960 556943 557518 557113 556351 556140 556604 557339 558146 558988 559527 559279 558163
51088 558163 556596 555054 553778 552790 551995 551325 550880 550874 551325 551936 552433 552885 553531 554416 555405 556501 557913 559819
51070 559819 562247 565208 568795 573098 578157 584045 590874 598643 607232 616705 627494 640114 654749
51057 654749 671317 689771 709958 731161 752154 771945 790118 806325 819957 830857 840080 849353
51045H49353J0363J1203J0948R204N828J394k718n536p425r147j0508j0799j0181
51032H41979r492q842p637o098n521o581q376r678j0241j0274r516p704n409l537
51018G33073k224r86L43J520K610M131O296Q570J0168J0824J1049J1586J2551
51005H09511J3107J2409J0822R639R420R163P645N046K582R57j28j050j705j982
50991H85436k205k753l514l907l320j569R13L337N228O817Q642J0834J3119J5343
50977I32401J7677K0271K2986K5566K7857K9760L1213L2331L3487L5112L7388
50966A246049M0181M3271M6585N0159N3825N7209O0152O2965O5889O8460O9829
50955A864574O9752O8728O7090O4470O0427N5120M9016M2359L5342K8496K2379
$$ plain form
51045 849353 859716 870919 881867 891071 896899 898293 895575 890039 882614 873467 862959 852160 841979
51032 841979 832487 823645 816008 809910 804389 797808 789432 779754 769513 759239 749723 742019 736610 733073
51018 733073 730849 729863 730206 731726 734336 738467 744763 753333 763501 774325 785374 796960 809511
51005 809511 822618 835027 845849 855488 864908 874071 881716 886762 889344 890301 890173 889123 887418 885436
50991 885436 883231 880478 876964 873057 869737 868168 869081 872418 877646 884463 893105 903939 917058 932401
50977 932401 950078 970349 993335 1018901 1046758 1076518 1107731 1140062 1173549 1208661 1246049
50966 1246049 1286230 1329501 1376086 1426245 1480070 1537279 1597431 1660396 1726285 1794745 1864574
50955 1864574 1934326 2003054 2070144 2134614 2195041 2250161 2299177 2341536 2376878 2405374 2427753
50944B427753J7059J2251P905M368K067J192J378J552N35j867m750p442j0403
50931B451598j4195j8210k1283k3408k5783k9174l3138l7058m1041m5342m9596
50920B113370n3213n6125n8592o0502o1374o0926n9380n7203n4734n2029m8894
50909A490398m5199m1126l7046l3189k9631k6546k4120k2182k0274j8211j6305
50898A176569j4858j3715j2487j1014r456q095p078o189m879k863o90O68R10O88
50884A087511P62J278K111L287M674N721O070O186O829Q095R480J0708J1878J2914
50870A177504J3541J3964J4937J6838J9121K0946K2107K3139K4789K7559L1415
50859A405860L5680L9582M3184M7463N3078N9478O5631P1425P7652Q4852R2810
$$ plain form
50944 2427753 2444812 2457063 2464968 2469336 2471403 2472595 2473973 2475525 2476060 2474193 2469443 2462001 2451598
50931 2451598 2437403 2419193 2397910 2374502 2348719 2319545 2286407 2249349 2208308 2162966 2113370
50920 2113370 2060157 2004032 1945440 1884938 1823564 1762638 1703258 1646055 1591321 1539292 1490398
50909 1490398 1445199 1404073 1367027 1333838 1304207 1277661 1253541 1231359 1211085 1192874 1176569
50898 1176569 1161711 1147996 1135509 1124495 1115039 1106944 1099866 1093677 1088798 1085935 1085245 1085913 1086823 1087511
50884 1087511 1088273 1089551 1091662 1094949 1099623 1105344 1111414 1117600 1124429 1132524 1142004 1152712 1164590 1177504
50870 1177504 1191045 1205009 1219946 1236784 1255905 1276851 1298958 1322097 1346886 1374445 1405860
50859 1405860 1441540 1481122 1524306 1571769 1624847 1684325 1749956 1821381 1899033 1983885 2076695
50848B076695J01298J10422J19963J29027J36889J43792J50295J56140J60314
50839C284835J62056J61250J57843J51530J42203J30230J16049R9794Q1585O2038
50829D549413M2299K3645O967p482j9763k9564l6090l8954l8916l7096l3673k8207
50817D352579k1406j5535j2591j2734j5217k0123k8248l9602n3015o7276q1811
50806C985021r6219j09771j21667j31290j38119j41829j42611j40920j36839j30164
50796B695592j21168j10707r9420q7440p5098o3259n2523m2573l2855k3489j5054
50785A972006p796j589L546P411R970J1230J1006R293O722M121J721p65l362n797
50771B017717q188j1032j4312j7317j9640k1781k4313k7044k9578l2116l4910
$$ plain form
50848 2076695 2177993 2288415 2408378 2537405 2674294 2818086 2968381 3124521 3284835
50839 3284835 3446891 3608141 3765984 3917514 4059717 4189947 4305996 4405790 4487375 4549413
50829 4549413 4591712 4615357 4622324 4614842 4595079 4565515 4529425 4490471 4451555 4414459 4380786 4352579
50817 4352579 4331173 4315638 4303047 4290313 4275096 4254973 4226725 4187123 4134108 4066832 3985021
50806 3985021 3888802 3779031 3657364 3526074 3387955 3246126 3103515 2962595 2825756 2695592
50796 2695592 2574424 2463717 2364297 2276857 2201759 2138500 2085977 2043404 2010549 1987060 1972006
50785 1972006 1964210 1962621 1966167 1973578 1983548 1994778 2005784 2015077 2021799 2025920 2027641 2026876 2023514 2017717
50771 2017717 2009529 1998497 1984185 1966868 1947228 1925447 1901134 1874090 1844512 1812396 1777486
50760A777486l7230l7855l6681l4961l3712l2534l0468k7423k4109k0976j7818
50749A443719j4398j0837p312l763j7M044Q445J2991J7268K1098K4962K9521L4714
50736A560435L9799M4446M9221N4682O0466O5744P0248P4321P8113Q1349Q3858
50725B262682Q5783Q7058Q7158Q5637Q2656P8758P4200O8687O1637N2610M1612
50714C068478K9159J6030K904r689k1139l0675l7669m1847m3165m1627l7466l1440
50702B821854k4764j8519j3094q217l710k83O09k075p948j5585k3873l2703m2240
50689B629452n1923o0552o7196p1635p3970p4164p2082o7721o1224n2928m3569
50678A932488l4192k5480j7137q292J397J1332K0742K9469L7655M4963N0733N4908
$$ plain form
50760 1777486 1740256 1702401 1665720 1630759 1597047 1564513 1534045 1506622 1482513 1461537 1443719
50749 1443719 1429321 1418484 1411172 1407409 1407392 1411436 1419881 1432872 1450140 1471238 1496200 1525721 1560435
50736 1560435 1600234 1644680 1693901 1748583 1809049 1874793 1945041 2019362 2097475 2178824 2262682
50725 2262682 2348465 2435523 2522681 2608318 2690974 2769732 2843932 2912619 2974256 3026866 3068478
50714 3068478 3097637 3113667 3116571 3106882 3085743 3055068 3017399 2975552 2932387 2890760 2853294 2821854
50702 2821854 2797090 2778571 2765477 2757260 2753550 2753267 2753876 2751801 2743853 2728268 2704395 2671692 2629452
50689 2629452 2577529 2516977 2449781 2378146 2304176 2230012 2157930 2090209 2028985 1976057 1932488
50678 1932488 1898296 1872816 1855679 1847387 1848784 1860116 1880858 1910327 1947982 1992945 2043678 2098586
50666B098586N8183O0978O2643O2106N9019N4017M8013M1658L5382K9528K4340
50655B634453J9993J6568J3869J1423Q934O562M475K344k47k965m895n585n418
50642B699511m760l304o18L123P336J1675J6025K0113K3539K6172K8070K9062
50630B855944K8830K7421K5399K3371K1549J9792J7821J5314J1964P538J742n928
50618C050757j5865k7518l8888m7198n0471m8735m3699l7266l0389k3314j6503
50607B670911j0794o586l519j294m52j880n785j1585j8700k6854l5614m4173n1854
50594B451821n8477o3968o7981p0204p0791p0132o8354o5444o1758n8080n4969
50583A741663n2270m9415m6116m2612l9320l6285l3142k9542k5513k1333j7162
$$ plain form
50666 2098586 2156769 2217747 2280390 2342496 2401515 2455532 2503545 2545203 2580585 2610113 2634453
50655 2634453 2654446 2671014 2684883 2696306 2705240 2711802 2716277 2718621 2718374 2715409 2710514 2704929 2699511
50642 2699511 2694751 2691447 2690829 2693952 2701288 2712963 2728988 2749101 2772640 2798812 2826882 2855944
50630 2855944 2884774 2912195 2937594 2960965 2982514 3002306 3020127 3035441 3047405 3054943 3056685 3050757
50618 3050757 3034892 3007374 2968486 2921288 2870817 2822082 2778383 2741117 2710728 2687414 2670911
50607 2670911 2660117 2653531 2650012 2648718 2648266 2646386 2640601 2629016 2610316 2583462 2547848 2503675 2451821
50594 2451821 2393344 2329376 2261395 2191191 2120400 2050268 1981914 1916470 1854712 1796632 1741663
50583 1741663 1689393 1639978 1593862 1551250 1511930 1475645 1442503 1412961 1387448 1366115 1348953
50572A348953j3032r079n523k301R28M247P220R420J1147J3206J6026J9233K2206
50559A422651K4777K7343L0378L3951L7632M0865M3537M6138M9178N2482N5289
50548A864221N7062N7909N8186N8028N7437N6536N5421N4017N2432N1314N1397
50537B473960N2761N4843N7268O0174O3644O7117O9827P1678P3366P5581P8316
50526C198535Q1129Q3928Q7254R1604R6617J01142J04246J05908J06451J05515
50516D162329J01993R5147Q5370P3595O0217M5013K8003R941q271k6284m4080
50505D582973o1153p6387q8939r8818j06217j10491j10450j05802r7723q7593
50495C639400p5610o1249m4921k8339j3190N5J1662K1463K8400L0985K7980J9070
$$ plain form
50572 1348953 1335921 1326842 1321319 1319018 1319946 1324193 1331413 1340833 1351980 1365186 1381212 1400445 1422651
50559 1422651 1447428 1474771 1505149 1539100 1576732 1617597 1661134 1707272 1756450 1808932 1864221
50548 1864221 1921283 1979192 2037378 2095406 2152843 2209379 2264800 2318817 2371249 2422563 2473960
50537 2473960 2526721 2581564 2638832 2699006 2762650 2829767 2899594 2971272 3044638 3120219 3198535
50526 3198535 3279664 3363592 3450846 3542450 3639067 3740209 3844455 3950363 4056814 4162329
50516 4162329 4264322 4359469 4444839 4518434 4578651 4623664 4651667 4661608 4653337 4627053 4582973
50505 4582973 4521820 4445433 4356494 4257676 4151459 4040968 3930518 3824716 3726993 3639400
50495 3639400 3563790 3502541 3457620 3429281 3416091 3416146 3427808 3449271 3477671 3508656 3536636 3555706
50483C555706N213j1815l0553n0313p0400q9357j05447j17675j25933j30425j31487
50472B697514j29788j26058j20545j13242j04613r5606q6785p8080o9566o1926
50462A711305n5718n0582m5779m1190l7232l3937l0717k7223k3885k1238j8951
50451A324853j6037j2013p453l293J30L062N671P854R707J1641J3894J6285J8660
50438A372961K1038K3025K3558K2011J9267J6982J5771J4897J3798J3107J3742
50427A570157J5590J7664J9176J9989K0355K0693K1469K2819K4349K5619K6772
50416A804652K8388L0845L4102L7855M1622M4847M7432N0019N3339N7230O0688
50405B291019O2890O3788O3696O2759O0921N8019N3752M7894M0759L3078K5224
$$ plain form
50483 3555706 3560919 3549104 3518551 3468238 3397838 3308481 3203034 3085359 2959426 2829001 2697514
50472 2697514 2567726 2441668 2321123 2207881 2103268 2007662 1920877 1842797 1773231 1711305
50462 1711305 1655587 1605005 1559226 1518036 1480804 1446867 1416150 1388927 1365042 1343804 1324853
50451 1324853 1308816 1296803 1289350 1286057 1286187 1289249 1294920 1302774 1312481 1324122 1338016 1354301 1372961
50438 1372961 1393999 1417024 1440582 1462593 1481860 1498842 1514613 1529510 1543308 1556415 1570157
50427 1570157 1585747 1603411 1622587 1642576 1662931 1683624 1705093 1727912 1752261 1777880 1804652
50416 1804652 1833040 1863885 1897987 1935842 1977464 2022311 2069743 2119762 2173101 2230331 2291019
50405 2291019 2353909 2417697 2481393 2544152 2605073 2663092 2716844 2764738 2805497 2838575 2863799
50394B863799J6839P498k610j2949k3367l4015m4628n4335o2320o8308p2270p3893
50382B439441p2756o8926o3108n6119m8348l9777l0398k0581j1119l014K957O640
50370B034892Q461Q799P443L853k053r626j7954k6385l4459m1652m7449n1602
50358A832268n4102n5083n4850n3816n2126m9475m5618m0996l6575l3040l0294
50347A326293k7622k4232j9819j4973j0925q556p708p707q313r708j1737j3786
50335A161207j5511j7006j8119j8287j7346j5879j4355j2467r906p191n097l583
50323A006460k049l59J238K975N332P875R331R357R316J0608J2768J4116J4011
50310A100979J3569J4051J5335J6427J7001J7811J9654K2376K5055K6922K7873
$$ plain form
50394 2863799 2880638 2888136 2885526 2872577 2849210 2815195 2770567 2716232 2653912 2585604 2513334 2439441
50382 2439441 2366685 2297759 2234651 2178532 2130184 2090407 2060009 2039428 2028309 2025295 2028252 2034892
50370 2034892 2043353 2052152 2059595 2063448 2061395 2051769 2033815 2007430 1972971 1931319 1883870 1832268
50358 1832268 1778166 1723083 1668233 1614417 1562291 1512816 1467198 1426202 1389627 1356587 1326293
50347 1326293 1298671 1274439 1254620 1239647 1228722 1220166 1212458 1204751 1196438 1186730 1174993 1161207
50335 1161207 1145696 1128690 1110571 1092284 1074938 1059059 1044704 1032237 1022331 1015140 1010043 1006460
50323 1006460 1004411 1004052 1005290 1008265 1013597 1021472 1030803 1040160 1049476 1060084 1072852 1086968 1100979
50310 1100979 1114548 1128599 1143934 1160361 1177362 1195173 1214827 1237203 1262258 1289180 1317053
50299A317053K8317K8769K9664L1180L3147L5269L7568M0290M3128M4833M3907
50288A713125L9552L1606J9899M517j3132l0132m3427n1298n3533n0920m5025
50277A521232l7874l1015k4721j8464j2103o165j117L161P016J0550J3654J6240
50265A440394J8278J9875K1480K3757K7014L0846L4635L8356M2612M7775N3372
50254A798394N8595O3354O8330P3803P8809Q1986Q2971Q2366Q0348P6207O9623
50243B614786O1706N4154M7696M1932L6279L0381K3768J5866O381m852j8232l3808
50231B876057n0268o5255p7009q5294r0550r2871r2148q8665q3076p6220o9259
50220B005442o3560n9805n7465n5584n3874n2683n2098n1560n0298m7860m4287
$$ plain form
50299 1317053 1345370 1374139 1403803 1434983 1468130 1503399 1540967 1581257 1624385 1669218 1713125
50288 1713125 1752677 1784283 1804182 1808699 1795567 1765435 1722008 1670710 1617177 1566257 1521232
50277 1521232 1483358 1452343 1427622 1409158 1397055 1390890 1389773 1392934 1399950 1410500 1424154 1440394
50265 1440394 1458672 1478547 1500027 1523784 1550798 1581644 1616279 1654635 1697247 1745022 1798394
50254 1798394 1856989 1920343 1988673 2062476 2141285 2223271 2306242 2388608 2468956 2545163 2614786
50243 2614786 2676492 2730646 2778342 2820274 2856553 2886934 2910702 2926568 2932949 2928097 2909865 2876057
50231 2876057 2825789 2760534 2683525 2598231 2507681 2414810 2322662 2233997 2150921 2074701 2005442
50220 2005442 1941882 1882077 1824612 1769028 1715154 1662471 1610373 1558813 1508515 1460655 1416368
50209A416368m0068l5851l2009k8556k5548k3159k1230j9210j6961j5156j4308
50198A144312j3844j2777j1144r981r834j0034r640q480p042n777m882m364m004
50185A032509l417k454j392n72PN60J180J790K334K844L426M140M835N138M836
50170A055764M287M214M929O045P016P801Q679R689J0500J0914J1244J2003J3310
50157A166395J4740J5828J6618J7559J8934K0650K2639K5045K7886L0816L3628
50146A410738L6755M0843M5940N1558N7469O4003P1526Q0121Q9833J00806J12858
50135B162450J25295J37224J47800J56103J61320J63291J62494J59135J52750
50126C527862J43254J32058J21266J11633J01824Q9917P5218N8135L8665J5671
$$ plain form
50209 1416368 1376300 1340449 1308440 1279884 1254336 1231177 1209947 1190737 1173776 1158620 1144312
50198 1144312 1130468 1117691 1106547 1096566 1086732 1076698 1067058 1058578 1051536 1045759 1040877 1036513 1032509
50185 1032509 1029092 1026638 1025246 1024674 1024681 1025241 1026421 1028211 1030545 1033389 1036815 1040955 1045790 1050928 1055764
50170 1055764 1060051 1064265 1069194 1075239 1082255 1090056 1098735 1108424 1118924 1129838 1141082 1153085 1166395
50157 1166395 1181135 1196963 1213581 1231140 1250074 1270724 1293363 1318408 1346294 1377110 1410738
50146 1410738 1447493 1488336 1534276 1585834 1643303 1707306 1778832 1858953 1948786 2049592 2162450
50135 2162450 2287745 2424969 2572769 2728872 2890192 3053483 3215977 3375112 3527862
50126 3527862 3671116 3803174 3924440 4036073 4137897 4227814 4303032 4361167 4399832 4415503
50116D415503j1852m2976p4697j03785j28570j48890j64674j75270j80250j80275
50106C204264j76654j70285j61449j50578j38633j26591j14846j03419r2646q3273
50096A885890p5781o9774o4256n8549n2786m7406m2427l7476l2526k8159k4852
50085A351898k2313j9802j6996j4229j1885j0022q658q021q076q088p154n211
50073A211443l133j702q24J20J430K959M452N608O036N612M836M359M116L480
50059A248792K259J048L35q0n61r99j262j659k469l273l372k767k106j762j453
50044A230671p85L04J673L272N137P284R547J1502J2863J4100J6127J9068K1904
50031A352667K3928K5884K8811L2240L4728L6018L7416L9896M3053M6272M9821
$$ plain form
50116 4415503 4403651 4360675 4285978 4182193 4053623 3904733 3740059 3564789 3384539 3204264
50106 3204264 3027610 2857325 2695876 2545298 2406665 2280074 2165228 2061809 1969163 1885890
50096 1885890 1810109 1740335 1676079 1617530 1564744 1517338 1474911 1437435 1404909 1376750 1351898
50085 1351898 1329585 1309783 1292787 1278558 1266673 1256651 1247993 1239972 1231896 1223808 1216654 1211443
50073 1211443 1208310 1206608 1205784 1205904 1207334 1210293 1214745 1220353 1226389 1232001 1236837 1241196 1245312 1248792
50059 1248792 1251051 1252099 1252434 1252354 1251793 1250794 1249532 1247873 1245404 1242131 1238759 1235992 1233886 1232124 1230671
50044 1230671 1229886 1230190 1231863 1235135 1240272 1247556 1257103 1268605 1281468 1295568 1311695 1330763 1352667
50031 1352667 1376595 1402479 1431290 1463530 1498258 1534276 1571692 1611588 1654641 1700913 1750734
50020A750734N4166N9078O4130O9375P4918Q0322Q5044Q8891R1441R1617Q8613
50009B598329Q2950P5924O8349O0404N2401M4885L8025L1484K4855J7774R632
49998C105012m05j3018k8483m6436o5591q4004j00016j12814j21963j26929j27617
49987B277736j24897j19958j13356j05270r6358q7611p9401p1367o3300n5624
49977A360594m8910m3278l8355l3533k8435k3460j9666j7660j6741j5590j3638
49966A061328j1328r274p766p010p080p572p744p206o107m705l146j623k68J116
49952I81615K739M342N455O047O377O354N603M179K588J055n80k247l573m555
49938A015399n649o992q216r206j0351j1723j2724j3013j3161j3834j4754j5077
$$ plain form
50020 1750734 1804900 1863978 1928108 1997483 2072401 2152723 2237767 2326658 2418099 2509716 2598329
50009 2598329 2681279 2757203 2825552 2885956 2938357 2983242 3021267 3052751 3077606 3095380 3105012
49998 3105012 3104607 3091589 3063106 3016670 2951079 2867075 2767059 2654245 2532282 2405353 2277736
49987 2277736 2152839 2032881 1919525 1814255 1717897 1630286 1550885 1479518 1416218 1360594
49977 1360594 1311684 1268406 1230051 1196518 1168083 1144623 1124957 1107297 1090556 1074966 1061328
49966 1061328 1050000 1040726 1032960 1025950 1018870 1011298 1003554 996348 990241 985536 982390 980767 980499 981615
49952 981615 984354 988696 994151 1000198 1006575 1012929 1018532 1022711 1025299 1026354 1025774 1023527 1019954 1015399
49938 1015399 1009750 1002758 994542 985336 974985 963262 950538 937525 924364 910530 895776 880699
49926H80699j4469j3264j1809j0182q438o685m967l382k256j824j760j363k31
49913H00069J361K816L782M383M936N509N905O066O362P202Q501R849J1027J2026
$$ plain form
49926 880699 866230 852966 841157 830975 822537 815852 810885 807503 805247 803423 801663 800300 800069
49913 800069 801430 804246 808028 812411 817347 822856 828761 834827 841189 848391 856892 866741 877768 889794
$$ [...]
##END NTUPLES=NMR SPECTRUM
##END=
