##TITLE=AC1696_ROEFFECT0025_8637818_uTAhjjjDHB
##JCAMPDX= 6.0         $$ Bruker NMR JCAMP-DX V2.0
##DATA TYPE= NMR SPECTRUM
##DATA CLASS= NTUPLES
##ORIGIN= BRUKER
##OWNER= Administrator
$$ 1.72 TOPSPIN		Version 2.1
$$ 2014-05-22 19:20:58.362 -0700  Administrator@X
$$ Compression mode = diff/dup
##.OBSERVE FREQUENCY= 400.02188249412
##.OBSERVE NUCLEUS= ^1H
##.ACQUISITION MODE= SIMULTANEOUS (DQD)
##.ACQUISITION SCHEME= undefined
##.AVERAGES= 8
##.DIGITISER RES= 22
##SPECTROMETER/DATA SYSTEM= spect
##.PULSE SEQUENCE= zg30
##.SOLVENT NAME= COFFEE_meoh
##.SHIFT REFERENCE= INTERNAL, COFFEE_meoh, 1, 14.98509
##AUDIT TRAIL= $$ (NUMBER, WHEN, WHO, WHERE, PROCESS, VERSION, WHAT)
$$ ##TITLE= Audit trail, TOPSPIN		Version 2.1
$$ ##JCAMPDX= 5.01
$$ ##ORIGIN= Bruker BioSpin GmbH
$$ ##OWNER= Administrator
$$ $$ E:\/data/COFFEE/nmr/AC1696_ROEFFECT0025_8637818_uTAhjjjDHB/10/pdata/1/auditp.txt
$$ ##AUDIT TRAIL=  $$ (NUMBER, WHEN, WHO, WHERE, PROCESS, VERSION, WHAT)
(   1,<2014-05-22 19:20:51.506 -0700>,<Administrator>,<X>,<go>,<TOPSPIN 2.1>,
      <created by zg
	started at 2014-05-22 19:19:45.220 -0700,
	POWCHK enabled, PULCHK disabled,
       configuration hash MD5:
       C8 4E 4E 5D D3 5C D8 9E 9F 52 82 E0 59 8A DE 15
       data hash MD5: 64K
       68 E3 A0 A6 9E 14 54 9E 5A E1 C7 BD 61 32 80 5D>)
(   2,<2014-05-22 19:20:54.669 -0700>,<Administrator>,<X>,<proc1d>,<TOPSPIN 2.1>,
      <Start of raw data processing
       efp LB = 0 FT_mod = 6 PKNL = 1 PHC0 = 0 PHC1 = 0 SI = 32K 
       data hash MD5: 32K
       DD 79 70 64 A8 9E 5F B5 36 BB F6 CE E1 C3 06 33>)
(   3,<2014-05-22 19:20:54.995 -0700>,<Administrator>,<X>,<proc1d>,<TOPSPIN 2.1>,
      <pk PHC0 = 91.93359 PHC1 = 0 
       data hash MD5: 32K
       80 EC C6 6F 99 5A 00 2C 0B AB 78 2B F3 6F ED 4F>)
(   4,<2014-05-22 19:20:55.115 -0700>,<Administrator>,<X>,<proc1d>,<TOPSPIN 2.1>,
      <abs ABSG = 1 
       data hash MD5: 32K
       B5 58 BD 01 04 68 AE 1B 5A F6 DC B4 15 64 6E 9D>)
(   5,<2014-05-22 19:20:55.167 -0700>,<Administrator>,<X>,<proc1d>,<TOPSPIN 2.1>,
      <abs ABSG = 2 
       data hash MD5: 32K
       12 79 86 02 15 36 27 EC 32 45 D7 8F 27 BC 27 F7>)
(   6,<2014-05-22 19:20:55.236 -0700>,<Administrator>,<X>,<proc1d>,<TOPSPIN 2.1>,
      <abs ABSG = 3 
       data hash MD5: 32K
       4C 3D 5A 0C 7F 3F 2D 62 11 A8 46 7D 86 38 40 03>)
(   7,<2014-05-22 19:20:55.305 -0700>,<Administrator>,<X>,<proc1d>,<TOPSPIN 2.1>,
      <abs ABSG = 4 
       data hash MD5: 32K
       97 12 18 6F 53 14 A0 5E F9 E4 08 AF F2 EA 4E C8>)
(   8,<2014-05-22 19:20:55.373 -0700>,<Administrator>,<X>,<proc1d>,<TOPSPIN 2.1>,
      <abs ABSG = 5 
       data hash MD5: 32K
       AD D7 B5 49 54 58 29 E2 06 21 E0 25 15 62 66 8C>)
$$ ##END=
$$ 
$$ $$ hash MD5
$$ $$ 7E F7 A2 A0 EE 8E 51 48 22 75 DD 5B 1E 61 2D 64
##$RELAX= 
##$RELAX= 
##$RELAX= 
##$RELAX= 
##$RELAX= 
##$RELAX= 
##$RELAX= 
$$ Bruker specific parameters
$$ --------------------------
##$DU= <E:\>
##$EXPNO= 10
$$ [...]
150 150 150 150 150 150 150 150
##$TP07= 0
##$TPNAME0= <>
##$TPNAME1= <>
##$TPNAME2= <>
##$TPNAME3= <>
##$TPNAME4= <>
##$TPNAME5= <>
##$TPNAME6= <>
##$TPNAME7= <>
##$TPOAL= (0..7)
0.5 0.5 0.5 0.5 0.5 0.5 0.5 0.5
##$TPOFFS= (0..7)
0 0 0 0 0 0 0 0
##$TUNHIN= 0
##$TUNHOUT= 0
##$TUNXOUT= 0
##$USERA1= <user>
##$USERA2= <user>
##$USERA3= <user>
##$USERA4= <user>
##$USERA5= <user>
##$V9= 5
##$VALIST= <valist>
##$VCLIST= <CCCCCCCCCCCCCCC>
##$VD= 0
##$VDLIST= <DDDDDDDDDDDDDDD>
##$VPLIST= <PPPPPPPPPPPPPPP>
##$VTLIST= <TTTTTTTTTTTTTTT>
##$WBST= 2048
##$WBSW= 25
##$XGAIN= (0..3)
0 0 0 0
##$XL= 0
##$YL= 0
##$YMAX_a= 600889
##$YMIN_a= -515160
##$ZGOPTNS= <>
##$ZL1= 120
##$ZL2= 120
##$ZL3= 120
##$ZL4= 120
##$ABSF1= 14.98509
##$ABSF2= -5.573092
##$ABSG= 5
##$ABSL= 3
##$ALPHA= 0
##$AQORDER= 0
##$ASSFAC= 0
##$ASSFACI= 0
##$ASSFACX= 0
##$ASSWID= 0
##$AUNMP= <proc_prof1d_extract_pilot.lims>
##$AXLEFT= 0
##$AXNAME= <>
##$AXNUC= <1H>
##$AXRIGHT= 0
##$AXTYPE= 0
##$AXUNIT= <>
##$AZFE= 0.1
##$AZFW= 0.1
##$BCFW= 0
##$BC_mod= 0
##$BYTORDP= 0
##$COROFFS= 0
##$CY= 15
##$DATMOD= 1
##$DC= 0
##$DFILT= <>
##$DTYPP= 0
##$F1P= 0
##$F2P= 0
##$FCOR= 0.5
##$FTSIZE= 32768
##$FT_mod= 6
##$GAMMA= 0
##$GB= 0
##$INTBC= 1
##$INTSCL= 1
##$ISEN= 128
##$LB= 0
##$LEV0= 0
##$LPBIN= 0
##$MAXI= 10000
##$MC2= 0
##$MEAN= 0
##$ME_mod= 0
##$MI= 0
##$NCOEF= 0
##$NC_proc= -8
##$NLEV= 6
##$NOISF1= 0
##$NOISF2= 0
##$NSP= 0
##$NTH_PI= 0
##$NZP= 0
##$OFFSET= 14.98509
##$PC= 1
##$PHC0= 91.93359
##$PHC1= 0
##$PH_mod= 1
##$PKNL= yes
##$PPARMOD= 0
##$PPDIAG= 0
##$PPIPTYP= 0
##$PPMPNUM= 2147483647
##$PPRESOL= 1
##$PSCAL= 4
##$PSIGN= 0
##$PYNMP= <proc.py>
##$REVERSE= no
##$SF= 400.02
##$SI= 32768
##$SIGF1= 0
##$SIGF2= 0
##$SINO= 400
##$SIOLD= 32768
##$SPECTYP= <>
##$SREGLST= <1H.CDCl3>
##$SSB= 0
##$STSI= 32768
##$STSR= 0
##$SW_p= 8223.68421052631
##$SYMM= 0
##$S_DEV= 0
##$TDeff= 65536
##$TDoff= 0
##$TI= <>
##$TILT= no
##$TM1= 0
##$TM2= 0
##$TOPLEV= 0
##$USERP1= <user>
##$USERP2= <user>
##$USERP3= <user>
##$USERP4= <user>
##$USERP5= <user>
##$WDW= 1
##$XDIM= 32768
##$YMAX_p= 468130494
##$YMIN_p= -810474
##$CURPLOT= <Network HP LaserJet P1505>
##$CURPRIN= <$Network HP LaserJet P1505>
##$DFORMAT= <normdp>
##$LAYOUT= <+/1D_H.xwp>
##$LFORMAT= <normlp>
##$PFORMAT= <normpl>
##$SURQMSG= 1
$$ End of Bruker specific parameters
$$ ---------------------------------
##NTUPLES= NMR SPECTRUM
##VAR_NAME=  FREQUENCY,     SPECTRUM/REAL,   SPECTRUM/IMAG
##SYMBOL=    X,             R,               I
##VAR_TYPE=  INDEPENDENT,   DEPENDENT,       DEPENDENT
##VAR_FORM=  AFFN,          ASDF,            ASDF
##VAR_DIM=   32768,         32768,           32768
##UNITS=     HZ,            ARBITRARY UNITS, ARBITRARY UNITS
##FACTOR=    0.250966925370066, 1,           1
##FIRST=     8223.43324360094, 89223,        -85072
##LAST=      0,             -44358,          -33200
##MIN=       0,             -810474,         0
##MAX=       8223.43324360094, 468130494,    0
$$ Real data points
##PAGE= N=1
##DATA TABLE= (X++(R..R)), XYDATA
$$ [...]
23834 -158919 42989 216261 51570 166322 -64592 168677 -13374 285025 423012 134909
23823 145798 -199520 7838 -110086 287732 9656 -134982 -306319 -63685 -177727 -123557 135738
23811 -66621 145613 -306233 -52219 83476 -205263 -140756 26824 67759 -8258 -166971 -255630
23800 -255630 -119766 111373 92869 -117281 63139 192652 -71341 -233260 18313 -206909
23789 169626 -5278 -111447 105776 155104 -85089 269566 193137 -11711 188237 -67734 23780
23777 42983 -107682 -188164 -9733 98869 -93471 -80111 157690 -5662 264427 88022 335012
23766 335012 72992 -78300 -45497 203480 38095 -5296 12284 -51242 -51852 142231 134749 -132344
23753 128040 240404 -47425 -124318 -123820 15115 -143642 130583 -326496 -235611 -175980 64618
23741 134861 -131684 252226 -137885 -380381 -57794 -105006 311087 -259714 147290 -124820
23730 95386 387560 -60913 -195933 179940 60147 -70949 131153 222825 -143854 46171 185586
23719 185586 -200990 8269 56441 -177020 99505 110329 300351 -17238 -92588 69806 -177911
23707 61315 -1718 219442 -407914 127888 -161204 231456 151070 91488 -333601 250520
23696 -230102 -141287 -104999 39431 -76314 -422178 -230400 -14262 315441 -171472 -186133 38005
23684 20643 191842 155945 314334 -220380 -252101 -39430 320903 286909 -78266 -273232 -53556
23672 -54588 36021 -176743 -66238 -90759 -304282 -19812 -219241 -236894 -108221 -115414 -189465
23661 -189465 119751 -24926 -58556 4324 49013 118806 231122 -92699 -234937 262483 100864
23649 -231179 50959 324895 109962 1719 -175496 28892 -32070 352504 -80348 -56523 -9666
23637 -64466 -77324 -412120 -434169 -14698 -159724 171766 -253579 108819 143597 -92529 49011
23625 64507 48335 -167437 -11086 -103496 71777 17292 9152 -157829 36834 -335978 60359
23613 -45241 -298913 -100187 -207262 -85277 -389602 113223 -392789 -98505 62159 -123385
23602 8255 -177793 243208 -33610 231822 300380 -98494 152267 234666 -33446 83434 -262707
23590 23457 186550 -142143 136214 300920 416820 -117646 -78188 251310 -282536 -130102
23579 198680 -124658 -93455 -4677 -29428 -251591 159666 -82286 56143 162103 -3757 -224437
23568 -224437 380062 -36631 -228939 -163199 -338592 80368 156085 -87402 -514114 -201744
23557 -113016 -238729 -177463 71052 4573 53440 -115003 -83626 -342581 -154544 -49838 -227123
23546 -227123 -291679 -60841 141679 -11304 265293 529429 114303 -59224 58901 -174049
23535 177761 218043 40438 -221729 -111033 383318 24672 -102029 -89262 -344137 -131460
23524 242594 70112 167698 242180 -222042 -267710 13651 151583 129040 -206670 113875 -176769
23512 49066 -279188 -158587 199993 -61921 204740 -103964 239173 240928 -28911 81202 -155625
23500 22313 158212 227304 25034 101806 249655 -146047 281780 -75862 -298006 -106083
23489 65948 102338 78838 72719 -129255 -16026 -292938 338096 205850 -162790 -43367 -210454
23478 -210454 134916 -140759 157228 -181341 -98858 -49450 -48026 -179442 -22955 -7343 -392733
23467 -392733 -71695 116750 -1127 -125516 -31983 -46397 -385296 -73896 43379 88163 -336671
23455 39076 74510 -186273 296104 -38762 72611 -33084 283395 6759 53795 -268910 60584
23443 -235335 -366696 -30207 184712 -540611 -256088 178500 -95808 -56358 141596 245725
23433 245725 43913 106358 243710 -90165 -82728 139470 -48874 313518 51345 -132258 203895
23421 -150802 20731 120758 399303 -206412 32084 -180079 29005 -81655 85528 -72929 -5237
23409 47248 36627 193275 -183634 122062 27706 -100765 -204878 107888 -194810 -216032
23399 -216032 -101551 175311 94780 49744 164159 -164967 -77473 -68411 -278866 -111259
23388 187856 312426 402642 117403 76342 111025 -163925 -9389 69567 90850 26319 240532
23377 240532 183308 -116981 -152325 216584 -23640 -115502 -90720 -11978 -8177 -282603 103362
23365 25986 37692 37334 -103319 -312492 -45643 209732 35140 -142932 232374 84451 -232123
23353 7542 35484 122447 320191 -56831 -29699 -24508 114787 353339 -43875 -493147 122061
23341 -263964 -105151 13874 -219305 234420 31204 154914 85860 -282095 64266 -494467
23330 -248351 79330 103194 -187577 -274038 -37247 189642 -170452 -156288 -154355 -108117 232870
23318 298409 -66221 -52433 -50240 -196478 -126523 55274 133482 -72546 10536 231018 -132460
23306 -222765 -124450 -102777 -139266 -155841 -133454 55052 -15829 -86366 289901 -98452 -86263
23295 -86263 98703 -35496 114840 -209584 -207114 -303902 -39547 -72806 304670 238660 -293873
23283 128327 -41099 -25381 292191 -81789 -101716 198862 -66934 -155292 79900 -212125 -118870
23272 -118870 363329 116350 -66219 -5268 -100187 -89424 -124619 100928 154833 102692 -231629
23260 -124228 117112 123518 260303 132144 -239417 -252391 -44133 129881 -9525 126942 -295117
23248 -14393 187160 -17591 267487 100794 16247 -309366 -314426 47597 226749 184819 -43157
23236 -153133 -224881 -140598 51546 77578 -230348 126158 17099 -22203 211569 -233046 -196959
23225 -196959 -69072 -182794 30370 126914 -2038 121358 199698 138791 389124 -221303 -63519
23213 93117 -21290 -264472 -334025 90498 -137303 -120009 -37553 -117049 121471 -31506 -325564
23202 -325564 269304 -85825 191561 -154340 -118868 -45989 -244927 -462308 -179210 -92625
23192 -92625 -52548 -106952 229406 133330 -382801 -54691 256441 81100 -108561 -18903 116700
23180 -225498 44826 -48923 28445 -328052 125727 52448 -190 -124088 -53936 -325481 -142463
23168 -97050 77032 -261738 424520 37982 38041 -95717 77025 -256993 -294802 -169171 457567
23156 314305 222180 297287 -206908 178758 -78393 293560 82367 -250984 7511 107941 -20681
23144 -59781 72988 -12202 108765 95983 2365 -216433 -186843 -22246 -80746 -214753 49064
23132 153483 137986 65398 -122604 45451 -47173 -45658 -51089 6378 -30130 131858 152877 127737
23120 127737 240860 127737 -239001 184525 -365931 -224064 207439 -247369 119294 -177528
23109 -43284 348565 -178307 208487 100582 102464 -52423 86120 120763 169349 37678 266137
23098 266137 260979 -166166 -34130 76778 38428 170588 -195403 -328297 222919 -30738 65244
23086 -32037 -227934 -146523 2899 75277 -241102 -337695 -172867 -162459 199379 -365766 -244627
23075 -244627 -54548 -120175 -38308 -176058 -408143 -305798 109161 161056 -367511 -133252
23064 -156376 -15740 252142 45890 -183246 -145079 -91004 -87392 -39227 240476 -67516 -17683
23052 243952 -79172 -159390 -92979 -53129 -100973 -33109 -166461 -239143 -24602 211341 -234626
23040 235429 -16588 -82842 -15135 -319567 36617 39875 129555 135522 -90698 -106790 111145
23028 -1942 -77402 -12223 -205199 -132080 -110366 -153769 162036 11148 -45046 -77698 -73477 -4488
23015 -39692 95977 4449 -210075 198966 -103249 -109459 14242 -80989 -52317 30103 -170093
23003 -57058 -138151 91518 -17463 -50176 102100 -146945 57261 33740 118111 -37074 175544
22991 52607 101238 -109068 231378 -193406 -286799 -176262 -112597 108589 1304 -257331 -297630
22980 -297630 -384576 159890 147503 338974 143055 171650 151085 -175636 95267 -82783 -134031
22969 -134031 -260881 -44241 157010 -95077 -32075 269319 183323 451138 -57157 30911 61502
22958 61502 -303594 379846 169475 -47304 -253622 159600 191780 -79958 -445887 -395685
22948 -395685 141182 -96443 127905 170783 14502 182516 48166 -53750 -176730 -595560
22938 -595560 326649 -281866 -387972 -148782 -15218 -22911 59382 7563 -6740 210524 8448
22926 -208040 138678 -148231 -50819 18372 187549 133471 -38748 -107965 -244132 205999
22915 -161110 352444 -20833 7751 -119191 111936 -81314 -6924 -193825 -253590 -219167 -55722
22903 51517 -336999 74764 167434 19702 -115538 234756 -150695 -105450 -158530 -250509 -55738
22891 149516 28327 -7503 -19112 -77645 42734 -153701 -206 -227998 -120269 -45758 67886
22879 -392514 -142508 -94229 -154739 346423 -22173 -34217 -58745 284405 275680 36056 -177826
22867 129741 -3523 -163606 216400 201915 214147 -206928 -225326 -245021 141553 233760 49231
22855 206349 -344433 95969 -234936 28018 -53754 26893 -150598 -176732 -166252 192392 -197752
22843 198008 -117820 33147 -17386 -134040 24144 -143652 32305 86190 -99686 -165031 -210839
22832 -210839 6275 -104583 -167538 278664 -243348 -145780 137140 -4209 224626 374890 140449
22820 102893 268829 -95454 241091 148022 59374 146117 -76987 161158 -118977 -210597 -71172
22808 -299438 74043 66016 140472 289376 -87861 -257264 -366210 -39383 163165 381712 187919
22796 -67171 -279899 -283175 266520 -107862 123565 149565 -268990 206379 299971 482477
22786 482477 194446 97143 263127 -152770 -277700 -340687 11866 173845 -36943 43523
22775 41818 -111836 74600 -52508 -52950 108750 -126622 -97978 30041 168283 286652 -80041
22763 -96499 -141337 -278928 -283482 -212637 203873 -14425 165436 -52484 -9763 -229222 42930
22751 504338 58378 -40916 -48343 -104016 189702 -54453 -124697 8181 -217774 155921 187721
22740 187721 19787 194658 -79051 -55864 -36303 -57576 -98116 126115 -98259 -9816 -194668
22729 -194668 -415118 182621 -91330 -147738 -309477 33750 -308166 -97962 4402 -282771 -93548
22717 -95366 21519 196394 132795 207060 348268 103902 -83618 -315192 115036 -230925
22706 138056 -151500 209857 -64328 -155541 -136633 -132326 109550 -250646 -387364 -232974
22696 -232974 273789 -310561 -105359 426664 52444 -91032 -281682 292454 -5626 37438
22685 -147479 -133756 38288 8666 57670 -22911 -195582 -120877 43876 -349423 -78911 -98397
22674 -98397 27233 252731 -98968 -290605 -381016 146760 -305873 -242562 -139925 -47054 260079
22662 -54135 -68082 161526 12175 255231 -558002 3202 -174361 -187209 31482 -246548 -16987
22650 -125147 -205767 88846 -4779 -68380 132589 -331653 -48387 -314321 256948 -144500 -56295
22638 -133227 84012 66796 -20997 98135 -73986 220400 -213120 196917 -11431 56035 -140235
22626 81466 185432 -406475 -5874 18166 52738 -128372 -220415 13714 -228153 -70419 -257422
22615 -257422 -139525 18172 -49100 1127 -342807 154768 70638 -130692 -407589 96898 -38816
22603 -19961 -255563 -86634 45836 3953 -367725 -165374 -32787 225202 39902 -57405 100793
22591 249618 -54986 188198 201699 245803 535168 37341 -86841 81787 -305207 -103139 -91692
22580 -91692 -133316 -215684 -339396 -211357 13691 -8358 140406 142800 311841 -172642 -42580
22568 -19287 73018 -110389 -204627 -518739 -59418 -104066 102825 -271880 -94639 351159 38339
22556 -232505 99768 -53565 -221956 229307 133219 27602 -206869 149665 -62465 96987 204647
22545 204647 63179 268875 110275 110263 -118689 -47716 68432 85160 -22913 -71480 -96128
22534 -96128 172647 461937 -64173 208481 -226631 110300 -197339 120666 52235 -62909
22523 92161 -280784 -102468 148742 -492823 -301539 280905 -91707 136200 -13152 284942
22512 -62670 88866 159860 117600 368559 6816 238216 -55072 -164221 -201436 -39474 109950
22500 -1588 -6114 47234 -67667 168840 -188895 -137905 -344838 -307948 226663 -158387 139209
22488 -198822 -106892 240124 -50739 320297 210927 -124367 -239155 76198 -390785 188382
22477 -4985 -234670 75799 -44182 40557 -197838 -180646 98897 -71754 90434 202850 -17787
22465 -135321 101966 -125990 -255797 117792 -19750 88876 -50129 -197379 -311138 -70269
22454 376536 -200780 1748 -277307 4318 86457 29095 -197805 -353662 -408538 -54217 335622
22442 -23690 -53250 30542 354762 -182295 28529 -144936 -429172 -264172 -56766 123661
22431 26589 -119139 -1730 113336 144450 116166 -345164 2337 140396 -116773 -173759 -251558
22420 -251558 63843 -298756 -201369 -12415 -184170 135493 23835 89852 148694 26940 314291
22409 314291 -118739 -144954 -44829 -145804 -229937 64094 -183336 69295 2816 -249410 -208797
22398 -208797 211738 116320 -159972 -50480 33238 -310355 -49366 -304704 137752 -136668
22387 -34061 264766 -263740 -139649 -124952 -24820 165494 -18281 -121348 -365599 -94351
22376 74457 -211174 373228 252073 -200150 -97078 -62464 32312 -175406 53697 -130475
22365 117366 188902 290672 9630 -150490 90224 -12028 8346 22985 -139829 159377 -33830
22353 -229423 -210361 -11619 -26343 -84705 -93716 -269265 27440 -335718 -51489 -173603 -124331
22342 -124331 157163 -64978 128165 84063 -246322 -100215 -154318 73683 213935 16730
22331 135977 -446998 -404364 -72034 -114872 -179362 82588 -14702 -64852 120442 218648 -43390
22319 67382 -86668 -112191 -90774 39456 68448 -300731 148862 21444 43751 -145370 -257564
22308 -257564 184361 37998 7049 -143673 9171 40852 220192 150285 22978 71631 8406
22296 -380993 -140261 57988 398585 89339 328036 58579 310847 -117220 210584 -107943
22285 147845 -46549 -352907 21832 -93337 12380 135361 -57999 366363 180392 -216218
22274 -209715 98680 -172130 -4229 -270025 -350356 -157686 70557 -122670 -110799 242591 -313290
22262 -426984 -91727 339069 -315702 -239147 -32584 -178541 -251643 -197811 54284 166607 -322060
22250 -281081 95279 -121837 -105556 -46491 18482 -40096 90260 309945 -204463 222557 -24212
22238 -215033 -336388 7198 -64791 151657 -55962 -54100 32216 -250760 -324786 220828 283208
22227 283208 287453 85678 -128059 -243566 307390 99628 -177340 200861 -174699 -308536
22217 -308536 -100596 -450153 36685 165195 -115499 108321 -199175 205880 -40222 -225141
22207 -225141 24169 -77767 -133505 -68585 188248 257621 55463 -45387 -68968 172790 -234684
22195 -160330 -80768 -150242 229993 -99213 147763 -719 -19304 -3536 41552 170450 -111183
22183 -77486 29758 -239111 4993 -47918 78505 -338593 -235506 -302745 151025 -100907 138553
22171 -261863 -446238 -97099 -81831 -148583 -47986 221565 98901 -143752 5653 -180987 -27414
22159 -144451 116786 23205 -206079 203954 52393 208394 214723 -261813 -17576 59656 82533
22148 82533 147216 -9165 -31868 152436 122575 -169574 -339427 -260478 -141437 -52973 86528
22136 -85136 -16965 251818 174420 -201827 -135445 27372 189994 -63161 62573 -110682 -301363
22125 -301363 -99830 -159448 -225324 -169927 -165962 193677 -276730 120987 -372916 -197068 -67495
22113 40331 90135 -74483 305596 -55424 -253295 409715 158402 -145329 73962 -130698
22102 -133212 35412 -229134 -110298 422452 31873 39338 -38404 -217491 -92671 -492541 21128
22090 -44930 -277627 107072 -177848 99273 205848 98001 66508 -148140 -65134 -167397
22080 -167397 141784 179229 -356470 -36234 27487 291897 -72920 -520 379109 28160 253587
22069 253587 196108 -3376 59757 -307912 -76963 -362 76779 -130707 353286 90895 4796 72561
22057 72561 -62925 101143 176490 -45228 298661 -201859 -289341 -274787 87882 -225286 -254015
22046 -254015 -282215 119491 20604 135795 53118 -77461 -50750 10155 73661 145275 -52211
22034 -232189 -536052 76431 -316447 129627 89818 -104879 -249683 78166 101009 299552
22024 299552 239487 -197975 -166730 57477 -248020 -30043 -33454 122364 72400 108539 15789
22012 -215625 -231851 -363532 37012 -120589 -68707 -119022 297557 -16847 65994 -296039 -183299
22001 -183299 173816 -137537 -294263 13313 88980 73496 232712 -282799 357707 50759
21990 -162860 -45180 -55398 62260 -63599 275740 17936 -131499 -73660 -352701 -29215 158614
21978 -183890 301420 68064 16753 89094 -120878 9212 167669 -38966 -158274 -150588 -217821
21967 -217821 -222015 49685 -132911 -377367 -257193 315542 43742 -41783 -269839 -21552 103081
21955 10980 126634 81497 -313701 -11044 -390814 -98954 2081 -23331 -359035 -64477 20540
21943 214521 125657 -223577 -335004 -209278 -343728 199554 -237529 -55577 50990 15582
21932 -25014 4746 -67278 78575 -47537 89228 35073 -131948 -33596 128297 -91490 -69975
21921 -69975 -196131 -137373 276242 -88054 -133512 156879 40553 56110 -240195 209605 62560
21909 -192794 144306 -65074 -41196 -441536 -229547 144751 11512 -229435 272765 166632
21899 166632 52695 -95858 -177358 241835 160369 96714 521418 -20385 -18737 69240 -157313
21887 314553 159621 -64616 -94565 -179569 203559 195977 125132 -20775 -179440 -79545 -174738
21876 -174738 124756 -31348 144270 -200857 250080 93010 18709 -241454 142117 15869
21865 -121807 -146288 687 -48844 -301465 -77094 -307525 -30140 -34698 -49579 -167267 99560
21853 242543 77424 -196656 -94224 -331476 24384 50630 -102508 90851 -107324 -245177
21843 -245177 103545 -98128 167302 -145735 -60480 111199 144594 -273811 293347 -210378
21832 -239391 -104264 138199 -46521 -271150 -115675 -125249 -162852 -34710 -33141 -309988 -58738
21820 -150112 -123873 84366 -140748 -9230 146411 -13046 -111913 52233 41858 85718 197596
21809 197596 337877 102028 217235 55181 -182629 -72031 189816 66444 272956 139619
21799 139619 -56209 -46097 68323 -49055 12292 93331 -122095 75800 248449 -91382 -45669
21787 -65080 176551 -39027 37713 107912 144576 -63234 48864 137166 -25322 -85036 -158693
21776 -158693 98499 -240713 -237211 162802 -234749 -12416 178540 -161941 275099 -43777
21765 220994 -182366 -20318 170806 -118126 175271 -244462 -291801 283079 -101378 -197075
21755 -197075 -305018 169681 -101454 97197 -324342 -392342 -250313 18163 -122686 33627
21744 93932 -140897 -427556 78132 177480 -78633 -190378 118956 8159 325191 -217149 -229265
21733 -229265 -143420 109785 -140252 -56743 -151760 255714 -139323 127554 37007 -55486
21722 -271101 3898 201787 -87334 -160113 -102942 -157455 -159200 -187077 162655 227424 -394791
21710 -81087 58015 -242562 -22875 -56991 121947 278088 -152976 -70198 141304 -36101 -231480
21699 -231480 -218559 197936 -118537 46180 -174420 -230187 69821 13959 180881 -22506 -77289
21688 -77289 -226457 82597 -105315 -25976 -130577 110084 -105904 13507 -339509 -319137
21678 -319137 -157868 15250 214985 87231 -386168 -64189 229353 74847 -105226 -45914
21667 -162117 -129514 -77912 -101127 163293 -59753 -491927 33444 210289 -142979 -220586 -2057
21655 -499221 -94867 -86646 -36241 -94534 187303 107189 229126 126642 -257193 -377406 -126286
21643 16796 -29579 141130 -22398 103831 -91495 -203203 -172189 -139670 264899 -228587 245019
21631 -17669 -307984 -186969 240264 -572237 -37545 115945 -107784 298288 85259 247516
21621 247516 46962 19011 -165916 51038 231741 -183554 -25297 199594 -72225 -70661 284432
21609 -349643 -106398 -125392 -214056 182126 -338137 -201423 -115815 -177104 -70198 76532 302597
21598 302597 -108892 -66264 46934 211465 187097 42859 -372516 79975 37627 -159660 269675
21586 -113995 70150 -84230 54358 -177151 -33332 122283 16660 70745 16985 -155575 -207618
21575 -207618 288382 15393 -150695 108768 -33299 -311432 -93985 -144059 -108694 -165382 -348716
21564 -348716 -114407 -52246 -65121 -132150 -241734 -138258 212590 -111045 150679 141219
21554 141219 109920 137278 3877 -127290 107047 -75466 130623 -232994 -104554 -150714 -284224
21543 -284224 168632 -71332 -67588 78411 -46809 -126187 249866 -309340 308917 82797 -57696
21531 -164445 -799 -193544 -99130 155795 12719 -18357 115089 320188 -129568 55265 -22142
21519 -76128 -378152 -133412 -243423 -118478 -300914 261998 97801 -132318 -244028 10459
21508 176088 4198 -261892 118894 -275535 129877 -169835 312533 154307 -185001 215952
21497 49011 -114797 128939 -292703 82000 -115330 -14496 -54138 139316 -65580 108257
21486 97675 378951 -283675 -239530 -170226 151752 -69371 -364817 -121096 271396 -114568
21475 -55436 269498 -196078 227533 -312607 -138595 -320533 272595 12173 164858 -51140
21464 23848 -177206 -288874 168111 70100 -145837 233037 -361069 -102804 -28888 82171
21453 -15875 -267513 -166467 -203267 -226261 -340981 275490 -94637 -142684 142193 71258 -29845
21441 959 82951 -344692 299667 100657 316449 568042 115847 527829 240131 233550 -77547
21429 207486 -82724 164668 -147446 152530 12992 -140926 285973 232919 64136 -150641
21418 64205 67973 31559 -423730 -437283 -260404 -81108 -227151 -92618 274444 -35149 187863
21406 -368958 -30659 -242389 -138361 69151 -87127 -102116 54911 72402 -11056 -47245 160207
21394 18822 47644 -197295 -200223 -122552 -293255 136429 69990 -268592 -262118 -140003 -61576
21382 262071 -86305 -243593 50284 -194875 -143947 153859 19561 110963 -145668 -115774 -120247
21371 -120247 -321266 -244382 -30719 -102513 -180887 -55432 -4262 -33841 -262803 -180218 13345
21359 225804 194577 -384698 -17802 83656 191522 -4120 -96857 -84744 -99349 -54516 -59219
21348 -59219 -212869 -133718 228355 152980 78958 197157 -78673 -280404 -190028 219378 -97320
21336 -84340 -149585 88869 20671 -236509 -250558 -125804 57740 -180843 -219332 161022 176519
21325 176519 161101 12870 110955 -274619 44965 -136224 -32602 -437051 -166495 -209316 1664
21313 25487 -810474 9834 -279233 -418310 -2957 66010 -48282 80771 123168 -101058 112556
21301 -277955 -91720 -234995 -45336 -195264 -55134 142192 -1262 -356608 14292 -351487 -227073
21290 -227073 168503 8800 -131681 -226713 -147164 21403 91265 -5740 -42600 165506 60148
21278 -340643 -188279 -39673 -226163 7660 -157049 -160469 134090 -2649 -153603 65647 128064
21267 128064 326788 -125009 25308 -88618 -362705 172164 -269600 173916 -93352 -15144
21256 -75562 -69570 37903 -48473 129503 -218533 66029 214312 177130 76945 -258503 -10075
21244 151094 -257566 -172893 -64947 18702 119684 -154246 -122279 -106256 -457791 138440
21233 -367310 -132740 -205082 35117 -132901 -23138 83924 -211809 121830 40741 10534 108598
21222 108598 -44574 296849 6105 -225925 -138952 88971 123841 -330263 -66944 -407242 -49920
21210 68801 -5317 -364887 -168401 174246 -55381 232555 -85488 42049 -91977 -261771 101880
21198 196088 8460 -112399 148378 202470 310909 336507 33464 106834 33233 124706 309496
21187 309496 -286602 -138325 -242568 34409 167686 -201231 -79621 26913 -117577 -292844
21177 -292844 -241047 137078 184866 -187773 -151928 89810 204103 -179819 -19122 167729
21166 -191553 -201651 -86061 -82406 197680 24605 -294202 78806 -110820 -319529 -345977 22031
21154 -232054 180014 116865 -151489 17066 -94332 -181638 -9863 397439 -286963 -351064 -103802
21142 262203 -163312 1979 21246 54192 -372605 -406034 -243274 2530 -278204 -103636 -159984
21131 -159984 -173241 -18774 36068 -44053 120825 -155852 -140538 14026 -262340 -189237 -364520
21120 -364520 -58854 31798 18412 -32313 32636 -23609 416364 -119660 176885 -357007 156363
21108 -191049 -344545 57743 16064 -116690 -35874 -95535 397772 77402 18945 -411073 -134692
21096 221194 -4821 199316 -43096 111560 -36740 -72615 88826 -155814 -41574 187815 7299
21084 -12332 76178 112306 234605 -91 -181635 -121269 178197 12741 -123079 255805 -12125
21072 -105320 -170093 -80966 -263894 -162076 -66854 -39296 9253 -333212 -212965 71985 63122
21061 63122 -64463 -41028 32773 75748 -96995 177137 -158221 -320805 310458 -122236 -66979
21050 -66979 -326529 -98850 -252867 -124180 -332793 -153477 294458 -177176 -336023 -82489
21039 -71352 207878 -57044 -307923 189070 60227 9011 33368 90715 -79494 -214249 -29957
21027 -126194 -61203 228188 -63418 -238536 -138408 -152090 178214 131505 -409855 -85457
21016 -110330 -13213 111832 -81558 -288330 -73142 -136440 50033 -4965 -82628 73192 22702
21004 -99759 -77671 -8301 -95540 4399 -135369 47318 -179306 124117 176079 -309369 174508
20992 17381 -482341 -280533 -114721 -89208 -229731 214717 -31721 318583 -317897 -13721
20981 150505 161893 -200508 385329 270829 115012 -25576 -416940 -148559 399429 -119736
20970 -71254 28236 -150656 -31986 -218175 -72842 -184583 -103922 194803 228631 -246030 -8513
20958 -171048 7307 -177200 -370441 94240 -222460 183399 -122831 26509 -122328 581232
20947 -368511 -51189 131534 -63816 82818 -204108 -355331 131217 -213044 -215915 -139406 -105261
20936 -105261 48082 137803 -234516 4253 65276 -250284 13148 -163859 -85500 236365 -179379
20924 -189404 167784 -424074 92682 97669 101139 -284570 -90144 -167026 289407 299487 -130330
20912 61754 -77175 25359 -13102 -156956 75736 154505 -236622 136232 360070 165947 -277823
20900 -557123 155793 -173461 250663 256870 -58905 -80523 -112483 169539 43584 5382 -465285
20888 22257 192207 49387 142336 144419 62327 -249260 -78261 -417548 132349 31806 -296894
20876 -260737 66429 -110578 -69831 -89488 -335056 33192 -79382 -62294 -23686 -105937 20491
20864 -368298 128089 -204644 -186912 -22687 10312 213650 115730 -146987 103209 -175368
20853 362122 -23429 77178 167809 86455 -38953 -103547 43364 187188 -263378 -176654 -98454
20842 -98454 62875 -57935 118192 -340612 -423128 -125211 -66947 46576 -203178 250177 -154151
20830 -58342 -105990 5859 -355629 -160789 -279044 -181202 -17261 -63082 169392 -270125 -468588
20819 -468588 184666 44515 -237723 135433 197410 66344 -240903 -55121 -215132 352931
20808 52039 -251976 273346 -233141 25377 95866 -62746 41268 -65956 -74075 754 -106697
20796 -46536 -74021 -10523 -130163 -294701 169836 14868 89131 -29414 155157 81948 129841
20785 129841 79797 132686 -173620 -92693 -63829 -453052 -31663 -124445 39316 -99862 70530
20773 1036 75546 136387 195564 -6919 -17879 -30370 -255674 -475669 25298 8652 -3479 -90193
20761 -90193 -237306 63843 -142674 27827 113786 109694 -269342 -96816 110752 -384249 -292150
20750 -292150 4730 305159 194537 42178 -103718 56471 -127601 -192464 85626 -103220 -20271
20738 16914 189434 -153359 194382 -73802 -49715 -223987 -71394 -152159 -76515 -119859 -173449
20727 -173449 -282289 -382477 -98882 -497648 -172809 -55621 -177016 303905 -108665 -201404
20717 -201404 -88822 77756 28770 -206322 -342195 -74285 -123351 -165925 308532 79234 134651
20706 134651 138838 -10000 162292 -179635 74670 324665 -215294 -62776 -142231 -246481 158292
20694 -293122 -67997 -204865 87951 -410749 29206 -317606 -266532 -322526 23561 45426 -97779
20682 -150546 -16410 -116025 34673 -150564 -382301 -403527 67317 -8736 -388089 -19556 39375
20670 -103235 -98371 -284022 -243066 99277 33980 69579 -246933 77270 -99401 232084 1355
20658 -58672 -343189 -71151 -2466 -8865 180853 83594 -104850 310630 -119521 -123058 361273
20646 80930 -214051 29933 -38261 -53265 -397666 66380 -231633 -48301 -10959 -26920 197106
20634 6317 -360014 -131786 -90993 -317314 -518733 137239 -167762 -107927 -112558 118166 249196
20623 249196 217118 -30990 616 -367477 -246250 163781 99146 -60726 -136904 -33915 -23617
20612 -23617 97182 -106548 -65951 -200828 -45819 -25425 19428 124710 163446 211987 -255494
20600 -476622 23082 117326 105660 255846 35920 162090 -388656 -97734 -38566 -32085 49123
20588 -15102 30464 211544 179517 324720 329120 -300199 24073 -37332 -187629 191968 132736
20577 132736 120528 -199515 -54009 -104497 -10009 -202858 24259 -81834 -230611 201538 94137
20565 211420 -405527 65533 -55372 98856 24067 158721 157085 -222160 -282605 259510 -143309
20553 201060 -93998 -28404 89572 -250950 29573 150073 -33701 -21813 -115601 95741 -493306
20541 80929 -85138 -247117 -47710 -51517 -341456 -325959 -321064 144717 79888 76846 -111187
20529 -70770 19988 -129317 -200741 -285801 -196332 -69460 44895 -52356 27058 146950 165048
20518 165048 156113 -239977 -157039 -33390 -61000 -465302 -41120 -38689 -146464 -295796 -37928
20506 -72858 282389 -104913 178546 126026 -6329 -238608 -28440 -16827 39291 -242392 -245520
20495 -245520 -199049 215224 -77786 -207172 -100466 -10092 -232714 -208930 -199909 -186209 4652
20483 -327968 -91398 160865 24069 137341 -303142 146882 115553 -115735 -153029 -59192
20472 -443997 149063 124808 207161 -65857 -392626 -44403 317811 137735 313135 400938
20462 400938 -57746 49969 86795 -1745 45224 -141007 204032 -144298 -2205 360061 -25890
20450 100768 -351182 56468 -156927 -204119 230961 -74524 109616 -144205 -106670 -53496
20440 -53496 -32627 -71237 -107191 -31017 -119374 324022 7977 11408 82751 157253 315527 -249358
20427 -274382 -50183 -197220 -302895 -73581 190419 -275502 288991 -44499 44315 -144416
20416 -232291 -304415 63538 -230606 -243214 -73669 -156056 -248619 -124201 -172149 12361 79786
20405 79786 -33095 -379674 154030 -142739 58186 231092 -232308 264171 -86576 83161
20394 -243370 -151110 6433 -71454 -76874 -37580 -134184 -160238 -132610 -229631 175818 80550 141771
20382 141771 75839 29022 -33200 -69531 -85586 -113064 -30891 -92743 -254776 -224944 -183117
20371 -183117 -294599 23153 162015 42400 -57697 -136620 155347 73288 -138296 -211050 -221736
20360 -221736 -133769 -291594 58340 -273511 -169943 336808 -93259 -280118 292828 46106
20349 -50383 -123 205816 -162657 -65774 168537 -12765 -99195 59344 -171938 108071 175400
20338 175400 -184210 -111606 -249361 -56387 -230305 -7447 -215733 -18525 -202572 -348429
20328 -348429 -86169 -59760 -117375 -192382 -173324 33950 85109 47030 -137997 189275 -133960
20316 -42354 -191845 -53360 -119601 -95789 -119904 -187616 125442 -178630 265699 -94972 104768
20304 -164735 -53274 -72252 -76387 33850 91753 161506 83614 150708 -39666 -102493 -65369 78496
20291 -37781 12877 75930 163460 -498338 -251152 234937 556146 -56379 112287 -284432
20280 -91727 -69364 -175175 64427 -113944 96049 -498006 -190999 -50253 -125392 80357 -178752
20268 -17669 -26426 -91935 -221216 121318 233860 -170288 -15633 23930 -140791 -183142 17936
20256 -59122 464192 -113292 -177617 -168755 174295 -158141 -148707 34167 -189057 -14551 27782
20244 -204258 -129902 -90683 77455 -221403 147463 -10311 349710 132324 -60525 -297285
20234 -297285 -134761 -289097 317320 -106720 -146325 67686 -162947 -56777 -445118 -21021
20223 -294116 -167779 -26637 61968 226240 96118 36935 -38902 27633 -72102 -519328 30867
20211 -395047 115207 -71395 -84264 -102379 -46808 -46664 -112334 204362 -209798 22124 -234634
20199 73135 95082 210675 -67604 -158138 -187555 282374 -110944 -213091 -201573 -41537 -239873
20188 -239873 87912 -190648 -17082 -81978 -76548 140917 -61722 193004 87646 153408 176028
20177 176028 -57890 -243969 -182721 -227165 148386 -103328 203484 -79034 78291 131958 49549
20165 -64954 -151668 -209829 178202 193693 218285 -105948 236931 83895 -214396 -98729 12564
20153 -38271 -92342 169614 344958 25241 87223 -313795 -246604 160023 -322660 -96674 -22102
20141 32042 -113024 48855 -33973 297683 229172 -87363 -234562 61014 -61855 68641 -173706
20129 -155125 21769 -105944 187784 69588 -21913 4370 39253 -188022 -175423 85917 -84968
20117 -170237 -100435 179575 246882 35495 -43277 -177638 97290 -400901 115821 219473
20107 219473 -211564 -176151 -24583 32461 -74319 -226677 191645 4556 -106070 183220 -176307
20095 -55010 -180078 97699 -3815 -107392 -294772 57170 -122171 -155598 159788 -358238 -349380
20084 -349380 -53051 -67539 -132095 -79241 430730 -194902 219164 37889 38704 4249 238594
20073 238594 -340844 201180 51123 -391865 92300 -94160 -124812 -91851 327417 84192 191974
20062 191974 -241045 116386 -131292 -27113 154657 22734 -214586 -308359 -131195 229007
20051 185964 -344702 -162104 -179844 -17107 -402536 49659 218048 131082 43791 -377352
20040 -89859 -93388 -3807 -91387 -64424 67658 -278480 -79271 214694 163231 -225283 -339057
20029 -339057 -152222 57932 -33049 -116771 47694 -65022 45048 -364733 -61146 -194121 -32794
20017 -36379 -29913 7718 -143459 307681 -12066 -305774 26670 22588 -81938 -228180 -74584
20005 -155289 -148900 98856 9455 128073 36149 -210058 -55972 51166 -111932 21908 128606
19994 128606 -67606 -43479 227569 252446 -287463 33789 111904 -51128 -114549 -97585 179397
19982 238454 -226761 375366 174914 196109 -53315 178547 117023 -278217 -144109 -161150
19972 -161150 48442 -83036 262746 7103 -395592 -177653 -649 120734 -139326 -263955 -16911
19960 15765 -83309 -373172 -233587 -194707 -154785 160066 97529 -94982 6809 235773 63754
19948 -149499 -131596 106881 93660 26767 524 -240362 218457 -264514 -55959 143973 -73142
19936 72683 -458163 -232683 -309149 -224501 286905 137355 -172430 -120050 -46674 21857 -188856
19924 30555 -135506 45704 17314 48464 -28406 85399 9129 2757 -140487 387363 213253
19913 213253 166538 245029 256744 -23128 -35154 109023 -275343 6214 -85788 -37627 -88663
19902 -88663 -219203 -227113 -55586 5206 101376 32247 -86904 -251353 -50785 -425597 138723
19890 -119448 -247145 -44942 -358980 -60582 263482 107634 170754 -204908 12452 -133690
19879 -151290 19321 23328 -211869 -601235 -201634 49266 -78371 -209617 -192797 -108968 81070
19867 -158782 57908 -355864 7944 -92680 -135493 -38041 -26125 -109463 -89295 -94113 5444 261431
19855 261431 -215646 22699 -160954 -212249 342996 196247 90564 184916 111516 -7680 -262365
19844 -262365 48485 -141062 71404 -109069 -125192 94920 -50784 -360144 -397249 -212586 -986
19832 135570 -244321 -65734 -217469 9006 116547 -177154 -331873 -267373 -151591 -96307
19822 -96307 -74214 -219603 140716 -55650 -52070 -20657 70991 -213999 173754 133942 -1568
19810 -196943 -25463 259203 -202428 305415 -59781 95590 -204231 -208670 -59892 147380 181520
19799 181520 -201111 69225 -248516 -342083 11477 11323 -162035 118778 -58041 57349 -202252
19787 -264823 -254904 318735 41589 -94331 -49111 -287751 -74436 -174399 95783 -314830 -398111
19776 -398111 -136351 -143328 -165623 -120936 -96625 -278363 -12420 54958 213429 -206109 -154149
19765 -154149 -341851 -149220 -140366 -61265 16837 -197933 344956 -29583 -174547 -76255 -92462
19754 -92462 -360184 -45841 6964 -152914 36398 -363649 -303336 -87328 178087 -199406 -211804
19743 -211804 -239838 90769 -231459 -5140 27641 166411 -115157 53871 530043 227266 -308612
19731 -173283 -63054 -3301 -144614 -190311 91181 -254518 -32436 -342177 74302 -105306 25067
19719 -34667 183837 74450 137813 -185333 -182044 -163798 140802 -196224 76937 177017 -70636
19707 -257844 -28609 119166 -275104 19101 -5552 -194967 -227718 -178869 -78485 -133118 195651
19695 194675 -149183 -137220 -254878 281609 182849 -26112 -113522 -421729 -53830 59869 -223462
19683 25079 258020 -73331 -75174 114602 23631 -124597 -249472 86778 -114615 -63549 -267856
19672 -267856 22137 -60465 9881 -48757 -386153 -68812 174788 384060 -38756 -66822 -89321
19661 -89321 82811 157955 -58078 -163059 -49913 151909 225034 -190470 -106044 -102551 327166
19649 -29019 -42729 136496 9804 -62636 -74701 -51264 -209238 -142863 -98075 86133 110424
19638 110424 61352 -14162 19685 -27256 4382 -142545 -303095 -358334 20066 165448 94909
19627 94909 133021 -56496 -198680 -69835 -102628 -70809 163584 -260725 110993 18727 -9650
19615 -37664 -75417 -33866 -242746 -122822 -219249 -1325 -246235 21435 287787 -119173 141950
19603 -349252 21313 -77877 -217874 -105598 134374 -47761 -232166 -136962 -288027 -94576
19592 176261 -235044 -357071 -60232 -51382 -179091 -267136 -268490 -21071 52826 175904 -57374
19580 -19631 -419709 -29576 -13714 240423 189445 -249121 7565 -242144 81192 31900 -422411
19568 -116561 -24433 132067 -75037 84410 -207470 13398 -230518 -273404 -73125 19911 84354
19557 84354 83165 -97441 -176035 372316 170421 -313185 -116334 -62218 -181873 -116881 23246
19545 -35878 99700 -148002 -449984 64021 13945 46057 1759 -83997 69695 -51702 174960
19533 -83827 -194289 -288144 -125927 -123285 26810 -126842 79722 -219512 -182770 -179317 -49074
19521 -82648 -223146 -90366 -306115 20937 -196580 157946 -33290 -397807 151743 94952
19511 94952 -293187 -290608 -150983 -106930 9531 -130452 130517 159550 28696 -116811 -396295
19500 -396295 -44383 -155255 -281548 -82672 375681 -285397 -249621 -66888 119215 42662
19489 -8412 -451079 87175 -302569 -169252 -292843 -109193 152891 -22076 -272850 199163
19478 -76425 -320380 190351 -186590 -8384 -7876 101175 -443660 -98507 58689 -163948 122891
19466 325756 46538 360699 -43303 214819 -32001 -238821 -86042 45179 -85534 237504 -146419
19454 -14410 -161116 -156778 91873 -147158 -127001 83974 -235444 -55625 277311 -384918 167508
19442 -257084 -296596 -35147 93368 104940 408976 6508 -38770 -131513 -103180 -117331 36177
19430 88784 140612 -81988 -192788 261224 -350867 -5375 280627 -79317 30009 234797 88590
19418 -43391 -33303 211752 -65128 -297170 -123074 45899 -134075 -166187 62132 -97321 -108342
19407 -108342 -206091 43326 -41700 -195998 29026 46418 210794 172793 89600 183552 164304
19396 164304 -199425 203335 -38459 -97807 -237727 218072 -510389 -234047 -94820 -225444
19386 -225444 -155436 -75763 -160238 -152540 -172371 -209942 -289232 74629 -363659 -320695 -467702
19375 -467702 100065 125707 12675 -36289 -346903 -130831 -258725 299902 -252738 -297840
19365 -297840 -130833 -72045 -107199 -166509 -382891 -77510 135237 103519 -217185 -353635
19355 -353635 -210930 100396 -346499 -478993 -134238 223596 -117867 -62263 -71457 -25741
19344 -61777 26186 -40790 151719 -278865 -36538 37160 -46327 153783 -223497 230420 135230
19333 135230 -214816 55707 -437744 75003 -90750 -107629 -245456 -456447 -239929 -6021 359813
19321 -105114 -198262 95956 -82194 -63932 -109950 112172 -21618 -233090 -179907 -469299 -75141
19309 -71098 -297934 -72928 -35855 227555 407403 30158 -186237 109257 81577 112089 -96059
19297 -128374 -305630 -159497 -146032 -51463 305898 -353669 -71273 -12501 130529 75925
19287 75925 -188114 156221 -91604 -76923 101901 -67547 158471 56700 -117786 -129276 277546
19275 -256564 -56319 -132973 -198311 -410396 212529 194529 -84580 -59396 -50312 -244006 -362926
19264 -362926 58488 66966 -88022 -225812 -292655 19674 -220928 -151406 -320535 97734 -14100
19252 -27748 -62206 -535816 -140211 -137044 -129239 14019 -72295 -290402 -95922 184774 30032
19240 251356 -94301 -144002 166515 -122647 -73821 -59090 -72729 -20081 123699 -142980 -216209
19229 -216209 -128814 -281581 -287384 -99970 2321 95477 -241772 -53131 -65979 -355667 -72400
19217 -43104 -354430 258388 245283 -313677 -249666 16677 143853 53639 -203939 -65250 -226159
19206 -226159 -237125 -105765 123241 -18493 134565 76371 -146826 -45701 1781 131533 -23260
19194 151008 67493 168894 -108824 282056 145409 -128462 -130387 355677 171537 -114109
19183 -85812 278883 -112165 -1482 230225 -201343 -93208 -188324 -56588 -129813 -11815 239449
19171 42547 70735 -83383 82160 -92498 -57310 -240888 -229516 -192153 -30299 -165847 170 -99722
19158 101757 14303 -221973 35231 -141431 -147313 84100 -115919 192216 96327 -94964 -276602
19147 -276602 -93325 -192393 153274 -8373 -66276 -429517 -472386 227508 -254295 -171272 -195815
19136 -195815 -161370 4891 -162722 -89604 -253512 90469 -246849 -54636 -149285 -15384 -152514
19125 -152514 -226461 40854 -84146 37421 -10907 -256065 -104453 -47033 -18403 29846 83764
19114 83764 -255654 -112067 -126010 -35472 139685 219387 -131368 -124805 96164 -155119 143508
19102 -72503 32902 -484763 -139023 167556 -105489 -92436 -100770 182183 -257682 -314179 -221778
19091 -221778 -261806 -88582 285620 -60964 -25396 -266779 140866 -106611 -164735 -188861 162969
19079 -50852 -64449 -409650 -360388 117140 1141 -178444 -257298 -130294 170654 39207 -31964
19067 207699 60898 -193294 -222564 -75140 224768 -183075 -239316 107903 184693 -70505 -258931
19056 -258931 -312660 9897 27721 115536 226127 -127545 64598 -101862 -215335 52290 31752
19045 31752 211913 29408 -3772 158548 -118173 45284 -93012 -366434 -432122 -133231 -125878
19034 -125878 -183091 -328875 25991 -236216 141970 -245212 -80967 14343 101040 383403
19024 383403 167792 219701 81402 150512 -7372 91909 -128506 160874 166706 318853 -222119
19012 -5233 165939 53967 105488 -34787 -16968 -376138 -128054 -32366 -195768 -102811 -92925
19001 -92925 -231042 7308 -126270 -217799 -266716 66011 62646 -424022 68389 117670 -307180
18989 133287 -176022 76851 149605 144478 64214 -40422 249208 -102566 -325714 -132490 -93069
18978 -93069 -189109 -321535 -147828 129384 74389 -159776 -377868 -26497 -112283 224369
18967 -165528 129282 107626 -193280 33372 -245424 94112 -100093 -76655 309837 7762 169287
18956 169287 66307 -145470 3056 -164938 -15889 -36181 -234045 217536 -30980 -140497 -178653
18945 -178653 -145857 142514 -98592 42195 58263 -39907 191250 -302078 -345021 -65048 -175222
18934 -175222 -56989 121163 -237612 192949 -104247 -338462 91108 52092 226521 166022
18924 166022 -114649 -181884 1795 -115269 -59294 -26755 -58582 94353 -251339 -40681 16947
18912 -161868 -93457 -44499 -15209 -100024 367649 323563 -123620 188436 -216749 -267868 -64318
18900 -109219 -114600 55571 45557 100045 -94380 -71339 63238 19400 88628 104174 216760
18889 216760 -85224 36401 -335985 8338 -455653 226232 -280775 -42219 -35580 -172106 45283
18877 -166890 151255 264566 -107924 -129619 121689 20500 -88618 -268784 -93231 85832
18866 133825 -368793 -160917 -350930 24111 -232524 -300580 426116 -124184 36827 -356445
18855 -92233 104923 96641 -281836 189619 -164956 -215793 22210 -163094 -231861 128730 -216024
18843 174078 58121 165754 59492 5554 -35786 300159 -179896 132460 -100580 -285022
18833 -285022 288324 -135363 -79515 -223437 -247291 -177908 212416 -162673 211188 1476
18822 -187651 -54160 119409 240496 92555 -21059 -97587 -88113 -213278 -307950 -55749 -321592
18811 -321592 45655 -23325 31350 267676 -159207 -48908 241801 133629 -29737 -244453
18801 -244453 5086 115721 -19835 118583 -404043 -157017 -48241 -226947 127046 -139539
18790 -41090 -308002 -77400 203213 267709 225009 17432 -118167 61792 82232 95398 -270459
18778 -285421 -2222 -175807 -14284 38607 42297 -130349 122694 -132803 -207802 -155105 -167175
18767 -167175 317467 -181376 -48520 -59194 -170408 -309900 -6527 -32706 28507 -172313 127950
18755 -186686 27083 -225770 296312 -581085 -102856 -82036 -113264 49109 343216 68219
18744 109194 17246 -51260 184644 -12213 205178 54556 14523 -246379 -66647 135034 -129276
18732 385055 -120447 -120959 68663 -25256 -67534 210360 79805 -377722 -46480 -38901 -1696 32475
18719 54893 83390 -27360 -209421 69125 -2561 -567087 -290522 21905 -361469 -151029 235120
18707 111936 -54660 19670 -53765 36045 -290106 -347009 132472 -206521 -205167 -298736 -231559
18696 -231559 -6995 70478 -21055 -240615 -117507 14176 108167 124770 -362237 -48836 -91644
18685 -91644 42480 -289421 48820 -241144 -93380 -261465 -436833 -459955 221987 -123777
18674 -183397 -138364 216659 74500 -37443 -112440 11960 9030 -496112 -369748 -214017 -27341
18662 27210 -385048 -51941 213600 -42560 243647 -123546 -174881 -355899 83467 -343195
18651 -43121 -130993 -176753 -1035 -26394 47657 -174295 -222906 34984 112898 131081 71142 -299703
18638 -347532 -275112 -255825 16298 1577 -53552 85266 -275890 161026 63809 -4088 -238760
18627 -238760 -138878 -300037 79229 -67115 -232453 -85536 -192093 -367507 10896 -63264 -59834
18616 -59834 -105242 -158673 62997 -21153 -131007 91193 -19998 -181041 -107410 126953 197555
18605 197555 126558 -73863 -82703 -149203 280050 -312178 -62167 -24216 -237843 -88899 172255
18593 -118453 82158 -37889 133895 -279954 -68001 -139988 -39705 -334879 143759 51888 91251
18582 91251 218639 69840 -33560 -125137 -14906 -126093 -409152 -33637 -164423 -102618 181686
18570 -217207 -410304 164424 -92284 -26081 133960 -132996 247334 -197417 -176199 -152872
18560 -152872 -55953 78186 -230969 -282710 -114511 30253 238065 -172939 -219137 262398
18549 88833 -216777 46411 14584 -193824 -195352 -292810 225986 -153008 29680 -170874 -33059
18537 192756 -275709 156316 -394261 -279914 -232382 -289762 52096 363178 -22662 62866
18526 12434 14452 -118021 -449067 355354 -166844 70632 182653 277487 265050 -68536 -123104
18515 -123104 92176 107005 -62238 44311 73331 -12059 -88530 66384 -10196 -152446 -59233
18503 -100419 -67060 142757 -252109 13540 -276672 -84579 -8022 67119 -235234 -15466 -80904
18492 -80904 40232 -58231 227962 -187486 -165852 46894 -243718 -18682 86836 -87452 25590
18480 -404495 -227398 -228020 510536 -357911 -286839 -54278 292064 -224979 -62746 -235128 -193391
18469 -193391 42252 50637 -130587 168710 -112635 89845 -51558 109756 -169492 -245977 -9056
18457 -143285 -305073 -59854 158517 134876 143452 -230555 43393 424124 40030 3733 -85868
18445 248768 -156418 111211 -154332 -277481 32760 -188202 -229974 262187 28743 306574
18435 306574 249117 -326778 -136726 -355516 -43812 -19869 246519 -24397 -70307 76491 85967
18424 85967 40904 -117947 -185689 -156207 -143270 -31497 215515 -24578 -96765 12153 -344352
18412 -157385 -254610 -98459 218120 -193833 16292 -19571 -184656 -185704 115775 -6670 -220167
18401 -220167 188095 5753 59776 -362421 -36453 -36179 133561 74078 139300 -24398 -169628
18390 -169628 -95898 -229800 -14871 -35476 -272951 93043 -3608 -493049 -371071 -46960 -137904
18379 -137904 -21536 59525 -143491 -92694 221928 -167025 -30164 115865 -207868 113718
18368 239830 -155137 -24445 -173986 -46420 -134979 201004 -128313 921 145561 -171586 346210
18356 390300 -146100 -204330 126506 173041 139000 -97788 113347 -354408 -209398 -162680
18346 -162680 -73964 -167051 -271129 -39922 -89426 173035 179926 -193484 229 -21935 -12947 -111642
18334 -111642 105200 290691 31804 -65636 42608 25240 -45719 7990 82104 139606 -102346
18322 -307375 -90078 -82337 -119476 -224060 -26086 -66346 -58301 -376825 95701 -48845 -241608
18311 -241608 40818 -425733 -455 123579 -200997 236221 54648 -77360 -85879 27641 185035
18300 185035 26798 -360685 -180666 -58578 113613 126460 126787 105267 61652 -53641 -112521
18289 -112521 -10944 -64846 -40205 -86890 147220 204323 -47427 -251351 72940 -143993 -281497
18278 -281497 165569 -40858 -217651 -15229 -142336 -28985 -69926 -201904 -210915 181810 -242591
18266 -7032 34993 -174225 -103309 -286526 -349676 24204 -485027 351224 -85641 -2186 24152
18254 -39683 254470 168613 -10361 -275665 27815 12675 63062 -260493 42134 186158 -171153
18242 -2010 191143 -156357 -269613 -255706 -166422 264299 -96373 14352 92245 -30950 -89187
18231 -89187 -97277 14774 -35173 83892 180076 65687 -183774 -181284 -47750 -172643 -112936 -236365
18219 -236365 -113494 -301079 -332334 -115339 46999 76302 -21029 294407 -244784 -179046
18209 -179046 -225671 231973 234969 233346 -64009 -323336 -37846 -99073 -103237 -37070 -178091
18198 -178091 27400 192519 -300462 -285243 -17285 103489 29552 141603 92069 -130663
18187 -2974 -255285 54698 -164411 -219445 189467 -209181 -183429 -156568 112216 55226 -208756
18175 -124726 150515 297065 183039 282592 30545 -271843 -236167 83960 -147287 -222902
18165 -222902 55517 -126843 62454 -50255 123106 301718 140374 -82574 -217188 -184632
18155 -184632 -62403 -108384 -308312 47534 6413 -9182 59308 569117 322265 -136124 -77735
18144 -77735 -37621 128337 137547 -193630 -334727 -297404 -188865 -102755 -44731 -38791 -284608
18133 -284608 -14183 -128207 -63994 -145814 -411734 -162928 10252 -140660 57732 -360943
18122 -103910 -45867 249236 99198 -102905 281269 65007 -2562 85322 -59867 39973 -88387
18110 -154463 -108348 116596 -123400 79331 146949 -21073 -152177 -97036 -117568 -27033 19280
18098 96492 237545 31295 208516 -135160 -227378 -77742 59205 -396070 -578629 -69529 152610
18086 187136 -167504 2461 -45733 -401607 149581 -199172 61221 -24231 193207 91367 -155910
18074 -154147 141376 -159091 -61832 60975 -26695 55260 -16730 -456698 -82153 348640 216769
18063 216769 -212371 -26654 194422 295096 296276 -279114 -130533 -193580 -29232 -402023
18053 -402023 353768 24283 149609 -124168 -288662 -273222 107103 -162725 7432 -151966
18042 147112 -253638 -215996 224064 90748 -31283 1849 186587 254962 -54258 39921 -87893
18030 -17478 -81202 -302935 -121801 -103663 217756 -95775 39387 -255715 -23601 15526 -164203
18018 -105286 -182193 -147986 69081 -244677 25226 4315 52240 -146336 -284964 -68315 -94610
18007 -94610 111841 6157 -148300 159490 93230 -270743 -74925 -124806 -33314 685319 -7961
17995 -89847 -336788 179121 -195457 -317256 -121180 78486 171939 17934 49683 263728
17985 263728 100215 69430 -149563 -148186 -120885 192118 -102374 -147755 -97385 245025 -183077
17973 98196 24145 -201087 50363 47129 -223479 -165772 -304935 57521 -88646 -25973 -85427
17962 -85427 -199212 -193935 -60796 -117522 65654 -60076 -357524 130476 -242057 -102774 73651
17950 150423 -92774 120869 -49660 -95988 173943 -99870 -422203 222418 -239513 -225250
17940 -225250 -305378 136058 176183 117097 -65185 303690 55529 -157532 -164591 133324 -90811
17928 18459 91866 124780 230700 218201 -97192 130748 -66735 40734 142309 36359 112927
17917 112927 -173607 261446 176530 -108786 -14796 -148530 86165 77950 -97026 -129685 171871
17905 -131940 12833 -31893 -190383 250810 -112348 38643 93972 40963 -90937 -334924 -138492
17893 55662 107839 45101 -217273 -5064 -244721 39259 97686 -7108 367829 -94430 156558
17881 -331081 -108853 41752 -1990 268189 102044 218201 32458 -67906 199673 81833 117490
17870 117490 168902 263856 100704 243456 -67703 176843 255423 58516 264677 34407 96698
17859 96698 1157 -137206 78710 -100787 -347486 269178 73968 -223873 -139335 -131668 34744
17847 -155027 -278491 164221 -146972 -303774 -47248 -203206 169280 -385706 -260629 -91373
17836 -171765 -77013 -328716 -175728 9957 23444 44577 73692 64356 -179676 281854 -44451
17824 -278825 -139867 -155962 -62846 282466 -159029 -10385 -300269 -59773 337702 -78461
17813 -171223 -248552 -297494 144469 110977 -256304 81746 -291600 100936 -253113 96114
17802 -76303 -8898 10091 16553 -31381 89287 37774 216209 -69602 -81015 -56136 -218112 74055
17789 118480 43663 73020 -232105 -227284 105606 -132699 29938 303627 -107259 69506 37867
17778 37867 140510 233752 -31196 -65962 274556 146495 175939 66073 137606 232071 -252014
17766 67469 -170787 131964 -25951 57235 -95 224545 -202849 139855 -54107 45513 297554
17755 297554 204135 225140 -357808 40481 70323 -302546 5139 -88126 253768 -103486 -235312
17744 -235312 114126 195742 -95690 -301892 -57975 -151376 19323 -142024 65941 -232761 -270379
17733 -270379 38003 84845 197414 -203032 183357 42369 -349815 317 -87497 -147324 59147
17721 -145800 -303769 207812 -73834 -46236 118958 -157839 -69884 -53802 5007 27463 168236
17710 168236 20675 -160808 -267303 349400 80883 -3570 297689 170542 -112807 -139054
17700 -139054 -10913 -185244 206020 -42587 45731 16084 199535 91666 -232586 69713 297011
17689 297011 23946 60211 -4234 191736 -156167 -192680 -212394 6101 -166258 -139641 -41801
17677 -1496 -83161 -29100 210879 258788 -58237 -133659 314168 219628 108696 -50772 238289
17665 157729 -174922 -413593 116165 -250795 141027 -30189 3252 -86944 -134027 8121 -207348
17653 -65487 -178719 -83167 -25318 32777 -278298 198433 -76994 6077 -183122 180072 222131
17642 222131 -141868 231335 96032 -102510 -99402 -40273 -273806 -74843 320353 30151 92004
17631 92004 7022 108192 112151 -78183 34738 -30205 -279863 -85588 -81825 -138995 -126322 -29925
17618 14923 77013 248006 202891 -51090 -8579 65552 170263 -4836 -153374 -166003 572301
17606 16982 -251760 -52150 333519 330632 118323 30403 -19337 12819 14215 -300703 22129
17594 -158523 78343 287843 106945 382306 46468 -57127 315424 140363 321577 125584
17583 -228678 124206 115167 18871 -25285 223521 103475 370977 -34620 148941 14688 12764
17572 12764 -452341 -180217 -199720 -34462 125177 2766 -76472 181061 -33210 -47769 -272630
17561 -272630 31489 18969 -241038 -2217 -78151 -58716 -129334 137965 253403 74786 33591
17549 98497 385145 -251302 192114 244681 247345 57602 98338 310782 -17916 -318681 26469
17537 371216 139513 -69233 77005 76164 144419 183490 205187 341394 459845 88912 -56982
17525 565009 319919 -212148 -120378 -117765 -205190 114887 60104 244006 183853 -107337 93152
17513 -24986 101832 143397 109976 -178845 -62797 140477 189588 221215 -8853 113648 49835
17501 101273 -88345 136746 -126607 70657 320178 134234 254736 153632 236811 187029
17491 187029 83802 -65769 191173 44045 -91710 -173809 219555 261291 26161 138456 104076
17480 104076 190070 360595 295999 282664 67944 18151 34574 208132 62466 -344738 -31347
17468 167202 437925 139272 -73872 271979 -23306 201031 -24408 -134258 -195062 241093
17457 3304 -54862 327059 62622 547406 299192 125915 252746 270324 227552 149481 297770
17446 297770 510819 554751 304237 338397 243603 165738 39118 48621 218133 301897 66236
17434 90303 -45038 159378 328974 423372 -55979 -19380 189540 455244 -101820 253460
17423 148048 180331 346875 451152 241071 75736 320710 -8741 54984 514574 188497
17412 351716 432917 397664 248212 245310 387479 138420 -6610 -25725 -170060 118507 237454
17401 237454 -50381 430417 -229381 113663 35861 186706 316748 -1065 337783 47322
17390 286547 645178 158881 76263 202248 412708 41954 191097 119186 139952 94505
17380 94505 139730 387184 195917 403636 125089 81270 300888 146618 336254 178365
17370 178365 -57902 -189030 410648 168390 52734 220126 187786 69969 283986 204653
17360 204653 185677 51409 353060 109252 -61696 -32751 341593 466235 -280161 86500
17349 246520 36858 428883 354057 26230 -29838 132610 223082 -30821 66124 69191 -221642
17337 -20984 -41748 -135212 -52146 -294734 52299 -120128 183385 -124962 -23787 1752 214603
17326 214603 305934 139019 529275 242263 426475 -67793 196862 -129648 209709 131863
17316 131863 11463 219065 27237 148655 262858 16120 208440 171470 139284 224754 139819
17305 139819 -49244 276931 2172 -65236 -282514 147135 193002 34064 48192 100574 328539
17294 328539 146301 27197 174370 51168 387131 97076 -72272 44536 126375 -41068 83470
17282 268594 119611 142218 481554 335286 -100494 43664 113735 408955 191521 -32669
17271 14660 124454 183590 51703 272261 163834 86324 85182 188643 145922 -40272 -8591
17259 81756 68228 78010 -43853 398374 217439 106927 69210 60730 378660 257515 121830
17247 -131553 148262 -73331 303547 274555 157831 177015 162485 41474 503938 134988
17236 513089 284411 196817 100349 364891 -270201 28227 455443 -112634 -116878 121042
17225 263678 200651 171900 306829 -126248 434639 500725 128172 569468 254087 64091
17214 41186 132164 136553 120198 406705 17763 224842 364858 271657 139344 67715 127026
17203 127026 313404 263431 -105453 173100 40533 525160 210941 160696 363761 263363
17193 263363 337841 56393 129589 340557 361666 300224 147370 79432 300876 427307 274607
17182 274607 524090 -115144 332712 121188 194378 55646 -24979 416153 411872 344 198447
17171 198447 207571 146917 205627 564967 419369 204528 593768 86055 317570 99941 354891
17160 354891 536003 390512 144522 426315 149501 186109 116988 549944 570912 522406
17150 522406 174762 158696 90822 280876 208677 552870 553576 507462 524271 109802 360780
17139 360780 238973 497255 260392 259436 94510 194981 291867 65054 -16276 212044 180072
17128 180072 380059 207008 364858 527875 491656 184283 348713 -18219 229640 422499
17118 422499 202830 361676 394110 208388 239784 347779 427794 223315 449525 362056
17108 362056 415617 140725 134096 417471 325454 244068 703740 294756 133845 377984
17098 377984 641646 38202 295311 388183 236344 390870 189843 258036 523551 127058
17087 489372 846962 215354 373897 214268 562105 395608 321331 392888 165230 471367
17077 471367 88071 210859 521019 365788 377189 450237 526720 308755 590211 499809
17067 499809 334411 406968 393047 425525 402916 441665 734097 184132 325876 516727
17057 516727 723759 479840 435176 523377 303424 688345 220697 368772 282440 449691
17047 449691 497174 635892 257345 379734 698096 431947 486777 370969 376792 712810
17037 712810 848447 543378 736497 484158 626088 727202 501655 512256 317385 546017
17027 546017 918305 764091 461724 702155 487102 459673 365918 757846 624658 1030087
17017 1030087 418667 676661 755382 990203 608488 723028 1010017 961723 405271 662652
17007 662652 768968 506058 666967 449309 500238 520272 646759 543169 561389 902925
16997 902925 431031 494405 356761 564381 802794 407263 813962 743884 616665 629438
16987 629438 522873 469804 689344 524505 853356 763318 942144 805764 754315 987515
16977 987515 1073624 754230 707789 1008912 1137737 743490 762315 859649 565824 909600
16967 909600 697234 747175 1225373 864494 1028848 538558 842003 1072863 951028 800335
16957 800335 1037368 1055396 883030 812848 1163418 1222867 1082120 721845 1045884 1017701
16947 1017701 858970 994983 842627 957450 1062793 842285 1070978 1172464 846186
16938 846186 975562 1101962 1024660 1413295 1071277 1273542 1213290 1037839 957674 1062538
16928 1062538 1313381 1226809 1195424 1259576 1127463 988295 1404401 1341980 1659261 1329396
16918 1329396 965790 1641917 1447789 1392818 1311199 1255571 1447051 1668985 1241502 1751644
16908 1751644 856892 1133704 1207046 1239258 1729220 1472499 1677460 1547421 1231677 1550268
16898 1550268 1557084 1789670 1635327 1357831 1887437 1812808 1770447 1986229 1662122 1670156
16888 1670156 2009542 1621444 1544468 1919564 1939231 1949962 1949636 1960722 1599956 2074617 1913568
16877 1913568 1991777 2351689 2064171 2167837 2100449 2098025 2242652 2365905 2449159 2598114
16867 2598114 2224439 2248992 2553930 2130262 2514099 2383732 2402387 2701169 2634025 2284020
16857 2284020 2426388 2570706 2997851 2650299 2643404 2657166 3138885 2584256 3028589 2834239
16847 2834239 3122937 3403420 3057107 3155726 3126587 3259070 3330164 3712737 3323674 3351056
16837 3351056 3524130 3801992 3882517 3497028 3684742 3685342 3661380 3635144 3966514 4298466
16827 4298466 3830571 4265581 4297474 4217879 4536971 4403437 4692878 4438986 4883682 4439681
16817 4439681 4968528 5091789 5346971 5492677 5230771 5149912 5590210 5431692 6007677 6067589
16807 6067589 6116745 6185411 6564753 6897026 6731869 6899960 6829983 7025535 7334000 7471592
16797 7471592 7362479 7935442 7984721 8060773 8312518 8461821 8704438 8774201 9500498 9710190
16787 9710190 9514862 9820435 10118084 10502424 10937825 11109169 11541976 11562894 12099079 12388226
16777 12388226 12791689 13302126 13776739 14109158 14219204 14583823 15120533 15898668 16231988
16768 16231988 16973537 17824701 18098618 18650865 19467532 20258670 20898885 21603617 22707599
16759 22707599 23967657 24597223 25754758 26854387 27596781 28948872 30504066 32057599
16751 32057599 33412451 35267742 36788702 38415099 40995260 42740427 44969154 47508469
16743 47508469 50039161 53447428 56011116 59460065 62649991 66624230 70600658 75127316
16735 75127316 79814904 84767337 89722896 96003933 102128587 108681878 115312746 122433405
16727 122433405 129715118 137519304 145097836 152952913 160264301 167415260 174065592 179962919
16719 179962919 184964744 188752191 190928984 192101092 191492402 189888678 187048725 182595085
16711 182595085 177579281 171208855 164611311 157564695 149566814 142006747 134775816 126727968
16703 126727968 119343512 112213400 105340043 98682868 92664367 86947338 81545363 76284695
16695 76284695 71825651 67448182 63680344 59850701 56860032 53368304 50393307 47560810
16687 47560810 44926340 42588917 40513139 38491399 36229534 34897477 33226220 31187502
16679 31187502 29936219 28605167 27409886 26260544 25178883 24001807 23176596 21838132
16671 21838132 21049946 20425659 19647433 18705396 17871378 17250948 16616828 16268723 16037582
16662 16037582 15137346 14474599 13959728 13238856 13112346 12510804 12223936 11739367 11431635
16653 11431635 11012866 10200697 10311176 9812993 9668475 9302925 8971832 8990094 8611849
16644 8611849 8208533 8021857 8065208 7661794 7331865 7273383 7409703 6977527 6893230 6471000
16634 6471000 6528955 6121024 6355641 6229897 5810467 5548758 5575790 5579085 5553269 5704804
16624 5704804 5027348 5401996 4516384 4782444 4658778 4600214 4452352 4608573 4539227 4240403
16614 4240403 4166788 4072818 4113440 3549190 3942153 3934325 3843269 3703382 3612778 3272072 3601621
16603 3601621 3146067 3498468 3140452 3195787 3228026 2991701 2750140 3020726 3170631 2809081
16593 2809081 2745724 2555411 2381318 2430249 2524230 2609257 2355561 2560188 2203607 2475132
16583 2475132 2425346 2532025 2557053 1828240 2495548 2331400 1826811 2061938 1772523 2092572
16573 2092572 2096847 1460136 2015049 1686025 1787006 1700161 1964248 1829858 1542221 1823646
16563 1823646 1785434 1910760 1698989 1420334 1609469 1281460 1249059 1651446 1482082 1700709
16553 1700709 1289824 1413419 1370021 1221444 1349307 1470678 1101781 1184753 1036746 1298546
16543 1298546 1316005 976300 1324070 1400350 1074375 1301540 1066951 1029031 1629317 1157178
16533 1157178 1362831 1352215 936181 997740 1194328 939449 1323820 865422 1020517 814991
16523 814991 810894 935546 714579 914402 866106 803987 980725 621541 928188 855281
16513 855281 699841 743201 729116 647888 675287 837794 768617 921987 825135 761691 881179
16502 881179 362401 1074760 785888 765589 744975 807987 643833 727467 707066 620348 444578
16491 444578 643302 803323 288622 616247 528948 515251 626652 587805 535543 592972
16481 592972 417284 355499 641037 622336 720358 491644 704808 568278 1014246 743542
16471 743542 488240 515047 454955 670981 489766 579506 693119 607674 487079 573292
16461 573292 554156 649525 526297 621563 167244 331510 331677 341095 472348 578499 379928
16450 379928 410270 272697 696730 494746 775009 309393 464604 440600 428585 685169
16440 685169 278936 422084 426846 403335 659671 419393 5377 358836 398061 -16791 576702
16428 481595 436731 36337 407000 342332 290660 464493 120603 427142 80696 475417
16418 475417 555374 128695 365844 350825 214361 331130 172053 706682 560728 647079
16408 647079 202359 249589 293744 437533 299577 96009 196798 273545 305235 184955
16398 184955 42659 391478 366538 473643 353700 214351 51257 378664 534330 553331
16388 553331 54960 168123 239596 408865 75911 363028 453922 276928 141174 238532
16378 238532 288899 136352 107080 45652 177530 156334 262309 528441 217389 173584
16368 173584 283029 310402 232093 85037 271540 -2808 283286 336188 -127047 72417 123373
16357 123373 205946 152941 431184 401691 110126 119670 -23027 -52350 -223895 67537 467914
16346 467914 22673 400191 265248 -113062 -93234 289790 -86159 32778 199182 255580
16336 255580 296617 281420 149871 365738 182791 204755 201195 203370 268131 309654 -26026
16324 210662 221024 -19963 -7460 287736 78190 188119 255261 234890 70382 28448 202531
16313 202531 243384 284217 -177857 313371 123225 74110 302825 119830 175390 -21462
16302 -158369 21452 171105 375829 244054 288301 -328491 -15431 -243420 282145 160986
16292 160986 -108365 142809 217382 185879 -213834 9996 145140 8461 -56624 329026 85242
16280 70299 -226918 16215 129496 243400 49627 179368 -131004 -5623 17219 348124 299864
16269 299864 121507 -168120 142633 -106231 146116 513179 86375 532183 37025 -255527
16258 -167482 -259226 -63407 98562 116006 -38221 166197 296176 141879 2593 70260 358251
16247 358251 -112095 -517843 471463 -12977 184818 184424 243281 -205712 80724 242964 -19581
16235 -39578 261033 -117658 320418 -131190 -8569 -178383 63437 -13219 107396 209523
16225 209523 94007 -34082 230583 -59878 63486 119653 -178016 217871 -151876 496587
16214 293670 46589 201103 -72205 122422 -334156 -459766 361651 206153 -270345 -91952
16203 226808 -63505 -117426 89558 -84352 112469 325424 147484 -339309 -95942 29221 -213789
16191 71450 2958 33976 438209 -172024 -306281 -36212 179364 45326 -178980 -68272 345034
16179 54416 -11420 -304 -159834 -204848 -153173 -127618 -124981 312858 -51709 -97270 385899 -67678
16166 200066 53573 -48717 136595 -188246 29995 22427 -5082 412098 85574 165512 -293055
16154 -175740 98408 45544 -221269 -97978 -334481 -33821 54657 109480 -52660 -272770 -165017
16143 -165017 39847 -98154 -44018 -17582 -258611 122226 393 -22909 -120831 113456 -15691
16131 296894 62414 -310281 -142145 191371 -52375 68463 -122399 225670 177287 -285507
16120 6468 69053 -23353 86277 -132717 -177946 -113747 166574 23705 106999 -192887 10071
16108 180120 163808 237657 249913 -190555 -26832 114108 -1686 292718 -28965 44044 -103771
16096 -19884 45537 -85226 154203 181353 -34426 169412 -175766 -88517 339994 -385066 137903
16084 55330 -86654 203076 -109754 -30008 148554 -31247 4199 -134510 -132722 -43441 -66085
16073 -66085 -27670 -3677 -66147 -268170 4200 -192533 -263367 -132369 -108299 -125718 28085
16061 286231 263541 275085 -177579 -312869 -59283 -204762 -72482 41489 262703 -306746
16050 64933 10617 -2219 14580 481885 -28128 62818 -12329 -305746 519281 -167075 -39149
16038 -136477 7523 8251 -137615 -287430 53491 -101464 312574 -46091 -178084 -159023 -60205
16026 152192 -146207 68294 30547 -103074 -64995 290890 9704 -79767 -164532 -143456 -177102
16015 -177102 -94718 -56201 -145082 -75 -162729 196511 175687 -107341 110390 -227969 -148288
16004 -148288 194834 -143209 127605 -104077 -118678 48164 109189 110939 -64012 219591 78504
15992 -237498 -38710 157311 206936 -82465 62213 -219191 401616 173101 230228 -50751 517987
15980 123515 68177 254039 71000 -111650 198640 176165 406046 117215 2686 82908 -151555
15968 48347 -107817 -69436 93147 -92089 -124606 -46133 -155394 -52574 -145699 -148420 112190
15956 17388 -206502 -168912 -163216 174476 193188 -192683 -103036 -24313 120173 -138869 111653
15944 94875 -288312 71684 -66347 -15944 -400930 495477 -74589 8629 -224891 93374 -57048
15932 123621 -132413 48493 -32061 130946 -246403 40059 -142133 43284 -107411 -109697 188859
15920 -116049 112879 -256200 -187063 -295401 -3034 -72012 60300 -118107 210137 -205278
15909 -171651 182020 11525 -127463 -75720 98396 122118 30677 101377 -232404 -34420 268118
15897 106583 -41672 -118079 96192 -170780 -258624 -14935 -12004 62386 -216804 -2232 390038
15885 -157343 -24892 -35304 -106717 -90443 61004 -89040 -116617 -43059 -57090 -176405 -5318
15873 -206365 -9335 -149288 106137 -60859 -27844 -127994 72756 -80801 -332039 -350776 132873
15861 318751 -40634 24039 105047 104281 -3727 60744 -212656 -57203 76152 -427973 -85163 83464
15848 -296996 306535 -126751 -249762 -233660 -373574 -191208 -6683 -126964 -318504 -181838
15838 -181838 233408 -51407 -113532 -264482 -347469 34176 -88803 -240972 -501630 56604 47126
15827 47126 -158332 -206309 78574 102972 7121 -102326 -19044 251344 -204342 -157296 -208309
15816 -208309 35362 60862 -17432 -58374 176089 138747 -69212 -37925 -105405 20112 70580
15805 70580 -358689 -212422 -341675 -129808 129869 -126374 176679 373415 104049 -276060
15794 63809 84607 46924 -6408 -68101 -236253 -31070 -134316 -2054 20121 103259 -232158
15782 1819 82080 -126936 -220093 -224711 -321348 -228747 16516 112084 40970 -90475 -214385 -102246
15769 109250 -86472 -104374 -189272 90766 -403789 -113839 -89066 211283 97417 254531 35660
15757 217352 127878 -66934 -113668 -107956 -14251 -379182 163681 -29575 197356 238704 -68007
15745 44991 140379 -31399 -243601 61427 259966 -254921 399351 -59501 -171601 -311461
15735 -311461 204839 348941 -216327 -197622 -70848 50846 -110140 236215 -282838 37429
15724 129080 -73749 -109512 100833 -52339 -89517 395421 201236 116300 157661 -26095 -245079
15713 -245079 -132706 -6726 -629958 40758 -69527 56601 -225484 -29700 -118375 102898 -77013
15701 190051 -188744 -157483 354209 146100 -324803 77615 55081 289155 243684 119185
15690 -488 527408 -314739 301377 5136 -125678 451 55747 84334 10071 -250733 -410726
15679 -410726 231524 327247 110571 121013 -45470 -9045 -42439 -149237 -208190 -144765 121938
15667 38520 -58501 -296961 52163 -224520 17519 -135438 -75117 -131938 -131776 -124118 60590 230239
15655 230239 -69206 160091 -233815 118458 -185768 -100957 -44947 210576 -183480 -64267
15644 105288 -85298 131520 78041 4124 -142498 -53348 -391970 38695 -17831 129187 78487
15633 78487 -144117 310925 326714 171233 -172902 -235580 344034 90166 21085 91987 -50082
15621 39641 176498 -70827 -94160 108675 138305 -25729 -91271 220672 -151512 36280 -188493
15609 99317 399233 -16530 -119020 -146262 -94240 47467 73845 -214231 273303 21016 64484
15598 64484 94148 -376989 -7770 16237 -261924 -151927 -122764 -131551 314991 286685 79153
15586 -147137 -137524 -92246 -298101 -135339 -496183 -169114 -232146 200100 -209668 -359787
15576 -359787 64294 9697 61326 -105949 -91880 -216387 176927 -17931 -25084 -122737 -104949
15565 -104949 108862 -400187 404895 -77824 214531 401557 226208 23034 11914 61933
15555 61933 -156529 149361 68224 32521 85059 -111914 78111 -234911 70526 40362 183315
15544 183315 -115248 -20860 54229 221577 404223 300466 2102 193380 -201990 -124834
15534 -124834 -123163 -31894 60230 20856 -58457 -584168 37759 358739 318124 -69231 87404
15522 96186 86910 -231852 -113966 -55056 52400 -23418 -100730 120099 -74005 -144735 396872
15510 -21943 -13424 142777 -246818 401045 -27366 220364 68950 -11974 -271697 490955 212121
15498 -153310 -123614 -58873 -266456 30135 -107056 -89529 -252840 -32472 174856 -31290 187577
15486 132287 125116 190732 41839 -86469 -16125 -202666 176585 -281794 1019 146275 -23101
15474 -375064 153122 -182136 49352 -5382 107573 1796 239640 -265794 91494 -138726 191810
15462 58168 -442760 -241296 -107343 7484 -19156 213565 -90546 278303 173632 202070 554358
15451 554358 -150169 -117838 331247 -67064 320330 178748 -4428 -156610 88688 -80423 175336
15439 122184 30512 36344 -351122 271824 -291848 -164444 -114441 -111622 -147765 214104 -10313
15427 -376504 -37268 -207963 -52757 -68869 -9699 226800 53923 204139 -312573 -259777 -237043
15416 -237043 132363 -128239 -131253 -88932 298245 12224 -115893 -72364 -28049 -150449 -20822
15404 228709 160629 -31572 30247 148801 64974 -60199 -24434 -96519 -43281 29091 121681
15393 121681 -114319 -66809 23144 -258305 -388039 91023 62635 -21635 -60504 -87197 -132329
15382 -132329 96464 -148639 -92084 211449 -179139 38480 -11025 167680 142639 -95128 188768
15370 183653 56491 -327140 -325610 -66647 119206 127674 141539 101338 203228 -15478 33906
15358 358362 -235779 7689 55786 -92408 178695 119950 215560 114122 -58663 276103 -244077
15346 48869 38334 13464 67510 -33139 117290 -156273 19062 165479 -300161 -211632 99452
15334 24595 241767 -39961 -52111 -5388 105881 50411 -53502 85308 -278576 -21526 32781
15322 -360568 18042 27675 113477 -193342 -363367 4263 315623 -77785 148574 749 77020
15311 77020 -184933 -9 -233844 27037 71360 -53360 71160 128984 115096 -177320 57942 160554
15299 160554 -128595 369691 103448 -25314 -80659 -185917 -135461 170220 -102406 22277
15288 107376 71734 -9222 -81109 161710 244327 -44398 23679 9274 -209609 -173798 -396516
15277 -396516 169085 107485 137984 153941 123294 341579 -166326 -18978 144201 -40072 -66280
15266 -66280 -155566 65433 335762 142571 -2746 28161 -234939 -156346 31785 179368 -133910
15254 411745 -133066 149539 25955 -48638 241058 198118 130869 741571 1396560 1481359
15244 1481359 911281 1857029 861048 343690 16413 70165 -173524 152113 224103 -87752
15233 -107067 50961 487573 -277083 136398 -102091 -77365 -209944 -206088 216612 227626
15223 227626 -243374 -38822 -96013 -163082 91475 121883 107560 113719 187514 -128027 -77678
15212 -77678 280390 435853 163363 41125 -120960 515 18756 -291042 -168894 -119909 -189867
15201 -189867 -86326 -22662 209016 184237 -5758 102858 97349 -50009 181341 -105618 147768
15189 290715 199920 16608 -53370 407459 61458 350169 75114 -42707 308573 231367 111874
15177 30375 27368 -68830 39020 130840 72604 59304 -186773 72431 345489 -134745 424633
15165 286071 100720 -289712 182907 52493 90033 110578 101939 -6460 104190 -268852 244217
15153 163594 -89591 40940 97149 160622 -33531 576354 382257 304509 370812 -9371 -40771
15142 -40771 77114 -249422 -48133 489020 140102 28501 91541 236191 -82642 220831 26941
15130 -178837 339500 27595 86213 160371 366136 288301 519693 -252428 -13612 -80970 237688
15118 101806 1956 367206 -126855 -155594 -7500 176078 31773 166103 -17968 102269 -63304
15106 317371 5867 53056 277000 -129751 224738 -119949 142265 -209001 -300299 242688
15095 57440 -39059 -62746 64964 -16066 -36961 548016 109991 -10954 152672 141638 256672
15084 256672 -92933 228011 195205 232523 97658 184021 339138 303096 222162 132539 281093
15073 281093 165694 326795 -432555 -132346 39645 416105 90974 271829 137256 169916
15063 169916 -155020 142815 259392 311891 -324864 -2329 -55906 152718 199370 82475 -73005
15051 -126493 34647 57699 223243 312681 200 234751 263189 17519 -38628 143461 234816
15040 234816 427161 33931 172445 37494 350901 -14394 207259 254461 369795 -230644
15029 183077 27353 210234 71381 346966 257627 -66857 115237 221431 568018 98472
15018 58780 509065 46997 289036 230097 4538 172961 89310 -65724 101976 149664 -44071
15006 171481 13787 308972 429851 -80712 -160147 -40133 122718 325503 19351 99450 203747
14995 203747 420422 -114468 67802 241182 378278 71287 481405 379336 250258 15526
14984 213850 84561 388650 208405 230779 137648 81602 466654 320999 212572 337551
14974 337551 240964 161898 527006 298596 -94647 299448 236883 70757 295745 -110663
14963 161602 226569 359384 158318 517382 282393 254836 429301 163022 270985 207994
14953 207994 332495 401420 465063 698094 -161035 347262 160695 221878 92241 545895
14943 545895 175322 191532 265406 324822 58425 76606 281277 -96190 176491 314179 469176
14932 469176 128092 358481 178249 70732 14499 223084 585381 206647 -250012 306086
14921 164298 415836 272798 -65650 237897 311975 256119 338063 354682 206838 506624
14911 506624 268071 369099 327981 429876 235747 292977 351454 263698 517948 466595
14901 466595 455128 143780 -115658 37405 46225 404700 224902 125551 320564 705076
14891 705076 -83071 439024 305656 117790 183346 195820 314829 117044 316940 94490
14880 36100 190645 346867 175452 175861 212091 120046 385001 166169 709635 -57010 323837
14868 502413 306635 167853 324436 380117 178512 541592 400967 397650 223488 412984
14858 412984 281410 570703 200474 374750 64731 -3851 -34774 417125 483630 163697
14847 426793 238756 404408 613841 335091 467519 633148 587801 299928 184209 241160
14837 241160 276978 540732 190144 411599 230969 462802 714245 169906 -45337 352910
14826 332480 142599 377807 622330 526908 315436 398269 209814 256371 789471 421294
14816 421294 300053 85018 572768 199612 452813 357729 382706 106735 546592 287295
14806 287295 393608 400896 308170 447492 664132 676842 368627 645691 535677 565089
14796 565089 815574 485952 475650 325130 692401 328538 679412 356522 872444 592103
14786 592103 344207 435843 590884 450730 620771 623010 392664 1159208 583448 445647
14776 445647 444128 106056 520365 299551 362181 246106 147911 329907 494650 750802
14766 750802 442827 505542 371816 689494 260854 528964 339225 365689 585449 565448
14756 565448 445782 251809 625418 932794 443440 380392 149300 814524 618908 371775
14746 371775 485613 942801 500219 403995 580854 679586 718293 749666 630751 531863
14736 531863 693483 438025 622081 891489 465680 312539 945527 670813 626975 839125
14726 839125 395161 490009 881348 579930 717054 597681 668923 875259 853440 353115
14715 781549 932710 606790 578766 563503 578977 752590 566662 535622 634264 799817
14705 799817 607282 960680 624860 796837 622407 514872 746006 373621 451868 562015
14695 562015 827680 661431 557995 751541 640726 1064781 993605 781035 724772 438060
14685 438060 801926 962859 1378837 931376 716213 823854 1266640 516118 341448 612255
14675 612255 983419 662305 506280 1078249 1036476 516905 899823 810215 1089113 802888
14665 802888 618048 1121472 849052 817441 905352 1065497 856580 928547 952050 523695
14655 523695 1042747 781184 976768 1022514 1062036 803677 953421 898310 1193714 1011343
14645 1011343 780428 928993 995582 835379 984058 1110737 1124098 1042096 1181877 1233605
14635 1233605 1228019 749419 1073499 808464 1094966 1449806 1090261 1146622 953766 1058353
14625 1058353 843343 1522952 1296030 881040 1373531 1334196 1243792 1329270 1253032 1354635
14615 1354635 1277760 1244449 1179730 1403022 1321046 1433090 1106380 1452503 1263657 1398877
14605 1398877 1471853 1278045 1363714 1661669 1209936 1236766 1103981 1415479 1479100 1419540
14595 1419540 1721924 1281122 1641356 1482409 1555402 1365691 1639852 1800198 1602343 1471647
14585 1471647 1464288 1609947 1775058 1816749 1857485 1747066 1288796 1502406 2063970 1805176
14575 1805176 2140476 1804725 1937843 1840458 1892562 1944322 1649889 1912880 1956177 1904309
14565 1904309 2260030 2028210 1917119 2387226 2315141 2281960 2235895 2590294 2500521 2660763
14555 2660763 2961810 3023948 3054430 3480946 3743714 4683495 6200440 9412126 16188330
14546 16188330 38302744 43418524 21474546 10375510 8721535 5137829 2974756 1804848
14538 1804848 1951993 1573110 1677803 1854128 1341302 1631662 1882868 2002794 1882977
14529 1882977 1787684 1925145 1747558 1961834 2520405 2084076 2065674 2094988 2215869 2061153
14519 2061153 2214909 1930373 2225128 2333579 2477172 2542292 2252020 2301000 2431879 2555056
14509 2555056 2362929 2599876 2404302 2375410 2729746 2546363 2361907 2182334 2514128 2717572
14499 2717572 2872808 2714658 3055236 2994818 2734528 2902423 2938991 3000263 2848743 2951409
14489 2951409 3098322 3009701 3043383 3087780 2961724 3032662 3159756 3238511 3570442 3261276
14479 3261276 3154674 3164316 3322759 3584803 3322686 3719690 3196227 3647061 3756351 3603914
14469 3603914 3574579 4084876 3876125 3897183 3768070 3801881 4217053 3997400 4147747 4091418
14459 4091418 4200645 4416418 4298413 4239792 4312006 4376394 4300883 4740911 4415493 5037250
14449 5037250 4914050 5010108 4731444 5258199 4744759 5037697 4988429 5194020 5315289 5229872
14439 5229872 5593751 5115767 5649070 5561640 5363894 6061807 6029205 6084488 6028381 5850959
14429 5850959 6329837 6358825 6243367 6127068 6556842 6503909 6810930 6868153 6990825 7166636
14419 7166636 6889289 7104635 6804100 7548894 7420218 7281521 7648708 7564799 7860353 7504249
14409 7504249 7954511 8194036 8381152 8313198 8767199 8561400 8573952 8698487 9011719 9328793
14399 9328793 9239272 9475449 9685906 10019681 9940474 10058048 10611601 10264361 10395133 10581142
14389 10581142 10897111 11271031 11417097 11468361 11906401 11894570 12351821 12611092 12753948 13127680
14379 13127680 13053507 13372680 13468236 13600965 14321937 14454133 14514726 14896968 15014414 15713082
14369 15713082 15948528 16509787 16607984 17179851 17168614 18014204 18168426 18661406 18660554 19014894
14359 19014894 19733627 20216612 20757132 20994719 21638846 21916709 22446478 23149059 23542138
14350 23542138 24432982 24560251 25464137 26029233 26999645 27596917 28010305 29423636 29721949
14341 29721949 30675817 31201881 32032027 33048119 34050500 34987921 36203056 37145869 38252679
14332 38252679 39051540 40766626 41660057 42987631 44417557 45958923 47526604 48850360
14324 48850360 50659714 52465653 54455878 56242639 58094843 60628945 62464819 65322083
14316 65322083 67610167 70549439 73091917 75984459 79192233 82957988 86498122 89818500
14308 89818500 93795429 98090821 102683086 107471459 112373844 117635934 123826822 129611133
14300 129611133 136135989 143190876 150394059 158402989 166891270 175954170 185233024 195971005
14292 195971005 206514866 217960333 229790628 242624807 256457758 270713540 285621921
14285 285621921 301039180 317003234 333193356 349690664 366408259 383241548 399286451
14278 399286451 414708750 429132181 442512280 453603900 462856099 467614434 467699501 468130494
14270 468130494 463945909 459289871 455093536 446095639 436804238 429987315 421313766 407865066
14262 407865066 393156570 377009272 360055158 343163261 325981673 309283530 293492188
14255 293492188 277844417 263184438 249694313 237106776 224334508 212748328 201236441
14248 201236441 190673183 180731581 171258528 162786521 155319585 147456719 140239168 133505878
14240 133505878 126974473 121160600 116255176 111108945 105853265 101212718 96790718 92642888
14232 92642888 89017653 85633803 82218015 78821341 75623350 72848298 69970591 67326131
14224 67326131 64581109 62621880 60158249 58317754 56315610 54318685 52528439 50688220
14216 50688220 48833518 47176266 46157091 44903966 43596682 41657835 40230060 39465812
14208 39465812 38328971 37762502 36555042 35203736 34037634 33025764 32159588 31690404
14200 31690404 30798214 29585017 29123556 28105876 27656370 26579710 26070931 25610692 25187801
14191 25187801 24237217 23790702 23172989 22401475 22276886 21754714 21007082 20504881 20135711
14182 20135711 19676888 19653305 18771817 18688105 18728973 17873873 17424989 17307909 16861115 16587311
14172 16587311 15885197 15770333 15692720 15086969 14987699 14339301 14230252 14198170 14063171 13540466
14162 13540466 13292032 13404591 13033200 12511674 13015351 12423785 11851898 11645029 11667100
14153 11667100 11386534 11135490 10703075 10988650 10772879 10847369 9903215 10164256 9825148
14144 9825148 9968651 9642866 9536095 9612798 8855491 9036196 8970908 9015466 9066966 8436706
14134 8436706 8681723 8185225 8410881 7911408 8309593 7918997 7966597 7560949 7375004 7446506
14124 7446506 7503620 7622247 7303262 6785113 6965855 6927628 6717331 6953915 6613888 6394186
14114 6394186 6204614 6234304 6037694 6148365 6257957 6099042 6168374 5703930 5847426 5563368
14104 5563368 5885825 5775051 4996253 5540122 5212982 5422455 5314617 5360399 4906087 4975725
14094 4975725 5501369 4679940 4908031 4878432 5072706 4895089 4949643 4358578 4602295 4627789
14084 4627789 4525473 4570557 4614278 4307795 4314998 4163156 4316038 4178351 4194545 4266108
14074 4266108 4049158 3719038 3800840 4203931 3694262 3798342 3795374 3913753 3865271 3901951
14064 3901951 3673255 4045643 3623702 3649620 3620217 3587614 3426601 3477649 3921463 3386907
14054 3386907 3262130 3337705 3346153 3345300 3581747 3161895 3296092 3186112 2832581 3020377
14044 3020377 3254780 2861219 3130096 2940394 3099175 2886553 3258808 2492136 2619907
14035 2619907 3219615 3018643 3023984 2640770 2751706 2546792 3016123 2860526 2740664 2677333
14025 2677333 2860745 2759199 2493669 2555960 2704107 2518918 2420924 2379117 2166436 2290481
14015 2290481 2241985 2354606 2287085 2020853 2056485 2173325 1749842 2118942 1912244 2087266
14005 2087266 2272538 1738386 2072374 1672456 2015948 2107189 1641253 1872386 1694552 1746604
13995 1746604 1841975 2212118 1875360 1879619 1729476 2366913 2828648 4618020 9662995 30175355
13985 30175355 44898340 26884668 13960919 9301611 6253525 4591645 3865057 3049642
13977 3049642 3245708 2848364 2644286 2555006 2710991 2406013 2473698 2245437 2217045 2401059
13967 2401059 2218925 2504364 1889451 2143693 2068207 1755120 2168935 1916322 2095469 2044883
13957 2044883 1739004 1981089 1749203 2039521 1806727 1879285 1818964 1776567 1816097 1944413
13947 1944413 1803501 1797083 1717101 1543040 1895514 1732449 1763048 1565967 1505328 1651340
13937 1651340 1434021 1704364 1460474 1501161 1723324 1504619 1401970 1458271 1789446 1468123
13927 1468123 1582390 1405057 1457599 1569145 1283631 1256561 1331518 1749669 1311331 1426557
13917 1426557 1292385 1735915 1231794 1206609 1406221 1295127 956019 1156372 1111817 1287844
13907 1287844 983938 1316963 1489862 1323410 1171671 1195221 1242297 1320565 1525466 1258819
13897 1258819 1225542 1153757 1105348 1121556 1063679 1295755 1489208 1121632 1040634 890577
13887 890577 1342942 1010066 1136227 1061491 1082182 1094777 1114118 1096192 977279 1496656
13877 1496656 1154053 1184044 825175 1219265 1459210 1222493 1293049 889165 944619 857052
13867 857052 1020338 1088218 770559 889826 885126 976515 902070 838531 777521 825193 970776
13856 970776 1180663 1004140 1213537 965005 655990 802762 1180577 1132735 1175253 901620
13846 901620 597149 869911 1085941 881561 549102 1045559 934633 974510 1120489 483775
13835 1161871 529238 666218 1149436 950968 1077745 1045213 792506 890143 625510 605223
13825 605223 605628 814970 703365 854878 784532 994053 1026867 765342 853834 870530 954187
13814 954187 845654 698879 890767 835034 648018 809884 1078363 541752 463702 760938
13804 760938 733147 805635 922368 950356 551538 761264 889213 609565 685000 795491
13794 795491 537366 1308388 819097 964009 821833 892132 685701 419093 899433 749872
13784 749872 612654 752833 440039 828630 676906 993700 594842 554242 674097 393167
13774 393167 787703 739696 729284 717115 666647 856749 289988 332853 611098 463473
13764 463473 706618 835586 456392 596490 713852 421599 720034 494117 719958 645354
13754 645354 215015 434106 479473 727690 878609 600477 464649 345626 561700 944100
13744 944100 765243 681333 323170 573612 344037 529068 391598 661671 551842 509546
13734 509546 642331 329026 542285 685043 665588 762023 279487 726884 285117 491817
13724 491817 288887 678661 429691 343079 366624 473747 686689 504109 372864 483159
13714 483159 556506 727819 466321 793443 760361 432449 619820 493106 674533 432598
13704 432598 583011 549720 180877 300879 413125 453512 680921 795717 470986 355323
13694 355323 452583 588244 497955 215716 473162 319667 378896 481301 60753 336896
13684 336896 408531 451205 295821 226954 424272 519711 344870 715659 613697 306648
13673 595924 454379 319344 315820 294334 310653 522574 607640 109041 388892 317910 483263
13662 483263 564569 413900 243655 510832 474449 556394 471782 585759 234388 364890
13652 364890 569359 443783 291818 140388 519259 492570 247473 409356 452152 562598
13642 562598 348994 462670 586598 -104698 96264 423169 649098 274955 107960 567110
13632 567110 125189 442058 418031 300651 297300 212115 374916 379715 336030 278789 387962
13621 387962 336661 240490 637295 149533 429288 218720 402774 693506 532069 517277
13611 517277 -67087 468326 211692 7059 107418 504764 546166 698728 148775 402573
13601 402573 262197 140156 561901 722413 545011 240156 425909 324967 427473 362562
13591 362562 32580 66437 750223 448030 156036 53038 406141 452314 189323 -56285
13580 379157 422509 580897 206299 94710 138167 266188 504463 154679 590155 509440
13570 509440 252902 -39991 -6267 159211 150338 77120 264324 186985 180040 598141 238694
13558 -45953 256570 229934 363591 372477 354183 375882 440786 191305 270697 396681 199844
13547 199844 38741 209889 449810 480560 261974 426550 265849 443963 172206 106393
13537 106393 275358 504417 285865 134743 315519 170108 529807 313032 186493 255001
13527 255001 -9618 327287 385742 196122 -14812 173627 -148432 458750 591748 37051
13516 475258 44906 50693 184997 201168 165613 145575 276217 111552 486417 44626 43823
13505 43823 237301 57801 198938 177259 256884 -89700 -33465 241787 376093 -52720 248498
13493 274397 348909 438579 752361 320585 362903 37225 376444 -15298 116960 104430 370026
13482 370026 187128 228751 132204 418578 289986 265915 151341 216346 295395 -2799 419455
13470 357953 18145 328305 316835 172243 49576 239856 385546 210191 110798 384109
13460 384109 337611 196319 353321 259526 248567 569410 113414 220121 98589 273860
13450 273860 235722 -33559 117849 125663 114591 375802 417251 84000 126991 152480 279109
13439 279109 441409 444464 28919 176522 337767 169353 378744 44281 314692 123020
13428 279147 247412 -15735 312203 412225 49676 495381 98861 254579 292849 241435 101028
13416 185521 161245 302605 366564 -41001 165144 36327 287768 115075 172027 229312 1176
13404 261959 207359 -16556 238649 26748 322595 483112 141637 235250 316211 -125759
13393 475709 375189 303846 232060 61909 415627 301028 249698 112127 229531 63853
13382 29234 -180706 -47111 239342 -157913 185193 325174 117145 253828 122248 421993
13372 421993 83331 115162 165935 43043 233778 323358 172007 185126 230379 308202 100477
13360 474832 520148 178753 -20493 266653 268023 386549 79542 589252 -43330 332157 343097
13349 343097 369964 369289 362512 123601 276643 286917 -7595 114797 405909 181802 283346
13338 283346 17135 154983 152319 14023 27007 49472 146640 227630 255346 237611 -105523
13326 338098 153744 160353 311596 -10054 22866 189421 -54823 411020 168707 134479 322982
13315 322982 83358 348344 313724 146992 239618 238986 66947 176275 -88323 224516 -104408
13303 185350 5034 240450 252044 242037 261326 207133 186443 90346 -178865 287071 -6639
13291 171244 -94728 55621 226993 119038 121308 84010 244900 296864 -53956 226433 236541
13280 236541 -296430 100151 128922 89677 -56338 -65208 343711 76450 361797 -10783 -192095
13269 -192095 332426 108873 135982 -2517 45859 388877 18287 193188 215272 178109 44691
13257 254944 165731 73953 287568 79059 -351709 -101313 343257 195157 -101140 119762
13246 54803 -66226 29949 -19241 -243695 303413 -307177 374580 306309 184400 15088 555354
13235 555354 131178 39461 233262 -95375 -55411 205394 596070 107103 237418 328731
13225 328731 25111 41608 112216 -54123 38025 20094 -30628 -50367 129683 214013 67788
13213 252592 383703 15918 -160326 423141 258490 242709 223710 -51754 127950 68465
13203 68465 -13634 -250764 218440 38061 120089 -16631 -88073 -109524 127553 126841 213037
13192 213037 61999 11986 40418 20160 128113 24151 -323022 168816 166704 3545 36010
13181 36010 371833 -148103 -116260 343055 36590 418339 41335 -86743 267470 64102 27463
13169 -150560 140129 36777 -134022 115833 90547 280045 60672 -284973 163474 -222689
13158 348788 -345363 28737 187108 47154 209746 -113146 104278 -239458 48990 51602
13148 51602 -27073 307946 200312 112247 262495 393506 73113 61535 214132 81244 17184
13136 235500 -158611 -1552 181770 -174591 41057 254581 275295 -100358 -41057 162274
13125 162686 -27560 -185766 -109520 65353 -117435 432723 205167 -24039 34119 62736 -108733
13113 170870 66311 245198 43863 46418 -25642 3279 219632 102097 154771 269427 -158140
13101 -281405 -98743 80871 159863 131491 -110949 101209 143883 185130 19527 312062 -64512
13089 193851 -247055 -258728 -221859 -221079 38491 -20194 267882 -144701 -432783 -41815 167297
13077 -25698 -197433 -24100 -135636 313778 97623 34618 279884 177138 380786 -121332
13066 189067 164184 525668 73807 -58377 -207343 647590 -35941 254175 78668 -55374 139289
13054 84144 -1857 166572 -380795 8497 -89463 185338 391158 -21070 -53455 76687 185883
13043 185883 92279 56993 207711 -177385 -37011 -13198 104193 495003 31219 274629
13033 274629 -114240 172031 1064 -31094 46161 -3833 178603 335962 34259 232571 42454
13021 263498 138857 203933 382859 164734 56905 173867 221707 71294 200106 65033
13010 24107 106936 29038 -15939 -53089 183310 12242 452201 37391 116338 243344 -21954
12998 118656 -69629 123230 107303 187262 33091 151867 284044 -336135 -4756 146492 40221
12986 257515 181476 223207 157770 129890 96431 120179 -3337 -67479 -76356 208531 259785 -290624
12973 -861 215544 216361 -4726 -19089 290755 29688 55490 -54403 -317815 372713 52260 151836
12961 151836 28350 199060 76150 40122 -8117 -18505 -126687 -86076 199433 88114 153896
12950 153896 106349 -56293 -93827 234053 -37245 -84304 3197 240887 -91117 -113703 -176049
12939 -176049 402893 29296 96309 10523 85672 -36201 -49250 45988 -54098 -189605 -78751
12927 180283 84063 -138697 -49927 109483 -55282 -25611 -2310 -41323 166731 -109882 -76216
12916 -76216 -253049 -102702 -349618 348892 -111493 219031 -147299 214255 59027 1598
12905 52444 -20536 196323 34889 101463 188850 303756 -215619 -29369 115453 37991 420745
12894 420745 -191590 186692 133969 284180 38718 -116212 51346 42166 -98064 176797 281955
12883 281955 106215 164624 56803 45287 -202828 43918 139481 1848 242009 206815 174376
12872 174376 85435 -5850 -20947 -102264 233037 191206 37778 124660 -185717 201537 -30751
12860 134300 -187888 120587 128387 -192747 -64029 12672 -208359 220372 -87547 154598
12849 204766 -51574 -72052 -21608 -254223 -191206 -77980 86058 -114675 144598 -106197 23940
12837 -78817 256575 -106778 -9519 5789 460987 306427 302582 132140 100462 390806 164079
12825 499580 152314 1861 -130125 34876 -134429 172812 51227 520369 -32874 26746 -166663
12813 44755 -148233 -48380 -66350 396516 31328 -17276 204597 117792 17229 95196 144416
12802 144416 -168864 232527 -8529 -380204 -8965 -200692 -14678 44419 49448 -188022 137715
12790 251710 -206800 -376643 332537 -49183 -410228 -199500 -161260 -109447 -160151 95623
12779 -239644 -277168 22930 186010 -31406 -298270 258322 -270596 -1934 -239056 -150199 -14735
12767 127385 226488 -23329 -152264 -52330 -197128 -53794 450184 -321327 -50423 -169491
12757 -169491 14481 127851 -170118 30108 52577 39658 154990 217094 465350 294224
12747 294224 89655 179723 127430 148615 -19066 36485 -87362 100302 100396 207206 -249131
12735 349993 141353 292351 130819 156806 365252 -163318 -47431 132219 30398 -102213
12724 57079 -250166 139096 -422992 53892 -143036 -163003 105133 -82547 -303088 59890
12713 201017 6143 203577 62682 352196 85195 12302 213574 94873 194938 -80881 55466
12701 559978 310262 366480 201422 -261161 71980 379028 146920 -90921 19313 275722
12691 275722 127634 43827 -48481 -152154 247287 -35895 44741 48148 -39888 14592 2849
12679 177832 360425 -135863 158205 98695 205648 375107 -55441 275518 79057 -40028
12668 16345 310507 46466 70892 231579 189216 97622 114359 61505 31130 408579 80967
12656 -9788 84735 482177 264828 144922 -161918 193688 157643 83195 100271 39066 -9822
12644 66267 223586 60250 135185 76905 -161991 200198 221852 -22617 172680 84744 270372
12633 270372 -428950 17525 -169222 271324 337072 -92417 140584 225959 136066 -20510 288166
12621 180792 295026 42500 -71538 57746 -18291 305326 -359806 4839 -129377 71639 -287572
12609 48986 -201093 76721 290565 -178843 116861 269422 -126253 474342 -162578 229989
12598 155598 103686 101223 197803 319785 284843 -88558 316417 469110 -80267 16983 -82375
12586 -31943 98843 -203563 275364 -119685 -87512 15092 -68117 -126828 -29576 -223977 96777
12574 464027 -138760 108673 -58122 74270 -82246 14371 -77321 13212 230095 -202195 -52899
12562 48629 382613 326649 -79684 518850 196689 184740 52778 334349 74473 -156520 358486
12550 201243 51318 52110 -175620 104461 69257 52012 150661 207696 -160983 -167424 -148681
12539 -148681 -95168 -23152 131489 -201953 54481 -121081 88898 341028 360163 220413
12529 220413 115040 117451 3547 60042 121611 132537 255329 31970 -79972 -116859 58283
12517 -311716 -136495 83506 8782 129206 -403784 -8255 -196372 94620 -21577 256561 105447
12505 -138545 223190 131206 -36176 280035 52599 -18028 81531 226761 130988 -231174 86086
12493 376933 299471 35566 -117352 374102 -86241 247576 -276071 -331644 -139949 -8509 49429
12481 -68203 7041 -150188 -178646 -155051 -58181 -135789 7200 -207472 -8768 130732 -66387 -155256
12469 -155256 -291838 -43903 -302965 63038 -129056 56154 -64902 57872 58973 -319154 -336117
12458 -336117 -175088 192832 135890 73502 230808 -150834 92740 385983 120969 45327
12447 -331881 292201 29454 106426 -231151 120015 20769 -84040 -169501 -100935 12779 53141
12436 53141 76135 -70820 5142 -73038 -36562 -49044 -38366 185898 112074 -233632 40175
12424 212441 11816 -194135 -30186 145575 72768 -294927 92567 250849 -66171 302933
12413 -39152 -179601 -61152 102424 216928 69850 32173 5864 20518 46542 -188889 91364
12401 -13689 31700 -30762 197036 -278489 57802 -234545 71711 -110343 -176056 -208272 -2142
12389 63878 -342125 -98961 -111361 75707 110773 94005 68013 -176759 -83927 -9329 -138063
12378 -138063 -84263 80926 11374 505845 271342 -114502 238437 -198101 -603656 77304
12367 354969 -377661 278012 56449 130917 128545 174707 -116173 170276 222926 17259 -377306
12355 165026 210370 248403 -25322 -31777 -89737 140389 -186992 298938 -260561 -130098 295446
12343 126222 -82716 62017 122078 -119557 194476 -49610 -43380 185209 30419 -14672 -183369
12332 -183369 -201559 -77717 81518 -126487 -321432 144571 381804 -351197 -30491 -103045
12322 -103045 249844 -123781 161712 218142 119503 129849 105582 369092 82308 106372 5545
12310 43485 -143704 69932 96481 -126257 331203 -13838 116848 88876 164646 110676 224592
12299 224592 131036 -216257 -218031 -8178 138562 237477 286775 137726 -84197 -87657 -68004
12288 -68004 104458 474319 300135 -175297 428602 -401276 234504 -337230 158314 237027
12278 237027 111215 370221 223020 27651 588776 154072 -131978 -102401 232254 -4473
12267 38153 -56215 73609 -135378 140771 -16772 111694 77243 -108196 -14500 263026 15467
12255 4541 146566 39472 62914 -26021 71750 58204 75695 708323 -22080 200646 292845
12244 292845 202389 178996 -69047 74310 45328 52365 211385 71151 -80218 246591 68247
12232 238112 12474 139206 137552 417853 381470 262394 297859 -164995 410223 300159
12222 300159 68491 -142890 -47089 502642 363363 117047 473179 128484 259808 -153385
12211 130492 85732 117188 -76364 -47011 78264 -22546 41693 -59530 38522 252970 487103
12200 487103 404139 347981 120823 273555 89611 445414 90719 262194 427354 162322
12189 129728 206028 84436 -28130 -80368 37981 35867 97179 165384 224368 277446 62927 360459
12177 360459 -214802 269293 401919 97314 211352 282190 387659 150812 390537 239243
12167 239243 -67446 155279 249742 232535 -40196 -30573 -105443 57569 123056 321661 167553
12156 167553 38447 -226487 -124951 225745 263192 248171 -306508 352968 135311 456146
12146 456146 -10258 -193319 -199387 -122119 6230 -135423 290619 126137 -54523 -302257 494
12134 -150081 74632 83215 207204 153776 -2933 -198480 -75787 250680 -245143 78628 -162878
12122 50699 -106731 80893 182691 48720 -14556 -382 -167759 -35286 66896 -327295 124607
12110 251899 -28551 -125846 -178185 -115013 165490 169850 172705 113909 -134255 92499 -360246
12098 -95359 118966 295490 68182 -36549 133955 64068 -20470 37594 20234 -4868 -17473
12087 -17473 152502 8378 -66665 -132901 -40430 -134968 198202 -143156 172529 206779 566688
12076 566688 1681803 1937485 651927 400728 213663 389974 -75330 -106257 88630 -112528
12065 -65850 -17242 282066 358653 -139446 207584 331928 -319845 -134725 -163114 319306
12054 17333 -95032 -12813 -391499 149725 75845 -76762 -282621 291285 194081 -244001 -378260
12043 -378260 -200058 138035 -178674 111598 85357 119009 176185 25954 -158129 -43171
12032 -164562 -224850 411367 -241183 85979 229520 104744 -256541 -51633 222292 211488
12022 211488 250735 -150628 -15629 -8379 -187936 517686 115095 70611 424458 -204456
12011 123245 82987 -983 312439 -271468 95161 -44098 -78298 143553 70131 107529 -36154
11999 -49051 241953 7799 201805 107865 -201151 182123 -63648 -40869 -50233 -17781 102053
11987 191646 -52138 -109579 143626 -38319 -322746 -352246 -464516 186414 -53133 217603
11976 82853 -400626 -47354 24429 120350 -225948 186670 -105298 200525 -273783 149701
11965 96048 43291 -277791 -284817 -77574 -526562 181080 -295747 -115382 -185650 163609 -173698
11953 -210361 -46222 811 -175841 -238202 282014 -191941 -90562 148661 -125629 -2239 -108780
11942 -108780 2859 -214356 -137126 335776 -78413 -41409 5733 335575 192353 321012 -272800
11930 80564 -146947 -253967 165539 529633 -69446 -139373 -157542 -125623 -2429 -79149 -38683
11918 125439 87448 155415 110060 151761 78704 82036 -244309 16111 -73082 -199799 -136049
11907 -136049 179688 313465 262530 93329 -61966 -63925 -96277 182527 -68084 -77240 4184
11895 -344931 -250058 209465 56427 7898 -50519 121521 25418 -225172 37998 -175263 14050
11883 217029 -253590 -239275 -50463 -184057 -405701 67262 -220489 166631 -438934 7867
11872 -332145 -190800 232067 208982 -16360 1593 -177102 253628 -8426 75410 -99512 127423
11860 76550 92193 -460366 -251813 -181941 -92000 -116517 134561 67658 -253 -35167 -1368 88843
11847 48432 -274894 108183 -9052 -52663 -275012 31345 62293 -285403 -441693 233802 -135174
11835 36366 428950 -191367 152282 7057 -133881 -130004 103114 -110444 -172279 -183252 -120514
11824 -120514 20819 105562 27461 277382 95104 -138562 99656 -60351 125897 -5949 -266548
11813 -266548 -321132 -101345 178671 68726 -44702 -94853 -4458 -30699 321337 -260998 154873
11801 -105381 -62520 10709 -47650 117150 32968 295855 -28876 -91915 84775 26636 -208388
11789 97935 133632 33158 118990 66523 -134545 -309620 -265971 25490 -114768 -252149 -143019
11778 -143019 -205219 -136258 -373308 -249818 146500 36629 24295 227047 -225637 -53735
11767 239831 -275270 237239 333820 46826 -268971 -49848 95747 15384 127234 390328
11757 390328 8484 -157108 -56964 -58381 175791 174299 -53183 289976 248650 -17269 -150573
11746 -150573 212565 95014 -33303 49529 -95348 -111552 4369 -60409 -49349 7131 -49464 -107732
11734 -107732 -73784 494612 111851 111193 213360 -138177 -65330 44582 -9237 281843 74982
11722 -120210 -224586 -56598 81899 37480 -238621 15800 157802 148567 222812 -52499 223539
11710 286724 -224296 229074 29341 45402 -1778 430437 -37734 83258 -355883 259882 11998
11698 -119440 172902 43064 -80483 216891 -23598 -90869 247570 42388 -96631 214189 -208475
11686 -121279 99713 198600 -57284 -69806 27404 -60123 50693 157620 543273 -219443 2736
11674 -14032 139426 327813 12760 -173035 -21726 118753 190461 -85287 17671 -190313 -78484
11662 -63807 17705 -22272 85595 39335 -282700 159584 253337 -230830 5793 21810 27473
11651 27473 86175 64552 -376519 -285012 -250626 -84713 116983 -62188 -189003 -141542 20839
11639 -170176 242786 82791 401159 -151804 216629 86009 -282083 184857 383498 236957
11629 236957 127019 120503 -97674 -230911 88232 212657 277688 450987 402915 -267431 148438
11617 -202731 -117218 -27056 224077 201061 -146448 15286 245952 142978 210770 -22825 25330
11605 97392 -71095 57782 33529 -165496 -56120 -16466 72267 66681 449059 285374 197756
11594 197756 -105639 -166828 479033 -136896 51746 -41352 137700 117554 337235 25763
11583 43208 -250409 313587 -12188 126471 70960 91721 227041 25282 -50761 239919 52069
11571 -25007 -160455 141096 -162868 48534 248365 48553 158745 56856 242740 202941
11561 202941 -177493 -194920 -32366 295850 -22219 203491 -253694 -30387 -21330 40717 434768
11550 434768 415051 3513 135045 207681 176135 566827 78683 390937 -2182 237621 293360
11539 293360 257936 -99009 253536 327766 -2099 180801 34434 239463 -25483 124803 -193392
11527 -193964 33595 82347 231110 207930 135160 6638 363108 358973 129158 -62254 67502
11515 -80761 -252538 453572 105988 -214928 -81704 -182689 -54819 11104 86544 -74444 306665
11503 139393 140258 336517 265406 199317 199134 99683 -153730 151405 223858 238950 243721 214150
11491 214150 -71054 -142210 329850 60325 159813 -6374 58220 48991 449468 345963 439409
11480 439409 272263 129965 -231191 328031 54456 299833 260250 40873 229737 168315
11470 168315 -110753 42576 -83193 240150 265156 252350 -76705 96429 -50056 -74559 121272
11458 -82630 46064 142770 -343356 63478 -51013 168122 965 -34861 164181 11608 111677
11447 111677 77404 249204 91906 95740 170851 -66991 -68572 27388 -98714 94183 -122273
11435 -750 -6590 -32520 157316 221426 223921 79491 -7544 251941 -154171 157116 112790 374339
11423 374339 46661 135652 -163353 430142 203463 -153545 -18580 -63134 76993 53437 -107871
11411 -66308 -353335 -82469 214183 180565 -10037 93707 7528 166318 328706 69185 326766
11400 326766 -91548 68813 198171 9768 247640 -163031 314986 138285 -90137 28229 154212
11389 154212 -137670 174693 111127 -25692 129364 -47901 -151755 238859 104635 8085
11378 4473 -133112 -115938 191434 372044 225722 -115962 -104254 -240432 -331320 345731
11367 279188 -70202 42623 -216673 63761 -3558 -84489 236048 312527 120260 187954 123039
11356 123039 158990 117131 -69842 -242514 -35995 -106845 170489 -383528 -293167 -204823 -40750
11344 -201803 158553 126173 187740 288675 53984 -164526 -8358 234761 -142038 -62353 -47709
11333 -47709 -541 113618 -18961 -79723 93494 -97989 76914 23817 28427 -155661 20948 -257099
11320 -21391 -94317 -303466 -261583 177272 -137451 -319388 347524 413676 -100694 28843
11309 -65388 170958 133310 130567 203700 -198481 11979 -165413 -221761 -105681 64941 -187729
11297 -123943 88318 83134 77086 -211769 -306709 86868 -6569 221972 -6136 -197841 -198712 -26194
11284 -80792 -116160 -166784 -23587 184421 -133313 -55768 -341379 -160953 18278 -309603 34449
11272 -158127 -38031 332604 390627 34096 -73127 47142 4874 -111047 52167 151457 50842
11260 -416091 -26254 -208821 -122024 69442 -143770 174254 -292671 138300 -135018 -194142
11250 -194142 -172032 -252349 -162562 -161922 -250376 266712 -181055 263591 56877 55465 -145809
11238 -398495 195894 88564 55148 107491 128532 145471 -149993 93553 -66924 384162 -199223
11226 -39814 -411400 -55988 302452 -100406 -204532 -204438 26751 -42588 -90801 100263 -64727
11214 118940 -95829 198217 -35297 303878 144899 104283 177383 90381 216316 -79212 124866
11202 75960 -77219 -73598 64787 48421 -52648 -25947 -132865 -26612 45221 63190 77446 21314
11189 100732 242010 -142208 -99637 -568 -89454 -257819 186960 34359 -201476 -110610 104706
11177 308526 -241845 -168851 -217295 76678 -119797 -175300 -42966 30947 77864 159121 303831
11166 303831 11886 -430381 75418 250146 249818 225651 168753 37212 -1585 156836 52166
11154 -103370 14682 138548 -96842 -410292 209184 -242477 47261 24397 -61110 112307
11143 70014 -38064 -68699 27163 32796 -323098 -88533 125108 109888 -1218 -538494 -121242
11131 127653 396964 324455 -534985 -97039 159975 19044 95915 111828 19433 114054 295421
11120 295421 36126 65607 7647 183238 -111541 10400 -35238 -66035 -117480 63588 266716
11109 266716 -42024 404897 334109 36822 -49415 -81462 34539 375730 131789 135351 116033
11098 116033 229732 315910 63990 191161 105524 136215 206800 283853 394211 353907 397697
11087 397697 320972 338025 187442 122616 207426 167191 -18541 453390 467931 381281 44445
11075 301618 162590 63217 305051 370084 785708 -4502 38195 258952 445842 643941
11065 643941 417849 575371 443045 630436 568918 560256 536643 544468 736836 542714 514868
11054 514868 797879 893457 843081 1000877 945885 616258 749343 999957 1052268 911828
11044 911828 947026 1126799 951640 931454 566628 677323 1112559 1048935 1058561 1016816 537079
11033 537079 734591 800605 712240 887823 596271 829320 904645 958649 827068 633091
11023 633091 888110 473975 586713 1292824 891838 889296 685266 702388 822966 824483
11013 824483 619430 680671 866361 507978 1014738 689237 696213 649166 1092272 722669
11003 722669 755304 492993 812441 620564 829566 387873 1136889 547931 875602 835201
10993 835201 1052616 941453 736104 648817 730195 818102 798309 1222619 576844 1246734
10983 1246734 1240554 1124045 1137682 1346640 1600769 1528429 1830415 2217151 1873915 2570726
10973 2570726 2700247 3298389 3385794 3839193 3758153 3371914 3825921 3133267 2995484 2485024
10963 2485024 1981324 2381223 2148408 2081389 1990259 2167705 2145732 2145240 1702103 1899029
10953 1899029 1794475 1510458 1139177 1277484 323326 752248 472240 761176 738303 447871
10943 447871 380255 387243 306389 322430 535730 331593 126444 -155892 -17471 163361 367761
10932 367761 -24599 86418 403405 -68274 125038 231359 539463 116040 -91278 33197
10921 214411 148956 246269 -109952 7204 -184039 -39301 -4218 -15711 -71382 -419412 232828
10909 130564 -87162 132083 -22537 -219048 -27237 -80284 -219767 133252 138448 -82399 -255177
10898 -255177 -407531 47391 -267957 186247 52656 34146 -283545 -14343 5430 -34412 111528
10886 -83684 -340028 221063 203652 56357 110473 -72798 -203412 -55635 245937 82192 65018
10875 65018 47747 -284011 -51184 -94749 -107412 -38735 -152388 110373 80290 -52911 13536
10863 59684 237855 401722 -14294 63595 197867 182727 7094 315348 415348 -83966 -70650
10852 -70650 -127047 -50046 -66521 32958 186598 132272 -203237 298250 203005 -61094 29869
10840 323813 1159 254366 99446 206216 -6972 193919 -323554 -108810 313664 118123
10829 -197749 85430 -171406 -47077 34422 -155884 -153995 -152311 -52499 152606 268726 -219628
10817 45400 59400 -122564 -80607 -58840 -323512 108441 34369 -112279 187245 -167569
10806 -36298 -356578 -190935 -69970 -114263 -155978 -58711 -39019 160920 39059 134599 -65236
10794 2569 -278040 -157777 -97130 -13237 -205844 -211758 -87484 -37928 -41054 -32869 -181363 -232032
10782 -232032 -174246 172248 -74636 98985 -218892 -177858 -68222 -152355 -233959 5875 -237601
10770 105848 -320050 316868 62759 -41708 -120093 -94562 -59719 -316060 -28208 128869 -208646
10758 140579 177150 -134617 -209364 1546 -222486 -238197 154948 -74044 -212875 -34244 -178778
10747 -178778 206331 -96133 -218680 -43196 392 -152711 -129058 -151440 62584 -81465 -230291
10736 -230291 342665 -44478 216477 -717 -62731 11953 -308332 -271857 100521 -295795 -15140
10724 155291 -167754 31921 -146391 175672 -305084 75800 -375764 -253602 87136 140344
10714 140344 67064 -249760 120164 -152551 51048 106596 -80295 -124521 -235315 -5560 72271
10702 5412 -65227 122071 1623 -297824 242117 -129670 -75012 -173092 -216210 -138414 9611
10690 214079 -95931 -194542 4655 -309789 -83664 76779 -44204 -114239 -86757 -175838 -213785
10679 -213785 147903 -152457 -39304 -81932 -141515 112179 40109 50583 31191 -135151 -169657
10668 -169657 127902 24810 -210305 -256536 17302 31336 60947 269296 -193752 -40065 -120466
10657 -120466 -110851 -52944 -216651 -17411 -61882 119095 7581 -128211 -105351 -271246 247260
10645 -145211 260603 39311 -186748 -5155 185285 -145019 -32451 -102292 51821 -70682 -172411
10634 -172411 -73863 -187091 -198502 -145800 236663 62226 -447390 -97281 -44627 172217 2698
10622 -144018 45898 69790 -40703 -41397 -138001 -146925 -69981 -25745 -170823 182782 -205037
10610 -187066 93770 155143 116443 -350793 -200950 78783 291257 -422024 47761 -69652 -25022
10598 -247212 -46406 243937 469820 -65333 93568 -115532 109893 -86180 -148956 262690
10587 -165218 -126423 64741 -59869 -224860 -17033 -31536 52419 212378 117826 -5274 -176272
10576 -176272 94563 -87778 -74727 -440494 -210411 -181219 17031 -130838 159 67167 -328616
10564 130567 46146 -9578 -71094 -83780 122402 133576 113410 53447 -234846 -108992 138659
10552 185852 238422 -155534 191408 59719 -426407 -113793 110149 -27981 152962 -185222
10541 -290868 -154174 70753 179816 34628 110210 79945 -22936 -83262 116323 -258796 -96371
10529 -8537 32090 5610 67443 -395552 261613 -187918 9995 -35654 67549 15496 15195 53015
10517 53015 23990 95870 96962 9449 -149013 89417 -101608 -71485 -263124 -326980 71165
10505 -133381 -332405 -52095 100021 32672 294922 -29414 -322299 -158792 44449 -279338
10494 -134706 -61857 -257595 18893 -5926 -371028 -408738 -108912 227926 -122140 237813
10483 32646 232598 -77867 104832 590987 75630 531174 96528 252879 290312 -263596
10472 -344638 9651 46932 -75986 86463 8976 241159 -355339 254001 -86884 -97012 290822
10460 18930 107906 406751 28591 312 -57565 -17806 -98707 -176911 -141546 -54579 44481 -28486
10447 -64508 -220240 -13102 -128926 10456 6753 27029 288309 229301 -129966 54336 -98450
10435 -140670 -882 86119 11727 -238222 -12966 -158316 -292143 -177107 282237 -6100 252701
10423 -415394 -429601 369493 236059 252702 55499 -27390 -77795 21677 247311 14925 -96061
10411 55710 63716 -42635 -27899 -275440 30545 -135696 -319721 -9436 -154391 127021 -12748
10399 65961 -65934 135874 -161028 -146512 165228 70122 110217 326355 -18149 8696 366942
10388 366942 -88730 -65674 -87888 191487 58196 240600 218288 240926 163599 236991 515788
10377 515788 195535 -10405 220749 171724 346470 278387 148544 46043 378386 397365
10367 397365 500020 432930 807307 661293 323168 377902 369419 257087 261071 382965 342168
10356 342168 144935 42276 262303 494048 353470 447479 809695 404238 667952 679251
10346 679251 227271 177300 531603 248621 510860 186702 262584 324768 406217 369681
10336 369681 285570 384795 -112940 118263 47198 58379 -1137 166247 95891 -12048 -20372
10325 -20372 251765 366763 -73739 30915 302658 182369 304797 280100 -290200 133120
10314 476818 153611 -238369 376274 113609 237993 -51855 61794 34315 438950 23068
10303 -59286 -275500 -49297 -38492 -50764 -131195 136091 -232740 82092 -55809 -468566 -132102
10291 158560 72748 -21160 112772 -100334 -118618 105151 -207282 23431 -2067 -41374 242438
10279 -229400 -120901 75409 -281178 -183639 -95527 240873 -63804 -395816 -198541 128071
10268 -194477 -20961 -262988 63720 -118738 15710 -248418 86491 -255704 332719 185345
10258 185345 89138 296558 195060 93029 361292 94855 33072 124140 179259 -105577 -97910
10247 -97910 -158611 143501 -12004 -118824 -293949 194599 -64633 -41895 -121597 -281829 -221640
10236 -221640 46095 -263421 -89558 4765 255140 6825 -336174 164175 185393 190519 276971
10225 276971 -18613 47178 40072 245678 184959 -15677 32989 -71737 67766 218261 -48072
10213 15704 126371 -178228 -79012 -136348 49215 -95314 -46303 -358611 133434 -13826 -127738
10202 -127738 -60625 132347 36994 -142587 -259334 89720 -113981 314769 -116890 180908
10191 53476 -256213 -379888 -266371 133987 -184140 230821 -47921 -239509 137517 -63250
10180 -327337 182032 24792 207810 -264059 63909 -82886 78303 -136866 -90927 -195557
10170 -195557 -184339 138711 -10184 205946 -302540 132645 -49064 -1505 -227648 -288553 -13500
10158 -245231 194595 -110360 -232083 -15744 -106471 131334 -64921 -34738 -220308 -138483
10148 -138483 -207704 -217211 -65467 -194740 -127477 -102398 -310910 370356 130891 -486112 502527
10136 -318051 -188340 -61342 5541 -199555 -43986 -230851 -151185 63884 21409 76790 -160220
10124 -127920 -93991 -226198 64494 107988 -339902 43848 -49489 99031 -53623 -32784 -51088
10113 -51088 -24153 -262346 -52615 3950 34025 -59263 -219686 308739 -23427 -109890 -165644
10102 -165644 52167 -108507 163424 -53629 48733 -173491 133442 -241751 -206668 -89081
10091 35761 413046 -187859 358258 189596 -447364 20787 -39309 -62381 224177 -42170
10080 -57488 -130316 7009 -53099 167568 -230732 -131715 110946 143033 319837 135776 -3969
10068 81063 249389 18927 -17209 -177793 -245280 14040 -290112 -174723 -43580 -162260 -77376
10056 -126320 -184477 19228 -436992 7718 28623 -146708 -203709 74601 -70647 -33949 145569
10044 59372 -69604 -54953 -289181 3803 165982 -333160 -547337 -221973 288047 133862
10033 -189208 86454 -10417 -413519 12490 -158895 -102371 -35742 30566 268574 57813 -319209
10021 -483010 86645 -268602 -236029 -121221 -154152 44147 -58395 -185914 -220952 188610 -362705
10009 -92250 -16739 -157820 -95320 59655 -5325 339972 333430 -34180 -190048 -181039 -291664
9998 -291664 -138425 70121 -233941 -114586 -145915 -223046 358025 -278635 -103799 -51746
9987 -289600 120644 192860 89206 381287 -35874 144546 -61427 41130 144357 -201900 454
9975 -321186 -40281 274162 -109461 60186 -144488 71301 387727 -164767 318243 -383764
9964 73346 -60327 -151994 -251300 -18178 228102 46714 -59549 -241311 4634 -13249 1252 -206626
9951 -129824 14792 -252514 -3594 -222048 -37530 -185645 -35996 -269679 69702 47859 -19606
9939 35802 -145704 24354 50230 -392560 -213175 -132968 -107035 212489 -130499 -528283 59505
9927 -295828 82390 -180918 -179850 -224857 238631 -283631 -19734 -294934 82965 -29168 463655
9915 90809 -285812 171594 258779 255708 -163758 7752 32741 -95847 70052 -251256 36217
9903 120139 14171 52092 279458 285546 22371 74698 3831 10758 -162125 -156444 14790 -63162
9890 118184 168965 -109070 -3900 312556 -447938 4642 -183449 -166971 69485 -72455 5697
9878 -54343 128865 -51726 -70661 30895 -243329 -183870 80168 -17336 -114701 -175888 160704
9866 201623 -75178 121127 -311543 -151892 68910 -2277 -9857 199534 30555 -131124 49636
9854 -244529 101876 -105264 -102755 -203460 -279699 -18512 -111555 -406868 -224130 20394 -116168
9842 -353749 198092 200571 -177887 52830 84417 -241732 26694 -24002 -103835 125572 86388
9831 86388 -127696 -61098 -248187 -83964 36506 -180421 331942 113559 -30253 -312566 143616
9819 -221185 38171 -150913 9316 199339 227930 -219484 56949 -178424 4389 -87112 -176483
9808 -176483 61203 -317654 -222100 -285523 -108179 -88028 359517 -207293 246535 -374089
9797 -212434 -215156 -97820 -186707 -305621 -118087 -7755 -268158 -115688 76607 -88372 83511
9785 -411847 14917 105087 -109700 -181339 -350844 112109 116081 128981 232169 20464 -96430
9773 -203358 -143443 -204893 -103510 -231922 -29179 178117 33846 -215016 123932 -28004 -93488
9762 -93488 287996 -82039 36834 -4102 134946 -121748 112713 -23875 -145948 -26141 233013
9750 -432861 -77417 143230 -84051 -249368 -106631 -47765 -233211 30379 -94740 -97161 -211907
9739 -211907 144495 -191102 -10489 221237 -296131 -149304 -89595 -66747 -302013 -184903
9729 -184903 145788 -230939 -381189 24964 33404 -244204 99603 -260180 -11851 -47071 -112498
9718 -112498 112869 10936 -115690 -91362 196107 51240 -226382 -89958 32251 -113820 163166
9706 182202 -180674 -335501 -80387 -129755 -192197 -372270 -147526 -107458 130114 127813 11556
9694 168089 194511 -170367 -199875 -98263 195950 -73828 235308 59872 -182573 162573 -312202
9682 223432 -69958 -128023 -235513 -112275 131796 -368847 98326 91577 -4472 -34378 168019
9670 -226798 -176219 -136405 -222932 -150915 -283027 -190636 -330219 -184314 216923 140899 75408
9659 75408 59287 -325768 -230693 -172940 10852 69655 72847 87453 -72295 -279103 -143833
9648 -143833 -19933 -282239 350236 36492 -101769 -179922 95420 142997 1146 15503 -53103
9636 -144825 13535 -386004 122457 -55359 235321 -33414 -140765 23861 156882 -72939 -71939
9625 -71939 11910 2549 178602 -220076 48496 -205025 -266440 -121321 -107096 68808 351490
9614 351490 -135312 -300763 -171907 20807 88830 -63615 305108 69094 -67803 -107033 -90144
9603 -90144 33580 179321 -82861 -27276 -107535 107601 -212092 -210406 -44567 -235751 187408
9591 -3098 -3239 171100 65112 251014 -17587 -315072 -278372 -62078 -81536 -15509 -1234 241272
9578 677 -227646 -97528 59017 212937 280040 -229234 -526364 -118653 307357 139094 7383
9566 -344786 -81829 68058 354092 -487177 -117645 -182077 -170067 -283966 161093 106028 43689
9554 -416742 -271052 127751 50751 4714 226915 -90336 -95677 -151717 -47257 109704 -183403
9542 148007 110384 173961 178917 -371635 -367539 -136395 -168527 141642 -183850 -57431 20084
9530 -71034 241721 -526592 -325385 118126 -321878 -416607 -363779 214345 239154 -191758
9519 -74211 442933 -204341 -89188 41673 -220391 35903 42361 94398 -195894 -4314 174826
9507 -180246 98233 2511 -36935 -129416 -109031 -119389 -436893 -275924 -43639 -139622 -187500
9496 -187500 -247871 101995 -155620 -114599 177100 -79282 273958 51243 108370 -112719 143680
9484 -186669 -2917 354677 -238159 -107553 -91523 -212238 142742 -50150 113574 202359 -149107
9472 174764 117400 -3695 -60954 -188418 -107833 -221948 90635 166449 -248467 -183873 -101754
9461 -101754 -77499 52459 -104726 -105816 -76918 -216316 -309583 19508 11530 -8021 -157958 -274714
9449 -274714 -97633 -120703 -32254 -177150 122994 -68623 -105044 -145720 -49969 -203621 -191688
9438 -191688 -39257 -185443 -62125 117835 -25451 -67347 131354 92338 6815 -190877 -115258
9427 -115258 -225229 -3662 -172719 171067 -330326 65257 -265789 147711 -107079 -70017
9417 -70017 -226909 13464 148288 -25745 22637 328704 -225919 -362096 -235534 -268145 44139
9405 -41799 -143623 81672 -205665 486281 -418243 58287 -283794 -434829 146220 79671
9395 79671 -86002 36295 52052 337378 26774 -43630 80689 37248 -304971 -52092 -297531
9384 -297531 144140 196782 -234838 -243490 215537 43165 81322 -21288 -267391 324841 -253134
9372 -160407 -214161 -184670 25880 -326713 -147899 -61271 -140583 -174821 -217539 135634 4991
9360 -289620 145838 -16092 -20063 -240275 34209 -190172 54088 217418 -31227 -251354 -84984
9348 -68613 -144984 126816 -120481 -303915 2267 50508 301715 118471 104398 230560 -316244
9336 -101025 -25828 35039 -216038 -376603 -88007 -64425 162500 74350 125267 -194617 171830
9324 -206523 -36726 -47670 -334670 -148435 138386 -142289 185171 100131 82379 -350079
9313 -197779 -68088 235957 -70831 -12834 -285624 -169106 -68504 220188 11822 -63101 -39898
9302 -39898 61621 -26777 -47163 -95104 86641 111690 26135 -236130 -394449 -161778 -215513
9291 -215513 33498 71685 93923 -78075 -99672 22268 -103134 -326337 -301844 -346814 -78992
9279 -143532 -251537 25909 -216456 -113649 -40797 -306826 86448 22857 -15288 120974 -71742
9267 -82270 -236767 -63905 -308879 -24399 94968 42656 -110520 25742 -57153 254928 84395
9255 -204173 120554 516027 3056 -187138 31495 -112477 -280949 131303 -54159 -47917 -274748
9244 -274748 -578484 -6088 -339987 -159429 -246278 -342188 86486 -94891 -101968 -455508 53205
9232 -179189 35561 -205614 -604272 -94915 186294 -150122 -53743 -155978 -14431 -130228
9222 -130228 -29876 -83064 42149 -28645 -146136 -92534 -92236 285849 -259386 -118794 49883
9210 -101366 96490 -328362 224922 71747 243585 -74698 198860 174883 187685 95860 66066
9199 66066 -328955 -18078 -93087 -323510 -63821 16532 74000 -31896 -158594 -53978 74805
9187 172557 257025 -297266 -25038 25221 89786 -406990 -63832 124169 208573 -23953 206873
9175 -129234 102286 6757 -298303 58281 104784 137421 308822 49238 -11798 -71707 -15463
9163 51411 -125409 -10778 96857 17217 205159 -225185 -167396 -23062 -93299 -210392 55080
9151 -16159 -173485 -152322 113112 -68214 -207037 -30669 -52884 -100993 -154038 -156090 -240825
9140 -240825 -130608 254518 -164980 -77283 -181882 -41381 63893 -392994 62472 -65924 75685
9128 22355 -186031 -11169 72131 -124264 -274588 77668 229805 -84670 -192643 346067 -138225
9116 183894 110401 50340 74071 43348 127353 -147879 -53482 -1444 333181 -223544 261549
9104 26344 -31906 72134 45395 2949 -204618 9697 46645 203277 -68634 -193913 152291
9092 -123257 -339548 -25344 -211915 -32200 139826 309193 -140483 -312649 -36293 132428
9081 80006 -112501 74801 -189881 220941 139871 39465 -361083 -121473 6042 -87302 -161835
9070 -161835 -22042 -237210 -286014 -190382 187806 -166432 -179183 -94588 25526 -345637 -184835
9059 -184835 -39401 -90152 -297836 -157280 -1565 -406491 -245803 -135801 288515 -13749 -177459
9048 -177459 -435318 -102860 -358270 -149659 -11822 117722 -163936 -244841 165085 -83942
9037 102129 -176832 -428558 125702 135803 -272481 -221356 107791 -86621 -148267 -36160 -296949
9026 -296949 227757 -169510 96411 44418 183983 188810 16217 24058 87378 -187759 267910
9014 222397 30374 188182 -355420 -48382 -55382 22399 116654 -93128 35537 84930 -59586
9002 36969 -169868 -74525 23082 -224825 -13895 -69607 -302510 10546 -76057 -85170 144135
8990 -70903 -456474 -180432 -67507 -155296 34863 177783 -385602 521 7025 -294619 -151029
8979 -151029 -266533 535 -464674 -25009 -116064 -212780 117175 -485582 43155 311107 -17876
8967 -58091 82509 -152391 -211490 -98469 289398 -163086 20355 105225 3240 -44656 -463 -388044
8955 -388044 121487 -191422 -87256 -175837 245761 2639 -52529 -296579 -395026 -29434 10838
8943 -123545 -33625 -125098 -64523 -425901 -236942 7268 222641 -55044 77700 263015 -115474
8931 274545 190157 -13373 -88280 85653 -62420 237659 207717 591072 985432 3860513 9288286
8920 9288286 4019034 1267767 711777 464356 60323 280160 -255634 2914 208095 -208707
8909 -171905 40805 -304290 254262 23203 46717 -58374 -137253 -433602 146411 77968 -320742
8897 211090 -86576 -151394 -364437 -34018 178524 142788 -150693 -169687 -126959 -139239 -51571
8885 -55013 -467574 122383 -14197 111587 31695 -129026 -9258 -203821 -209136 239533 -83715
8873 -2085 361905 -27703 86836 151419 13686 -132529 -98427 26857 1647 171370 96099 -311237
8860 -229967 -345457 142941 91085 -134000 153723 -104027 61849 -137598 -178345 -36412
8849 216235 210744 166524 -532855 -332669 26883 162103 -372847 15108 -93296 37876 -77529
8837 108958 34564 -7421 138101 -245121 -286263 -78785 164026 -382350 -174584 27915 -200216
8825 -51121 -58785 289169 -3627 25546 -6192 63188 -306603 -125961 151637 -46310 -15683 -225086
8813 -225086 -138242 141527 -95203 -48518 -69229 -83391 67229 -375427 -238513 118498 420879
8802 420879 -110609 203675 -184862 86416 -87368 75742 54468 -19435 -292680 71258 -5858
8790 92541 -409919 17451 35487 -339878 261888 -8117 -188993 -53352 240860 -2028 -146474
8779 -146474 376356 245847 -267175 -30451 -328150 397420 196993 7456 -269772 27230
8768 331073 -162890 10830 8103 -82507 -34936 -79763 -136806 209035 -201385 -187654 278592
8756 86951 -361202 16896 -267027 -288683 -198355 29429 -6027 -132069 122422 27894 -388075
8744 -158908 -222621 -131218 -228238 -383846 -21721 -465704 -35297 57772 -11973 -140168 -200054
8733 -200054 197593 -190821 -418823 -131354 -14711 -268307 -56044 39680 -16985 245212
8722 47742 299317 45396 48310 261095 -169838 274116 192801 -294226 19501 80708 73353
8711 73353 56213 -116571 -239281 316874 132598 17913 87894 -233170 -233638 -210252 338311
8699 -37229 126121 -193145 20743 -231840 -145144 -47456 -331356 21457 160609 78534 142358
8688 142358 -117580 338544 -76278 -93592 -289059 21709 -11425 -345685 358925 46425 -61625
8676 -95064 -42260 -58187 -44642 -96561 25479 2780 -164581 -38292 -14095 79723 -48024 -199913
8664 -199913 -175566 -55394 -2487 122302 38877 -58123 74698 183840 105717 -280865 -382055
8653 -382055 -191770 -110364 -198902 139562 -266591 -119979 29573 186689 -90196 56166 -33028
8641 -52525 -276442 -189252 115949 -161905 -90150 -107084 -152475 93866 137111 -4560 -21012
8630 -21012 -301685 -258537 -41573 -17451 -250708 -234234 -9986 -389233 128019 33673 68111
8619 68111 -212119 -111470 -99833 -9750 135763 -190073 -28993 -236171 -16012 133345 -168309
8607 138720 -359254 -211744 -230197 43822 169555 31203 -145413 -193472 110054 -248500
8596 577 185139 -80428 -146197 -139059 9525 -133993 -2269 13389 -245876 83615 53092 275535
8584 275535 -176560 -17756 -310255 -75019 -135320 34848 -89840 -134153 267192 40258 -74659
8572 195602 -3566 136740 130748 -59453 -88818 -93194 18132 -94830 73822 -192807 137934 90875
8560 90875 146472 57463 -9710 145983 -521355 27100 -32231 -124126 -15876 -98699 21540 -213183
8547 -271913 -17176 -25593 49918 -28289 99645 -436763 -171131 36391 61960 -159733 -104539
8536 -104539 -245452 90363 -42422 102553 -203915 -88228 -206495 -213727 -80046 -152405 -40621
8524 -220253 293782 -58487 -342979 -140169 25570 -362330 -190007 -155450 133113 -152048
8513 -113800 22657 -172433 192600 51773 32524 -22682 -83669 -261467 221059 68376 -118378
8501 -13376 -172023 -338747 -91881 -33509 -207312 -88954 -67000 -451797 -235116 -304747 -56423
8489 6843 77035 160623 -154628 218907 -233106 -202263 12310 353283 166062 -202915 -354217
8478 -354217 -164408 -109149 -99681 79385 117189 -276281 -50719 -45695 -253945 -97489 -146018
8467 -146018 -336582 -249618 -115411 -4576 -211647 -41523 -228911 96295 18285 -119863 9671
8455 -23622 69291 -269554 400323 -113981 -316758 32432 245232 -198870 -139351 -233524 -335790
8444 -335790 27502 10674 163089 60463 30400 -104189 -123459 6928 -252834 -172889 -104748
8433 -104748 -254769 -151161 -334891 192097 -186016 -65884 -220512 35871 24315 39206
8423 39206 -21599 -88020 -128696 -32961 5155 28951 -19314 -141986 -34763 -36897 76755 -84033
8410 -131888 206107 145441 43362 -83966 54947 -237996 69711 -171751 113047 10681 -68183
8398 245223 267164 20963 72609 -104551 -44125 203451 -172269 -132343 8525 -87451 150449
8386 -41339 54900 161062 -125832 -109480 -68461 -337637 -105916 -269848 129813 -96274 -118645
8375 -118645 83842 -183267 -183524 -90082 272974 -168907 -119012 -77316 -93954 -42970 -57652
8364 -57652 64374 136884 -141168 -232827 58275 117521 -67608 -30786 76630 -154983 115447
8352 -193668 -297109 -50425 485046 -226323 375518 -55901 -593132 77205 -58646 -142742 185082
8340 4882 -226278 114751 147185 115402 238807 -246442 -141798 131855 -7103 264525 105928
8328 200000 -93018 -103919 102471 -384934 3309 18608 -91196 -47628 193476 -234354 67197
8316 -237274 -4076 -78870 177855 14623 -169641 95923 -337432 46801 -48035 109636 -160601
8304 -6151 66254 -310570 -40682 -119367 -102378 -661779 -74902 -309077 168118 -17885 -110534
8293 -110534 -46727 -36661 -174481 133378 -118218 18867 -85283 -24395 -70003 169811 99752
8282 99752 70447 -41201 -139968 90652 -198708 -633539 -210048 140066 184542 -31710 71614
8270 -342120 -1907 -238376 104979 -224053 204220 168559 -623893 -104193 160814 -38021
8259 -94845 -182944 -183201 -276433 189222 145791 159855 41893 -217929 108226 -232147 -68329
8247 -109057 134455 294187 -59089 -86858 57079 -69844 -240610 -3168 9470 76317 -102748
8235 129749 315001 -216311 164562 -273580 -212083 -141669 -302414 -240026 -110025 -62146
8225 -62146 17155 -237718 -134830 18320 -37630 71890 -122648 -134834 -329849 118682 64880
8214 64880 -178199 198907 -108949 18650 54090 59267 31280 -36727 -98603 176397 -100934
8202 -106275 -22771 297340 -130165 -406667 69228 68943 -439727 -111180 -132090 -204586 -229426
8191 -229426 -4328 156774 -389045 192942 171673 57764 280775 -32086 -381411 -73446 149757
8179 -298967 91883 -100741 173568 60207 -232277 244811 -104599 53743 -111698 116046
8168 312011 -20064 -326087 66895 -346991 -183082 -175570 26315 -214589 133035 -143469 -109219
8157 -109219 290763 -116245 97126 31305 143328 77390 -130287 -468551 242749 -109704
8146 76410 10468 -135974 131836 -388779 -206273 120960 244108 241823 67834 7010 -75757
8134 172134 -169432 24339 -148914 -307620 -102937 8075 -248370 -152334 -194986 -28820 11750
8122 149546 -73964 54669 -240916 10888 135040 -89424 -153440 -14878 -320437 -84726 -18877
8110 -66611 -39787 -77678 73594 265649 -177471 -19969 -81020 301309 -394459 13929 -551952
8098 57 319824 -1662 -145767 -94445 -144998 -177304 -210707 28673 -183994 191868 -231199 -79647
8085 70482 -141697 -152677 -73952 -175936 -165473 142285 125649 249514 -122758 -47205 -111236
8074 -111236 8503 84821 -256464 -268545 -444949 175328 -223985 -185031 115211 14798 53612
8063 53612 38241 77357 -375833 48753 -21469 258542 -158391 28540 103566 123088 46449
8051 142988 -149880 -164380 108741 233180 -206078 8625 103161 68713 -342857 23573 2797
8039 -119139 -220627 -92736 127173 -206682 302577 -142646 -31217 -91600 119417 -166343
8028 -330958 -129006 78886 -48977 -303869 -34443 203845 -290722 -90491 -119829 -9831 -35986
8017 -35986 -153813 253219 -48030 99407 -253555 -104642 -238298 222029 218369 26093 24845
8006 24845 -27714 13515 -149208 -87424 75457 110570 -31143 -346892 -439602 -4107 12345 -132856
7993 -9027 -45125 -144779 147926 -98398 146566 -61302 -27788 32566 -80878 -51014 103001
7981 34635 -71755 30200 -130569 -240791 191470 -13358 -229997 -294840 69147 -369125 140943
7969 192670 98569 -186019 149606 -221622 -1354 -231147 -158363 -20326 228979 33661 -23650
7957 277689 51325 206284 -220349 -34663 43903 126842 57263 -74202 198720 80963 -47575
7945 -168375 7233 -250721 -189329 -71778 -14697 -95664 48119 -77447 -164802 -12832 -155226
7934 -155226 -104095 -48762 -171394 -242614 147934 94381 -184235 -33640 305640 108218 -180516
7922 -182733 13886 55793 146593 144885 -68745 -81505 -251388 -274871 130943 156347 -185867
7910 326816 171029 -161256 -1145 58121 -123753 116979 -58943 -183112 -99290 25881 -239353
7898 69831 192548 82946 51260 43817 113368 -2403 33706 38355 -152841 -18834 377422 334115
7886 334115 120540 24439 -37524 43614 -414101 141165 -1767 -108179 -56154 -61003 139088
7874 403837 -68934 -145035 -159938 -53866 -124319 -68337 42000 -221189 -14158 119487 -122057
7862 -46909 -262646 -50484 90976 52332 12045 -2558 -136715 -5063 8216 294412 5313 -49870
7849 -330115 -368622 55264 -508861 197996 -363416 -20165 46400 -131729 -138145 271487 -249554
7837 -41105 -157046 -140719 82035 125056 -27323 -184800 -191537 -25935 -45811 121182 -457199
7825 10548 -249517 -47589 -20446 -102390 -18273 -213656 -110756 -43359 -745 -433894 270371
7813 123688 174635 -155784 -326573 136282 34666 228312 -235632 6418 -44362 -308525 -118706
7801 224574 54702 -32369 136120 -236658 38777 43312 -103687 -300554 134736 10679 27922
7790 27922 -133471 -206739 -61567 -183698 -75287 -19828 -229975 -129736 -88297 24313 -342782
7778 -59979 -140629 -143132 -41193 -195752 -169959 -646 -271213 -18474 -143200 -166058 -214074 61718
7765 50931 32822 119102 -95417 317331 37802 81144 -42677 137011 105406 28470 -50559
7753 77037 198854 -263602 114530 54104 328519 -376469 -8599 -256398 -34835 -84059 2097
7741 -412591 -110384 310807 53498 -194578 -110768 -254771 187308 218717 -124780 -187291
7731 -187291 25312 -15998 -5006 -340533 -148536 162158 -209883 -24973 -218999 -22510 139807
7719 -115606 206796 -104771 175903 34573 -329124 14762 105808 -350065 -105388 8806 -127966
7707 -195212 -47157 -244901 98921 143915 -199913 -227040 -122904 -143029 53240 -50143 -12873
7695 179594 -50322 170105 144195 282949 -3038 249510 254310 -169697 12584 -45278 41219
7683 -277790 195132 -59215 -21067 -204466 -40204 63538 -85328 -226379 -257575 -221561 -424538
7672 -424538 -122630 34721 -142575 -114557 23273 15339 165780 -269624 155281 63147 86438
7661 86438 122875 -236275 68417 -205723 63112 -89574 -228878 112844 102677 -347980 -376284
7650 -376284 105335 -163263 -59904 36791 -317744 92711 62866 -139326 53199 -225792 -231082
7639 -231082 -89482 107130 71857 33805 -235652 7490 10079 110388 -164135 -10355 -83105
7628 -83105 -117766 151416 200799 40408 47430 122996 9742 158030 -52513 189784 -28054 187432
7615 -79553 -44854 141121 -35418 -27351 -37458 -94877 34351 -87800 -272870 16383 73250 -368785
7602 -132786 53152 27296 124823 -238397 -130451 -146390 -24423 -77333 250885 -162023 216504
7590 -234453 -110631 -77943 -137316 11268 73961 24784 -289795 79954 53652 272295 -137600
7578 7932 95455 -2306 -122510 89145 -243767 -71161 46375 -253543 57408 -238746 -36004
7566 219897 49081 -284698 28551 23 -131233 43704 -284481 -122700 -75471 78866 75618 -214823
7553 -94686 95782 -148301 39242 -181318 207036 -23236 367720 31434 249316 -275615 -51247
7541 -255507 -258386 -38150 64438 -297358 -202393 -124250 -422083 -40054 -120178 -26137 -206369
7530 -206369 7982 -77447 -72498 -96782 -113949 -76348 -268670 -60173 -326067 -126517 -60827
7518 8077 -160088 254729 -44961 -123087 -140672 69397 -46051 -312825 284467 -148407 -80314
7507 -80314 349621 -103847 -92010 166117 -63890 -188867 142674 -332121 -35227 137626
7496 -141906 3546 -17438 -166684 200839 226890 -120128 30350 -14478 414171 213743 207119
7485 207119 6959 -51993 -71909 -109438 -271395 -40250 -220995 -32159 204303 -32411 80220
7473 52053 -293344 -162194 -56600 -74187 -3418 95605 -180508 381342 -403721 -158387 77727
7461 -133912 -150656 -166109 -106987 236682 76770 -471619 -118917 -460796 -28004 -77755 64783
7449 -82404 75566 -97325 -121089 103019 39613 232727 -258093 352945 -117582 261273 76269
7437 90487 -82920 -268783 112786 55632 -165264 -43207 -146212 -113154 107686 -143649 -152293
7426 -152293 -344325 -32782 539527 10161 23175 -86058 152930 -136661 121010 313716
7416 313716 -119869 -151176 375494 -213264 2862 -40087 -519285 -487748 -112519 -79060 133005
7404 21788 -272095 -116881 185057 -192285 -91191 -25339 312772 -296888 27435 83737 210854
7393 210854 -253800 378970 73026 139665 -409818 -117291 -181465 -356927 -114473 41064
7382 140417 -152829 -73598 -130460 -315177 -77043 147969 -106168 -269191 -99779 -38203 14377
7370 124279 70362 -78009 -259192 269263 9753 106519 -121903 -78520 -148408 296278 192139
7359 192139 -70090 82455 -313433 -20040 -334786 -15026 75078 -240472 -78140 107018 33997
7347 -336571 110604 -177665 -16672 156785 59186 -39037 4967 -27429 -55334 -225558 -220203
7336 -220203 455753 -287946 169485 -109334 -148134 -201114 -5368 -7240 255622 59471 -307415
7324 -441147 415890 -206587 131478 134821 101037 98361 55555 -173382 51482 54644 80006
7313 80006 57032 56313 -70895 226660 -101742 -212544 117606 32906 74876 -131914 -134327
7302 -134327 -173815 -233284 -122329 -98687 -53096 220348 -234770 -344688 67096 -76820 108693
7290 -43947 -288372 -147693 -306067 23243 11669 -77772 -18741 31645 -240842 -120654 261311
7278 -291797 -61957 -186702 -17301 -137896 -125444 -329003 105379 18555 -156342 -8996 -120970
7267 -120970 -144004 262427 -237799 19367 193363 -127604 -166211 376845 92951 99363 -300964
7255 -58385 -39741 -122664 -314142 164088 -51375 -215637 36107 90585 -23916 11045 -127740
7243 52172 -12446 -220266 -113645 60831 114657 67335 44005 183430 54104 -276881 -47796
7231 -120255 -193164 -204739 171773 110510 -112650 -344178 -71209 -227641 216367 -188972
7220 -170970 -1311 53061 -38588 -70130 -2308 97028 -72983 -108197 83989 67833 -73654 179964
7207 243479 159435 14187 100173 -90637 50755 252068 8523 7186 -187120 184245 15654
7195 -171884 -110605 -64395 -77076 44193 23310 7439 -227514 206699 -119004 155004 57824
7183 -5191 -7049 13721 224310 -222667 -77066 -301805 -81453 -235987 -5859 -91957 -28388 -78274
7171 -78274 -50726 -117692 -97271 -270038 -183968 -13439 138272 -6661 -263005 93697 -168477
7159 -104805 -142521 28025 -111548 -190504 -297897 -161165 -21615 -171574 245350 -214065
7148 246920 69641 114028 60521 -56302 -57936 -126233 -342901 -228827 -60407 -66856 397497
7136 -295987 26257 39669 -169173 61556 33201 -73161 -364014 -56624 201272 -15235 98558
7124 -164602 -229922 -73654 37976 35441 -15780 53631 57721 -288700 -127027 -67884 -276193
7113 -276193 143277 -121607 -51696 62185 -33580 -174511 -130093 -325783 58357 230815 35521
7101 -193707 142092 -114254 284157 250955 -155527 -104058 85976 -253427 -80341 -1758 -278689
7090 -278689 -20410 207998 -124487 -206087 -134374 -131776 93310 -298463 -212801 302940 6287
7078 106610 251197 13979 147880 -89330 -135918 33155 298517 -181711 170666 80715 -101488
7066 -259541 46614 34892 -12024 -182230 -117727 -33479 -17064 86252 -9573 -306619 -222444
7055 -222444 48984 -11734 94680 118892 -14083 181189 52510 256767 -129497 -183863 -64330
7043 -172316 61276 127825 200304 -55350 -199225 74829 -331878 392360 -106242 104689 -108033
7031 -299448 -138380 -116222 230 -134317 -34334 -79076 -96863 187599 -21871 -20056 152454
7019 70006 -89625 -168769 -200778 116124 378441 290955 -177547 35373 455421 -173910 -82758
7007 -169438 70119 -93645 16894 167391 6427 -103325 -197267 207946 -65837 -371297 -140431
6995 -16062 54364 -282700 -100271 -53130 -93931 -179286 98405 261524 66656 -130683 68723
6983 111548 -13575 312162 -245738 118310 -210355 -139441 47352 -1366 224817 36802 -95257
6971 -83190 43435 -182600 35003 -111797 208207 -58167 11127 -51260 131262 144388 270243
6960 270243 -4560 -70365 -82138 -50206 -265173 151996 -231407 152109 200199 -146370 -119274
6949 -119274 204539 -173079 -343119 68033 126426 -278764 -145623 -84597 -226246 -38486
6938 166020 -130156 -195534 -412153 309380 -80686 -182041 -19733 -139337 -360503 -218497
6928 -218497 -97846 28836 145426 -191778 172668 -340715 2407 172120 162192 123460 -72477
6916 -232030 59700 2959 -39636 140234 -25281 -187416 -260426 -170668 222247 -39992 -447355
6905 -447355 -147939 -167829 22357 -252443 -78666 74685 -222260 -59214 -274797 17246 -41454
6893 -108403 -67604 205022 -159789 -114223 -78736 -127675 94016 -96769 -125476 -24550 483012
6881 -41934 -151377 -264612 195383 -41455 -222450 -81706 -36166 136981 -342142 38288 -213358
6869 -72562 156536 193954 -214459 -96309 214855 40806 -14074 -125380 253264 -97755 -161089
6858 -161089 355700 -59384 117249 -94497 -108135 172476 -277150 -249000 127195 -161978
6847 54109 294621 2989 186172 -55810 -95216 -85570 -161670 -86610 -115439 -110045 -122060 -129892
6835 -129892 104038 268219 -178224 84731 171591 -63796 20613 16373 -215873 57123 36676
6824 36676 -12464 -69608 -221564 -226877 -190240 -42276 56379 -148415 -218459 -199532 -100574 -165777
6812 -165777 247286 -304032 141663 254238 -302622 118730 138600 -181960 -373082 -278994
6802 -278994 -93150 493691 -28819 -52779 -326465 2112 232342 199645 -128524 -170936 -61623
6790 -132819 98555 -200871 55927 258568 33733 -84756 23434 176110 -372557 -51867 257508
6778 108595 -245373 17838 -362198 267156 215798 74252 -120040 -29786 -292 21603 -92679
6766 -104602 -3995 -102794 -107532 20491 -55295 -394956 -192411 -153500 -259665 185529 -248732
6754 34677 -226027 -220471 -12797 140958 -53855 -182117 81691 -199327 158797 169970 112435
6743 112435 -259642 -175784 6720 11852 20971 63932 -143075 -53274 189140 -97739 -4860 -129343
6731 -129343 351555 -257950 42025 120702 230166 -38535 145056 339972 110338 156610
6721 156610 229204 -16343 -291979 66299 -31418 96334 -92818 -65750 -17350 -159083 -24539
6709 75483 79295 134946 -118385 315487 -159435 -96833 -325134 -241579 329283 45015 20456
6697 43828 147856 -13237 312454 -128214 -39400 9093 95231 -18068 48733 235436 -160172
6685 -168547 -135475 132249 13088 -45014 14373 -122489 -36275 18027 -147584 67415 -148724
6673 -89465 -170272 32267 -64171 -400030 74495 134456 -222849 -377740 -310843 54792 -47723
6661 -163322 -145662 65014 -93 177760 273659 -52924 -390152 -197276 14131 99963 -83728 114768
6648 -87087 343602 99027 -411487 104400 2148 -17217 41119 -21645 -226148 31758 176740
6637 176740 -244786 70065 166184 -9182 -151293 80192 -133777 -160252 186868 -56449 -84959
6626 -84959 61746 -137453 36997 215625 81555 -378138 -197005 13343 119569 139707 79334
6615 79334 -285112 308050 35588 318913 368058 41943 292082 -405667 -127811 -307089
6605 -307089 6058 192809 -246446 42887 -37098 97829 -153636 159805 -239232 93600 -204308
6593 163989 14327 -133989 -86245 123764 16198 39297 -241659 202584 2342 -155173 126282
6581 -124879 -88981 -195190 38968 217924 303765 -96683 43706 -100502 -164731 -123972 -274376
6570 -274376 -85827 -289121 250814 -212935 155293 120006 -121646 340862 86372 55699
6560 55699 -112876 319067 41171 48713 -1912 -146657 -146039 -28497 275405 -160560 -171070 31095
6547 95697 -176198 144930 -92987 -387833 -120008 -105127 343530 -194904 -106712 11785 -155361
6535 25932 -150265 211495 378438 230767 139682 110972 15838 -167455 -95210 2906 9063
6524 9063 -290310 -176558 -23250 -272773 -126598 -20938 10357 28261 -350627 -39565 -72007
6513 -72007 303261 113241 -189363 205396 -130956 -377173 203230 -106436 -230566 -307781
6503 -307781 193869 125915 -73553 108709 247086 -93743 -260401 13330 -48071 33277 79322
6492 79322 91074 -73187 3591 -161454 -24153 -238363 445693 -332947 -256032 145729 -210320
6480 60101 -127756 14245 -272167 -238023 -236667 -70604 -104296 -53693 298670 213351 -36957
6468 246561 -96595 24071 -194225 12871 132701 -36340 -188706 -256163 305410 141341 223772
6457 223772 -159363 27427 74059 -39992 -144904 274684 -109749 173037 71527 19165 -286475
6445 -231167 65456 43510 48740 178248 239808 -87462 224625 210621 -122949 192959 43336
6433 -261197 139666 367132 -183664 -160802 -12442 134571 -133126 -59105 108099 95501
6423 95501 164343 139208 83669 20440 -235217 10343 334362 76317 -166668 -116155 103788
6411 -96365 -139831 229777 70845 268477 82474 11008 172344 287392 61180 6233 -12548
6399 -103376 300943 -185063 294073 -73115 68365 -132335 136968 85575 127067 -331041
6388 -224870 277324 -165871 -166278 225815 -194493 -69153 63949 342812 280405 133157 227801
6377 227801 335301 -103816 184606 3721 -113902 62896 -104175 175613 24227 108343 126806
6366 126806 30295 -45079 -180624 -22118 -235030 155185 -22754 -400375 -29515 -267533 -220203
6355 -220203 69820 53840 219512 -113350 108027 -16605 74999 158389 -189701 -12773 203529
6343 -147484 440152 -107143 219263 27845 -117539 39859 -145848 -174611 190237 -19398
6332 231913 -104824 34767 105111 273344 -11319 146653 -167293 -68410 -177251 40163 -91528
6320 222009 -79770 -282065 -326317 512766 -105765 -144983 144460 96017 40763 77743 -165250
6308 126003 63549 -103976 108343 -153363 195762 -3382 -239754 -11680 200737 13323 -166887
6296 166116 -9444 166175 166909 -163283 -162942 -100171 -141919 109337 -362632 -35993 -8924 63279
6283 -185135 235742 -23002 -53132 33731 54796 29735 -42093 -61273 86272 -114229 -163299
6272 -163299 -184783 86891 6507 22288 86793 -230283 -149197 -123669 26234 145920 -16250
6260 -148123 -120129 -286997 -228667 73860 128856 56278 -200396 -4921 103546 46930 -88771
6248 56683 152833 -446517 -125913 289054 -265309 72887 -45967 -46161 -155460 -380519 458776
6236 56695 220198 -119587 22129 1438 -106789 399872 -89386 115925 -98064 106680 20764
6224 269633 8898 -6167 -10481 23389 166245 -104696 -358268 151835 -51853 40978 268531
6213 268531 32534 -88665 279204 -108083 -1491 -304289 -130618 121056 130430 92654 -77299
6201 -345111 80135 -69761 -201666 17488 -29297 99822 -9047 -58741 162608 -1466 -153454
6190 -153454 247518 -3648 -188427 -28205 118456 -138248 48599 167852 -4940 -382266 60183
6178 392153 275505 -39259 -222887 42762 -279840 191637 11094 -100349 222459 -125968
6167 58941 -81309 -266080 -10606 57225 -227727 190260 -128312 9191 63115 -62574 -292755
6156 -292755 -101992 -173984 230169 -176174 300543 -78471 -281738 -37648 182906 -191141
6145 70785 -199234 22273 -168241 278141 164390 -103465 80968 150057 -296516 46755 -41287
6133 -46880 -137773 -271677 -16885 -28735 290177 -351272 325903 -119805 -137955 198375 -139943
6121 90264 -241163 141015 4040 515 -201536 -207054 70706 -284860 -138943 -173811 -143680 -97485
6109 -97485 -46853 2565 73122 -236406 16638 -197855 63658 125414 70229 -210040 -82857
6097 -200384 -122221 -185205 -195899 -68918 428181 -104957 -48020 -296089 360180 -16984 -64297
6086 -64297 146136 -167181 57966 -142411 85649 -236098 -69054 224459 -77311 -353280 37156
6074 26155 140302 54020 -175784 17048 9390 -52531 72805 -59503 75229 -161525 -47252
6062 -425008 -136152 163273 218833 -95002 -194936 -14308 38763 -52663 248908 134510 -19796
6050 -146946 -162534 -78641 348093 54146 14019 276812 53635 39754 -72168 -28806 183603
6038 -115787 -77562 -77345 69482 -210129 -255781 -229598 -75312 -196913 -348785 -32279 5290 -96143
6025 224380 88153 -92144 -68146 -78802 193059 -439068 30621 241918 -65562 68497 47776
6014 47776 170435 56618 85085 272925 26266 226075 105494 -114738 157557 62548 -210
6002 231336 226192 151301 15197 -189519 -72580 137964 169271 -178357 -391958 82645 -226104
5990 -295890 -185174 45389 -46361 -139577 103981 -324423 175333 96025 -178846 271982
5979 -11370 58527 -256421 -311215 231439 75301 111690 -24016 32095 48619 176491 -572616
5967 135575 252436 176807 111491 -62900 -197300 -13363 -18028 70156 70135 78857 -18417 -106435
5955 -106435 -4018 57558 -215982 -226463 -129701 8995 -38270 -143045 -61580 232971 144837
5944 144837 -174600 308046 20580 255741 128059 -236295 168604 231618 -5722 -433040
5934 -433040 217410 -146863 -141943 -132966 -34236 60150 -234299 20843 -121701 396701 241069
5923 241069 -317403 168691 404399 26193 266965 -132548 25764 -112823 25618 178861
5913 178861 -127321 -162876 -132536 240847 -13978 -158776 393142 -82799 -310327 13935 -84099
5901 149687 -63983 -27284 55125 -96208 21665 -281805 365467 -85268 -54182 -445249 -57500
5889 315502 289336 -22377 -60775 -190455 116218 7823 258256 111529 -253776 -136581 81050
5877 -160082 149912 -31794 -119466 -164171 17920 -215578 -218783 54073 36751 79151 176722
5866 176722 -153359 -314902 -64556 -239671 78068 -178912 3774 261891 81182 98555 -8532
5854 -149566 -100520 -108715 7227 121602 10407 -228468 -44404 -159671 -26851 -173621 -187725
5843 -187725 33778 267166 -27705 192362 -207981 -61387 -96717 78189 40317 -77743 -121039
5832 -121039 56266 127060 -50151 284236 -77262 -135061 -280607 85434 -229395 -20961 272638
5820 11025 -115218 153358 -82482 -370431 70486 37034 -168336 -299 -146461 -75366 -284749
5809 -284749 -133493 -350397 318113 -104670 -257450 -72083 -132730 25364 345808 -96162
5798 224369 -56259 -34474 -158575 289777 -168686 -117640 180916 -340561 6513 -121195 -146577
5787 -146577 74338 252782 138592 -36784 278742 -26935 -189824 -118528 -42649 70593 -109891
5775 -77048 -192130 -149615 160293 3596 -47677 171671 -211469 -169976 328253 -86483 -127069
5764 -127069 -143701 18235 -210998 320877 91836 -105772 -186265 391369 53096 274498 49345
5752 -345299 286148 -198457 -109862 37113 -90314 -76049 -39142 54694 -71092 -131957 160343
5740 314731 -64425 -237109 -108938 134720 311876 -421763 186350 130932 -251282 -126007
5730 -126007 -170997 284062 -277112 34699 -57956 -127499 245961 116910 68931 -159978 170937
5718 -257305 156044 204163 18026 -106965 114735 -21383 59372 152622 61173 -181338 -241392
5707 -241392 -48149 201983 3145 276375 -216271 -88162 -96999 26480 -97859 -302981 -153612
5696 -153612 147784 -243196 -109834 151695 204763 -93939 -32942 297574 -7513 218141 77477
5684 310925 -73676 214559 297313 -161983 -167324 -209404 132490 -178924 -251241 -16682 -284188
5673 -284188 -89977 292828 -46074 79239 27779 -216575 -281522 74548 -159910 -316284 -573020
5662 -573020 222511 -266043 191155 362043 23916 267420 -45174 -236465 297218 114278
5651 -429054 70306 20078 -36893 -16947 -24040 68087 -15208 170657 -7787 111839 127185 -109192
5638 -338746 -324761 99755 98407 117303 174301 206334 -76940 147026 -195873 -67149 -51760
5627 -51760 113013 162302 142092 333779 9538 67535 121452 302169 86493 434689 -27239
5615 114100 40022 56372 -289613 373772 66530 88825 -47447 261450 42816 18473 -72541
5603 123669 -382879 66568 45407 4070 -206022 -55577 72599 68564 -331627 216850 27511
5591 95658 -105959 -106073 -110746 -146410 282177 123977 220997 -144701 -166248 100054 -206806
5579 195334 162078 -289732 11210 -6810 192546 -194152 -96085 -124292 92094 -162584 -168395
5568 -168395 241661 -180596 -332137 104997 371117 -370539 -103995 237252 -143173 -85223
5558 -85223 81943 -210015 -41648 343666 47722 -201753 205477 297708 50807 44835 -134027
5546 120994 -3368 -161141 -160234 -9921 25606 -142294 173334 214958 -315868 -131369 -111693
5535 -111693 82140 67329 -252734 94784 281602 140939 117269 152 -63514 -285171 -292477
5524 -292477 -109362 -119164 90989 191772 -229615 71911 -65562 -299572 5977 -212 -112872
5513 -112872 123746 -52695 -35613 269774 168006 -119400 15310 -514907 66334 -92809 -93200
5502 -93200 -53407 -32962 -301350 180373 65274 -232383 392147 -31267 5514 15958 -162533
5490 321909 263546 127335 -139945 88714 66728 228034 -85741 218519 -56668 -110707 101383
5478 281747 105726 175460 -117481 -203828 209471 -49329 -143274 59455 278324 -70356 -9119
5466 -263516 224267 -76981 -97172 1107 -94065 268141 -185800 -68346 1603 -60046 -153140
5455 -153140 192521 35786 -92537 84190 176593 -98472 -17902 -56058 -17944 -280908 267038
5443 -147686 -299644 41165 -2106 -76696 -139677 -431786 -132189 -83247 169053 -139470 -62874
5431 -55595 -122205 307127 -243867 -5931 -359230 -259177 -413248 -332370 81920 26106 -269220
5419 111169 -145063 -67454 103029 16906 -151472 220208 212691 -14660 -200875 -31669 55166
5407 110781 185708 76159 175458 115381 44339 234221 243520 107824 -75433 -260208 -259055
5396 -259055 -203294 -6254 22170 -104752 -87710 27251 -187899 -443647 -61728 91161 60035
5385 60035 93513 168153 -157275 131823 -123699 59070 -147874 210481 -251659 -12687 24531
5373 13897 83253 130746 245601 -30803 43362 -369736 -12765 -35377 122895 230609 -153859
5361 342600 169519 129923 142862 -204054 129086 -5266 -157432 65666 -95871 350327 49358
5349 242826 -100822 23759 71653 239668 -87161 -200307 31165 60550 -94635 -323830 -207343
5338 -207343 155719 48536 219519 187722 90062 108419 -345284 -181227 -332157 -98694 -84852
5327 -84852 25134 -168890 -89362 222086 106550 -57230 65001 91494 196379 126266 -250925
5315 -138513 -9230 211081 124115 233854 112958 -112142 184435 -242703 219071 -132661
5304 229827 162802 -71816 17544 30241 351657 -52467 -105324 31353 18014 -39552 217520
5292 34091 -136518 276691 -6326 325145 -52876 -276426 236803 156842 229424 262092 95993
5280 -32354 88323 89079 -305119 187502 177931 132593 -61999 101186 54929 200347 114365 357920
5268 357920 571052 -187109 5104 -106996 145010 -3370 204569 -222577 93214 95537 102102
5257 102102 178860 -62971 -85954 -149077 182793 -304611 -73910 48307 -92945 418208 264159
5246 264159 -134240 147233 -153399 -126563 -137164 -131370 -39936 -119274 -236366 -332450 -137689
5234 270333 120988 -133858 126191 2055 -41060 346047 -122391 48755 -81528 -174278 51709
5222 14142 354264 7532 413422 151551 -431252 -103389 -160461 68203 48600 155289 129271
5211 129271 -157529 -264247 83908 -159986 300935 -190732 -35627 -30051 -229547 -239115 -205545
5200 -205545 -80502 25932 -123429 65389 98176 -38560 -87444 441321 163631 127674 -128638
5188 66240 -145120 -183771 -68285 -313162 55198 217909 -133923 218721 115402 -280073
5177 105793 84140 -116932 -200120 -49747 252820 -615 -193564 94482 -438286 197090 42483
5165 -85565 159536 161165 207285 55591 -100538 -151439 70948 368245 -107902 47265 -47709
5153 246312 178877 200419 76463 -159711 -61054 62362 -163388 -383371 -383503 -171497 123769
5141 121830 -80876 -147614 -318447 -168072 -368614 76858 147009 -16396 -273411 -275415 289517
5129 51587 133627 133718 187059 228302 -83289 -293819 -4539 250241 62497 -3146 128843 35237
5116 30876 -236554 24946 227001 -86225 -80395 -289709 56641 -119151 55310 342970 -182466
5104 87491 7235 -48147 -92786 38000 -329201 36802 -209615 29419 209802 115521 -123136
5092 40407 -81136 -58799 -152932 -5939 84501 -126479 -2661 -98809 -401732 315353 65391 208990
5080 208990 140220 232161 204952 -94463 -16180 -122425 -114579 -31161 41578 20112 -120044
5068 -178407 -44863 -393828 -8464 81752 99845 -82370 144513 353098 56867 -157330 -253827
5057 -253827 -15699 149486 245676 24413 89700 369345 -13097 -123621 -190577 -206297 -257726
5046 -257726 -99392 44699 186691 184887 -144702 48550 69025 126193 227928 -64433 46378
5034 -133957 101211 90142 -4679 173625 273668 26858 -290331 223429 -302292 -163380
5024 -163380 141802 141281 3558 206141 -103435 -39116 71835 -68615 -204542 -118355 -173769
5013 -173769 -126513 -401871 -104654 -335045 19676 48602 -194906 -71192 -28048 129058 -66070
5001 94246 -155539 162211 -177401 -216849 -146820 -2156 115913 -145348 184736 181270 172369
4990 172369 85539 79750 -257965 75187 67664 65611 326491 23472 90278 -65076 -45730 42860
4977 92961 146689 -375703 -106155 1599 -249432 -143292 -294551 307905 14780 41354 -36245
4965 417573 -424249 178994 108595 -232060 -102870 140429 -88329 -190250 195112 82516
4954 -5552 -140172 -180835 -81638 137470 222133 150889 72538 -275942 -163959 219998 270593
4943 270593 166385 -28713 209477 -247671 -271607 274448 124929 -119231 120483 16136
4932 -81073 10376 126721 -145980 183431 150883 -128623 -76430 10079 168171 296330 -431603
4920 -92662 141779 263598 42480 -484573 217172 -31716 204428 27503 -4387 86367 -82058
4908 -10963 -28485 -223780 181839 -49209 -65893 4794 1908 9265 120695 -160312 5769 238937
4896 238937 -8449 -99282 194735 5848 46850 -40414 -41316 108917 453952 -40289 -232261 -120962
4884 -120962 -147548 91974 179746 7672 22622 -112263 13105 -201550 183056 -44792 -280019
4873 -280019 -439038 -81019 380359 114386 140905 -143974 -247694 58048 312541 124663
4862 -467020 55108 284906 162392 101593 -63108 57126 149612 -151127 -274817 80807 475314
4851 475314 156957 97781 206383 160303 265261 145829 185951 -106944 53169 331536
4841 331536 38609 -205622 51844 -36232 -53118 144511 -262725 50747 49195 65373 -50856
4829 -162787 12504 153795 115921 14692 117384 210598 -91540 203251 -127282 -124019 62135
4817 -98868 -146363 446466 -422593 320632 15221 345399 -142052 -14717 -87505 -102791 -15113
4805 64318 -81708 -209719 83520 -71534 -236332 21155 90545 310425 147861 69223 83683
4794 83683 -61486 96233 -14545 -215738 -156268 -56837 -26929 6490 -70357 170527 -204869
4782 -114811 57514 -248463 62318 289921 -336933 -190189 -93191 68641 49942 -17505 8535
4770 -341085 -18795 424232 -425039 -111541 -51552 -307007 99730 70085 -233748 159717
4759 -329801 60353 149096 -73098 19253 -103377 -169270 283111 38834 162229 32905 -372402
4747 -7230 129840 198423 80909 86526 14431 -91645 172694 19688 266132 -41372 300074
4735 -254935 -261407 -210382 -418472 16197 -295417 43064 39172 -196320 -248545 51466 -336676
4723 -71407 -36899 -175002 135514 -5346 52577 126701 31641 -43188 -15039 -4542 -21490 115742
4710 128845 -156077 67676 -141557 -183757 46493 -7964 -133897 -42408 -96683 192749 -105689
4698 -171825 238098 -387590 352765 84122 113313 452728 175278 116650 162943 -66019 -5690
4686 134094 116092 -215921 -113491 50896 151787 77135 -139517 -143996 157815 -71789 3180
4674 1932 -143918 -62882 160231 -141776 -125401 -185121 -6678 18677 -235366 17234 -28575
4662 -125368 344184 313467 -161820 107263 122005 -221369 90594 219415 -83303 241232
4651 -253692 -70966 561793 -330277 185872 -118382 73091 139471 -104225 -213534 27168
4640 195428 -249908 -119161 -287153 -178891 -192665 85389 27940 71629 166844 58955 75474
4629 75474 6973 52646 -455916 163135 -5873 380594 -100057 8595 -48819 27050 190255
4618 190255 60545 -33748 -150964 149580 -285512 -245199 -113828 -48200 189857 103029 47433
4606 -36323 -86231 94274 99453 -9559 49703 37722 -195345 499556 217609 -260918 241589
4594 -80162 -100204 296138 -76960 -75601 -122003 116404 -103831 250042 -32474 176727 273899
4583 273899 -10658 95371 149959 -426 213467 -155695 -95215 -40680 -141267 -152970 21999
4571 -233097 -73200 -329479 81311 23310 -36230 82009 136025 25247 -145533 52597 124389
4560 124389 127863 73779 148870 118872 -48302 30838 132772 172573 173035 -124393 111600 -145318
4547 201335 27122 102608 210006 -33883 170137 -32719 -279296 -26529 -58607 221996 130521
4536 130521 180614 56047 -49295 81281 -149407 -138750 109026 13130 121581 100879 124449
4525 124449 -292487 10039 120764 -63842 271675 -310442 -97149 -210806 83898 23413 -30168
4513 104982 -153192 124506 -61751 65059 68432 172753 318283 -234259 168185 -175140
4502 -296446 -86392 144103 -36454 54773 128350 46567 -72075 -19409 226587 100223 45792
4490 134222 42768 -215831 99638 474496 -6672 254137 -311108 -6834 228034 100473 -242112
$$ [...]
##END NTUPLES=NMR SPECTRUM
##END=
