##TITLE=AC1696_ROEFFECT0025_8637818_uTAhjjjDHB
##JCAMPDX= 6.0         $$ Bruker NMR JCAMP-DX V2.0
##DATA TYPE= NMR SPECTRUM
##DATA CLASS= NTUPLES
##ORIGIN= BRUKER
##OWNER= Administrator
$$ 1.72 TOPSPIN		Version 2.1
$$ 2014-05-22 19:33:58.000 -0700  Administrator@X
$$ Compression mode = diff/dup
##.OBSERVE FREQUENCY= 400.02188249412
##.OBSERVE NUCLEUS= ^1H
##.ACQUISITION MODE= SIMULTANEOUS (DQD)
##.ACQUISITION SCHEME= undefined
##.AVERAGES= 64
##.DIGITISER RES= 22
##SPECTROMETER/DATA SYSTEM= spect
##.PULSE SEQUENCE= noesygpps1d.comp
##.SOLVENT NAME= COFFEE_meoh
##.SHIFT REFERENCE= INTERNAL, COFFEE_meoh, 1, 14.96113
##AUDIT TRAIL= $$ (NUMBER, WHEN, WHO, WHERE, PROCESS, VERSION, WHAT)
$$ ##TITLE= Audit trail, TOPSPIN		Version 2.1
$$ ##JCAMPDX= 5.01
$$ ##ORIGIN= Bruker BioSpin GmbH
$$ ##OWNER= Administrator
$$ $$ E:\/data/COFFEE/nmr/AC1696_ROEFFECT0025_8637818_uTAhjjjDHB/12/pdata/1/auditp.txt
$$ ##AUDIT TRAIL=  $$ (NUMBER, WHEN, WHO, WHERE, PROCESS, VERSION, WHAT)
(   1,<2014-05-22 19:33:52.594 -0700>,<Administrator>,<X>,<go>,<TOPSPIN 2.1>,
      <created by zg
	started at 2014-05-22 19:22:24.222 -0700,
	POWCHK enabled, PULCHK disabled,
       configuration hash MD5:
       C8 4E 4E 5D D3 5C D8 9E 9F 52 82 E0 59 8A DE 15
       data hash MD5: 64K
       8B 00 EB 16 37 0D 66 DC C9 11 90 68 91 00 07 DB>)
(   2,<2014-05-22 19:33:55.595 -0700>,<Administrator>,<X>,<proc1d>,<TOPSPIN 2.1>,
      <Start of raw data processing
       efp LB = 0.3 FT_mod = 6 PKNL = 1 PHC0 = 0 PHC1 = 0 SI = 128K 
       data hash MD5: 128K
       C6 06 F2 5C 7C 80 56 87 DC 85 F2 52 A4 F8 29 17>)
(   3,<2014-05-22 19:33:56.736 -0700>,<Administrator>,<X>,<proc1d>,<TOPSPIN 2.1>,
      <pk PHC0 = -86.77002 PHC1 = 0 
       data hash MD5: 128K
       55 7A 1D CA DA B4 AD D4 A0 FE 67 4D 58 40 4F 7D>)
(   4,<2014-05-22 19:33:57.326 -0700>,<Administrator>,<X>,<proc1d>,<TOPSPIN 2.1>,
      <abs ABSG = 1 
       data hash MD5: 128K
       F7 DB 35 38 CE E0 35 10 B7 9F 3B 3D 3A 4A FC D4>)
(   5,<2014-05-22 19:33:57.444 -0700>,<Administrator>,<X>,<proc1d>,<TOPSPIN 2.1>,
      <abs ABSG = 2 
       data hash MD5: 128K
       59 39 5C 25 FB 4C 94 93 AE F5 ED 41 79 5F 07 37>)
(   6,<2014-05-22 19:33:57.545 -0700>,<Administrator>,<X>,<proc1d>,<TOPSPIN 2.1>,
      <abs ABSG = 3 
       data hash MD5: 128K
       45 67 57 9D 61 54 C4 6D 48 6A C5 96 C7 57 8D 5C>)
(   7,<2014-05-22 19:33:57.663 -0700>,<Administrator>,<X>,<proc1d>,<TOPSPIN 2.1>,
      <abs ABSG = 4 
       data hash MD5: 128K
       6B 0A E7 74 89 6C 7F 18 E0 61 B1 8B 93 84 EC 98>)
(   8,<2014-05-22 19:33:57.764 -0700>,<Administrator>,<X>,<proc1d>,<TOPSPIN 2.1>,
      <abs ABSG = 5 
       data hash MD5: 128K
       36 F7 39 94 13 2C 22 25 41 74 E6 A8 0F E0 1A 85>)
$$ ##END=
$$ 
$$ $$ hash MD5
$$ $$ 32 1B F5 61 2A 1D F6 33 30 8E D5 08 8A EE 76 CA
##$RELAX= 
##$RELAX= 
##$RELAX= 
##$RELAX= 
##$RELAX= 
##$RELAX= 
##$RELAX= 
##$RELAX= 
$$ Bruker specific parameters
$$ --------------------------
##$DU= <E:\>
##$EXPNO= 12
$$ [...]
##$TP07= 0
##$TPNAME0= <>
##$TPNAME1= <>
##$TPNAME2= <>
##$TPNAME3= <>
##$TPNAME4= <>
##$TPNAME5= <>
##$TPNAME6= <>
##$TPNAME7= <>
##$TPOAL= (0..7)
0.5 0.5 0.5 0.5 0.5 0.5 0.5 0.5
##$TPOFFS= (0..7)
0 0 0 0 0 0 0 0
##$TUNHIN= 0
##$TUNHOUT= 0
##$TUNXOUT= 0
##$USERA1= <user>
##$USERA2= <user>
##$USERA3= <user>
##$USERA4= <user>
##$USERA5= <user>
##$V9= 5
##$VALIST= <valist>
##$VCLIST= <CCCCCCCCCCCCCCC>
##$VD= 0
##$VDLIST= <DDDDDDDDDDDDDDD>
##$VPLIST= <PPPPPPPPPPPPPPP>
##$VTLIST= <TTTTTTTTTTTTTTT>
##$WBST= 2048
##$WBSW= 25
##$XGAIN= (0..3)
0 0 0 0
##$XL= 0
##$YL= 0
##$YMAX_a= 6494063
##$YMIN_a= -13530839
##$ZGOPTNS= <>
##$ZL1= 120
##$ZL2= 120
##$ZL3= 120
##$ZL4= 120
##$ABSF1= 14.96113
##$ABSF2= -5.597052
##$ABSG= 5
##$ABSL= 3
##$ALPHA= 0
##$AQORDER= 0
##$ASSFAC= 0
##$ASSFACI= 0
##$ASSFACX= 0
##$ASSWID= 0
##$AUNMP= <proc_prof1d_extract.lims>
##$AXLEFT= 0
##$AXNAME= <>
##$AXNUC= <1H>
##$AXRIGHT= 0
##$AXTYPE= 0
##$AXUNIT= <>
##$AZFE= 0.1
##$AZFW= 0.1
##$BCFW= 0
##$BC_mod= 0
##$BYTORDP= 0
##$COROFFS= 0
##$CY= 15
##$DATMOD= 1
##$DC= 0
##$DFILT= <>
##$DTYPP= 0
##$F1P= 0
##$F2P= 0
##$FCOR= 0.5
##$FTSIZE= 131072
##$FT_mod= 6
##$GAMMA= 0
##$GB= 0
##$INTBC= 1
##$INTSCL= 1
##$ISEN= 128
##$LB= 0.3
##$LEV0= 0
##$LPBIN= 0
##$MAXI= 10000
##$MC2= 0
##$MEAN= 0
##$ME_mod= 0
##$MI= 0
##$NCOEF= 0
##$NC_proc= -2
##$NLEV= 6
##$NOISF1= 0
##$NOISF2= 0
##$NSP= 0
##$NTH_PI= 0
##$NZP= 0
##$OFFSET= 14.96113
##$PC= 1
##$PHC0= -86.77002
##$PHC1= 0
##$PH_mod= 1
##$PKNL= yes
##$PPARMOD= 0
##$PPDIAG= 0
##$PPIPTYP= 0
##$PPMPNUM= 2147483647
##$PPRESOL= 1
##$PSCAL= 4
##$PSIGN= 0
##$PYNMP= <proc.py>
##$REVERSE= no
##$SF= 400.020009586737
##$SI= 131072
##$SIGF1= 0
##$SIGF2= 0
##$SINO= 400
##$SIOLD= 131072
##$SPECTYP= <>
##$SREGLST= <1H.CDCl3>
##$SSB= 0
##$STSI= 131072
##$STSR= 0
##$SW_p= 8223.68421052631
##$SYMM= 0
##$S_DEV= 0
##$TDeff= 65536
##$TDoff= 0
##$TI= <>
##$TILT= no
##$TM1= 0
##$TM2= 0
##$TOPLEV= 0
##$USERP1= <user>
##$USERP2= <user>
##$USERP3= <user>
##$USERP4= <user>
##$USERP5= <user>
##$WDW= 1
##$XDIM= 131072
##$YMAX_p= 416566591
##$YMIN_p= -11899
##$CURPLOT= <Network HP LaserJet P1505>
##$CURPRIN= <$Network HP LaserJet P1505>
##$DFORMAT= <normdp>
##$LAYOUT= <+/1D_H.xwp>
##$LFORMAT= <normlp>
##$PFORMAT= <normpl>
##$SURQMSG= 1
$$ End of Bruker specific parameters
$$ ---------------------------------
##NTUPLES= NMR SPECTRUM
##VAR_NAME=  FREQUENCY,     SPECTRUM/REAL,   SPECTRUM/IMAG
##SYMBOL=    X,             R,               I
##VAR_TYPE=  INDEPENDENT,   DEPENDENT,       DEPENDENT
##VAR_FORM=  AFFN,          ASDF,            ASDF
##VAR_DIM=   131072,        131072,          131072
##UNITS=     HZ,            ARBITRARY UNITS, ARBITRARY UNITS
##FACTOR=    0.0627417313425164, 1,          1
##FIRST=     8223.62146879497, -2417,        -69940
##LAST=      0,             -278,            -70812
##MIN=       0,             -11899,          0
##MAX=       8223.62146879497, 416566591,    0
$$ Real data points
##PAGE= N=1
##DATA TABLE= (X++(R..R)), XYDATA
$$ [...]
61607D90494o305p464q371r146r647r585q877p612o023m684m150m182l979l339
61593C97130k938l174l550l514l209l012k924k752k344j516l70K75l63j745k424
61578C63570j882j040p59q57r43j108j372j291o37K76J134J771J736P82j50K81
61562C59511J856K858K443J624J462J705J845K172K912L419L123K348J578P64
61548C89620l5l30p5J01L4L06R75J171O28L08Q46J564J833K173L115M129M584
61531D10947M672M609M001K882K182K242K005O29j223k606l632m560m826m174
61517D13148l549l635l545k357q49k61k73K48J187J491J012O15O85Q36Q46Q10
61501D06409O81N63J076K495L952M349L721K909K451K442K856L253K834J587O45
$$ plain form
61607 490494 484189 476725 468354 459208 449561 439976 431099 423487 417464 412780 408630 404448 400469 397130
61593 397130 394192 391018 387468 383954 380745 377733 374809 372057 369713 368197 367827 368102 367739 365994 363570
61578 363570 361688 360648 359889 359032 358089 356981 355609 354318 353681 353957 355091 356862 358598 359380 359230 359511
61562 359511 361367 364225 366668 368292 369754 371459 373304 375476 378388 381807 384930 387278 388856 389620
61548 389620 389585 389255 389180 389281 389315 389621 390596 391767 392395 392703 393549 395113 396946 399119 402234 406363 410947
61531 410947 415619 420228 424229 427111 429293 431535 433540 434169 432946 430340 426708 422148 417322 413148
61517 413148 409599 405964 402419 400062 399213 398952 398679 398927 400114 401605 402617 403232 403917 404753 405599 406409
61501 406409 407090 407653 408729 411224 415176 419525 423246 426155 428606 431048 433904 437157 439991 441578 442223
61486D42223O97R29L84n13p67k92M99J682L260M447M712M826N668O745P048O647
61470D88195O139N196L141M56j644k753l232l213k835k946m169n665o112n483
61456D65075m714m026k987j840j360j509j481r90m26Q6P52J377J597J653K040
61441D53247K663L146L561L976L880L064K484L022L978M013L131K343J866J085
61427D95459O6m35l56l83n38m0J361K984M258N184N720N638N003M046K712J106
61411E31785j01n72j139k607m233m681m149m032m645m784l741k351j640j568j507
61396D90035j163o34k39m40j386k474k857k365j459n29K97R83J757K963M247M596
61380D91332L799L108L545M464M846N046N890O820O606N382M332L677K651J351
$$ plain form
61486 442223 442920 443849 444233 443720 442953 442661 443160 444842 448102 452549 457261 462087 467755 474500 481548 488195
61470 488195 494334 499530 502671 503127 501483 498730 495498 492285 489450 486504 482335 476670 470558 465075
61456 465075 460361 456335 453348 451508 450148 448639 447158 446168 445742 445828 446580 447957 449554 451207 453247
61441 453247 455910 459056 462617 466593 470473 473537 476021 479043 483021 487034 490165 492508 494374 495459
61427 495459 495525 495090 494734 494351 493813 493773 495134 498118 502376 507560 513280 518918 523921 527967 530679 531785
61411 531785 531684 531112 529973 527366 523133 518452 514303 510271 505626 500842 497101 494750 493110 491542 490035
61396 490035 488872 488238 487999 487559 486173 483699 480842 478477 477018 476489 476786 477769 479526 482489 486736 491332
61380 491332 495131 498239 501784 506248 511094 516140 522030 528850 535456 540838 545170 548847 551498 552849
61366E52849Q39J319J807J818J925K279J998O46q13j113m9J681L344M607N615
61351E78752O789Q270R726J0970J2175J2951J2082R155N713L623K905K366J790
61338F77267J927K752L260L011K459J734L81j631l728n565p034p720p343o587
61324F53183o348o428o018n160m412l554k041m63k0o10q99k21R32K271M071O120
61308F30403P685Q701R881J1576J3524J5413J6671J6125J3240R260N741K490j384
61295G59326n114p115p753q877j0614j1110r847q728r043r601q912p378o119n215
61281F43900m276l471k918k021l58J665L523N073O068O256O245P010Q265Q644
61267F83605P727O517N640M746M100M910P429J0245J2339J4248J6428J7952J7802
$$ plain form
61366 552849 553688 555007 556814 558632 560557 562836 564834 565480 564667 563554 563505 565186 568530 573137 578752
61351 578752 585541 593811 603537 614507 626682 639633 651715 660870 666583 670206 673111 675477 677267
61338 677267 679194 681946 685206 688217 690676 692410 692791 691160 687432 681867 674833 667113 659770 653183
61324 653183 646835 640407 634389 629229 624817 621263 619222 618759 618739 618129 617230 617009 617941 620212 624283 630403
61308 630403 638088 646789 656670 668246 681770 697183 713854 729979 743219 752479 758220 760710 759326
61295 759326 754212 747097 739344 730467 719853 708743 698896 690168 681125 671524 662612 655234 649115 643900
61281 643900 639624 636153 633235 631214 630856 632521 636044 641117 647185 653441 659686 666696 674961 683605
61267 683605 691332 697849 703489 708235 712335 717245 724674 734919 747258 761506 777934 795886 813688
61254H13688J6140J3475R915O096L459K461J735J1k259m049n369o671p769q440
61240H32423r161j0238j0980j0675r669q771q312q375r011r596q987p001m770
61227G16877l041j247J074L121L990L926L496K519Q47p03j254r95n35J28J131
61212G29334J960K017J467Q49L40j25n72j182k021k344j101J469L835N195O416
61197G45537Q444J1021J3609J6424J9616K2459K4080K4217K2677J9103J3991Q909
61185I50087N057K420Q08M95J197J620Q94n76k241m248o463p989q503q896r766
61170I13896j0423j0248r810r769r858r855j0315j1365j2108j2140j2417j3504
61158G82084j4366j3998j2975j2054j0636p978m777k096K79K933N332O713P373
$$ plain form
61254 813688 829828 843303 853218 859314 862773 865234 866969 866980 864721 860672 855303 848632 840863 832423
61240 832423 823262 813024 802044 791369 781700 772929 764617 756242 747231 737635 728648 721647 716877
61227 716877 713836 712589 713663 716784 720774 724700 728196 730715 731562 730859 729605 728610 728075 728203 729334
61212 729334 731294 733311 734778 735627 735967 735842 735270 734088 732067 729723 728622 730091 733926 739121 745537
61197 745537 753981 765002 778611 795035 814651 837110 861190 885407 908084 927187 941178 950087
61185 950087 955144 957564 958372 958867 960064 961684 962578 962002 959761 955513 949050 941061 932558 923662 913896
61170 913896 903473 893225 883415 873646 863788 853933 843618 832253 820145 808005 795588 782084
61158 782084 767718 753720 740745 728691 718055 710077 705300 703204 703483 706416 711748 718461 725834
61145G25834P593O265K308l262q216j1418j2953j2871j1375r586q516p652n938
61132F50213l588j667m14P37K034L527N626Q305J0467J1334J1754J2867J4382
61119G25577J5524J6757J8891K1315K2818K3538K4333K4929K4475K3460K3174
61108I64791K3494K3107K1781K0673K0329J9983J8855J6781J3517Q840L347j967
61096A153531o904j1700j5858j8550j9913k0694k1009k0630k0099k0019j9750
61085I58405j8297j6090j4323j2895j0843q482p261p442p666o988n706m117k041
61072H36254J95J846L062M691O656P951Q406Q982J0180J1422J2326J3228J4286
61059I39485J5283J6443J8188K0065K1156K1494K1910K2580K3123K3842K5329
$$ plain form
61145 725834 733427 739692 742000 738738 730522 719104 706151 693280 681905 672319 663803 656151 650213
61132 650213 646625 644958 644544 645281 647315 650842 656468 664773 675240 686574 698328 711195 725577
61119 725577 741101 757858 776749 798064 820882 844420 868753 893682 918157 941617 964791
61108 964791 988285 1011392 1033173 1053846 1074175 1094158 1113013 1129794 1143311 1152151 1155498 1153531
61096 1153531 1146627 1134927 1119069 1100519 1080606 1059912 1038903 1018273 998174 978155 958405
61085 958405 940108 924018 909695 896800 885957 877475 870214 862772 855106 848118 842412 838295 836254
61072 836254 836449 838295 841357 846048 852704 860655 869061 878043 888223 899645 911971 925199 939485
61059 939485 954768 971211 989399 1009464 1030620 1052114 1074024 1096604 1119727 1143569 1168898
61048A168898K6987K7711K7844K8694L0137L0614K9615K8219K7034K5582K3981
61037A475316K3109K2715K1418J9071J7079J5820J3981J1171Q975Q404Q366P782
61025A653207P200P287P629Q280J0450J4377J8317K0938K2829K4551K5313K5053
61013A845431K5719K8850L4032M1246N2094O6612Q1408R3680J04798J17484J32395
61002B623749J50744J77103K14981K61928L14025L72848M42360N21898O10784
60993E690420P18788Q62830J054884J306258J639650K061429K490497K732888
60985A8557644K585224K005127J175209L80203j77191m38513m14891j28430L35133
60976B3879515P61051Q76338N34256j71990r85459j665704k100829k290965k281460
$$ plain form
61048 1168898 1195885 1223596 1251440 1280134 1310271 1340885 1370500 1398719 1425753 1451335 1475316
61037 1475316 1498425 1521140 1542558 1561629 1578708 1594528 1608509 1619680 1628655 1637059 1645425 1653207
61025 1653207 1660407 1667694 1675323 1683603 1694053 1708430 1726747 1747685 1770514 1795065 1820378 1845431
61013 1845431 1871150 1900000 1934032 1975278 2027372 2093984 2175392 2269072 2373870 2491354 2623749
61002 2623749 2774493 2951596 3166577 3428505 3742530 4115378 4557738 5079636 5690420
60993 5690420 6409208 7272038 8326922 9633180 11272830 13334259 15824756 18557644
60985 18557644 21142868 23147995 24323204 24703407 24526216 24087703 23672812 23544382 23879515
60976 23879515 24640566 25516904 26051160 25879170 24893711 23228007 21127178 18836213 16554753
60967A6554753k128344j894666j640201j402838j195269j018149q69483p43763
60959E662040o32933n32980m46038l74425l16403k68943k30754k00602j75734
60950B483228j54195j36446j22858j11538j00383q9441p9591p0561o2051n5288
60940A500876n1588n0361n0138n0420n0935n0357m7656m3893m0754l8083l4651
60929I92040l0672k7534k5415k3209k0608j8373j6615j4634j2585j1448j1241
60918G79706j0889j0012r177q280o508m285l251l717l945k758j176m62k22L79
60904G15403Q59L67p31j484j944k842m331n957p417q485q756q260p773p849q120
60889F42680q165q365r143r999j0024q990p298n412l858l146l153l252l358m052
$$ plain form
60967 16554753 14426409 12531743 10891542 9488704 8293435 7275286 6405803 5662040
60959 5662040 5029107 4496127 4050089 3675664 3359261 3090318 2859564 2658962 2483228
60950 2483228 2329033 2192587 2069729 1958191 1857808 1768367 1688776 1618215 1556164 1500876
60940 1500876 1449288 1398927 1348789 1298369 1247434 1197077 1149421 1105528 1064774 1026691 992040
60929 992040 961368 933834 908419 885210 864602 846229 829614 814980 802395 790947 779706
60918 779706 768817 758805 749628 741348 734840 730555 727304 723587 719642 716884 715708 715246 715024 715403
60904 715403 716262 716629 715898 714414 712470 709628 705297 699340 691923 683438 674682 666422 658649 650800 642680
60889 642680 634515 626150 617007 607008 596984 587994 580696 575284 571426 568280 565127 561875 558517 554465
60875E54465n232n748n038m090l891l998l556k787k321j950j215m91k75m1R65
60860E14797K290K888K787K968L830M859N640O173O362O074N544M951L876K028
60846E75067J83m59K94J587K694L431L599K809R05j823m702o800p520p356p416
60831E54493p872p752o680n722n746o025n485m366l520k946k221j663j804k354
60817D90337k829l584m939n968n574m275l538l715l982l956l963l981l635l087
60803D33311k755k356j432n46o91j664k320k243k013j868j397n23K65P34J073
60788D15575J336J521J944K700L144K774K142J889J615P54p8KN00K93m93q45o77
60771D34096p09q93n92p0j63o31m31M87J236J599K037K255J494J99l39%J76m5
$$ plain form
60875 554465 549233 543485 538447 534357 530466 526468 522912 520125 517804 515854 514639 514148 513873 513832 514797
60860 514797 517087 519975 522762 525730 529560 534419 540059 546232 552594 558668 564212 569163 573039 575067
60846 575067 575250 574791 575085 576672 579366 582797 586396 589205 590110 588287 583585 576785 569265 561909 554493
60831 554493 546621 538869 532189 526467 520721 514696 509211 504845 501325 498379 496158 494495 492691 490337
60817 490337 487508 483924 478985 473017 467443 463168 459630 455915 451933 447977 444014 440033 436398 433311
60803 433311 430556 428200 426768 426222 425531 423867 421547 419304 417291 415423 414026 413503 413768 414502 415575
60788 415575 416911 418432 420376 423076 426220 428994 431136 433025 434640 435394 435316 435318 435818 436111 435618 434773 434096
60771 434096 433387 432494 431902 431832 431669 431038 430607 431094 432330 433929 435966 438221 439715 439914 439575 439575 439751 439706
60753D39706P4M60J64p93j313j233j487k032j563J38J539J686J382J309P61q31
60737D37967k676l884m614n117m992m177l460l175k637j554p56p21o51J41J073
60722D00767J342J094P74L34k04l88j62q4j78L19J513K343K192J830K048K479
60706D16019K526K404K435K367K099K089K364K071P89o75j460j697j786j632j214
60691D26699r38q54n17j53p25k166k898j960m68N5l27n95m15o7M12R94J269J110
60673D18456J084J534K018K234K537K903K484J024l93q81j065j850k880l303l166
60658D20736k965k535j569n71k20l16k75j05j6L15J197K153K574K642K819K955
60642D26819K665K006J075l87k227l398l207k396k086k176j804q81j50J3r5k27
$$ plain form
60753 439706 439780 440240 440404 439611 438298 437065 435578 433546 431983 432121 433660 435346 436728 438037 438798 437967
60737 437967 435291 431407 426793 421676 416684 412507 409047 405872 403235 401681 400925 400204 399553 399694 400767
60722 400767 402109 403203 403977 404311 404107 403719 403557 403473 403295 403614 405127 407470 409662 411492 413540 416019
60706 416019 418545 420949 423384 425751 427850 429939 432303 434374 435163 434488 433028 431331 429545 427913 426699
60691 426699 425761 424907 424390 424237 423512 421346 418448 416488 416020 416075 415748 415153 414738 414671 415083 416077 417346 418456
60673 418456 419540 421074 423092 425326 427863 430766 433250 434274 433881 433000 431935 430085 427205 423902 420736
60658 420736 417771 415236 413667 413096 412876 412560 412285 412180 412164 412479 413676 415829 418403 421045 423864 426819
60642 426819 429484 431490 432565 432178 429951 426553 423346 420950 418864 416688 414884 414003 413853 413866 413771 413544
60626D13544m36o44o30l21J98Q23J264J190P84P05J169J548J232L73m84r77q96
60609D18442k14O40J068J034Q64M60l79r23j11J622K456J569J20n96o44m89M7
60592D24966J046J851K103K362K957L316L212L458M446N129M480K980J642O04
60578D64552l45q06m92J1J92N32J490K492K956L359M282N313N987O818Q252R510
60562E14103R788R823J0861J2735J4188J4509J3712J1596Q021L738j04l043n157
60549F14770o376o773o845o669n500l121p90K55N03J299K914M648O270Q114J0218
60534F12917J2394J4900J8094K1740K5284K8245K9778K8788K5272K0742J6369
60523H54523J1617N685p09o158j0301j3513j5658j6427j6297j5921j5203j3990
$$ plain form
60626 413544 413108 412464 411834 411513 411711 412534 413798 414988 415772 416477 417646 419194 420426 420799 420315 419338 418442
60609 418442 418228 418868 419936 420970 421834 422294 421915 420992 420881 422503 424959 426528 426648 426052 425408 424919 424966
60592 424966 426012 427863 429966 432328 435285 438601 441813 445271 449717 454846 459326 462306 463948 464552
60578 464552 464207 463401 462909 462920 463112 463644 465134 467626 470582 473941 478223 483536 489523 496341 504593 514103
60562 514103 523891 533714 544575 557310 571498 586007 599719 611315 619336 623074 622970 619927 614770
60549 614770 608394 601621 594776 588107 582607 579486 578696 578951 579454 580753 583667 588315 594585 602699 612917
60534 612917 625311 640211 658305 680045 705329 733574 763352 792140 817412 838154 854523
60523 854523 866140 871825 871116 864958 854657 841144 825486 809059 792762 776841 761638 747648
60511G47648j2853j2129j1059r077p093o068n238l253k73K542M977P565J0189
60498G05878J2504J5267J9508K4693K9401L3546L8279M3829M9032N2957N5526
60487A080420N6475N5212N1866M7419M2618L7717L3052K8802K4316J8700J1903
60476A488500M198m967j6419k9560m2386n3042o0649o4937o6212o5459o3484o0158
60464I65425n5263m9604m4323l9619l5146l1102k7803k4774k1466j8382j6238
60453F01705j4614j2665j0693r568r116q399p280o340n593m610l581l008k719
60440E03519k363k347k934l098j845j40K03q24j616j504j320j547j631j308j021
60425D80224r18p64q32j497k054j340M01J721J955J662J221M49l50m22J68O29
$$ plain form
60511 747648 734795 722666 711607 702530 695437 689369 684131 680878 680605 683147 688124 695689 705878
60498 705878 718382 733649 753157 777850 807251 840797 879076 922905 971937 1024894 1080420
60487 1080420 1136895 1192107 1243973 1291392 1334010 1371727 1404779 1433581 1457897 1476597 1488500
60476 1488500 1492698 1487731 1471312 1441752 1399366 1346324 1285675 1220738 1154526 1089067 1025583 965425
60464 965425 910162 860558 816235 776616 741470 710368 682565 657791 636325 617943 601705
60453 601705 587091 574426 563733 554165 545049 536650 529370 523030 517437 512827 509246 506238 503519
60440 503519 501156 498809 495875 492777 490932 490792 490995 490171 488555 487051 485731 484184 482553 481245 480224
60425 480224 479306 478542 477710 476213 474159 472819 473220 474941 476896 478558 479779 480228 479878 479456 479624 480253
60409D80253Q36J378K247K671K391J883J458J182J445K365L020K592J916K424
60395E08061L873M734M532M104L791L174K525K730L617M057L858L930M458M613
60381E62057M201L976M140M089L831M020M438M089L024K455K745K900K329J589
60367F09883J130P76P11J383K298K450K058K239K896K769J799J398K051K613K544
60352F38998K829L984N090N665O677Q700J0674J1514J1510J1207J0334Q696O770
60339G42648M561J271k998o625q462r185r758r894r014p631o677o373o498o906
60325F58459p113o437n175m565n006n489n331n130n263m896l450j801q69j36J310
60310E99108L196M754O227Q412J1223J3755J5571J7001J8309J9264J9619J9617
$$ plain form
60409 480253 481089 482467 484714 487385 489776 491659 493117 494299 495744 498109 501129 503721 505637 508061
60395 508061 511934 516668 521200 525304 529095 532269 534794 537524 541141 545198 549056 552986 557444 562057
60381 562057 566258 570234 574374 578463 582294 586314 590752 594841 597865 600320 603065 605965 608294 609883
60367 609883 611013 611789 612500 613883 616181 618631 620689 622928 625824 628593 630392 631790 633841 636454 638998
60352 638998 641827 645811 650901 656566 663243 671943 682617 694131 705641 716848 727182 735878 742648
60339 742648 747209 748480 745482 738857 730395 721210 711452 701558 692544 684913 678236 671863 665365 658459
60325 658459 651346 644909 639734 635169 630163 624674 619343 614213 608950 604054 600604 598803 597934 597798 599108
60310 599108 602304 607058 613285 621697 632920 646675 662246 679247 697556 716820 736439 756056
60298G56056J9811K0279J9948J7364J2519P190K678j960q154j5047k0088k2097
60286G88499k2019k0911j8997j6710j4782j3081j1000r187r021j0140j0498r244
60274F22909p693o942o545o113o227o843o719n331l794k967k395j853k075k991
60260E54421l134j996j170j872k971k891j928j174o11K38R33R29P73J104J449
60245E42100J223R23J150J335P59j03m04k53j76l5M50R51J212J678K549L173L187
60228E59719L289L925M331L894L468M172N738P073P718P840P511O913O589O843
60214F39023P506Q603J0257J1651J1514J0167R541J0439J1398J1124J0349J0136
60202G61708R960Q946P667P124P117O929O627O336N359L324J260J38o33j991l520
$$ plain form
60298 756056 775867 796146 816094 833458 845977 853167 855845 853885 845731 830684 810596 788499
60286 788499 766480 745569 726572 709862 695080 681999 670999 661812 652791 642651 632153 622909
60274 622909 615216 608274 601729 595616 589389 582546 575827 570496 566702 563735 561340 559487 557412 554421
60260 554421 551287 549291 548121 546249 543278 540387 538459 537285 536674 536912 537845 538774 539547 540651 542100
60245 542100 543323 544246 545396 546731 547490 547387 546983 546730 546554 546519 546969 547920 549132 550810 553359 556532 559719
60228 559719 563008 566933 571264 575158 578626 582798 588536 595609 603327 611167 618678 625591 632180 639023
60214 639023 646529 655132 665389 677040 688554 698721 708262 718701 730099 741223 751572 761708
60202 761708 771668 780614 788281 795405 802522 809451 816078 822414 827773 831097 832357 832495 831862 829871 826351
60187H26351m340m748n533o453o811o768o867o892o391n674n249m975m677m741
60173G46232n104m764l261j651r19n91r9k28j724l488l883l048k481k830l475
60158G08686l713l202j839k33L76l52j167r33o8O46J467K679L469L152K526K515
60142G14009K535J696O87Q57K081L092L338L230L120L266M129N573O477O161N384
60127G65635M971M583L877L575M022M048K853J711K187L776N086O100P362Q028
60113H27814P032N298M664N053M825L506K198J553J207R34O73k86k469m835n808
60098H51359n339m472l418j740L6Q06O33M82M31k26j417k442l385m781o128o396
60082H14003n807n545n853n883n382n072n375o070p028q169q913q865q625q842
$$ plain form
60187 826351 822011 817263 811730 805277 798466 791698 784831 777939 771548 765874 760625 755650 750973 746232
60173 746232 741128 736364 733103 731452 730533 729942 729843 729615 727891 724403 720520 717472 714991 712161 708686
60158 708686 704973 701771 699932 699699 700075 699723 698556 697623 697555 698201 699668 702347 705816 708968 711494 714009
60142 714009 716544 718240 718927 719784 721865 724957 728295 731525 734645 737911 742040 747613 754090 760251 765635
60127 765635 770606 775189 779066 782641 786663 790711 793564 795275 797462 801238 806324 812424 819786 827814
60113 827814 834846 840144 844808 849861 854686 858192 860390 861943 863150 864084 864757 864471 862002 857167 851359
60098 851359 846020 841548 838130 836390 836426 837232 837865 838347 838778 838552 837135 834693 831308 826527 820399 814003
60082 814003 808196 802651 796798 790915 785533 780461 775086 769016 761988 753819 744906 736041 727416 718574
60068G18574q993q345p426p130p051o244n040m486m482m093l260k672k337j897
60054F45118j788k508l171k508q89K74P15J313K406L760N581P871R287Q604O878
60039F80943O249O943P328O534N091L302J095p56j338j381k384m029m632m001
60025F98964l744m606n698o525p718r296j0213j0172j0104j0376j0180r160q112
60012E93060p558p016o115n157m310l426k763k646k516j610m73l08r87j213n64
59997E46398J92O25J006J258J189J486K871M555N194N182O001P606Q466Q071P327
59982F07427O515M958K835J215J26j384l088l669l191l275m438n329n107m561
59968E89034m304l868l139k817k879k399j356p77p19k4J420K226J872J482J739
$$ plain form
60068 718574 709581 701236 693810 686680 679629 673385 668345 663859 659377 655284 652024 649352 647015 645118
60054 645118 643330 640822 637651 635143 634254 634528 635243 636556 638962 642722 648303 656174 665461 674065 680943
60039 680943 687192 694135 701463 707997 713088 716390 717485 716729 715391 714010 711626 707597 702965 698964
60025 698964 695220 690614 684916 678391 670673 661377 651164 640992 630888 620512 610332 601172 593060
60012 593060 585502 578486 572371 567214 562904 559478 556715 554069 551553 549943 549470 549162 548175 546962 546398
59997 546398 546590 547215 548221 549479 550668 552154 555025 559580 564774 569956 575957 583563 592029 600100 607427
59982 607427 613942 618900 621735 622950 623076 621692 618604 614935 611744 608469 604031 598702 593595 589034
59968 589034 584730 580862 577723 574906 572027 569628 568272 567495 566776 566752 568172 570398 572270 573752 575491
59953E75491J941J794K082K822K763J587P18J029J568J385Q38K74p47k019k304
59938E89222j369o72j144j885j937j554r10N71K584L619L437L984O459R201J0035
59923F19641R204Q358P946P244N952M312K392M90m82r8Q43J407J698K146K505
59908F73558K283J401J6j539k398j910r52j172k676l898m034l837l619k429n4
59893F48740K052K931L485M612N633N825N890O609P367P436P462Q299R414R774
59879G35529R434R083Q866Q697Q815R041Q380O370L965K191Q44o10j890k663l513
59864H02539n097p022q444r126r193q568p369o195n396m670l828l160k764k353
59850G19354j950j863j794j065J79J192K071L562N437O659P433R109J1681J3289
$$ plain form
59953 575491 577432 579226 581308 584130 586893 588480 589198 590227 591795 593180 594018 594292 593545 591526 589222
59938 589222 587853 587181 586037 584152 582215 580661 579751 580322 582906 586525 589962 593946 600405 609606 619641
59923 619641 628845 637203 645149 652393 658345 662657 665049 665539 665057 664959 665802 667209 668907 671053 673558
59908 673558 675841 677242 677258 675719 673321 671411 670459 669287 666611 662713 658679 654842 651223 648794 648740
59893 648740 650792 653723 657208 661820 667453 673278 679168 685777 693144 700580 708042 716341 725755 735529
59879 735529 744963 754046 762912 771609 780424 789465 797845 804215 808180 810371 811215 810605 808715 806052 802539
59864 802539 797442 790420 781976 772850 763657 755089 747720 741525 736129 731459 727631 724471 721707 719354
59850 719354 717404 715541 713747 712682 712861 714053 716124 719686 725123 731782 739215 748324 760005 773294
59836G73294J2858J1356R731P597M863K832K526L488N180P799J0646J1563R308
59823H73041N116P85l279p030r553j0248r906r400q579p514p230q031q649q259
59809G81264p803q069q136p167o070n805n538m240k746k443l012l203k887k755
59795G11390k865k943l227l724l595k585j944k568l411l118k124j592j437j020
59781F75237q16j568k528k310r45L53J098J735K397K736K763K879L323M194N512
59766F94060O727O987O396N972O002N631M661M209M826N535N648N904O764P287
59752G76609O917O771P662Q470P967O843O278N893M724L045J636M00q28j310p10
59737H40367j50n01r05m54Q4j81l77O80K328L118K927K478J887J248J359K368
$$ plain form
59836 773294 786152 797508 807239 814836 819699 822531 825057 828545 833725 841524 852170 863733 873041
59823 873041 878157 878942 875663 868633 859080 848832 838926 829526 820947 813433 806203 798172 789523 781264
59809 781264 773461 765392 757256 750089 744019 738214 732676 728436 725690 723247 720235 717032 714145 711390
59795 711390 708525 705582 702355 698631 695036 692451 690507 687939 684528 681410 679286 677694 676257 675237
59781 675237 674421 672853 670325 668015 667070 667423 668521 670256 672653 675389 678152 681031 684354 688548 694060
59766 694060 700787 707774 714170 720142 726144 731775 736436 740645 745471 751006 756654 762558 769322 776609
59752 776609 783526 790297 797959 806429 814396 821239 827517 833410 838134 841179 842815 843215 842387 841077 840367
59737 840367 840217 839716 838811 838357 838441 838260 837883 838563 840891 844009 846936 849414 851301 852549 853908 856276
59721H56276K916K216J466J636J548J14j269q89K39Q9q42l94J710L762M910N742
59705H79230O527P019P585Q593R273Q963Q643R347J0058R326P945P717Q451Q653
59691I97330Q413Q839R265P787M438J231r50l014n211o469o477o250o323o278
59677I96331o280p210q996j0501j1238j1638j1669j0821r412q364p686o701n515
59664H80300m686l801k038J20J526K444M156O618Q383Q845Q843Q976Q967Q688
59650I37341Q385P846O662N064L312P58l058p105j0234j3045j6493j9437j9807
59637H80189j7821j5759j4693j3647j1966j0296q989p581o131n461n719o262o954
59624G48910q150r539j0437j0977j1513j1281r426o897n448n101m552l676l511
$$ plain form
59721 856276 859192 861408 862874 864510 866058 866172 864903 864014 864253 864342 863500 863106 864816 868578 873488 879230
59705 879230 885757 892776 900361 908954 918227 927190 935833 945180 955238 964564 972509 980226 988677 997330
59691 997330 1005743 1014582 1023847 1031634 1036072 1037303 1036353 1033339 1028128 1021659 1015182 1008932 1002609 996331
59677 996331 990051 982841 973845 963344 952106 940468 928799 917978 908566 900202 892516 885815 880300
59664 880300 875614 871813 869775 869895 871421 873865 878021 884639 893022 901867 910710 919686 928653 937341
59650 937341 945726 953572 960234 965298 968610 969368 966310 959205 948971 935926 919433 899996 880189
59637 880189 862368 846609 831916 818269 806303 796007 787018 779437 773306 767845 762126 755864 748910
59624 748910 740760 731221 720784 709807 698294 687013 677587 670690 665242 660141 655589 651913 648402
59611F48402l921l556k192j085q29p31m52l74l33K95J214J579J591J975K193J211
59595F44987k50l88Q79J903K045K206K619K496K009K304L188L006J294n53j653
59580F66092k579l585l977l800m071m818m837l878l214l492l930m104m588n263
59566F09956m987l612k533k517k662k170j490j086o59j96k49p07p31k65m5L1Q71
59549E86949K326L158L178L532M538N182N117N251N876O213O322P428R716J1946
59535F66732J3995J7609K3316K8346K9094K4585J6713Q330J841j568k358j717
59523H24918j21K306M399M628L205J752P66q29l437o178q703j1577j4374j5513
59509G81242j4762j3893j4081j4443j3914j2770j1459r708p654o311o007n775
$$ plain form
59611 648402 644481 640925 638733 637648 636819 636088 635636 635262 634929 635224 636438 638017 639608 641583 643776 644987
59595 644987 644737 644349 645228 647131 649176 651382 654001 656497 658506 660810 663998 667004 668298 667745 666092
59580 666092 663513 659928 655951 652151 648080 643262 638425 634547 631333 627841 623911 619807 615219 609956
59566 609956 604969 601357 598824 596307 593645 591475 589985 588899 588240 588044 587795 587088 586357 586092 586047 586078 586949
59549 586949 589275 592433 595611 599143 603681 608863 613980 619231 625107 631320 637642 645070 654786 666732
59535 666732 680727 698336 721652 749998 779092 803677 820390 828720 830561 828993 826635 824918
59523 824918 824797 827103 831502 836130 839335 841087 841853 841024 837587 831409 822706 811129 796755 781242
59509 781242 766480 752587 738506 724063 710149 697379 685920 676212 668558 662247 656240 650465
59497F50465m887l645k282o58O08M81n29n66R25K524L243L728M483M889M682M560
59481F68021M638M141L221L077L693L574K441J953K858L699L445L158L682L844
59467G15445K542P76m8k41o99j072o13L52J171K034L305M699O042P693R432J0186
59451G61004R661Q817Q129O829M712K987K398J972O42j348l500n952q430r842
59437G78079r860r410q808p180m576k764k752l282l026k517k545k375j118O23
59423G18489K000L449N563P768R512J1505J4231J6478J6990J6481J6437J6875
59411H55778J7055J7751K0726K5744K9400K7514J8599N209p760j6404j9856j9360
59399I54396j6097j0560l111N866J5550K3138K4105J6395L808p224j3923j7912
$$ plain form
59497 650465 645578 641933 639651 638993 639601 640082 639553 638987 639912 642436 645679 649407 653890 658779 663461 668021
59481 668021 672659 676800 680021 683098 686791 690365 692806 694759 697617 701316 704761 707919 711601 715445
59467 715445 717987 718763 718715 718474 717775 716703 716090 716442 717613 719647 722952 727651 733693 741386 750818 761004
59451 761004 770665 779482 787611 794440 799152 802139 804537 806509 807151 805803 802303 796351 787921 778079
59437 778079 768219 758809 750001 742821 738245 735481 732729 729447 726421 723904 721359 718984 717866 718489
59423 718489 720489 723938 729501 737269 746781 758286 772517 788995 805985 822466 838903 855778
59411 855778 872833 890584 911310 937054 966454 993968 1012567 1017776 1010016 993612 973756 954396
59399 954396 938299 927739 924628 930494 946044 969182 993287 1009682 1013490 1006266 992343 974431
59387I74431k0440k0337j7129j2729q921n703l097j964j962j282L95J173K10p76
59373H81869n08l2k82l22M66Q54J7q88r02q03j052m70J429L086L478L753M827
59356H94520N708N920P077J0111J3273J4918J6003J7813J9507K0079K0586K2016
59344A067531K3015K2147K0514J9713J9014J6949J3987J1239Q162L975k22l124
59332A222900n572q917j2444j4705j6041j7498j8660j8763j8575j9011j9322j8727
59320A034665j8292j8905j9135j7561j5630j5473j6326j5922j4252j3145j3027
59309H56997j2841j2438j2475j2549j1761j0524r769r101p720o264n616n002l339
59296G37598j397l09Q61L603P115R598J1544J4967J9749K3147K2762J8115R977
$$ plain form
59387 974431 953991 933654 916525 903796 894875 889172 886075 884111 882149 880867 881262 882435 882645 881869
59373 881869 881361 881329 881047 880725 881191 882045 882062 881174 880272 879469 878417 877947 879376 882462 885940 889693 894520
59356 894520 900228 906148 913225 923336 936609 951527 967530 985343 1004850 1024929 1045515 1067531
59344 1067531 1090546 1112693 1133207 1152920 1171934 1188883 1202870 1214109 1222271 1226246 1226024 1222900
59332 1222900 1217328 1208411 1195967 1181262 1165221 1147723 1129063 1110300 1091725 1072714 1053392 1034665
59320 1034665 1016373 997468 978333 960772 945142 929669 913343 897421 883169 870024 856997
59309 856997 844156 831718 819243 806694 794933 784409 774640 765539 757819 751555 745939 740937 737598
59296 737598 736201 735892 736753 740356 747471 757069 768613 783580 803329 826476 849238 867353 877330
59283H77330K86p783j1849j2246j0655p738l754q4K134L907O684R702J1213J1430
59269H68577J1897J2802J3179J3077J3182J2895J1009P790M406R51k938o371q171
59256I52285q813r378r529q632p784q333r310q801p074n831n122l625j402K94
59242H58945J579L673O270P679P540P198P391P608P669P878P733O289L758J148
59228I42358j385m264p116r191j0620j1812j2398j2181j2137j2838j3137j2086
59216H23193j0843j0749j0928r931q265p031n610l233j375j685k796k182j30J143
59202G49578J341J883K740K726K426L532N562O362N740N641O818Q119R006J0021
59188H21495J0844J0609J0023J0539J1518J0924Q679O714N682M338K146j5j754
$$ plain form
59283 877330 877616 869833 857984 845738 835083 827345 823591 823507 825641 829548 836232 845934 857147 868577
59269 868577 880474 893276 906455 919532 932714 945609 956618 964408 968814 969765 966827 960456 952285
59256 952285 943472 934094 924565 915933 908149 899816 890506 881705 874631 868800 863678 860053 858651 858945
59242 858945 860524 864197 870467 878146 885686 892884 900275 907883 915552 923430 931163 937452 941210 942358
59228 942358 940973 936709 929593 920402 909782 897970 885572 873391 861254 848416 835279 823193
59216 823193 812350 801601 790673 780742 772477 765446 759836 756603 755228 753543 750747 748565 748435 749578
59202 749578 750919 752802 755542 758268 760694 764226 769788 776150 781890 787531 794349 802468 811474 821495
59188 821495 832339 842948 852971 863510 875028 885952 894631 901345 907027 911365 913511 913496 911742
59175I11742l404m435m074l295l750m946m921l504k325j858j096m4J34n85j051
59160H72588j176j833k795l180l589n277p588q807r156j0216j1767j2039j0923
59147G84242j0089j0049r875r542r855j0265r564q436q517r243q647o853n714
59134F67593n285l947j857q67j030n04J001J974K399L848O151P409P601Q744J1103
59119G04333J2757J3328J4523J6446J6956J5654J4936J6049J7341J7486J7233
59108H77042J6881J5242J2374J0407J0301J0430R496Q269P473O481N063L915K750
59095I96124L64k750m488m373l939l593k100K77J415P86J00k27j923n196p679
59080I62798q254q764j0586j2528j3468j4092j4634j3807j1458r561r197r063
$$ plain form
59175 911742 908338 903903 899829 896534 892784 887838 882917 879413 877088 875230 874134 874090 874224 873639 872588
59160 872588 871412 869579 866784 863604 860015 854738 847150 838343 829187 818971 807204 795165 784242
59147 784242 774153 764104 754229 744687 734832 724567 715003 706567 698050 688807 680160 673307 667593
59134 667593 662308 658361 656504 655637 654607 654103 655104 657078 659477 663325 669476 676885 684486 693230 704333
59119 704333 717090 730418 744941 761387 778343 793997 808933 824982 842323 859809 877042
59108 877042 893923 909165 921539 931946 942247 952677 962173 970442 977915 984396 989459 993374 996124
59095 996124 996488 993738 989250 984877 980938 977345 975245 975522 976937 977723 977823 977596 975673 970477 962798
59080 962798 954544 945780 935194 922666 909198 895106 880472 866665 855207 845646 836449 827386
59068H27386q227p738q288q877q958r359j0071r734q305p507p766p476o188n483
59054G13409n760n313l693k793l384l719k853k155k233j632j6O74j56k78J452
59039F81550K916K380J233J170J544J557K207M012N395N372N329O413P619Q208
59025G36905R413J2032J4834J6933J9134K1522K2524K1799K0993K0175J6891J0650
59013I43805M849K013L26k580n588o511n725m609k887k02K037K915L932O290Q479
58998I46544Q803Q018P215N504K131j354l545n514q412j0912j1430j0864j0767
58985I15417j0876j0518j0404j0853j0317p921n339m113l184j121J372L249N142
58972H50534P500Q990Q863Q682R666J0632J0541J0543J1370J1439R796Q241Q002
$$ plain form
59068 827386 819159 811421 803133 794256 785298 775939 765868 756134 747829 740322 732556 725080 718892 713409
59054 713409 707649 702336 698643 695850 692466 688747 685894 683739 681506 679874 679858 680532 680376 680098 681550
59039 681550 684466 686846 688079 689249 690793 692350 694557 698569 703964 709336 714665 721078 728697 736905
59025 736905 746318 758350 773184 790117 809251 830773 853297 875096 896089 916264 933155 943805
59013 943805 948654 950667 950993 948413 942825 936314 930589 925980 923093 922891 924928 927843 931775 938065 946544
58998 946544 955347 963365 970580 976084 978215 976861 973316 967802 959390 948478 937048 926184 915417
58985 915417 904541 894023 883619 872766 862449 854528 849189 845076 841892 840771 842143 845392 850534
58972 850534 858034 867024 875887 884569 894235 904867 915408 925951 937321 948760 958556 966797 974799
58959I74799P096L701m25k901m621p679j1449j3891j4949j5817j6469j6444j6462
58946H64489j6862j6256j3977j1854j1334j0998r228p056n887m717k299J97J278
58933G55496J778K729K826P72j989l546m425n647o216n312m567n254n543l604
58919G17498j137n27q29j0J003J49j612j658R6J704K665L780M799N155N794P590
58903G44460R319R755J0156J2025J4245J5165J5642J7133J8635J8571J7834J8014
58891I20954J8346J7508J6621J7342J8745J9211J9518K0944K2064K0763J7719
58880A129735J4742J1456O919K614K95j381m521q052r652r984j1201j2779j2732
58867A095459j1723j2077j3656j4338j3790j3454j3590j3492j3647j4686j5346
$$ plain form
58959 974799 981895 985596 985171 982270 977649 969970 958521 944630 929681 913864 897395 880951 864489
58946 864489 847627 831371 817394 805540 794206 783208 773980 766924 761037 756320 754021 754218 755496
58933 755496 757274 760003 762829 763601 761612 758066 753641 747994 741778 736466 731899 726645 721102 717498
58919 717498 716361 715834 715005 714995 715998 716147 714535 712877 712973 714677 717342 721122 725921 731076 736870 744460
58903 744460 753779 763534 773690 785715 799960 815125 830767 847900 866535 885106 902940 920954
58891 920954 939300 956808 973429 990771 1009516 1028727 1048245 1069189 1091253 1112016 1129735
58880 1129735 1144477 1155933 1162852 1165466 1165761 1164380 1159859 1151807 1142155 1132171 1120970 1108191 1095459
58867 1095459 1083736 1071659 1058003 1043665 1029875 1016421 1002831 989339 975692 961006 945660
58856I45660j4460j3556j4428j5727j5091j3146j1951j1164r310p342p252q453
58844H03780r083r542j1147j2760j2444j1155j1021j1379j0226q256p441p003
58832F82323m852j901p50j132p96J04l64j630j288N40J510J348J920L432M240
58817F82704M050L924L663K557J802K761L785K517J95k55O96K39j607k258j468
58802G03305j503k663k932k082k061l152l470k537j904k100k141j944k209k259
58788F70348r18J014K077K961M999P124P584P415Q687J0669J1334J1208J1907
58775G56409J2351J0498P430N469L753rm748p600q856j0697j2361j1612r733r901
58761G20393j1517j1418r806r469r949q144m339k010j729q38R07R83m72n00J069
$$ plain form
58856 945660 931200 917644 903216 887489 872398 859252 847301 836137 826827 819485 812233 803780
58844 803780 794697 785155 774008 761248 748804 737649 726628 715249 705023 696767 689326 682323
58832 682323 677471 675570 674820 673688 672892 672996 672632 671002 669714 670254 671764 673112 675032 678464 682704
58817 682704 686754 690678 694341 696898 698700 701461 705246 707763 707958 707703 708399 708638 707031 704773 703305
58802 703305 701802 699139 696207 694125 692064 688912 685442 682905 681001 678901 676760 674816 672607 670348
58788 670348 669430 670444 672521 675482 680481 687605 695189 702604 711291 721960 733294 744502 756409
58775 756409 768760 779258 786688 792157 795910 795901 791153 783553 774697 764000 751639 740027 730294 720393
58761 720393 708876 697458 687652 678183 668234 660090 655751 653741 652012 651174 652081 653064 652592 652092 653161
58746F53161J367L34J229M592P126P562Q324J0313J1154R963R096R849J0767J1222
58732G56059J2350J3703J3317J1671J1160J1306R151M807J711Q99l6j745k027
58719H42326n79K80M14K242N498O854N785N523P021P256M779J888j64l004o734
58704H79385q874r258j0995j4891j7802j8215j8608k0521k2006k1714k0939k0013
58692F75549j7267j3144j0742j0676r956p410n529n537n490m708n143o759o566
58679E66622m020k433l160l361j411M05N81R41K433L126K399K549M309N387N234
58664E79601O495R900J2579J3138J3443J3642J0816M675o79l042m981q232j0455
58651F36900j0120r468r955r668p839o990q102q500p021o200o930o235k980m88
$$ plain form
58746 653161 654528 654862 656091 660683 667809 675371 683695 694008 705162 715125 724221 734070 744837 756059
58732 756059 768409 782112 795429 807100 818260 829566 838717 843524 845235 846134 846098 844353 842326
58719 842326 841747 842027 842441 844683 850181 857035 862820 868343 875364 882620 887399 889287 889123 886119 879385
58704 879385 870511 861253 850258 835367 817565 799350 780742 760221 738215 716501 695562 675549
58692 675549 658282 645138 634396 623720 613764 606354 600825 595288 589798 585090 579947 573188 566622
58679 566622 562602 560169 557009 553648 552237 552642 553223 554164 556597 559723 562122 564671 568980 574367 579601
58664 579601 586096 595996 608575 621713 635156 648798 659614 664289 663610 660568 655587 647355 636900
58651 636900 626780 617312 607357 597689 589850 582860 574758 566258 559237 553037 546107 539872 536892 536404
58637E36404o38o30J352K600J243j3J045K246J569Q20J399J138j204k901k017
58622E42413p96j066q83J115K622K185K192M206N867N607N683P350P923N966M492
58607E94876N491O185M346K449K859L594K690K013K979L161R97p31M5Q20m82j385
58591F29907L06K264K268K441M894P611Q710J0196J3414J5447J4141J2224J2338
58578G36161J2542J0811R269R704R676P456O075P995J0502J0924J1637J5123J8913
58565H76788K0405K2133K7042L2860L6228L8214M0687M1434L7956L2248K6961
58554A232956K0823J2560N068Q50k515p517j1654j2086j1021j1494j2122j1130
58542A192718j1163j4850j9733k2830k5902l1067l5541l6118l4704l4059l2482
$$ plain form
58637 536404 535766 535136 536488 539088 540331 540318 541363 543609 545178 545998 547397 548535 547331 544430 542413
58622 542413 541617 540551 539668 540783 543405 545590 547782 551988 557855 563462 569145 576495 584418 590384 594876
58607 594876 600367 606552 610898 613347 616206 619800 622490 624503 627482 630643 631640 630909 630954 631774 631292 629907
58591 629907 630213 632477 634745 637186 642080 649691 658401 668597 682011 697458 711599 723823 736161
58578 736161 748703 759514 768783 778487 788163 795619 801694 809689 820191 831115 842752 857875 876788
58565 876788 897193 919326 946368 979228 1015456 1053670 1094357 1135791 1173747 1205995 1232956
58554 1232956 1253779 1266339 1271407 1272257 1269742 1262225 1250571 1238485 1227464 1215970 1203848 1192718
58542 1192718 1181555 1166705 1146972 1124142 1098240 1067173 1031632 995514 960810 926751 894269
58531H94269k8083k3847k2697k1856j7845j2907j0727r983p941o183o879p541
58519G17780n464l284m174n677m319k149k475l317j413J217J097k70L6L58j703
58504F86243l541k050K07k69j247O44K920J813l41O56L106L061J949L314N586
58489G02051N333M330O279R762J1374J2435J5737J9251J9987K0419K3956K7860
58477H78774K7901K6078K6257K6074K1051J3088O946J807n680j3470j7275j8418
58465I73133k0581k2107j9490j5107j3291j2097p166m47L286N237R452J4288J5606
58452I10716J5192J7093J8805J5155Q005L008l92o540j3968j7555j7877j9250
58440I12392k0861j8921j5166j4031j3839r994m403k399k767l47M000N570N461
$$ plain form
58531 894269 866186 842339 819642 797786 779941 767034 756307 746324 738383 732200 725321 717780
58519 717780 712316 709032 704858 699181 694862 692713 690238 686921 685508 686725 687822 687552 687588 687946 686243
58504 686243 682702 680652 680859 680590 679343 679987 682907 684720 684379 685035 688141 691202 693151 696465 702051
58489 702051 707384 711714 717993 727755 739129 751564 767301 786552 806539 826958 850914 878774
58477 878774 906675 932753 959010 985084 1006135 1019223 1026169 1027976 1022296 1008826 991551 973133
58465 973133 952552 930445 910955 895848 882557 870460 863294 862847 866133 871370 880822 895110 910716
58452 910716 925908 943001 961806 976961 984966 987974 987582 981042 967074 949519 931642 912392
58440 912392 891531 872610 857444 843413 829574 819580 815177 812778 810011 809664 813664 819234 824695
58427H24695Q247J2434J3166J2130J4591J8742J8292J3691J0443Q166K009o567
58415I50039j1120j1318j2478j5126j5128j3047j3269j4898j3409j0067r791j1265
58403G99123r272n117m325n711l451J581L463K618M500Q318Q283M905L821M590
58389H13326J984k785l665j457k293n519m856o95O93o67R84N211O141M297N582
58374H16281R217R039N975O634J0327J0393P606R016J3962J4808J1458J1439J5507
58361I51662J6778J4431J4409J6333J3618P054M235N079K118m360o084k217l15
58348A032741j162K207R367J1768Q576P998J1308J1011O525N967J0330J1642Q960
58335A137238J0324J6458J8628J5289J4720J8481J8510J3376J0940J2100Q634
$$ plain form
58427 824695 832942 845376 858542 870672 885263 904005 922297 935988 946431 954597 956606 950039
58415 950039 938919 927601 915123 899997 884869 871822 858553 843655 830246 820179 810388 799123
58403 799123 789851 784734 780409 774698 771247 772828 776291 778909 783409 791727 800010 804915 808736 813326
58389 813326 815310 812525 808860 807403 805110 799591 794735 794040 794733 794066 795050 800261 806402 810699 816281
58374 816281 825498 834537 840512 847146 857473 867866 875472 884488 898450 913258 924716 936155 951662
58361 951662 968440 982871 997280 1013613 1027231 1034285 1038520 1043599 1045717 1041357 1035273 1033056 1032741
58348 1032741 1031579 1033786 1043153 1054921 1063497 1071495 1082803 1093814 1100339 1106306 1116636 1128278 1137238
58335 1137238 1147562 1164020 1182648 1197937 1212657 1231138 1249648 1263024 1273964 1286064 1294698
58324A294698K69l198o0J39n020o686k535r98l934k887L284N083J032J320Q358
58309A288865J2117R624J0322J6948K0027J6829J6674K1755K1981J4793J0711
58298A460646J3197J2611O268M370R619J1353O662O592J4401J8631J4995J3952
58286A593297J9237K0632J5620J5988K4937L0153K7640K9177L7835M0095L1424
58275A886035K5198K6743K3654J2071O766J4042K0536K0398K7021M5408N9855
58264B167727O2290O5853P6844Q0881P1293O3338O5125O2502M8263L7772L9696
58253B841584M0188L2468L2101M5885N6022N2947N2876O4743P2082O6549O6065
58242C423510P9739Q8922Q3932Q4317J00949J14445J13875J19053J40339J55581
$$ plain form
58324 1294698 1294967 1291769 1291709 1291848 1286828 1280142 1277607 1276609 1272675 1269788 1273072 1278155 1279187 1280507 1288865
58309 1288865 1300982 1310606 1320928 1337876 1357903 1374732 1391406 1413161 1435142 1449935 1460646
58298 1460646 1473843 1486454 1492722 1497092 1506711 1518064 1524726 1531318 1545719 1564350 1579345 1593297
58286 1593297 1612534 1633166 1648786 1664774 1689711 1719864 1747504 1776681 1814516 1854611 1886035
58275 1886035 1911233 1937976 1961630 1973701 1980467 1994509 2015045 2035443 2062464 2107872 2167727
58264 2167727 2230017 2295870 2372714 2453595 2524888 2588226 2653351 2715853 2764116 2801888 2841584
58253 2841584 2881772 2914240 2946341 2992226 3048248 3101195 3154071 3218814 3290896 3357445 3423510
58242 3423510 3503249 3592171 3676103 3760420 3861369 3975814 4089689 4208742 4349081 4504662
58232D504662J52638J54307J74151J89579J87279J91533K17071K39151K42847
58223F253218K54664K90786L23329L34921L55371M04660M53079M79933N15363
58214I665324N78896O36727O69575P20635Q22976R44492J060071J206274J403521
58205A7708491J603632J785480K020931K370813K805517L308957L954282M778428
58197D0336531N699114O673094P811605R214981J0855414J2792588J5331047J8780348
58189A27494722K3306912K9226885L6842342M5052966N0220699M7698414L5547673
58182C95390613J6665734l181582j9294227k9975155l5560230l6893041l4986151
58175B52165961l1171565k6695674k2194811j7871963j4052361j1262090r799561
$$ plain form
58232 4504662 4657300 4811607 4985758 5175337 5362616 5554149 5771220 6010371 6253218
58223 6253218 6507882 6798668 7121997 7456918 7812289 8216949 8670028 9149961 9665324
58214 9665324 10244220 10880947 11550522 12271157 13094133 14038625 15098696 16304970 17708491
58205 17708491 19312123 21097603 23118534 25489347 28294864 31603821 35558103 40336531
58197 40336531 46035645 52708739 60520344 69735325 80590739 93383327 108714374 127494722
58189 127494722 150801634 180028519 216870861 261923827 312144526 359842940 395390613
58182 395390613 412056347 408874765 389580538 359605383 324045153 287152112 252165961
58175 252165961 220994396 194298722 172103911 154231948 140179587 128917497 119117936
58168A19117936r457075r686528r931373r845956r356787q580321p660340o682553
58160D7917003n722309m877929m200180l647913l164117k746064k401862k099479
58152A9057150j810915j557045j359789j194508j034104q95833q00026p24321
58144I680609o42768n71163n30548n02017m59731m15139l88127l65767l28946
58135E476403k90458k68769k51336k20073j87268j71646j63731j48066j35366
58126C639690j39812j47691j40712j28502j27245j27651j14645r8147r4091r4143
58116B427051q3593p0768p0010p3220o6311n7054n9045o4253n8499m8671m8099
58105A727528m9780m0409k7052k4226k7418k4256j9426k4165l3031l4784l4877
$$ plain form
58168 119117936 109660861 99974333 90042960 80197004 70840217 62259896 54599556 47917003
58160 47917003 42194694 37316765 33116585 29468672 26304555 23558491 21156629 19057150
58152 19057150 17246235 15689190 14329401 13134893 12100789 11204956 10404930 9680609
58144 9680609 9037841 8466678 7936130 7434113 6974382 6559243 6171116 5805349 5476403
58135 5476403 5185945 4917176 4665840 4445767 4258499 4086853 3923122 3775056 3639690
58126 3639690 3499878 3352187 3211475 3082973 2955728 2828077 2713432 2615285 2521194 2427051
58116 2427051 2343458 2272690 2202680 2129460 2063149 2006095 1947050 1882797 1824298 1775627 1727528
58105 1727528 1677748 1637339 1610287 1586061 1558643 1534387 1514961 1490796 1457765 1422981 1388104
58094A388104m3909n4856n4415m6472m2390l8619k5892j0520m755n215j677J987
58082A061371l721j3653j6622j5730k0424k6769k5299k0262k1632k5796k3251
58071H48212j7797j9067k3406k1004j5046j5041j7894j4190p040o244r498p454
58059F74531k058k208o222n857k958n298j0483j0451p434r398j4093j3524r701
58046E74846j0276j3018j0280m590m244p506o541l003m372q708q303m825n669
58033D83511q825o592j070q68n257o448m832p192j2219j2509q851q215r598o103
58019C84932P71L043Q54J370M515L560j351l639l215n896j0834j1492q270p534
58005C46814q901o125J71L115K318L690P250P301M288M244O857O129K616K964
$$ plain form
58094 1388104 1344195 1289339 1234924 1188452 1146062 1107443 1081551 1071031 1066276 1061061 1059384 1061371
58082 1061371 1057650 1043997 1027375 1011645 991221 964452 939153 918891 897259 871463 848212
58071 848212 830415 811348 787942 766938 751892 736851 718957 704767 697727 691483 681985 674531
58059 674531 672473 670265 664043 658186 655228 649930 639447 628996 621562 612164 598071 584547 574846
58046 574846 564570 551552 541272 536682 532438 524932 518391 515388 511016 502308 494005 489180 483511
58033 483511 474686 468094 467024 466156 460899 454451 449619 442427 430208 417699 408848 400633 391035 384932
58019 384932 385703 388746 389600 390970 395485 399045 397694 394055 390840 384944 374110 362618 354348 346814
58005 346814 337913 331788 331959 335074 337392 341082 348332 355633 359921 364165 371022 377151 379767 382731
57991C82731P255Q702O155N249O816N686J538k65O78p41m602n607l690m282p503
57976C98120p690m328k866m041k862J066K504Q04R29L453L548Q02L8J516K78l776
57960C87495n159l133k938n549o090l773l525o195o720l840k283l533l515j226
57946C30016o42k301j748J798L850L276M025O816P737O550P675J1420J3005J1747
57932D03224J2366J5471J5793J1887Q692Q176O185J087k968m089n732r185j0903
57919D50004r953j0231j2788j3608j1489j0362j1363j0464o524l928m466m241
57907C40587j447K55r94j972j146j558m091n006l062k021l298l118L2K265J574
57892C17000J365L621N297M670M688O819P986O792O341P883P987N143K857L093
$$ plain form
57991 382731 389986 398688 404843 410092 416908 422594 424132 423867 424545 423804 419202 413595 409905 405623 398120
57976 398120 390430 386102 383236 379195 376333 377399 379903 380707 381636 385089 388637 389439 389477 390993 391271 387495
57960 387495 382336 379203 376265 370716 364626 360853 357328 351133 344413 340573 338290 334757 331242 330016
57946 330016 329374 327073 325325 327123 330973 334249 338274 345090 352827 359377 367052 378472 391477 403224
57932 403224 415590 431061 446854 458741 467433 475609 481794 482881 479913 475824 470092 460907 450004
57919 450004 440051 429820 417032 403424 391935 381573 370210 359746 353222 349294 344828 340587
57907 340587 339140 339395 338401 336429 335283 333725 329634 324628 321566 319545 316247 313129 313161 315426 317000
57892 317000 318365 321986 327283 331953 336641 343460 351446 358238 364579 372462 380449 385592 388449 391542
57878C91542K841L06j665j452j862m292n706m583l899n171n387l001j073j376
57864C55222j184R38K077Q39M69K835M965M749M560N969O583N304N096P295Q637
57849D14354P205N759O030N356K335M4L09K66j891l350k380j944l845m870k685
57834D20693k84n25j394o43j12j416k171n59J001N91M51K171L056J167p30k13
57818D21083M31j141k913k834l034n554q061p997p010p326p662o428n113m924
57804C51517m182k426k701o155q892p982o092o216o505m553k315k202k414p38
57790B88144R99O80K41J854L521K977K190L547N218M855M331O153Q565Q826Q211
57775C50312R159J0518J0063Q838Q684Q313N989L222J783J60l061n616n444m829
$$ plain form
57878 391542 394383 394689 393024 391572 389710 385418 379712 375129 371230 366059 360672 357671 356598 355222
57864 355222 354038 354976 357053 357892 358361 361196 366161 370910 375470 381439 388022 393326 398422 405717 414354
57849 414354 421559 427318 433348 438704 441039 441083 441392 441658 439767 436417 434037 432093 428248 423378 420693
57834 420693 420409 419884 418490 417847 417735 416319 414148 413589 414590 415181 415632 417803 420859 422026 421296 421083
57818 421083 421514 420373 417460 414626 411592 406038 397977 389980 382970 375644 367982 361554 356441 351517
57804 351517 347335 344909 342208 336053 327161 319179 313087 306871 300366 295813 293498 291296 288882 288144
57790 288144 289143 289823 290064 291918 295439 298416 300606 304153 309371 314226 318557 324710 333275 342101 350312
57775 350312 359471 369989 380052 388890 397574 405887 411876 415098 416881 417041 413980 408364 402920 398091
57761C98091o327p920o796m684m613n385m136j755q86j001q8R93M24n42J79J509
57745C57063J537J466L059M664M071K771L029L324J227j617k134j093j092j558
57731C74717n23P37j76j908j461M49R56L24R16K241J876J90l51K74Q7q19p26J36
57713C76939L35M51J777L122K623J447J832K858K101J28o69l93q20j483o60Q67
57697C90455J035M23J084K436K248P67l4l66j992m560o192o934q129r233q814
57682C52194p622p287p004m929j771N37K450N590R245J1750J4088J8455K4412
57669D10108L0246L7005M7440O1807P7687R2040R9915R3744O9399L2424n888l7804
57657A008123o1177p4872p8135p3917o7385o0552n2375m3644l7076l2716k7912
$$ plain form
57761 398091 391764 383844 377048 372364 367751 362366 358230 356475 355589 354588 354500 355493 355917 355375 355554 357063
57745 357063 358600 360066 363125 367789 371860 374631 377660 380984 382211 380594 378460 377367 376275 374717
57731 374717 374194 374931 374755 372847 371386 371835 372791 373115 374031 376272 378148 378338 377987 378261 378348 377529 376803 376939
57713 376939 377274 377725 379502 382624 385247 386694 388526 391384 393485 393613 392944 392551 391731 390248 389588 390455
57697 390455 391490 391913 392997 395433 397681 398448 398414 398048 396056 391496 385304 378370 370241 361008 352194
57682 352194 344572 337285 330281 325352 323581 324118 326568 332158 341403 353153 367241 385696 410108
57669 410108 440354 477359 524799 586606 664293 756333 856248 949992 1019391 1051815 1045927 1008123
57657 1008123 946946 872074 793939 720022 652637 592085 539710 496066 458990 426274 398362
57646C98362k2214j7992j5867j3723j0740q518p580o483m911m231m508m178l007
57633B74410k320k236j740j312k320l970m121l020k890l998m482l953l880m425
57619B29743m175l087k615k922k896k693l305m064l590k626k787l284k304q09
57605A88586j185k788k810j144l15p51k68J629K904K768K571K665J908N59K00
57590A94529O26J57r52q59L00P31N79J444K568J558j115k453j853j639k511k748
57574A88362k240k938m624m647k709j704k794l706l116k688l465m050l713l713
57560A42255m233l563j563m70r90j052L86J601J459J157J442J409J198K517N203
57545A46756O597N569L997L096J694o24k018j533o03j52O85J818J502l82j646
$$ plain form
57646 398362 376148 358156 342289 328566 317826 309308 301728 295245 290334 286103 281595 277417 274410
57633 274410 272090 269854 268114 266802 264482 260512 256391 253371 250481 246483 242001 238048 234168 229743
57619 229743 225568 222481 219866 216944 214048 211355 208050 203986 200396 197770 194983 191699 189395 188586
57605 188586 187401 184613 181803 180659 180344 179593 179325 180954 183858 186626 189197 191862 193770 194329 194529
57590 194529 195155 195312 194360 193501 193801 194532 195111 196555 199123 200681 199566 197113 195260 193621 191110 188362
57574 188362 186122 183184 178560 173913 171204 169500 166706 163000 159884 157196 153731 149681 145968 142255
57560 142255 138022 134459 132896 132426 131436 130384 130770 132371 133830 134987 136429 137838 139036 141553 146756
57545 146756 153353 158922 162919 166015 167709 167085 165067 163534 162931 162779 163464 165282 166784 166402 164756
57530A64756j591k120l843m688l841l387m364m758l344j981k019j789m4J304L78
57515A28669j515k298k174k028j239O07K076K091J756K219K772K704K790L372
57501A39802L216J875Q98J160J262J43j084j390j599k333k610j960j636k257k567
57486A30920j913j470j730j378j24J48j370k722k400j534j225o02P06J002m75
57471A15833j772j517j291k532l852l767l463m279m949l995k684k751l193k110
57457G3678j09Q35N17J36Qk54m24l47o98j534j550k02J024R48M87P22J074R13
57439G5224J011J835K328J872J484J669J359L70L66J790K529J443M89J154J645
57424I6568J53j732j770r03j314k620k994k504k425k569k004j242j224j334o00
$$ plain form
57530 164756 163165 161045 157202 152514 148673 145286 140922 136164 132820 130839 128820 127031 126987 128291 128669
57515 128669 127154 124856 122682 120654 119415 120022 122098 124189 125945 128164 130936 133640 136430 139802
57501 139802 143018 144893 145791 146951 148213 148356 147272 145882 144283 141950 139340 137380 135744 133487 130920
57486 130920 129007 127537 125807 124429 124305 124453 123083 120361 117961 116427 115202 114600 115306 116308 115833
57471 115833 114061 112544 111253 108721 104869 101102 97639 93360 88411 84416 81732 78981 75788 73678
57457 73678 73569 74404 74921 75057 75065 74811 74387 74040 73342 71808 70258 70056 71080 72028 72515 73237 74311 75224
57439 75224 76235 78070 80398 82270 83754 85423 86782 87152 87518 89308 91837 93280 93769 94923 96568
57424 96568 96721 94989 93219 92316 91002 88382 85388 82884 80459 77890 75886 74644 73420 72086 71486
57409G1486L71P96J548L466N250N289M155L140J901j86j880j781q32p93j386j253
57393H9291n43k70j81N35J399J487J166J162J013K20k75N49K085L254L967M098
57377A08957K755J70j545j254n12q12j214o72l10j259k407k645l098m657n582
57362H5915m378k817l026l665k318J26R76J84j83J98O1l33M76K148K906K483K131
57345H0884K140J853J513J778K035J414O95R58J324L14j481k416k415k334j884
57330H4378n79L37n62k275k668j432K78J849K686J362k179m990m497k110q74j065
57314F7659j023p09j112j428k14J494J542K27m89l92n63n72N16J369J30j913j924
57297F2598j67N97j99m43O52J615J762J924K088J444O73J227K418K252Q35K4L3
$$ plain form
57409 71486 71857 72653 74201 77667 82917 88206 92361 95501 97402 97216 95336 93555 92723 91930 90544 89291
57393 89291 88748 88478 88297 88832 90231 91718 92884 94046 95059 95279 95004 95553 97638 100892 104859 108957
57377 108957 111712 111882 110337 109083 108571 107759 106545 105873 105563 104304 101897 99252 96154 91497 85915
57362 85915 81537 78720 75694 72029 69711 69837 70813 70997 70814 71012 71073 70740 71216 73364 76270 78753 80884
57345 80884 83024 84877 86390 88168 90203 91617 92312 93270 94594 94908 93427 91011 88596 86262 84378
57330 84378 83799 84136 83574 81299 78631 77199 77477 79326 82012 83374 81195 76205 71708 69598 68724 67659
57314 67659 66636 65927 64815 63387 63173 64667 66209 66436 65947 65555 64992 64420 64936 66305 66435 64522 62598
57297 62598 62431 63028 62829 62386 63038 64653 66415 68339 70427 71871 72544 73771 76189 78441 79276 79300 79333
57280G9333m93j406j396j058k248m502n471m842m434m544l714k147j732k391j954
57265C7001o2J295J576K452M159M692L450K342K306J943O03l10k00n04j882k927
57249E5934k834k769l565m408m657m703m437l211j777j644k192j175J509L455
57235B3526L638L596M115L965K906K781M301N558N093L815K738J444K3p6J510
57220F8933L043L335L210L313K858J641J042J797K897L539M103M466L731K386
57206A10294K212L324L801L047K802L843M598M268M493O380Q422R040Q872Q958
57192A84354Q852Q084P529P792Q066P769P531P475O529M453K580J567M96r13j403
57177B60761m74P01J596L246N857Q053R546J2030J6124J9929K1989K3228K4555
$$ plain form
57280 79333 78840 77434 76038 74980 72732 68230 62759 57917 53483 48939 45225 43078 41346 38955 37001
57265 37001 36939 38234 39810 42262 46421 51113 54563 56905 59211 61154 61757 61447 61247 60743 58861 55934
57249 55934 53100 50331 46766 42358 37701 32998 28561 25350 23573 21929 19737 18562 20071 23526
57235 23526 27164 30760 34875 38840 41746 44527 48828 54386 59479 63294 66032 67476 67499 67423 68933
57220 68933 71976 75311 78521 81834 84692 86333 87375 89172 92069 95608 99711 104177 107908 110294
57206 110294 112506 115830 119631 122678 125480 129323 133921 138189 142682 149062 157484 166524 175396 184354
57192 184354 193206 201290 208819 216611 224677 232446 239977 247452 253981 258434 261014 262581 263077 262164 260761
57177 260761 260287 260988 262584 265830 271687 279740 289286 301316 317440 337369 359358 382586 407141
57164D07141K5122K4515K4248K5270K6247K6059K5856K6974K8792L0286L1676
57153G02186L3016L3194L1957L0881L0773L0280K8597K7266K7449K7557K5655
57142A028811K2324J9222J6632J4332J3125J3488J4205J4121J3830J4219J4949
57131A199258J5798J7683K0782K3551K5087K6542K8665L0258L0871L2690L7320
57120A488505M2578M5019M4266M2582M1702M2534M6724N5878O9739Q7141J08243
57109B114911J34296J65967K03203K45704K92072L39879L88600M41827N05245
57100D831704N83359O79638P98627R46056J127367J347472J610920J920536K275989
57091A6121668K674404L111221L579674M071671M581641N106328N632459O119104
$$ plain form
57164 407141 432263 456778 481026 506296 532543 558602 584458 611432 640224 670510 702186
57153 702186 735202 768396 800353 831234 862007 892287 920884 948150 975599 1003156 1028811
57142 1028811 1051135 1070357 1086989 1101321 1114446 1127934 1142139 1156260 1170090 1184309 1199258
57131 1199258 1215056 1232739 1253521 1277072 1302159 1328701 1357366 1387624 1418495 1451185 1488505
57120 1488505 1531083 1576102 1620368 1662950 1704652 1747186 1793910 1849788 1919527 2006668 2114911
57109 2114911 2249207 2415174 2618377 2864081 3156153 3496032 3884632 4326459 4831704
57100 4831704 5415063 6094701 6893328 7839384 8966751 10314223 11925143 13845679 16121668
57091 16121668 18796072 21907293 25486967 29558638 34140279 39246607 44879066 50998170
57083E0998170O495489O683683O624385O273829N577577M473791K960376J173909
57075I1261209o20954k157753l306914m101790m647091n018148n235840n299136
57067F0873583n214947n005394m706962m365131m018757l685643l366067l057717
57059B7452965k762444k482753k220387j978818j761419j566984j391235j232185
57051A2056740j090149r63861q51106p52248o68713n98605n37898m85127m40884
57042E668149m03456l69260l37172l08426k82521k57093k31784k08498j87865
57033C082074j68763j51193j36264j23349j10490r7530q5830p5115o3763n2122
57023B017655m2200l3911k4694j3203l25J3935L1552N2653P1938Q0047O8987L7970
$$ plain form
57083 50998170 57493659 64177342 70801727 77075556 82653133 87126924 90087300 91261209
57075 91261209 90640255 88482502 85175588 81073798 76426707 71408559 66172719 60873583
57067 60873583 55658636 50653242 45946280 41581149 37562392 33876749 30510682 27452965
57059 27452965 24690521 22207768 19987381 18008563 16247144 14680160 13288925 12056740
57051 12056740 10966591 10002730 9151624 8399376 7730663 7132058 6594160 6109033 5668149
57042 5668149 5264693 4895433 4558261 4249835 3967314 3710221 3478437 3269939 3082074
57033 3082074 2913311 2762118 2625854 2502505 2392015 2294485 2208655 2133540 2069777 2017655
57023 2017655 1975455 1941544 1916850 1903647 1903322 1917257 1948809 2001462 2073400 2153447 2222434 2260404
57011B260404m389m4832p4318r2051j00917j02222r7036q9229q2979p8596p4259
57000A419576p0314o8261o6815o3014n6601m9727m2978l5332k7626k2248j9503
56989H97157j7523j5623j4470j3128r385l222K921P312R611Q882M149l058r681
56976H43942j4643j8771k1724k2154k0655j9391j8661j6825j3566j0338p632m726
56964F54856j955l33R17L487O941R653J2438J7608K4182K7529K4553J6497O271
56951H02644m062j2770j8412k1247k2565k2497k0503j7654j5791j4730j2952j0625
56939F08836r101p849n014p47L190O945J2523K0338K8706L6217M1242L9985K9317
56926H04588J1827n688j9023k8459l4361l5660l3306l0747k9575k8267k6150k4724
$$ plain form
57011 2260404 2256015 2211183 2136865 2044814 1943897 1841675 1744639 1655410 1572431 1493835 1419576
57000 1419576 1349262 1281001 1214186 1151172 1094571 1044844 1001866 966534 938908 916660 897157
56989 897157 879634 864011 849541 836413 827028 823806 826727 834039 843650 852532 856681 853623 843942
56976 843942 829299 810528 788804 766650 745995 726604 707943 691118 677552 667214 659582 654856
56964 654856 652901 652568 653485 656972 663913 673566 686004 703612 727794 755323 779876 796373 802644
56951 802644 798582 785812 767400 746153 723588 701091 680588 662934 647143 632413 619461 608836
56939 608836 599735 591886 586872 586125 589315 596260 608783 629121 657827 694044 735286 775271 804588
56926 804588 816415 810727 791704 763245 728884 693224 659918 629171 599596 571329 545179 520455
56914E20455k4074k1899j7523j3256j0436p612m102j769j628j951j379r03j243
56901D12680j305p65j147k843l977l612l239l656l476k102j061q28O64M607R371
56886C99311J3540J7791K1893K2930J8897J1686M420j806o815r571r695q773q121
56873D65687p100n150l376k578j679K51K438M324P026J1463J6877K2652K9680
56860E40515L8527M7615N4076N4857M7111L0348R031r689k2024k9286l3449l4283
56848F93349l1753k7717k3500j8563j3024q531n253r85N197J1434J6827K3463
56836F20944L3032M4529N7196P1881Q6462R3102Q4021N9066K5508p883l4774n2093
56824A080991o0332o2485o0953n6204m9001m1603l5499l0081k4768k0212j6118
$$ plain form
56914 520455 496381 474482 456959 443703 433267 425655 421553 419784 418156 416205 414826 413923 412680
56901 412680 411375 410610 409463 406620 402643 399031 395792 392136 388660 386558 385497 384669 385333 389940 399311
56886 399311 412851 430642 452535 475465 494362 506048 510468 508662 501847 492276 482581 473808 465687
56873 465687 458587 453437 450061 447483 445804 446055 448493 452817 459843 471306 488183 510835 540515
56860 540515 579042 626657 680733 735590 782701 813049 822080 812391 790367 761081 727632 693349
56848 693349 661596 633879 610379 591816 578792 570261 565008 564023 569220 580654 597481 620944
56836 620944 653976 698505 755701 827582 914044 1007146 1091167 1150233 1175741 1167858 1133084 1080991
56824 1080991 1020659 958174 897221 841017 792016 750413 714914 684833 660065 639853 623735
56813F23735j0533k808N217J2551K1053L2483M5679N7688O4993O2875M7654K2009
56801I82596n120k6289m0695n0210n4421n2670m7542m2474l7938l2980k8272k4622
56789E39363k0626j4867q744m308j011K940P812J3399K0571K8959L4779L3854
56777F32121K5728J2907j957j6124k6331l1208l2681l2860l1363k7646k3557k0995
56765D26034j9170j6725j4512j3652j2919j0831q399p183o503n234m424n312o639
56752B94531o611n771n333m587k700j159j526k594k562k191k909l620k510m23
56738B50035N25K65m2n30j596j948n30J176J376Q89J211J618R72M56J436K500
56722B57813J763M12O02J630J484O91J083K047J544j79j118q98o36m60P4K18o51
$$ plain form
56813 623735 613202 610394 615611 628162 649215 681698 727377 785065 850058 912933 960587 982596
56801 982596 977476 951187 910492 860282 805861 753191 705649 663175 625237 592257 563985 539363
56789 539363 518737 503870 495126 490818 489807 492747 500559 513958 534529 563488 598267 632121
56777 632121 657849 670756 668799 652675 626344 595136 562455 529595 498232 470586 447029 426034
56765 426034 406864 390139 375627 361975 349056 338225 329826 322643 316140 310906 306482 301170 294531
56752 294531 287920 282149 276816 272229 269529 268370 266844 264250 261688 259497 256588 252968 250458 250035
56738 250035 250560 250825 250783 250253 248657 246709 246179 247355 248731 249620 250831 252449 253421 253877 255313 257813
56722 257813 259576 259988 260590 262220 263704 264395 265478 267525 269069 268890 267772 266874 266238 265778 265852 266070 265419
56705B65419j175q9J246J074K81M26N42r42k831k969j886j443j398n24L98L7o01
56688B55565k4O26k82j373m34J447J743R16J134K061J887J284K272M136M444L208
56672B78610K224J338p12k738k563j208j524l283l721k445j688j998j712n66j12
56657B57902n07m22J24L9j91O26J549R19k93p1O40o14l190m207l319k623k408
56640B43954j129P99J339P25R90J870J255n32j021n1J09r18j163k45J12l49j39
56623B45606O30L57o44n32L92J71q67n40R92J382L57j62Kp38j940j481K69Q00
56605B44054n6j42O03J14j336j204N34J075k40j058n37l47o86K60K185K486R82
56588B46687M43J600J930L81r26p89o00r49n65N47P25K24J084K891K845P73k98
$$ plain form
56705 265419 264244 264155 265401 266475 266756 267182 267724 266782 263951 260982 259096 257653 256255 255731 256129 256166 255565
56688 255565 255541 256167 255885 254512 254078 255525 257268 258184 259318 261379 263266 264550 266822 270958 275402 278610
56672 278610 280834 282172 281460 278722 276159 274951 273427 270144 266423 263978 262290 260292 258580 258014 257902
56657 257902 257395 256973 257097 257136 256945 257571 259120 260039 259746 259675 260315 259701 256511 252304 248985 246362 243954
56640 243954 242825 243624 244963 245688 246678 248548 249803 249271 248250 248199 248308 247390 246227 245982 246094 245745 245606
56623 245606 246236 246593 245949 245417 245809 245980 245113 244573 245565 246947 247304 247142 247144 246406 244466 242985 243254 244054
56605 244054 243998 243856 244459 244573 243237 242033 242567 243642 243402 242344 241807 241460 240774 241034 243219 245705 246687
56588 246687 247130 248730 250660 251041 250115 249326 248726 247777 247212 247759 248484 248708 249792 252683 255528 256301 256003
56571B56003O37J215N14O12K189L041K361K250L532M326M170N450R218J3553J7173
56556C26244K0637K2839K0797J4447P508K272k340o480p839o075m245m019l646
56543C80100k347k209l940n086m498m297n490n987m997m968o947q306p462o660
56529C06906p548q132o735n089m837m618l240k193k559k764j826j388k350k894
56515B50733k032j608k608l073j861r52j693k333j570j022j849k377j400n10r25
56500B24920j343r86j341k751k888p66J234J423J348K239K640J719J327K435L136
56485B32346K324J795K576K912J952J603K617K805J342P07K040K719J124l61K24
56470B58725J053M09m0J219K525K324J941K459K441J245P84J718J831M30N4J487
$$ plain form
56571 256003 256640 257855 258369 258981 261170 264211 266572 268822 272354 276680 280850 286300 295518 309071 326244
56556 326244 346881 369720 390517 404964 412472 414744 412404 405924 398085 392010 387765 383746 380100
56543 380100 377753 375544 371604 366518 362020 357723 352233 346246 341249 336281 329334 321028 313566 306906
56529 306906 299358 291226 284491 279402 274565 269947 266707 264514 261955 259191 257365 255977 253627 250733
56515 250733 248701 247093 244485 241412 239551 238599 236906 234573 233003 231981 230132 227755 226355 225845 224920
56500 224920 223577 222591 221250 218499 215611 214845 216079 217502 218850 221089 223729 225448 226775 229210 232346
56485 232346 234670 236465 239041 241953 243905 245508 248125 250930 252272 252979 255019 257738 258862 258501 258725
56470 258725 259778 260187 260147 261366 263891 266215 268156 270615 273056 274301 275085 276803 278634 279064 279118 280605
56454B80605J773k35j242N36J779o5k143j335N22N93M6R51K027J544R14J521J537
56437B89328m49k120j395j50n22j140m28L7j048j750p41k35j693k679j425l04
56421B73286j169j662P0J449K98q93K48J404J45j348o59J07j363k817j755l41
56405B65000j098j882j68J797J256K36J376K529R78r40m0J723J127j46J034L084
56389B75866K901J846K714M019L118J859L181N148M372K346K372L191J729n61
56375C14101l33J247Q82n00J21J725J292k15J39J427Q34o38j60J347J201L10J057
56358C23837K153J229K2J283L057J961l76j57J703J726N06R84K280J501l56m10
56342C40943L32p71k211j009J153Q54l44J288M321M515K556K539M417M751L576
$$ plain form
56454 280605 282378 282143 280901 281437 283216 283151 281008 279673 280195 280788 280834 281785 283812 285356 286270 287791 289328
56437 289328 288879 286759 285364 285214 284692 283552 283124 283161 282113 280363 279622 279387 277694 275015 273590 273286
56421 273286 272117 270455 270525 271974 272272 271379 271627 273031 273176 271828 271169 271276 269913 267096 265341 265000
56405 265000 263902 262020 261852 263649 264905 265141 266517 269046 270024 269084 269044 270767 271894 271748 272782 275866
56389 275866 278767 280613 283327 287346 290464 292323 295504 300652 305024 307370 309742 312933 314662 314101
56375 314101 313768 315015 315897 315397 315518 317243 318535 318320 318459 319886 320720 320082 319922 321269 322470 322780 323837
56358 323837 325990 327219 327241 328524 331581 333542 333166 333009 334712 336438 336944 337928 340208 341709 341353 340943
56342 340943 341275 340504 338293 337284 338437 339291 338947 340235 344556 349071 351627 354166 358583 363334 366910
56327C66910L721M664L708K020K869N091M819K496J698K232R71j615k258j155
56313C96171j166j875p07J270R03r08q45N62L78n67O45K841K699J368K565N615
56297D08949O879O427O757O834M196J142J692M150L878J618J672L605L479J812
56283D63090K439M777N055L933N114P587P250N068N526P966P785N372N406P879
56269E44247Q216O071N771Q045R376R402J1187J4306J5395J5186J7374K1156K2768
56256G08500K3453K7739L4613L8954M0913M5262N2113N7253O1047O7803P6645
56245A234295Q2310Q4808Q8980R4552R6106R3101R0325Q8091Q1728P1180O1440
56234B166916N2790M0399K4352J0272q16j3445k7696l8297m4775n2437o1875o7653
$$ plain form
56327 366910 370631 375295 379003 381023 383892 388983 393802 396298 397996 400228 401199 399584 397326 396171
56313 396171 395005 393130 392423 393693 394596 393688 392843 393405 393783 393216 393861 396702 399401 400769 403334 408949
56297 408949 415828 422255 429012 435846 440042 441184 442876 447026 450904 452522 454194 457799 461278 463090
56283 463090 465529 470306 475361 479294 484408 491995 499245 504313 509839 517805 525590 530962 536368 544247
56269 544247 552463 558534 564305 572350 581726 591128 602315 616621 632016 647202 664576 685732 708500
56256 708500 731953 759692 794305 833259 874172 919434 971547 1028800 1089847 1157650 1234295
56245 1234295 1316605 1401413 1490393 1584945 1681051 1774152 1864477 1952568 2034296 2105476 2166916
56234 2166916 2219706 2260105 2284457 2294729 2293913 2280468 2252772 2214475 2169700 2117263 2055388 1987735
56222A987735o8823p0565p3775p3360o8774o5968o6616o5542o1140n8211n8040
56211A256921n5744n0167m6452m6094m4219l9401l6375l6326l4357k9298k6178
56200H12310k6257k4505j9725j7126j7989j6946j2433r670j0286r301n476m212
56188F38384o754p063k994k06j325j662O38P85k428l149O13L011J371P82L534
56173F23537M546J776O42L465M879K397J241L979N637L863L703P481J0106R143
56159F86395R427J3063J5170J3998J4796J9121K1056J8655J8253K2737K6654K7656
56147I06981L1384L9913M6939M9869N5303O7099Q0412R2903J09884J32554J52879
56136A766120J66092J76371J84441J82030J65379J42491J20747R9288P9532O9899
$$ plain form
56222 1987735 1918912 1848347 1774572 1701212 1632438 1566470 1499854 1434312 1373172 1314961 1256921
56211 1256921 1201177 1151010 1104558 1058464 1014245 974844 938469 902143 867786 838488 812310
56200 812310 786053 761548 741823 724697 706708 689762 677329 667659 657373 648072 642596 638384
56188 638384 631630 624567 621573 621367 620042 618380 619018 619803 617375 614226 614839 617850 619221 620003 623537
56173 623537 628083 629859 630501 633966 638845 641242 642483 646462 652099 655962 659665 667146 677252 686395
56159 686395 695822 708885 724055 738053 752849 771970 793026 811681 829934 852671 879325 906981
56147 906981 938365 978278 1025217 1075086 1130389 1197488 1277900 1370803 1480687 1613241 1766120
56136 1766120 1932212 2108583 2293024 2475054 2640433 2782924 2903671 3002959 3082491 3152390
56126C152390P2323P6071P2267O3165N1259L2554P930j2036k1798k8541l8567
56115C427017m8924n9270p7658j06049j33550j52287j66679j79197j81643j69992
56105B151768j53758j40904j26924j08212r2013q3041p4080o0141m8284m3413
56095A220998l8381k8407k0977k0895k0054j2873p272r064j0410n295j459m881
56083A041030p471k650J852o26k627K207O147K905P77O552J1736Q837N990J0934
56069A085593J5869J3109J0352J5249K0136J7434J4690J8889K1553J5326R348
56058A257548J1953J4325P983K001N669J0572P493M437R848J4913J0956P314J3077
56045A378089J8548J4342J1056J9684L0357L1275L0632L8179M3444L4786K2232
$$ plain form
56126 3152390 3224713 3300784 3373051 3436216 3487475 3520029 3527959 3515923 3494125 3465584 3427017
56115 3427017 3378093 3318823 3241165 3135116 3001566 2849279 2682600 2503403 2321760 2151768
56105 2151768 1998010 1857106 1730182 1621970 1529957 1446916 1372836 1312695 1264411 1220998
56095 1220998 1182617 1154210 1133233 1112338 1092284 1079411 1072139 1063075 1052665 1047370 1045911 1041030
56083 1041030 1033559 1030909 1032761 1032135 1029508 1031715 1037862 1040767 1041544 1048096 1059832 1068669 1074659 1085593
56069 1085593 1101462 1114571 1124923 1140172 1160308 1177742 1192432 1211321 1232874 1248200 1257548
56058 1257548 1269501 1283826 1291809 1293810 1299479 1310051 1317544 1321981 1331829 1346742 1357698 1365012 1378089
56045 1378089 1396637 1410979 1422035 1441719 1472076 1503351 1533983 1572162 1615606 1650392 1672624
56034A672624J8747J6933P221K85P466J7829J9048K1709L7604N3785N4590M9758
56022A977599N3697N7127M7410L6539L9583M5524L9327L2335M0066N0918M8656
56011B468781M4628N4894O7237O4831O0321P1169Q3938P9750P2053Q1005R3983
56000C242590R1212Q6524J01027J20625J22793J20992J37615J58081J58596J53950
55990D494005J68943J88689J88208J84389K05083K34139K42924K48030K79005
55981F433415L18202L34576L47026L89034M41823M71218M97599N56006O21945
55972A0410844O56011O86823P65851Q76829R78433J095577J271451J473610J655826
55963A9871255J868968K195587K623831L111341L713977M504070N423807O389162
$$ plain form
56034 1672624 1691371 1708304 1715525 1715810 1723276 1741105 1760153 1781862 1819466 1873251 1927841 1977599
56022 1977599 2031296 2088423 2135833 2172372 2211955 2257479 2296806 2329141 2369207 2420125 2468781
56011 2468781 2513409 2568303 2635540 2700371 2760692 2831861 2915799 2995549 3067602 3148607 3242590
56000 3242590 3333802 3420326 3521353 3641978 3764771 3885763 4023378 4181459 4340055 4494005
55990 4494005 4662948 4851637 5039845 5224234 5429317 5663456 5906380 6154410 6433415
55981 6433415 6751617 7086193 7433219 7822253 8264076 8735294 9232893 9788899 10410844
55972 10410844 11066855 11753678 12519529 13396358 14374791 15470368 16741819 18215429 19871255
55963 19871255 21740223 23935810 26559641 29670982 33384959 37889029 43312836 49701998
55955D9701998P476026Q819216J0414723J2258933J4601539J7799730K2060193
55948A43132358K7656037L5021394M3612113N0382810N0497571M0842241K3016299
55941D14160823K405768j5648356k8542446l6077084l8936290l8091902l4897810
55934B24372703l0777067k6653348k2894413j9651271j6971994j4714735j2671175
55927H0038700j0797702r173853p795808o579008n511748m642062l944188l338910
55919B8255421k818854k427994k142324j886410j646331j460341j318532j171874
55911A3382761j023243r15492q43082p61395o70104o05972n65452n11705m47583
55902G038733m08309l90953l60405l16826k91306k82346k59801k25239k07884
$$ plain form
55955 49701998 57178024 65997240 76411963 88670896 103272435 121072165 143132358
55948 143132358 170788395 205809789 249421902 299804712 350302283 391144524 414160823
55941 414160823 416566591 400918235 372375789 336298705 297362415 259270513 224372703
55934 224372703 193595636 166942288 144047875 124396604 107424610 92709875 80038700
55927 80038700 69240998 60067145 52271337 45692329 40180581 35538519 31594331 28255421
55919 28255421 25436567 23008573 20866249 18979839 17333508 15873167 14554635 13382761
55911 13382761 12359518 11444026 10600944 9839549 9169445 8563473 7998021 7486316 7038733
55902 7038733 6630424 6239471 5879066 5562240 5270934 4988588 4728787 4503548 4295664
55893D295664k06373j92161j65669j53768j56109j47080j27014j20207j25584
55884B901699j18681r9710r2077r5732q8106o9202o1185o4688n8658m2351l5805
55873B075504l9755l5666k4824k7739m4606n4404n3257n6855o4975o0302m3363
55862A569758l3509l4073l0104k1148k2876l5262m1601m0167m5213n5828n5484
55851A154493m3718l7358l8710l2968j9047j2857j7321j8276j2995j4327k3463
55840H83453k6217k0015j7916k2532k1906j4497j2664j7998j8205j1752j0997
55829F88754j7493j8415j1112p393r916p780O09L383k113m798j737k617q774r590
55815E91008l668k127p009p490j441L75m387n044J122L839K63K55O499R196N512
$$ plain form
55893 4295664 4089291 3897130 3731461 3577693 3421584 3274504 3147490 3027283 2901699
55884 2901699 2783018 2683308 2591231 2495499 2407393 2338191 2277006 2212318 2153660 2111309 2075504
55873 2075504 2035749 2000083 1975259 1947520 1902914 1848510 1795253 1738398 1673423 1613121 1569758
55862 1569758 1536249 1502176 1472072 1450924 1428048 1392786 1351185 1311018 1265805 1209977 1154493
55851 1154493 1110775 1073417 1034707 1001739 982692 969835 952514 934238 921243 906916 883453
55840 883453 857236 837221 819305 796773 774867 760370 747706 729708 711503 699751 688754
55829 688754 671261 652846 641734 634341 624425 616645 617254 620637 618524 613726 611989 609372 600598 591008
55815 591008 587340 585213 578204 570714 569273 569648 565261 560217 561339 565178 565441 565696 572195 581391 586903
55800E86903M885R899J0853M568J12O63k053j0208j4663j2524j2387j7088j8513
55787E30447j4487j3548j7806j8031j0923m653k387K751J1384J3614O714O15J86
55774D83876j793q489j2249r900r005j2685j3566q862o303q975r295m226j616
55761C76912n030o913l289r90l745n064j573L34k307k774J955M744J797m92J535
55746C55100J892k554n521l763l474p780j0235p376n517q367r956o538l780n350
55732B76781n975k419n8k004k877K25J706j391l385j205l93l728n278k045j90
55717B47764l148m905j814K71k424m089p04K124J09j613J095L283R36j081J200
55702B37004K961K36k158r9J803o09k957j184N36j568l056Q1L448K662J475L842
$$ plain form
55800 586903 591788 601687 612540 617108 617220 617883 615830 605622 590959 578435 566048 548960 530447
55787 530447 515960 502412 484606 466575 455652 450999 448612 451363 462747 476361 483075 483690 483876
55774 483876 482083 473594 461345 451445 442440 429755 416189 407327 401024 392049 382754 378528 376912
55761 376912 371882 364969 361680 360690 356945 351881 350308 350642 348335 345561 347516 352260 354057 353565 355100
55746 355100 356992 354438 348917 345154 341680 333900 323665 316289 310772 302405 292449 285911 282131 276781
55732 276781 270806 268387 268329 266325 263448 263673 265379 263988 260603 259398 259005 255277 249999 247954 247764
55717 247764 244616 239711 237897 238168 235744 231655 230951 233075 233184 231571 232666 235949 236885 235804 237004
55702 237004 239965 240201 238043 237944 239747 239138 236181 234997 235533 233965 230909 230990 234438 237100 238575 242417
55686B42417N965L870J241K134L455J884P94L216N314L908K904N388O851L391
55672B92732p75j039k78k094l567j763k69k132l363m72K462J262p07O38K503J365
55656B84503L4J689L388K179J102K617K840j039m504l628k310m752p693p182o148
55641B61096p948r165o330l246m116n737m068k144l764n534l167J93j54j844n99
55626B03473J445L86j634r52K74j232k868j277N09j416m138l206p95j083k242
55611A85244o32J582O36j345n72R39m66k634j758P1j111l393k636l07m42k232
55595A70944k446j812k423k379L97K720J087j693j257Q14P59j80R20K210P92r19
55579A67534O19L234L194K318M123O764O789O110Q119J0637R981Q460J0358J3909
$$ plain form
55686 242417 248382 252252 253493 255627 259082 260966 261760 264976 270290 274198 277102 282490 289341 292732
55672 292732 291957 290918 290640 288546 284979 283216 282947 280815 277452 276980 279442 280704 279997 280635 283138 284503
55656 284503 284537 286226 289614 291793 292895 295512 298352 297313 292809 289181 286871 282119 274426 267244 261096
55641 261096 253148 243983 237653 234407 230291 224554 220486 218342 214578 209044 205877 206070 205916 204072 203473
55626 203473 204918 205304 203670 202718 202992 201760 198892 197615 198124 196708 192570 189364 188569 187486 185244
55611 185244 184612 186194 186830 185485 184913 185852 185386 182752 180994 181065 179954 176561 173925 173618 173176 170944
55595 170944 168498 166686 164263 161884 162281 165001 166088 164395 163138 163952 164711 164531 165451 167661 168453 167534
55579 167534 168153 171387 174581 176899 181022 187786 194575 200685 208804 219441 229422 237882 248240 262149
55565B62149J4643J3400J3447J2975Q330J903j099j430l791q173j0640j0762j1190
55552B79762j1619r976p818q019q967p359m577m012m493k833m20o68k235j513
55538B05253M65K18j318p98Q23L18j310r53Q4j521m319m461k893l386n256m976
55522A75970l228l472n032m411k113j530k381j768l38r30k541j959J1K61l25J239
55506A47453L636L255J102R64K224J299j175j461J64K78q52j06J810J357r43j356
55490A57649N7o6j585j227P83J045m57n52Q22Q12l56J33J669J014j341j838m36
55473A56126l79j833j984r38j386k810k291n41q45k582k212j31J7j641j587L1
55457A35014k98k246j838R11J602o29j759k72P11j76m64O26O63p57j061j0k90
$$ plain form
55565 262149 276792 290192 303639 316614 324944 326847 325748 324318 320527 312354 301714 290952 279762
55552 279762 268143 258167 250349 242330 233363 226004 221427 217415 212922 210089 209669 209001 206766 205253
55538 205253 205718 205936 204618 203820 204643 204961 203651 202698 202782 201261 196942 192481 189588 186202 180946 175970
55522 175970 172742 169270 164238 159827 157714 156184 153803 152035 151697 150767 148226 146267 146278 146539 146214 147453
55506 147453 151089 154344 155446 156410 158634 159933 158758 157297 157461 157739 156887 156781 158591 159948 159005 157649
55490 157649 157706 157640 156055 154828 155611 156656 156199 155647 156469 157281 156925 157058 158727 159741 158400 156562 156126
55473 156126 155747 153914 151930 150992 149606 146796 144505 143964 143119 140537 138325 138194 138211 136570 134983 135014
55457 135014 134716 132470 130632 131543 133145 132516 130757 130485 131196 131020 130556 131182 131845 131088 130027 130017 129727
55440A29727j932j876JK51j751k599j076j2p06j009o4K38l56K59J962K123O10
55423A23790N3O87J46j261o08J838K517R37M43J962K631J541J165K101J993O12
55407A40547N22J799J606j18k64J433J812N33P88K805K923N31m72J233K118N72
55391A58368l03J050J663j29j555p45J77j14M97K768L855K443J240J780J626o54
55375A71967k492k014j192j716k075j321j300k655k903r78M71k93j244p38l31
55360A51186j167j506k15J019J087J306K067J570l33j177l77m64k131k564o42
55345A47659P95K4p77n1L26q65j659r67p42j724j401J155K777J358o43o84j20
55328A44461q16j614j195q36j568j928j120r66k240k581o08J423J482Q30R30P91
$$ plain form
55440 129727 127795 125919 125920 126171 124420 121821 120745 120733 120027 119018 118954 119192 118836 119095 121057 123180 123790
55423 123790 123843 124530 124676 123415 122807 124645 127162 128099 128542 130504 133135 134676 135841 137942 139935 140547
55407 140547 141069 142868 144474 144356 144092 145525 147337 147870 148658 151463 154386 154917 154445 155678 157796 158368
55391 158368 158065 159115 160778 160649 159094 158349 158526 158412 158909 161677 165532 167975 169215 170995 172621 171967
55375 171967 169475 167461 166269 164553 162478 161157 159857 157202 154299 153321 153792 153499 152255 151517 151186
55360 151186 150019 148513 148298 149317 150404 151710 153777 155347 155014 153837 153460 152996 150865 148301 147659
55345 147659 148454 148478 147701 147650 147976 147111 145452 144485 143743 142019 140618 141773 144550 145908 145265 144581 144461
55328 144461 143645 142031 140836 140000 138432 136504 135384 134418 132178 129597 128989 130412 131894 132724 133654 134445
55312A34445k21n61K59K22j207j496K72J172n71k309j527J91O05N27J171J293
55296A32265M3p03K56R71k6q88k5R64O08L85J419J808K52j041j87R35J43j193
55278A35986r92j02j13k82L67O61k08n60O18J324K8j363q20M35O16M69R65Q44
55260A37873o94j735r27n9o84j154M1J073K5j528j332k32m4k43K94P69M26N36
55242A32405J760K206P52n40L4Q19O0r48q00q42k089k511p00R70K51r78k38J065
55224A30676M88r16q84k36r21j955j296K53O62L22O08P76k47r26M61K383K414
55207A31662J160O40O03j39p52j11M40o17j785j033M51M24m20r1Q38N75l69m29
55189A31047j75r03j646r65p5q29k137j827n63m31j077p32J98O6o87l89O89J083
$$ plain form
55312 134445 134224 133663 133922 134144 132937 131441 131713 132885 132314 130005 128478 128669 129274 129801 130972 132265
55296 132265 132308 131605 131861 132832 132806 131918 131893 132857 133465 133850 135269 137077 137329 136288 136101 137036 137179 135986
55278 135986 134994 134892 134779 134497 134864 135525 135317 134757 135375 136699 136727 135364 134544 134979 135595 136064 137029 137873
55260 137873 137179 135444 134517 134458 133774 132620 132661 133734 133759 132231 130899 130667 130623 130380 130674 131443 131869 132405
55242 132405 134165 136371 137123 136583 136617 137436 137496 136548 135748 134906 132817 130306 129606 130576 130827 129849 129611 130676
55224 130676 131164 130248 129364 129128 128207 126252 124956 125209 125871 126193 126801 127577 127330 126404 126865 129248 131662
55207 131662 132822 133462 134065 133926 133174 133063 133503 132886 131101 130068 130519 130943 130523 130432 131270 131845 131476 131047
55189 131047 130872 129969 128323 127358 127283 126454 124317 122490 121927 121496 120419 119687 119885 119951 119264 118875 119564 120647
55171A20647R83J423J786J037N8N3J05r09j614l84J390J458N26P36J811K054J630
55154A32790J651J411j27j511q45O71N94o79j033n06o33r94n3J513J676N29k06
55137A34248l28q01j197n06M33K24l73J10R12M52n52m42J51m00j411j097K8K00
55119A29651k36K40J139R29J23J70L58q31k339j956k48L51l70n66K17R47J629
55102A29208K749L081J395n96l72J200J282j39n50O60J691J885K194K396J284
55087A47368n32j201q25j008j590j014M18Q27M9m08l73q99j547q75O35J142N67
55070A40734K84K32n61j185M2K130K481J083L54R41J024q6r59q74o67o20j70J94
55052A44377n27j558j248K7N12J50K71P59M17l26r3N58M7j003o34P31Q64l00o48
$$ plain form
55171 120647 121630 123053 124839 125876 125934 125987 126092 125183 123569 123185 124575 126033 126559 127295 129106 131160 132790
55154 132790 134441 135852 135725 134214 133369 134040 134634 133955 132922 132416 131783 130789 130736 132249 133925 134454 134248
55137 134248 133920 133119 131922 131416 131849 132073 131700 131810 132722 133174 132622 132180 132331 131931 130520 129423 129451 129651
55119 129651 129415 129655 130794 131723 131846 132016 132374 131543 129204 127248 127000 127351 126981 126415 126632 127579 129208
55102 129208 131957 135038 136433 135837 135465 136665 137947 137808 137258 137918 139609 141494 143688 146084 147368
55087 147368 146836 145635 144810 143802 142212 141198 141616 142443 142492 142084 141711 140812 139265 138390 139025 140167 140734
55070 140734 141018 141250 140689 139504 139546 141676 144157 145240 145594 146535 147559 147473 146514 145640 144973 144353 144183 144377
55052 144377 143850 142292 141044 141071 141583 141733 142004 142763 143180 142854 142761 143319 143366 142363 141729 142460 143324 143024 142376
55033A42376K75P56K49j0J80k11q48k99J021J193J55l54o6l46j164j071k13j72
55015A41451q63p31L0k54j322j169K04O99j11m28K40L99k01q8P74O68m36m73J050
54996A39439K122J697J063J123J138Q91J216J775J122n43j355r18o45p87j20J144
54980A48362J297L70L57J561J967Q71M3M72R01M75Q0K33K32L0M57J107O19o97
54962A58737j123n74m94p79R1J730K016Q52L49R27P18n66q26N46J436P04k69o00
54944A62875j208k152j957o04P2j81M74K109K280L44j087m29N90M85M86J668K780
54927A66545K823K962M055M960M925N160O413P490P632P825Q457Q186O408M323
54913B48164K435k42l458n246n373o140q307r394p768n383m467m401l833l198
$$ plain form
55033 142376 142651 143407 143656 143646 143826 143615 142767 142468 143489 144682 144837 144483 144417 144071 142907 141836 141623 141451
55015 141451 140588 139857 139887 139633 138311 137142 137346 138045 137934 137506 137746 138145 137944 137856 138630 139298 138862 138389 139439
54996 139439 141561 143258 144321 145444 146582 147473 148689 150464 151586 151043 149688 148770 148125 147338 147218 148362
54980 148362 149659 150029 150386 151947 153914 154785 154828 155300 156201 156676 156756 156989 157221 157251 157708 158815 159434 158737
54962 158737 157614 157040 156546 155767 155858 157588 159604 160456 160805 161732 162450 161884 161058 161604 163040 163744 163475 162875
54944 162875 161667 159515 157558 156954 157026 156845 157319 159428 161708 162052 160965 160536 161126 161611 162097 163765 166545
54927 166545 169368 172330 176385 181345 186270 191430 197843 205333 212965 220790 229247 237433 243841 248164
54913 248164 250599 250357 246899 241653 236280 230140 221833 212439 204671 199288 194821 190420 186587 183389
54899A83389l129k777j734j281j984k294j279l20m80n47N31J658J776J758K454
54884A75741L029K872K948L758M173L754L918N441P148Q315R715J0958R802N786
54870B57358J696m76k157m901p297p585o761o591o778o373n984o269o169m736
54856A86977k962j988j356o34p04j793k373j733j308j903k103j145o87j725k468
54841A62095j478l06o24j292q01j99q41j523o15Q34R30no82j345k466k812j427
54824A47443J57K36k46K41Q14l5j263q83O05J190O77L72M20L1m73k13M17N38N51
54805A50579J200J883J731J353J648K033J600Q68O31L88m15r08l67K29j39p39
54789A61575p03o96j251j243j7Q50M7r73l16J274J979J977K445L038K818K348
$$ plain form
54899 183389 180260 177483 175749 174468 172484 170190 168911 168591 168111 167564 168095 169753 171529 173287 175741
54884 175741 178770 181642 184590 188348 192521 196275 200193 205634 212782 221097 230812 241770 251572 257358
54870 257358 259054 258578 256421 251520 244223 236638 229877 223286 216508 210135 204151 197882 191713 186977
54856 186977 184015 182027 180671 180037 179333 177540 175167 173434 172126 170223 168120 166975 166288 164563 162095
54841 162095 160617 160311 159687 158395 157594 157395 156554 155031 154416 155250 156180 156175 155493 154148 151682 148870 147443
54824 147443 147600 147836 147590 147831 148645 148610 147347 146464 147069 148259 148936 149308 149728 149759 149286 149073 149490 150028 150579
54805 150579 151779 153662 155393 156746 158394 160427 162027 162895 163526 163914 163499 162591 162224 162453 162314 161575
54789 161575 160872 160176 158925 157682 157665 158515 158562 157589 157273 158547 160526 162503 164948 167986 170804 173152
54773A73152K519K656K073K056L869O242P300P514Q271Q933Q152O729O282O199
54759B51947M745K260M23p80k594m700n683n689o028o678o608o093o173o369n374
54744A96606l619k757k897k691j816j248j182q83l71l74p29o19l9M99J281K735
54728A81896M066M185L462L080L336L999N374P443Q875Q561P233N997M451J894
54714B53852q31k623l997n819p377p731p698q312q585p086m682l324l057k577
54700A80153j794j511j423p45m9k57o73k23K76n35j896k038j167q33j050n95M14
54683A66054O85J22k85m64r87j406j001n02r45j547r78R3N6p87r72o50j076j906
54665A53504j640l34O36J072J747K233J478J39k14J31l60j497j656p43k22l16
$$ plain form
54773 173152 175671 178327 180400 182456 186325 192567 199867 207381 215652 224585 232737 239466 245748 251947
54759 251947 256692 258952 259375 258595 256001 251301 245618 239929 233901 227223 220615 214522 208349 201980 196606
54744 196606 192987 190230 187333 184642 182826 181578 180396 179513 179142 178768 178039 177420 177381 177880 179161 181896
54728 181896 185962 190147 193609 196689 200025 204024 209398 216841 225716 234277 241510 247507 251958 253852
54714 253852 253021 250398 246401 240582 233205 225474 217776 209464 200879 193793 189111 185787 182730 180153
54700 180153 178359 176848 175425 174680 174631 174374 173701 173478 173754 173219 171323 169285 168118 167285 166235 165640 166054
54683 166054 166739 166861 166576 166112 165125 163719 162718 162216 161271 159724 158746 158839 158895 158108 157136 156486 155410 153504
54665 153504 151864 151530 152166 153238 154985 157218 158696 158835 158621 158752 158392 156895 155239 154496 154274 153958
54649A53958J35J109J255M71J80Q20J346J277J137Q46j63j256j116N4Q17Q15Q33
54632A62518R00M74Q8N74J020p8j975k454j229o6K52N60R61N52m20o10K5J88k14
54613A61066O1J079J394N18m75j004j475j717j103k61m18j037m64J082J661Q22
54597A59729J07K14J91j84J69J288J711J004N14R22J245Q80N71O79M62l23q49
54580A68330p92p61q90o57k43k80k41Q99K451K615J371N49Q31R61K55m11n31o90
54562A72766r48n25M89J093J271J885K567J928J55r58q73q66j337j052K87J144
54546A77026P20J71M22P43M81L14Q60J603J965K017J766J113O95J161J680J011
54530A93748j86j61Q49Q82l98j136m89J75p1l66o4J13j95k50O4k53j388k121j774
$$ plain form
54649 153958 154093 155202 156457 156928 157108 157928 159274 160551 161688 162534 162371 161115 159999 160053 160870 161685 162518
54632 162518 163418 163892 163980 164554 165574 165496 163521 161067 159838 159772 160024 160584 161545 162097 161677 161067 161092 161280 161066
54613 161066 161127 162206 163600 164118 163643 162639 161164 159447 158344 158083 157665 156628 156164 157246 158907 159729
54597 159729 159836 160050 160241 160057 160226 161514 163225 164229 164743 165665 166910 167790 168361 169040 169502 169179 168330
54580 168330 167538 166777 165887 165230 164987 164707 164466 165365 167816 170431 171802 172351 173182 174143 174398 173987 173456 172766
54562 172766 171818 171293 171782 172875 174146 176031 178598 180526 180681 179723 178850 177984 176647 175595 175882 177026
54546 177026 177746 177917 178339 179082 179563 179877 180737 182340 184305 186322 188088 189201 189896 191057 192737 193748
54530 193748 193562 193401 194250 195132 194734 193598 193109 193284 193213 192847 192783 192896 192701 192451 192515 192262 190874 188753 186979
54511A86979r75j28R58J737J272J65n0M77K03q55j076l38l20j209j141L76J369
54494A87444P30j75l24n97j360j208L87J721J618J224J538J495J78j190j091J52
54478A90542J475K586L186K539J000K10P82J524J725K099K703K264P21o3O79J240
54462B15212M60k71M38J643J946J656J421P19o43j398q06j08m28j016r14o56q64
54445B16391r49n63n60j209j297l53K60k71p01j36K61m79j235q56j40r8j40K65
54427B08190J77q02j132J21J355J042K90P02J523J302O35Q11J206M90p83j132
54411B13995p17p39j236j479j651k161k298j381l07j55k89L20J054Q42L47R10
54395B05055K097K380J595R23Q66R53R75J045R23N15M22R26J208O89L4j66n49
$$ plain form
54511 186979 186004 185876 186834 188571 189843 190008 189958 190435 190638 189783 188707 188369 188049 186840 185699 186075 187444
54494 187444 188174 187999 187675 187078 185718 184510 184897 186618 188236 189460 190998 192493 192671 191481 190390 190542
54478 190542 192017 194603 197789 200328 201328 201538 202320 203844 205569 207668 210371 212635 213356 213293 213972 215212
54462 215212 215672 215401 215839 217482 219428 221084 222505 223224 222581 221183 220377 220269 219841 218825 217911 217255 216391
54445 216391 215442 214879 214319 213110 211813 211460 211720 211449 210748 210612 210873 210394 209159 208303 208163 208065 207925 208190
54427 208190 208367 207565 206433 206554 207909 208951 209241 209943 211466 212768 213403 214214 215420 215910 215127 213995
54411 213995 213278 212539 211303 209824 208173 206012 203714 202333 202026 201871 201582 201902 202956 203798 204145 205055
54395 205055 207152 209532 211127 212050 212916 213869 214844 215889 216812 217327 217749 218675 219883 220572 220606 220440 219891
54378B19891j576k285j794q17l41l8O03Q84J82o13m45L18R75J858L101L600K815
54361B26318K117K610L085K059M01j66J06j16o71n08m0n71j958k908l127l275
54345B23356l386k949k191j688j225n43l26j024j584r36J85N05K55K88K07p20
54329B08224j684j458n42k46l61K08J148J174L31j71r5k87q82j190j160j319j438
54312B00252q33J88N56K8p16j225j402r42J45R97R20M68M01M26Pm54m83n98j246
54293A96489j646j082k53pK02R97J463O19n59n29L36N85K01K86Q80J083Q58Q55
54275B00778Q72K53n91p01k10%j74l10n51j028r73K3Q30M85J03J166K816L028
54257B05816J820J036J365J730J478J095P71Q8o65o03K63Q98O99k4q02j217q34
$$ plain form
54378 219891 218315 216030 214236 213419 213078 213040 213643 214527 214709 214096 213651 213969 214944 216802 219903 223503 226318
54361 226318 228435 231045 234130 236189 236590 236424 236530 236414 235743 235235 235195 234624 232666 229758 226631 223356
54345 223356 219970 217021 214830 213142 211917 211374 211048 210024 208440 207504 207689 208194 208449 208737 208944 208224
54329 208224 206540 205082 204540 204294 203933 204141 205289 206463 206794 206623 206528 206241 205359 204169 203009 201690 200252
54312 200252 199419 199607 200163 200191 199475 198250 196848 195906 196051 197048 197968 198436 198837 199263 199270 198816 198333 197735 196489
54293 196489 194843 193761 193508 193501 193703 194700 196163 196782 196223 195694 196030 196615 196816 197102 197982 199065 199923 200778
54275 200778 201650 201903 201312 200611 200401 200401 200227 199917 199366 198338 197365 197388 198218 198703 198806 199972 202788 205816
54257 205816 207636 208672 210037 211767 213245 214340 215111 215199 214534 213931 214194 215092 215791 215767 214965 213748 212914
54240B12914O0K68p26j724j522p06m66p20q00r25j449j654r11j5J67K51R07J215
54222B04164K94p05l49N71M86j86p3M38L1r02r76m55o73j423j421q39q64j299
54204A95819r88j55Q4J8O77J511J201K57J74O33K27n31O3J565J849P37J51N84
54186B03876N39k84l33P44J343Q36N34J025J187O05M52J124J437R22O88J142J081
54169B16918j42j529k219k466k334j452m69o99j820k112j380j234k042k145r09
54154A93966L0l49p56m5Q12O04j47m64n11o69m55M19J226J328J013N99L0k27N67
54135A96971J847K078J118N17R54J240N22l73o36p06r80r29l82j30m79o51k65
54118A99716L3OL10J047J456J460J827K413K098J034Q80K092L042K678K115K534
$$ plain form
54240 212914 212974 213242 212516 210792 209270 208564 208098 207378 206578 205653 204204 202550 201639 201624 201791 202042 202949 204164
54222 204164 204458 203753 203404 203975 204461 204275 204202 204640 204671 203769 202793 202338 201665 200242 198821 197982 197118 195819
54204 195819 194831 194676 194760 194778 195455 196966 198167 198424 198598 199231 199458 198927 198990 200555 202404 203141 203292 203876
54186 203876 204415 204131 203798 204542 205885 206721 207255 208280 209467 210072 210524 211648 213085 214007 214695 215837 216918
54169 216918 216776 215247 213028 210562 208228 206776 206307 205608 203788 201676 200296 199062 197020 194875 193966
54154 193966 193996 193647 192891 192846 193658 194262 194115 193651 193140 192471 192016 192435 193661 194989 196002 196601 196631 196404 196971
54135 196971 198818 200896 202014 202531 203485 204725 205247 204874 204238 203532 202552 201623 201241 201111 200632 199981 199716
54118 199716 199749 199755 200065 201112 202568 204028 205855 208268 210366 211400 212280 214372 217414 220092 222207 224741
54102B24741L396L863M184M558M239K931J557O42n18k162l190k994k590k803k923
54087B32931k219j304q57l77O03J418J458J215J138P71p8o13m13k11m49m04L31
54070B32940R39Q80R17J613K224K022J435R06K0j267j989j772j640k191k376j356
54054B31305q8J97j22K8O76J230J617J874J627J031J166K444L669L771L390L616
54038B57431M219M348M179M556N586O594P079O938O295N692N823O576P060O828
54024C39204O277N625M658L679L456L814L592K439J370J026Q17K57k35n25j311
54009C74143k789m195n167o217p269p296o114n039m984n297n184m822m466l867
53995C01437l245l304l751l404k287j830k413k671j944j375j653j795j213r19
$$ plain form
54102 224741 228137 232000 236184 240742 244981 247912 249469 250111 249593 247431 244241 241247 238657 235854 232931
54087 232931 230712 229408 228551 228174 228777 230195 231653 232868 234006 234777 234699 234086 233673 233462 233013 232609 232940
54070 232940 233879 234759 235676 237289 239513 241535 242970 243876 243896 242629 240640 238868 237228 235037 232661 231305
54054 231305 231217 231414 231292 231320 231996 233226 234843 236717 238344 239375 240541 242985 246654 250425 253815 257431
54038 257431 261650 265998 270177 274733 280319 286913 293992 300930 307225 312917 318740 325316 332376 339204
54024 339204 345481 351106 355764 359443 362899 366713 370305 372744 374114 375140 375957 376214 375979 375454 374143
54009 374143 371354 367159 361992 355775 348506 341210 335096 330057 325073 319776 314592 309770 305304 301437
53995 301437 298192 294888 291137 287733 285446 283616 281203 278532 276588 275213 273560 271765 270552 269633
53981B69633j475j819j383j293k116k448j353j57j38l18N61J662J622R00O64P36
53965B63278M67L46R34J572J781K544M448O147O612P234R552J2146J2317R705
53951C39083O115K635p72l615n106n583n782n227l190n95R71J565K360L421L937
53936C30217M133M950O005N832M095K024O49k9k03O6M26N88R26J871L118M153
53920C68821N028N732N699M911M558N446O728P281P402P886Q476Q621Q814R639
53906D65042J0364R921Q497O867M990K730R05J76k66j368k568k946l010l650m389
53891D91295m430m504n687p246p771p692q555j0251j1134j0673r990r787r572
53878C84003q953q161p193n863m637m188m304m325m238m272m047l353l069l832
$$ plain form
53981 269633 268158 266339 264956 263663 261547 259099 257746 257589 257451 257133 257694 259356 260978 261878 262542 263278
53965 263278 263745 264091 265025 266597 268378 270922 275370 281517 288129 295363 304915 317061 329378 339083
53951 339083 345198 347833 347061 343446 338340 332757 326975 321748 318558 317963 318934 320499 322859 326280 330217
53936 330217 334350 339300 345305 351137 355232 357256 357905 357876 357673 357739 358165 358753 359679 361550 364668 368821
53920 368821 373849 379581 385280 390191 394749 400195 406923 414204 421606 429492 437968 446589 455403 465042
53906 465042 475406 485327 493824 500691 505681 508411 509316 509492 509226 507858 505290 502344 499334 495684 491295
53891 491295 486865 482361 476674 469428 461657 453965 445410 435159 424025 413352 403362 393575 384003
53878 384003 375050 366889 359696 353833 349196 345008 340704 336379 332141 327869 323822 320469 317400 313568
53864C13568m628m190l083k738l137l190k839k909l339l323k875k573k133r83
53850B71628J67R6q71j339j068r75j277j340j230j603k148j865q24r0N8K31M60
53833B58010J67m45n71k67k42l83N8R07J286J178J267J456J140P31J169K035J875
53816B69371N31n42l89M65J276J878K114J885J782K450L339L414K866K846L623
53801B96909M442N044N818O631O987P172P826Q528Q295P312O582O139N197L917
53787C86799L312L436L371K935K725K535J518op67p45j351l100m823n577n745
53772C84517n867n877n913o444p125o895n616m391l976m068m318m817n276n092
53758C08842m396l904l612k846j687j099j480k205k662k690k086r25j55o05j564
$$ plain form
53864 313568 308940 304750 301667 298929 295792 292602 289763 286854 283515 280192 277317 274744 272611 271628
53850 271628 271795 271891 271020 269681 268613 267638 266361 265021 263791 262188 260040 258175 257351 257261 257319 257550 258010
53833 258010 258177 257732 257161 256894 256652 256269 256327 257234 258520 259698 260965 262421 263561 264292 265461 267496 269371
53816 269371 269902 269360 268971 269436 270712 272590 274704 276589 278371 280821 284160 287574 290440 293286 296909
53801 296909 301351 306395 312213 318844 325831 333003 340829 349357 357652 364964 371546 377685 382882 386799
53787 386799 390111 393547 396918 399853 402578 405113 406631 406625 405858 405113 403762 400662 395839 390262 384517
53772 384517 378650 372773 366860 360416 353291 346396 340780 336389 332413 328345 324027 319210 313934 308842
53758 308842 304446 300542 296930 294084 292397 291298 289818 287613 284951 282261 280175 279250 279095 278490 276926
53743B76926j641q24l04m95p49p96q86p86j31M47K01j26O67J915J881N59m06m56
53725B74996n14o46J44J565J903Q65K21R11J732J757J851K728L474L221K605K456
53709B99269K496K357K435K810K730K052J772K379L029L110L226L807M242M257
53695C39971M624N582O022N243M157L739L505K673J654J326J689K164K383J991
53681C86723O45j139k088j755j033o63l59R9J67m07r94j176j286j381r26o9J33
53664C74491o07j217j007o42o87o58k74k71r59j336o93R8m0p84j233j305j321
53647C61555j146o77l63l58jJ008J880J903J486J293J281J274J510J929J890J313
53631C75777J119J743K346K230J969K206K435K045J612K047L144M058M627N286
$$ plain form
53743 276926 275285 274461 274157 273662 272913 272117 271231 270445 270314 270761 270962 270836 271503 273418 275299 275858 275452 274996
53725 274996 274482 273836 273980 275545 277448 278313 278534 279445 281177 282934 284785 287513 290987 294208 296813 299269
53709 299269 301765 304122 306557 309367 312097 314149 315921 318300 321329 324439 327665 331472 335714 339971
53695 339971 344595 350177 356199 361442 365599 369338 372843 375516 377170 378496 380185 382349 384732 386723
53681 386723 387368 386229 384141 382386 381353 380690 380331 380430 380597 380190 379196 378020 376734 375353 374427 374358 374491
53664 374491 373884 372667 371660 371018 370331 369673 369399 369128 368169 366833 366140 366238 366198 365414 364181 362876 361555
53647 361555 360409 359732 359369 359011 359010 360018 361898 363801 365287 366580 367861 369135 370645 372574 374464 375777
53631 375777 376896 378639 380985 383215 385184 387390 389825 391870 393482 395529 398673 402731 407358 412644
53617D12644O088O641O639N941M626L364L003L453L682L249K863L076L408L352
53603D72029L282L591L848L574L128L117L441L524L028K046J066Q36J553K179
53589E10242J458l16j581j546q74k90J01N9q38k162k876k858k881k995k472j573
53573D88598j574k659l506l473l388l597l204j990j211j497j820j466j231j529
53559D56453j231K56J562J449P04N09M76r8n19J7P16N09k2K87J154J536J482J661
53541D66901J819J313O15Q31K137L849N446O561O651N752M929N032N776O689Q020
53526E32321R784J1106J1491J1656J2152J2459J2423J3144J5089J6823J7096J6883
53514F92427J7690J9138J9997K0514K1764K3557K4920K5938K7364K8952K9930
$$ plain form
53617 412644 418732 425373 432012 437953 442579 445943 448946 452399 456081 459330 462193 465269 468677 472029
53603 472029 475311 478902 482750 486324 489452 492569 496010 499534 502562 504608 505674 506510 508063 510242
53589 510242 511700 511384 509803 508257 507383 507093 507194 507253 506415 504253 501377 498519 495638 492643 490171 488598
53573 488598 487024 484365 480859 477386 473998 470401 467197 465207 463996 462499 460679 459213 457982 456453
53559 456453 455222 455478 457040 458489 459193 459702 460178 460080 459561 459578 460294 460803 460781 461068 462222 463758 465240 466901
53541 466901 468720 470033 470648 471479 473616 477465 482911 489472 496123 501875 506804 511836 517612 524301 532321
53526 532321 542105 553211 564702 576358 588510 600969 613392 626536 641625 658448 675544 692427
53514 692427 710117 729255 749252 769766 791530 815087 840007 865945 893309 922261 952191
53503I52191L0566L1571L2442L2101L0768K9677K9243K8958K8676K8609K8457
53492A283259K7915K7568K7976K8373K7675K6304K5505K5384K4980K3986K2942
53481A571867K2069K1250K0835K1228K2019K2601K3135K3777K3690K2148J9905
53470A814524J8066J6272J3525J0090O931L886J57l849p013r477j2358j5601j7884
53457A817269j8612j8441j7996j7587j8110k0396k3610k5918k6884k7633k8581
53446A573501k8760k7801k6932k7261k8313k8938k8733k7918k6612k4754k2265
53435A275214j9080j5434j2093r773q400p438o609n747m406k417l22J525L679
53422A188699O521R097J0285J0577J1470J3457J5880J8316K0784K2870K4050K4869
$$ plain form
53503 952191 982757 1014328 1046770 1078871 1109639 1139316 1168559 1197517 1226193 1254802 1283259
53492 1283259 1311174 1338742 1366718 1395091 1422766 1449070 1474575 1499959 1524939 1548925 1571867
53481 1571867 1593936 1615186 1636021 1657249 1679268 1701869 1725004 1748781 1772471 1794619 1814524
53470 1814524 1832590 1848862 1862387 1872477 1879408 1883294 1883451 1879602 1872589 1863112 1850754 1835153 1817269
53457 1817269 1798657 1780216 1762220 1744633 1726523 1706127 1682517 1656599 1629715 1602082 1573501
53446 1573501 1544741 1516940 1490008 1462747 1434434 1405496 1376763 1348845 1322233 1297479 1275214
53435 1275214 1256134 1240700 1228607 1218834 1210434 1202996 1196387 1190640 1186234 1183817 1183495 1185020 1188699
53422 1188699 1195220 1204317 1214602 1225179 1236649 1250106 1265986 1284302 1305086 1327956 1352006 1376875
53410A376875K6423K8719L0745L2100L3370L4903L6431L7988M0046M2555M4833
53399A764988M6600M8351N0622N3587N7212O1074O4331O6544O8237O9889P1049
53388B422484P1339P1627P2870P4367P4525P3039P0950O8782O6176O3244O0793
53377C190196N8995N7020N4263N0950M7453M3856M0208L6462L2313K7780K3411
53366C662907J9073J3162M222p131j9034l0531m1526n1214n8348o2928o6114o8572
53354C293966p0253p1561p3089p4247p3756p1647o9367o7725o6211o4506o3243
53343B528361o2909o3208o3803o4505o4579o3086o0242n7348n5096n2898n0032
53332A870655m6486m2581l8636l5064l1890k8365k4040j9965j7671j7233j7539
$$ plain form
53410 1376875 1403298 1432017 1462762 1494862 1528232 1563135 1599566 1637554 1677600 1720155 1764988
53399 1764988 1811588 1859939 1910561 1964148 2021360 2082434 2146765 2213309 2281546 2351435 2422484
53388 2422484 2493823 2565450 2638320 2712687 2787212 2860251 2931201 2999983 3066159 3129403 3190196
53377 3190196 3249191 3306211 3360474 3411424 3458877 3502733 3542941 3579403 3611716 3639496 3662907
53366 3662907 3681980 3695142 3699364 3692233 3673199 3642668 3601142 3549928 3491580 3428652 3362538 3293966
53354 3293966 3223713 3152152 3079063 3004816 2931060 2859413 2790046 2722321 2656110 2591604 2528361
53343 2528361 2465452 2402244 2338441 2273936 2209357 2146271 2086029 2028681 1973585 1920687 1870655
53332 1870655 1824169 1781588 1742952 1707888 1675998 1647633 1623593 1603628 1585957 1568724 1551185
53321A551185j8173j9499k1076k1593k0635j9035j7372j5463j3468j2076j1245
53310A361550j0042q033n733l488j116J210K892L935M863N683O138O905R134J2572
53296A386470J5658J7670J9383K1320K2921K3938K5206K7395L0049L2388L4097
53285A656495L5006L4962L4323L3589L2520L0722K8963K8496K8941K8451K6174
53274A998642K3045J9735J5638J0567N812K510J27k513n715r248j3245j7897k2884
53261B004574k7689l1877l4873l6305l6796l7526l8726l9595l9849m0162m0749
53250A600427m0768l9662l8041l6675l5594l4637l4008l3762l3638l3703l4357
53239A205582l5375l5900l5567l4784l3753l2293l0718k9645k8741k6908k4017
$$ plain form
53321 1551185 1533012 1513513 1492437 1470844 1450209 1431174 1413802 1398339 1384871 1372795 1361550
53310 1361550 1351508 1343475 1337742 1334254 1333138 1334348 1337240 1341175 1346038 1351721 1357859 1364764 1373898 1386470
53296 1386470 1402128 1419798 1439181 1460501 1483422 1507360 1532566 1559961 1590010 1622398 1656495
53285 1656495 1691501 1726463 1760786 1794375 1826895 1857617 1886580 1915076 1944017 1972468 1998642
53274 1998642 2021687 2041422 2057060 2067627 2073439 2075949 2076076 2073563 2067848 2058600 2045355 2027458 2004574
53261 2004574 1976885 1945008 1910135 1873830 1837034 1799508 1760782 1721187 1681338 1641176 1600427
53250 1600427 1559659 1519997 1481956 1445281 1409687 1375050 1341042 1307280 1273642 1239939 1205582
53239 1205582 1170207 1134307 1098740 1063956 1030203 997910 967192 937547 908806 881898 857881
53228H57881k1209j9128j7147j4748j2465j0930j0172j0148j0929j1982j2474
53217G06549j2580j3217j4334j4897j4819j5182j6108j6202j4887j3494j3069
53206E47760j2706j1282r373q118p419o645o147o623p745q613r074r486r749r467
53192D25313q727p948p310o872o710o586o132n619n726o230o020m827l767l598
53178C39241l625l068k362k152k062j455o37l61o88j105j248r52k55K78n6r96
53162C18497j532j393j243j222p22J5k82j744k702k165j338j505j927j384l83
53147B98970j43m65l57L7p1l90qP59O77m19j403j511r42L3J282K200K118J467
53129C01834J421K227K855K495J517P31M25M95R03J657K506K979K704J825J062
$$ plain form
53228 857881 836672 817544 800397 785649 773184 762254 752082 741934 731005 719023 706549
53217 706549 693969 680752 666418 651521 636702 621520 605412 589210 574323 560829 547760
53206 547760 535054 523772 514399 506281 498862 492217 486070 479447 471702 463089 454015 444529 434780 425313
53192 425313 416586 408638 401328 394456 387746 381160 375028 369409 363683 357453 351433 346606 342839 339241
53178 339241 335616 332548 330186 328034 325972 324517 323880 323519 322831 321726 320478 319526 319271 319549 319493 318497
53162 318497 316965 315572 314329 313107 312385 312400 312118 310374 307672 305507 304169 302664 300737 299353 298970
53147 298970 298827 298362 298005 298042 297971 297581 297573 298332 299009 298590 297187 295676 294734 294767 296049 298249 300367 301834
53129 301834 303255 305482 308337 310832 312349 313080 313505 314000 314903 316560 319066 322045 324749 326574 327636
53114C27636J098J821K445K473K078J556R25K40l25q77j718k714l322l437l481
53099C24398l544l233k498j825j324o12J58J32r02j947k110j686j414j420j427
53084C00746j302r15j36O69Q03K15m02o29o28l93K75Q39L76q37j352n87L81N55
53066B97678J91k81j081k046k216j348o37r41j518j437j052j008r33k92M43O59
53050B84181P07J156J696J826J765J821J694J285J191J537J324N1j177j233o87
53035B97137p15j220j344j010o88l59J20K87j16l78J05O97O20L59P12J238R61
53018B96406j0p60r32p38j81O69J229J228J258J626J539N51k31K63J181R68k72
53001C03794j113r99n53j61L48Q07Q21N33L60K56R3K37Q30J256J223J525K654
$$ plain form
53114 327636 328734 330555 333000 335473 337551 339107 340032 340272 339947 339070 337352 334638 331316 327879 324398
53099 324398 320854 317621 315123 313298 311974 311362 311520 311652 310750 308803 306693 305007 303593 302173 300746
53084 300746 299444 298529 298393 299062 299865 300080 299678 299049 298421 298028 298303 299142 299518 298681 297329 296742 297123 297678
53066 297678 297869 297588 296507 294461 292245 290897 290260 289319 287801 286364 285312 284304 283371 283079 283522 284181
53050 284181 284888 286044 287740 289566 291331 293152 294846 296131 297322 298859 300183 300234 299057 297824 297137
53035 297137 296422 295202 293858 292848 292160 291801 291921 292208 292092 291714 291819 292516 293136 293495 294207 295445 296406
53018 296406 296396 295636 294704 293966 293785 294454 295683 296911 298169 299795 301334 301885 301654 301917 303098 304066 303794
53001 303794 302681 301682 301129 300968 301316 302123 302944 303477 303837 304093 304186 304423 305253 306509 307732 309257 311911
52984C11911L664L622L223L522M024L645K643J968J416K90q78j070p01r02j371
52969C35006q96L26R11O56P11J370J655J243R84J200J177O68L21K33l61j490k042
52952C41672j483p06o02r58j276j561j826j733j305j175j674k348k690k707k524
52937C17104k053j291m79J80O10P63P66Q33P65Lj285j964j426n65l86m44K16J302
52919C12649J676J054Q3p86j358j174j50P46O86K71M10O16p7j135j246n62m63
52902C11240j265j892j751j300p25L19J544K091J876J597J415R72N65Q55J487
52887C17028J462Q26M45K99m06j408j470m55L68K88j10l97p86r58j01J448K253
52870C18326J946J766K470L265L404L307L411L315K830K490K330J406o48k707
$$ plain form
52984 311911 315575 319197 322420 325942 329966 333611 336254 338222 339638 339928 339050 337980 337279 336377 335006
52969 335006 334110 334436 335347 336003 336714 338084 339739 340982 341966 343166 344343 345011 345332 345565 345204 343714 341672
52952 341672 340189 339483 338881 337923 336647 335086 333260 331527 330222 329047 327373 325025 322335 319628 317104
52937 317104 315051 313760 313281 313461 314071 314834 315600 316433 317198 317201 315916 313952 312526 311961 311575 311131 311347 312649
52919 312649 314325 315379 315462 314676 313318 312144 311994 312740 313426 313697 314107 314723 314646 313511 312265 311703 311240
52902 311240 309975 308083 306332 305032 304307 304626 306170 308261 310137 311734 313149 314121 314686 315541 317028
52887 317028 318490 319316 319761 320060 319654 318246 316776 316321 316689 316977 316867 316470 315684 314726 314625 316073 318326
52870 318326 320272 322038 324508 327773 331177 334484 337895 341210 344040 346530 348860 350266 349618 346911
52856C46911l657l783l911m046l736l052k485k361k742l402l787l547l178l313
52842B99911l593l188k262j747j704j310m84j04l54l23L44P92M26j94m55n07m48
52825B84800J30J267K254K608K491J924O59q42j512j110n48m27l91k15k75o03
52809B90210o05j17L91Q72J742K601K286O45j117k192k896l260k507p30N58L51
52793B86232n38r59j008j194j311j008n94l64o7K86J54m07l81N88J361R71J08
52776B81869L3Q62J803K324K309J733Q76K06l59j277k207k112r78j57m63j124
52760B83338j353j525j920j705l54J040J227O72O91J408J892J802J674J823J922
52745B90632J652J084O46Q91J935K873K603J434R43J797K785K660J803J237J009
$$ plain form
52856 346911 343254 339471 335560 331514 327778 324726 322241 319880 317138 313736 309949 306402 303224 299911
52842 299911 296318 293130 290868 289121 287417 286107 285623 285519 285165 284842 285186 285978 286404 286210 285755 285248 284800
52825 284800 284930 286197 288451 291059 293550 295474 296133 295291 293779 292669 292121 291694 291303 291088 290813 290210
52809 290210 289605 289488 289879 290751 292493 295094 297380 298025 296908 294716 291820 288560 286053 285323 285881 286232
52793 286232 285694 284735 283727 282533 281222 280214 279620 279256 279189 279475 279629 279222 278841 279429 280790 281761 281869
52776 281869 281902 282764 284567 286891 289200 290933 291809 292015 291656 290379 288172 286060 285082 284925 284462 283338
52760 283338 281985 280460 278540 276835 276481 277521 278748 279420 280111 281519 283411 285213 286887 288710 290632
52745 290632 292284 293368 294014 294905 296840 299713 302316 303750 304693 306490 309275 311935 313738 314975 315984
52730C15984N59m4k80n8M34J238K239K726K132P94m91j328j714j709j538j444
52714C17500j268p86m46q98j673j540m09M51M16L62Q72J102L03p86j117p83l40
52697C10960K17Q27P65k32j112q95n4L96M07M82N51K74j57m20o36q31o32j09J9
52678C09820k98n0J098J828J031n28j463j658j677j367m46M26N19K93M98P28J85
52661C08939p88j286j238j024l65R87K128K091J475J520K094K156J823K236L479
52646C24227M232L647K223O56r47k426l248l157k418j312q2O84L99o53j442j241
52630C19142j34J348K638L477M221N385O561O463M638K265N20r86l073n167n936
52615C41362n269m294l668l121k561k426k719k765k088r44J55Q88J119R29O21
$$ plain form
52730 315984 316543 316499 316219 316161 316595 317833 320072 322798 324930 325724 325233 323905 322191 320482 318944 317500
52714 317500 316232 315446 315000 314102 312429 310889 310480 310931 311347 311709 312581 313683 313986 313200 312083 311300 310960
52697 310960 311177 312004 312769 312537 311425 310530 310476 310872 311279 311761 312312 312586 312429 312009 311373 310542 309910 309801 309820
52678 309820 309522 309472 310570 312398 313429 312901 311438 309780 308103 306736 306290 306716 307235 307528 308026 308754 308939
52661 308939 308151 306865 305627 304603 304238 305225 307353 309444 310919 312439 314533 316689 318512 320748 324227
52646 324227 328459 332106 334329 334985 334038 331612 328364 325207 322789 321477 321395 322079 322478 321825 320383 319142
52630 319142 319008 320356 322994 326471 330692 336077 342638 349101 353739 356004 356524 355538 352465 347298 341362
52615 341362 336093 331799 328131 325010 322449 320023 317304 314539 312451 311507 311662 312550 313669 314598 315219
52600C15219M01K75M49J220K130K062O96q03j271r19n51k52J93M28J19k07Q8O70
52582C19947R22J079J620K053J520K27p60q79m15J64L95j35j120j434n33O55J023
52565C24329P29M27L0o64j007n22l4m38j062p78K4J66k62l86m82j470k738k580
52547C13282q89N24O12K72M40O98M24o3k61k43j30K62P79Q36L75Ln5k31o32p30
52527C15273l26M7J00K85R45J630J696J111M18K72R43J921K212J550R25J298K281
52510C32581L000L646M952O478O870N711L857J897l53k690m195m505m328m305
52496C48616m281m050l802l520k823j867j477j946k381j812m48N90N05m40j175
52481C19689q36K43Q74N80K77P83J396J013J14K34J616K762K584J776J666K585
$$ plain form
52600 315219 315620 315895 316344 317564 319694 321756 322452 321649 320378 319459 318908 318656 318849 319277 319396 319189 319277 319947
52582 319947 320869 321948 323568 325621 327141 327368 326608 325729 325314 325478 325873 325738 324618 323184 322651 323306 324329
52565 324329 325058 325485 325515 324851 323844 323322 323288 322850 321788 321010 321034 321200 320938 320552 320070 318600 315862 313282
52547 313282 312393 312917 313529 313801 314241 314939 315363 315300 315039 314796 314666 314928 315707 316543 316918 316921 316866 316635 316003 315273
52527 315273 314947 314994 315094 315379 316324 317954 319650 320761 321179 321451 322394 324315 326527 328077 329002 330300 332581
52510 332581 335581 339227 344179 350657 357527 363238 367095 368992 368639 365949 361754 357249 352921 348616
52496 348616 344335 340285 336483 332963 330140 328273 326796 324850 322469 320657 320209 320799 321304 320864 319689
52481 319689 318853 319096 319970 320550 320827 321610 323006 324019 324133 324367 325983 328745 331329 333105 334771 337356
52465C37356L772M319L923L196L127L817L996K537J02j623k035j986k216k574
52451C55711k823l158l689m140m245l844k793j419o05p08p81J4Q80M33j065k056
52435C25712j992j743j725j263p7R98J240Q34J56o72j245j027k48L85Q59J658
52419C21850K386K041Q07J08N37J114J049Q22R69J162J152J441K262K984L256
52404C43940L695M804O180P501R185J1336J2889J2726J0843P815L872o29m599
52391D29558o974p709p444o666n671m793m082l199k059j150q33q56q93r77j104
52376C75148q91j20R17J856K672L388L884M183M411M407L915L220K871K688J872
52361D14421K80j179j755j747j819k089k201j862r69K83J319J620J343J112J240
$$ plain form
52465 337356 341128 345447 349370 352566 355693 359510 363506 366043 366145 364522 362487 360501 358285 355711
52451 355711 352888 349730 346041 341901 337656 333812 331019 329600 328995 328287 327506 327520 328400 328833 327768 325712
52435 325712 323720 321977 320252 318989 318912 319910 321150 321984 322140 321468 320223 319196 318948 319333 320192 321850
52419 321850 324236 326277 327084 327192 327729 328843 329892 330714 331683 332845 333997 335438 337700 340684 343940
52404 343940 347635 352439 358619 366120 375305 386641 399530 412256 423099 430914 434786 434157 429558
52391 429558 422584 414875 407431 400765 395094 390301 386219 383020 380961 379811 378978 378122 377229 376252 375148
52376 375148 374257 374137 375054 376910 379582 382970 386854 391037 395448 399855 403770 406990 409861 412549 414421
52361 414421 414701 413522 411767 410020 408201 406112 403911 402049 401080 401363 402682 404302 405645 406757 407997
52346D07997J592J993K222J900J087O88J404K673L449L698M041M412M328M143
52332D45627M625N453N684N558O256P819R034R565J0479J2144J3405J3501J3259
52319E62409J3554J4009J4042J3955J4135J4292J4334J4859J6039J7064J7441
52308G26133J7819J8820K0028K0895K1594K2296K2673K2824K3603K5220K6499
52297I68404K6308K4889K2987K0677J7880J5057J2529R881O905M261K543J369
52285A133690J72r83k006l292m875n985o212o184o365o217n355m553m577m863
52271A072395m384l137j784m88J004K618M113N470O526O895O799P192Q431R747
52257A121397J0713J2154J4696J7374J8871J9333J9875K0803K1392K0987J9480
$$ plain form
52346 407997 409589 411582 413804 415704 416791 417479 418883 421556 425005 428703 432744 437156 441484 445627
52332 445627 450252 455705 461389 466947 473203 481022 490056 499621 510100 522244 535649 549150 562409
52319 562409 575963 589972 604014 617969 632104 646396 660730 675589 691628 708692 726133
52308 726133 743952 762772 782800 803695 825289 847585 870258 893082 916685 941905 968404
52297 968404 994712 1019601 1042588 1063265 1081145 1096202 1108731 1118612 1125517 1129778 1132321 1133690
52285 1133690 1133862 1132879 1130873 1127581 1122706 1116721 1110509 1104325 1097960 1091743 1086388 1081835 1077258 1072395
52271 1072395 1068011 1064874 1063090 1062602 1063606 1066224 1070337 1075807 1082333 1089228 1096027 1103219 1111650 1121397
52257 1121397 1132110 1144264 1158960 1176334 1195205 1214538 1234413 1255216 1276608 1297595 1317075
52246A317075J7058J4240J1765R882Q234O729N711M885L200M48k103l557m699
52233A388868o518q505r574r841j0164j0711j1085j1336j1695j1865j1636j1516
52221A264422j1858j1949j1018r506q340p590o839o217n951n595m701l661k803
52208A168394j490P45K942L889L966M399N266N621N188M563M052L720M202O027
52194A221484Q289R362Q982Q436Q659R313R764R811R319Q068O146L900J472j053
52180A321952l321n183p081r193j0697j0805j0083r687r682r159p766o066m579
52167A218650l505l121l441l615k732j038N13J706K997M257M694M004K656J067
52153A223092o13k022k819l299l860m055l102j196O28J836K693L371L716L802
$$ plain form
52246 1317075 1334133 1348373 1360138 1370020 1378254 1384983 1390694 1395579 1398779 1399227 1397124 1393567 1388868
52233 1388868 1382350 1373845 1364271 1354430 1344266 1333555 1322470 1311134 1299439 1287574 1275938 1264422
52221 1264422 1252564 1240615 1229597 1220091 1211751 1204161 1197322 1191105 1185154 1179559 1174858 1171197 1168394
52208 1168394 1166904 1167649 1170591 1174480 1178446 1182845 1188111 1193732 1198920 1203483 1207535 1211255 1215457 1221484
52194 1221484 1229773 1239135 1248117 1256553 1265212 1274525 1284289 1294100 1303419 1311487 1317633 1321533 1323005 1321952
52180 1321952 1318631 1313448 1306367 1297174 1286477 1275672 1265589 1255902 1246220 1237061 1229295 1223229 1218650
52167 1218650 1215145 1212024 1208583 1204968 1202236 1201198 1201711 1203417 1206414 1210671 1215365 1219369 1222025 1223092
52153 1223092 1222479 1220457 1217638 1214339 1210479 1206424 1203322 1202126 1202754 1204590 1207283 1210654 1214370 1218172
52139A218172L796L355K108O08j63r2J06J60M65J142J934L051N111Q050J0967
52124A258770J3198J4811J6075J7196J8498K0059K1230K1287K0524J9900J9723
52113A461271J9514J8978J8257J7315J6051J4974J4827J5454J5947J5961J6073
52102A644622J6811J8073J9496K0598K0711J9581J7898J6411J4741J2005Q349
52091A829296M700J131l180q147j2265j4421j5178j5786j6671j7461j7741j7371
52079A696906j6437j5293j4282j3428j2667j2185j1891j0966q796o179m502l790
52067A566490k692m98K028M144O219Q726J1168J2804J3763J4699J5787J6777J7669
52054A687084J8700J9782K0394K0024J8489J5965J2851R615O591L898J467r24
$$ plain form
52139 1218172 1221968 1225323 1227431 1228039 1227876 1227784 1227890 1228050 1228515 1229657 1231591 1234642 1239753 1247803 1258770
52124 1258770 1271968 1286779 1302854 1320050 1338548 1358607 1379837 1401124 1421648 1441548 1461271
52113 1461271 1480785 1499763 1518020 1535335 1551386 1566360 1581187 1596641 1612588 1628549 1644622
52102 1644622 1661433 1679506 1699002 1719600 1740311 1759892 1777790 1794201 1808942 1820947 1829296
52091 1829296 1833996 1835127 1831947 1823800 1811535 1797114 1781936 1766150 1749479 1732018 1714277 1696906
52079 1696906 1680469 1665176 1650894 1637466 1624799 1612614 1600723 1589757 1580961 1574782 1570280 1566490
52067 1566490 1563798 1563300 1565328 1569472 1575691 1584417 1595585 1608389 1622152 1636851 1652638 1669415 1687084
52054 1687084 1705784 1725566 1745960 1765984 1784473 1800438 1813289 1822904 1829495 1833393 1834860 1833936
52042A833936l478o060q283r948j1252j2418j3493j4520j5504j6095j5928j5458
52030A691499j5626j6408j6609j5634j4506j4425j5174j5875j6359j6800j6732
52019A517351j5740j4553j4207j4542j4651j4334j3901j3087j1522r978r624j0268
52007A360944j0653j0480j0725j1941j3528j4909j6205j7619j9059k0509k1816
51996A193500k2157k0797j8333j6193j5030j4560j4681j5503j6486j7017j7699
51985A005044j9572k2104k3508k3184k2283k1602k0682j9346j8440j8247j7800
51974G78276j6642j5803j5916j5748j3815j0556p551n259k852J16K941M730N330
51961F87251N300N314N554N462M291K021o04k997n178p192q608q881p887n919
$$ plain form
52042 1833936 1830458 1824398 1816115 1806167 1794915 1782497 1769004 1754484 1738980 1722885 1706957 1691499
52030 1691499 1675873 1659465 1642856 1627222 1612716 1598291 1583117 1567242 1550883 1534083 1517351
52019 1517351 1501611 1487058 1472851 1458309 1443658 1429324 1415423 1402336 1390814 1380836 1371212 1360944
52007 1360944 1350291 1339811 1329086 1317145 1303617 1288708 1272503 1254884 1235825 1215316 1193500
51996 1193500 1171343 1150546 1132213 1116020 1100990 1086430 1071749 1056246 1039760 1022743 1005044
51985 1005044 985472 963368 939860 916676 894393 872791 852109 832763 814323 796076 778276
51974 778276 761634 745831 729915 714167 700352 689796 682245 676986 674134 674250 677191 681921 687251
51961 687251 692551 697865 703419 708881 713172 715193 714589 711592 706414 699222 690614 681733 673846 667927
51947F67927l489j114R99L083N370P740J0079J2580J5179J7135J7877J7902J8148
51934G89416J8868J9801K0900K1969K2116K0470J7011J1815M296n431j5204k2487
51922I03540k7011l0202l2416l2633l0763k8228k6007k3791k1323j8971j6730
51911F15465j4237j1915j0454r118o443k794j58R37K110M132N548N290M499M368
51897E87230M007K052j144m323p085r490j1147j1941j2527j2998j2279r985p550
51884D92820o260n427l842j827k77J076K881M603N463O133P889J0574J2818J3801
51870E40425J3526J1943R088N652K268j138m290n774m754k644j534j487j039J50
51856E60392R19P02K98L78O35O52M56j6j016k345l495m448n602o905p798q009
$$ plain form
51947 667927 664438 663324 664323 667406 672776 680516 690595 703175 718354 735489 753366 771268 789416
51934 789416 808284 828085 848985 870954 893070 913540 930551 942366 946662 941231 926027 903540
51922 903540 876529 846327 813911 781278 750515 722287 696280 672489 651166 632195 615465
51911 615465 601228 589313 578859 569741 563298 560504 560346 561283 563393 567525 573073 578363 582862 587230
51897 587230 591237 593289 592145 587822 580737 571247 560100 548159 535632 522634 510355 500370 492820
51884 492820 486560 481133 477291 475464 475187 476263 479144 483747 489210 495343 503232 513806 526624 540425
51870 540425 553951 565894 574982 580634 582902 581764 577474 571700 566946 564302 562768 561281 560242 560392
51856 560392 561311 562013 562311 562689 563324 563976 564432 564416 563400 561055 557560 553112 547510 540605 532807 524798
51840E24798p789p421p074o932o843o229m913l632l030k667j732k12J464L207
51826D70995M727M877K938J57j375j246q81j261j809j684r92k94J27K58K47N43
51810D75327J420K331K374J413J27r86j862k265j803o78L05O44M66L2m00k69Q64
51793D77040K434L193K642J475M49m35j322j838j610r81o72r22j339j509j395
51778D75210j153p54K9J236K447L101L133L061L430M380N796P490R053R933R865
51763E36257R069P849O293M388K055q60m186p039q518q823q946r222r066q307
51749E00944p628p289o537m985l528l056l044k442j228j19O01J057J166R77J190
51734D66079K308L739M636N206O168P287P486O213L871J145j188k103r97J579
$$ plain form
51840 524798 517009 509588 502514 495582 488739 482510 477597 473965 470935 468268 466536 466324 467788 470995
51826 470995 475722 480599 483537 483694 482319 481073 480192 478931 477122 475438 474446 474152 474279 474537 474784 475327
51810 475327 476747 479078 481452 482865 482992 482006 480144 477879 476076 475398 475703 476347 476813 476845 476445 476176 477040
51793 477040 479474 482667 485309 486784 487233 486798 485476 483638 482028 481047 480375 479453 478114 476605 475210
51778 475210 474057 473303 473332 474568 477015 480116 483249 486310 489740 494120 499916 507406 516459 526392 536257
51763 536257 545326 553175 559468 563856 565911 565051 560865 553826 545308 536485 527539 518317 509251 500944
51749 500944 493316 486027 479490 474505 470977 467921 464877 462435 461207 461088 461689 462746 463912 464889 466079
51734 466079 468387 472126 476762 481968 488136 495423 502909 509122 512993 514138 512950 510847 509850 511429
51720E11429M476O908Q224P405M082k91l560n044n626n782m964l053j210p71j989
51705E10234m132o134o966o096l829q60K305M980N800L813P4l008m127m027l783
51690D84244l247j781L44J997K282J130q11k554l413l581l819m401m738m213k863
51675D54576j145N63J913K480K189J572J292J526K096K956M323O287Q593J0834
51661E00055J2688J3853J3938J2601R817N883J150l892q218j0515j0344q637o606
51648E21773m469j916O90K546L611M313M186K146j531m871o405o579o394n910
51634E01190m872l721k909k198j515j556k552l363l012k220k166k533k232j417
51620D64924j198j743k132j959j745j789j919k235k989l717l663l042k762k922
$$ plain form
51720 511429 515905 522813 531037 538442 542524 542233 538673 533629 528003 522221 517257 514204 512994 512223 510234
51705 510234 506102 499968 493002 486906 483077 482217 484522 489502 495302 499115 499189 496181 492054 488027 484244
51690 484244 480997 479216 479560 481557 483839 484969 484158 481604 478191 474610 470791 466390 461652 457439 454576
51675 454576 453431 453994 455907 458387 460576 462148 463440 464966 467062 470018 474341 480628 489221 500055
51661 500055 512743 526596 540534 553135 562952 568835 569985 566093 557875 547360 537016 528379 521773
51648 521773 517304 515388 516078 518624 522235 526548 530734 532880 531349 526478 520073 513494 507100 501190
51634 501190 496318 492597 489688 487490 485975 484419 481867 478504 475492 473272 471106 468573 466341 464924
51620 464924 463726 461983 459851 457892 456147 454358 452439 450204 447215 443498 439835 436793 434031 431109
51606D31109k702j784p82j67J78L19J18r4K97J219J976K409L026M029N167O648
51590D50966R106J2249J4519J4410J1655O990J595l111o014p087p132o652n491
51577D86003l574j215J353M067O619Q681J0528J2645J4683J5740J5907J6615J8937
51564F06989K2182K4554K4871K3475K1878K1628K3129K5400K7270K8554K9742
51553H79672L0757L0651K8284K2888J4376L843o566j5142k1845k7450l1925l4541
51541H73002l5183l4438l2597k9671k6207k2971j9796j5878j1335p418n030m025
51529F28453m055n081o838q680j0249j1497j1988j1136r247p483o653o685p196
51516E21665p643p208n640m141m116n080n182l922k801k963l720m101m300m754
$$ plain form
51606 431109 428407 426623 425841 425674 425852 426171 426289 426195 426492 427711 429687 432096 435122 439151 444318 450966
51590 450966 460072 472321 486840 501250 512905 519895 521490 518379 512365 505278 498146 491494 486003
51577 486003 482429 481214 482567 486634 493253 501934 512462 525107 539790 555530 571437 588052 606989
51564 606989 629171 653725 678596 702071 723949 745577 768706 794106 821376 849930 879672
51553 879672 910429 941080 969364 992252 1006628 1010471 1003905 988763 966918 939468 907543 873002
51541 873002 837819 803381 770784 741113 714906 691935 672139 656261 644926 637508 632478 628453
51529 628453 624398 619317 612479 603799 593550 582053 570065 558929 549682 542199 535546 528861 521665
51516 521665 514022 506814 501174 497033 492917 487837 482655 478733 475932 472969 469249 465148 460848 456094
51502D56094m982m423l477k731j884m27J232K184K172J626J042Q44J361K331K836
51487D53798K341J397R02J000J165R69L58m77j190j486j482j573j867k165k454
51472D49236k847l018k470j416p35q85j501k201k960l564l583l224l354m308n324
51457D07846n496m709l318j645n3J034J569J846J977J932K067K807L845M459M657
51442D18818N088N943O943Q371J0707J3133J3878J2424J0074P985O114M626M508
51429E28612N754O404M727J329k151n212q075j0191j0794j0405j0143r964q941
51416D70950p072n435m578m014l383k915k600j859n48N54O40q0o27l11O22J346
51400D40690J430J357J866K860L505L478L521M339N576O375O568O761P520Q873
$$ plain form
51502 456094 451112 446689 443212 440481 438597 438170 439402 441586 443758 445384 446426 447270 448631 450962 453798
51487 453798 456139 457536 458438 459438 460603 461572 461930 461453 460263 458777 457295 455722 453855 451690 449236
51472 449236 446389 443371 440901 439485 438750 437865 436364 434163 431203 427639 424056 420832 417478 413170 407846
51457 407846 402350 397641 394323 392678 392625 393659 395228 397074 399051 400983 403050 405857 409702 414161 418818
51442 418818 423906 429849 436792 445163 455870 469003 482881 495305 505379 513364 519478 524104 528612
51429 528612 534366 540770 545497 546826 544675 539463 531388 521197 510403 499998 489855 479891 470950
51416 470950 463878 458443 453865 449851 446468 443553 440953 439094 438546 439100 439740 439660 439033 438722 439344 440690
51400 440690 442120 443477 445343 448203 451708 455186 458707 463046 468622 474997 481565 488326 495846 504719
51386E04719J0476J1960J3344J5233J8253K2252K6483L0626L5008L9632M3700
51375G71686M6492M8209M9587N1025N2090N1179M5857L4689J9207L133j0875k2765
51363A139514l3235m1691m7123m9843n1088n1352n0287m7846m4508m0595l6204
51352F45742l1719k7644k4087k0942j8273j6051j3891j1612r659q417p518o382
51340D49547n015l781k783k045j772j904j877j422j023r49n71N87J731J744P95
51325D31262j02p12j611k804l461l140k330j594j039p05p36q90n82K90J078J258
51309D14182J069J107J573K163K452K179J385L76m80j016j298j458j570j640j691
51294D17333j887k402l007l049k243j276j056j415j272j21J359K314K651K685
$$ plain form
51386 504719 515195 527155 540499 555732 573985 596237 622720 653346 688354 727986 771686
51375 771686 818178 866387 915974 966999 1019089 1070268 1116125 1150814 1170021 1173154 1162279 1139514
51363 1139514 1106279 1064588 1017465 967622 916534 865182 814895 767049 722541 681946 645742
51352 645742 614023 586379 562292 541350 523077 507026 493135 481523 471864 463447 455929 449547
51340 449547 444532 440751 437968 435923 434151 432247 430370 428948 427925 426976 426405 426992 428723 430467 431262
51325 431262 431160 430448 428837 426033 422572 419432 417102 415508 414469 413764 413028 412138 411556 411846 412924 414182
51309 414182 415251 416358 417931 420094 422546 424725 426110 426486 426006 424990 423692 422234 420664 419024 417333
51294 417333 415446 413044 410037 406988 404745 403469 402413 400998 399726 399605 400964 403278 405929 408614
51280D08614K633K738L346M422N513O387P139P479O747M979L209K205J597P31
51266D67739k41p18m75K97J357K314K718K537K101J383N9j594k705l024l135l238
51250D65375k887k286k505l682m425l942l373l851m536m033k752k127k266k114
51236D20596j473j177j371j208l12P99J722K438K586J730M34n5N38J130P71l07
51220D26841j254j504j010k57Ll96o38j3R26J161Q47J018J807K183J655J034J102
51203D33505J504J531J332J703K913M286M874M404L575L295L583L511K415P40
51189D73171o18j264j262p34j11j94j169k113k174j809j969k535k582j841r43
51174D51853l46k2k2l50m56K18J216J495Q42k5o24j002r24L7J456K116J600Q65
$$ plain form
51280 408614 411247 413985 417331 421753 427266 433653 440792 448271 455018 459997 463206 465411 467008 467739
51266 467739 467498 466780 466305 466602 467959 470273 472991 475528 477629 479012 479071 477477 474772 471748 468613 465375
51250 465375 462488 460202 457697 454015 449590 445648 442275 438424 433888 429855 427103 424976 422710 420596
51236 420596 419123 417946 416575 415367 415055 415854 417576 420014 422600 424330 424764 424709 425247 426377 427148 426841
51220 426841 425587 424083 423073 422816 422819 422423 421785 421772 422698 423859 424706 425724 427531 429714 431369 432403 433505
51203 433505 435009 436540 437872 439575 442488 446774 451648 456052 459627 462922 466505 470016 472431 473171
51189 473171 472553 471289 470027 469293 469182 468988 467819 465706 463532 461723 459754 457219 454637 452796 451853
51174 451853 451507 451485 451463 451113 450657 450875 452091 453586 454428 454403 453779 452777 451853 451890 453346 455462 457062 457927
51156D57927Q88J479J848J700J294Q35K74m81j341j947j860j159n82o98j102r47
51140D56128j58M46J83p74j625j527j79J746L032L153K800K725K642J895O99q7
51124D71099q0N91J861L422M212L329J374j41o55p78q17l17P70J640J754J510
51108D88774J432J462J400J326J206P02j84p96n24M87J590K273K450K396K466
51093E06460K631K429J610O19j4l95r24j497j656j357r32m92M6N01N95M17K35
51076E08276J02R0M16Q19N08m57n38J309L659M107K504J161J763L617N259O385
51060E38980P512Q880J0561J2981J6500K0716K4427K6110K4624K0090J4209R122
51048G34712N978M874N696P959J0081J0179Q010N214L297K109M98k223n779r187
$$ plain form
51156 457927 458815 460294 462142 463842 465136 465971 466245 465764 464423 462476 460616 459457 458875 458177 457075 456128
51140 456128 455970 456416 456599 455825 454200 452673 452494 454240 457272 460425 463225 465950 468592 470487 471186 471099
51124 471099 471019 471610 473471 476893 481105 484434 485808 485667 485012 484234 483417 483100 483870 485510 487264 488774
51108 488774 490206 491668 493068 494394 495600 496302 496118 495322 494798 495285 496875 499148 501598 503994 506460
51093 506460 509091 511520 513130 513749 513735 513340 512416 510919 509263 507906 506974 506482 506528 507029 507624 508041 508276
51076 508276 508378 508468 508884 509703 510211 509754 509216 510525 514184 518291 520795 521956 523719 527336 532595 538980
51060 538980 546492 555372 565933 578914 595414 616130 640557 666667 691291 711381 725590 734712
51048 734712 740690 745564 751260 759219 769300 779479 787489 792703 796000 798109 798607 796384 790605 781418
51034G81418j1172j0877q465m970j694n2j332n541j0745j4491j5928j5763j4481
51021F65907j1867q256m868k494p89Q06K332L816N623P813R841J1250J2092J2490
51007G03696J2354J1694J0635R112P110N165L932L263K428J176j48j423k849m260
50993G61885n210n646n738n219l842k242j226l57J576M621P461R228J0339J1397
50979G77027J2505J3971J6404J9700K2910K5426K7354K8571K8579K7601K6794
50968A026842K6963K8106L0294L3889L8565M3270M7531N1752N5997N9748O3174
50957A506131O7225P1866P5478P6660P5608P3143O9522O4806N9341N3141M5803
50946B238724L7605K9781K3075J6972J0999N791K375J126J816L636M845L745O12
$$ plain form
51034 781418 770246 759369 750904 745934 744240 744188 742856 737315 726570 712079 696151 680388 665907
51021 665907 654040 645784 640916 638422 637633 638439 640771 644587 650210 658023 667864 679114 691206 703696
51007 703696 716050 727744 738379 747491 754601 759766 763698 766961 769389 770565 770417 768994 766145 761885
50993 761885 756675 751029 745291 740072 736230 733988 732762 732405 733981 738602 746063 755291 765630 777027
50979 777027 789532 803503 819907 839607 862517 887943 915297 943868 972447 1000048 1026842
50968 1026842 1053805 1081911 1112205 1146094 1184659 1227929 1275460 1327212 1383209 1442957 1506131
50957 1506131 1573356 1645222 1720700 1797360 1872968 1946111 2015633 2080439 2139780 2192921 2238724
50946 2238724 2276329 2306110 2329185 2346157 2357156 2362947 2365322 2366448 2368264 2371900 2376745 2380490 2381102
50933B381102k448m177n493p667j0575j3581j6766k0321k3823k7236l1545l7377
50921B180093m3914n0067n5681o0689o4204o5694o5948o5719o4312o0904n6295
50910A526666n2004m8251m4346m0422l7337l5068l2700k9893k7223k5037k2984
50899A131401k0798j8688j6809j4985j2958j0649q291o527n893n939n478m060
50887A000326k544j787j567j336j120j013n43O06J953L016M128N675P246Q268
50873A021308Q869R381R730J0011J0869J2417J3658J3900J4006J5186J7254J9216
50861A175805K0963K3236K6274K9636L3040L6447L9688M2932M7140N3099O0374
50850A588634O8041P6109Q5290R5721J06723J17492J27320J35676J42874J50183
$$ plain form
50933 2381102 2378654 2374477 2368984 2361317 2350742 2337161 2320395 2300074 2276251 2249015 2217470 2180093
50921 2180093 2136179 2086112 2030431 1969742 1905538 1839844 1773896 1708177 1643865 1582961 1526666
50910 1526666 1474662 1426411 1382065 1341643 1304306 1269238 1236538 1206645 1179422 1154385 1131401
50899 1131401 1110603 1091915 1075106 1060121 1047163 1036514 1028223 1021696 1015803 1009864 1004386 1000326
50887 1000326 997782 995995 994428 993092 991972 990959 990416 991022 992975 995991 1000119 1005794 1013040 1021308
50873 1021308 1030177 1039558 1049288 1059299 1070168 1082585 1096243 1110143 1124149 1139335 1156589 1175805
50861 1175805 1196768 1220004 1246278 1275914 1308954 1345401 1385089 1428021 1475161 1528260 1588634
50850 1588634 1656675 1732784 1818074 1913795 2020518 2138010 2265330 2401006 2543880 2694063
50840B694063J58303J66173J72073J75201J75228J71118J61787J47643J30208
50831D151797J10421Q8559O5554M3023K1981K657j4260k7393l5993m0543m1658
50820D324145l9188l2893k3502j2720k434N817J0877J1758P719j202j3886k8884
50808D205607m5509o3550q2085r9518j15056j29073j41538j51151j56663j58081
50798C063383j55916j50305j41681j31223j19677j06735r2600p9006o7370n6929
50788A961941m6204l5456k6074j8146j0538l128K847O745R247J0816J0860Q926
50776A871836N772K670L12j436l129n215p549r602j1369j3532j6425j9521k2487
50763A770325k5769k9383l2147l3213l3489l4202l4932l4477l2993l1591l0282
$$ plain form
50840 2694063 2852366 3018539 3190612 3365813 3541041 3712159 3873946 4021589 4151797
50831 4151797 4262218 4350777 4416331 4459354 4481335 4483992 4469732 4442339 4406346 4365803 4324145
50820 4324145 4284957 4252064 4228562 4215842 4213408 4219225 4230102 4241860 4249579 4248377 4234491 4205607
50808 4205607 4160098 4096548 4014463 3914945 3799889 3670816 3529278 3378127 3221464 3063383
50798 3063383 2907467 2757162 2615481 2484258 2364581 2257846 2165246 2086240 2018870 1961941
50788 1961941 1915737 1880281 1854207 1836061 1825523 1822395 1825242 1831987 1841234 1852050 1862910 1871836
50776 1871836 1877608 1880278 1880590 1879154 1876025 1870810 1863261 1853659 1842290 1828758 1812333 1792812 1770325
50763 1770325 1744556 1715173 1683026 1649813 1616324 1582122 1547190 1512713 1479720 1448129 1417847
50752A417847k8055k4830k1698j9108j6302j2689q568m336j29L724O994J0270
50740A303120J4384J9152K3724K7993L2541L7345M1775M5840N0225N5050N9828
50729A710977O4570O9767P5198P9965Q3744Q6928Q9373R0268Q9384Q7478Q5236
50718B612888Q2596P8991P3354O4239N1068L5166J8470J666j5114l0303m1501
50707B931520m7980n0718n0018m5084l6492k6920j8432j0600k395N437J1081J3640
50695B673039J3265J0003L587n997j8336l2602m7347o0834p1891q0070q5095q6860
50683B210862q5976q3239p8532p1292o2164n2839m4008l4781k4637j4551n487
50672A653356L061J2081K1576L0893L9702M7749N4287N8582O0547O0379N8119
$$ plain form
50752 1417847 1389792 1364962 1343264 1324156 1307854 1295165 1286597 1282261 1282132 1285856 1292850 1303120
50740 1303120 1317504 1336656 1360380 1388373 1420914 1458259 1500034 1545874 1596099 1651149 1710977
50729 1710977 1775547 1845314 1920512 2000477 2084221 2171149 2260522 2350790 2440174 2527652 2612888
50718 2612888 2695484 2774475 2847829 2912068 2963136 2998302 3016772 3018438 3003324 2973021 2931520
50707 2931520 2883540 2832822 2782804 2737720 2701228 2674308 2655876 2645276 2642881 2648318 2659399 2673039
50695 2673039 2686304 2696307 2699894 2693897 2675561 2642959 2595612 2534778 2462887 2382817 2297722 2210862
50683 2210862 2124886 2041647 1963115 1891823 1829659 1776820 1732812 1698031 1673394 1658843 1653356
50672 1653356 1656417 1668498 1690074 1720967 1760669 1808418 1862705 1921287 1981834 2042213 2100332
50661B100332N4059M8980M3407L7263L0770K5090K1379J9602J8760J7922J6616
50650B434180J4655J2032Q865N204J248k295m535n188m529k664M92M490Q468J2186
50636B482609J6168K0664K5102K8800L1464L2796L2469L0756K8544K6378K4158
50625B779908K2047K0997K1861K4130K5537K2745J3049l365k2644l9436n0110
50614B814719n3845n1552m4991l6563k8266k0569j3059o045l56M092P913J0422
50602B581900R862N730o19q001j6502k6119l5959m5422n4666o3241o9659p3137
50590B204167p4483p4599p3496p1475o9647o8324o6323o2872n8837n4977n0598
50579A478536m5233m0160l6561l3438k9159k4161k0109j7082j3634r351n422k544
$$ plain form
50661 2100332 2154391 2203371 2246778 2284041 2314811 2339901 2361280 2380882 2399642 2417564 2434180
50650 2434180 2448835 2460867 2469732 2474936 2476184 2473889 2469354 2464166 2459637 2456973 2457465 2461955 2470423 2482609
50636 2482609 2498777 2519441 2544543 2573343 2604807 2637603 2670072 2700828 2729372 2755750 2779908
50625 2779908 2801955 2822952 2844813 2868943 2894480 2917225 2930274 2926909 2904265 2864829 2814719
50614 2814719 2760874 2709322 2664331 2627768 2599502 2578933 2565874 2559829 2559473 2563565 2571478 2581900
50602 2581900 2591762 2597492 2596873 2588872 2572370 2546251 2510292 2464870 2410204 2346963 2277304 2204167
50590 2204167 2129684 2055085 1981589 1910114 1840467 1772143 1705820 1642948 1584111 1529134 1478536
50579 1478536 1433303 1393143 1356582 1323144 1293985 1269824 1249715 1232633 1218999 1209648 1204226 1201682
50567A201682L3K982N903Q315J0514J2931J5338J7259J8670K0025K1883K4582
50555A360117K7928L1233L4024L6600L9595M3131M6760N0078N2998N5434N7073
50544A834971N7477N6409N4148N1473M9093M7234M6057M6132M7905N0970N4689
50533B396558N9189O4631O9658P2082P1438O9649O8766O9439P1934P6992Q4588
50522C174924R3162J01215J08695J15665J20760J22353J20491J16325J10198J01549
50512D285337R0263P6672O0590M1601K0394j266k2004m1621o0448p8467r4923
50501D276128j08366j17337j21446j21321j17297j08884r6063q0161o2644m3812
50491C298797k3649l245J5670L2023M5081N3371N5092M9524L7181J8975l836k9230
$$ plain form
50567 1201682 1201715 1204697 1210600 1218915 1229429 1242360 1257698 1274957 1293627 1313652 1335535 1360117
50555 1360117 1388045 1419278 1453302 1489902 1529497 1572628 1619388 1669466 1722464 1777898 1834971
50544 1834971 1892448 1948857 2003005 2054478 2103571 2150805 2196862 2242994 2290899 2341869 2396558
50533 2396558 2455747 2520378 2590036 2662118 2733556 2803205 2871971 2941410 3013344 3090336 3174924
50522 3174924 3268086 3369301 3477996 3593661 3714421 3836774 3957265 4073590 4183788 4285337
50512 4285337 4375600 4452272 4512862 4554463 4574857 4573591 4551587 4509966 4449518 4371051 4276128
50501 4276128 4167762 4050425 3928979 3807658 3690361 3581477 3485414 3405253 3342609 3298797
50491 3298797 3275148 3271903 3287573 3319596 3364677 3418048 3473140 3522664 3559845 3578820 3574984 3545754
50479C545754n4924p9207j00598j17351j28425j34571j37257j36776j32535j25123
50469B398987j16660j08892j02002r5521q9411q3780p8312p2550o6367n9904n3302
50458A472286m6711m0318l4352k9145k4922k1345j7638j3441r200n444k121R26
50446A228575L512N669Q063J1254J5012J9021K3608K9006L4321L7970L8747L5942
50434A490700K9260J9731J0058K825j445l614l967k233R73M240O996R657J2192
50421A575373J3892J4816J6067J8178K0385K2115K4100K7251L1260L5125L8562
50410A837124M2073M6088N0662N5780O1258O6298O9645P0506O9256O7141O5184
50399B501015O3247O0321N5653M9473M2452L4879K6527J6962N576q121k3619l8990
$$ plain form
50479 3545754 3490830 3411623 3311025 3193674 3065249 2930678 2793421 2656645 2524110 2398987
50469 2398987 2282327 2173435 2071433 1975912 1886501 1802721 1724409 1651859 1585492 1525588 1472286
50458 1472286 1425575 1385257 1350905 1321760 1296838 1275493 1257855 1244414 1235214 1229770 1227649 1228575
50446 1228575 1232087 1237756 1245819 1257073 1272085 1291106 1314714 1343720 1378041 1416011 1454758 1490700
50434 1490700 1519960 1539691 1549749 1552574 1551129 1547515 1543548 1541315 1542288 1546528 1553524 1563181 1575373
50421 1575373 1589265 1604081 1620148 1638326 1658711 1680826 1704926 1732177 1763437 1798562 1837124
50410 1837124 1879197 1925285 1975947 2031727 2092985 2159283 2228928 2299434 2368690 2435831 2501015
50399 2501015 2564262 2624583 2680236 2729709 2772161 2807040 2833567 2850529 2856105 2847984 2824365 2785375
50387B785375n2118o2347p0438p6937q1170q2030p9280p3834o6910n9131n0413
50376B030767m0610l0139j9711r686r6Q622J5447J9503K0538J8514J3378N464
50364B031991m352j5182k6350l6827m5220n0796n3966n5388n5156n3205m9859
50353A585690m5536m0560l5610l1528k8257k4988k2007k1254k3951k8620l2621
50342A250758l4881l5841l5536l3338k9428k4981k0841j7101j3918j1608r934
50331I83351q307o744n682m907l635j757l6J061J919K986M173N138N650N630N413
50316I84253N806P290R267J0764J1620J2369J3234J4036J4819J5820J6963J8128
50304A134369J9641K1746K3997K5912K7712K9518L0591L0694L1453L4796M0648
$$ plain form
50387 2785375 2733257 2670910 2600472 2523535 2442365 2360335 2281055 2207221 2140311 2081180 2030767
50376 2030767 1990157 1960018 1940307 1930621 1930525 1939147 1954594 1974097 1994635 2013149 2026527 2031991
50364 2031991 2027639 2012457 1986107 1949280 1904060 1853264 1799298 1743910 1688754 1635549 1585690
50353 1585690 1540154 1499594 1463984 1432456 1404199 1379211 1357204 1335950 1311999 1283379 1250758
50342 1250758 1215877 1180036 1144500 1111162 1081734 1056753 1035912 1018811 1004893 993285 983351
50331 983351 975044 968300 962618 957711 954076 952319 952283 953344 955263 958249 962422 967560 973210 978840 984253
50316 984253 990059 997349 1006616 1017380 1029000 1041369 1054603 1068639 1083458 1099278 1116241 1134369
50304 1134369 1154010 1175756 1199753 1225665 1253377 1282895 1313486 1344180 1375633 1410429 1451077
50293A451077M8154N8468P3058Q8162R3857Q1477N1615J3632k1794m8553o5206
50282A823947p2567p2309o6665n7943m8065l8586l0683k4723j9957j5075r380
50271A367994l292K366P329J1816J5773J8882K1472K4557K8666L3328L8208M3998
50259A611097N1447O0010O8381P5849Q2219Q6718Q8018Q5372P9105P0279O0500
50248B418995N1690M5099M0605L7478L5283L3202K9081K0592P270r466k7944m6770
50236B635115o4003p7473q6209r0556r0819q6917p9600p0715o1896n3865m7330
50225A825732m3420m2637m4115m6298m7873m7947m6256m3449m0540l7821l4909
50214A350467l1776k8904k6427k4101k2102k0838j9864j8138j5673j3808j3386
$$ plain form
50293 1451077 1499231 1557699 1630757 1718919 1812776 1894253 1945868 1959500 1937706 1889153 1823947
50282 1823947 1751380 1679071 1612406 1554463 1506398 1467812 1437129 1412406 1392449 1377374 1367994
50271 1367994 1364702 1367068 1374397 1386213 1401986 1420868 1442340 1466897 1495563 1528891 1567099 1611097
50259 1611097 1662544 1722554 1790935 1866784 1949003 2035721 2123739 2209111 2288216 2358495 2418995
50248 2418995 2470685 2515784 2556389 2593867 2629150 2662352 2691433 2712025 2719295 2709829 2681885 2635115
50236 2635115 2571112 2493639 2407430 2316874 2226055 2139138 2059538 1988823 1926927 1873062 1825732
50225 1825732 1782312 1739675 1695560 1649262 1601389 1553442 1507186 1463737 1423197 1385376 1350467
50214 1350467 1318691 1289787 1263360 1239259 1217157 1196319 1176455 1158317 1142644 1128836 1115450
50203A115450j3686j3635j3165j2747j2379j1719j0726r614q542p693p175o734
50191I87635n975m984m161l499k732k022j712j423m92P19J120O46N27J379K275
50176I67301K311J914J932K291K466K513K848L519M275N017N716O272O827P717
50162A022919Q902R992J0897J1858J2767J3296J3743J4859J6701J8737K1215K5158
50150A201044L0683L6633M2443M8930N6552O4302P1513P9546R0253J03553J17768
50139A943220J31598J44216J53934J58445J56694J49663J39335J27847J17508
50130C222460J10408J07277J06897J06655J03280R3431P4797M7366J3670k2442
50120C963799n7481q9106j15983j37352j52970j63212j68789j70093j67145j60349
$$ plain form
50203 1115450 1101764 1088129 1074964 1062217 1049838 1038119 1027393 1017779 1009237 1001544 994369 987635
50191 987635 981660 976676 972515 969016 966284 964262 962550 961127 960635 961354 962474 963120 963647 965026 967301
50176 967301 969612 971526 973458 975749 978215 980728 983576 987095 991370 996387 1002103 1008375 1015202 1022919
50162 1022919 1031821 1041813 1052710 1064568 1077335 1090631 1104374 1119233 1135934 1154671 1175886 1201044
50150 1201044 1231727 1268360 1310803 1359733 1416285 1480587 1552100 1631646 1721899 1825452 1943220
50139 1943220 2074818 2219034 2372968 2531413 2688107 2837770 2977105 3104952 3222460
50130 3222460 3332868 3440145 3547042 3653697 3756977 3850408 3925205 3972571 3986241 3963799
50120 3963799 3906318 3817212 3701229 3563877 3410907 3247695 3078906 2908813 2741668 2581319
50110B581319j50850j39671j27102j13554j00371q8748p8370o8433n9646n3550
50100A601024m9769m5805m0285l4808l1561l0430k9679k8444k7103k5803k4064
50089A233273k1756j9450j7667j6351j5113j3633j1941j0444r426q494p058n362
50077A076578m257l782k989j445R4J080K133L895N860P268Q278R294R911R602
50063A121520Q864Q545Q411P525N784M086L031K370J708R69P1j164k593l730m194
50048A161203m038l653l477l534l184j737N97K938M984P344J0259J2971J4834
50035A195507J6341J8313K0728K3113K5563K8624L2542L7163M2223M7306N2000
50024A539423N6624O2144O8956P6391Q3848R1415R8649J03790J05295J03298R8375
$$ plain form
50110 2581319 2430469 2290798 2163696 2050142 1949771 1861023 1782653 1714220 1654574 1601024
50100 1601024 1551255 1505450 1465165 1430357 1398796 1368366 1338687 1310243 1283140 1257337 1233273
50089 1233273 1211517 1192067 1174400 1158049 1142936 1129303 1117362 1106918 1097492 1088998 1081940 1076578
50077 1076578 1072321 1068539 1065550 1064105 1064199 1065279 1067412 1071307 1077167 1084435 1092713 1102007 1111918 1121520
50063 1121520 1130384 1138929 1147340 1154865 1160649 1164735 1167766 1170136 1171844 1172813 1172884 1171720 1169127 1165397 1161203
50048 1161203 1157165 1153512 1150035 1146501 1143317 1141580 1142177 1145115 1150099 1157443 1167702 1180673 1195507
50035 1195507 1211848 1230161 1250889 1274002 1299565 1328189 1360731 1397894 1440117 1487423 1539423
50024 1539423 1596047 1658191 1727147 1803538 1887386 1978801 2077450 2181240 2286535 2389833 2488208
50013B488208Q9756P6541O0418M5468L4981K9371K7078K5900K3028J5293P36k0074
50001B896704m4570o9636r2420j10485j22141j26929j25735j20348j12673j04076
49991A867691r5259q6556p8046o9489o0747n2452m5887m1865m0032l9317l8684
49980A219357l7348l4975l1923k8858k5894k2759j9811j7940j7117j6038j3812
49969I52882j1066q772o964n531n195o432q129q704q184p906q327q423p302n323
49955H46624l367j701K5K151M536O442P129O721O160N958N572M397K783J378J08
$$ plain form
50013 2488208 2577964 2654505 2714923 2760391 2795372 2824743 2851821 2877721 2900749 2916042 2916778 2896704
50001 2896704 2852134 2782498 2690078 2579593 2457452 2330523 2204788 2084440 1971767 1867691
49991 1867691 1772432 1685876 1607830 1538341 1477594 1425142 1379255 1337390 1297358 1258041 1219357
49980 1219357 1182009 1147034 1115111 1086253 1060359 1037600 1017789 999849 982732 966694 952882
49969 952882 941816 933044 926080 920549 915354 908922 900793 892089 883905 875999 867672 859249 851947 846624
49955 846624 843257 841556 841581 843732 848268 854710 861839 868560 874720 880678 886250 890647 893430 894808 894916
$$ [...]