##TITLE=AC1697_ROEFFECT0026_8637774_ixY62Nhbj3
##JCAMPDX= 6.0         $$ Bruker NMR JCAMP-DX V2.0
##DATA TYPE= NMR SPECTRUM
##DATA CLASS= NTUPLES
##ORIGIN= BRUKER
##OWNER= Administrator
$$ 1.72 TOPSPIN		Version 2.1
$$ 2014-05-23 01:25:31.519 -0700  Administrator@X
$$ Compression mode = diff/dup
##.OBSERVE FREQUENCY= 400.02188249412
##.OBSERVE NUCLEUS= ^1H
##.ACQUISITION MODE= SIMULTANEOUS (DQD)
##.ACQUISITION SCHEME= undefined
##.AVERAGES= 8
##.DIGITISER RES= 22
##SPECTROMETER/DATA SYSTEM= spect
##.PULSE SEQUENCE= zg30
##.SOLVENT NAME= COFFEE_meoh
##.SHIFT REFERENCE= INTERNAL, COFFEE_meoh, 1, 14.98509
##AUDIT TRAIL= $$ (NUMBER, WHEN, WHO, WHERE, PROCESS, VERSION, WHAT)
$$ ##TITLE= Audit trail, TOPSPIN		Version 2.1
$$ ##JCAMPDX= 5.01
$$ ##ORIGIN= Bruker BioSpin GmbH
$$ ##OWNER= Administrator
$$ $$ E:\/data/COFFEE/nmr/AC1697_ROEFFECT0026_8637774_ixY62Nhbj3/10/pdata/1/auditp.txt
$$ ##AUDIT TRAIL=  $$ (NUMBER, WHEN, WHO, WHERE, PROCESS, VERSION, WHAT)
(   1,<2014-05-23 01:25:24.879 -0700>,<Administrator>,<X>,<go>,<TOPSPIN 2.1>,
      <created by zg
	started at 2014-05-23 01:24:17.566 -0700,
	POWCHK enabled, PULCHK disabled,
       configuration hash MD5:
       C8 4E 4E 5D D3 5C D8 9E 9F 52 82 E0 59 8A DE 15
       data hash MD5: 64K
       45 A6 5B B1 AB FF F5 3B 85 85 76 40 75 CC 63 C7>)
(   2,<2014-05-23 01:25:27.863 -0700>,<Administrator>,<X>,<proc1d>,<TOPSPIN 2.1>,
      <Start of raw data processing
       efp LB = 0 FT_mod = 6 PKNL = 1 PHC0 = 0 PHC1 = 0 SI = 32K 
       data hash MD5: 32K
       3C 46 58 34 2D 3E 1C 9E BA 59 4E 82 00 5A 29 F0>)
(   3,<2014-05-23 01:25:28.176 -0700>,<Administrator>,<X>,<proc1d>,<TOPSPIN 2.1>,
      <pk PHC0 = 92.31262 PHC1 = 0 
       data hash MD5: 32K
       95 19 6D 4E F6 33 64 F7 FC A5 EA 36 A1 D3 73 57>)
(   4,<2014-05-23 01:25:28.285 -0700>,<Administrator>,<X>,<proc1d>,<TOPSPIN 2.1>,
      <abs ABSG = 1 
       data hash MD5: 32K
       7F F4 21 FA 11 17 9D 43 06 86 39 9A B1 EC BC B7>)
(   5,<2014-05-23 01:25:28.348 -0700>,<Administrator>,<X>,<proc1d>,<TOPSPIN 2.1>,
      <abs ABSG = 2 
       data hash MD5: 32K
       85 2B E2 CC 56 EB 01 00 58 2F 69 33 B9 69 D6 84>)
(   6,<2014-05-23 01:25:28.410 -0700>,<Administrator>,<X>,<proc1d>,<TOPSPIN 2.1>,
      <abs ABSG = 3 
       data hash MD5: 32K
       E6 E9 75 9E 60 4E DB 4F 2B 30 36 E6 8E 4A 3D EF>)
(   7,<2014-05-23 01:25:28.473 -0700>,<Administrator>,<X>,<proc1d>,<TOPSPIN 2.1>,
      <abs ABSG = 4 
       data hash MD5: 32K
       86 F1 57 FC 42 79 75 CE F7 37 5B 08 57 81 5A DE>)
(   8,<2014-05-23 01:25:28.519 -0700>,<Administrator>,<X>,<proc1d>,<TOPSPIN 2.1>,
      <abs ABSG = 5 
       data hash MD5: 32K
       E2 3B 5E EE 60 27 AE 97 7C 05 33 50 A8 64 84 67>)
$$ ##END=
$$ 
$$ $$ hash MD5
$$ $$ 63 8D 20 A8 FA 1D 71 EA 1D 60 28 BD 9E 82 0C 65
##$RELAX= 
##$RELAX= 
##$RELAX= 
##$RELAX= 
##$RELAX= 
##$RELAX= 
##$RELAX= 
$$ Bruker specific parameters
$$ --------------------------
##$DU= <E:\>
##$EXPNO= 10
$$ [...]
150 150 150 150 150 150 150 150
##$TP07= 0
##$TPNAME0= <>
##$TPNAME1= <>
##$TPNAME2= <>
##$TPNAME3= <>
##$TPNAME4= <>
##$TPNAME5= <>
##$TPNAME6= <>
##$TPNAME7= <>
##$TPOAL= (0..7)
0.5 0.5 0.5 0.5 0.5 0.5 0.5 0.5
##$TPOFFS= (0..7)
0 0 0 0 0 0 0 0
##$TUNHIN= 0
##$TUNHOUT= 0
##$TUNXOUT= 0
##$USERA1= <user>
##$USERA2= <user>
##$USERA3= <user>
##$USERA4= <user>
##$USERA5= <user>
##$V9= 5
##$VALIST= <valist>
##$VCLIST= <CCCCCCCCCCCCCCC>
##$VD= 0
##$VDLIST= <DDDDDDDDDDDDDDD>
##$VPLIST= <PPPPPPPPPPPPPPP>
##$VTLIST= <TTTTTTTTTTTTTTT>
##$WBST= 2048
##$WBSW= 25
##$XGAIN= (0..3)
0 0 0 0
##$XL= 0
##$YL= 0
##$YMAX_a= 649222
##$YMIN_a= -552397
##$ZGOPTNS= <>
##$ZL1= 120
##$ZL2= 120
##$ZL3= 120
##$ZL4= 120
##$ABSF1= 14.98509
##$ABSF2= -5.573092
##$ABSG= 5
##$ABSL= 3
##$ALPHA= 0
##$AQORDER= 0
##$ASSFAC= 0
##$ASSFACI= 0
##$ASSFACX= 0
##$ASSWID= 0
##$AUNMP= <proc_prof1d_extract_pilot.lims>
##$AXLEFT= 0
##$AXNAME= <>
##$AXNUC= <1H>
##$AXRIGHT= 0
##$AXTYPE= 0
##$AXUNIT= <>
##$AZFE= 0.1
##$AZFW= 0.1
##$BCFW= 0
##$BC_mod= 0
##$BYTORDP= 0
##$COROFFS= 0
##$CY= 15
##$DATMOD= 1
##$DC= 0
##$DFILT= <>
##$DTYPP= 0
##$F1P= 0
##$F2P= 0
##$FCOR= 0.5
##$FTSIZE= 32768
##$FT_mod= 6
##$GAMMA= 0
##$GB= 0
##$INTBC= 1
##$INTSCL= 1
##$ISEN= 128
##$LB= 0
##$LEV0= 0
##$LPBIN= 0
##$MAXI= 10000
##$MC2= 0
##$MEAN= 0
##$ME_mod= 0
##$MI= 0
##$NCOEF= 0
##$NC_proc= -8
##$NLEV= 6
##$NOISF1= 0
##$NOISF2= 0
##$NSP= 0
##$NTH_PI= 0
##$NZP= 0
##$OFFSET= 14.98509
##$PC= 1
##$PHC0= 92.31262
##$PHC1= 0
##$PH_mod= 1
##$PKNL= yes
##$PPARMOD= 0
##$PPDIAG= 0
##$PPIPTYP= 0
##$PPMPNUM= 2147483647
##$PPRESOL= 1
##$PSCAL= 4
##$PSIGN= 0
##$PYNMP= <proc.py>
##$REVERSE= no
##$SF= 400.02
##$SI= 32768
##$SIGF1= 0
##$SIGF2= 0
##$SINO= 400
##$SIOLD= 32768
##$SPECTYP= <>
##$SREGLST= <1H.CDCl3>
##$SSB= 0
##$STSI= 32768
##$STSR= 0
##$SW_p= 8223.68421052631
##$SYMM= 0
##$S_DEV= 0
##$TDeff= 65536
##$TDoff= 0
##$TI= <>
##$TILT= no
##$TM1= 0
##$TM2= 0
##$TOPLEV= 0
##$USERP1= <user>
##$USERP2= <user>
##$USERP3= <user>
##$USERP4= <user>
##$USERP5= <user>
##$WDW= 1
##$XDIM= 32768
##$YMAX_p= 468612086
##$YMIN_p= -837014
##$CURPLOT= <Network HP LaserJet P1505>
##$CURPRIN= <$Network HP LaserJet P1505>
##$DFORMAT= <normdp>
##$LAYOUT= <+/1D_H.xwp>
##$LFORMAT= <normlp>
##$PFORMAT= <normpl>
##$SURQMSG= 1
$$ End of Bruker specific parameters
$$ ---------------------------------
##NTUPLES= NMR SPECTRUM
##VAR_NAME=  FREQUENCY,     SPECTRUM/REAL,   SPECTRUM/IMAG
##SYMBOL=    X,             R,               I
##VAR_TYPE=  INDEPENDENT,   DEPENDENT,       DEPENDENT
##VAR_FORM=  AFFN,          ASDF,            ASDF
##VAR_DIM=   32768,         32768,           32768
##UNITS=     HZ,            ARBITRARY UNITS, ARBITRARY UNITS
##FACTOR=    0.250966925370066, 1,           1
##FIRST=     8223.43324360094, 70467,        70208
##LAST=      0,             -40783,          -226744
##MIN=       0,             -837014,         0
##MAX=       8223.43324360094, 468612086,    0
$$ Real data points
##PAGE= N=1
##DATA TABLE= (X++(R..R)), XYDATA
$$ [...]
19546F1145h3564E9888e1319O983p335j54992I8560b58781L4918Q1058m3449A1315
19533c32765g7669n2400H6939a08473m9035N305N2552B05514a59403q1056R8594
19522a41865J8717e0006B48568i5537F4322c51138B34061a35879j15985E1089
19511C16179j25816a9883L562o2097j04885C22532d00203J29790l4790a18642
19500A14673m0767c41914c4312B35572I4298D5428N8983b12981p5629A56424b95815
19488c23520R2494a12143A09590D447J05478a10325j75086C95022c05626A29310
19477b01348G4394d1968q803A0670a02802M635B33415D1525h6799B3866a84073
19465b4386m4268l3896j73522g2237k22885D3578j1005b30310o3053J41853j23763
$$ y = [61145, -83564, 59888, -51319, -44336, -51671, -206663, 98560, -258781, -223863, -142805, -186254, 11315, -332765, -77669, -130069, 86939, -108473, -157508, -152203, -99651, 205514, -159403, -240459, -141865, -123148, -50006, 248568, -95537, 64322, -351138, 234061, -135879, -251864, 51089, 316179, 190363, -19883, -16321, -78418, -183303, 322532, -400203, -270413, -305203, -118642, 114673, 73906, -341914, -34312, 235572, 94298, 45428, 104411, -212981, -288610, 156424, -295815, -323520, -231026, -112143, 109590, 4447, 109925, -110325, -285411, 395022, -305626, 129310, -201348, 74394, -41968, -50771, 10670, -102802, -98167, 233415, 41525, -86799, 23866, -184073, -24386, -68654, -102550, -276072, -72237, -295122, 43578, 32573, -230310, -293363, -151510, -275273]
19454b75273A01600a08936A85550H2727h3223k40749F381R9815f2702k38417a24414
19442A9028p376b13341b8642B5588e1941J3815k16463j76038a86132a136G02a21492
19429C3180a85827A2218b6862j5298R536j32496L8477j58422A93212q3776D6360
19417f9237r0883A69943R40a28545r289D08339H4237c6895k27579A9627a71039
19405a06251m2302N1629l1309p8807A1499K0217J88516b80404J02897L8305a5501
19393I060K34742b09811M8560a204j6645n50293b71407R7064e2623j01799B73275
19381a46122E0898L0053c09368J33569Q5641L6366H8336d2974A00056a43204C0623
19369D6980G445f2920k60698j79251Q7489J69179A56105m2684f8522k39820q9511
$$ y = [-275273, 101600, -108936, 185550, 82727, -83223, -323972, 6381, 106196, -62702, -301119, -124414, 19028, 11652, -213341, -28642, 25588, -51941, -38126, -254589, -430627, -186132, -1136, 702, -121492, 33180, -185827, 12218, -26862, -42160, -32624, -165120, -126643, -285065, 193212, 109436, 46360, -69237, -160120, 169943, 170883, -128545, -137834, 408339, 84237, -36895, -264474, 19627, -171039, -106251, -148553, -96924, -128233, -207040, 11499, 31716, 220232, -280404, -177507, -139202, -15501, 9060, 243802, -209811, -161251, -1204, -17849, -568142, -271407, -174343, -52623, -154422, 273275, -146122, 50898, 80951, -309368, -175799, -90158, -53792, 88336, -42974, 100056, -143204, 30623, 46980, 7445, -62920, -323618, -502869, -415380, -246201, 156105, 113421, -68522, -308342, -397853]
19358c97853H1482a43141p99F766c8424j4774B30349I0664i5045o9497H217M47619
19346D55836F3388a41347o2472p046n7704a22513A91720n3656b17116d8000B34452
19334a65414G1680h229k23803a15182j19373F469i7231j50451K9103R3955H0742
19322a04939q7036k02520G4916b50480M1795A29457h6352L1192k84318H7215A5614
19310d85021d7307A13545i6937G9881j9319c18477a28329B76592b89798C4847
19299f9456H142c318j45849A34607a37694j9048A60636j6862a75800B30917e8223
19287a82608m7446c569C23270A22701R6584b24293G9485b60655b3901f639j46473
19276a53112B11446i984j02687k48337J01722A68390f2243j23257L4561l02530
$$ y = [-397853, 81482, -143141, -143940, 6766, -38424, -53198, 230349, 90664, -95045, -164542, 8217, 455836, 63388, -141347, -203819, -210865, -268569, -122513, 191720, 138064, -217116, -48000, 234452, -165414, 71680, -8229, -232032, -115182, -234555, 6469, -97231, -247682, -218579, -124624, 80742, -104939, -191975, -394495, 74916, -250480, -208685, 129457, -86352, -55160, -339478, 87215, 15614, -485021, -47307, 113545, -96937, 79881, 60562, -318477, -128329, 276592, -289798, 34847, -69456, 8142, -3318, -149167, 134607, -137694, -156742, 160636, 143774, -175800, 230917, -58223, -182608, -230054, -3569, 323270, 122701, 219285, -224293, 79485, -260655, -23901, -6639, -153112, 211446, -9984, -112671, -361008, -259286, 168390, -62243, -185500, -150939, -453469]
19266d53469A45594c19630o4673B08416a18036q620l5073A57082C609J7402a54794
19254B60297b48198G7339f5243j7389j08261G0518a60725g3322k18231A45532
19243G9229C0931c3952D9804A5453J18575a95715k42813a39624A7287h7410k9353
19232a16763l35929a65962A1122b976j41608A73393b39730h6752K287m1338L2769
19221i3034A3768J20068g652k24858B21031a39611J6181A47861g4566B04142b49976
19209a71563g1541c1392l5581A28807m0880L4922a19164g041j54290d5008C55278
19197G13b12820c5082j33627B9101Q4249L6837J14715i0792J6322m5874k54262
19186c74606a26639O531j53962O8173i3939j72282o2064e4646j26383B28062O958
$$ y = [-453469, 145594, -319630, -384303, 208416, -118036, -126656, -161729, 157082, 3609, 21011, -154794, 260297, -248198, 77339, -65243, -82632, -190893, 70518, -160725, -73322, -291553, 145532, 79229, 30931, -33952, 49804, 15453, 134028, -195715, -438528, -139624, 17287, -87410, -116763, -452692, -165962, 11122, -2976, -144584, 173393, -239730, -86752, -84465, -125803, -93034, 13768, 133836, -7652, -232510, 221031, -139611, -123430, 147861, -74566, 204142, -249976, -171563, -71541, -31392, -66973, 128807, 87927, 122849, -119164, -7041, -161331, -45008, 355278, 713, -212820, -35082, -168709, 29101, 113350, 150187, 264902, -90792, -74470, -120344, -374606, -126639, -120108, -274070, -205897, -93939, -266221, -328285, -54646, -181029, 228062, 235020]
19175B35020b69763A81969a03024k0684A73298d159j308j79264A25676c00244
19164h4436G5369a09079A66187C7163c29367e1310o492E538f8803k6838k02817
19153b98458B00284a67489b3503j5163k73688b8925E7846b5150p7583A25778a58832
19141e3864A67422c78634P7979a06053A73184a31316p6765H9829a25491A4829
19130B76844N6619j03628a88591D146e8851k67944A01226d16584R4817J55466
19120a66301g2661A42384a94755M8074A52799d9688o5639j21319A44116k6576
19110A17540k3937f1824j6000k58614J24389p7705L6455J12106M4778A22006a6132
19098i4394d2191k95698a49245j25666a00148q5413A36446n5917i4675F0254b05831
$$ y = [235020, -269763, 181969, -103024, -123708, 173298, -4159, -5467, -184731, 125676, -300244, -84436, 75369, -109079, 166187, 37163, -329367, -51310, -57802, 5538, -68803, -95641, -298458, 200284, -167489, -23503, -38666, -312354, -28925, 57846, -25150, -102733, 125778, -158832, -53864, 167422, -378634, -300655, -106053, 173184, -131316, -208081, 89829, -125491, 14829, 276844, 333463, 229835, -188591, 4146, -58851, -326795, 101226, -416584, -321767, -166301, -72661, 142384, -194755, -146681, 152799, -49688, -115327, -236646, 144116, 117540, 93603, -61824, -77824, -336438, -212049, -289754, -253299, -141193, -96415, 122006, -16132, -94394, -42191, -337889, -149245, -274911, -100148, -185561, 136446, 80529, -94675, 60254, -205831]
19086c00999f5127j0107L7312j15816N5e2277A55735R8819c9132L543r7153m777
19074a37519K8586j80683q938A36692a13163D9723a53897C2889b51619G5949g3770
19062b05761H0402a07061j857A27024m5420J013a48220f4757k0081k93646a82082
19050A51326b71715B39057A14195g5844k4510j22534L4801g6568j1581E4080L51835
19039D05915j26446c60043a68624B94315n0872M2778j18399G1892c9880j45794
19029a85674D7881e2800A97171b6933A53796K93165H1780P278A4342K66317j21462
19018A59197l6438M6964l4948d5565A34212a91908B4751a60779D0842b0034k39025
19007b59059A35562a09448j02897n4338j75087A40250b38885N9892j382m7498
$$ y = [-300999, -65127, -75234, -37922, -153738, -153683, -52277, 155735, 254554, -39132, -35589, -132742, -137519, -108933, -289616, -298554, 136692, -113163, 49723, -153897, 32889, -251619, 75949, -73770, -205761, 80402, -107061, -108918, 127024, 81604, 82617, -148220, -64757, -84838, -378484, -182082, 151326, -271715, 239057, 114195, -75844, -100354, -222888, -188087, -76568, -88149, 54080, 405915, 279469, -360043, -168624, 294315, 243443, 286221, 167822, 71892, -39880, -185674, 47881, -52800, 197171, -26933, 153796, 446961, 81780, 89058, 14342, 280659, 159197, 122759, 169723, 134775, -45565, 134212, -191908, 24751, -160779, 40842, -20034, -259059, 135562, -109448, -212345, -266683, -441770, 140250, -238885, -178993, -180375, -227873]
18997b27873d5954l79280a94892A62979a32302j44443A6308i1584f620B19124
18986D8614k3122c9101A7250K41967a31054f1307j03889D379P4833b53458B0394
18974D5693b41626Q8587k47987a53386D7683Q1058a63382L1239p298q8337G7928
18962h5002j85076A48077a86456A34235K72644d1594A8353J58521g5946l23474
18952c99420f9657J6200j90024D455a31411B9481a85599g0977A07719b71857C09176
18940H5261e6594F8711j0435c2321k01166l196j26871a09570A23286g6597k306
18929g8903q0381a2782B33102b40500B34111M6441O9876h0969A80029Q051c6030
18917b18856A12254b33797A24052g0061C6027j3508b07663f7734j71476B86444
$$ y = [-227873, -45954, -425234, -194892, 162979, -132302, -276745, 16308, -91584, -6620, 219124, 48614, 25492, -39101, 17250, 259217, -131054, -61307, -165196, 4379, 79212, -253458, 20394, 45693, -241626, -153039, -401026, -153386, 47683, 128741, -163382, -132143, -139441, -227778, 77928, -85002, -270078, 148077, -186456, 134235, 406879, -41594, 18353, 176874, -75946, -399420, -69657, -53457, -243481, 4455, -131411, 29481, -185599, -70977, 107719, -271857, 309176, 85261, -56594, 68711, 58276, -32321, -233487, -236683, -363554, -109570, 123286, -76597, -78903, -159284, -12782, 233102, -240500, 234111, 280552, 350428, -80969, 180029, 188080, -36030, -218856, 112254, -233797, 124052, -70061, 36027, 22519, -207663, -67734, -239210, 286444]
18906b6964A03821J1905L32014d03992A43827a63331d5640B28826a61457c1331
18895e2597p5197r8151A24811d3052H7238k5360e4900E014h7775A4904g765j87263
18883a95028l23090d5261k07651J6503d4722F4740J1216L4689a24254C2603b12689
18871I7740l2913K61955C1753a92108R1406A19148D5817L24940b3843Q604j12244
18860a27483k81774g4881l3982j72708B72711a54273j48467C38460c14351C10002
18849A8466b2913A53295l0221c5349p2752B48407D279g8325j40340p5419f4748
18837C01266l5728o0430a89401i1882A05674B2267g751j76666J9359a7820k90557
18826c08377J43706A2875c39869a64633N5569j73498c4502D7890j4875K7465R8064
$$ y = [-26964, 103821, 115726, 447740, -403992, 143827, -163331, -45640, 228826, -161457, -31331, -52597, -127794, -225945, 124811, -43052, 87238, 61878, -54900, 5014, -87775, 14904, -7765, -195028, -518118, -45261, -252912, -236409, -44722, 64740, 75956, 110645, -124254, 32603, -212689, 97740, 64827, 326782, 31753, -192108, -100702, 119148, 45817, 370757, -23843, -15239, -127483, -409257, -74881, -108863, -281571, 272711, -154273, -302740, 338460, -314351, 310002, 18466, -22913, 153295, 123074, -35349, -108101, 248407, 4279, -78325, -218665, -294084, -64748, 301266, 265538, 205108, -189401, -91882, 105674, 22267, -7751, -184417, -165058, -17820, -308377, -164671, 12875, -339869, -164633, -109064, -282562, -34502, 47890, 33015, 60480, 158544]
18815A58544a56087A04153a0917E2900J5904a9566j78H3149f2768A59422K16745
18804C76167b53862g3413j15541n8213j34032g3864j45172e1162q0977j3856L7261
18793a08734j36682A53551g6380B78346b61236A12958e6104a7025k14169A06063
18782b8026C14776B2811M4030i8906q8568H8270R0710l7420B7595b01165A7744
18770B6641J24731p1335i5675n6108A2264b13409O7160e6028b1592l97783a41121
18758A24429L9592i5622k52203I7528N0451a77423j1545b2720A8062c03253f7754
18746a66325c635F2747h6421j17901r963P5671r3734D5459b74279i1145K3320
18735f7825A83379a29746j9502j03335c7782k7334m6278o71j48713J18396N3912
$$ y = [158544, -156087, 104153, -10917, 52900, 68804, -19566, -19744, 83149, -62768, 159422, 376167, -253862, -73413, -188954, -247167, -381199, -73864, -219036, -51162, -132139, -145995, -108734, -245416, 153551, -76380, 278346, -261236, 112958, -56104, -17025, -231194, 106063, -28026, 314776, 22811, 66841, -98906, -187474, 88270, 178980, 141560, 27595, -201165, 17744, 26641, 151372, 80037, -95675, -151783, 12264, -213409, -146249, -56028, -21592, -419375, -141121, 124429, 164021, -95622, -347825, 97528, 147979, -177423, -188968, -22720, 18062, -303253, -67754, -166325, -3635, 62747, -86421, -204322, -214285, -138614, -232348, 45459, -274279, -91145, -67825, 183379, -129746, -149248, -252583, -37782, -65116, -111394, -112065, -260778, -142382, -88470]
18724h8470j6932B80133a15474J839I3179a42800A29573h9796A11704a00299j51489
18713b51788A31013B0241a36494m9233m150f5536A15837C521c00046j24664a85201
18701A14789b27980A15205L2461a60705o5638A67912F6155R820c83175b5570B8776
18689a03693k08228B45890a08546r0997m4667B83471a63899G8666a9347k02669
18679b22016k4585N7446M0281k92441J71036f6437i37k68891A26964c28629i1060
18667A414J42231K7020p8505b06001G0303e6166j10883A09474a50305B05057c33491
18655B49104a32894l7759H4606k2655k3568a46858j77539A30907a78861G5466
18644a56780D83022i2229j56769B46482n9836B8474a43889k04844E832b3004j07170
$$ y = [-88470, -105402, 280133, -115474, -113635, 93179, -142800, 129573, -89796, 111704, -100299, -251788, 131013, 20241, -136494, -185727, -189877, -65536, 115837, 3521, -300046, -424710, -185201, 114789, -227980, 115205, 147666, -160705, -226343, 167912, 66155, 75975, -383175, -25570, 28776, -103693, -311921, 245890, -108546, -199543, -244210, 283471, -163899, 78666, -19347, -222016, -246601, -189155, -148874, -441315, -270279, -66437, -937, -269828, 126964, -328629, -91060, 1414, 143645, 170665, 92160, -206001, 70303, -56166, -167049, 109474, -150305, 205057, -333491, 249104, -132894, -170653, 84606, 61951, 38383, -146858, -324397, 130907, -178861, 75466, -156780, 483022, -92229, -248998, 246482, 186646, 28474, -143889, -348733, 5832, -23004, -130174]
18633a30174A6354O1577A7419a20587K7707m44045c2204j84333g2431j7923B99104
18621D1969c9064D2929L50117H3227i9545I000J29390a51186p2229e0542B90609
18609c52372A1280h7756j20656g8418A2076b83325M7201H4900a23391A71741f0232
18597a94181C43096C8497e1959j55850g6101I927J60392f9462G8549c6872j1435
18586d8307l8556b730k50148R5237L0660r6060Q3884E2367j147i8072B74265f7450
18573a07776o7184j01255g1810E7734a89207A82682h7790j6652m842k51001J39151
18562b21134f9183b6667E139K433i9647K3316A961c03785a00599j61169F4458
18550D0186f4996r5343L8739A05853R6220K0631c61906A81454N5436p4679J15726
$$ y = [-130174, 16354, 77931, 17419, -120587, -92880, -536925, -32204, -216537, -72431, -90354, 299104, 41969, -39064, 42929, 393046, 83227, -99545, 9000, 138390, -151186, -223415, -50542, 290609, -352372, 11280, -87756, -208412, -78418, 12076, -283325, -236124, 84900, -123391, 171741, -60232, -194181, 343096, 38497, -51959, -207809, -76101, 9927, 170319, -69462, 78549, -36872, -48307, -86863, -2730, -252878, -157641, -126981, -223041, -139157, 52367, 51220, -98072, 274265, -67450, -107776, -174960, -276215, -71810, 57734, -189207, 182682, -87790, -104442, -109284, -360285, -221134, -69183, -26667, 5139, 7572, -99647, -76331, 1961, -303785, -100599, -261768, 64458, 40186, -64996, -160339, -121600, 105853, 202073, 222704, -361906, 181454, 236890, 162211, 277937]
18539B77937I6629b84789N7511C9190Q0213N1193e5303J1791n1153l52056B6754
18527b04986q6658P2795a0586j43314K7629m0718A73959i3020A9233j678O1937
18516G9492h0861i236k6194j9298A83022o2010n3172N5694E2205e6350A03136
18504G5917i1908A9710K76665A3133J14668a2410o1299l0624b2461r7675A73021
18492a87286Q0476l9235C01342j39812b84671E3325c68473c4373m90445G7227
18481c93287G7424a52539C4976J84332c4310F3293a6324k42078J12964N1299B5494
18469b24734j24130g3745q6758l0104A66117Q600C3646a22936L610B41157h2987
18457I2562i4717A23141b86756P1187a541r7169l41972A39775i8454j8547A09329
$$ y = [277937, 96629, -284789, -227278, 39190, 119403, 170596, -55303, -43512, -94665, -446721, 26754, -204986, -291644, -218849, -10586, -153900, -126271, -166989, 173959, -93020, 19233, 17555, 79492, -80861, -9236, -35430, -54728, 183022, 121012, 67840, 123534, 52205, -56350, 103136, 75917, -91908, 19710, 296375, 13133, 127801, -12410, -73709, -104333, -22461, -120136, 173021, -187286, -106810, -146045, 301342, 161530, -284671, 53325, -368473, -34373, -524818, 77227, -393287, 77424, -152539, 34976, 219308, -34310, 63293, -16324, -258402, -145438, -94139, 25494, -224734, -348864, -73745, -160503, -190607, 166117, 174717, 33646, -122936, -119326, 241157, -82987, 92562, -94717, 123141, -286756, -215569, -1541, -98710, -440682, 139775, -98454, -117001, 109329]
18445A32988a45144j72606N4555H5643a23008d6828G7003c11500P6282C64511
18434B49605f7386H9134Q6321a59945A1124b51565f6025j05130g8216l00486g6325
18422A71955f6300K6198G192h8855A33157b74015A09642d7370j52135A15978a24944
18410a82296A4428L1825M1753a96217e2701r0869A97603F6586a56160A85395H472
18398D1326K76902F6803K26750J30330F7426a2320B20844a886j66845E0673O9052
18387A19725b44897r498A18294e0893j14078r4390P8699m0562A59648K26464h4861
18375h0114j78592G801f2396A9187J92479a759A54832b73317F882a92168A78976
18363A63234O6311m8249e5781A83514J47560j18834E4292c40231a5100A72778
$$ y = [132988, -145144, -317750, -263195, 85643, -123008, -46828, 77003, -311500, -235218, 364511, 249605, -67386, 89134, 175455, -159945, 11124, -251565, -66025, -171155, -78216, -378702, -76325, 171955, -66300, -40102, 7192, -88855, 133157, -274015, 109642, -47370, -199505, 115978, -124944, -182296, 14428, 46253, 88006, -196217, -52701, -143570, 197603, 66586, -156160, 185395, 8472, 41326, 318228, 66803, 293553, 423883, 67426, -12320, 220844, -1886, -168731, 50673, 119725, -244897, -254395, 118294, -50893, -164971, -259361, -180662, -221224, 159648, 386112, -84861, -80114, -258706, 7801, -62396, 19187, 211666, -1759, 154832, -273317, 6882, -192168, 178976, 163234, 229545, 181296, -55781, 183514, 331074, 212240, 54292, -340231, -15100, 172778]
18352b47529F7278c25544g9622j8071A8336a163j92746o923B32189a16131c0234
18340a08767k37630e9781k23614J11626N6073I1074A3986b79492a37443k1562
18330a59005A70944c1742H8612b71514b9611D8457A4331a54527j07167A76130
18319a11620L046A29869j8352a06405d2225C14639A56653b02911q8076F7740a87414
18307c24876A44564J220a52969d825j92500i2246p1378k77509B87188h6971c9008
18295b77853c0983j60944K0475A02086e2145C3139J88449b92323G8776A7325N6722
18284G4047J2704H562M0579b31456E8167O1269a5565B43224I1209b38458A0727
18272D6788a94809h7614A46875K17071j73421a0370p0424K7534j60481a9793j95873
$$ y = [-247529, 67278, -325544, -79622, -97693, 18336, -1163, -193909, -200832, 232189, -116131, -30234, -108767, -346397, -59781, -283395, -171769, -115696, 91074, 13986, -279492, -137443, -159005, 170944, -31742, 88612, -271514, -29611, 48457, 14331, -154527, -261694, 176130, -111620, -108574, 129869, 111517, -106405, -42225, 314639, 156653, -202911, -290987, 67740, -187414, -324876, 144564, 145784, -152969, -4825, -197325, -92246, -163624, -441133, 287188, -86971, -39008, -277853, -30983, -191927, -171452, 102086, -52145, 33139, 221588, -292323, 78776, 17325, 74047, 86751, 8562, 49141, -231456, 58167, 119436, -15565, 243224, 91209, -238458, 10727, 46788, -194809, -87614, 146875, 363946, 190525, -10370, -80794, -53260, -213741, -19793, -215666]
18261b15666n8978n1450h3173C48780N815g633A22981a15727B53907f5627n6454
18250a22081c5054j9882j68669L1378h1733J4070j15241B4344b46418d7324k51400
18239b98724d7345a5804a831j06961E9001c67149e5549b3075r6348A97725A9268
18227a11071B32279a74703I6639b65832a11963k39425g0149C9275Q4967B0271
18216A33132k961a19721A52909J99262A42843a59797r4635c3518j53878q7900
18206b75296G8685R0509b61916A82344f3074J7551F860b17903A95096f0388k56245
18195c16633A67615b70900o6679B1778a41274p8054A01900J52270c13600a24547
18184A40949b8950j66719Q0854l4562j62341C60526c83664A86880a97473a0561
$$ y = [-215666, -274644, -326094, -83173, 348780, 354595, -7633, 122981, -115727, 253907, -65627, -122081, -35054, -54936, -223605, -192227, -81733, -67663, -182904, 24344, -246418, -47324, -298724, -47345, -15804, -1831, -108792, 59001, -367149, -55549, -23075, -119423, 197725, 19268, -111071, 232279, -174703, 96639, -265832, -111963, -351388, -70149, 39275, 124242, 20271, 133132, 130171, -119721, 152909, 352171, 142843, -159797, -254432, -33518, -187396, -275296, 78685, 169194, -261916, 182344, -63074, -45523, 6860, -217903, 195096, -60388, -316633, 167615, -270900, -337579, 21778, -141274, -219328, 101900, 254170, -313600, -124547, 140949, -28950, -195669, -114815, -149377, -311718, 360526, -383664, 186880, -197473, -10561]
18173h1683H9088l1186M8946A5252a19024o9517j9183b9801A83768a15974l6357
18162a52331o3024J05927j05129o1408g6074m4315e2951j74039H7240a71531B29821
18150h1363n0048c7589E2090a25980c7125p584A47368j5414F3266K17546b60276
18138e02565a06538c3514j91420J7155Q020d6270A60892b4463C2924A1571J98210
18127B09781j00721J95674c33689h1749F3900J84523i8670j11610K1958A03962
18116d7515k35414J30638A2022a59558A90456a41667D772b39451I6668b27941
18105C6227J21079l0495d2297b269k32501D2680b16497A17020m3345C6744a7961
18093b37425A1638d06891B43159D2247a79459G5036g6422j9527K2278B9261a59916
$$ y = [-81683, 89088, 57902, 106848, 15252, -119024, -188541, -207724, -29801, 183768, -115974, -152331, -215355, -109428, -214557, -275965, -76074, -120389, -52951, -226990, 87240, -171531, 229821, -81363, -131411, -37589, 52090, -125980, -37125, -44709, 147368, 131954, 63266, 280812, -260276, -502565, -106538, -33514, -224934, -207779, -199759, -46270, 160892, -24463, 32924, 11571, 209781, 109060, 304734, -333689, -81749, 63900, 248423, -98670, -210280, -188322, 103962, -47515, -282929, -152291, 12022, -159558, 190456, -141667, 4772, -239451, 96668, -227941, 36227, 157306, 126811, -42297, -2269, -234770, 42680, -216497, 117020, 73675, 36744, -17961, -237425, 11638, -406891, 243159, 42247, -179459, 75036, -76422, -95949, -73671, 29261, -159916]
18081b19605N7759A47512a1603H6006N3821B0564c23628A19124c126G7477c08051
18069A73752G6618h6576E350J19076b20924a8235A9362e5020j78590j3798n9369
18058c06777a09506j67040k1890A18714e9087A74662a45888K1154b1140D3007
18047A38487c23650K5247a2256k74321F9148K36266e5638k86799h1222b4778C46930
18035b69714J07722A54527b76548j4330A17461d5003a2076j45392A01064R2789
18025A93853J77483A60904b41739B41434e23790B41805D7694a14383N4830D1950
18014c79560D9311b21496H624N3726b77100A45510K9663j5939c57176B33202p7149
18003A56053B9466a93507E9019d6022A80445P5338d8689k97314J67030B99665
$$ y = [-219605, -161846, 147512, -11603, 86006, 139827, 20564, -323628, 119124, -3126, 77477, -308051, 173752, 76618, -86576, 5350, 124426, -220924, -18235, 19362, -55020, -233610, -247408, -306777, -109506, -276546, -298436, 118714, -59087, 174662, -145888, -124734, -21140, 43007, 138487, -323650, -298403, -12256, -286577, 69148, 305414, -55638, -342437, -81222, -24778, 346930, -269714, -161992, 154527, -276548, -290878, 117461, -45003, -12076, -157468, 101064, 193853, 371336, 160904, -241739, 241434, -523790, 241805, 47694, -114383, -59553, 41950, -379560, 49311, -221496, 8624, 62350, -277100, 145510, 175173, 159234, -357176, 233202, 156053, 29466, -193507, 59019, -46022, 180445, 255783, -48689, -346003, -178973, 299665]
17992A01774O0982B7767a02922m2318d648j41620j53178B3532d3065B5652j003
17981B4649a61550A70407b98846L8903a23360m8501k10403E4632J35893B6566
17970A96514A9589c64604K3725f4890m3643p1024I7970f354A41861G0318k1088
17959D9230b57745A00394a26308A8975J38566i9425b1932m1776f45l2761A2731
17947d7837e629j12753J1145I0441g5981j30140f6176A51410E6815a69753J0343
17936a59410E3395a54664n1117g0362p433B6028j0727a21995B43678o5425g1950
17924B3339a67921P2231I513J85457q6205a27250j78527H7555a20501C03290D5779
17912b02628H0242i3155b5374D3904O5988a19062o5427F3561e4279j88183J06294
$$ y = [101774, 162756, 27767, -102922, -145240, -4648, -146268, -299446, 23532, -43065, 25652, 24649, -161550, 170407, -298846, -259943, -123360, -171861, -382264, 54632, 190525, 26566, 196514, 19589, -364604, -340879, -64890, -108533, -179557, 97970, -6354, 141861, 70318, 49230, -257745, 100394, -126308, 18975, 157541, -99425, -21932, -63708, -645, -33406, 12731, -47837, -5629, -118382, -107237, 90441, -75981, -206121, -66176, 151410, 56815, -169753, -159410, 53395, -154664, -205781, -70362, -77795, 26028, 15301, -121995, 243678, 178253, -71950, 23339, -167921, -95690, 9513, 194970, 108765, -127250, -305777, 87555, -120501, 303290, 45779, -202628, 80242, -93155, -25374, 43904, 109892, -119062, -184489, 63561, -54279, -242462, -136168]
17901a36168j05996J01329q4391h0573C06530c5874B85436b0826j8443C4216a49615
17889e2135D8269Q7877k0491h0869B13570l1644a07798J3595A63224E2666a879
17877a10517E504f6925j68532A41182K16043e0520A18115A635J67376b08746f1826
17865a57537A2904J73416Q2482b87312i748j12462L0245E0690a0270p4720B90145
17853h5576B12194J5759g81C7059a63620B43366D1478g3768A60244a49623M110
17842a45513A85751a95131n5470D9003a75333A04141l6086a16442k092d6341H61
17830d7930j13536g8947E2241J04099c24898a1354j05914q3549O5732j39759J34108
17819a40736k0068A02869K60586a45507F8503b81476J8530C31737b24909A36903
$$ y = [-136168, -242164, -140835, -225226, -80573, 306530, -35874, 285436, -20826, -39269, 34216, -149615, -52135, 48269, 136146, 115655, -80869, 213570, 181926, -107798, -94203, 163224, 52666, -1879, -110517, 5504, -66925, -235457, 141182, 357225, -50520, 118115, 1635, 169011, -208746, -61826, -157537, 12904, 186320, 268802, -287312, -9748, -122210, -91965, 50690, -10270, -84990, 290145, -85576, 212194, 227953, -781, 37059, -163620, 243366, 41478, -73768, 160244, -149623, -145513, 185751, -195131, -250601, 49003, -175333, 104141, 68055, -116442, -118534, -46341, 861, -47930, -161466, -78947, 52241, 156340, -324898, -11354, -117268, -200817, -135085, -274844, -140736, -160804, 102869, 363455, -145507, 68503, -281476, -262946, 331737, -224909, 136903]
17808C6863a43371R56j238f937C4376d6559j45486A31064J39113B7342J31166
17797A58508E554b56784N7881C1022R4355J01645q4196F0488b20001L8454B49387
17785a72614B0038f346k39191P4034C10471F2849a77881e7629F4108J15428d02541
17773a56174D3513O040J30771a09578q6601D526a5004D9882c6451F2486a83523
17761b19801R1877A39350b27164f0026H1137d9894A13879j2749j0160K07505a00488
17749B92808A08317b60010B08886g3938G0149K88447a48606I7615d9370A69770
17738e4050G1582J06706h0738j60934J17436e949A08167a62095M0207n9073a4090
17726C0303c10706a40481j39190a5870B15294G6655l1311A2625f9695j53179j4749
$$ y = [36863, -143371, -142415, -143653, -6937, 34376, -46559, -192045, 131064, 270177, 27342, 158508, 5554, -256784, -198903, 31022, 125377, 227022, 142826, 60488, -220001, -181547, 249387, -172614, 20038, -6346, -245537, -171503, 310471, 62849, -177881, -57629, 64108, 179536, -402541, -156174, 43513, 49553, 180324, -109578, -196179, 4526, -15004, 49882, -36451, 62486, -183523, -219801, -127924, 139350, -227164, -60026, 81137, -49894, 113879, 101130, 90970, 298475, -100488, 292808, 108317, -260010, 208886, -73938, 70149, 358596, -148606, 97615, -49370, 169770, -54050, 71582, 178288, -80738, -241672, -124236, -5949, 108167, -162095, -121888, -180961, -14090, 30303, -310706, -140481, -279671, -15870, 215294, 76655, 45344, 12625, -69695, -222874, -237623]
17715b37623a09043C2625K42434e8254A03466C5389J34250a4125j19519C5158
17704C84697G1051A1230b85601A51629G1065a16567j07445i0298C25320D6864
17693G1874K6858a420B34178D3784K34438c83302G0563C0382J51051M9902J07536
17682C38871A46322a6789F877P4391Q8415M5232l2334J90279b17033P7446m5119
17671a84706O098A28272c9506B83138r1476r023a8819p5519B48445C5772J22865
17660A58637M0189n9507J90583p9326I3193C7415M1746a38618B24052R7767j47649
17649A74170D9347K64804a52031A03417e4389E3984m038b41243D5061A6228M1502
17638E7730e8124C62797H8701J44892b899B3496g0329A371M0966e21421a97921
$$ y = [-237623, -109043, 32625, 275059, -58254, 103466, 35389, 169639, -14125, -133644, 35158, 384697, 71051, 11230, -285601, 151629, 71065, -116567, -224012, -90298, 325320, 46864, 71874, 98732, -1420, 234178, 43784, 278222, -383302, 70563, 30382, 181433, 231335, 338871, 146322, -16789, 6877, 81268, 169683, 214915, 182581, 372860, -217033, -139587, -184706, -178608, 128272, -39506, 283138, 191662, 182639, -18819, -94338, 248445, 35772, 158637, 198826, 139319, 329902, 250576, 93193, 37415, 79161, -138618, 224052, 321819, 174170, 49347, 314151, -152031, 103417, -54389, 53984, 49946, -241243, 45061, 16228, 57730, -58124, 362797, 88701, 233593, -2899, 23496, -70329, 1371, 42337, -521421, -197921]
17626d4852A36f2108A3765K33407a85891A85121N6364p6062k423C8956M07104
17615D46060I1967M1415a10708A21369a57929C38241F3881J07945J06818c771
17604C53559j37910r3848d5365q6011B34699e1130k14579M4614B082N2993A8836
17592D03532a73537n2877Q2435b102H8693K32917A4608J05653A1472K34117C5939
17580E1778J57740B7164a02572b1808A16216g0148H5538A3093L98889j38547a27581
17568c54193D0705f0436D9248J55607q2752j5873a16151A06683b47107A45138
17557B46063a43603B68956B392J8437b09376D0430a46513K4284E15071a19911
17546D61290d5490n897n3785A19029D0745a52597F78696C833J90823D8082c6012
$$ y = [-44852, 136, -62108, 13765, 247172, -185891, 185121, 241485, 165423, 163000, 38956, 446060, 91967, 133382, -110708, 121369, -157929, 338241, 63881, 171826, 278644, -3771, 353559, 215649, 121801, -45365, -131376, 234699, -51130, -265709, -221095, 2082, 55075, 18836, 403532, -173537, -226414, -143979, -2102, 88693, 321610, 14608, 120261, 11472, 245589, 35939, 51778, 209518, 27164, -102572, -21808, 116216, -70148, 85538, 13093, 411982, 273435, -127581, -354193, 40705, -60436, 49248, 204855, 122103, 106230, -116151, 106683, -247107, 145138, 246063, -143603, 268956, 2392, 20829, -209376, 40430, -146513, -122229, 515071, -119911, 461290, -45490, -51387, -105172, 119029, 40745, -152597, 678696, 3833, 194656, 48082, -36012]
17534A82408D865a4922j4971A7429a01881D33466c8528q0013A25633m9829O4328
17523A40132J34961j15366b15053R3074G6102R3943f2390b1187D452K058J51735
17512A58245P8004J68799q6239f0792B64342D9305L42555j63319M7979H6545l8784
17501D7761a0481B41675p8746O5300j00189R7492J70591E3182m24d2540j52537
17490a95077f0202a1923E88427A1538K01104a98871A28914D8361a0758D9079K35299
17479B84378j22519r846J30392b4543B68977m7662b3929A56744b08057G2977a03718
17467A93485o4810N8075I0119L93569A08918J31253o3513R9621A33949m4828J04763
17456A93884O5463l8199j08552D6780f8408B98370Q6230j63780p9964K9961H3627
$$ y = [182408, 4865, -14922, -29893, 17429, -101881, 433466, -38528, -118541, 125633, 75804, 140132, 275093, 159727, -215053, -121979, 76102, 170045, -62390, -21187, 4452, 6510, 158245, 236249, 405048, 318809, -60792, 264342, 49305, 391860, 228541, 276520, 86545, 47761, -10481, 241675, 162929, 228229, 128040, 225532, 396123, 53182, 52758, -42540, -195077, -60202, -11923, 588427, 11538, 212642, -198871, 128914, 48361, -10758, 49079, 284378, 161859, 152013, 282405, -24543, 268977, 221315, -23929, 156744, -208057, 72977, -103718, 193485, 128675, 186750, 90119, 483688, 108918, 240171, 176658, 276279, 133949, 89121, 193884, 259347, 221148, 112596, 46780, -68408, 298370, 384600, 220820, 140856, 170817, 83627]
17444B54663j08918E4716J12124J69300p0078J12426o4007j03482J71636A07367
17433B70078j15034b18340E4762b905I3258K15997J1723j17438J54409N4422A88262
17421F4082K33295j2055p2871r8370J64403K38345B17100P1901n4952A5094L79725
17410C94819r3277n2802D6380J71855a39433p5523I2474J4565M27610k41634n9176
17399B33839j4384r7662J47675l7819a74785G18850B13552E3885R3439O4098o4489
17388A46933a44313D00367j76994c48016B8566N2642b03932h1504A79021J5932
17378A94953K65397b7268A36942J65711b09131d982E3978L84530a56068C18609
17367C26081i081A62450G6854J15342f2864j7134c9838B85508f297B15852I3127
$$ y = [254663, 145745, 54716, 166840, 336140, 266062, 378488, 314481, 210999, 382635, 107367, 270078, 155044, -218340, 54762, -2905, 93258, 309255, 320978, 203540, 357949, 412371, 188262, 64082, 297377, 285322, 212451, 114081, 278484, 516829, 217100, 289001, 234049, 15094, 394819, 301542, 248740, 46380, 218235, -139433, -214956, 92474, 107039, 534649, 293015, 233839, 219455, 121793, 269468, 231649, -174785, 718850, 213552, 53885, 147324, 211422, 146933, -144313, 400367, 223373, -348016, 28566, 81208, -203932, -81504, 179021, 194953, 460350, -27268, 136942, 302653, -209131, -4982, 53978, 438508, -156068, 318609, 326081, -9081, 162450, 76854, 192196, -62864, -79998, -39838, 285508, -6297, 215852, 93127]
17355B92678A08671R3163R238N423m4492A0719N26601k13525C651h6779F5016
17343E874O8862K16703l6982j9763j01194e3877A89243N8322a12187L4006j28914
17332b07095c6646E18661A24321J22274A00548K8390J91054A06649J56963a99686
17321C39315I4312J23324N4891p9822r3043C7243P4157Q637M4538J1067K63189
17310D38831C8049L4028a46508A20881L3380K17380A51780M3627a6989B78076
17299G4406A0093K01150C1463K31775K38263C6886L99268A85792a28224C07650
17288D06231j31014q1322r4064J9461L934F0964i2140E74594A29899l2288a6431
17276B32241F8023P1632J50555D9750K32323j7824F9107L27823o3110p7964J56939
$$ y = [292678, 108671, 201834, 211072, 216495, 172003, 10719, 537320, 323795, 3651, -86779, 65016, 5874, 74736, 291439, 254457, 234694, 133500, -53877, 189243, 247565, -112187, -78181, -207095, -36646, 518661, 124321, 246595, 100548, 128938, 319992, 106649, 263612, -199686, 339315, 94312, 217636, 272527, 192705, 99662, 37243, 111400, 120037, 164575, 175642, 438831, 38049, 72077, -146508, 120881, 154261, 371641, 151780, 195407, -16989, 278076, 74406, 10093, 211243, 31463, 263238, 501501, 36886, 436154, 185792, -128224, 307650, 406231, 275217, 193895, 99831, 119292, 123226, 60964, -92140, 574594, 129899, 97611, -16431, 232241, 68023, 139655, 290210, 49750, 282073, 264249, 69107, 396930, 333820, 255856, 412795]
17265D12795j45249a45705B76530B7919J84988g3132B00062F8179g8959C2288
17254C09820h8470A75856q0411M2535k3868n4929J21716h3232B98791A09323J4822
17243A24145F224N52089k34489H4927J94892N9444j6454F9585K47479q2893g1949
17231c2926B70263o38D0325J40607J47763J63697h9748G2811J86457K64295j28857
17220C94706A34368K33463J78984e7346E13502a78176A26050J81288I4104K19476
17210C13580a14771A10412M3502k442b6734A23641L57520A04215K4529P6274p5952
17199A29066L08183k2559j85375l5158M118n1708J36178p6488c2134B47896K54087
17188E01983A56919K61168j82220N61446k07210j24560J61520A18603J40187j20719
$$ y = [412795, 267546, -145705, 276530, 27919, 212907, -73132, 200062, 68179, -78959, 32288, 309820, -88470, 175856, 95445, 137980, 114112, 59183, 180899, -83232, 298791, 109323, 124145, 6224, 558313, 323824, 84927, 279819, 339263, 322809, 69585, 317064, 234171, -71949, -32926, 270263, 269625, 40325, 180932, 328695, 492392, -89748, 72811, 259268, 523563, 394706, 134368, 367831, 546815, -57346, 513502, -178176, 126050, 307338, 94104, 313580, -114771, 110412, 153914, 151472, -26734, 123641, 481161, 104215, 128744, 205018, 129066, 437249, 414690, 229315, 194157, 198275, 146567, 282745, 206257, -32134, 247896, 501983, 156919, 418087, 235867, 797313, 590103, 465543, 627063, 118603, 258790, 138071]
17178A38071a32293F38580k95987R3876A81459H4944L35008F3291L30437k7908
17168C65820p1107j45728J66820J03924b3770C47519j62728K16958J23201O3343
17158E88293k10332N3360l3510j35886Q7074K82023j53839B26594L17036b8941
17147E54466B243J95696N7992J54473A23567Q7686J79686K73157K5322A20129
17136B69423j02984K48049j55591P5577P3603j87058J12853J61955j9235A78567
17125C42750a716E70500m7289j5072k34346m7344b1572G6008K35934J42738R9169
17114E53849k70488p1732J25340K28732q6917J38837A71616M13581K6659B81781
17103G27778A00162L27951j77768J58861A92996K35403J71732l3048n4570L1544
$$ y = [138071, -132293, 638580, 342593, 436469, 181459, 84944, 419952, 63291, 393728, 365820, 294713, 148985, 315805, 419729, -23770, 347519, 184791, 401749, 524950, 588293, 377961, 431321, 397811, 261925, 348999, 631022, 477183, 226594, 543630, -28941, 554466, 2243, 197939, 255931, 410404, 123567, 211253, 390939, 664096, 689418, 120129, 269423, 166439, 414488, 258897, 334474, 408077, 221019, 333872, 495827, 476592, 178567, 342750, -1716, 570500, 523211, 508139, 273793, 226449, -21572, 76008, 311942, 454680, 553849, 283361, 211629, 336969, 565701, 478784, 617621, 171616, 585197, 611856, 281781, 727778, 100162, 428113, 250345, 409206, 192996, 428399, 600131, 567083, 512513, 544057]
17093E44057E8204N00406j09855k852J11667B70999J85221J61624j14353k35327
17083B68164M58300k48092k04369L8656K37507B18473J46459K20820O1160A51327
17072C28486K71985k63247r6828L4715L16757A36363L16427L08419k40902j0339
17062E09968J11567B74761n1288J5344L28655p8977j68346K02552N91830l48027
17052G66504l04354n5564j91899L29797p9190Q8552J45542n4547j18494j82813
17042C43534L1766J72902N7250A63352O11629k92693j04572J28886J97215j40356
17032E63461o814R5067r6842l0719j08771M15671k48815R419k67826N83692k55595
17021F51928l7812B06888M73152r1188L7570L78110K1715B85726L91186J14795
$$ y = [544057, 58204, 558610, 448755, 445903, 557570, 270999, 456220, 617844, 503491, 268164, 726464, 478372, 274003, 312659, 550166, 218473, 364932, 585752, 646912, 151327, 328486, 600471, 337224, 240396, 275111, 591868, 136363, 452790, 761209, 520307, 509968, 621535, 274761, 223473, 238817, 567472, 488495, 320149, 522701, 1114531, 766504, 462150, 406586, 214687, 544484, 465294, 553846, 699388, 644841, 526347, 343534, 375300, 548202, 605452, 163352, 774981, 482288, 377716, 506602, 703817, 563461, 556647, 651714, 554872, 524153, 415382, 831053, 582238, 591657, 323831, 907523, 651928, 614116, 206888, 680040, 588852, 626422, 1004532, 1026247, 285726, 676912, 791707]
17011G91707j29974j8199J63184j41633L3238J60962k15678j07308M91993m01466
17001F26826l9040k2447L10910K18311k58749K81210l98795J09477J30071N9624
16991A017398l10778M920J82046j46449o9760M30688j87025M2915j06275J8879
16981H76559O4295L698J82989r6556K76149l22994K7326L7987k18098J32158l4212
16970I29301J68282J71091l01138N4132M45557k97567l88141M23735j49205k0096
16960A035951m384O1268p6922J38901o4318q1479j99831K00329J51607m56871
16950G04251J98401K76783p8644J75835l33519M04336l37437j69386J19100M44920
16940A404640k48263J86169R812j22875J68467J1809j81614j0873M1701j42776
$$ y = [791707, 661733, 643534, 806718, 665085, 698323, 859285, 643607, 536299, 1028292, 626826, 587786, 565339, 876249, 1094560, 835811, 1117021, 718226, 827703, 957774, 1017398, 706620, 711540, 893586, 747137, 677377, 1108065, 921040, 963955, 857680, 876559, 940854, 944552, 1127541, 1030985, 1307134, 984140, 1011466, 1049453, 831355, 963513, 929301, 1097583, 1268674, 967536, 1021668, 1467225, 1169658, 781517, 1205252, 1056047, 1035951, 1031567, 1092835, 1015913, 1154814, 1090496, 1009017, 809186, 1009515, 1161122, 704251, 902652, 1179435, 1100791, 1276626, 943107, 1347443, 1010006, 840620, 959720, 1404640, 1156377, 1342546, 1352358, 1229483, 1397950, 1409759, 1228145, 1217272, 1258973, 1116197]
16930A116197M1875J72383K04085j80512K58565m58676J91347l00014M48131R3220
16920A586601m54026K60955M47309l2556j49181q3570K14236J08025m00134M04479
16910A902138l72332n7494R9079K51913J08345l63672L35731j44141L3332k56740
16900A536159K45023J59248O119j38481J82718j10488m79151K92865K46233L1741
16890A971986L88750l64577j20728n3242N8816K89182m94171M48011r0417m9972
16880A983638M5271J73602J38990j86415J16768J62719j57160J86468l85808L71243
16870B449316k07186J47984N2858Q8462j64232M23140J11058k11197J94908k41818
16860B643293K09114j45270n5563J71862J55705J19731k51159M03568m21836L35362
$$ y = [1116197, 1158072, 1330455, 1534540, 1354028, 1612593, 1153917, 1345264, 1045250, 1493381, 1586601, 1132575, 1393530, 1840839, 1808283, 1659102, 1575532, 1789768, 1897793, 1497659, 1902138, 1529806, 1472312, 1571391, 1823304, 1931649, 1567977, 1903708, 1759567, 1792899, 1536159, 1781182, 1940430, 1946549, 1808068, 1990786, 1880298, 1401147, 1694012, 1940245, 1971986, 2360736, 1996159, 1875431, 1822189, 1881005, 2170187, 1676016, 2124027, 2033610, 1983638, 2028909, 2202511, 2341501, 2155086, 2271854, 2434573, 2277413, 2463881, 2078073, 2449316, 2242130, 2390114, 2442972, 2531434, 2367202, 2790342, 2901400, 2690203, 2885111, 2643293, 2852407, 2707137, 2651574, 2823436, 2979141, 3098872, 2847713, 3251281, 2829445, 3164807]
16850C164807j92230K66381L48157m51450N31987k43996n5617K51655Q1090r2122
16840C608662L26855m31614J69795M39513j90416N32689l92687J17695m0003M13818
16830D554307o5416K11964O5865m35689L16274K84792M0883N1984J5694K2406
16820E063064L05174L98602k90455J85577K21944j20359K13537j79485K06363
16811F003962K29859L03193P2132K82846O5407J85818q1991K37410j157N17967
16801G815446K49551k46266J98428M44941O7999j47318P91629M70J04247K13173
16791I492300L49908J61436N67537R0632K21855J63073L55750M28590N81266K40803
16781A2653150K06136P18224J61786M76048M47149M83974J98777N93103O75584
$$ y = [3164807, 2972577, 3238958, 3587115, 3135665, 3667652, 3423656, 3368039, 3619694, 3700784, 3608662, 3935517, 3503903, 3673698, 4113211, 3922795, 4455484, 4062797, 4180492, 4140489, 4554307, 4488891, 4700855, 4766720, 4331031, 4647305, 4932097, 4972980, 5024964, 5040658, 5063064, 5368238, 5766840, 5476385, 5661962, 5883906, 5763547, 5977084, 5797599, 6003962, 6233821, 6537014, 6609146, 6891992, 6957399, 7143217, 7061226, 7298636, 7297479, 7815446, 8064997, 7818731, 8017159, 8462100, 8530099, 8382781, 9174410, 9174880, 9279127, 9492300, 9842208, 10003644, 10571181, 10661813, 10883668, 11046741, 11402491, 11831081, 12412347, 12653150, 12859286, 13577510, 13739296, 14215344, 14662493, 15146467, 15345244, 15938347, 16613931]
16772A6613931K67560L25582M48629J027453N45275O86078O10710J041455N64682
16763B2131355R89591R24294P14948J292618P39056J421764R52286J381817J369564
16754C1917293R52231J765100J855145J511604J543504J846475K418529K119037
16746D5928918K164170K686052K431125K852197K849944L075950L494300L745669
16738F9228325L861089M150604M920863M915343N112165N582975N812175O234192
16730A09817731O598317O982325P269872P203005P676486P871713P566040P585145
16722A68570634P194302P045885O195175M796970L954369K810718J337181m42004
16714B01463230j466255k663247m091113n137408o331020p040864p138857p871984
$$ y = [16613931, 16881491, 17207073, 17655702, 18683155, 19228430, 19914508, 20525218, 21566673, 22131355, 23120946, 24045240, 24760188, 26052806, 26791862, 28213626, 29165912, 30547729, 31917293, 32869524, 34634624, 36489769, 38001373, 39544877, 41391352, 43809881, 45928918, 48093088, 50779140, 53210265, 56062462, 58912406, 61988356, 65482656, 69228325, 73089414, 77240018, 82160881, 87076224, 92188389, 97771364, 103583539, 109817731, 116416048, 123398373, 130668245, 137871250, 145547736, 153419449, 160985489, 168570634, 175764936, 182810821, 189005996, 193802966, 197757335, 200568053, 201905234, 201463230, 199996975, 197333728, 193242615, 188105207, 181774187, 174733323, 167594466, 159722482]
16706A59722482q301906p862531p936503p883840p525880o963841p450381o070880
16698I9726720o541496n348461n268483m892930n057781m007250m057925l857222
16690F0695172l191286l370870l152268k222181k746406k382068k031190k426023
16682C9172880j757102k059104j604508j557055j198665j530231j189360j519493
16674B6757362j053101q86773j046991j020797p88760j009137n61562o09469q90085
16665A8890687r49572p34221k68644q15946o15839k41264r12247l41426k00306
16656A3811222p52671l74265m85534m1188n44586m09563o22665K47510o20800
16647A0207460j89689l81288l83987l18782l71862j90999j31188k3571n45797
$$ y = [159722482, 151420576, 143558045, 135621542, 127737702, 120211822, 113247981, 105797600, 99726720, 93185224, 87836763, 82568280, 77675350, 72617569, 68610319, 64552394, 60695172, 57503886, 54133016, 50980748, 48758567, 46012161, 43630093, 41598903, 39172880, 37415778, 35356674, 33752166, 32195111, 30996446, 29466215, 28276855, 26757362, 25704261, 24817488, 23770497, 22749700, 21960940, 20951803, 20390241, 19780772, 18890687, 17941115, 17206894, 16938250, 16122304, 15506465, 15265201, 14352954, 14011528, 13811222, 13058551, 12684286, 12198752, 12157564, 11612978, 11203415, 10580750, 10828260, 10207460, 10017771, 9636483, 9252496, 8933714, 8561852, 8370853, 8239665, 8216094, 7670297]
16638G670297J2163m01083L14448n27797M0344n79207l1679J70421n30878o0174
16628F076855m3412l91009K15094J24279j97276o71144Q2161n8715j39773K19060
16618E216120l01572l15899k71530J10805j82702J2737J33801m0209l28190K3795
16608D057156j23236l51422N12242o37915L82023m18062K62166l28581L99199
16599C753570m19269n2155l67295L86352N5788j54153J61832n24237K60829j34428
16589B966834j71291q2151K99904l32011L6346l10673K23158l3068n6391j9759
16579B520898P2647k92651n6031K28870k97859j2568k0355Q3324l41751K33856
16569B118380P9031o4763l93486P3976R4193M2148K51965n61103Q98N5511R235
$$ y = [7670297, 7682460, 7281377, 7595825, 7068028, 7108372, 6529165, 6497486, 6667907, 6137029, 6076855, 6033443, 5642434, 5857528, 5981807, 5784531, 5113387, 5195548, 5136833, 4997060, 5216120, 4914548, 4598649, 4327119, 4437924, 4255222, 4267959, 4401760, 4361551, 4033361, 4057156, 3933920, 3582498, 4094740, 3456825, 3838848, 3420786, 3682952, 3354371, 3753570, 3334301, 3282146, 2914851, 3301203, 3356991, 3202838, 3364670, 2840433, 3101262, 2966834, 2795543, 2713392, 3013296, 2681285, 2717631, 2406958, 2630116, 2597048, 2540657, 2520898, 2593545, 2300894, 2244863, 2473733, 2175874, 2163306, 2142951, 2226275, 1884524, 2118380, 2197411, 2132648, 1739162, 1813138, 1907331, 1949479, 2201444, 1640341, 1641239, 1696750, 1705985]
16558A705985j78969K86145l52615J33088R2193q447m0465r6878J17321p3172
16548A584186L29706m28338O5536j61961K80979m85484R4231j4678R9197K03169
16538A566543k82086k59682N70410m72834R9877N2505R9321l49780R5231K5154
16528A144659k0924k440L9772m0493j10719J15206p6922q6935R6673j89579K13537
16517A081835L3156J5941j10497l71303N53344m90641L50702k35141j87334p0940
16507E69122L19482k4985K3303K37011l80430j36242J02917J85725J8303k48894
16497F65312k8478L73133j95938k30941K48808k2462j68206J82900k07342K36308
16487H53094j48683j55457N6078J33318k02385L49472j16821n2749k60009M51574
$$ y = [1705985, 1527016, 1813161, 1460546, 1593634, 1685827, 1677380, 1636915, 1540037, 1657358, 1584186, 1913892, 1485554, 1551090, 1389129, 1670108, 1184624, 1278855, 1264177, 1363374, 1566543, 1284457, 1024775, 1595185, 1122351, 1222228, 1274733, 1374054, 1024274, 1119505, 1144659, 1123735, 1121295, 1161067, 1120574, 1009855, 1125061, 1048139, 961204, 1057877, 868298, 1081835, 1114991, 1130932, 1020435, 649132, 1202476, 711835, 1062537, 827396, 640062, 569122, 888604, 863619, 886922, 1123933, 743503, 607261, 710178, 895903, 914206, 665312, 636834, 1009967, 814029, 583088, 831896, 809434, 641228, 824128, 616786, 853094, 704411, 548954, 605032, 738350, 535965, 885437, 768616, 715867, 455858, 907432]
16477I07432m50033K71570M9548j28846J98628k65868k10236J63267j30550L36584
16467G41496q9822j66397K12057k66719J66846m7665k4958k7871j26163K28649
16457E99453j70479J56853k09674J94929n7196j06853M2130R4384k0088A88363
16446F19639o4747j40166r4724J49856k12141K90202j10283N763J55922k03882
16436C95439Q8285j99122Q1574m9611K39436j54319O2976M17679D04281A4832
16425C17341M1204K24606K1485k28152A74326J16713q349J70231n0656j17543
16415B84722K48474j66232L359K50842k79268A64345O9545L22858B72050J75848
16405D47898j07123r8389K57066Q9750B64715N4069j01044I6690K53048j35744
$$ y = [907432, 457399, 728969, 778517, 649671, 848299, 582431, 372195, 535462, 404912, 741496, 651674, 485277, 697334, 430615, 597461, 549796, 524838, 496967, 370804, 599453, 428974, 585827, 376153, 571082, 513886, 407033, 449163, 543547, 523459, 188363, 619639, 554892, 414726, 320002, 469858, 257717, 547919, 437636, 443399, 599321, 395439, 483724, 284602, 366176, 316565, 556001, 401682, 464658, 882337, 404281, 14832, 317341, 358545, 583151, 604636, 376484, 174326, 291039, 282690, 452921, 402265, 284722, 533196, 366964, 370323, 621165, 341897, 164345, 233890, 556748, 272050, 447898, 340775, 242386, 499452, 589202, 264715, 318784, 217740, 96690, 349738, 213994]
16395B13994r4097J80568j568K32191j95875J68931j36376q2028N4709B3664J70271
16384A93935K80305A81046J37642j1020E1632k0066K50643r8684c4869c650B99291
16372B92878J81097i4519A2179K28148r1421L6885K8954n58f9610H3831J79521
16361B63352B4299K09229g5730A9091J85975J82491c9440F28798A85144J89347
16351C74491A52745r033J79399M13289A95373G8211J22488H1731K4759Q1675q8450
16340I9715K5557N1183J16624j43384a39901M6748B79994j5670b30410F3511I356
16328A12014M6199g689E5060J34088b36151A54963B9560K04031K65879A53974
16317E3545R5142R8100a48080A6273J55404J850M8352C8275K10133F3766J86846
$$ y = [213994, 119897, 300465, 298897, 531088, 335213, 504144, 367768, 285740, 340449, 23664, 193935, 474240, 181046, 318688, 307668, 51632, 31566, 282209, 183525, -34869, -3650, 299291, 292878, 473975, -94519, 12179, 240327, 148906, 185791, 214745, 214187, -69610, 83831, 263352, 24299, 233528, -75730, 19091, 205066, 387557, -39440, 628798, 185144, 374491, 152745, 143712, 323111, 736400, 195373, 78211, 200699, 81731, 106490, 188165, 99715, 125272, 176455, 293079, 149695, -139901, -93153, 279994, 264324, -230410, 63511, 9356, 112014, 158213, -7689, 55060, 189148, -236151, 154963, 29560, 233591, 499470, 153974, 53545, 148687, 246787, -148080, 16273, 171677, 173527, 221879, 38275, 248408, 63766, 250612]
16306B50612a82669B763L0916M6061d3288C8051c7789I8263Q9094J39319A007
16294c989m6130G7390M93042a50674A70408j670J9961H3409j5018L67311j37749
16283B97953p8213a56078A90449A2225a34851A03617l3490K13057Q9345d9026
16272a79285C57714b21418O4936m9484A26559l8126c0397D811d2260A57021J12644
16261B69665C275J26645d7774j24091C02064R2564b57577C03503b0121D12192
16250F8155o534K45591b41798B533J21167l3998a25683M7855K8316A36412l2912
16239A03500K78241i1981F7226K66731R43A05035C6477P4644b04789I2786K84106
16228C76892a31408K6787A16182N842A4192e6526A6933a8709A11054k8373b9334
$$ y = [250612, -182669, 2763, 33679, 79740, -43288, 38051, -37789, 98263, 187357, 326676, 1007, -3989, -50119, 77390, 570432, -150674, 170408, 168738, 188699, 83409, 68391, 435702, 297953, 219740, -156078, 190449, 12225, -134851, 103617, 70127, 283184, 372529, -49026, -179285, 357714, -221418, -156482, -205966, 126559, 88433, -30397, 4811, -42260, 157021, 269665, 3275, 129920, -47774, -171865, 302064, 394628, -257577, 303503, -20121, 412192, 68155, 61621, 307212, -241798, 2533, 123700, 89702, -125683, -77828, -49512, 136412, 103500, 381741, -91981, 67226, 333957, 334900, 105035, 36477, 111121, -204789, 92786, 376892, -131408, -104621, 116182, 122024, 14192, -56526, 16933, -18709, 111054, 82681, -29334]
16216B98571A35427C1259d4697k722C50132j53602E6519a26673B93694C3703b28470
16204C17469A13655N1920c1631j55660b596l19337b0991G5820b31948P7116g1468
16192b28987a14198H9562a69777g3534B59305a42129A38487a50905B43884b14381
16181h8541L8212b0551C40781p3265a45469f6619j44439C07463C5642a36232C8767
16169a03356C61939j65217b23009c6900p0501G6540J67738d9230j71931B35016
16158A55509a3071A08407a012j28138A93599h6339b5221l00911A5844J51005Q3109
16147B49958a54927c7742B03907J29570B9213K1362C051a88240c7046B86204b5265
16135b65346A499Q1724L5246Q5304O5455a87780l41685K10271a37432k66628A2524
$$ y = [298571, 135427, 31259, -44697, -47419, 350132, 196530, 56519, -126673, 293694, 33703, -228470, 317469, 113655, 165575, -31631, -187291, -2596, -321933, -20991, 75820, -231948, -154832, -71468, -228987, -114198, 89562, -169777, -73534, 259305, -142129, 138487, -150905, 243884, -214381, -88541, -50329, -20551, 340781, 267516, -145469, -66619, -211058, 307463, 35642, -136232, 38767, -103356, 361939, 196722, -223009, -36900, -107401, 76540, 244278, -49230, -221161, 235016, 155509, -13071, 108407, -1012, -129150, 193599, -86339, -25221, -326132, 15844, 166849, 249958, -154927, -37742, 203907, 333477, 29213, 50575, 3051, -188240, -37046, 286204, -25265, -265346, 1499, 83223, 118469, 203773, 269228, -187780, -529465, -319194, -137432, -404060, 12524]
16123e5508A27536N6353h35j08141A70626o2277i9971k55657A23953R0689J2515
16112B27157e0778J7775m16433f9171c573A6318K39509l2466C6578g1224C2048
16100C3657n903O1149B6675q49b89716A16956a91728c7572A74789I467d6092J2332
16088c3760m5907K214L8147j5334A70410a09264A19036b33829A7455i3287E8634
16076C3033J822f2835A3793h9790A50569a713j24741l0442C933J9886d43180B64658
16063a63259M9222B4523J00939a25767J3644o9402G5047b76804C8612a96596E3895
16051b49515H4638l4174d48150a96205c7985C1684N0145b15978N8783A28348a5436
16039C12939a06005j80351d7588j1217b8535m37j61979n8506M5470H7061C3517
$$ y = [-55508, 127536, 183889, -835, -108976, 170626, 108349, -99971, -355628, 123953, 214642, 227157, -50778, -33003, -449436, -69171, -3573, 16318, 255827, 223361, 36578, -71224, 32048, 33657, 27754, 88903, 26675, 25826, -289716, 116956, -191728, -37572, 174789, 9467, -46092, -33760, -79667, -77453, -39306, -54640, 170410, -109264, 119036, -233829, 17455, -93287, 58634, 33033, 34855, -62835, 13793, -89790, 150569, -1713, -126454, -156896, 3933, 23819, -443180, 264658, -163259, -114037, 24523, 125462, -125767, -112123, -181525, 75047, -276804, 38612, -196596, 53895, -249515, 84638, 50464, -448150, -196205, -37985, 31684, 81829, -215978, -157195, 128348, -15436, 312939, -106005, -286356, -47588, -58805, -28535, -28972, -190951, -249457, -203987, 87061, 33517]
16027b15988A69836a61144q1493g449E9078g4733b1736A94206A4068K1564J60345
16016A95977b509m3899k80181J37185A02342K22813q4639f1160q4489R121k23031
16005c59559d6068k7556C8445a20920p4350A01166L4743b68083C73117j30577
15995B42540a37518A72624G3343a26598L6197a1961j40494q2052g1319C51251
15984A18332K30584J19525o0190j23528n0544K08298j06932a23914J1569I1755
15973F2248b60646A88504G4416a66157E20801a47055b2415j46918M4547I0683
15962D11712A5942J35036E0929a19609m7991B94253G0074K63697a2421C90099
15951b52889Q8126g5825k69104F1069i3469F6359J80399F2230b33584r5661J57061
$$ y = [-215988, 169836, -161144, -242637, -7449, 59078, -74733, -21736, 194206, 14068, 35632, 195977, -2509, -46408, -326589, -189404, 102342, 325155, 240516, -61160, -145649, -136528, -359559, -46068, -73624, 38445, -120920, -195270, 101166, 135909, -268083, 373117, 242540, -137518, 172624, 73343, -126598, -90401, -11961, -152455, -234507, -71319, 351251, 118332, 348916, 468441, 408251, 284723, 234179, 442477, 335545, -123914, -112345, 91755, 62248, -260646, 188504, 74416, -166157, 520801, -147055, -22415, -169333, -124786, 90683, 411712, 15942, 150978, 50929, -119609, -167600, 294253, 70074, 333771, -12421, 390099, -252889, -164763, -75825, -344929, 61069, -93469, 66359, 246758, 62230, -233584, -329245, -172184]
15940a72184L0356O145n5920E0495L5140D1011b43048A00958a84656C03148a82726
15928D05418h8454j04192L0873I9672d2290k5145H8969a57446j55325g4682p1747
15917a46429j5437l93622B56448a55385A23614c0206l23910P1925A74268n2075
15907A22193E653a39995A45829e0118A8230L51802A54911c22564P8715r3361C32207
15895I3511a29555I9719a0632A41286E7842p21O3330a8203j88759e6246j33874
15884a90120H9058C186c0692A03567c47913r263h5399A51923b4122j92752e2203
15872i2355j05674E7760J51385D8448d9592c78G7116c30236G3993a39808D3900
15860b53695A97900a12706A93770a20706j80431g9961A9218K6433P0742h4704
$$ y = [-172184, -141828, -135683, -191603, 50495, 85635, 41011, -243048, 100958, -184656, 303148, -182726, 405418, -88454, -192646, -161773, 99672, -42290, -67435, 88969, -157446, -312771, -74682, -146429, -161866, -555488, 256448, -155385, 123614, -30206, -354116, -282191, 174268, 122193, 5653, -139995, 145829, -50118, 18230, 370032, 154911, -322564, -243849, -337210, 332207, 93511, -129555, 99719, -10632, 141286, 57842, 57121, 120451, -18203, -206962, -56246, -190120, 89058, 3186, -30692, 103567, -347913, -357176, -85399, 151923, -24122, -216874, -52203, -92355, -198029, 57760, 209145, 48448, -49592, -378, 77116, -330236, 73993, -139808, 43900, -253695, 197900, -112706, 193770, -120706, -301137, -79961, 19218, 45651, 116393, -84704]
15849f6224D6537P8079b44906K7549l0249A34815k6767b17663h5608C7476O4260
15838A01736J56195j17549a3383A19573a23755a5645m11055B19827P9739A17853
15827H7306D0195O8924N920B6095J21674a82818m986n2164J1363N1799M0292o1442
15815a97956A25318b3114k17388R0364a327j95208h3449H1075h7676E3022a51048
15803C9337a36384C690J1963O1339a08426J6415A45115m8297l1175b2614k17922
15792b40536o2586A74736a8398A3881J32458e1858e792j51639B8456J75605d9628
15780b7582r7755J5511j89215A08521K65732a21512l0796m8486C3977b12262q1751
15769b94013B7270J81113b54550a06125j43551A33051a7362H9395c64151A85430
$$ y = [-66224, 46537, 124616, -244906, -217357, -247606, 134815, 108048, -217663, -85608, 37476, 101736, 257931, 140382, -13383, 119573, -123755, -15645, -426700, 219827, 299566, 117853, 87306, 40195, 109119, 115039, 26095, 147769, -182818, -187804, -239968, -228605, -176806, -136514, -197956, 125318, -23114, -240502, -150138, -1327, -196535, -83449, 81075, -87676, 53022, -151048, 39337, -136384, 3690, 15653, 76992, -108426, -92011, 145115, 96818, 65643, -22614, -240536, -303122, 174736, -18398, 13881, 146339, -51858, -5792, -157431, 28456, 204061, -49628, -27582, -125337, -109826, -299041, 108521, 374253, -121512, -152308, -200794, 33977, -212262, -294013, 27270, 208383, -254550, -106125, -249676, 133051, -17362, 89395, -364151, 185430]
15758A16954A1034K27263q1232d0742p2197D8842a77538A06659c9399A5447e1244
15746a50633A57598b8578B7712a53581B3288K38646b01668H1984b96414A98116
15735A29686b13069c9539A2328J86631b12393O1972K0755I9905k9001b42538b7343
15723B4830b57606G1678h7633C73124A17648B5768h3058g776m3803j41835K8303
15712a65111P3617p8286J5058h09A33895c0633A73886B4716a24894A83993q4670
15701I9323a41389k22184E9401b18481J07551a3426C8168b4040A70954M9166H7780
15689d477n4891C28782q8934o5182a84160B23711F0359d1047q3636I1364M6467
15678A37831n2411a48132m2461E6158K6368j4792B5195b79142c6618r3550j02631
$$ y = [116954, 11034, 238297, 157065, -40742, -112939, 48842, -177538, 106659, -39399, 15447, -51244, -150633, 157598, -28578, 27712, -153581, 23288, 261934, -201668, 81984, -296414, 198116, 129686, -213069, -39539, 12328, 198959, -212393, -150421, -129666, 99905, 70904, -242538, -27343, 24830, -257606, 71678, -87633, 373124, 117648, 25768, -83058, -7776, -51579, -193414, -165111, -91494, -169780, -154722, -809, 133895, -30633, 173886, 24716, -124894, 183993, 99323, -141389, -363573, 59401, -218481, -110930, -13426, 38168, -24040, 170954, 220120, 87780, -4477, -59368, 328782, 239848, 174666, -184160, 223711, 60359, -41047, -124683, 91364, 137831, 85420, -148132, -190593, 56158, 82526, 67734, 25195, -279142, -36618, -130168, -232799]
15667b32799o350c8576a9147m7456A64546b5151n6133C7667b50389h8189D5641
15655b6875A77199a18998j1712l02204C79153e9697j4246J466A2715J02756b36137
15643F9308a3908B9330f5349C3055m695l884J618b07764m8431J26144A24196A1381
15630A40395a40681F5046b33445A31620c69823A70089b1994o4726B03620a62946
15619A60507K3516K43859E8660J09279J00481J6021D1708L439a96347A28159P7863
15608B06022c1107E0484a00797l29345d9864b2537r0720K5139j17888O8229j07900
15597b45677I7359g7206k23079A69518o1730L20119a74470A51470a1044B4383
15586A28996e9705H3290J20838k1810m9006n4213a3072k29728A09380b23182d7216
$$ y = [-232799, -239149, -38576, -19147, -66603, 164546, -25151, -81284, 37667, -250389, -88189, 45641, -26875, 177199, -118998, -130710, -432914, 379153, -59697, -73943, -72477, 12715, 115471, -236137, 69308, -13908, 29330, -65349, 33055, 28360, 24476, 26094, -207764, -256195, -130051, 124196, 11381, 140395, -140681, 65046, -233445, 131620, -369823, 170089, -21994, -86720, 203620, -162946, 160507, 184023, 427882, 58660, 167939, 268420, 284441, 41708, 45147, -196347, 128159, 206022, -31107, 50484, -100797, -430142, -49864, -22537, -113257, -88118, -206006, -137777, -245677, 97359, -77206, -300285, 169518, 107788, 427907, -174470, 151470, -11044, 24383, 128996, -59705, 83290, 204128, 182318, 133312, 79099, -13072, -242800, 109380, -223182, -47216]
15574g7508l37569K00827k18826A51934a43044K2325n8402H1521i943k8260F2605
15562A38742n9291M0741P2808F5282L700Q4405b143A47761J17280g6085A69049
15550G3648i7910j41616A69929b75840b7382E6658R1449M2111n4826m862N8612
15539A89142a34977A25952J75807A12922b32718J10003N8405q4699j39991N1810
15529b37190h5206a8429E8061r173K45551a30771F3557c74254A26433b38800f9349
15517a67844B33864J95086i9339B04814a22524B67914B0808J38269f0000C36331
15506B91554A22239d9274n2158b7052j72075Q988B77768a55986A71682F5200a87413
15494b88542f1420g913l6908H063J31188b42375d1599J6661j3906l63651F0457
$$ y = [-77508, -415077, -214250, -433076, 151934, -143044, -120719, -179121, 81521, -9943, -38203, 62605, 138742, 79451, 120192, 193000, 65282, 68982, 153387, -2143, 147761, 265041, -76085, 169049, 73648, -97910, -239526, 169929, -275840, -27382, 56658, 148107, 190218, 135392, 130530, 189142, -134977, 125952, 301759, 112922, -232718, -122715, -64310, -149009, -289000, -237190, -85206, -18429, 58061, 48888, 294439, -130771, 63557, -374254, 126433, -238800, -69349, -167844, 233864, 428950, -99339, 204814, -122524, 267914, 20808, 159077, -60000, 336331, 291554, 122239, -49274, -101432, -27052, -199127, -190139, 277768, -155986, 171682, 65200, -187413, -288542, -61420, -7913, -44821, 8063, 139251, -242375, -41599, -24938, -38844, -402495, 60457]
15482b01917A18281h9169B58479G1484A2052P590J49494b33k4361B24870E5768
15470b7685A278a77216g9551a1378F138a24392R829B45031F0977K32633a85237
15458B5011L2488G595L2836a48488E1784b08824b8740q7581A05217N8359c01386
15446a04656D5866a71931B83848H573K61036a32764j21729A442O7665j8496J29390
15435A80001J4683n8003k7112N506a80565i860j7574A19947b66779H4223b26435
15423b78591B16571a17442B5256J09055c05406A76851R5647q4985a73711A19334
15412b06434L2505O6512j09044b5072j1816r4981M8170e627l29265B97948j27200
15401A70748c3099B14274A6489d47788a68240F3287B1698a62486l0967b8705H1986
$$ y = [-201917, 118281, -89169, 258479, 71484, 12052, 19642, 169136, -233, -24594, 224870, 55768, -27685, 1278, -177216, -79551, -11378, 6138, -124392, -114563, 245031, 60977, 293610, -185237, 25011, 57499, 7595, 40431, -148488, 51784, -208824, -28740, -116321, 105217, 163576, -301386, -104656, 45866, -171931, 283848, 8573, 269609, -132764, -254493, 1442, 69107, 50611, 180001, 194684, 136681, 109569, 115075, -180565, -9860, -27434, 119947, -266779, 84223, -226435, -278591, 216571, -117442, 25256, 134311, -305406, 176851, 272498, 187513, -173711, 119334, -206434, -173929, -107417, -216461, -25072, -36888, -131869, -83699, -5627, -334892, 297948, 170748, -33099, 214274, 16489, -447788, -168240, 63287, 21698, -162486, -193453, -28705, 81986]
15389C45244I4997O5277k435b07600A6335J78556a56751E7831O2913a0971C08260
15377A25132a0346o4131L171m6155j03805b3663F2557b20249h3961C8895L2517
15366G1412i9352F9721j9042J22891a09010a1585E6464i9114A00753e38991h0680
15354A09710n208D6547J93969a40019A03010a87477B44497b36711g7504I9597
15343A0309J10099C3786a57480A51587o5765J2216N3999L7477E9629a64961d3445
15331a9502o8037D0644o151b78915B37351c7713G4796J7970J21477k1217C4864
15319a55767A97630B8140L28355E142c9407j15653B9122L20429a14655A23129
15308D34b1433j07973D27858b63486C0883J32967o8823J84742b423k4856A66215
$$ y = [345244, 94997, 160274, 157839, -207600, 16335, 194891, -156751, 57831, 120744, -10971, 308260, 125132, -10346, -74477, -71306, -117461, -221266, -23663, 62557, -220249, -83961, 38895, 71412, -99352, 69721, 50679, 173570, -109010, -11585, 56464, -99114, 100753, -538991, -80680, 109710, 104502, 46547, 240516, -140019, 103010, -187477, 244497, -236711, -77504, 99597, 10309, 120408, 33786, -157480, 151587, 85822, 98038, 152037, 189514, 59629, -164961, -43445, -19502, -87539, 40644, 34493, -278915, 237351, -37713, 74796, 92766, 214243, 193026, 34864, -155767, 197630, 28140, 356495, 5142, -39407, -155060, 29122, 349551, -114655, 123129, 434, -21433, -129406, 427858, -263486, 30883, 163850, 95027, 279769, -2423, -27279, 166215]
15296A78870a56591F5658J27193q2795Q5663J15562j16907l6211a7701A18142
15285B70474E3696K7720a5721H4351g1068e694A96557a56074D74122D3089M20104
15274D63193B29815j14795h4936B32438A7830J78621J37141G7221B4464K29876
15264B54340E653d7422A04044a67034A21741J47446e8053C0321P6041D8999K85560
15253C34559F4501k1240c5716C83683A89178M41262M10456R31727q91253M07210
15243A488580k67159B53575H8607C6847a86035B21013a13952A08812J10033D0189
15232A79670J8711a96522O3626A32804c13831g2147A28863b13005i8282I8780
15221a42863C23475c3360B01271I4126B3573J67018c49563A61705h7226H9564
$$ y = [178870, -156591, 65658, 192851, 110056, 195719, 311281, 194374, 158163, -17701, 118142, 270474, 53696, 81416, -15721, 84351, -71068, -5694, 196557, -156074, 474122, 43089, 463193, 229815, 115020, -84936, 232438, 17830, 196451, 333592, 77221, 24464, 254340, 5653, -47422, 104044, -167034, 121741, 269187, -58053, 30321, 106362, 48999, 334559, 64501, 43261, -35716, 383683, 189178, 630440, 1040896, 1972623, 1081370, 1488580, 1221421, 253575, 88607, 36847, -186035, 221013, -113952, 108812, 218845, 40189, 179670, 198381, -196522, -132896, 132804, -313831, -72147, 128863, -213005, -98282, 98780, -142863, 323475, -33360, 201271, 94126, 23573, 190591, -349563, 161705, -87226, 89564]
15210G7449b31490A32987b6848l5544j91997A00700J69457P6877i4817r072B66617
15198C2494K02520h4334A59441k6141O9013D6510c10834a0750J351l17127d6605
15186h6445B41789a06791A84048J30718A31021L4735n4012J81619a9031A94983
15175a40130H8198C1027P8614a77463F8524N9882J27722d7523I686K14980b7121
15163A88694L7032B2699R0000L0785J58117b32622A42407j4043b6962A52278K0193
15152A72471n5551K41743A69375K89004H0898j9957c2924j71654B11831a71496
15141C8131M0827A2923L11380l9722c76926A2250J92096a6775A54347C855K09907
15130B13762A900K45177a38478D9867b7369C0016a32569d6611A37962g5024A24324
$$ y = [77449, -231490, 132987, -26848, -62392, -254389, 100700, 270157, 347034, -94817, -103889, 266617, 32494, 235014, -84334, 159441, 133300, 202313, 46510, -310834, -10750, -9399, -326526, -46605, -86445, 241789, -106791, 184048, 314766, 131021, 165756, 111744, 293363, -19031, 194983, -140130, 88198, 31027, 109641, -177463, 68524, 128406, 256128, -47523, 9686, 224666, -27121, 188694, 225726, 22699, 112699, 143484, 301601, -232622, 142407, 128364, -26962, 152278, 172471, 116920, 358663, 169375, 458379, 80898, 60941, -32924, -204578, 211831, -171496, 38131, 78958, 12923, 324303, 284581, -376926, 12250, 204346, -16775, 154347, 3855, 213762, 1900, 247077, -138478, 49867, -27369, 30016, -132569, -46611, 137962, -75024, 124324]
15118C13512h1899A52828d1767A37389a7044j16128B66825a29136B07040D7750
15107B38225a9745A18335J11908N6280j16340a91196A43903E6394J48212K7517
15097B32123O2699Q7502j21034b7353A52778J08928m7489a7147A42840K54577
15087C97417A11653K17453o2216a5254C75205k5210r9007J30629A31148j6858
15077A14290L01932j34711F0804J76887D8782j9499J8598J47935J01794A7526
15066B29524k6795L0717H5449L46668B11741d7504D3335K18975B9793a785H3780
15054I1836a50033A62845l6440J83789A29347a2096B91612r9299L6122M2590H4205
15042B91960r4989P6041n5475E7519L17226j62283j03691R1739d4495E02808e7669
$$ y = [313512, -81899, 152828, -41767, 137389, -17044, -133172, 266825, -129136, 207040, 47750, 238225, -19745, 118335, 230243, 286523, 170183, -191196, 143903, 56394, 204606, 232123, 294822, 382324, 261290, -27353, 152778, 261706, 214217, -17147, 142840, 397417, 111653, 329106, 266890, -15254, 375205, 349995, 250988, 381617, 131148, 114290, 416222, 281511, 60804, 237691, 48782, 29283, 47881, 195816, 297610, 17526, 229524, 202729, 233446, 85449, 432117, 211741, -47504, 43335, 262310, 29793, -1785, 83780, 91836, -150033, 162845, 126405, 310194, 129347, -12096, 291612, 192313, 228435, 271025, 84205, 291960, 196971, 273012, 217537, 57519, 374745, 212462, 108771, 200510, -44495, 502808, -57669]
15030b69364D54227j97328A3449k875L44536E0884d8240F6483J2112J44257N6425
15019B79277H1259N1323E6962e6197q3420B62251m2058e8917C76085H054J38224
15008A46278O1515p1819b79043F05417d129C99252A86099G6409a25776A19060
14997E4638L66520j72055j18121J53364A09309K51976A75580L19777D1654O1934
14987A03588K05337A50642l8540J60264J83450g5807D73167c7058C30462A36897
14976A19162L45420j24324a61935E9389J58273E1258M24713a27519D54772K01472
14966F56244A49871P31450l90191n0290a50098C30998q466n1871K50444q4415
14956D36690K26131j95389b2432E71732B54269P6779j01601J55552A34530J79445
$$ y = [-269364, 454227, 256899, 13449, 10574, 355110, 50884, -48240, 66483, 78595, 222852, 279277, 81259, 132582, 56962, -56197, -139617, 262251, 220193, -58917, 376085, 8054, 146278, 207793, 135974, -279043, 605417, -4129, 399252, 186099, 76409, -125776, 119060, 54638, 421158, 249103, 130982, 284346, 109309, 361285, 175580, 495357, 41654, 103588, 308925, 150642, 112102, 272366, 455816, -75807, 473167, -37058, 330462, 136897, 119162, 464582, 340258, -161935, 59389, 217662, 51258, 475971, -127519, 454772, 656244, 149871, 881321, 491130, 440840, -150098, 330998, 322532, 270661, 521105, 436690, 662821, 467432, -22432, 571732, 254269, 331048, 229447, 384999, 134530, 313975]
14946C13975p3253J99033j64504A7053K58214j0909M2841J75976B26530Q9615
14936C16145K11702j24749A11460M15702B02594L28847n418B57637G9459k3554
14926E5905N12748a18666B50541l1227K67172A83904J1515J27902A54678k9513
14916A25165K3276K10996K85250j84641F3804K43299J08761q2838J49995r0892
14906C92129j2567E9920K07495q7608K9782o7776L23282K9740k35658j16357K66335
14895D09155j39082O9441A50699O10011k08457i095A82837p9432J21052L23164
14885E47621j86454k0317J41741j77386N3024L38815j00581k11713j08645j09322
14875A66783J43744m9994K29475O977B20755k702K14251k08541J67142J25445
$$ y = [313975, 240722, 439755, 275251, 17053, 275267, 264358, 307199, 483175, 226530, 316145, 527847, 403098, 111460, 527162, 202594, 531441, 526023, 257637, 79459, 55905, 568653, -118666, 250541, 219314, 486486, 183904, 195419, 323321, 154678, 125165, 148441, 359437, 644687, 460046, 63804, 307103, 415864, 333026, 483021, 392129, 379562, 59920, 267415, 179807, 209589, 141813, 465095, 494835, 259177, 142820, 409155, 270073, 339514, 150699, 760710, 552253, -9095, 182837, 103405, 224457, 547621, 361167, 340850, 482591, 305205, 358229, 697044, 596463, 384750, 276105, 166783, 310527, 260533, 490008, 496985, 220755, 218053, 432304, 223763, 390905, 516350]
14865E16350F817M28320R7208B38740o9989K84454j10656L3910J57925j75269
14855C59115J49852k12289j02184N58917l69283n5388Q6606A20469L76386b3122
14844B86337L67971k70336m8225L04203B92178K21937r319q0422j05330J0070
14834C29114R2300r3223K46080f7790B53970J95453r57P5093L13j19734J60897
14823E65035q5649l6039k77J2029O0341J41897B62029P02834l16208l05322K42221
14812E85554O6338L6575A96475M03499J92294l47860n2816L37281k18936O3595
14802E73532k24349K55926C00896J51009j42198N73846l07289R218L28817l09818
14792F04481O4188k83615K2957N1408j02740J53690m1912L01766k98008q8738
$$ y = [516350, 6817, 435137, 532345, 238740, 168751, 453205, 342549, 376459, 534384, 359115, 508967, 296678, 194494, 753411, 384128, 328740, 415346, 120469, 496855, -23122, 286337, 654308, 383972, 335747, 639950, 292178, 514115, 504796, 424374, 319044, 329114, 421414, 328191, 574271, -67790, 253970, 449423, 448466, 523559, 523872, 404138, 565035, 479386, 443347, 443070, 455099, 515440, 657337, 262029, 964863, 648655, 343333, 585554, 651892, 688467, 196475, 599974, 792268, 444408, 391592, 728873, 509937, 573532, 349183, 605109, 300896, 451905, 309707, 883553, 576264, 585482, 914299, 604481, 668669, 385054, 408011, 459419, 356679, 510369, 468457, 770223, 472215, 383477]
14782C83477M70813l66727J15524k80986K69628n2591O1597l8451J38196j71930
14772E28550j37048J86691L6314j248N6344L3839j56904N7259A20085N80358K65091
14761I65534l74795j46478L4001K13263j49873L17967k82489B54044N49975Q2211
14751H86230D36683l8198M60269L23963E88089A72716M61431j2201K82819k30642
14741F74123K48351O5294m02214N06983E44762R3519K73470Q9156k49362l3933
14731G17612K08672k33673j5806j8807K25635k75907M6473L4048N2062n8600M4636
14720G26345J41958K0234k62147K52895j82373K89326j38164l48732P9940J35543
14710G14825J27367m5329J37208o5760n3957K5981l1245J67337k97059M10343
$$ y = [383477, 854290, 487563, 603087, 322101, 591729, 539138, 600735, 562284, 700480, 528550, 391502, 578193, 614507, 613259, 669603, 703442, 546538, 603797, 120085, 700443, 965534, 590739, 444261, 478262, 691525, 541652, 859619, 577130, 254044, 804019, 886230, 436683, 398485, 858754, 1182717, 588089, 172716, 634147, 621946, 904765, 674123, 922474, 987768, 585554, 1092537, 544762, 638281, 911751, 1000907, 751545, 717612, 926284, 692611, 676805, 657998, 883633, 607726, 654199, 688247, 740309, 681709, 726345, 868303, 888537, 626390, 879285, 696912, 986238, 848074, 499342, 579282, 714825, 842192, 796863, 934071, 868311, 814354, 840335, 809090, 976427, 679368, 1089711]
14700A089711J68033m50703K8282K09364l50132M21017j27024R7403j4334n4521
14690A017096k4450R6151j38935J11764m6436r6316j84568L86247j22126r0086
14680I08341J61901j30261M04402m08672j51773J20714k804J68274K10365k72423
14670A008064J05355L4595j29541K76047k70397J53719n27914L82659n1925J27051
14660A107713k98812K95434j09366J55910j6199j65682O8036l40647M98253j75780
14650A018860K22292p6574o0568j54435K26272p8052p2173J36011J02903l7419
14640A227117M54966m22593L07130l48629j24749L09180P1266k6033j69994o9164
14630A208497J32173l69873N45890j90786j20365J46280j26310J50171M5740J49387
$$ y = [1089711, 1257744, 807041, 835323, 1044687, 694555, 1115572, 988548, 1085951, 1071617, 1017096, 992646, 1088797, 949862, 1061626, 1015190, 918874, 734306, 1120553, 998427, 908341, 1070242, 939981, 1344383, 935711, 783938, 904652, 901848, 1070122, 1280487, 1008064, 1113419, 1148014, 1018473, 1294520, 1024123, 1177842, 649928, 1032587, 980662, 1107713, 808901, 1104335, 994969, 1150879, 1134680, 968998, 1037034, 696387, 1194640, 1018860, 1241152, 1164578, 1104010, 949575, 1175847, 1097795, 1025622, 1161633, 1264536, 1227117, 1682083, 1259490, 1566620, 1217991, 1093242, 1402422, 1473688, 1447655, 1277661, 1208497, 1340670, 970797, 1516687, 1325901, 1205536, 1351816, 1225506, 1375677, 1421417, 1570804]
14620A570804l10769M16830J31200J96602m60186k47063l340J87431L08440k87855
14610A502094N6705P2295K21514n58592M00934j49396L3146J99632K2980J29259
14600A930571k05318J11981L27756l48998K01200k40108j02203J95360l75561
14591A494680k36684N92112Q6721n9166k02479L24431j88910l6492L48600q4136
14581B038677j29200Q2926L48344k89123L85342n58632L59228P2312k7305m36800
14571A845769K95112L44549l84723J02019J08908r8821K4802N33413k3978j18284
14561B628766l4683L3429M31743j16143K9897L88622j72859N79068l5225M32474
14551D165089K45719J756671J523504M585195P664076J8567606Q600938B1729949
$$ y = [1570804, 1260035, 1676865, 1808065, 2004667, 1544481, 1297418, 1294078, 1481509, 1789949, 1502094, 1558799, 1631094, 1852608, 1294016, 1694950, 1545554, 1578700, 1778332, 1801312, 1930571, 1725253, 1837234, 2164990, 1815992, 2017192, 1777084, 1674881, 1870241, 1494680, 1257996, 1850108, 1936829, 1877663, 1675184, 1999615, 1810705, 1774213, 2122813, 2038677, 1909477, 1992403, 2340747, 2051624, 2436966, 1878334, 2237562, 2309874, 2282569, 1845769, 2140881, 2485430, 2100707, 2202726, 2311634, 2212813, 2237615, 2771028, 2747050, 2628766, 2594083, 2627512, 3059255, 2943112, 2973009, 3361631, 3188772, 3767840, 3732615, 4165089, 4410808, 6167479, 7690983, 12276178, 19940254, 38507860, 47108798, 21729949]
14542A2148919n270730l210527r89556o91293K81007k10025p4059m6474O2116
14533A999378k68806O75077j80124j8397K7242J06037l90585J92530k07682Q16324
14523B750994n2809o92961R7612M39586j99682L47495M2675r7629R6532j5420
14513B716393k98612L10225M4064J52435j79592K70394m86776M14363K46617l5444
14503C154067k55918n7408M24161M9037J2620q1417k0132L239q8443K51127l43872
14492C047061K76694J75526q5976J35069K7537J16001K65128n9472k54153l2958
14482C610457M89171o11851O72396l85900j20481M84279J86578j21138p2441J28084
14472D259154j84366K46783k8651K91510p7768o003p6647O07531l94668J99160
$$ y = [12148919, 6878189, 3667662, 2678106, 1986813, 2267820, 2057795, 1983736, 1937262, 1999378, 1730572, 2405649, 2225525, 2207128, 2234370, 2340407, 1949822, 2142352, 1934670, 2750994, 2698185, 2005224, 2102836, 2542422, 2342740, 2690235, 2732910, 2635281, 2731813, 2716393, 2417781, 2728006, 2772070, 2924505, 2744913, 3015307, 2528531, 2942894, 3189511, 3154067, 2898149, 2840741, 3264902, 3313939, 3326559, 3245142, 3225010, 3228249, 3139806, 3390933, 3047061, 3323755, 3499281, 3413305, 3548374, 3575911, 3691912, 3957040, 3897568, 3643415, 3610457, 4099628, 3487777, 4160173, 3774273, 3653792, 4138071, 4324649, 4203511, 4131070, 4259154, 4074788, 4321571, 4292920, 4584430, 4506662, 4500659, 4424012, 5031543, 4636875, 4836035]
14462D836035k39125j7345N84625l42415K73777l107L07784m47037J78055j86351
14452D944896K54313J19671Q5954M3800M02361l16062J01416j38007K64345L86017
14442F148704n8974J61327n04124N06986J16273Q4640j72857O3476j47975L93554
14432F591030k9968L47202j19525N68719k72521J40958J19085K60528l42611M40427
14422G703324J49026K146k19500J49830M56854j41728O45326l38975L05680K19132
14412H931115P7908L55547K20907j78947K15039J8365K26400P9267N3806J26456
14402A0125863K46699O3654K45379L93711l07321N36424J55869K58975j38370
14393A1580883L25903J44608K48871N50138L23230J4800K61720M60076Q6017J45497
$$ y = [4836035, 4596910, 4579565, 5164190, 4821775, 5095552, 5092445, 5400229, 4953192, 5131247, 4944896, 5199209, 5318880, 5404834, 5448634, 5850995, 5534933, 5636349, 5498342, 5762687, 6148704, 6089730, 6251057, 5746933, 6253919, 6370192, 6454832, 6281975, 6345451, 6197476, 6591030, 6561062, 6908264, 6788739, 7357458, 7084937, 7225895, 7344980, 7605508, 7262897, 7703324, 7852350, 7854496, 7634996, 7784826, 8241680, 8099952, 8745278, 8406303, 8711983, 8931115, 9009023, 9364570, 9585477, 9406530, 9621569, 9639934, 9866334, 9945601, 9999407, 10125863, 10372562, 10436216, 10681595, 11075306, 10767985, 11304409, 11460278, 11719253, 11580883, 11906786, 12051394, 12300265, 12850403, 13173633, 13188433, 13450153, 13910229, 13996246, 14141743]
14383A4141743J51497L18812M88706L06579K14266L33519O1829P0009N80296J55495
14373A6822751M26812J98506M78773m0701Q88192K03632K02555N88246O78844
14364B0447610P2996M40332K87139J073021L54006L84825L92498P86491P20727
14355B4959645K60947M86323P21374O61640N21809R64830N36216J016910N19133
14346C0648827P27970P59436J294750M47689R22755Q37281J365489J203370P07694
14337C8915261J566325J007493O80509J561423J230336J696417J426925J330172
14329D9414861J765889J486211K033559J467044K075539J977466J905073K214876
14321F4340518K188776K645822K436448K247818K785225L098780K788270L479533
$$ y = [14141743, 14293240, 14612052, 15100758, 15407337, 15621603, 15955122, 16016951, 16086960, 16667256, 16822751, 17249563, 17448069, 17926842, 17886141, 18774333, 18977965, 19180520, 19768766, 20447610, 20520606, 20960938, 21248077, 22321098, 22675104, 23059929, 23452427, 24238918, 24959645, 25220592, 25706915, 26428289, 27089929, 27611738, 28576568, 29112784, 30129694, 30648827, 31376797, 32136233, 33430983, 33878672, 34801427, 35638708, 37004197, 38207567, 38915261, 40481586, 41489079, 42169588, 43731011, 44961347, 46657764, 48084689, 49414861, 51180750, 52666961, 54700520, 56167564, 58243103, 60220569, 62125642, 64340518, 66529294, 69175116, 71611564, 73859382, 76644607, 79743387, 82531657, 86011190]
14313H6011190L566454L157734L955877L792094M568301M172203M989511N058783
14305A19272147N102395N835404O036989N881785O617490O939135P764225P516219
14297A70965789P823656R150879Q952473R990295J0390989J0729910J1424739
14290B39428730J2122145J2054016J3152254J3812041J3808878J4829242J4373198
14283C33580504J5038347J5206878J5038281J4944497J4685421J3699543J3333559
14276D35527030J1853427J0598733Q022525K524372o7148J53147l59633j670901
14268D66581552n039853n365887l953372r254798j1529079j3689069j4816958
14261D02932536j5899028j6166018j5992897j6403014j5917251j5795449j5012977
$$ y = [86011190, 89577644, 92735378, 96691255, 100483349, 105051650, 109223853, 114213364, 119272147, 124374542, 130209946, 136246935, 142128720, 148746210, 155685345, 163449570, 170965789, 178789445, 187940324, 196892797, 206883092, 217274081, 228003991, 239428730, 251550875, 263604891, 276757145, 290569186, 304378064, 319207306, 333580504, 348618851, 363825729, 378864010, 393808507, 408493928, 422193471, 435527030, 447380457, 457979190, 466001715, 468526087, 468458939, 468612086, 468252453, 466581552, 461541699, 456175812, 452222440, 442967642, 431438563, 417749494, 402932536, 387033508, 370867490, 354874593, 338471579, 322554328, 306758879, 291745902]
14254B91745902j4641956j2723456j3601392j2367617j2138127j1632071j0415451
14247B04225832j0057043r631765r080949q054916p802401p421539p373100o845262
14239A37958857o083759n344365n981761m966891n163460m570042m401298l726184
14231I7721097l392529l893854l740088l038354l448881k676956l123943k649850
14223G1756642l038201j870137k297733k177689k019081k144222j900159j696461
14215E4612959j892134j162272j571752j745553j364957j447920j301102j175670
14207D2951599q39508j149119j279966j514655r04622r50051o89554n32521j254038
14198C3837565j032961q59501j158760o42666n49603n63707p01438r81833l46248
$$ y = [291745902, 277103946, 264380490, 250779098, 238411481, 226273354, 214641283, 204225832, 194168789, 184537024, 175456075, 167401159, 159598758, 152177219, 144804119, 137958857, 131875098, 126530733, 120548972, 115582081, 110418621, 105848579, 101447281, 97721097, 94328568, 90434714, 86694626, 83656272, 80207391, 77530435, 74406492, 71756642, 68718441, 66848304, 64550571, 62372882, 60353801, 58209579, 56309420, 54612959, 52720825, 51558553, 49986801, 48241248, 46876291, 45428371, 44127269, 42951599, 42112091, 40962972, 39683006, 38168351, 37263729, 36313678, 35624124, 35091603, 33837565, 32804604, 31945103, 30786343, 30143677, 29594074, 29030367, 28328929, 27347096, 27000848]
14189B7000848o54375q00593m49170q35327m91418l75484o69491m54202m38896
14180B1831892j95331m99754n56187l60534o05860j41203n11061j29659p41803
14171A8090500Q6871n53206m35644j63186o25085m92377j85208r4559k13425l57641
14161A5057040k56156k84416k67729j58589M09p68690m7946M055k59118l83822
14151A2635038O0393l71329n1237l76068k17610n8799j11758j73039o09741P9525
14141A0805375l1681k77795k10860m44456K84294j28711k45425K65957p05173
14132I311525j06569n138O7122j40778l45657P8606l56406K16585j56500r6761
14122H466029m17289M4937j10413M7276k28267k27773K18191o21455K50745j30136
$$ y = [27000848, 26346473, 25545880, 25096710, 24261383, 23769965, 23394481, 22724990, 22270788, 21831892, 21636561, 21136807, 20580620, 20220086, 19614226, 19473023, 18961962, 18832303, 18090500, 18177371, 17624165, 17188521, 17025335, 16400250, 15907873, 15722665, 15628106, 15414681, 15057040, 14800884, 14516468, 14248739, 14090150, 14090559, 13321869, 13273923, 13277978, 13018860, 12635038, 12695431, 12324102, 12272865, 11896797, 11679187, 11620388, 11508630, 11335591, 10725850, 10805375, 10773694, 10495899, 10285039, 9840583, 10124877, 9996166, 9750741, 10016698, 9311525, 9204956, 9199818, 9266940, 9126162, 8780505, 8859111, 8502705, 8719290, 8562790, 8466029, 8048740, 8093677, 7983264, 8030540, 7802273, 7574500, 7792691, 7171236, 7421981, 7291845]
14112G291845n3653j10775k40491j15271N1112n28099L85805J63591l54829k85399
14102F203836j55666L64027k87345r2450k7722j04243J40361l06957j31739K68769
14092E870871k32602k0763l71957M44255k77923J44497k03203m1913k52044J3375
14082E072593L01824m08167j40449J92763m3554j85182N2614j13233K26529m6260
14072D909478m67770j15818K82566j34877K4777k23471L71186m00978r7055R0472
14062D238510j55360J44318k01793N75258m11098k37425L21264r8397k2042j70131
14052C983104j53247n1803j22706M45487n96922Q8235J61810n2142j76745l03141
14042C221930K23125j20812O2150m17508M47513k98430J61162j66376J97376r0578
$$ y = [7291845, 7238192, 7127417, 6886926, 6771655, 6822767, 6294668, 6680473, 6844064, 6489235, 6203836, 6048170, 6412197, 6124852, 6032402, 6004680, 5900437, 6040798, 5733841, 5602102, 5870871, 5638269, 5617506, 5245549, 5689804, 5411881, 5556378, 5353175, 5311262, 5059218, 5072593, 5374417, 4966250, 4825801, 5018564, 4975010, 4789828, 4842442, 4729209, 4955738, 4909478, 4441708, 4325890, 4608456, 4473579, 4498356, 4274885, 4646071, 4245093, 4148038, 4238510, 4083150, 4227468, 4025675, 4600933, 4189835, 3952410, 4273674, 4175277, 4153235, 3983104, 3829857, 3778054, 3655348, 4100835, 3503913, 3592148, 3753958, 3701816, 3525071, 3221930, 3445055, 3324243, 3386393, 2968885, 3416398, 3117968, 3279130, 3112754, 3310130, 3219552]
14032C219552k48212J70550J67229k75766j03399L57330k52140k1598k18690j81493
14022B613363R9945l0848J06294J39047k47152k2730J75426K2867l59092J32633
14012B629753k2618J4955k28058J40839q909m5259N5232o5808m1534N2466q5604
14001B395455l62767Q8950J0771q3569k18220L27378k44831M31378K9624j98984
13991B175185L21320L24694J178533L121713O024447J6987385J8799419k1497799
13983B7434897j2397320o385326k679504j562119k35963m32815k54663l53948
13975C133239j29595j687l68611j02230J7366J09749j45644R551k39365p2022
13965B210751L9236N4266j07851l41298K46589K91960l54078J14678K52247n04094
$$ y = [3219552, 2971340, 3141890, 3309119, 3033353, 2929954, 3287284, 3035144, 3013546, 2794856, 2613363, 2713308, 2682460, 2788754, 2927801, 2680649, 2657919, 2833345, 2856212, 2497120, 2629753, 2607135, 2622090, 2394032, 2534871, 2525962, 2480703, 2535935, 2470127, 2428593, 2481059, 2395455, 2032688, 2121638, 2132409, 2048840, 1830620, 2157998, 1913167, 2344545, 2374169, 2175185, 2496505, 2821199, 3999732, 7121445, 13145892, 30133277, 48932696, 27434897, 15037577, 8652251, 5972747, 4410628, 4174665, 3741850, 3487187, 3133239, 3003644, 3001957, 2633346, 2531116, 2548482, 2658231, 2512587, 2522138, 2282773, 2210751, 2249987, 2304253, 2196402, 1855104, 2101693, 2393653, 2039575, 2154253, 2406500, 1902406]
13955A902406P3760p0424j46822J48789k10354K05938N6886j93426J52490j17052
13945A802191J61744j77026J56634j70574o9446L44685l71972N8323P4076j67729
13935A640906J35860J6254k6140l4801K6946k86164M28229n40087L17817j73926
13925A504894J59220p5618k1421l48545J77344K38847R294L77433m13382r6066
13915A512000p0177j4896L06647l52052O6960j05420J3665J5783L20552n00464
13905A192598K05916Q6790j70386J09789J67328j14222p2491j02187K62481k07515
13895A358101L8424R2557k29563J1211K13483m18886k6893M94343l2818k20396
13885A279563j13640l4997N3914l0705Q2512L8784j7958j68565Q2891j89445J86230
$$ y = [1902406, 1976166, 1905742, 1758920, 1907709, 1697355, 1903293, 1960179, 1766753, 1919243, 1802191, 1963935, 1786909, 1943543, 1772969, 1703523, 2048208, 1676236, 1734559, 1808635, 1640906, 1776766, 1793020, 1766880, 1732079, 1759025, 1472861, 1901090, 1361003, 1678820, 1504894, 1664114, 1588496, 1567075, 1218530, 1395874, 1634721, 1644015, 2021448, 1608066, 1512000, 1441823, 1426927, 1733574, 1381522, 1448482, 1343062, 1356727, 1372510, 1693062, 1192598, 1398514, 1485304, 1314918, 1424707, 1592035, 1477813, 1405322, 1303135, 1565616, 1358101, 1396525, 1489082, 1259519, 1270730, 1484213, 1065327, 1038434, 1532777, 1499959, 1279563, 1165923, 1130926, 1184840, 1154135, 1236647, 1275431, 1257473, 1088908, 1171799, 982354, 1168584]
13874A168584L3497O2345J95798k66871p0006K75001k68689K55169Q022l07729
13864A085121r3865l422r0187J01722J74286K8564O1349j2494r0694j37103l3637
13853I89640P4443j08233K15622J10493m8515k35886J50883l2618j77336K56897
13843A195390k47722K14764m4780j84334Q6533l04105k9749M71152r5629k39641
13833H21879K30463j36326L66584m99647L61918j86026J61746l83822o116n54
13823G30099K41411j07055P5061r5009K33830k30445J09628j32052L30610N9298
13813A215376k95106j03882k3943P5210J56192q8842L800n7901M1259p0532k0888
13802H30743m0340J67471l38359L4025O5356Q1108j97547K0259O67096l70699
$$ y = [1168584, 1202081, 1264426, 1460224, 1193353, 1123347, 1398348, 1129659, 1384828, 1392850, 1085121, 991256, 987834, 897647, 999369, 1173655, 1202219, 1263568, 1251074, 1160380, 1023277, 989640, 1064083, 955850, 1171472, 1281965, 1233450, 997564, 1148447, 1115829, 938493, 1195390, 947668, 1162432, 1117652, 933318, 1019851, 715746, 685997, 1157149, 1061520, 821879, 1052342, 916016, 1282600, 782953, 1144871, 958845, 1120591, 736769, 730653, 730099, 971510, 864455, 939516, 844507, 1078337, 847892, 957520, 825468, 1156078, 1215376, 920270, 816388, 792445, 867655, 1023847, 935005, 938805, 880904, 922163, 851631, 830743, 790403, 957874, 619515, 653540, 718896, 800004, 602457, 622716, 1289812, 919113]
13792I19113j85890j86140K50694l47815K51510Q4280j09718o3900R7650L91188
13782A100972k54412o4920J16187N7074k84004l3055K12799r9893p6985k9350
13772F44413n9196J94349K51209k14582l43973K44698k37306J25549p7006p8720
13762D49435M29131j76562L6981J2190J68196l46760n8317J95490j29148K06993
13752G87629j64246l6160K03777j86103R1277j56418K76317l56914m7821M19207
13742H30545j13711O8740J0732M8232r6278C60804M15587r1823k87167K67018
13732F64419B65177L97043L2266r5130p8531B48185J63237M28630k17328j33705
13722D89019j10691o5619K66085j31143J39908L0082K9582j63166K40145j26282
$$ y = [919113, 733223, 547083, 797777, 449962, 701472, 785752, 676034, 612134, 709784, 1100972, 846560, 781640, 897827, 954901, 670897, 637842, 850641, 750748, 673763, 644413, 585217, 779566, 1030775, 816193, 472220, 716918, 479612, 605161, 528155, 449435, 878566, 702004, 738985, 751175, 919371, 572611, 514294, 709784, 580636, 787629, 623383, 587223, 791000, 604897, 696174, 539756, 816073, 459159, 411338, 830545, 716834, 785574, 796306, 844538, 748260, 360804, 776391, 684568, 397401, 664419, 265177, 662220, 694486, 599356, 520825, 248185, 411422, 840052, 622724, 489019, 378328, 312709, 578794, 447651, 587559, 617641, 647223, 484057, 724202, 597920]
13712E97920j10562J09009B02462M13465j31865j06501M38861k73701P8052k16780
13702D03993K14641j74182J4659n9146J70061k1112B69074J3830L72357k35914
13692D19347L85978C80194L14058B86031J52566j70421M05903p8959q3097j30818
13682C81205R8003A84128M23485p3753L2358j57365L79440B49882L86772k09780
13672D26874K20241q6954j06334j78074J98184k34135R4749K39836j53252J86558
13662F07693L72512C96125D8952K28526K82462l9723B08339J88044q5605m3872
13652B66906K24874I1464O0372M13701k02239k4516m9944O5140P9215J39128A90963
13640E56207j13396o0885K71989j35512j32992p3141Q6429A66283N56893k46274
$$ y = [597920, 487358, 596367, 202462, 615927, 484062, 377561, 816422, 542721, 620773, 403993, 618634, 444452, 459111, 399965, 570026, 548914, 269074, 282904, 655261, 419347, 805325, 380194, 694252, 286031, 438597, 268176, 674079, 595120, 512023, 381205, 479208, 184128, 607613, 533860, 566218, 408853, 788293, 249882, 636654, 426874, 647115, 560161, 453827, 275753, 473937, 239802, 334551, 574387, 421135, 607693, 980205, 396125, 48952, 277478, 559940, 520217, 208339, 396383, 310778, 266906, 491780, 91464, 151836, 565537, 363298, 338782, 288838, 353978, 433193, 572321, 190963, 556207, 442811, 381926, 653915, 518403, 385411, 312270, 398699, 166283, 723176, 476902]
13630D76902L3543A44954M38381p4298l1060O366j0470K04588B74323J88331k07735
13619B54919L65779r8379j73081j30689n8589L10026A59981N7894L11178j98322
13609C30731P2393o6741r5189L52139r9171n9338j06368k5853K43413j90114q1828
13598B74074p7022K50796j71670n6458R6842J41141B24074J06739L7952O6452
13588D35217L8768L3924I9229J2149J04566L08169k54104n0979B6456O89659k17890
13577D98225B05856Q2848M1234M13211l59809F9281K19032J57396p0482j45439
13567B29788J19313r5802K33170B18865l5379J07599J56227r8142J70165B42095
13556B36017j03753Q6176r653P7811F8624K10475J78101A63539K334C9250L65626
$$ y = [476902, 510445, 144954, 583335, 509037, 477977, 484343, 473873, 678461, 274323, 462654, 254919, 620698, 522319, 349238, 218549, 159960, 469986, 159981, 217875, 529053, 330731, 403124, 336383, 241194, 593333, 494162, 434824, 328456, 302603, 546016, 355902, 274074, 197052, 447848, 276178, 219720, 316562, 457703, 224074, 330813, 368765, 435217, 473985, 507909, 99229, 111378, 215944, 524113, 270009, 219030, 26456, 716115, 498225, 205856, 288704, 329938, 743149, 383340, 69281, 288313, 445709, 375227, 229788, 349101, 253299, 486469, 218865, 183486, 291085, 447312, 349170, 519335, 242095, 236017, 132264, 218440, 208787, 286598, 68624, 279099, 457200, 163539, 165873, 39250, 404876]
13545D04876j16156K01922j51441n409F8034L43327K66993B05415q4880M13359
13535E33894B61566j0124J03206K24331j05499n4438j33758q8939m4886L25852
13525D77311M9936k61397A21695M38900j86797j75063L23575A36740J42337j07088
13515A71989J22052I2832N8065K56048A83860L7633L24590d7060A97675E3683
13504A45896l9945J98735A35756L44638k34019o1144A1985L90873j65060J07709
13494C45507j32654K9277K64507p8394o9840o936A65779K46403M1972m5527j90526
13483B18101a92107B67355l0250j8776k453N50576k20677A62079O01628B05402
13472B73946M89402l52174j53018a83694B99664J08040A79723K23002J26582d2060
$$ y = [404876, 288720, 490642, 339201, 333792, 68034, 411361, 678354, 205415, 120535, 533894, 261566, 251442, 354648, 578979, 473480, 419042, 285284, 196345, 151459, 477311, 527247, 265850, 121695, 560595, 373798, 198735, 522310, 136740, 279077, 171989, 294041, 92832, 150897, 406945, 183860, 221493, 546083, -47060, 197675, 53683, 145896, 105951, 304686, 135756, 480394, 246375, 185231, 11985, 402858, 237798, 345507, 212853, 242130, 506637, 428243, 358403, 351467, 165779, 412182, 454154, 408627, 218101, -192107, 267355, 237105, 218329, 215876, 766452, 545775, 162079, 763707, 205402, 273946, 763348, 411174, 258156, -183694, 299664, 407704, 179723, 402725, 529307, -42060]
13461A60016J8105A8768N30572A41881a61071B95012b475E6062K47442J94519
13451D98023B12444J01032r0871a63394A80107J38652O3867P0316A41879B9705
13440C82525A60586J85755f7766A84849K93191q1726G3680J34848K63626j12016
13430C60138a93255N9570c7582A84015d6814H9179K65489j22996J4422P885I1610
13418C60906Q357j53420J06654a9818C42467k9480j26896J29535g5688B02168
13407B55883Q5185N4204E413J79827o332f3467F1601K33342q9169J12739b04227
13395I700L99945j60802o1341N4693J40213K2404G6812K45447j57343C6482d5728
13383A26560J90284A4721N39169k71846j06830L6990n5362G87L64322e7597A72882
$$ y = [160016, 178121, 18768, 549340, 141881, -161071, 295012, -2475, 56062, 303504, 498023, 212444, 313476, 222605, -163394, 180107, 318759, 382626, 452942, 141879, 29705, 382525, 160586, 346341, -67766, 184849, 478040, 396314, 73680, 208528, 472154, 360138, -193255, -133685, -37582, 184015, -46814, 89179, 354668, 231672, 246094, 253979, 91610, 360906, 369263, 215843, 322497, -19818, 342467, 312987, 186091, 315626, -75688, 202168, 255883, 341068, 395272, 5413, 185240, 178908, -63467, 61601, 294943, 205774, 318513, -204227, 9700, 409645, 248843, 187502, 242195, 382408, 404812, 76812, 322259, 164916, 36482, -45728, 126560, 316844, 14721, 553890, 282044, 175214, 212204, 156842, 787, 365109, -57597, 172882]
13371C63528j56279J4134m4248K15806p4420L29035j25571B22900a90062D62958
13360E31894A31687G67L68K40731l3960G4768J96826J30814A07328a26500B40364
13348A510L72093j03949J45726k1738F0961L73530j04586n8586q658q6964L07830
13337D83527q8900A88239M07962B84544L9123E9899e9510B20210J50154j07369
13327B62995K63097A29681K00687o4495A00022J80459K84466k35636J56016B12649
13316I6892K61932H882M0700a2078I8507j4198J05936a22043C19974J3721G19
13304C53305H7014A7016J75324C0356d8360B48572I8411m7279J88555E4192K21138
13293B75330D3290Q0361K5247o0686K80890i8047B29335m3814L96266a40066A62884
$$ y = [363528, 207249, 221383, 177135, 392941, 318521, 647556, 521985, 222900, -190062, 462958, 531894, 131687, 767, 1135, 241866, 207906, 74768, 271594, 402408, 107328, -126500, 240364, 1510, 373603, 269654, 415380, 393642, 60961, 434491, 329905, 271319, 262661, 175697, 483527, 394627, 188239, 596201, 284544, 323667, 59899, -59510, 220210, 370364, 262995, 526092, 129681, 330368, 265873, 100022, 280481, 564947, 329311, 485327, 212649, 96892, 358824, 8882, 49582, -12078, 98507, 84309, 190245, -122043, 319974, 333695, 719, 353305, 87014, 17016, 192340, 30356, -48360, 248572, 98411, 51132, 239687, 54192, 275330, 43290, 123651, 148898, 88212, 369102, -98047, 229335, 185521, 581787, -140066, 162884]
13281D46627E0360R5286k3837N023a72423e7527F3542b01280B65848j16765K14730
13270C63813j49091O7938j24802o4955J09431I4446A2540J01765e0335B99416
13259C87955A8187L69493A31728J71501e9836A3057R4551L5099J70480A7132a17745
13247B14509r3448k3904C2085J03849D1012K57269e2261I2119L3595k2067J24356
13236B28003j07196a6107p4678A54668b49691I7878C6016a89769B06616A8775
13225e0081l41091C69999A29502J64518b68119E2165B4518i6769B20170J63302
13215C83472a38098F3382Q3609r393f5901B91252b04048c284A94806O8313c1217
13203G366J13788K76243A07633n635N8383J23746j8521a68314m2298c3383B25614
$$ y = [446627, 50360, 145646, 121809, 126832, -172423, -57527, 63542, -201280, 265848, 149083, 363813, 214722, 282660, 157858, 92903, 202334, 94446, 12540, 114305, -50335, 299416, 387955, 18187, 387680, 131728, 303229, -59836, 13057, 107608, 142707, 313187, 17132, -117745, 214509, 121061, 97157, 32085, 135934, 41012, 298281, -52261, 92119, 125714, 103647, 228003, 120807, -16107, -90785, 154668, -249691, 97878, 36016, -189769, 206616, 18775, -50081, -391172, 369999, 129502, 294020, -268119, 52165, 24518, -96769, 220170, 383472, -138098, 63382, 146991, 137598, -65901, 291252, -204048, -3284, 194806, 263119, -31217, 7366, 121154, 397397, 107633, 101998, 160381, 284127, 265606, -168314, -210612, -33383, 225614]
13191B66271E6313b574A30160B3346K72112b15067H2509K00391a49686A62469
13180C56524I7543M3108M7574J54436D7908b9518B39930O8859O9429A67614H255
13168a4944G3851a31789A95761c8836B5332J66840k5139b45884B23804a31914
13157f8451B57588J1439b23145H5067i205B18855b87701B72764A11917J19573
13147B31490j1058N3916c09415h3288c9918E37453a32943H2069a23765H1537J74661
13136B56198b23287i1011B46802b4419A02623m5755a86856n4336B43434O6870
13126C10304A09078a47003A32272a44800j48805a40213l3452E238K16324L751
13116B25313A00771j9795J24298a16809I5715a29157B53106A22736i9986A46663
$$ y = [266271, 56313, -2574, 130160, 23346, 295458, -215067, 82509, 282900, -149686, 162469, 356524, 97543, 140651, 188225, 342661, 47908, -29518, 239930, 308789, 378218, 167614, 8255, -14944, 73851, -131789, 195761, -38836, 25332, 192172, 167033, -245884, 223804, -131914, -68451, 257588, 269027, -223145, 85067, -9205, 218855, -287701, 272764, 111917, 231490, 220432, 274348, -309415, -83288, -39918, 537453, -132943, 82069, -123765, 81537, 256198, -223287, -91011, 246802, -24419, 102623, 56868, -186856, -241192, 243434, 310304, 109078, -147003, 132272, -144800, -293605, -140213, -173665, 5238, 221562, 225313, 100771, 80976, 205274, -116809, 95715, -129157, 253106, 122736, -99986, 146663]
13105A7024K42122A0874J4677e8447m2032A61074J81184A43929c70948D4380J01676
13094A46056M5270D6413J71079a30838r5525A93711H9620R218P9304J2820n9350
13083A31612K39247A76832D9055c5691F3865R8313K50749j46174C5844J05074
13073A40918J14653K0534c071A74972b8264F9713J47467H9649J44588k5215N8486
13062B67508H8180d1079F02209k63927B8354c83092G2614O1480e8828B12487N2676
13051B65163m5550D4924J1267P6765a82304D1029g1382J162A75580C9186J89915
13040B29101J50709B1702K12487O0265a49988j28743b2960Q026m632n16068a16355
13028F8491j1818J08216q0834J1672J56718k1000e3073A12265g9830C34740A20743
$$ y = [17024, 259146, 10874, 25551, -58447, -100479, 161074, 342258, 143929, -370948, 44380, 146056, 191326, 46413, 217492, -130838, -226363, 193711, 89620, 98838, 178142, 190962, 131612, 370859, 176832, 49055, -35691, 63865, 162178, 412927, 266753, 35844, 140918, 255571, 276105, -3071, 174972, -28264, 69713, 217180, 89649, 234237, 209022, 267508, 88180, -41079, 602209, 338282, 28354, -383092, 72614, 134094, -58828, 212487, 265163, 219613, 44924, 56191, 132956, -182304, 41029, -71382, -70220, 175580, 39186, 229101, 379810, 21702, 234189, 294454, -149988, -278731, -22960, -14934, -19566, -535634, -116355, 68491, 56673, 164889, 84055, 95727, 252445, 231445, -53073, 112265, -79830, 334740, 120743]
13016a83759B8024L03705j52668B1104N3879M6591L92792A59734a14748A33085
13005a52067C5709K12675g6960B06083E1751K24165A23369J0303A7489a74948
12994C63819b48700H7721b5281q0021H5294K18749H1222K0999m987J02006b9140
12982A34247k581a06116M5024C46921i7011C05881j45591j9743o9120K32489b20512
12970c57531C83102e6598H653R6095N8181n9502K017K7675J444K4256A5523K40744
12958B56267I2909P1869D1075a55953A15396M9720e5532q4978m4831C22735a14697
12946B5744M40293C295L95502f2846j60801K3304Q1955L0205n3487k7855J7455
12935a52070A45963R7686E1181k0875K80899j30669E6799P6826h7107D1161j2445
$$ y = [-183759, 28024, 331729, 179061, 21104, 74983, 121574, 514366, 159734, -114748, 133085, -152067, 35709, 248384, -76960, 206083, 51751, 275916, 123369, 133672, 17489, -174948, 363819, -248700, 87721, -25281, -105302, 85294, 304043, 81222, 102221, 97234, 199240, -29140, 134247, 131666, -106116, -61092, 346921, -97011, 305881, 160290, 140547, 71427, 303916, -220512, -357531, 383102, -56598, 8653, 104748, 162929, 103427, 105444, 133119, 134563, 158819, 15523, 256267, 92909, 164778, 41075, -155953, 115396, 165116, -55532, -140510, -185341, 322735, -114697, 25744, 466037, 3295, 398797, -62846, -223647, -200343, -118388, -88183, -141670, -169525, -152070, 145963, 243649, 51181, 30306, 311205, 180536, 56799, 133625, -87107, 41161, 28716]
12924B8716A0343J46271A0350b9043G8842K54948A31488a69551c9659j59677B35288
12912B8150L06840j28136a62400O4755K067F2653b63434a09895A35869K05287
12902C41156j08302a56363A14796b27392F6805e6664A2941Q9920k6605L4751e9919
12890A73886K67291D9060c3489B97283A32164a43961j4703B70371k4574b5984
12879d3629r1243j77076A29557o1666a51540A71093i701A21213l7343a6677A90767
12867a17614B17573d9286B062J83760b38214A94223a12224I8494a70140g1107
12856F8185a91062G720b07858F6590J23672c24968a22670F7224f8713E0410J20187
12845A70597H3832a7556Q167B11177m5401Q6768q1032f9928a5282A6387H72J10293
$$ y = [28716, 10343, 156614, 10350, -29043, 78842, 333790, 131488, -169551, -39659, -199336, 235288, 28150, 334990, 206854, -162400, -97645, -95578, 62653, -263434, -109895, 135869, 341156, 232854, -156363, 114796, -227392, 66805, -56664, 12941, 102861, 76256, 111007, -59919, 173886, 441177, 49060, -33489, 297283, 132164, -143961, -158664, 270371, 245797, -25984, -43629, -134872, -311948, 129557, 67891, -151540, 171093, -9701, 121213, 83870, -16677, 190767, -117614, 217573, -49286, 2062, 185822, -238214, 194223, -112224, 98494, -170140, -71107, 68185, -191062, 7720, -207858, 66590, 190262, -324968, -122670, 67224, -68713, 50410, 170597, 83832, -17556, -9389, 211177, 165776, 252544, 171512, -69928, -15282, 16387, 872, 111165]
12833A11165c91897C97314b29779E3410a05829B30880a80770h1117j65622b1665
12822c7430A14242c5722q1296K1418J4706E5544a41868B9049J45849C7029O615
12811D3644d10310a16974I0309b9288A73218e2006P618C47714P7666E3815b24169
12799a0118j80249n2616I4284a0342E0715p95K10147A9720e8686B80589K4282
12788C04871c91372A13899a97836a9760j49689Q0775C37136j22657J07691A3447
12777B15827G6705J55448c36078C51527A64260E270J18872J64683b78270J9811
12767b58459A06280a33923A15331h3331A7760e10796E8229a21550a8995I6689
12756i3124A59905o3015c7220j41782i39A79882J82702A64301d7344j96479B28711
$$ y = [111165, -391897, 397314, -229779, 53410, -105829, 230880, -180770, -81117, -246739, -21665, -37430, 114242, -35722, -117018, -95600, -80894, 55544, -141868, 29049, 174898, 37029, 43644, -410310, -116974, 90309, -29288, 173218, -52006, -44388, 347714, 425380, 53815, -224169, -10118, -190367, -242983, 94284, -10342, 50715, 49920, 260067, 19720, -58686, 280589, 304871, -391372, 113899, -197836, -19760, -169449, -88674, 337136, 214479, 322170, 13447, 215827, 76705, 232153, -336078, 351527, 164260, 5270, 124142, 288825, -278270, -258459, 106280, -133923, 115331, -83331, 17760, -510796, 58229, -121550, -18995, 96689, -93124, 159905, 96890, -37220, -179002, -939, 179882, 362584, 164301, -47344, -243823, 228711]
12744C02630c63110J55438O9493B82393R7012l2988j43421a01838m4692B22179
12733F0584P2602R7881I339g2212A0384N092L28735Q1065A6273a7420j46011B1008
12720C5882a20283B17659a99928B8990K31252G1143C2772a40847A54310P721l7512
12709A24519K66411A42657b0857l5376D24506a85455D297K62577K85786h1090
12698G7408C3750a00082M7701A73602J25434h5303A88142o7514l5209i0534q0783
12687a71317f0523B42740g4919J0325B74817p4795C7530B266P1603j992A2144
12675A5685M7285J8518A7919i9426E6248k6342M3426J14889d8505f457q770B5185
12662A34733c66046I2946a70017B30228d5418I5089R4500m1683P1491j06431J60772
$$ y = [302630, -363110, -207672, -138179, 282393, 379405, 346417, 202996, -101838, -146530, 222179, 60584, 133186, 231067, 9339, -72212, 10384, 15476, 344211, 425276, 16273, -17420, -163431, 21008, 35882, -120283, 217659, -199928, 28990, 260242, 71143, 32772, -140847, 154310, 162031, 124519, 390930, 142657, -20857, -56233, 424506, -185455, 4297, 266874, 552660, -81090, 77408, 33750, -100082, -52381, 173602, 299036, -85303, 188142, 120628, 85419, -90534, -171317, -60523, 242740, -74919, -64594, 274817, 200022, 37530, 2266, 73869, 71877, 12144, 15685, 62970, 81488, 17919, -99426, 56248, 29906, 73332, 188221, -48505, -6457, -15227, 25185, 134733, -366046, 92946, -170017, 230228, -45418, 95089, 189589, 147906, 219397, 112966, 273738]
12651B73738J7051h3117A90306g9530A09795K12188A6892b70693A22999k6949
12641I6050j304h8220o9981C08256b46665B45736g252A34062J7526L7825i9519
12629B97543b08108B33129B2184J02715L42438A23841h8058C7833N1018M9872
12619A38723M7371a54139B41720q6114J43134A09004a05123c5583B36426i5035
12608b06714K9526I0575g9886C46798j9768A46289J35334A16911a9290C88607
12597A62087e518B01446m0529L2910j101n1445m2454C5691L14316g6714A54981
12585B25150q6678E045a84548L3414C47634n0884a5637j34796f1730c0792B95715
12573E2461A9797b09616C4116O0247a72033C04715d527q1261A6340J33018Q7868
$$ y = [273738, 290789, -83117, 190306, -79530, 109795, 321983, 16892, -270693, 122999, 96050, 94746, -88220, -158201, 308256, -246665, 245736, -7252, 134062, 151588, 189413, -99519, 297543, -208108, 233129, 22184, 124899, 467337, 123841, -88058, 37833, 88851, 138723, 186094, -154139, 241720, 155606, 298740, 109004, -105123, -35583, 236426, -95035, -206714, -177188, 90575, -79886, 346798, 327030, 146289, 281623, 116911, -19290, 388607, 162087, -5518, 201446, 160917, 193827, 192726, 141281, 98827, 35691, 350007, -76714, 154981, 225150, 138472, 5045, -184548, -151134, 347634, 296750, -15637, -150433, -61730, -30792, 295715, 52461, 19797, -209616, 34116, 94363, -172033, 304715, -4527, -85788, 16340, 149358, 237226]
12562B37226p089J02615f7200I8036J09627L03271j94625m2784F7958m516B2353
12550A80120a14768r8112G3489a15716c2726n6813H6790b2822A21669b6563g221
12538B6764c42119E6541J54236c56744B21992c4752C3984N17956B09638b5481
12527G0557b26477g567j3659q7502C63118j42163E6386j7070L42363g9103B42760
12515G5525A1368O156P6608a1079k94631d7587j45836A67424a08510A55930l5409
12504A20521m6482O0809e9982H3659a90972C7435J19692G6191B2884a19328D8621
12492b56833A00482n643h8981K3859A69063c18659a3054r5795k06367a0647A76658
12480a48180j29986e0313j74864a5602P559C6871c49023B43935a62520B61738
$$ y = [237226, 230137, 332752, -67200, 98036, 207663, 510934, 316309, 273525, 67958, 63442, 22353, 180120, -114768, -212880, 73489, -115716, -32726, -89539, 86790, -22822, 121669, -26563, -7221, 26764, -342119, 56541, 210777, -356744, 221992, -34752, 33984, 551940, 209638, -25481, 70557, -226477, -7567, -21226, -108728, 363118, 220955, 56386, 39316, 381679, -79103, 242760, 75525, 11368, 17524, 94132, -11079, -305710, -47587, -193423, 167424, -108510, 155930, 120521, 74039, 134848, -59982, 83659, -190972, 37435, 157127, 76191, 22884, -119328, 48621, -256833, 100482, 94839, -88981, -65122, 169063, -318659, -13054, -108849, -315216, -10647, 176658, -148180, -278166, -50313, -225177, -15602, -8043, 36871, -349023, 243935, -162520, 261738]
12469a35740n07b1231C7033J26193F4587i9302L3098J7335j53321e9045J7160
12458d1885j8469p4478k5028A57029a50900D0541n895h1566A60624c2068l3216
12447f5284q185j27471K0292A2740b31304r2688E6346c0955B13743b42138A621
12435D1172a15229o2869L7540C65652A43457E9213c80110L8131A44154J6088b76650
12423b54567I9839J28621G9861f839n0151A26914a73156H5176a53566A11939a41960
12411D28481a04680o3632A50839g0367I8611K38300j57563i5205d5226l16979
12401c62205A77884b35043B36745a98916l93016A42779A6554L24001B1402R3207
12391A14609k6195h0532H0583P513a84746G1667L1794n115K04352A12784B9964
$$ y = [-135740, -136247, -21231, 37033, 163226, 64587, -99302, -66204, -48869, -202190, -59045, -41885, -60354, -134832, -159860, 157029, -150900, 40541, 34646, -81566, 160624, -32068, -65284, -73469, -200940, -180648, 12740, -231304, -323992, 56346, -30955, 213743, -242138, 1621, 41172, -115229, -178098, -140558, 365652, 143457, 59213, -380110, -341979, 144154, 160242, -276650, -254567, 99839, 228460, 79861, -6839, -56990, 126914, -173156, 85176, -153566, 111939, -141960, 428481, -104680, -168312, 150839, -70367, 98611, 336911, 179348, -95205, -45226, -362205, 177884, -235043, 236745, -198916, -591932, 142779, 16554, 340555, 21402, 114609, 88414, -80532, 80583, 88096, -184746, 71667, 103461, 98346, 302698, 112784, 29964]
12379A23853J53133b08658N6183M8464a6817j10237j56575a5454H8532e4300B33982
12367a63527B90974J45191A62793C0700J61475h8361a3592D270d3591a7020j39273
12356a56293B90351a35701b1154H7587c03935g1368n1532A04359c9851j22581
12346a62432L3441D1531b21101A85682F3924J65234J84952A96825d7967j07452
12336a55419C55144h7103L1832A97597f0756C07047F2189a57509k62463J62315
12326b57657f7867j6722A77931d0009j57903H1025K89261A50174a10925D0679
12315h659o2167F0133c6390l3196k3229r06B72396f9118A17208a09047K9170I1831
12302A21650a30233g387B1304b85054h9629b9108r8061j12682d3060B57341A19246
$$ y = [123853, 276986, -208658, -152475, -104011, -16817, -127054, -283629, -15454, 88532, -54300, 233982, -163527, 290974, 436165, 162793, 30700, 192175, -88361, -13592, 4270, -43591, -17020, -156293, 290351, -135701, -21154, 87587, -303935, -71368, -122900, 104359, -39851, -162432, -128991, 41531, -221101, 185682, 63924, 229158, 414110, 196825, -47967, -155419, 355144, -87103, -55271, 197597, -60756, 307047, 62189, -157509, -419972, -257657, -67867, -84589, 177931, -40009, -197912, 81025, 370286, 150174, -110925, 40679, -8659, -70826, 60133, -36390, -69586, -92815, -93721, 272396, -69118, 117208, -109047, -79877, 91831, 121650, -130233, -7387, 21304, -285054, -89629, -29108, -127169, -239851, -43060, 257341, 119246]
12290B60265c8377j37972h7575D2012e8693p1730E6958K93959d02838A96594J57424
12279C54018R733a44902c6777A78109J27787m221o0811K26254F5649J99704A28036
12267B3999J83355h6703H7899a3471j74191F3134L34061j65092J49762A19343
12256B46190a05393A01670C6772a3077B39494H0247J44998p289a29578C41131
12245a22280A9579J24531C0599b84917g960q7722I1499J53438B6159Q3225K93271
12234D02655e4989G7329b30744g8334B4733D584K56788r4820J44024D9160L02584
12223C51744r747Q3103j91407J1429K6092d4534A39323r161b9638j03407D6379
12211a06106B21143A00016h3414A8008g0265D50772J04281F4496b24730B05161
$$ y = [260265, -38377, -176349, -87575, 42012, -58693, -130423, 56958, 350917, -402838, 196594, 354018, 363751, -144902, -36777, 178109, 305896, 301675, 240864, 467118, 65649, 265353, 128036, 23999, 207354, -86703, 87899, -13471, -187662, 63134, 397195, 232103, 381865, 119343, 246190, -105393, 101670, 36772, -13077, 239494, 80247, 225245, 217956, -129578, 341131, -122280, 19579, 144110, 30599, -284917, -7960, -95682, 91499, 244937, 26159, 109384, 402655, -54989, 77329, -230744, -78334, 24733, 4584, 261372, 166552, 310576, 49160, 351744, 341997, 425100, 233693, 245122, 271214, -44534, 139323, 130162, -29638, -133045, 46379, -106106, 221143, 100016, -83414, 18008, -70265, 450772, 555053, 64496, -224730, 205161]
12200h187C41784A58905M6956J23708F1477K49896K63475I6380O1727R826J23534
12189B91467l8453J59638H1504O6068J62539A28211K41920h396A28243l5631J70687
12178B63299a5701A16682K29779N4914d8440B10173n4433J03597e0831B98634
12167A68303n2561J28602K28871F3770P3373M7703a3037A96291D4894e3041A52638
12155B97832j41745O2602j5046j6556M75332B64747a24141A4548Q8759a03067
12144I955K09109K06840g1275A04117E0124K7124J35873a7046E7827h6481k08860
12133b95341q393A61199a63299k371a3851E352K76430a58835j02229L8441P3543
12122a49080A53460l3708N1836P1164c7540B10180e26312A55380p6125D017J3546
$$ y = [-8187, 341784, 158905, 205861, 329569, 61477, 311373, 574848, 96380, 158107, 167933, 291467, 253014, 412652, 81504, 147572, 310111, 128211, 370131, -8396, 128243, 92612, 263299, -15701, 116682, 346461, 401375, -48440, 210173, 155740, 259337, -50831, 298634, 168303, 115742, 244344, 473215, 63770, 137143, 184846, -13037, 196291, 44894, -53041, 152638, 297832, 156087, 218689, 203643, 187087, 662419, 264747, -124141, 14548, 103307, -103067, 9955, 219064, 425904, -71275, 104117, 50124, 77248, 213121, -17046, 57827, -86481, -295341, -303734, 161199, -163299, -165670, -13851, 5352, 281782, -158835, -261064, -222623, -149080, 153460, 119752, 171588, 242752, -37540, 210180, -526312, 155380, 79255, 4017, 17563]
12111A7563b16615B34183i9820B9409K4490g743E0183b61824Q7201o1463d8543
12099a46157C31678B2476a4101A05581b8355m5786I5963J54291g2627A81890o9592
12088A12298C6329a0748j61978N3689j78449C32789k9672E8779J51740K50793
12078D61312j08005J180678P61523E75948A83900j4087A0662D890a5947A73156
12067B14411F7587a66523B1624b91475K013C9843L6381K61402I4406A3555i7866
12055A57299b9964j13527O1837b0986j94800g3071B10696B9731l845J03057g1536
12043b22047g661k03410A4941J24927F8389O2473e3859A03400b01148A02232B6164
12031C4070b41218B18194j5037A3993c31170Q0920R8512B91739J90721c6210F4
$$ y = [17563, -216615, 234183, -99820, 29409, 53899, -7743, 50183, -261824, -174623, -236086, -48543, -146157, 331678, 22476, -14101, 105581, -28355, -74141, 95963, 250254, -72627, 181890, 112298, 36329, -10748, -172726, -119037, -297486, 332789, 303117, 58779, 210519, 461312, 353307, 1533985, 2295508, 575948, 183900, 169813, 10662, 4890, -15947, 173156, 214411, 67587, -166523, 21624, -291475, -289462, 39843, 76224, 337626, 94406, 13555, -97866, 157299, -29964, -143491, -81654, -20986, -215786, -73071, 210696, 29731, 25886, 128943, -71536, -222047, -7661, -211071, 14941, 139868, 68389, 130862, -53859, 103400, -201148, 102232, 26164, 34070, -241218, 218194, 203157, 13993, -331170, -250250, -151738, 291739, 482460, -36210, 64]
12019B31619a05307c5670A09973J76900o3542b5580j27646B16552a93479B82875
12008B2322b6817A34053b37517F0732k573E861a37666J9314D6499a54046B24726
11996A36022D987b20049A62740L3796d04349a27236A04298b89749B42980c4472
11985A65749o2371c5813j11518J9052j51699g1369C32540a32648A74993C3458
11974B77259a58624a5895I2445d8017l10949C86460G5168a9705l6476k49030l30770
11963f35981b60747C49580I9601d4799H672O0362J05223p2698c26432D7475a50956
11951a02590D2642J61524F0969a02799j07597d3305A28440c05271J24963N9660
11941a20648A94173i9240b8640H7355a83215B2116a23022e7481k37402a22005
$$ y = [231619, -105307, -35670, 109973, 286873, 223331, -25580, -153226, 216552, -193479, 282875, 22322, -26817, 134053, -237517, 60732, 58159, 5861, -137666, -118352, 46499, -154046, 224726, 136022, 4987, -220049, 162740, 196536, -404349, -127236, 104298, -289749, 242980, -34472, 165749, 103378, -35813, -147331, -128279, -279978, -71369, 332540, -132648, 174993, 33458, 277259, -158624, -15895, 92445, -48017, -358966, 386460, 75168, -19705, -56181, -305211, -635981, -260747, 349580, 99601, -44799, 8672, 69034, 174257, 101559, -326432, 47475, -150956, -102590, 42642, 204166, 60969, -102799, -210396, -43305, 128440, -305271, -180308, -120648, 194173, -99240, -28640, 87355, -183215, 22116, -123022, -57481, -294883, -122005]
11930i4560j5368A02029J54479l3266o5370M9651i9547k75699H8899M3571a29262
11918A50882f8922j7691A08153l9031a72A73472a40414E6115k7049O3215c1857
11906a40737N608D5076a93410j90410e2421A04381d1976A66174h5248a3820n8456
11895g2276A4723M6559b79395D7356a65395e4551q9621k28710J69153k433n9551
11884b65713Q8329I7703a73667E2077K04227d62730E4547h8780r63R651l0268
11873a10360o6432B41445a97794K2600m8576h1287B99069j29863l8319l2915a11076
11861D5395a6307p8800k57728a19540A28428b19797h0824a5392C7446b15065D597
11849A88680a37695A45027L02770A36958d00340B15892n4833b23844H6306b21745
$$ y = [-94560, -109928, 102029, 256508, 223242, 157872, 207523, -99547, -375246, 88899, 132470, -129262, 150882, -68922, -86613, 108153, 69122, -172, 173472, -140414, 56115, 29066, 92281, -31857, -140737, -135129, 45076, -193410, -383820, -52421, 104381, -41976, 166174, -85248, -13820, -72276, 14723, 61282, -279395, 47356, -165395, -54551, -144172, -372882, -203729, -206162, -265713, -177384, 97703, -173667, 52077, 256304, -462730, 54547, -88780, -89743, -80092, -110360, -176792, 241445, -197794, -175194, -223770, -81287, 299069, 169206, 130887, 97972, -111076, 45395, -16307, -95107, -352835, -119540, 128428, -219797, -80824, -15392, 37446, -215065, 4597, 188680, -137695, 145027, 447797, 136958, -400340, 215892, 161059, -223844, 86306, -221745]
11838b07101B7906M1599a35347k4614I6092K50928c35453C7221j004b34943k52793
11827d87736e1117l3283G2479A8269g2766k52034P4243d3803J9530H7395a21773
11815G2464c93665D15353e9057o5371A43642n112B9391a17050A80050g5670A00749
11803H2662e0125D27434c13514D45560f1213q5033b2060G3597p072c39400I0793
11791B81120g9114I582d5954D9918p466h9434A73360D431b27962N8882E8678M2765
11779A01443a26582k17922D31886A37496J9036f903k79642B7978a18805L120b4126
11767B72273j06804B0877D575K9936a80366B40511g650m4610A7431L0778a24772
11755E2230a76052L6227k61277a88466g35A56841D44g4210D00234n9391h5481
$$ y = [-207101, 27906, 69505, -135347, -159961, 96092, 347020, -335453, 37221, 36217, -234943, -487736, -51117, -84400, 72479, 18269, -72766, -324800, -250557, -43803, -24273, 87395, -121773, 72464, -393665, 415353, -59057, -124428, 143642, 138530, 29391, -117050, 180050, -75670, 100749, 82662, -50125, 427434, -313514, 445560, -61213, -146246, -22060, 73597, 66525, -339400, 90793, 281120, -79114, 9582, -45954, 49918, 42452, -89434, 173360, 4431, -227962, -169080, 58678, 101443, -126582, -344504, 431886, 137496, 156532, -6903, -286545, 27978, -118805, -115685, -24126, 272273, 165469, 20877, 4575, 34511, -180366, 240511, -7650, -52260, 17431, 48209, -124772, 52230, -176052, -139825, -401102, -188466, -735, 156841, 444, -74210, 400234, 340843, -85481]
11743B7280J13217l3461b27579a0681l0229j72531b4860k5859l5922q9684M1961
11732a34364B82605a0344B30619B0046J7400a40229O5180M383A13424c35024A91991
11720d7846A04760K45294i3556r6157B88483G0339c8538D2309b73081C98678F2257
11708D5J9516a21276o0590j6112H3344K41372A6634K90803e0198e80G2616A5988
11695H2095a51544B42640l0845b98197F8653c920A30457E0671L474J1599K3042
11684H8786M9014o0340N2106O5425C7356L7061A9259R4437a51561A65660h5890
11672C33196A4119N5380b24738j3355P9729A34421b12797D9515a13273M3760B159
11660D4665J68034d8162a562B16407b85734C05184j39463P1762d9887i376j49728
$$ y = [27280, 140497, 107036, -227579, -10681, -40910, -213441, -24860, -50719, -86641, -176325, -134364, 282605, -10344, 230619, 20046, 37446, -140229, -75049, -70666, 113424, -335024, 191991, -47846, 104760, 350054, -93556, -189713, 288483, 70339, -38538, 42309, -273081, 398678, 62257, 45, 19561, -121276, -181866, -197978, 83344, 324716, 16634, 307437, -50198, -580, 72616, 15988, 82095, -151544, 242640, 211795, -298197, 68653, -3920, 130457, 50671, 54145, 65744, 88786, 137800, 77460, 129566, 194991, 37356, 74417, 19259, 113696, -151561, 165660, -85890, 333196, 14119, 69499, -224738, -238093, -158364, 134421, -212797, 49515, -113273, -69513, 2159, 44665, 212699, -48162, -1562, 216407, -285734, 305184, 165721, 237483, -49887, -9376, -159104]
11649a59104F5158G775K87832a00384l1589G8465a79633k2833A01670B5328o832
11638A8496K60612b10042p1627G2955k3069L9448a19452A17725k7677a53612E6542
11626A25549d6098B33173N5211k6593J69643i5249J8647G1528e5436I0079J53355
11615B43434O536h7245A84772a5610F7499i3337C4328b0401k36276J04239C34954
11603E9325L12357a52340A7075J02457J86116a1985A83627n8511P9058o1215E4387
11591c3933n2445A83567d3686J0318n5284B9395M67711D4380K49268q5146D9960
11579e6728E8903k2642C188L07279K4094r8468L1594b2095A51943l8217c8544
11567a58341l9083K6430B31245e52197H4413a1053A80965a28122A18672f3375
$$ y = [-159104, 65158, 7775, 295607, -100384, -131973, 78465, -179633, -202466, 101670, 25328, 18496, 279108, -210042, -281669, 72955, 49886, 89334, -119452, 117725, 90048, -153612, 56542, 125549, -46098, 233173, 288384, 261791, 431434, -95249, -76602, 71528, -55436, 90079, 243434, 249970, -87245, 184772, -15610, 67499, -93337, 34328, -20401, -256677, -152438, 334954, 59325, 371682, -152340, 17075, 119532, 305648, -11985, 183627, 125116, 204174, 142959, 54387, -33933, -86378, 183567, -43686, -33368, -88652, 29395, 497106, 44380, 293648, 208502, 49960, -56728, 58903, 36261, 3188, 310467, 334561, 236093, 267687, -22095, 151943, 113726, -38544, -158341, -197424, -170994, 231245, -552197, 84413, -11053, 180965, -128122, 118672, -63375]
11556A93420l7536E051J61841m1654c302r9358C53265A57369a5842q5516B93180
11544a09214F6365K16466K956j12528q5409J4592l1453a16263A79456f3573b0056
11532c1196C46845M5147G6174O9422J05286F0636F664L54644a67711n6607B11160
11520C04762R9512A46363i5113A8524K08589c00094I1593j2382K8402K04896h3464
11508B55269n5787K6248R9592l8133A43380a36264q4533H4015J49371J060Q250
11497B42696r7117r517J73999j06087R0503d14020E7334K25823j24559K17983
11487C76581A31245K83534j59764K5187d7529C73635H7504K89014r6174F7892
11476A60289J2697a5835A19791C9922L24967r6979b13349F9531l086a79394A50406
$$ y = [193420, 155884, 5051, 166892, 125238, -3302, -102660, 353265, 157369, -15842, -101358, 293180, -109214, 66365, 282831, 285787, 173259, 87850, 102442, 70989, -116263, 179456, -63573, -20056, -31196, 346845, 391992, 76174, 145596, 250882, 60636, 6664, 361308, -167711, -224318, 211160, 304762, 404274, 146363, -95113, 18524, 227113, -300094, 91593, 79211, 107613, 312509, -83464, 255269, 199482, 225730, 325322, 287189, 143380, -136264, -220797, 84015, 233386, 234446, 242696, 145579, 136062, 310061, 203974, 294477, -414020, 57334, 283157, 158598, 376581, 131245, 414779, 255015, 280202, -47529, 373635, 87504, 376518, 280344, 67892, 160289, 172986, -15835, 119791, 39922, 364889, 267910, -213349, 69531, 66445, -179394, 150406]
11464E1043K8304K179K06523A00145L07679a38038B66627H7534J82318d4789C29085
11452C2500K31719f7674a6641A85496J57463A35954R6499A06577C1911a64745
11441E6148k4829L58140e2272A84442a33538j64676d1139A61197l7642L0509K41184
11430C95248j70429A3198g9511j89454k9786A99558A5246K4099b8089C24271A30898
11418d4828K0137k42441A62649m6083F400J6066J19466a50045A70034J3517a05598
11406e80512b79948I855i8954L9059f116B01943a24579a4357m4232o6370A47777
11394B46942i3652j59937B69649b28533P4806j75775a51908F5581a09556p9332
11384a88888I079L9033g5596C95497A24524l2236h2459D43451A12512h1487l2527
$$ y = [51043, 79347, 81526, 288049, 100145, 407824, -138038, 266627, 87534, 269852, -44789, 329085, 32500, 264219, -67674, -16641, 185496, 342959, 135954, 232453, 106577, 31911, -164745, 56148, 31319, 389459, -52272, 184442, -133538, -298214, -41139, 161197, 123555, 154064, 395248, 224819, 13198, -79511, -268965, -298751, 199558, 15246, 39345, -28089, 324271, 130898, -44828, -24691, -267132, 162649, 116566, 6400, 22466, 141932, -150045, 170034, 183551, -105598, -580512, -279948, 9855, -98954, -59895, -6116, 201943, -124579, -14357, -58589, -124959, 147777, 246942, -93652, -253589, 269649, -228533, -153727, -329502, -151908, 65581, -109556, -188888, 9079, 48112, -75596, 395497, 124524, 92288, -82459, 443451, 112512, -81487, -114014]
11373a14014M3459k39921d518p7397k05238F4180J90687a08503B49957a41498
11362a51241B22543m3272b06590F2161L59120a49096B22432B8633b3433n8533
11352h1966D7580d8617e49C11459a29425d4727C7361b6566I3805B6750E765b37220
11339C17398A12664L06022j92212h3823H723c52116a00194D39573E2148a96306
11328a05288M3755a3760r1630A36023B3617J28895g5643H9877a23753A04941I89
11316B2716b78567A37222A2311M22555A1755K48234f2294D2615J5014D015h5668
11304a30737A03737C4918Q3093K84654b26459i9533B61780l8297c09697e8167
11293b00108j63731J14957P3978M3749A88036i7961j9178E4610c0779k1811A63784
$$ y = [-114014, -70555, -310476, -4518, -81915, -287153, 64180, 254867, -108503, 249957, -141498, -151241, 222543, 179271, -206590, 62161, 421281, -149096, 222432, 28633, -23433, -81966, 47580, -48617, -549, 311459, -129425, -44727, 37361, -26566, 93805, 26750, 5765, -237220, 317398, 112664, 418686, 226474, -83823, 8723, -352116, -100194, 439573, 52148, -196306, -105288, -61533, -13760, -105390, 136023, 23617, 152512, -75643, 89877, -123753, 104941, 989, 22716, -278567, 137222, 12311, 434866, 11755, 259989, -62294, 42615, 57629, 4015, -85668, -130737, 103737, 34918, 118011, 402665, -226459, -99533, 261780, 223483, -309697, -58167, -200108, -363839, -248882, -174904, -131155, 188036, -97961, -117139, 54610, -30779, -52590, 163784]
11281I6114a56229B7651r058J8678b28992d7447k1152F2228b14740f8406j04003
11270a72409J4145n5747O4492c8610l7512j35928A20682a32198C5025b18693B09939
11258A5612b12698d1477B9950J62008g7066J5558D5474K06769a74533C83772c13308
11246D9690a17707j8345F8753a26602b9155G9524g6123A23808E3142a80561B9095
11234E6464d4555A13113B1947a70750B31632A6569a20449A48530b19914d6967
11223E2565i6705b9137j7423k80008J15889C0542a83752M3004j59982A60808b4649
11211A91556a87354N5195P165e1449A60758a03754L3971A21740e2743G0772a80240
11199i2751M4931B9135c48940a36727o4278m4038H6232d69448a77875m0885N2609
$$ y = [96114, -156229, 27651, 18593, 37271, -228992, -47447, -68599, 62228, -214740, -68406, -172409, -158264, -214011, -149519, -38610, -76122, -212050, 120682, -132198, 35025, -218693, 209939, 15612, -212698, -41477, 29950, 191958, -77066, -61508, 45474, 252243, -174533, 383772, -313308, 49690, -117707, -136052, 68753, -126602, -29155, 79524, -76123, 123808, 53142, -180561, 29095, 56464, -44555, 113113, 21947, -170750, 231632, 16569, -120449, 148530, -219914, -46967, 52565, -96705, -29137, -46560, -326568, -210679, 30542, -183752, -140748, -300730, 160808, -24649, 191556, -187354, -132159, -124994, -51449, 160758, -103754, -69783, 121740, -52743, 70772, -180240, -92751, -47820, 29135, -348940, -136727, -201005, -245043, 86232, -469448, -177875, -218760, -166151]
11188a66151f1654o6726c7180A43171a24888e1358m6716m63567h0328n9441M9699
11177i0070j40095k6054K8507A22511a75765N9627H274a27093c5586B22627h1044
11165f754A21916b35199F8459a96270b4756k37539f6113A76774O761a49653k899
11154a52552B84721A31571l6044a35695D5587Q2922a49892A5215J57977d07173
11143B20516M8353b0838B29771d855o7821B6437a7628A66224j8209b27324E4165
11131b59317G8378L53640a90725B54533a69728A55718g4647K8964H5114L61704
11121D46818A49559J51128A18679R8540a7541G3528j8986j7509L36598q9416a27358
11109b23490A47848K5417J4521I2046J57031i5898B65743L8985L8302K7908J49848
$$ y = [-166151, -61654, -128380, -37180, 143171, -124888, -51358, -98074, -561641, -80328, -139769, -90070, -230165, -256219, -227712, 122511, -175765, -116138, 8274, -127093, -35586, 222627, -81044, -6754, 121916, -235199, 68459, -196270, -24756, -262295, -66113, 176774, 183535, -149653, -152552, 284721, 131571, 95527, -135695, 45587, 128509, -149892, 15215, 173192, -407173, 220516, 268869, -20838, 229771, -4855, -72676, 26437, -17628, 166224, 148015, -227324, 54165, -259317, 78378, 432018, -190725, 254533, -169728, 155718, -74647, -45683, 85114, 446818, 149559, 300687, 118679, 217219, -17541, 73528, 54542, 37033, 373631, 284215, -127358, -223490, 147848, 173265, 187786, 92046, 249077, -95898, 265743, 304728, 343030, 370938, 520786]
11098E20786k54047a11562A74684q2447h9860F7494a20727D55700a3945C26444
11087C06923j17261e6889C15061o86a9272A74297Q3693J7152o5512J32471L0612
11076C72713j7976j28427l4349p9033Q1464J39307N4747o9786l9290G3495K16325
11065B89820J2500K11591L4131k48308J58295j93866K96547L9921R1448j45808
11055E46271K35632B88910L09811j99511N60906C28574N11964C90107N86114k26083
11045G50138N216n3783M2950j32949L99340J12315l46050J17213o8294k74432
11035E51664K74770C94250M36655o4665K06072j75360k64061K16114k31083O30089
11025A148011C54219O35599j50567K10729k24570l04568K62900J6517l11806j06810
$$ y = [520786, 266739, -111562, 174684, 92237, -89860, 67494, -120727, 455700, -13945, 326444, 306923, 189662, -56889, 315061, 314375, -19272, 174297, 257990, 275142, 209630, 342101, 372713, 354737, 226310, 191961, 112928, 194392, 333699, 388446, 318660, 279370, 73495, 289820, 302320, 513911, 548042, 299734, 458029, 264163, 560710, 600631, 692079, 546271, 781903, 288910, 598721, 399210, 960116, 328574, 840538, 390107, 976221, 750138, 755354, 701571, 744521, 611572, 1010912, 1123227, 777177, 894390, 826096, 551664, 826434, 394250, 830905, 766240, 972312, 796952, 532891, 749005, 517922, 1148011, 354219, 989818, 839251, 1049980, 825410, 520842, 783742, 800259, 488453, 381643]
11015C81643N09021q0898k45053J91646q9186j74216J07525P2353l0361r3030
11005E49444J97732B50957M14845k871l13112O45930l30622n656n9928L59723
10995I59266l96796J91723M36493k98078q5766P5223k36079K26372J80210k59469
10985G93099K79738p9205K03877K14711l20313L51291j0443M6557J58979K66823
10975A905114M30595R8659K18424J04520P28417l81386o649k10432k43024k25438
10965B418800k9469o87636K40472J6116M978j09188K2963J65687k22172K75305
10955B095856k97280l03890m32149K74378k65602K23484j03341j21989B83621
10945E55887j62630K70747B47369J17983m6506j11672J1369h8472B42545J7129
$$ y = [381643, 890664, 809766, 564713, 756359, 667173, 492957, 600482, 672835, 642474, 549444, 747176, 250957, 665802, 662931, 349819, 995749, 665127, 659471, 599543, 959266, 562470, 754193, 1190686, 892608, 806842, 882065, 645986, 872358, 1052568, 793099, 1072837, 993632, 1197509, 1412220, 1091907, 1443198, 1432755, 1479312, 1638291, 1905114, 2335709, 2434368, 2652792, 2757312, 3485729, 3104343, 3097694, 2887262, 2644238, 2418800, 2389331, 1701695, 1942167, 1958283, 1963261, 1854073, 1877036, 2042723, 1820551, 2095856, 1798576, 1494686, 1062537, 1336915, 1071313, 1294797, 1191456, 1069467, 283621, 555887, 393257, 664004, 247369, 365352, 318846, 207174, 218543, -88472, 242545, 259674]
10935B59674A8986J47131J3605c0389A92429n7395M5779B1123P6371L5334m4516
10924H8312L33348A19527J43215p4535r1526a41306n8082c6277o0112f852A13308
10912h0741G6530h432F5171J20732c9231A64794A1575K2875d8882B40809f8524
10900B10359i0574p7648B6370a63332l9195J7299A67392b36210J17469K3789l3467
10889a28419E8185d4475B315K60562m4020e0154k20086B767a50184O0653C9940
10877a35707C51034j07460d5375A5846R6706H459b53931C32161e8262F2352d0768
10865B71936N4540I3865d1549A39119O7931G7759K62402a98572E2419a08910A83183
10853a43731a7658j47949j01706c1022j0558q774H7884C2434Q2359e18263b53076
$$ y = [259674, 18986, 166117, 179722, -30389, 192429, 135034, 180813, 21123, 97494, 132828, 88312, 421660, 119527, 262742, 188207, 96681, -141306, -199388, -36277, -96389, -6852, 113308, -80741, 76530, -8432, 65171, 185903, -39231, 164794, 11575, 34450, -48882, 240809, -68524, 210359, -90574, -168222, 26370, -163332, -202527, -185228, 167392, -236210, -118741, -94952, -128419, 58185, -44475, 2315, 262877, 218857, -50154, -270240, 2767, -150184, -89531, 39940, -135707, 351034, 243574, -45375, 15846, 112552, 8459, -253931, 332161, -58262, 62352, -40768, 271936, 326476, 93865, -41549, 139119, 207050, 77759, 340161, -198572, 52419, -108910, 183183, -143731, -17658, -165607, -267313, -31022, -41580, -50354, 87884, 32434, 114793, -518263, -253076]
10841a30433B9857b84664C6953a48801D2388A519b13995p5342e773n0143C4993
10829B36866c29639J38809B49565I3803K61350f8879k69856C88988j05806d8178
10818D3550a70116g3309j49801I1052e6425C4712a38992B715a00762B7405b19372
10806d28953B3390d16453J71977A42284a2020l90550A95884O056e50919R9115
10796d51804F782b74687a21204J3975B7034a41211d0289j94637A42308d7467A52037
10784h4909j34736J02289A7692c2695C53383a63501j54242O423F5067a34680B03415
10772g5173D6485b33250g0545m9583B61782h4258l1647E9061O9110J88789b58277
10760E7385k1676J03360C2594g6671j05187a8717G1732L2551J29634a65512A7038
$$ y = [-130433, 29857, -284664, 36953, -148801, 42388, 1519, -213995, -289337, -5773, -55916, 34993, 236866, -329639, -190830, 249565, 93803, 355153, -68879, -338735, 388988, 283182, -48178, 43550, -170116, -73309, -223110, 91052, -56425, 34712, -138992, 2715, -100762, 27405, -219372, -428953, 23390, -416453, -244476, 142284, -12020, -402570, 195884, 201940, -550919, -451804, 6782, -274687, -121204, -107229, 27034, -141211, -40289, -234926, 142308, -47467, 152037, -84909, -219645, -117356, 17692, -32695, 353383, -163501, -317743, -311320, 65067, -134680, 203415, -75173, 46485, -233250, -70545, -120128, 261782, -84258, -115905, 59061, 128171, 316960, -258277, 57385, 35709, 139069, 32594, -76671, -181858, -18717, 71732, 104283, 233917, -165512, 17038]
10748A80996b41349f3022j95627C41846b7041j04419q5859d192l80127f5764l87978
10737d53742F0115a21956A21049P6618q2994b18094G0253c57883g6339A737J82397
10726A84134b81755J29080P4868Q364a4674H5353M3524l4009b33417B73271E9992
10714f0762l05281c6955A39940a91131C4757c9967J6856q2542B17386b07209B56709
10702h2403b6784j66146B64353H7491b19771J00654H8907B2235K92334j40252
10692A74317k3777a53244e9629j69708J10156J3548j6506b5421k75797P8244C2627
10680h0848E3342c63229A08416c12344E5378l144J07561G656b7665A86198p1256
10669A14942r98b54983d8739k57278A236g4984B86468g0991C47837C726i7675
$$ y = [180996, -241349, -63022, -258649, 341846, -27041, -131460, -217319, -4192, -384319, -65764, -453742, 60115, -121956, 121049, 197667, 114673, -218094, 70253, -357883, -76339, 1737, 184134, -281755, -152675, -77807, -69443, -14674, 85353, 128877, 94868, -233417, 273271, 59992, -60762, -366043, -36955, 139940, -191131, 34757, -39967, -23111, -105653, 217386, -207209, 256709, -82403, -26784, -192930, 264353, 87491, -219771, -119117, 88907, 22235, 314569, 174317, 150540, -153244, -59629, -229337, -119181, -105633, -122139, -25421, -301218, -222974, 32627, -80848, 53342, -363229, 108416, -312344, 55378, 52234, 159795, 7656, -27665, 186198, 114942, 113944, -254983, -48739, -306017, 1236, -74984, 286468, -70991, 347837, 3726, -97675]
10657c05959d7588j54220C7415A5804J53512d22217a71511j93857B3464a84323
10646d31096a5615F9927a4597p9360c5599j83006h3204K8254C83049G1086k1744
10635D9342c6511A20398a42039A16791h2745A51032i2157k63171l0533d4641r3470
10624a38111N722A04858l4306K61621A07555f7839F4251J03420a93861g0792b1255
10612d32017A13218c08672A84665f9829G3331L86362A5245K22553b6121j43762
10602a69883c6474D5922M6793b50202Q3273k62991A42618a83261F0950e74027
10591a24188q1955G0276a27680A44498C9158K01872i9497j37468i989p3079I763
10579G784a91055A47916b45365D8826a96718l9545I4632g4316K8668p2364C3650
$$ y = [-305959, -47588, -201808, 37415, 15804, 169316, -422217, -171511, -365368, 23464, -184323, -431096, -15615, 69927, -14597, -93957, -35599, -218605, -83204, -54950, 383049, 71086, 49342, -36511, 120398, -142039, 116791, -82745, 151032, -92157, -355328, -385861, -44641, -138111, -132389, 104858, 70552, 332173, 107555, -67839, 64251, 167671, -193861, -70792, -21255, -432017, 113218, -308672, 184665, -69829, 73331, 459693, 15245, 237798, -26121, -169883, -36474, 45922, 92715, -250202, -166929, -429920, 142618, -183261, 60950, -574027, -124188, -206143, 70276, -127680, 144498, 39158, 241030, -99497, -236965, -9989, -83068, 9763, 7784, -191055, 147916, -245365, 48826, -196718, -236263, 94632, -74316, -45648, -118012, 33650]
10567e6783j01464A94704e8097a2780p9447J6578l509k07422A21033K03256B1949
10555A86470E434K22626o1399c62148A87897g462A8337b02334e0839j53749A07599
10543A45690c0483k14212H6994B1711K55984I3695K9285D3417a63976k13700A63587
10531B7937a85573b465j25323l7385B88698F6681a49930A7867J5815b8580C7699
10519b6116A54546a77138A67271c7254j32345n0008B99748a54552e4220B79185
10508B24780a780l04398E9113A940a92218B250R4004k0062b87298a17818j0562
10497a28380k5547O6917b9957A94217F301R0005L7556D1508a81360Q4693B28768
10485H0085b48196C68486A45275F5023J88292L22014J00644J55009B20982q4694
$$ y = [-56783, -158247, 194704, -58097, -12780, -92227, -75649, -79158, -286580, 121033, 324289, 21949, 186470, 5434, 228060, 166661, -362148, 187897, -7462, 18337, -202334, -50839, -204588, 107599, 145690, -30483, -244695, 86994, 21711, 277695, 93695, 122980, 43417, -163976, -377676, 163587, 27937, -185573, -2465, -127788, -165173, 288698, 66681, -149930, 17867, 33682, -28580, 37699, -26116, 154546, -177138, 167271, -37254, -169599, -219607, 299748, -154552, -54220, 279185, 224780, -1780, -306178, 59113, 1940, -192218, 2250, 96254, 76192, -287298, -117818, -128380, -153927, -87010, -29957, 194217, 6301, 96306, 133862, 41508, -181360, -96667, 228768, 80085, -248196, 368486, 145275, 65023, 253315, 575329, 675973, 830982, 220982, 136288]
10475A36288J4005J03762m7360a23521q7660B91908o6283k5267d02364b4551A88318
10463C71046a1972n97601h435j6348k74848J38643J9007A58467E5169d28425a02229
10451a14001b0717m7884G5462J14108F0876f6144e323C58770A2736a2770o923
10440a9693F5043J00830p4628N3696a9425k52836G1969a27799B23J7959R7327
10429A15509b08101e5176l2440A70799F7754k3088a41706A26477m6562R2212k8574
10418A43553E4870J37038c43682a03913G4188b088j29069l39560g5530j9500B35952
10406a68121D7674a72568P0005e0151j86142h706m7831i779H7509J37384N0587
10395B75480a97910A4058K45081J6906A24878J80160j16734G458c5505I4811a22536
$$ y = [136288, 150293, 254055, 206695, -123521, -211181, 291908, 225625, 200358, -402364, -24551, 188318, 371046, -11972, -609573, -8435, -24783, -299631, -160988, -141981, 158467, 55169, -428425, -102229, -114001, -20717, -68601, 75462, 189570, 60876, -66144, -5323, 358770, 12736, -12770, -19693, 65043, 165873, 91245, 144941, -19425, -272261, 71969, -127799, 223, 18182, 115509, -208101, -55176, -87616, 170799, 67754, 44666, -141706, 126477, 79915, 172127, 143553, 54870, 191908, -343682, -103913, 74188, -2088, -131157, -470717, -75530, -95030, 235952, -168121, 47674, -172568, -102563, -50151, -236293, -8706, -56537, -9779, 87509, 224893, 275480, -197910, 14058, 259139, 276045, 124878, 305038, 188304, 7458, -35505, 94811, -122536]
10383C52327a63028D8444a62479F8273j5501K30346j13987J68233L7683A47812
10372A84783a3532O153D46434L6376R3277j74103o8232L94754B95341J50164j46292
10361B99213F0132L62292D577K36435D1054a64262B64765R7181j12309l64M07035
10350F56308N3509C20424A38167J67423M1197j50500q1285Q500K27543K75899
10340F26944B72570I5161M43679k52890m019L40483a6226A26782R5151b94676
10329B3863K61256m1652J6691L1928A26921Q3979J06807g6959C00698C0073a38547
10317B25658n7274G9327J08891O1247a07822H5853a76292A25018e5575B22263
10306a08776j05140A48140L2407b21622R5256I0980M1023h368k62547B19738G4060
$$ y = [352327, -163028, 48444, -162479, 68273, 52772, 283118, 169131, 337364, 375047, 147812, 184783, -13532, -7379, 446434, 482810, 576087, 401984, 333752, 728506, 295341, 445505, 299213, 60132, 422424, 4577, 241012, 41054, -164262, 264765, 361946, 249637, 249273, 656308, 709817, 320424, 138167, 305590, 346787, 196287, 115002, 123502, 351045, 626944, 272570, 95161, 538840, 285950, 281931, 622414, -16226, 126782, 221933, -294676, 23863, 285119, 243467, 260158, 292086, 126921, 210900, 317707, -76959, 300698, 30073, -138547, 225658, 168384, 79327, 188218, 249465, -107822, 85853, -176292, 125018, -55575, 222263, -108776, -213916, 148140, 180547, -221622, -126366, 90980, 132003, -8368, -270915, 219738, 74060]
10294A00359d29j85721n8827B7384a48433B8003d0074j32341F2066a31589r3139
10283b24728B34845f6137k88362b0537A49714f9874b9391A58107a23276e1952
10272d7172q3549O1705R608I9956a2194A11819K33046l5581A11378M5455E4750
10260g9700D56122q2999A28519K33303A38174M3981b0875D17876I4374a61187
10249A59922d9149j6023n3312m3681C4162a98728d8755B17167d1429k24193D8882
10237a43179K6142j18932E5644a46777j39085C4071K3750a59046C16572A09718
10226b52149a00828F623b75413D0203J01076K3643A0800J69a81959l5190F9572
10214F2364P3790O3905l8167f7560A02478b15478o0555D1160K12473e1766q4195
$$ y = [100359, -429, -186150, -244977, 27384, -148433, 28003, -40074, -172415, 62066, -131589, -224728, 234845, -66137, -354499, -20537, 149714, -69874, -29391, 158107, -123276, -51952, -47172, -130721, -69016, -59408, 99956, -12194, 111819, 344865, 309284, 111378, 156833, 54750, -79700, 456122, 373123, 128519, 361822, 138174, 182155, -20875, 417876, 94374, -161187, 159922, -49149, -65172, -118484, -162165, 34162, -198728, -48755, 217167, -41429, -265622, 48882, -143179, -117037, -235969, 55644, -146777, -285862, 34071, 57821, -159046, 316572, 109718, -252149, -100828, 6623, -275413, 40203, 141279, 164922, 10800, 10969, -181959, -217149, 69572, 62364, 136154, 200059, 161892, -67560, 102478, -215478, -276033, 41160, 253633, -51766, -135961]
10203a35961K8451j28933Q1911r8573e5436K5558A27513J7527o906D605N3914
10192E8519B9055a82303N1988d0269B14114d11670J40578J14288k00570D3304
10181D264J65357G0159R8378a75220j32625D51002a85983O5057A47510a65493
10170a2416A21248a15178d1954j4351k7348j69070P6400m1876F7643C1445a65790
10158a02072k16257i4114j6063j12785j2990J8305g784j95334M9171D403J99811
10147B04214a41312e5500a4936o5345B00787G2031f0115I7658b32847G8276J80270
10136B58546d481r6327B4159b70878I011a77896a9616k3417k06362P2148p7657
10125b54904I6195b72970i353k27101I3022f0385A2941b23513A05933C1903a46490
$$ y = [-135961, -107510, -236443, -154532, -253105, -55436, -29878, 127513, 145040, 138134, 4605, 58519, 29055, -182303, -130315, -40269, 214114, -411670, -271092, -156804, -357374, 43304, 4264, 169621, 70159, 168537, -175220, -307845, 451002, -185983, -120926, 147510, -165493, -12416, 121248, -115178, -41954, -56305, -83653, -252723, -176323, -218199, 67643, 31445, -165790, -102072, -318329, -94114, -110177, -222962, -235952, -217647, -7784, -203118, -153947, 4403, 204214, -141312, -55500, -14936, -80281, 200787, 72031, -60115, 97658, -232847, 78276, 258546, -4481, -100808, 24159, -270878, 9011, -177896, -19616, -43033, -249395, -177247, -254904, 96195, -272970, -9353, -236454, 93022, -60385, 12941, -223513, 105933, 31903, -146490]
10113a26020l7893L0582n7723B56937b45186F2918b1726D7385h9431j12609L4272
10102a67768L7455A74846d196j3023A09082c75898a23947j47844B4104b57796
10091E2067b02749j55544A59839o0295a14086M1991F7721N6676a27904B1290a92227
10079b1956l62954A37481b8414j91573i6939A8595d9159A13229k0332j4843A5049
10067a32092q1571F8145h0463D00454c43072e5473A48882J52365n0728a46924
10056A09016i9051q1258h165r0367k68271J31845O8125d083A17347N8879e5321
10044a21350r4365i4497A31658F3248i5636H4772b13563B16714a59788j5435m853
10033a80076l4602E9788c3033m25987I650J59954F249h5966j50908j44250c3359
$$ y = [-126020, -163913, -133331, -191054, 256937, -245186, 62918, -21726, 47385, -89431, -202040, -167768, -130313, 174846, -4196, -17219, 109082, -375898, -123947, -271791, 24104, -257796, 52067, -202749, -358293, 159839, 99544, -114086, -72095, 67721, 124397, -127904, 21290, -192227, -21956, -384910, 137481, -28414, -219987, -96939, 18595, -49159, 113229, 92897, 78054, 15049, -132092, -213663, 68145, -80463, 400454, -343072, -55473, 148882, 301247, 250519, -146924, 109016, -99051, -180309, -8165, -98532, -366803, -234958, -166833, -4083, 117347, 176226, -55321, -121350, -215715, -94497, 131658, 63248, -95636, 84772, -213563, 216714, -159788, -175223, -180076, -214678, 59788, -33033, -459020, 9650, 169604, 6249, -85966, -236874, -381124, -33359]
10021b39697f8064k25328G3845d0920j02940o6295c3880k784D0958i2031l8724
10010a30755r2449A41038G515c9588p5917C1555N4415a04288b6148o0658E0465
9998A62345M4676e9731k85061A76235m9666c9887J4027p3904B1773a12084k02340
9987c14424k30J16316H5212J6998k9540b47047a00671J0419l08798m7039J81817
9976b64272B4245k425J71593a99766Q5023I5410a16626a766k46092g7030c0263
9964b1591R758p8151L6992j86844C8108A0435h8589a4558j19083A39062D8743
9952i9379j62422j9762A36118N5504h0556c2858A45122b07865I067P8030a48565
9940b21797n3124F7567c24071g6341A76127H5468d74258d8056C80523A08456d3217
$$ y = [-239697, -68064, -293392, 73845, -40920, -143860, -210155, -33880, -36664, 40958, -92031, -130755, -223204, 141038, 7515, -39588, -115505, 31555, 85970, -104288, -26148, -86806, 50465, 162345, 207021, -59731, -344792, 176235, 126569, -39887, -25860, -99764, 21773, -112084, -314424, -314654, -198338, 85212, 102210, 72670, -247047, -100671, -90252, -399050, -446089, -264272, 24245, 21820, 193413, -199766, -114743, 95410, -116626, -1766, -247858, -77030, -30263, -21591, -11833, -89984, -52992, -239836, 38108, 10435, -88589, -14558, -133641, 139062, 48743, -99379, -261801, -281563, 136118, 191622, -80556, -32858, 145122, -207865, 9067, 87097, -148565, -221797, -274921, 67567, -324071, -76341, 176127, 85468, -474258, -48056, 380523, 108456, -43217]
9928b70002J33883D594c60635E8970K74329c04427a05891A9039N9535c54892f3806
9916A63162a44360G7033a08723k0910m715r2053f590k29932P3301d8791j32799
9905a81590k6228p8982m5735a64508L3039n0527a7641l0298O247k55986G7915
9893h4792j87209A0918R276a59321L1193C0272c57681D5341c95740a33242j21352
9882b54594j03400n0364c1430m3200j40090g5181j06908c9822k38113A65463n2752
9871A12711J52329i0547E388g2496J0423k56158l4545e8878J0268q0815D2867
9859A10556J15191e1060k11286a23960I8150b6979p571k16559B84331a23347B20444
9847b31856q3337B32119c25540J58434k52607d1145l4304l35207a93142O3948
$$ y = [-270002, -136119, 4594, -360635, 58970, 333299, -304427, -105891, 19039, 78574, -354892, -63806, 163162, -144360, 77033, -108723, -129633, -134348, -226401, -6590, -236522, -163221, -48791, -181590, -207818, -286800, -332535, -164508, -131469, -181996, -17641, -47939, -41692, -297678, 77915, -84792, -272001, 10918, 20194, -159321, -128128, 30272, -357681, 45341, -395740, -133242, -254594, -357994, -408358, -31430, -74630, -214720, -75181, -182089, -39822, -277935, 165463, 112711, 265040, -90547, 5388, -72496, -62073, -318231, -352776, -58878, -48610, -129425, 42867, 110556, 225747, -51060, -262346, -123960, 98150, -26979, -34550, -251109, 284331, -123347, 220444, -231856, -315193, 232119, -325540, -167106, -419713, -41145, -75449, -410656, -193142, -129194]
9837a29194r4294a00785B48703a46882f6351a4690r5630J5819C8409P0982b29819
9825B28950K192G0763d4859j31212I6550b54582J21546B9883g0372l14587A7473
9813d70201A1464c74996a85692A53997c18300C78422i0366A15071a09102O57l8066
9802a46511B24736c7134a8163j9584p4964n5808h0931c9672E9717L32295a76061
9790i4038F9591a1697j83186A57301a92986d3604j6795b7706A152J19982f8250
9778A4298b33142A94070d1550J4391o4862l38213J79202J5112O0355O832F726
9766b4815e063C5733a74763A80316a00686e0330o0561P750j40051P9562j47293
9755c10923e1953A61738C2769a51041j90208d135B2747J12555K07227c12572i4773
$$ y = [-129194, -223488, -100785, 248703, -146882, -66351, -14690, -110320, -94501, 38409, 109391, -229819, 228950, 231142, 70763, -44859, -176071, 96550, -254582, -133036, 29883, -70372, -384959, 17473, -470201, 11464, -374996, -185692, 153997, -318300, 378422, -90366, 115071, -109102, -108445, -146511, 224736, -37134, -18163, -37747, -112711, -168519, -80931, -39672, 59717, 392012, -176061, -94038, 69591, -11697, -194883, 157301, -192986, -43604, -60399, -27706, 1152, 121134, -68250, 14298, -233142, 194070, -41550, -27159, -92021, -430234, -251032, -235920, -175565, -168733, 6726, -24815, -5063, 35733, -174763, 180316, -100686, -50330, -110891, -103141, -243192, -163630, -310923, -51953, 161738, 32769, -151041, -341249, -4135, 22747, 135302, 342529, -312572, -94773]
9743C3796M55567c41960c3149p568A90385d12013N8529J25494f9501C90701A95224
9731A05295h224A64962K04404c28898h8947d894F664i3683A97798D9166e2471
9719H737a57151d3319k70514R9676O0914f6386l18845a71772j85685b7306b259
9707B5396b62636J30937L0485l3704r9090E5076c04193i5306b5701k20559a8552
9695d92268C8303O7416l3925a54357C6531c10719b476l59036A34305Q7956b38174
9683B35044b81345B15172c18586E7053c34360C6457K75008i8014J8916B17797
9672a33043C4081J02714a39302f0485B9704O7793A2546C692b56259D6280b64340
9660c4449r0508A00720A7307a40357q5928k84184D5074b12274Q9842k98212J54056
$$ y = [33796, 489363, -341960, -33149, -40717, 190385, -412013, -353484, -227990, -69501, 390701, 195224, 105295, -8224, 164962, 369366, -328898, -88947, -4894, 6664, -93683, 197798, 49166, -52471, 8737, -157151, -43319, -313833, -214157, -153243, -66386, -385231, -171772, -357457, -27306, -2259, 25396, -262636, -131699, -101214, -134918, -234008, 55076, -304193, -95306, -25701, -246260, -18552, -492268, 38303, 105719, 71794, -154357, 36531, -310719, -2476, -361512, 134305, 222261, -238174, 235044, -281345, 215172, -318586, 57053, -334360, 36457, 311465, -98014, -79098, 217797, -133043, 34081, 136795, -139302, -60485, 29704, 97497, 12546, 3692, -256259, 46280, -264340, -34449, -124957, 100720, 17307, -140357, -226285, -510469, 45074, -212274, -122432, -420644, -266588]
9649b66588j4616h2957L9104e867D04746c70813F8362b7171F2085c86629a18475
9637B00594B8098a17722k04385D8846M44j6995J22446a52957A30838b73878d7528
9625A8148a61338p344j38375a46425M5842l63759A61561G1570g3356n3881k6533
9614a53770k57727g5811C08255e32235h9447G7848d2343G355J38785n9958f4396
9602a63258q6759C19642A1519d69091J90452n8360c7675G8094h37014a20744k19251
9591c39995a53258A34708A8659P5816d0035j19290j66878F9885c7482j20684C7929
9579h6112j6195L9420K0912j35759b3517B94899f4884F8661b65980o0714H5048
9567d6172A44464E4581J31207O863p3971i7924a4494A26058d47004B49092a58796
$$ y = [-266588, -281204, -82957, -43853, -5867, 404746, -370813, 68362, -27171, 62085, -386629, -118475, 200594, 28098, -117722, -322107, 48846, 49290, 32295, 154741, -152957, 130838, -273878, -47528, 18148, -161338, -168682, -307057, -146425, -100583, -464342, 161561, 71570, -73356, -127237, -153770, -411497, -75811, 308255, -532235, -89447, 77848, -42343, 7355, 146140, 86182, -64396, -163258, -250017, 319642, 11519, -469091, -278639, -336999, -37675, 78094, -837014, -120744, -339995, -153258, 134708, 18659, 94475, -40035, -159325, -326203, 69885, -37482, -158166, 37929, -86112, -102307, -62887, -41975, -177734, -23517, 294899, -64884, 68661, -265980, -326694, 85048, -46172, 144464, 54581, 185788, 192651, 118680, -97924, -14494, 126058, -447004, 249092, -158796]
9555e018A22402b37822Q1116F6264P6703D4578K8617J89028a38333L9742k70465
9544c69056R2917c1508A05019M8568i5461k01622A34949b16071A34548b30348
9533c11471J50305B71766b50196D3145b03759o5327J06482L2391G1512a03635
9522b47554I8503b11724j28454B1943b16856p5234a42132l12878H9022C1403b04049
9510A45563a9612j07878A8840i017A4919a83501c2319B39593a67695j05221h5479
9498A28403l3025a74759l25111h0058B37157E9379b02872j41467M7893J41677
9488a54769k4858a0675B16432g4948A42369i6204d7783j02889m01916b50270D9371
9476A61930b61910h9166P516j91044J15712l0936A40183e4690B66881e0615A5274
$$ y = [-5018, 122402, -237822, -156706, 66264, 142967, 44578, 73195, 262223, -138333, -98591, -369056, -276139, -31508, 105019, 153587, -95461, -297083, 134949, -216071, 134548, -230348, -311471, -161166, 271766, -250196, 43145, -203759, -269086, -162604, -130213, 71512, -103635, -247554, 98503, -211724, -340178, 21943, -216856, -292090, -142132, -455010, 89022, 31403, -204049, 145563, -19612, -127490, 18840, -9017, 14919, -183501, -32319, 239593, -167695, -272916, -85479, 128403, 95378, -174759, -499870, -80058, 237157, 59379, -202872, -344339, -296446, -154769, -179627, -10675, 216432, -74948, 142369, -96204, -47783, -150672, -552588, -250270, 49371, 161930, -261910, -89166, -81650, -272694, -156982, -187918, 140183, -54690, 266881, -50615, 15274]
9464B2919b17680f2045n9058a7671D8626a40910G7094a41669A9451a81761j19010
9453c00771D8709J51291b02719F1086b65589O850K7343a6331C5747M05853a13111
9441b78055J1173M3823n891j51829A55683l2076b0032H5787g8222q8218A25622
9429c08306A34420b11356B01184I2886h0325L316j77790g5331A5348a13618A99020
9417c11075e4091j02374o0532A22421K37297c45811j22694N021a61120A20962
9406a00316a5119j09492k98151N4170E8267K46278a86833A12089k4041M5910a99648
9394C1172b04180B418a42137K5664n2534Q1679E3649R7015b22574P5481A56187
9382a44381K4125M0581J2240B95627b06444c0123D3914a76590L1006c7063j37353
$$ y = [22919, -217680, -62045, -121103, -17671, 48626, -140910, 77094, -141669, 19451, -181761, -300771, 48709, 200000, -202719, 61086, -265589, -258739, -231396, -16331, 35747, 441600, -113111, -278055, -266882, -223059, -228950, -380779, 155683, 123607, -20032, 85787, -78222, -166440, 125622, -308306, 134420, -211356, 201184, 92886, -80325, -77009, -254799, -75331, 15348, -113618, 199020, -311075, -54091, -156465, -216997, 122421, 359718, -345811, -468505, -463484, -161120, 120962, -100316, -15119, -124611, -422762, -368592, 58267, 304545, -186833, 112089, 88048, 133958, -199648, 31172, -204180, 2418, -142137, -116473, -169007, -87328, 53649, 150664, -222574, -147093, 156187, -144381, -120256, -79675, -67435, 295627, -206444, -30123, 43914, -176590, -145584, -37063, -174416]
9371a74416A93800D3999a37880M9518A28151g3870E2596k4416a21849k80635E13
9359i270A23584n2595a31205e0425l23580e7329k78188B28402a08879p405R509
9348a06775c2154A36630b36002b9667o3941j45181d7099A58864g9706o8516K030
9337a46192n9246O0763L17I2590l3371O9687c25272A01832h4146G6944a12466
9325C5190J63397m8896E5556b8243D917g2280A07472J63602d9195q7736N0848
9314h6083I4400f0833j4487E93701A5821f9669j07975f200j26411E722a20420
9302b49063F9844a76706a3204j09196K9982A70099q2034d34908a22572k68967
9292c91539a181k53033Q7697B41615M4107b14861B32210I3095a24014B46303o5971
$$ y = [-174416, 193800, 43999, -137880, -88362, 128151, -73870, 52596, 28180, -121849, -402484, 513, -9270, 123584, 70989, -131205, -50425, -374005, -57329, -335517, 228402, -108879, -116284, -106775, -32154, 136630, -236002, -29667, -93608, -238789, -47099, 158864, -79706, -148222, -146192, -205438, -144675, -144358, 92590, 59219, 128906, -325272, 101832, -84146, 76944, -112466, 35190, 198587, 149691, 55556, -28243, 4917, -72280, 107472, 271074, -49195, -136931, -86083, 94400, -60833, -75320, 593701, 15821, -69669, -177644, -6200, -132611, 5722, -120420, -249063, 69844, -176706, -13204, -122400, -92418, 170099, 88065, -434908, -122572, -391539, -1181, -254214, -166517, 241615, 285722, -214861, 232210, 93095, -124014, 246303, 180332]
9281A80332a32082e4470j48642P2670m4467m7336C05020b47095C08386A31354
9270a91241a8598k7619m00142A9294a01497A02420a90333l07669a00689j81595
9260b82284k93542A58981A0314b96160C1416g7225k40462B46276b50271a19773
9249B46250l9479a63040N5585d871j2345k5424E5039j3929d4594E5783L37317
9238C93100a24159r2859A7072o453a32418R046j11868c526n3535b2801A66485
9226b11569P1440b3222j63084B02381b79383P0571N1098j17955N5248O1025j3366
9215a72762A04897m2474i7547k07305A13659B0038b52724B17075i1311j28697
9205b20008D46729H405b07415C7914c3540p9472e1222m6660q2946h5609A06654
$$ y = [180332, -132082, -54470, -203112, -130442, -174909, -222245, 305020, -247095, 308386, 131354, -191241, -18598, -46217, -446359, 19294, -101497, 102420, -190333, -498002, -100689, -282284, -575826, 158981, 10314, -296160, 31416, -77225, -317687, 246276, -250271, -119773, 246250, 206771, -163040, -107455, -4871, -17216, -42640, 55039, 41110, -44594, 55783, 393100, -124159, -217018, 17072, 10619, -132418, -123372, -235240, -3526, -57061, -22801, 166485, -211569, -140129, -23222, -186306, 202381, -279383, -208812, -157714, -275669, -220421, -159396, -172762, 104897, 62423, -97547, -304852, 113659, 20038, -252724, 217075, -91311, -220008, 446729, 8405, -207415, 37914, -33540, -113012, -51222, -97882, -180828, -85609, 106654]
9193b83939d2561M001o1158L0795j7684L2773l8191A47505E4356a90524L6210
9182a54314B1797c55678a19606r34j11758k5123A59415a29429B51899A16296Q4588
9171B00884e8059j46248A0514a75072h4070e923k99505R5304N516O9746I7779
9159a89179A37956L721f2583D45558c3095k52554B63514c34562C56579j66227
9149A90352a04859d6247j17315d7142A62401O5532a89071K6140P2812o1825h81
9137a87226d5302m8592G3975c1246l23840B21387B9219g0108G0921b62755A0544
9125A6964a43476E5871i4402o7167r4044l951e8672G2427b02091A99608b4631
9113a44319E4410i8668p6263b5056k48474A4311f64753i1930J5679c4367m5458
$$ y = [-283939, -42561, -38560, -99718, -68923, -86607, -53834, -92025, 147505, 54356, -190524, -154314, 21797, -355678, -119606, -120540, -232298, -257421, 159415, -129429, 251899, 116296, 200884, -58059, -204307, 10514, -175072, -84070, -5923, -305428, -210124, -204608, -134862, 97779, -189179, 137956, 141677, -62583, 445558, -33095, -285649, 263514, -334562, 356579, 190352, -104859, -46247, -163562, -47142, 162401, 227933, -189071, -162931, -90119, -151944, -881, -187226, -45302, -93894, 73975, -31246, -355086, 221387, 29219, -70108, 70921, -262755, 10544, 16964, -143476, 55871, -94402, -161569, -255613, -259564, -58672, 72427, -202091, 199608, -24631, -144319, 54410, -98668, -174931, -25056, -273530, 14311, -664753, -91930, -76251, -34367, -79825]
9102g9825a0925B1069d55255a17205A08400i9566C3288c54908A85085n7205b42013
9090A36795a32839H4269K05756b61682E210e6814I9816o578a43068l0502A87115
9078a16100b6777C9090a46401H6761f3896M65j75468j97511A66653h151G4228
9066I5815b35701k88801e2862P843H3111b9947B21315c5091B7277b27832C0053
9054D8971J62203h1813D5374a12670C2067N4875H298f9241J1751F6904b64087
9042b07492g459A04063a8088r6510h905j63663C41025q4440c63191a0451j31789
9031a42240N4425L4142k88199b4853A12473Q7994a11829F6798h6664B05046I5767
9019b93307p1725B44040b03275Q4755A7015a6677H8038j6244A5879a35057j33271
$$ y = [-79825, -10925, 21069, -455255, -117205, 108400, -99566, 33288, -354908, 185085, 127880, -242013, 136795, -132839, 84269, 290025, -261682, 5210, -56814, 99816, 93238, -143068, -173570, 187115, -116100, -26777, 39090, -146401, 86761, -63896, -63431, -238899, -436410, 166653, -8151, 74228, 95815, -235701, -524502, -52862, -45019, 83111, -29947, 221315, -35091, 27277, -227832, 30053, 48971, 211174, -81813, 45374, -112670, 32067, 86942, 8298, -69241, -57490, 66904, -264087, -207492, -7459, 104063, -18088, -114598, -8905, -172568, 341025, 256585, -363191, -10451, -142240, -87815, -53673, -341872, -24853, 112473, 200467, -111829, 66798, -86664, 205046, 95767, -293307, -365032, 244040, -203275, -118520, 17015, -16677, 88038, 71794, 15879, -135057, -268328]
9008b68328j02223A97837a90327J4157E73J82923a84172j757E2402J5232L5384
8997A03018a90542D9750J00341c48507h099A063L4497b43674Q5058A71907b6448
8985g1021K3283A32892a62750b2704j58921E1200a07879C2655c53983A20653c0585
8973h3561F8583J26439C9944b01891A6863f2997A46959L8541g64j23338a0515
8961a24227P609H5435b58536C44942p3629B463N2599b03072c9764r031O952j53209
8949a95052A6613a03343d3046B68335a88288h3777k85331A96158B5012K24602
8939B49614q7516K2573B7364f3243A99480n4496a31765A09635h7680j2974C70545
8927F26a02914B99878J43N65874R41814L291269O345170C775001A468762E16104
$$ y = [-268328, -370551, 197837, -190327, -176170, 573, 183496, -184172, -185929, 52402, 67634, 103018, -190542, 49750, 150091, -348507, -8099, 1063, 35560, -243674, -158616, 171907, -26448, -71021, -47738, 132892, -162750, -22704, -181625, 51200, -107879, 32655, -353983, 120653, -30585, -83561, 68583, 195022, 39944, -201891, 16863, -62997, 146959, 185500, -764, -124102, -10515, -124227, -116618, 85435, -258536, 344942, 271313, 2463, 55062, -203072, -39764, -48795, -41843, -195052, 16613, -103343, -43046, 268335, -188288, -83777, -369108, 196158, 25012, 249614, 162098, 184671, 27364, -63243, 199480, 144984, -131765, 109635, -87680, -100654, 370545, 626, -102914, 299878, 300021, 865895, 1807709, 5098978, 11444148, 3775001, 1468762, 516104]
8916B03287j392n1572J24724a30245A9715K52656a13742j31738a639B09242a06666
8904i4535p9020G4262K19317d48270A62977a87949H4587a9654j44766M2556D4134
8892f6784l45915A01627f0515A14511c16788A44429i8990k93494a24903d8558
8881C4481J07583m4895M4317b10861F6674c9668n08416a62530e9437j59960i7426
8869b96101g0396C34244A56757g2903j70840I8904K4027a90203j33697G031N491
8858A2522Q6963R439M3206h7923k05754A2898j002a10075r0906A89764K7969a21285
$$ y = [203287, 201895, 150323, 275047, -130245, 19715, 272371, -113742, -245480, -1639, 209242, -106666, -94535, -173555, 74262, 293579, -448270, 162977, -187949, 84587, -19654, -164420, -121864, 44134, -66784, -412699, 101627, -60515, 114511, -316788, 144429, -98990, -392484, -124903, -48558, 34481, 142064, 97169, 141486, -210861, 66674, -39668, -548084, -162530, -59437, -219397, -97426, -296101, -70396, 334244, 156757, -72903, -243743, 98904, 122931, -190203, -323900, 7031, 12522, 99485, 108924, 152130, -87923, -293677, 12898, 11896, -110075, -200981, 189764, 217733, -121285]
$$ [...]
##END NTUPLES=NMR SPECTRUM
##END=
