##TITLE=AC1697_ROEFFECT0026_8637774_ixY62Nhbj3
##JCAMPDX= 6.0         $$ Bruker NMR JCAMP-DX V2.0
##DATA TYPE= NMR SPECTRUM
##DATA CLASS= NTUPLES
##ORIGIN= BRUKER
##OWNER= Administrator
$$ 1.72 TOPSPIN		Version 2.1
$$ 2014-05-23 01:38:29.974 -0700  Administrator@X
$$ Compression mode = diff/dup
##.OBSERVE FREQUENCY= 400.02188249412
##.OBSERVE NUCLEUS= ^1H
##.ACQUISITION MODE= SIMULTANEOUS (DQD)
##.ACQUISITION SCHEME= undefined
##.AVERAGES= 64
##.DIGITISER RES= 22
##SPECTROMETER/DATA SYSTEM= spect
##.PULSE SEQUENCE= noesygpps1d.comp
##.SOLVENT NAME= COFFEE_meoh
##.SHIFT REFERENCE= INTERNAL, COFFEE_meoh, 1, 14.96113
##AUDIT TRAIL= $$ (NUMBER, WHEN, WHO, WHERE, PROCESS, VERSION, WHAT)
$$ ##TITLE= Audit trail, TOPSPIN		Version 2.1
$$ ##JCAMPDX= 5.01
$$ ##ORIGIN= Bruker BioSpin GmbH
$$ ##OWNER= Administrator
$$ $$ E:\/data/COFFEE/nmr/AC1697_ROEFFECT0026_8637774_ixY62Nhbj3/12/pdata/1/auditp.txt
$$ ##AUDIT TRAIL=  $$ (NUMBER, WHEN, WHO, WHERE, PROCESS, VERSION, WHAT)
(   1,<2014-05-23 01:38:25.131 -0700>,<Administrator>,<X>,<go>,<TOPSPIN 2.1>,
      <created by zg
	started at 2014-05-23 01:26:55.473 -0700,
	POWCHK enabled, PULCHK disabled,
       configuration hash MD5:
       C8 4E 4E 5D D3 5C D8 9E 9F 52 82 E0 59 8A DE 15
       data hash MD5: 64K
       68 00 20 7E 0C 93 30 01 1B 36 34 8A 57 2C BB 32>)
(   2,<2014-05-23 01:38:28.006 -0700>,<Administrator>,<X>,<proc1d>,<TOPSPIN 2.1>,
      <Start of raw data processing
       efp LB = 0.3 FT_mod = 6 PKNL = 1 PHC0 = 0 PHC1 = 0 SI = 128K 
       data hash MD5: 128K
       48 FF 48 9D 54 CB C7 1E 17 7B EB D0 8E 60 88 3B>)
(   3,<2014-05-23 01:38:28.912 -0700>,<Administrator>,<X>,<proc1d>,<TOPSPIN 2.1>,
      <pk PHC0 = -85.85266 PHC1 = 0 
       data hash MD5: 128K
       C7 5C C7 92 ED EA 1D 69 27 78 92 EE 6B BE F4 91>)
(   4,<2014-05-23 01:38:29.381 -0700>,<Administrator>,<X>,<proc1d>,<TOPSPIN 2.1>,
      <abs ABSG = 1 
       data hash MD5: 128K
       84 C7 A5 5E 8B 48 E1 99 88 D7 ED 6B D7 B0 F8 15>)
(   5,<2014-05-23 01:38:29.490 -0700>,<Administrator>,<X>,<proc1d>,<TOPSPIN 2.1>,
      <abs ABSG = 2 
       data hash MD5: 128K
       BC 92 7E 8E B7 BC 17 B0 D0 B8 8B D2 3D 91 FD 9D>)
(   6,<2014-05-23 01:38:29.584 -0700>,<Administrator>,<X>,<proc1d>,<TOPSPIN 2.1>,
      <abs ABSG = 3 
       data hash MD5: 128K
       06 13 40 39 BE C2 19 C1 D0 88 93 A3 BC B2 AC FA>)
(   7,<2014-05-23 01:38:29.662 -0700>,<Administrator>,<X>,<proc1d>,<TOPSPIN 2.1>,
      <abs ABSG = 4 
       data hash MD5: 128K
       39 62 68 5F 50 A0 B8 36 6C 3D AD 0F 56 F7 26 0A>)
(   8,<2014-05-23 01:38:29.740 -0700>,<Administrator>,<X>,<proc1d>,<TOPSPIN 2.1>,
      <abs ABSG = 5 
       data hash MD5: 128K
       BF 1E A6 9C 87 36 07 29 C9 36 89 84 27 ED AC A5>)
$$ ##END=
$$ 
$$ $$ hash MD5
$$ $$ E4 80 32 B0 A7 0F 1E 5B 85 6F 2B F9 DF A6 7B DC
##$RELAX= 
##$RELAX= 
##$RELAX= 
##$RELAX= 
##$RELAX= 
##$RELAX= 
##$RELAX= 
##$RELAX= 
$$ Bruker specific parameters
$$ --------------------------
##$DU= <E:\>
##$EXPNO= 12
$$ [...]
##$TP07= 0
##$TPNAME0= <>
##$TPNAME1= <>
##$TPNAME2= <>
##$TPNAME3= <>
##$TPNAME4= <>
##$TPNAME5= <>
##$TPNAME6= <>
##$TPNAME7= <>
##$TPOAL= (0..7)
0.5 0.5 0.5 0.5 0.5 0.5 0.5 0.5
##$TPOFFS= (0..7)
0 0 0 0 0 0 0 0
##$TUNHIN= 0
##$TUNHOUT= 0
##$TUNXOUT= 0
##$USERA1= <user>
##$USERA2= <user>
##$USERA3= <user>
##$USERA4= <user>
##$USERA5= <user>
##$V9= 5
##$VALIST= <valist>
##$VCLIST= <CCCCCCCCCCCCCCC>
##$VD= 0
##$VDLIST= <DDDDDDDDDDDDDDD>
##$VPLIST= <PPPPPPPPPPPPPPP>
##$VTLIST= <TTTTTTTTTTTTTTT>
##$WBST= 2048
##$WBSW= 25
##$XGAIN= (0..3)
0 0 0 0
##$XL= 0
##$YL= 0
##$YMAX_a= 6410975
##$YMIN_a= -13996780
##$ZGOPTNS= <>
##$ZL1= 120
##$ZL2= 120
##$ZL3= 120
##$ZL4= 120
##$ABSF1= 14.96113
##$ABSF2= -5.597052
##$ABSG= 5
##$ABSL= 3
##$ALPHA= 0
##$AQORDER= 0
##$ASSFAC= 0
##$ASSFACI= 0
##$ASSFACX= 0
##$ASSWID= 0
##$AUNMP= <proc_prof1d_extract.lims>
##$AXLEFT= 0
##$AXNAME= <>
##$AXNUC= <1H>
##$AXRIGHT= 0
##$AXTYPE= 0
##$AXUNIT= <>
##$AZFE= 0.1
##$AZFW= 0.1
##$BCFW= 0
##$BC_mod= 0
##$BYTORDP= 0
##$COROFFS= 0
##$CY= 15
##$DATMOD= 1
##$DC= 0
##$DFILT= <>
##$DTYPP= 0
##$F1P= 0
##$F2P= 0
##$FCOR= 0.5
##$FTSIZE= 131072
##$FT_mod= 6
##$GAMMA= 0
##$GB= 0
##$INTBC= 1
##$INTSCL= 1
##$ISEN= 128
##$LB= 0.3
##$LEV0= 0
##$LPBIN= 0
##$MAXI= 10000
##$MC2= 0
##$MEAN= 0
##$ME_mod= 0
##$MI= 0
##$NCOEF= 0
##$NC_proc= -2
##$NLEV= 6
##$NOISF1= 0
##$NOISF2= 0
##$NSP= 0
##$NTH_PI= 0
##$NZP= 0
##$OFFSET= 14.96113
##$PC= 1
##$PHC0= -85.85266
##$PHC1= 0
##$PH_mod= 1
##$PKNL= yes
##$PPARMOD= 0
##$PPDIAG= 0
##$PPIPTYP= 0
##$PPMPNUM= 2147483647
##$PPRESOL= 1
##$PSCAL= 4
##$PSIGN= 0
##$PYNMP= <proc.py>
##$REVERSE= no
##$SF= 400.020009584776
##$SI= 131072
##$SIGF1= 0
##$SIGF2= 0
##$SINO= 400
##$SIOLD= 131072
##$SPECTYP= <>
##$SREGLST= <1H.CDCl3>
##$SSB= 0
##$STSI= 131072
##$STSR= 0
##$SW_p= 8223.68421052631
##$SYMM= 0
##$S_DEV= 0
##$TDeff= 65536
##$TDoff= 0
##$TI= <>
##$TILT= no
##$TM1= 0
##$TM2= 0
##$TOPLEV= 0
##$USERP1= <user>
##$USERP2= <user>
##$USERP3= <user>
##$USERP4= <user>
##$USERP5= <user>
##$WDW= 1
##$XDIM= 131072
##$YMAX_p= 444110700
##$YMIN_p= -11663
##$CURPLOT= <Network HP LaserJet P1505>
##$CURPRIN= <$Network HP LaserJet P1505>
##$DFORMAT= <normdp>
##$LAYOUT= <+/1D_H.xwp>
##$LFORMAT= <normlp>
##$PFORMAT= <normpl>
##$SURQMSG= 1
$$ End of Bruker specific parameters
$$ ---------------------------------
##NTUPLES= NMR SPECTRUM
##VAR_NAME=  FREQUENCY,     SPECTRUM/REAL,   SPECTRUM/IMAG
##SYMBOL=    X,             R,               I
##VAR_TYPE=  INDEPENDENT,   DEPENDENT,       DEPENDENT
##VAR_FORM=  AFFN,          ASDF,            ASDF
##VAR_DIM=   131072,        131072,          131072
##UNITS=     HZ,            ARBITRARY UNITS, ARBITRARY UNITS
##FACTOR=    0.0627417313425164, 1,          1
##FIRST=     8223.62146879497, 2304,         -67811
##LAST=      0,             5165,            -67870
##MIN=       0,             -11663,          0
##MAX=       8223.62146879497, 444110700,    0
$$ Real data points
##PAGE= N=1
##DATA TABLE= (X++(R..R)), XYDATA
$$ [...]
63821D93632j4983j4050j3424j2706j1932j1118r861p958o031m887m499m235l854
$$ 493632 478649 464599 451175 438469 426537 415419 405558 397600 391569 386682 382183 377948 374094
63808C74094l610l445k897j882r89p47j019j328j461j528j692k006k436k918l393
$$ 374094 370484 367039 364142 362260 361271 360524 359505 358177 356716 355188 353496 351490 349054 346136 342743
63793C42743l783l923l677l156k688k550k894l842n202o133n676l934k150j280
$$ 342743 338960 335037 331360 328204 325516 322966 320072 316230 311028 304895 299219 295285 293135 291855
63779B91855j053q07n78p05r30p96n40p11j072q51n6M54L12J15K77K70m60j491
$$ 291855 290802 289995 289417 288712 287782 286986 286446 285735 284663 283812 283756 284210 284522 284637 284914 285184 284724 283233
63761B83233j989j792j380r84l43O79J615J761R73q8n38k09K68L12P2NJ47K67
$$ 283233 281244 279452 278072 277088 276745 277424 279039 280800 281773 281685 281147 280938 281206 281518 281590 281595 281742 282009
63743B82009M61J009J746K247K593L246M068M244L493K713K856L644L962L304
$$ 282009 282470 283479 285225 287472 290065 293311 297379 301623 305116 307829 310685 314329 318291 321595
63729C21595K244J625J670K061K532L174M122N051N367N005M745N276O115O101
$$ 321595 323839 325464 327134 329195 331727 334901 339023 344074 349441 354446 359191 364467 370582 376683
63715C76683M908L395K291J350J97p51r55p94j097j806k054j547j038j149j426
$$ 376683 381591 384986 387277 388627 388824 388073 387118 386324 385227 383421 381367 379820 378782 377633 376207
63700C76207j030O5J113J570J599J686K187L163M299M945M668L850L361L450L354
$$ 376207 375177 375242 376355 377925 379524 381210 383397 386560 390859 395804 400472 404322 407683 411133 414487
63685D14487K351Q39j35k50j92n86j253j779k183k561k591j956j031n43o43q03
$$ 414487 416838 417677 417542 417292 417100 416514 415261 413482 411299 408738 406147 404191 403160 402617 401974 401171
63669D01171o02j35L94R63J458J601J346J024Q65O35j3j068k243l320m180m700
$$ 401171 400569 400434 400828 401791 403249 404850 406196 407220 408085 408720 408707 407639 405396 402076 397896 393196
63653C93196m901n079n487n906n788m873l531k388j756j474j246r76p50n51j52
$$ 393196 388295 383216 377729 371823 366035 361162 357631 355243 353487 352013 350767 349791 349041 348490 348338
63638C48338O05J536K276K716L108L649M144M255M106M298N236O543P442P636
$$ 348338 348943 350479 352755 355471 358579 362228 366372 370627 374733 379031 384267 390810 398252 405888
63624D05888P518P496P514P489P808Q882J0408J1585J2109J2461J3228J4564J6404
$$ 405888 413406 420902 428416 435905 443713 452595 463003 474588 486697 499158 512386 526950 543354
63611E43354J8606K0736K2352K3753K5872K8977L1994L3653L3809L3097L1686
$$ 543354 561960 582696 605048 628801 654673 683650 715644 749297 783106 816203 847889
63600H47889K9133K5261K0346J4622Q287K107k750n699p094p533p330o849o792
$$ 847889 877022 902283 922629 937251 945538 947645 944895 939196 932102 924569 917239 910390 903598
63587I03598p726r647j2186j5054j8115k1246k4200k6439k7166k5949k3336k0485
$$ 903598 895872 886225 874039 858985 840870 819624 795424 768985 741819 715870 692534 672049
63575F72049j8086j5949j3679j1245q797o378m137k359r94M47K248L976N038N379
$$ 672049 653963 638014 624335 613090 604293 597915 593778 591419 590425 590872 593120 597096 602134 607513
63561F07513N317M919M100L307L411M727O527P897Q849J0233J2543J5298J7783
$$ 607513 612830 617749 621849 625156 628567 633294 639821 647718 656567 666800 679343 694641 712424
63548G12424K0056K2820K6406L0418L4452L8615M2968M6658M7987M5227L7546
$$ 712424 732480 755300 781706 812124 846576 885191 928159 974817 1022804 1068031 1105577
63537A105577K5591J1696r24r852j4596j6108j5546j3843j1857j0226r106q607
$$ 1105577 1131168 1142864 1141940 1132088 1117492 1101384 1085838 1071995 1060138 1049912 1040806 1032199
63525A032199r331j1893j5999k0670k5290k9787l3770l6358l7102l6465l5078
$$ 1032199 1022868 1010975 994976 974306 949016 919229 885459 849101 811999 775534 740456
63514G40456l3068l0381k7264k4077k1061j8515j6691j5331j3790j1917j0225
$$ 740456 707388 677007 649743 625666 604605 586090 569399 554068 540278 528361 518136
63503E18136q965p674o107m992n087n924o212n330l855k681k197k276k572k734
$$ 518136 509171 501497 495390 490398 485311 479387 473175 467845 463990 461309 459112 456836 454264 451530
63489D51530k610k336k053j690j180o58k23K98R95J646K081K482K924L002K474
$$ 451530 448920 446584 444531 442841 441661 441003 440780 441078 442073 443719 445800 448282 451206 454208 456682
63474D56682J981K374L379L728K781J288K70k49q70j663k078j878j581j779k428
$$ 456682 458663 461037 464416 468144 470925 472213 472483 472234 471364 469701 467623 465745 464164 462385 459957
63459D59957k992l111k785k000n92J274K823L300K999L163M533O270O819N851
$$ 459957 456965 453854 451069 449069 448477 449751 452574 455874 458873 462036 466569 472839 479658 485509
63445D85509M774N115O866Q759R887J0393J0666J0621J0195R988J0803J2750J5386
$$ 485509 490283 495398 502264 511023 520910 531303 541969 552590 562785 572773 583576 596326 611712
63432F11712J8652K2879K7733L1781L3488L2279K8436K2648J6119J0504O968N441
$$ 611712 630364 653243 680976 712757 746245 778524 806960 829608 845727 856231 863199 868640
63420H68640N278O268Q466J1516J4986J9076K4094K9401L3697L6353L7415L6395
$$ 868640 873918 880186 888652 900168 915154 934230 958324 987725 1021422 1057775 1095190 1131585
63408A131585L2254K4980J6156P513k46o759j1215j3094j2995j1960j0583r447
$$ 1131585 1163839 1188819 1204975 1212488 1212242 1205483 1194268 1181174 1168179 1156219 1145636 1136189
63396A136189r730j2266j6394k0714k4745k8950l3235l6503l7878l7513l5961
$$ 1136189 1126459 1114193 1097799 1077085 1052340 1023390 990155 953652 915774 878261 842300
63385H42300l3475l0306k7154k4711k2965k1258j9000j6187j3193j0208p030l541
$$ 842300 808825 778519 751365 726654 703689 682431 663431 647244 634051 623843 616813 613272
63373F13272j53K537M486O137P637Q706R477J0652J2387J3709J3790J3300J3693
$$ 613272 613119 615656 620142 626279 633916 642622 652099 662751 675138 688847 702637 715937 729630
63360G29630J5401J7590J9516K1338K3591K6543L0154L4025L7353L9399M0012
$$ 729630 745031 762621 782137 803475 827066 853609 883763 917788 955141 994540 1034552
63349A034552L9216L6456L1041K3360J4950P222O47m720q626j0869j1668j1551
$$ 1034552 1073768 1110224 1141265 1164625 1179575 1186797 1187444 1182724 1174098 1163229 1151561 1140010
63337A140010j1173j1242j2166j3708j5516j7920k1504k5877k9669l1980l3069
$$ 1140010 1128837 1117595 1105429 1091721 1076205 1058285 1036781 1010904 981235 949255 916186
63326I16186l3268l2100k9147k5098k1185j7927j5045j2204r221n846k218N39
$$ 916186 882918 850818 821671 796573 775388 757461 742416 730212 720991 715145 712927 713466
63314G13466P83k316q060j4632j9958k2615k2576k1033j9126j7026j4565j2280
$$ 713466 714249 711933 703873 689241 669283 646668 624092 603059 583933 566907 552342 540062
63302E40062j0928j0193q816o311l720k306k086k175k061j953k166k721l569m725
$$ 540062 529134 518941 510125 503814 500094 497788 495702 493527 491466 489513 487347 484626 481057 476332
63288D76332o029p081p479p065o003m773l932l675l665l498l220l142l261l225
$$ 476332 470303 463222 455743 448678 442675 437902 433970 430295 426630 423132 419912 416770 413509 410284
63274D10284k883k477k184j843j295o76r9O00J480K082J897J183Q10J239K061
$$ 410284 407401 404924 402740 400897 399602 398926 398827 399427 400907 402989 404886 406069 406879 408118 410179
63259D10179K633K787K689K467K299K562L467M659N514N802N730N560N506N937
$$ 410179 412812 415599 418288 420755 423054 425616 429083 433742 439256 445058 450788 456348 461854 467791
63245D67791P095Q557R505R730R982J1026J2653J4068J4942J5673J6689J8004
$$ 467791 474886 483443 492948 502678 512660 523686 536339 550407 565349 581022 597711 615715
63233F15715J9475K1033K2547K3858K5201K7040K9242L0779L0851K9964K9318
$$ 615715 635190 656223 678770 702628 727829 754869 784111 814890 845741 875705 905023
63222I05023K9186K8684K7301K5920K5827K7112K8634K9326K9129K8667K8340
$$ 905023 934209 962893 990194 1016114 1041941 1069053 1097687 1127013 1156142 1184809 1213149
63211A213149K7762K5986K2422J7668J3030Q983M580j240q176j5006k1101k6663
$$ 1213149 1240911 1266897 1289319 1306987 1320017 1329000 1333580 1332340 1324164 1309158 1288057 1261394
63199A261394l1698l5597l7777l8039l6335l2998k9190k6127k3724k0865j7290
$$ 1261394 1229696 1194099 1156322 1118283 1081948 1048950 1019760 993633 969909 949044 931754
63188I31754j4070j1835r726o874l764j144J505N082R173J2562J5044J7278J9118
$$ 931754 917684 905849 896123 889249 885485 884341 885846 890928 900101 912663 927707 944985 964103
63175I64103J9617J8829J8125J8285J8509J7887J6767J5954J5399J4497J3037
$$ 964103 983720 1002549 1020674 1038959 1057468 1075355 1092122 1108076 1123475 1137972 1151009
63164A151009J1108Q570N291J603k173o295j1083j6115k0539k4055k6973k9376
$$ 1151009 1162117 1170687 1175978 1177581 1175408 1169113 1158030 1141915 1121376 1097321 1070348 1040972
63152A040972l0887l1335l1144l0840l0376k9218k6991k3997k1104j9036j7753
$$ 1040972 1010085 978750 947606 916766 886390 857172 830181 806184 785080 766044 748291
63141G48291j6632j5157j3306j1294r323p631o357n212l703j932o25oP56K448
$$ 748291 731659 716502 703196 691902 682579 674948 668591 663379 659676 657744 657119 657113 657869 660317
63127F60317M526N790O065O382P445Q843R981J1002J2186J3012J2553J0659Q065
$$ 660317 664843 670633 676698 683080 690525 699368 709349 720351 732537 745549 758102 768761 776826
63114G76826N426K839M48j117j404r43q45j533k320k403j917j640j934k441k777
$$ 776826 782252 785091 785539 784422 783018 782075 781230 779697 777377 774974 773057 771417 769483 767042 764265
63099G64265k977l102k978k669k749l565m453m334l051j541n85N6J010K309L422
$$ 764265 761288 758186 755208 752539 749790 746225 741772 737438 734387 732846 732261 732317 733327 735636 739058
63084G39058L990M109M057M055M161M148L669K911K800M040O035P410P662P681
$$ 739058 743048 747157 751214 755269 759430 763578 767247 770158 772958 776998 783033 790443 798105 805786
63070H05786Q407R511R999R721R646J0694J2722J4851J6448J7698J9299K1714
$$ 805786 814193 823704 833703 843424 853070 863764 876486 891337 907785 925483 944782 966496
63058I66496K4659K7431K9790L2232L5252L8641M1905M5112M8782N2952N6972
$$ 966496 991155 1018586 1048376 1080608 1115860 1154501 1196406 1241518 1290300 1343252 1400224
63047A400224O0389O3425O6281O8506O9568O9771O9920P0157O9673O7829O5202
$$ 1400224 1460613 1524038 1590319 1658825 1728393 1798164 1868084 1938241 2007914 2075743 2140945
63036B140945O3143O2366O2270O1782O0678N9668N9114N7952N4386M7620L8541
$$ 2140945 2204088 2266454 2328724 2390506 2451184 2510852 2569966 2627918 2682304 2729924 2768465
63025B768465K8520J7886N865q100k3363l8477n2235o4202p4299q2252q7539q9866
$$ 2768465 2796985 2814871 2820736 2812636 2789273 2750796 2698561 2634359 2560060 2477808 2390269 2300403
63013B300403q9397q6583q1974p6273p0201o4017n7315m9578m0828l1578k2419
$$ 2300403 2211006 2124423 2042449 1966176 1895975 1831958 1774643 1725065 1684237 1652659 1630240
63002A630240j3906o502k03N603J1405J6867K1301K4636K7256K9177L0095L0230
$$ 1630240 1616334 1609832 1609629 1615232 1626637 1643504 1664805 1689441 1716697 1745874 1775969 1806199
62990A806199L0207L0069K9333K8200K7654K7940K7910K6440K3648K0080J5522
$$ 1806199 1836406 1866475 1895808 1924008 1951662 1979602 2007512 2033952 2057600 2077680 2093202
62979B093202R537K506m814j2289k0123k7978l5314m2185m8803n4544n8389o0233
$$ 2093202 2102739 2105245 2100431 2088142 2068019 2040041 2004727 1962542 1913739 1859195 1800806 1740573
62967A740573o0841o0586n9226n6902n4378n2030m9475m6375m3009l9778l6815
$$ 1740573 1679732 1619146 1559920 1503018 1448640 1396610 1347135 1300760 1257751 1217973 1181158
62956A181158l4278l2396l1023k9680k8188k6781k5488k4099k2802k2072k1731
$$ 1181158 1146880 1114484 1083461 1053781 1025593 998812 973324 949225 926423 904351 882620
62945H82620k0885j9209j7611j6993j6988j6495j5131j3454j1963j0530q899p256
$$ 882620 861735 842526 824915 807922 790934 774439 759308 745854 733891 723361 714462 707206
62933G07206o045n404n035m611m157l815l370k360q26M81R19O75K91j35q28j694
$$ 707206 701161 695757 690722 686111 681954 678139 674769 672409 671583 672064 672983 673658 673949 673814 672986 671292
62917F71292k408k888l149l013k559k490l257m110m048l452l655m862n831n788
$$ 671292 668884 665996 662847 659834 657275 654785 651528 647418 643370 639918 636263 631401 625570 619782
62903F19782n349n081m475l146j886j520j590j163l54O9M8R7J49l54j258j629
$$ 619782 614433 609352 604877 601731 599845 598325 596735 595572 595218 595287 595335 595432 595581 595227 593969 592340
62887E92340j050j47L60M38L57J41k15m29j84M19R14R08L86k66n32j92L90N03
$$ 592340 591290 591143 591503 591941 592298 592439 592224 591795 591611 592030 592944 593852 594238 593972 593440 593248 593638 594141
62869E94141k49j482k349k364j895j605j529j106k20L85J83k00J94J231J967K082
$$ 594141 593892 592410 590061 587697 585802 584197 582668 581562 581342 581727 581910 581710 581904 583135 585102 587184
62853E87184K087K188K024J637J657K156K385K029J706J751J569Q56M07P24Q63
$$ 587184 589271 591459 593483 595120 596777 598933 601318 603347 605053 606804 608373 609229 609636 610360 611223
62838F11223j91j746k276j609r34q92j006q76p56p12l39L78Q27P44O75J087J700
$$ 611223 611032 609286 607010 605401 604467 603575 602569 601693 600937 600225 599886 600264 601091 601835 602510 603597 605297
62821F05297K104K437L009L640L852L545L153L216L885M833N539N763N627N231
$$ 605297 607401 609838 612847 616487 620339 623884 627037 630253 634138 638971 644510 650273 655900 661131
62807F61131M548L815L639M267N104N450N505O018P112Q109Q533Q722R223J0150
$$ 661131 665679 669494 673133 677400 682504 687954 693459 699477 706589 714698 723231 731953 741176 751326
62793G51326J1250J2305J3311J4498J6252J8789K1951K5491K9460L3977L8848
$$ 751326 762576 774881 788192 802690 818942 837731 859682 885173 914633 948610 987458
62782I87458M3785M8921N4677O1117O7817P4308Q0406Q6146R1675R7011J01676
$$ 987458 1031243 1080164 1134841 1195958 1263775 1338083 1418489 1504635 1596310 1693321 1794997
62771A794997J04857J06200J06100J04663J00856R3362Q2068O8008N2063L4568
$$ 1794997 1899854 2006054 2112154 2216817 2317673 2411035 2493103 2561111 2613174 2647742
62761B647742J6051k631k0985l8859n5540o9786q1092r0135r7504j02669j04821
$$ 2647742 2663793 2661162 2640177 2601318 2545778 2475992 2394900 2304765 2207261 2104592 1999771
62750A999771j04190j02025r9424r6595r3008q8018q1593p4598o8129o2452n7012
$$ 1999771 1895581 1793556 1694132 1597537 1504529 1416511 1334918 1260320 1192191 1129739 1072727
62739A072727n1528m6420m1986l7824l3549k9529k6278k3546k0699j7698j5059
$$ 1072727 1021199 974779 932793 894969 861420 831891 805613 782067 761368 743670 728611
62728G28611j2918j0832q593o687n645n248m714l542k012p44O1Q24J940L235M313
$$ 728611 715693 704861 696268 689581 683936 678688 673974 670432 668420 667676 667737 668561 670501 673736 678049
62713F78049N253O537Q272R999J1486J3163J5447J8015K0273K2335K4982K8683
$$ 678049 683302 689839 698111 708110 719596 732759 748206 766221 786494 808829 833811 862494
62701H62494L3068L7394M1216M4543M7628N0779N4156N7644O1053O4432O7895
$$ 862494 895562 932956 974172 1018715 1066343 1117122 1171278 1228922 1289975 1354407 1422302
62690A422302P1063P2954P2804P0810O7626O3185N6511M6910L4936K1821Q332
$$ 1422302 1493365 1566319 1639123 1709933 1777559 1840744 1897255 1944165 1979101 2000922 2009254
62679B009254n361j8930l1765m3525n4107o2919o8981p2173p3625p4356p4071
$$ 2009254 2003893 1984963 1953198 1909673 1855566 1792647 1723666 1651493 1577868 1503512 1429441
62668A429441p2100o8920o5778o3015n9802n5605n0944m6435m2010l7568l3636
$$ 1429441 1357341 1288421 1222643 1159628 1099826 1044221 993277 946842 904832 867264 833628
62657H33628l0683k8213k5277k1718j8352j5958j4475j3309j2087j0983j0426
$$ 833628 802945 774732 749455 727737 709385 693427 678952 665643 653556 642573 632147
62646F32147j0532j0765j0302q843o974n670n343n505n237l964j873L11J906K670
$$ 632147 621615 610850 600548 591705 584731 579061 573718 568213 562976 559012 557139 557450 559356 562026
62632E62026K737K366J789J129L19p56j887k560k489j979j478j032m61J34N31
$$ 562026 564763 567129 568918 570047 570366 569610 567723 565163 562674 560695 559217 558185 557724 557858 558389
62617E58389Q76J560K567L430L896M218M703N312N897O482P080P545P845Q271
$$ 558389 559265 560825 563392 566822 570718 574936 579639 584951 590848 597330 604410 611955 619800 628071
62603F28071R175J0564J2095J3408J4533J5969J8304K1624K5438K9316L3356L7710
$$ 628071 637246 647810 659905 673313 687846 703815 722119 743743 769181 798497 831853 869563
62591H69563M1917M5210M7419M9062N0492N1449N1515N0527M8249M4104L7639
$$ 869563 911480 956690 1004109 1053171 1103663 1155112 1206627 1257154 1305403 1349507 1387146
62580A387146K9192J9857J0705K039o610j5710k4849l2835l8810m2972m5956m7869
$$ 1387146 1416338 1436195 1446900 1448939 1442329 1426619 1401770 1368935 1330125 1287153 1241197 1193328
62568A193328m8427m7799m6582m5051m3039m0609l8156l5750l3013k9858k6769
$$ 1193328 1144901 1097102 1050520 1005469 962430 921821 883665 847915 814902 785044 758275
62557G58275k4075k1452j8552j5562j2909j0715q936p578o545n549m496l698l322
$$ 758275 734200 712748 694196 678634 665725 655010 646074 638496 631951 626402 621906 618208 614886
62544F14886l040k505j934j820k268k886l233l089k463j561o41K41J146J881J995
$$ 614886 611846 609341 607407 605587 603319 600433 597200 594111 591648 590087 589446 589687 590833 592714 594709
62529E94709J413P51P18J350K235L257M818P222J0099J2604J4209J5239J6570
$$ 594709 596122 596873 597591 598941 601176 604433 609251 616473 626572 639176 653385 668624 685194
62516F85194J8745K1551K4496K7437L0466L3515L6423L9278M2280M5309M8031
$$ 685194 703939 725490 749986 777423 807889 841404 877827 917105 959385 1004694 1052725
62505A052725N0205N1514N1291M9088M5438M1344L7018L1782K5351J8480J2145
$$ 1052725 1102930 1154444 1205735 1254823 1300261 1341605 1378623 1410405 1435756 1454236 1466381
62494A466381O713K236r71k415j688J460O833J3521K0436K7267L4352M1621M8447
$$ 1466381 1473094 1475330 1474359 1471944 1470256 1471716 1478549 1492070 1512506 1539773 1574125 1615746 1664193
62481A664193N4655O0811O7157P2955P7044P8021P3801O2627M5691K7701J3283
$$ 1664193 1718848 1779659 1846816 1919771 1996815 2074836 2148637 2211264 2256955 2284656 2297939
62470B297939K865p144k0559l8443n8894p8287r2875j00773j03111j02802j01957
$$ 2297939 2300804 2293660 2273101 2234658 2175764 2097477 2004602 1903829 1800718 1697916 1595959
62459A595959j00726r8221r3766q7227p8989o9903o0911n2522m4854l7922l1642
$$ 1595959 1495233 1397012 1303246 1216019 1137030 1067127 1006216 953694 908840 870918 839276
62448H39276k5769k0290j5539j1623q087m704k018m24Q01K603M714O145O922Q060
$$ 839276 813507 793217 777678 766055 757968 753264 751246 750822 751623 754226 758940 765085 772007 780067
62434G80067R704J0531R508P269N153L509J651r82m190p288r649j1078j1905j2605
$$ 780067 789771 800302 809810 817079 822232 825741 827392 826410 822220 814932 805283 794205 782300 769695
62420G69695j3248j3532j3358j2946j2435j1773j1110j0749j0578j0023q856p636
$$ 769695 756447 742915 729557 716611 704176 692403 681293 670544 659966 649943 641087 633451
62408F33451p046p069p118o740n889m763l642k797k304j990j639j272j105j231
$$ 633451 626405 619336 612218 605478 599589 594826 591184 588387 586083 584093 582454 581182 580077 578846
62394E78846j297o18J152L407M959N301N088N092N080M324K975K114K439L557
$$ 578846 577549 576931 578083 581490 586449 591750 596838 601930 607010 611334 614309 616423 618862 622419
62380F22419M733N745O748P819Q901R835J0248R817Q857Q295Q755R948J1152J1985
$$ 622419 627152 632897 639645 647464 656365 666200 676448 686265 695122 703417 712172 722120 733272 745257
62366G45257J2552J3104J3922J5293J7361K0048K3151K6414K9573L2661L6242
$$ 745257 757809 770913 784835 800128 817489 837537 860688 887102 916675 949336 985578
62355I85578M0961M6629N2138N6409N9174O0618O0604N8560N3997M6945L8034
$$ 985578 1026539 1073168 1125306 1181715 1240889 1301507 1362111 1420671 1474668 1521613 1559647
62344A559647K8299J8743R900J833n467j1925j7636k2959k8098l2825l6687l9418
$$ 1559647 1587946 1606689 1616589 1618422 1612955 1601030 1583394 1560435 1532337 1499512 1462825 1423407
62332A423407m0984m1389m0563l8475l5347l1794k8599k6158k4227k2443k0866
$$ 1423407 1382423 1341034 1300471 1261996 1226649 1194855 1166256 1140098 1115871 1093428 1072562
62321A072562j9748j8983j8288j7855j8111j8801j8977j8178j7084j6573j6584
$$ 1072562 1052814 1033831 1015543 997688 979577 960776 941799 923621 906537 889964 873380
62310H73380j6295j5091j2894r968o881m503l416l293l259k896k570k737l310
$$ 873380 857085 841994 829100 819132 812251 807748 804332 801039 797780 794884 792314 789577 786267
62297G86267l845m040l944l801l850m173m584m703m252l359k509k071j893j456
$$ 786267 782422 778382 774438 770637 766787 762614 758030 753327 749075 745716 743207 741136 739243 737787
62283G37787n52L87Q41Q57R11J205J590K124L158M664N994O648O966P610Q682
$$ 737787 737235 737622 738463 739320 740231 741436 743026 745150 748308 752972 758966 765614 772580 780190 788872
62268G88872R764J0648J1497J2388J3163J3824J4705J6140J8295K1347K5450L0359
$$ 788872 798636 809284 820781 833169 846332 860156 874861 891001 909296 930643 956093 986452
62256I86452L5459M0395M5434N0871N6337O0982O4194O5801O5615O3238N8404
$$ 986452 1021911 1062306 1107740 1158611 1214948 1275930 1340124 1405925 1471540 1534778 1593182
62245A593182N1319M2564L2870K2976J3444M468m035j2116j9855k7653l5962m4485
$$ 1593182 1644501 1687065 1719935 1742911 1756355 1760823 1756788 1744672 1724817 1697164 1661202 1616717
62233A616717n1996n7375o0486o1725o1136n8584n4565n0090m5710m1336l7036
$$ 1616717 1564721 1507346 1446860 1385135 1323999 1265415 1210850 1160760 1115050 1073714 1036678
62222A036678l3307l0229k7087k3359j9573j6659j4787j3391j2092j0947r923
$$ 1036678 1003371 973142 946055 922696 903123 886464 871677 858286 846194 835247 825324
62211H25324q705p224n934n231m750l600j423R35K115J816J347K198M306O269
$$ 825324 816619 809395 803461 798230 793480 789880 788457 789392 791507 793323 794670 796868 801174 807443
62197H07443P183P482P825Q107Q003P780P800P788P300O636O553P344Q702J0252
$$ 807443 814626 822108 829933 838040 846043 853823 861623 869411 876711 883347 889900 897244 905946 916198
62183I16198J1595J2121J1575J0712J0578J1136J1187R818P381M978L469L004
$$ 916198 927793 939914 951489 962201 972779 983915 995102 1004920 1012301 1017279 1020748 1023752
62171A023752L193L665M648O805J0213J4032J7639K1579K6531L1816L5949L8528
$$ 1023752 1026945 1030610 1035258 1042063 1052276 1066308 1083947 1105526 1132057 1163873 1199822 1238350
62159A238350M0373M1726M1512L8752L3820K7735K1112J4243P576J444m205r426
$$ 1238350 1278723 1320449 1361961 1400713 1434533 1462268 1483380 1497623 1505199 1506643 1502438 1493012
62147A493012j4106j8470k3178k8395l3229l6544l8015l8112l7445l6402l4940
$$ 1493012 1478906 1460436 1437258 1408863 1375634 1339090 1301075 1262963 1225518 1189116 1154176
62136A154176l2519k8740k4236k0272j7271j4477j1483r094q033p710p204o770
$$ 1154176 1121657 1092917 1068681 1048409 1031138 1016661 1005178 996084 988051 980341 973137 966367
62124I66367p152p928p843o660n495n114m976m296l092j732k14J512L028L927
$$ 966367 959215 951287 943444 936784 931289 926175 921199 916903 913811 912079 911865 913377 916405 920332
62110I20332M403M828M880L686Q75k828o139q106q422p249m978k234J22J275R25
$$ 920332 924735 929563 934443 938129 939004 936176 930037 921931 913509 906260 901282 899048 899170 900445 901370
62095I01370n62k458m152n282n675n296m343l159j965p10O88J987K730K793K739
$$ 901370 900808 898350 894198 888916 883241 877945 873602 870443 868478 867768 868456 870443 873173 875966 878705
62080H78705L307M527N706O402P070Q360J0128J1690J2880J4279J6176J7979J8936
$$ 878705 882012 886539 892245 898647 905717 914077 924205 935895 948775 963054 979230 997209 1016145
62067A016145J9070J8975J9026J9238J9774K1053K3240K5901K8319K9995L0610
$$ 1016145 1035215 1054190 1073216 1092454 1112228 1133281 1156521 1182422 1210741 1240736 1271346
62056A271346K9634K6422K0979J4491Q651M277Q98k322n689r245j3290j8058k3160
$$ 1271346 1300980 1327402 1348381 1362872 1371523 1375800 1376698 1374376 1368687 1359442 1346152 1328094 1304934
62043A304934k8015l2573l6956m0579m2416m2280m1146m0000l8941l7602l5794
$$ 1304934 1276919 1244346 1207390 1166811 1124395 1082115 1040969 1000969 962028 924426 888632
62032H88632l3444l0496k7183k4043k1369j9052j7067j5622j4579j3380j1811
$$ 888632 855188 824692 797509 773466 752097 733045 715978 700356 685777 672397 660586
62021F60586j0304r126p878o320n097m963n624o021n531m395l207k454k400k808
$$ 660586 650282 641156 633278 626958 621861 616898 611274 605253 599722 595327 592120 589666 587266 584458
62007E84458k904k118q13J44M66O74J289K212K993L366L410L316L135K708J931
$$ 584458 581554 579436 578623 578767 579233 579907 581196 583408 586401 589767 593177 596493 599628 602336 604267
61992F04267J034M24J67r4o60j545k856m857p369r494j0380j0109r441q938q677
$$ 604267 605301 605725 605892 605798 605138 603593 600737 595880 588511 579017 568637 558528 549087 540149 531472
61977E31472q556q373p806o719n450m476l928l646l564l625l468k685j384k13
$$ 531472 522916 514543 506737 500018 494568 490092 486164 482518 478954 475329 471861 469176 467792 467579
61963D67579K93K50K49Q04J851K829L248L194L075K970K668K269K267K828L512
$$ 467579 467872 468122 468371 469175 471026 473855 477103 480297 483372 486342 489010 491279 493546 496374 499886
61948D99886L956M269M584M760M920N620P039Q471R241R588J0103J0818J1500
$$ 499886 503842 508111 512695 517455 522375 527995 535034 543505 552746 562334 572437 583255 594755
61935E94755J2324J3432J4214J3998J3226J2961J3301J3231J2095J0376Q796P384
$$ 594755 607079 620511 634725 648723 661949 674910 688211 701442 713537 723913 732709 740093
61923G40093N785L816J469j123l560n417o767p926q636q178o541m722l468k308
$$ 740093 745878 749694 751163 750040 746480 741063 734296 726370 717734 709556 703015 698293 694825 692517
61909F92517l48K423N275P821J0269J2602J4203J4522J3767J2571J1136R028N918
$$ 692517 692169 694592 699867 707688 717957 730559 744762 759284 773051 785622 796758 805786 811704
61896H11704K269r13k973m034m589m985n340n612n593n092m304l724l497l233
$$ 811704 813973 813060 810087 806053 801464 796479 791139 785527 779934 774842 770538 766814 763317 760084
61882G60084k768k702l729n672p684r184j0179j0860j1413j2028j2588j2473j1265
$$ 760084 757316 754614 750885 745213 737529 728345 718166 707306 695893 683865 671277 658804 647539
61869F47539r530q286p673o862n325l534k138j033L48K229M302O092P270P835
$$ 647539 638009 629723 622050 615188 609863 606329 604191 603158 603506 605735 610037 616129 623399 631234
61855F31234Q227Q979J0221J1784J3730J6304J9233K1575K2704K3015K3277K3576
$$ 631234 639461 648440 658661 670445 684175 700479 719712 741287 763991 787006 810283 833859
61843H33859K3400K2459K0930J8891J6097J2464Q385M317M15l179n962p501q090
$$ 833859 857259 879718 900648 919539 935636 948100 956485 960802 961217 958038 952076 944575 936485
61830I36485q468q701p902n408j831J588M380O967R538J1600J2728J3006J2474
$$ 936485 928017 919316 911414 906006 904175 905763 910143 917110 926648 938248 950976 963982 976456
61817I76456J0779P821M144K83l785q025j1699j4033j5218j6080j6874j7085j6334
$$ 976456 987235 995056 999200 999483 995698 987673 975974 961941 946723 930643 913769 896684 880350
61804H80350j5005j3904j3565j3884j4241j4156j3938j4313j5300j5979j5717
$$ 880350 865345 851441 837876 823992 809751 795595 781657 767344 752044 736065 720348
61793G20348j4893j3964j2650j0788r231q759q657p638n846m654m526m438l663
$$ 720348 705455 691491 678841 668053 658822 650063 641406 633768 627922 623268 618742 614304 610641
61780F10641k787k573k860l168l459l705l446k440j194l40N6K21K50L96J146K579
$$ 610641 607854 605281 602421 599253 595794 592089 588643 586203 585009 584669 584725 584946 585196 585592 586738 589317
61764E89317M121N301O260P168P747P892Q176R116J0376J1252J1589J1652J1420
$$ 589317 593438 598739 604999 612167 619914 627806 635982 645098 655474 666726 678315 689967 701387
61751G01387J0532Q728N940K290j627m901p228r261j1493j3235j3440j2224j0785
$$ 701387 711919 720647 726587 728877 727250 722349 715121 705860 694367 681132 667692 655468 644683
61738F44683r908r331q615p841p257o770o125n187l987k759j986j919k065j610
$$ 644683 634775 625444 616829 608988 601731 594961 588836 583649 579662 576903 574917 572998 570933 569323
61724E69323n55J82M1l37p1O92J072Q22O03Q80J285J315J037O52j01j441k772
$$ 569323 568768 568950 568991 568654 568583 569275 570347 571169 571772 572652 573937 575252 576289 576941 576840 575399 572627
61707E72627l201k789k533k973l511l412k866k529k569k668k740l014l565m238
$$ 572627 569426 566637 564104 561131 557620 554208 551342 548813 546244 543576 540836 537822 534257 530019
61693E30019m934n571n872n612m977m348l878l555l531l874m213m084l571l159
$$ 530019 525085 519514 513642 508030 503053 498705 494827 491272 487741 483867 479654 475570 471999 468840
61679D68840l065l078k995k704k002q68J92N82M08K94M59M91J20l25l52J87J020
$$ 468840 465775 462697 459702 456998 454996 454128 454320 454902 455310 455604 456063 456554 456674 456349 455997 456184 457204
61662D57204J633J625J239J316K223L165L209K703K806L803M865N438N793N953
$$ 457204 458837 460462 461701 463017 465240 468405 471614 474317 477123 480926 485791 491229 497022 502975
61648E02975N263L567J857J058Q70N01q3l17k1M72R57J437J797J879J787J762
$$ 502975 508238 511805 513662 514720 515590 516091 516008 515691 515670 516142 517099 518536 520333 522212 523999 525761
61632E25761J824J893K066K465K930L063K589J557K95q49j892l229n082o938p950
$$ 525761 527585 529478 531544 534009 536939 540002 542591 544148 544443 543594 541702 538473 533391 526453 518503
61617E18503p769o700n132l408k093j758k312l111l698m083m291m374m644n319
$$ 518503 510734 504034 498902 495494 493401 491643 489331 486220 482522 478439 474148 469774 465130 459811
61603D59811n897n708n027m728m813m343l029j819j559k040k779l717m585m625
$$ 459811 453914 448206 443179 438451 433638 429295 426266 424447 422888 420848 418069 414352 409767 405142
61589D05142l639k456j751j246o88o06j282j860j470m71K78O75R48P18l64j618
$$ 405142 401503 399047 397296 396050 395362 394756 393474 391614 390144 389673 389951 390626 391574 392292 391928 390310
61573C90310k028j599r96l73M28J004Q77N46Q74J648J919J583J455J799K009J828
$$ 390310 388282 386683 385687 385314 385742 386746 387623 388169 389043 390691 392610 394193 395648 397447 399456 401284
61557D01284J774K094K342K285K325K624K661K054J167N56K96K42M01P08Q45O10
$$ 401284 403058 405152 407494 409779 412104 414728 417389 419443 420610 421166 421462 421704 422105 422813 423658 424268
61541D24268K04m1j0J87L18K03J0K09R42J699K027K230K810L488L479K594J321
$$ 424268 424472 424431 424421 424608 424926 425129 425139 425348 426290 427989 430016 432246 435056 438544 442023 444617 445938
61524D45938n1j650l326m475m788m512l913k983j838q02m3M65N95K79J3M85J608
$$ 445938 445887 444237 440911 436436 431648 427136 423223 420240 418402 417600 417557 418022 418617 418896 418909 419394 421002
61507D21002K467K434J783J139Q91J174J859K420K344J863J715K104K592L023
$$ 421002 423469 425903 427686 428825 429716 430890 432749 435169 437513 439376 441091 443195 445787 448810
61493D48810L763M722N009M154K935K375K418K321J934J765J895J671P85L3N83
$$ 448810 452573 457295 462304 466458 469393 471768 474186 476507 478441 480206 482101 483772 484557 484590 485173
61478D85173K576M761N705N198M303M027M177L777K383N73q18j599k177k909l688
$$ 485173 487749 492510 498215 503413 507716 511743 515920 519697 522080 522653 521835 520236 518059 515150 511462
61463E11462m129m073l844l897m238m421m237m043m118m082l384k219j318r70
$$ 511462 507333 503260 499416 495519 491281 486860 482623 478580 474462 470380 466996 464777 463459 462489
61449D62489p68l45J27L99O26J101J767K229K211J869J669J906K367K561K407
$$ 462489 461721 461376 461503 461902 462528 463629 465396 467625 469836 471705 473374 475280 477647 480208 482615
61434D82615K340K614K802K310J226K40j04J57O73J118J317J267J066Q28Q17J438
$$ 482615 484955 487569 490371 492681 493907 494147 494043 494200 494873 495991 497308 498575 499641 500469 501286 502724
61418E02724K717L809L767K902K508K965L104K073P87M68O85J56j063j658j143
$$ 502724 505441 509250 513017 515919 518427 521392 524496 526569 527356 527824 528509 528665 527602 525944 524801
61403E24801m13j72j52j61o89j908l056l349k862k137j494j028o80q7R75J929
$$ 524801 524388 524216 524064 523903 523214 521306 518250 514901 512039 509902 508408 507380 506700 506613 507588 509517
61387E09517J916J148Q74J690K745L126L149L638M583N284N449N444N607N868
$$ 509517 511433 512581 513455 515145 517890 521016 524165 527803 532386 537670 543119 548563 554170 560038
61373E60038O004N839N263M270L015J755P71J24n57j798l481m641m581l828l434
$$ 560038 566042 571881 577144 581414 584429 586184 586955 587079 586522 584724 581243 576602 572021 568193 564759
61358E64759l617l760l469k768j558J61J685K298K518L482N045N799N240M522
$$ 564759 561142 557382 553913 551145 549587 549748 551433 553731 556249 559731 564776 570575 575815 580337
61344E80337M538M600L746K342J390J147J276J694K389K910K866K428J876J158
$$ 580337 584875 589475 593221 595563 596953 598100 599376 601070 603459 606369 609235 611663 613539 614697
61330F14697M01Q6J13m39j886l101k953j815o77M37J961L368L727L404L764N179
$$ 614697 615098 615184 615297 614858 612972 609871 606918 605103 604426 604863 606824 610192 613919 617323 621087 626266
61314F26266O584P265P863R203J1045J2572J3470J4067J4826J6041J7716J9430
$$ 626266 632850 640115 647978 657181 668226 680798 694268 708335 723161 739202 756918 776348
61302G76348K0558K0736J9903J7958J4741J0494N908J602k221n536q230j0192
$$ 776348 796906 817642 837545 855503 870244 880738 886646 888248 886027 880491 872261 862069
61290H62069j1514j2426j3139j3796j4470j5116j5465j5085j3708j1733j0127
$$ 862069 850555 838129 824990 811194 796724 781608 766143 751058 737350 725617 715490
61279G15490r455r132q092o144m088k523j237M3J067J561J710J685J367R50J147
$$ 715490 706035 696903 688811 682667 678579 676056 674819 674862 675929 677490 679200 680885 682252 683202 684349
61264F84349K177L157L204K674K622L443M736O149P489Q333Q298P609O737N663
$$ 684349 686526 689683 692887 695561 698183 701626 706362 712511 720000 728333 736631 744240 750977 756640
61250G56640M164K563J443P22j87j333k084k034j468q25m20n71j404k355k594
$$ 756640 760804 763367 764810 765532 765345 764012 761928 759894 758426 757601 757181 756610 755206 752851 750257
61235G50257k091j637j673j740j311n43J90R88K227L931N739P351Q718R935J1128
$$ 750257 748166 746529 744856 743116 741805 741262 741452 742440 744667 748598 754337 761688 770406 780341 791469
61220G91469J2301J3191J3337J2512J1067R778R244R356R454R095Q528Q168P758
$$ 791469 803770 816961 830298 842810 853877 863655 872899 882255 891709 900804 909332 917500 925258
61207I25258O597M739L199K698K782K727K644L041L820M596N688P798J0751J3485
$$ 925258 931855 936594 939793 942491 945273 948000 950644 953685 957505 962101 967789 975587 986338 999823
61193I99823J5378J6756J7881J8274J7322J4975J1562P547L710Q86r41k770n320
$$ 999823 1015201 1031957 1049838 1068112 1085434 1100409 1111971 1119518 1123228 1124114 1123173 1120403 1115083
61180A115083p975r552r850r873j0610j2033j3393j4096j4115j3764j3406j3388
$$ 1115083 1107108 1097556 1087706 1077833 1067223 1055190 1041797 1027701 1013586 999822 986416 973028
61168I73028j3930j4822j5357j4971j4039j3639j4274j5255j5637j5326j4782
$$ 973028 959098 944276 928919 913948 899909 886270 871996 856741 841104 825778 810996
61157H10996j4045j2759j0981r180p443n435l241j455j68J358L457N170N270L830
$$ 810996 796951 784192 773211 764031 756588 751153 747912 746457 746289 747647 751104 756274 761544 765374
61143G65374K023N01j191l487n734o765o170m607l023j916j345j075o02O55K800
$$ 765374 767397 767898 766707 763220 757486 750721 744551 739944 736921 735005 733660 732585 731983 732638 735438
61128G35438N306P631R749J1820J3676J5155J6736J9028K1689K3629K4528K5399
$$ 735438 740744 748375 758124 769944 783620 798775 815511 834539 856228 879857 904385 929784
61116I29784K7173K9437L1145L1969L2328L2480L2387L2178L1993L1483L0187
$$ 929784 956957 986394 1017539 1049508 1081836 1114316 1146703 1178881 1210874 1242357 1272544
61105A272544K8265K6291K4405K2384K0334J8559J6611J3394Q501K904k004n609
$$ 1272544 1300809 1327100 1351505 1373889 1394223 1412782 1429393 1442787 1451288 1454192 1452188 1446579
61093A446579q133r971j1354j2334j2811j2637j1806j0408q463o118l756j500
$$ 1446579 1438446 1428475 1417121 1404787 1391976 1379339 1367533 1357125 1348662 1342544 1338788 1337288
61081A337288J288N326J0262J4841J8408K1510K4865K8353L1504L4250L6623L8257
$$ 1337288 1338576 1343902 1354164 1369005 1387413 1408923 1433788 1462141 1493645 1527895 1564518 1602775
61069A602775L8882L8863L8611L7682L5256L1333K6715K1754J5902Q781J014o320
$$ 1602775 1641657 1680520 1719131 1756813 1792069 1823402 1850117 1871871 1887773 1896554 1897568 1891248
61057A891248j2657j7961k2244k5593k8400l0956l2907l3596l2927l1448k9563
$$ 1891248 1878591 1860630 1838386 1812793 1784393 1753437 1720530 1686934 1654007 1622559 1592996
61046A592996k7211k4469k1856j9666j7436j4589j1265q098n338k807n07J378
$$ 1592996 1565785 1541316 1519460 1499794 1482358 1467769 1456504 1448406 1443068 1440261 1439754 1441132
61034A441132L042M998P273R235J0400J1049J1840J3174J5104J7466J9910K2180
$$ 1441132 1444174 1449172 1456445 1465680 1476080 1487129 1498969 1512143 1527247 1544713 1564623 1586803
61022A586803K4461K7122K9926L2029L3033L3646L5001L7736M1988M7964N5912
$$ 1586803 1611264 1638386 1668312 1700341 1733374 1767020 1802021 1839757 1881745 1929709 1985621
61011A985621O5690P6720Q8519J01147J15146J31009J49128J70674J98530K36080
$$ 1985621 2051311 2128031 2216550 2317697 2432843 2563852 2712980 2883654 3082184 3318264
61001C318264K84369L41362M05092M76856N60415O59649P79285R26881J111110
$$ 3318264 3602633 3943995 4349087 4825943 5386358 6046007 6825292 7752173 8863283
60992H863283J337963J608188J908304K187209K338837K234058J808853J141537
$$ 8863283 10201246 11809434 13717738 15904947 18243784 20477842 22286695 23428232
60984B3428232M34538r9367l48628l23541j02803K08716M76427N41024K85115
$$ 23428232 23862770 23763403 23414775 23091234 22988431 23197147 23673574 24214598 24499713
60975B4499713k77454r84811j617185k020868k165936k113083j946150j730892
$$ 24499713 24222259 23237448 21620263 19599395 17433459 15320376 13374226 11643334
60967A1643334j509057j304026j124101r67062q27921p03885n93860m96949m12843
$$ 11643334 10134277 8830251 7706150 6739088 5911167 5207282 4613422 4116473 3703630
60958C703630l41945k84036k37777k01667j74200j52971j35149j19279j05496
$$ 3703630 3361685 3077649 2839872 2638205 2464005 2311034 2175885 2056606 1951110
60949A951110r3804q3404p3897o5587n8278n1276m5014m1146m0240m0684m0710
$$ 1951110 1857306 1773902 1700005 1634418 1576140 1524864 1479850 1438704 1398464 1357780 1317070
60938A317070m0225l9805l9205l7954l6373l4880l3067l0544k7901k5784k3727
$$ 1317070 1276845 1237040 1197835 1159881 1123508 1088628 1055561 1025017 997116 971332 947605
60927I47605k0984j7960j5645j4197j3120j2410j2338j2423j1791j0516r474q908
$$ 947605 926621 908661 893016 878819 865699 853289 840951 828528 816737 806221 796747 787839
60915G87839q168o989o013n633n216l995k294j236j417k284k862k869k807l082
$$ 787839 779671 772682 766669 761036 755820 751825 749531 748295 746878 744594 741732 738863 736056 732974
60901G32974l449l632m020n107o466p127p008p115q062r257r909j0014r819r149
$$ 732974 729525 725893 721873 716766 710300 703173 696165 689050 680988 671731 661822 651808 641989 632840
60887F32840p989p041o859o886o190m854l799l500l600l751m076m722n457n789
$$ 632840 624851 617810 610951 604065 597875 593021 589222 585722 582122 578371 574295 569573 564116 558327
60873E58327n329m153k902k179j712o38J147K656L166L211L569M055M141M147
$$ 558327 552998 548845 545943 543764 542052 541414 542561 545217 548383 551594 555163 559218 563359 567506
60859E67506M780N892O693O994P310P850Q293Q450Q251P284N249K890J510J355
$$ 567506 572286 578178 584871 591865 599175 607025 615318 623768 632019 639303 644552 647442 648952 650307
60845F50307J403R00K37Lm1n66j867l814o097q171r426r771r715r618r297q617
$$ 650307 651710 652610 652847 652850 652809 652243 650376 646562 640465 632294 622868 613097 603382 593764 584467 575850
60829E75850p943p587p243o502n676n576o445p563p984p412o275n138m250l579
$$ 575850 567907 560320 553077 546575 540899 535323 528878 521315 513331 505919 499644 494506 490256 486677
60815D86677l128l043l371l887m226m170l772l299l018k872k398j265P4O61K01
$$ 486677 483549 480506 477135 473248 469022 464852 461080 457781 454763 451891 449493 448228 448302 448963 449164
60800D49164m29k21P31J434J277O09J68L45J068K010K796L203L249L086K868K820
$$ 449164 448735 448514 449245 450679 451956 452565 452733 453078 454146 456156 458952 462155 465404 468490 471358 474178
60784D74178L137L595L532K556J109%m95p65j212j813k243k224j864j813k749
$$ 474178 477315 480910 484442 486998 488107 488107 487612 486847 485635 483822 481579 479355 477491 475678 472929
60769D72929m435n599n265l867k548j691q36J29O23M03J15L57Q08P84K87n2J05
$$ 472929 468494 462895 457630 453763 451215 449524 448688 448817 449440 449843 449958 450315 451123 451907 452194 452142 452247
60752D52247M49N14J32o20j545k166j840l56J577K805K838K200J541P40o81k509
$$ 452247 452696 453210 453342 452722 451177 449011 447171 446815 448392 451197 454035 456235 457776 458516 457835 455326
60736D55326l817m046l550k957k431j885j379j004o61l01r7n4J95Q86J752K449
$$ 455326 451509 447463 443913 440956 438525 436640 435261 434257 433596 433295 433198 433144 433339 434225 435977 438426
60720D38426L023L514L546K855J951J643K038K521K611K351J942J533J374J690
$$ 438426 441449 444963 448509 451364 453315 454958 456996 459517 462128 464479 466421 467954 469328 471018
60706D71018K295K684K552J964J071k9j153k033k438k245j563r54j150k163l046
$$ 471018 473313 475997 478549 480513 481584 481555 480402 478369 475931 473686 472123 471169 470019 467856 464810
60691D64810k959k191j669j768k137k434k529k190j253j30N25O90R67J694K596
$$ 464810 461851 459660 457991 456223 454086 451652 449123 446933 445680 445550 446075 446765 447732 449426 452022
60676D52022L347L880M132M070M006M334M819M795M181L598L270K481O38j687
$$ 452022 455369 459249 463381 467451 471457 475791 480610 485405 489586 493184 496454 498935 499573 497886
60662D97886l318l816l745l755l850l646k954j969r58nQ48J313J088M86L73J200
$$ 497886 494568 490752 487007 483252 479402 475756 472802 470833 469875 469870 470718 472031 473119 473605 473978 475178
60646D75178K380L040L037K797K406J586L45r48k149l301m055l816k642j358o14
$$ 475178 477558 480598 483635 486432 488838 490424 490769 489821 487672 484371 480316 476500 473858 472500 471886
60631D71886l64l83o26q49n67K74J055J271J130J069J128J146J157J232J216R81
$$ 471886 471522 471139 470513 469664 469097 469371 470426 471697 472827 473896 475024 476170 477327 478559 479775 480756
60615D80756O77M70L07J18r4m73j153j720j412k37P17O29P1J62R51J449J069K77
$$ 480756 481433 481903 482210 482328 482234 481761 480608 478888 477476 477239 477956 478585 478656 478818 479769 481218 482287 482564
60597D82564k17k38N3N54J092J327J106P55P27J044J301J221J050J214J668J804
$$ 482564 482347 482109 482162 482716 483808 485135 486241 486996 487723 488767 490068 491289 492339 493553 495221 497025
60581D97025J199K97NN59J250J382J129J138J622K261K793L191L379L324L408
$$ 497025 498224 498521 498526 499085 500335 501717 502846 503984 505606 507867 510660 513851 517230 520554 523962
60566E23962M265N974P798Q966R417R563R619R483R108Q538P621O085L992J790
$$ 523962 528227 534201 541999 550965 560382 569945 579564 589047 598155 606693 614314 620399 624391 626181
60552F26181j64j821l099l701l544l070k742k453j818q51J37J104K261L512M484
$$ 626181 626017 624196 621097 617396 613852 610782 608040 605587 603769 602918 603055 604159 606420 609932 614416
60537F14416N157N898O821P729Q871J0891J3676J5988J6868J6837J6952J7164
$$ 614416 619573 625471 632292 640021 648892 659783 673459 689447 706315 723152 740104 757268
60525G57268J6447J4287J1141P536L611l60l733o122p739q907r681j0065j0144
$$ 757268 773715 788002 799143 806679 810290 809930 806197 800075 792336 783429 773748 763683 753539
60512G53539r852r007p764o599n732m879l736k374r52N96K407M457O664Q998J1351
$$ 753539 743687 734680 726916 720317 714585 709706 705970 703596 702644 703240 705647 710104 716768 725766 737117
60497G37117J3544J5593J7799K0446K3496K6561K9072L0605L1239L1383L1042
$$ 737117 750661 766254 784053 804499 827995 854556 883628 914233 945472 976855 1007897
60486A007897K9532K6392K2352J8761J6121J3805J1265Q788O780M839K004k407
$$ 1007897 1037429 1063821 1086173 1104934 1121055 1134860 1146125 1154913 1161693 1166532 1168536 1166129
60474A166129q455j5676k3190k9951l5301l9203m1776m2751m1692l8753l4973
$$ 1166129 1157674 1141998 1118808 1088857 1053556 1014353 972577 929826 888134 849381 814408
60463H14408l1658k9303k7257k4629k1546j9050j7638j6505j4655j2243j0136
$$ 814408 782750 753447 726190 701561 680015 660965 643327 626822 612167 599924 589788
60452E89788q611p386o641o854p586p494n957l873k431j851j749j870j949j489
$$ 589788 581177 573791 567150 560296 552710 545216 539259 535386 532955 531104 529355 527485 525536 524047
60438E24047m18N10N85N3m30q15j456k224k587k476k319k261j919j064l8O83J052
$$ 524047 523629 524139 524724 524777 524347 523532 522076 519852 517265 514789 512470 510209 508290 507226 507188 507871 508923
60421E08923J317J581J662J354P97N29J002K006K788K867K488K145J901J567J251
$$ 508923 510240 511821 513483 514837 515634 516163 517165 519171 521959 524826 527314 529459 531360 532927 534178
60406E34178J336J843K276K242J972K012K499L047L323L476L803M183M184L706
$$ 534178 535514 537357 539633 541875 543847 545859 548358 551405 554728 558204 562007 566190 570374 574080
60392E74080L163K918K914L020L309L725L867L500K942K551K229J886J937K614
$$ 574080 577243 580161 583075 586095 589404 593129 596996 600496 603438 605989 608218 610104 612041 614655
60378F14655L234K973K158J824K135K276J908J655J941K338K436K413K371K043
$$ 614655 617889 620862 623020 624844 626979 629255 631163 632818 634759 637097 639533 641946 644317 646360
60364F46360J618J880K957L816L721L341L599M222M498M757N918P872R473J0109
$$ 646360 647978 649858 652815 656631 660352 663693 667292 671514 676012 680769 686687 694559 704032 714141
60350G14141J0364J1033J2204J3352J3759J2866J0812Q518O667M714J663k309
$$ 714141 724505 735538 747742 761094 774853 787719 798531 807049 813716 818430 820093 817784
60338H17784n803p839q733r213r467r471r516r761r679q602o679m828l686l007
$$ 817784 811981 804142 795409 786196 776729 767258 757742 747981 738302 729700 723021 718193 714507 711500
60324G11500k230j417j264k182l584m383m127l294k353j083Q39K954M358M903
$$ 711500 709270 707853 706589 704407 700823 696440 692313 689019 686666 685583 686422 689376 693734 698637
60310F98637N449O806Q848J0873J2488J3717J4469J4413J3509J2343J1497J0730
$$ 698637 704086 710892 719740 730613 743101 756818 771287 785700 799209 811552 823049 833779
60298H33779R149O426L407J132n15k626n859r719j3262j5921j7344j7178j5464
$$ 833779 842928 849354 852761 853893 853378 850752 844893 835174 821912 805991 788647 771469 756005
60285G56005j2937j0381p976n651l812l121l587m394m803m872n124n757o406o628
$$ 756005 743068 732687 724711 719060 715248 712127 708540 704146 699343 694471 689347 683590 677184 670556
60271F70556o436o243o312o459o470o500o792p081o802n892m880m116l380k477
$$ 670556 664120 657877 651565 645106 638636 632136 625344 618263 611461 605569 600689 596573 593193 590716
60257E90716j670j225r57o47n07p51r92o10M35J559K267K552K663K800K962K840
$$ 590716 589046 587821 586864 586217 585710 584959 583967 583357 583792 585351 587618 590170 592833 595633 598595 601435
60241F01435J973L60j229j845j335l85L11O61Q86R68O73J35J0Q02K065K752K561
$$ 601435 603408 603768 602539 600694 599359 598974 599285 599946 600832 601800 602473 602608 602618 603420 605485 608237 610798
60224F10798K457L407N000O033O217O427P236Q181Q786R379J0338J1281J1662
$$ 610798 613255 616662 621662 627695 633912 640339 647575 655756 664542 673921 684259 695540 707202
60211G07202J1687J1944J2522J3115J3669J4212J4387J3802J2740J1891J1446
$$ 707202 718889 730833 743355 756470 770139 784351 798738 812540 825280 837171 848617
60200H48617J0927R932Q586P245O099N135M261L373K379J086q24l351n751p080
$$ 848617 859544 869476 878062 885307 891406 896541 900802 904175 906554 907640 906816 903465 897714 890634
60186H90634p330p466q118q907r373r788j0478j1009j0835j0202r607q835p465
$$ 890634 883304 875838 867720 858813 849440 839652 829174 818165 807330 797128 787521 778686 771221
60173G71221n937n084m743l902k283q26l90p84j425k180l116l943m257m008l501
$$ 771221 765284 760200 755457 751555 749272 748446 748056 747272 745847 743667 740551 736608 732351 728343 724842
60158G24842l034k709k436k015j471j169j351j566j040L72K019L268M067M541
$$ 724842 721808 719099 716663 714648 713177 712008 710657 709091 708051 708423 710442 713710 717777 722318
60144G22318M608M240L793L645L741L885M334N602P546R158R584R141Q919R455
$$ 722318 726926 731166 734959 738604 742345 746230 750564 756166 763712 772870 782454 791595 800514 809969
60130H09969J0307J1008J1716J2485J2488J0785P673M494K243J086J009J950L231
$$ 809969 820276 831284 843000 855485 867973 878758 886431 890925 893168 894254 895263 897213 900444
60117I00444L901L982M414N399N899N250M258L896L892L466K628J759N87j254
$$ 900444 904345 908327 912741 918140 924039 929289 933547 937443 941335 944801 947429 949188 949775 948521
60103I48521l207m430n090n932o880p230o977o789o673n901m397l129k829l165
$$ 948521 945314 940884 935794 929862 922982 915752 908775 901986 895313 889412 885015 881886 879057 875892
60089H75892l546l909m349m582m266l497k683k185k122k289k312k139k145k448
$$ 875892 872346 868437 864088 859506 855240 851743 849060 846875 844753 842464 840152 838013 835868 833420
60075H33420k513k057j867k916m888o517p359q168r429j0497j0597r877q953q019
$$ 833420 830907 828850 826983 824067 819179 812662 805303 797135 787706 777209 766612 756735 747782 739763
60061G39763o957n927n317n183n131m748m017l260k609j749m51P60J100Q32J246
$$ 739763 732806 726879 721562 716379 711248 706500 702483 699223 696614 694865 694414 695174 696274 697106 698352
60046F98352K900M725N590N935O846Q139Q669Q215P674P462P027O072N104M381
$$ 698352 701252 705977 711567 717502 724348 732487 741156 749371 757045 764507 771534 777606 782710 787091
60032G87091L409J879J95j244k554l756m494m674m763n173o034p672j0374j3407
$$ 787091 790500 792379 792574 791330 788776 785020 780526 775852 771089 765916 759882 752210 741836 728429
60018G28429j5172j4941j3659j2551j1721j0651r368q272p319o203n089m465m276
$$ 728429 713257 698316 684657 672106 660385 649734 640366 632094 624775 618572 613483 609018 604742
60005F04742l837k658j097j5J16k51k10N65J434J725J657J920K569L041L141L283
$$ 604742 600905 598247 597150 597135 597251 597000 596790 597355 598789 600514 602171 604091 606660 609701 612842 616125
59989F16125L767M437N159O002O829P285P320P158O658N326L093N83j569l138
$$ 616125 619892 624329 629488 635490 642319 649604 656924 664082 670740 676066 679159 679742 678173 675035
59975F75035m073m430m597m973n400n379m880m287l704k961k255j891j459k19
$$ 675035 670962 666532 661935 656962 651562 646183 641303 637016 633312 630351 628096 626205 624746 624527
59961F24527J624L078L860M690N786O309N772M896M390L879K773J370K66n64j305
$$ 624527 626151 629229 633089 637779 643565 649874 655646 660542 664932 668811 671584 672954 673220 672656 671351
59946F71351j539q70J50N99L86J19N5j41p16j516k269k670k389j390j74Q13J785
$$ 671351 669812 668942 669092 669691 670077 670196 670251 670110 669394 667878 665609 662939 660550 659160 658986 659799 661584
59929F61584L281N240O935P839Q298Q993R825R659P488L849N63j099j473j421
$$ 661584 664865 670105 677040 684879 693177 702170 711995 721654 729142 732991 733554 732455 730982 729561
59915G29561r99P4J307J928K121K676L609M310M854N748O418N529L133R71j8r32
$$ 729561 728562 728636 729943 731871 733992 736668 740277 744587 749441 755189 761607 767136 770269 771240 771222 770290
59899G70290k780m548m651l317k140j806j596q57J35Q79J411K175L454M949N880
$$ 770290 767510 762962 758311 754994 752854 751048 749452 748595 748730 749609 751020 753195 756649 761598 767478
59884G67478N830N445N805P045Q320R125R744J0249J0137R395Q903R118R268Q475
$$ 767478 773308 778753 784558 791603 799923 809048 818792 829041 839178 848573 857476 866594 875862 884337
59870H84337O892N105L274J519K85m57j487l084m332m545m506n267o440o838o253
$$ 884337 891229 896334 899608 901127 901412 900955 899468 896384 892052 887507 883001 877734 871294 864456 858203
59855H58203n541n256n236n280n314n118m541l816l102k149q73K94J184K359M054
$$ 858203 852662 847406 842170 836890 831576 826458 821917 818101 814999 812850 811977 812271 813455 815814 819868
59840H19868N466N945O078O524O494M756J693r28j936j332Q02M353Q110R996R032
$$ 819868 825334 831279 837357 843881 850375 855131 856824 855896 853960 852628 853430 857783 865893 875889 884921
59825H84921O231L219P24j321k962m099m882n711o767p564p152n106k271l0J190
$$ 884921 891152 894371 895095 893774 890812 886713 881831 876120 869353 861789 854637 849531 847260 847230 848420
59810H48420J936K199J073j551m159n466o043o894p403o292m061k730l195m410
$$ 848420 850356 852555 853628 852077 847918 842452 836409 829515 822112 815820 811759 809029 805834 801424
59796H01424n340o234p491q534q578p772o903o346n818m965l955l438l850m712
$$ 801424 796084 789850 782359 773825 765247 757475 750572 744226 738408 733443 729488 726050 722200 717488
59782G17488m968m241l255k753k585k362k208k150j485K38K118K893K686K784
$$ 717488 712520 708279 705024 702271 699686 697324 695116 692966 691481 691719 693837 696730 699416 702200
59768G02200L895N581P155Q114Q013P002O348P250R138J0259R917R117Q929R355
$$ 702200 706095 711676 718831 726945 734958 741960 748308 755558 764696 774955 784872 793989 802918 812273
59754H12273J0044J1005J2207J3208J3635J3427J2478J0702Q598P038O290N819
$$ 812273 822317 833322 845529 858737 872372 885799 898277 908979 917577 924615 930905 936724
59742I36724N124M183K999J412m44k063l093l548l552l356l447m067m722m803
$$ 936724 941848 946031 949030 950442 949998 947935 944842 941294 937742 934386 930939 926872 922150 917347
59728I17347m418l969l274j980n97j33o26j104r87o32m01j80J1j52n96q22p33
$$ 917347 912929 908960 905686 903706 903109 902976 902350 901246 900259 899627 899226 899046 899057 898905 898309 897487 896754
59711H96754o66n05L17J694K703K997L409M626O101O949P207P541Q170Q823R440
$$ 896754 896088 895583 895900 897594 900297 903294 906703 911329 917430 924379 931586 939127 947297 956120 965560
59696I65560J0196J0959J1327J1284J1434J2348J3700J4172J2401Q218K900j818
$$ 965560 975756 986715 998042 1009326 1020760 1033108 1046808 1060980 1073381 1081599 1084499 1082681
59684A082681m896o255o402o084n963o236o688p206p908q645q979q883q864r008
$$ 1082681 1077785 1071530 1065128 1059044 1053081 1046845 1040157 1032951 1025043 1016398 1007419 998536 989672 980664
59670I80664q685p690o803o587o418n591m508l742k749p65J590L028L527M216
$$ 980664 971979 964289 957486 950899 944481 938890 934382 930640 927891 927126 928716 931744 935271 939487
59656I39487N582P102Q423R572J0141R672Q761Q474Q632P998O181L946J564j619
$$ 939487 945069 952171 960594 970166 980307 989979 998740 1007214 1015846 1023844 1030025 1033971 1035535 1033916
59642A033916n626r358j2147j4450j6487j7486j6996j5803j4709j3383j1315r053
$$ 1033916 1028290 1018932 1006785 992335 975848 958362 941366 925563 910854 897471 886156 877103
59630H77103p605p058o596n652m540m051m723o332q025r207j0044j0727j0739
$$ 877103 869498 862440 855844 850192 845652 841601 836878 830546 822521 813314 803270 792543 781804
59617G81804r587p925o935o787o677o287o039n976n504m341k761q82J225K790
$$ 781804 772217 764292 757357 750570 743893 737606 731567 725591 720087 715746 712985 712103 713328 716118
59603G16118K986K326K144K557K388J274L44L59O11L49l3Q6N48J096J906K801
$$ 716118 719104 721430 723574 726131 728519 729793 730137 730496 731107 731456 731423 731509 732057 733153 735059 737860
59587G37860K938K033R61M45R9n48j014p42k31m69j720l450m978n768n692n281
$$ 737860 740798 742831 743792 744237 744336 743788 742774 742032 741801 741332 739612 736162 731184 725416 719724 714443
59571G14443n183n166m491l295k600k726k797k269j703j594j492r62l78j60j12
$$ 714443 709260 704094 699603 696308 693708 690982 688185 685916 684213 682619 681127 680165 679787 679627 679515
59556F79515p6l48r35j256j033o13n8J016K395L227L430L902M911N667N935O590
$$ 679515 679439 679091 678156 676900 675867 675254 675196 676212 678607 681834 685264 689166 694077 699744 705679 712269
59540G12269P910Q895R140R835J1967J4993J8307K2191K5830K6037K0217R917
$$ 712269 720179 729074 738214 748049 760016 775009 793316 815507 841337 867374 887591 897508
59528H97508k29o638q633p239l985o36J523K414K520J859L56j406k703l554m321
$$ 897508 897279 890641 882008 874769 870784 870148 871671 874085 876605 878464 878820 877414 874711 871157 866836
59513H66836n080o006p600r717j1256j1601j1473j1461j0862r095p181o410o471
$$ 866836 861756 855750 848150 838433 827177 815576 804103 792642 781780 772685 765504 759094 752623
59500G52623o182n332m410l333j875o46k08J54J372K936L740L902M310M926N152
$$ 752623 746441 741109 736699 733366 731491 730845 730637 730791 732163 735099 738839 742741 747051 751977 757129
59485G57129N297O050O964P139O960P432Q147P743O350N626O293P265P524P289
$$ 757129 762426 768476 775440 782579 789539 796971 805118 812861 819211 824837 831130 838395 845919 853208
59471H53208P011O587N917N043L599J221j360k909l345l614l874l323j859m52
$$ 853208 860219 866806 872723 877766 881365 882586 881226 878317 874972 871358 867484 864161 862302 861850
59457H61850M91J695L557N486P119Q818J0457J1029J0192Q982Q297P674O387M748
$$ 861850 862341 864036 867593 873079 880198 889016 899473 910502 920694 929676 937973 945647 952034 956782
59443I56782L434K312P14j608m488p725j0712j2325j1885j0021p993o437n245
$$ 956782 960216 962528 963242 961634 957146 949421 938709 926384 914499 904478 896485 890048 884803
59430H84803m321l813l650l352k463j026N23J948L631O117R273J2334J4911J7410
$$ 884803 880482 876669 873019 869667 867204 866178 866701 868649 872280 878397 887670 900004 914915 932325
59416I32325K0068K2296K3595K4526K5931K7787K9828L2616L6302L8370L4500
$$ 932325 952393 974689 998284 1022810 1048741 1076528 1106356 1138972 1175274 1213644 1248144
59405A248144K2762O256r129j8980k2221k0039j4344o989P41Q339J5234J9496
$$ 1248144 1270906 1277162 1268033 1249053 1226832 1206793 1192449 1185460 1186201 1194540 1209774 1229270
59393A229270J8019Q935n846k1065l1660l6054l5958l3694l0446k6700k3011j9747
$$ 1229270 1247289 1256224 1250378 1229313 1197653 1161599 1125641 1091947 1061501 1034801 1011790 992043
59381I92043j6889j4476j2618j0860q430n503l344k576k309j564o37j77J38R67
$$ 992043 975154 960678 948060 937200 928770 923267 919923 917347 915038 913474 912837 912660 912798 913765
59367I13765K074K788L188L801M611N234N677O189O838P859R657J1769J2861J2700
$$ 913765 915839 918627 921815 925616 930227 935461 941138 947327 954165 962024 971681 983450 996311 1009011
59353A009011J2945J4819J7075J7882J7692J8313J9870K0722K0189J9227J8453
$$ 1009011 1021956 1036775 1053850 1071732 1089424 1107737 1127607 1148329 1168518 1187745 1206198
59342A206198J7330J5670J4175J3039J1354Q411M472N5m517q702j1980j4635j7279
$$ 1206198 1223528 1239198 1253373 1266412 1277766 1286177 1290649 1290704 1286187 1277485 1265505 1250870 1233591
59329A233591j9682k1157k1965k2985k4081k4200k3176k2002k1151k0021j8325
$$ 1233591 1213909 1192752 1170787 1147802 1123721 1099521 1076345 1054343 1033192 1013171 994846
59318I94846j6675j5462j4325j3125j2250j1702j1014j0277j0064j0166r666q500
$$ 994846 978171 962709 948384 935259 923009 911307 900293 890016 879952 869786 860120 851620
59306H51620p620p311o718n447m256l613k851j418K35J614K985M612O270Q055
$$ 851620 844000 836689 829971 824524 820268 816655 813804 812386 812621 814235 817220 821832 828102 836157
59292H36157J0611J3891J6494J6872J4404R156J740o022j1501j3315j2362j0326
$$ 836157 846768 860659 877153 894025 908429 917585 919325 913303 901802 888487 876125 865799
59280H65799p949n251k456J08K554N259Q397J1899J5333J7916J9236J9896K0618
$$ 865799 857850 852599 850143 850251 852805 858064 866461 878360 893693 911609 930845 950741 971359
59267I71359K0907J9698J7238J4987J3537J2012R739P127M486J463j763m075m940
$$ 971359 992266 1011964 1029202 1044189 1057726 1069738 1079477 1086604 1091090 1092553 1090790 1086715 1081775
59254A081775n190n589n785n346m745m518m411m120l903l872l555k857k453k623
$$ 1081775 1076585 1070996 1065211 1059865 1055120 1050602 1046191 1042071 1038168 1034296 1030741 1027884 1025431 1022808
59240A022808k672k174j847k382l343l988m395n016n885o833p798q485q543q462
$$ 1022808 1020136 1017962 1016115 1013733 1010390 1006402 1002007 996991 991106 984273 976475 967990 959447 950985
59226I50985r299j0993j2127j1887j1131j0841j0751j0278r663r165q230o505
$$ 950985 941686 930693 918566 906679 895548 884707 873956 863678 854015 844850 836620 830115
59214H30115m752l777l198k243r52K25J276K208K597K435K550L410M285M474M406
$$ 830115 825363 821586 818388 816145 815193 815418 816694 818902 821499 823934 826484 829894 834179 838653 843059
59199H43059M647M791M373L927L990L941L020J792J318J484J416J050J044J434
$$ 843059 847706 852497 856870 860797 864787 868728 871748 873540 874858 876342 877758 878808 879852 881286
59185H81286J611J346Q92K94m72r79q58n74q54j607k210k555l040l728m239m264
$$ 881286 882897 884243 885135 885429 884957 883978 883120 882546 881692 880085 877875 875320 872280 868552 864313 860049
59169H60049l687k532j240n58o18o92k79J90J85j97r21k443m689o536p204p341
$$ 860049 856362 853830 852590 852032 851414 850722 850443 850633 850818 850621 849700 847257 842568 836032 828828 821487
59153H21487p785q159p828p366p682q397q464p960p756p728o862n117l822l896
$$ 821487 813702 805543 797715 790349 782667 774270 765806 757846 750090 742362 735500 730383 726561 722665
59139G22665m834n635n831n334m172k770j876j755j830j317m7J400K282K493K815
$$ 722665 717831 712196 706365 701031 696859 694089 692213 690458 688628 687311 687264 688664 690946 693439 696254
59124F96254M025N877P434Q381R188R897R930R434R677J1322J3271J4105J3822
$$ 696254 700279 706156 713590 721971 731159 741056 750986 760420 770097 781419 794690 808795 822617
59111H22617J3261J2603J1533J0246R250Q546P807O899N621L628J371J92O01J214
$$ 822617 835878 848481 860014 870260 879510 888056 895863 902762 908383 912011 913382 913574 914175 915389
59097I15389M72j361l030m269n505o341n934m626l658l287k608j277j61J2m82
$$ 915389 915861 914500 911470 907201 901696 895355 889421 884795 881137 877850 875242 873965 873804 873816 873334
59082H73334j174k149l631n384o832p508p393p048p123p447p062n567l897l216
$$ 873334 872160 870011 866380 860996 854164 846656 839263 832215 825092 817645 810583 805016 801119 797903
59068G97903l609m377m971n010m144k755k071k654l436l172k197j630j515j094
$$ 797903 794294 789917 784946 779936 775792 773037 770966 768312 764876 761704 759507 757877 756362 755268
59054G55268m22l70j102j821j920j462n85N25J220R37P6m93o34q40j148j096o86
$$ 755268 754846 754476 753374 751553 749633 748171 747586 748111 749331 750268 750344 749851 749217 748377 747229 746133 745447
59037G45447m42n28n47j80N42J445K244K600K756L595N528P817R609J1016J2506
$$ 745447 745005 744477 743930 743750 744292 745737 747981 750581 753337 756932 762460 770277 779886 790902 803408
59022H03408J3891J4829J5625J6668J7516J7457J6374J4259J0696N811R88k500
$$ 803408 817299 832128 847753 864421 881937 899394 915768 930027 940723 946534 947522 945022
59010I45022m865o785p896p643o802o529o484n435l256p89J758M567O795P190
$$ 945022 940157 933372 925476 917833 911031 904502 898018 892583 889327 888538 890296 894863 901658 908848
58996I08848O084N045M604L885K561J475J158J152J124J336J724J689J083M04
$$ 908848 914932 919977 924581 928466 931027 932502 933660 934812 935936 937272 938996 940685 941768 942172
58982I42172n1k55J10J207K331K852L610N900R310J2119J3772J5241J6957J8124
$$ 942172 942121 941866 941976 943183 945514 948366 951976 957876 967186 979305 993077 1008318 1025275 1043399
58968A043399J8393J8504J8728J8292J6864J5269J4081J2766J0780Q411N938L120
$$ 1043399 1061792 1080296 1099024 1117316 1134180 1149449 1163530 1176296 1187076 1195487 1201425 1204545
58956A204545o1l104n892q929j2260j5203j7456j9433k1159k1961k1634k0926
$$ 1204545 1204484 1201380 1195488 1186559 1174299 1159096 1141640 1122207 1101048 1079087 1057453 1036527
58944A036527k0305j9289j7417j5024j2624j0260p855n455k978m52J430J879J191
$$ 1036527 1016222 996933 979516 964492 951868 941608 933753 928298 925320 924868 926298 928177 929368
58931I29368M03j44r02j779k086j894k146l087l871m072m313m957n350m941m052
$$ 929368 929771 929627 928725 926946 924860 922966 920820 917733 913862 909790 905477 900520 895170 890229 886177
58916H86177l024j611J48J425J610J116P44R27J855L545N514P108Q392R969J1924
$$ 886177 883153 881542 881690 883115 884725 885841 886585 887512 889367 892912 898426 905534 913926 923895 935819
58901I35819J3863J5936J8696K1778K3946K4637K4422K3759K2453K0661J9122
$$ 935819 949682 965618 984314 1006092 1030038 1054675 1079097 1102856 1125309 1145970 1165092
58890A165092J8116J7332J7047J8101K0363K2433K3410K3631K3225K1339J7630
$$ 1165092 1183208 1200540 1217587 1235688 1256051 1278484 1301894 1325525 1348750 1370089 1387719
58879A387719J3287R678O874M241J609r77l864p291j0775j3546j5186j5647j5221
$$ 1387719 1401006 1410684 1417558 1421799 1423408 1422431 1418567 1411276 1400501 1386955 1371769 1356122 1340901
58866A340901j4600j4266j3773j2562j1347j1488j2935j4137j4301j4287j4852
$$ 1340901 1326301 1312035 1298262 1285700 1274353 1262865 1249930 1235793 1221492 1207205 1192353
58855A192353j5478j5573j5546j5763j5612j4521j3028j1971j1448j1248j1503
$$ 1192353 1176875 1161302 1145756 1129993 1114381 1099860 1086832 1074861 1063413 1052165 1040662
58844A040662j2209j2809j2965j3088j3620j4359j4959j5440j5856j5995j5666
$$ 1040662 1028453 1015644 1002679 989591 975971 961612 946653 931213 915357 899362 883696
58833H83696j4705j2763r918p328o147n803m626k273j53P90J197J933K978M213
$$ 883696 868991 856228 846310 838982 832835 827032 822406 820133 819980 820770 821967 823900 826878 831091
58819H31091N771P095P081N794M750M852N391N639N948O452O239M784K969J625
$$ 831091 836862 843957 851038 856832 861582 866434 871825 877464 883412 889864 896103 900887 903856 905481
58805I05481L01j578l425m426m801n178n596n951o473p127p442p506q062r000
$$ 905481 905782 904204 900779 896353 891552 886374 880778 874827 868354 861227 853785 846279 838217 829217
58791H29217r107p954o642n873m722k344M75K590M077N377O156O298O839Q486
$$ 829217 820110 812156 805514 799641 794919 792575 793050 795640 799717 805094 811250 817548 824387 832873
58777H32873J0137J0297R141P920P022N836L994J548j515m957p995j0070j1347
$$ 832873 843010 853307 862448 870368 877390 883226 887220 888768 887253 882296 874301 864231 852884
58764H52884j1894j1392j0223r669j0102j0160q726o567m923l666k208j060r92
$$ 852884 840990 829598 819375 809706 799604 789444 780718 774151 769228 765562 763354 762294 761302
58751G61302j467j454j111j289j891k087j679r72J83K025M015N438O469P596Q540
$$ 761302 759835 758381 757270 755981 754090 752003 750324 749352 749535 751560 755575 761013 767482 775078 783618
58736G83618Q771Q647Q948R599R857R436Q637P715O828O226N856N259M332L553
$$ 783618 792389 801036 809984 819583 829440 838876 847513 855228 862056 868282 874138 879397 883729 887282
58722H87282L040K300J423J441K794M538N861P157Q786R948R956R425Q976P934
$$ 887282 890322 892622 894045 895486 898280 902818 908679 915836 924622 934570 944526 953951 962927 970861
58708I70861N585K666J94k186n269q647j1489j4073j7008j9723k1305k2157k3162
$$ 970861 976446 979112 979306 977120 971851 963204 951715 937642 920634 900911 879606 857449 834287
58695H34287k3835k2992k0884j8956j7688j6224j4110j1952j0285r008q025p434
$$ 834287 810452 787460 766576 747620 729932 713708 699598 687646 677361 668353 660328 652894
58683F52894p058o546n912n316m630l803l233l088k811j977j013l77L20J478K637
$$ 652894 645836 639290 633378 628062 623432 619629 616396 613308 610497 608520 607507 607130 607450 608928 611565
58668F11565L287L884N145O977Q929J0972J2968J4171J4104J3096J1195P636K463
$$ 611565 614852 618736 623881 630858 639787 650759 663727 677898 692002 705098 716293 723929 726392
58655G26392k525n713p567r339j0863j1147j0275r185q230p336o973p443p800
$$ 726392 723867 718154 710587 701248 690385 679238 668963 659778 651548 644212 637239 629796 621996
58642F21996o911n155l797l140k504j510k08J503L407M465M049L068K736K753
$$ 621996 615085 609930 606133 602993 600489 598979 598771 600274 603681 608146 612195 615263 617999 620752
58628F20752J989L94j009j625j707j632j671j982k153j430O4J286K032L328N354
$$ 620752 622741 623135 622126 620501 618794 617162 615491 613509 611356 609926 609990 611276 613308 616636 621990
58613F21990O645O515O483P705Q754P836N752M488M123L412K414K164K423K071
$$ 621990 628635 635150 641633 649338 658092 665928 671680 676168 680291 683703 686117 688281 690704 692775
58599F92775J183P33O20j8j000j459j521j779j686l60J557K750L479N036P449
$$ 692775 693958 694691 695311 695293 694293 692834 691313 689534 687848 687488 689045 691795 695274 700310 707759
58584G07759R645J1511J3738J5958J6944J6572J5749J4627J2660J0288Q711Q102
$$ 707759 717404 728915 742653 758611 775555 792127 807876 822503 835163 845451 854162 862264
58572H62264P665P320P794R190J0963J3166J6310K0226K4252K8227L2169L5583
$$ 862264 869929 877249 885043 894233 905196 918362 934672 954898 979150 1007377 1039546 1075129
58560A075129L8147M0257M1728M1060L7385L1866K5712J8279R085J31o096r745
$$ 1075129 1113276 1153533 1195261 1236321 1273706 1305572 1331284 1349563 1358648 1358779 1352683 1342938
58548A342938j2356j3739j2748j0224q330p632p347p888j0497j4825j9460k4249
$$ 1342938 1330582 1316843 1304095 1293871 1285541 1277909 1270562 1262674 1252177 1237352 1217892 1193643
58536A193643k9626l4252l6195l5919l5362l4453l1521k6840k2717k0045j7616
$$ 1193643 1164017 1129765 1093570 1057651 1022289 987836 956315 929475 906758 886713 869097
58525H69097j5002j3225j2319j0915q670o741n573m511l668l787m244l585k037
$$ 869097 854095 840870 828551 817636 808966 802225 796652 792141 788473 784686 780442 776857 774820
58512G74820j165j185j039q53j635k726k403r93m99j121j102q7M19J46N39J728
$$ 774820 773655 772470 771431 770578 768943 766217 763814 762821 762322 761201 760099 760012 760431 760577 761116 762844
58496G62844K060J177O68J075J170Q10J512L511N056N457O131P817R461J0698
$$ 762844 764904 766081 766749 767824 768994 769804 771316 774827 779883 785340 791471 799288 808749 819447
58482H19447J2723J5824J8590K0459K2619K5550K8005K9141K9282K7972K3748
$$ 819447 832170 847994 866584 887043 909662 935212 963217 992358 1021640 1049612 1073360
58471A073360J6540Q146r8p845j3914j6797j7236j7491j7683j5843j1901q292
$$ 1073360 1089900 1098046 1097948 1090103 1076189 1059392 1042156 1024665 1006982 991139 979238 970946
58459I70946o011l346N93M403P380J0778J4874J7904J9079J9639J9749J7406J1801
$$ 970946 964935 961589 962182 966585 973965 984743 999617 1017521 1036600 1056239 1075988 1093394 1105195
58446A105195M885j761q629j5659k0801k2843k3048k2638k1185j8687j6435j4606
$$ 1105195 1110080 1108319 1099690 1084031 1063230 1040387 1017339 994701 973516 954829 938394 923788
58434I23788j1633p249l478j433J53K200L854M913O681R308J1150J1891J3155
$$ 923788 912155 904906 901428 899995 900148 902348 906202 911115 917796 927104 938254 950145 963300
58421I63300J4957J4818J1771P877M468K60n123r329j0940j1727j3299j4535j4335
$$ 963300 978257 993075 1004846 1012723 1017191 1017451 1012328 1002999 992059 980332 967033 952498 938163
58408I38163j3825j3814j3037j0936r258q898q075n615l172k227j719o37L8o6
$$ 938163 924338 910524 897487 886551 877293 868395 860320 854705 851533 849306 847587 846950 846988 846922
58394H46922P86L249N122M851L956L903L558J918M26L20M52j25j16J315K697L073
$$ 846922 847708 850957 856079 860930 864886 868789 872347 874265 874691 875011 875463 875338 875222 876537 879234 882307
58378H82307L880N938P488P258O627O734O470N377N391P514R754J0530J1058J2340
$$ 882307 886187 892125 899613 906871 913498 920232 926702 932079 937470 944984 954738 965268 976326 988666
58364I88666J3078J2728J3246J5543J7504J7783J8170J9804K0537J8533J5188
$$ 988666 1001744 1014472 1027718 1043261 1060765 1078548 1096718 1116522 1137059 1155592 1170780
58353A170780J2013Q113L145p10k185k939l866l198n77J076L59k0J920M234N394
$$ 1170780 1182793 1190906 1194051 1193341 1191156 1188217 1184351 1181153 1180576 1181652 1182011 1181991 1183911 1188145 1193539
58338A193539P376J1337J4651J5603J6655J9549K1686K1065K0306K1830K3374
$$ 1193539 1200915 1212252 1226903 1242506 1259161 1278710 1300396 1321461 1341767 1363597 1386971
58327A386971K2313K0146J8597J5613R686L910J245k21k864m646l226q86n24n95
$$ 1386971 1409284 1429430 1448027 1463640 1473326 1477236 1478481 1478260 1475396 1470750 1467524 1466638 1466114 1465519
58313A465519J305L710M706O082R347J1791J1259J0705J3078J5946J6214J5809
$$ 1465519 1466824 1470534 1475240 1481322 1490669 1502460 1513719 1524424 1537502 1553448 1569662 1585471
58301A585471J7414J8951J7816J6372J7564J9261J8564J7516J8843K0388J9605
$$ 1585471 1602885 1621836 1639652 1656024 1673588 1692849 1711413 1728929 1747772 1768160 1787765
58290A787765J9053K1528K4218K3898K3245K5618K8390K8184K7822L0953L4564
$$ 1787765 1806818 1828346 1852564 1876462 1899707 1925325 1953715 1981899 2009721 2040674 2075238
58279B075238L4380L3070L5316L9055L9707L8928M0970M4280M4866M4418M6887
$$ 2075238 2109618 2142688 2178004 2217059 2256766 2295694 2336664 2380944 2425810 2470228 2517115
58268B517115N0594N1758N2193N5552N9750O1148O2213O6848P2272P3850P3615
$$ 2517115 2567709 2619467 2671660 2727212 2786962 2848110 2910323 2977171 3049443 3123293 3196908
58257C196908P5528P6904P3547O8674O7560O8125O6220O5172P0091P7710Q2143
$$ 3196908 3272436 3349340 3422887 3491561 3559121 3627246 3693466 3758638 3828729 3906439 3988582
58246C988582Q5596R2965J01268J05576J09767J19713J31380J37890J42739J53241
$$ 3988582 4074178 4167143 4268411 4373987 4483754 4603467 4734847 4872737 5015476 5168717
58236E168717J66524J75458J82816J95582K10680K20947K29855K45309K64199
$$ 5168717 5335241 5510699 5693515 5889097 6099777 6320724 6550579 6795888 7060087
58227G060087K78609K91882L12454L37342L58415L79306M08741M43185M74352
$$ 7060087 7338696 7630578 7943032 8280374 8638789 9018095 9426836 9870021 10344373
58218A0344373N07523N53101O06621O57642P11660P81338Q63168R46331J037831
$$ 10344373 10851896 11404997 12011618 12669260 13380920 14162258 15025426 15971757 17009588
58209A7009588J153926J293576J446878J623122J842835K109875K422156K803499
$$ 17009588 18163514 19457090 20903968 22527090 24369925 26479800 28901956 31705455
58201C1705455L293363L911445M662451N562549O623846P828398R165672J0690911
$$ 31705455 34998818 38910263 43572714 49135263 55759109 63587507 72753179 83444090
58193H3444090J2510140J4730094J7469759K0885073K5108655L0166640L5911630
$$ 83444090 95954230 110684324 128154083 149039156 174147811 204314451 240226081
58186B40226081M1735372M5989160M5841362L8520648K3542963L920596j5168658
$$ 240226081 281961453 327950613 373791975 412312623 435855586 439776182 424607524
58179D24607524k9315244l6897701l8835921l7032530l3194581k8596610k4223207
$$ 424607524 395292280 358394579 319558658 282526128 249331547 220734937 196511730
58172A96511730k0763117j8478694j7170859j6326430j5405697j4126847j2546492
$$ 196511730 175748613 157269919 140099060 123772630 108366933 94240086 81693594
58165H1693594j0886956r317997p905187o679456n661125m827276m124606l523550
$$ 81693594 70806638 61488641 53583454 46903998 41242873 36415597 32290991 28767441
58157B8767441l022449k606378k244708j927065j663537j449720j264772j102695
$$ 28767441 25744992 23138614 20893906 18966841 17303304 15853584 14588812 13486117
58149A3486117r73728q74699p87249p06037o41569n94041n49440n02875m62457
$$ 13486117 12512389 11637690 10850441 10144404 9502835 8908794 8359354 7856479 7394022
58140G394022m28774l92350l52788l19900k94487k67149k37192k14216k00036
$$ 7394022 6965248 6572898 6220110 5900210 5605723 5338574 5101382 4887166 4687130
58131D687130j86753j73524j67728j68311j64885j55006j46549j41641j33762
$$ 4687130 4500377 4326853 4159125 3990814 3825929 3670923 3524374 3382733 3248971
58122C248971j22270j14493j11426j05759r6166q9812q8500q5642p9089p4313
$$ 3248971 3126701 3012208 2900782 2795023 2698857 2609045 2520545 2434903 2355814 2281501
58112B281501p2727o9118o2786n9267n8977n5761m8804m4638m5161m4707m1287
$$ 2281501 2208774 2139656 2076870 2017603 1958626 1902865 1854061 1809423 1764262 1719555 1678268
58101A678268l9810m1694m1823l8552l6747l8126l8030l4420l1007k9146k5588
$$ 1678268 1638458 1596764 1554941 1516389 1479642 1441516 1403486 1369066 1338059 1308913 1283325
58090A283325k0484j8656k0569k0696j7187j4611j4915j4297j1512j0843j3926
$$ 1283325 1262841 1244185 1223616 1202920 1185733 1171122 1156207 1141910 1130398 1119555 1105629
58079A105629j6596j6669j7198j9388j9815j7491j6388j8063j8804j6809j5374
$$ 1105629 1089033 1072364 1055166 1035778 1015963 998472 982084 964021 945217 928408 913034
58068I13034j6254j6444j4343j2719j2964j2450j0112q668q991q234n745m927
$$ 913034 896780 880336 865993 853274 840310 827860 817748 809080 800089 791855 786110 781183
58056G81183p022q883q999r844j2228j3234j1891j1039j1434j0066o453m562n933
$$ 781183 774161 765278 756279 746435 734207 720973 709082 698043 686609 676543 670090 665528 659595
58043F59595o915n348m158n416o528n434m359n168n980n313m983n959o058m495
$$ 659595 652680 647332 643174 637758 631230 625796 621437 616269 610289 604976 599993 594034 587976 583481
58029E83481m217o841r581r988r571j0087j0332r246q268q217p534n773m989n753
$$ 583481 579264 572423 562842 552854 543283 533196 522864 513618 505350 497133 489599 483826 478837 473084
58015D73084n730m104l208l945l932k197j237k227k661j081K39k46n75O00J302
$$ 473084 467354 463250 460042 456097 452165 449968 448731 446504 443843 442762 443001 442755 442180 442780 444082
58000D44082L34n2J651L312L105K612L314L795K952K343K758K177k36j937j342
$$ 444082 444416 444364 446015 449327 452432 455044 458358 462153 465105 467448 470206 472383 472147 470210 468868
57985D68868o25j478j961n10P45j86j538j241o67j586k541j584R0N45N32J537
$$ 468868 468243 466765 464804 464294 465039 464853 463315 462074 461407 459821 457280 455696 455786 456331 456863 458400
57969D58400K734K826K628L154L360K206O99l07j873m356n823n252m585n290n834
$$ 458400 461134 463960 466588 469742 473102 475308 476007 475700 473827 469471 463648 458396 453811 448521 442687
57954D42687m902m151n077o047n252l941l888m264l713l048l139k646n95J269
$$ 442687 437785 433634 428557 422510 417258 413317 409429 405165 401452 398404 395265 392619 392024 393293
57940C93293J428J435L090N195N982O336P774R402R794R747J0361J0473Q719O172
$$ 393293 394721 396156 399246 404441 410423 416759 424533 433935 443729 453476 463837 474310 483029 489201
57926D89201M282K321n87l159m354n679q358j0502j0164q895r147j0223j0009
$$ 489201 493483 495804 495217 492058 487704 482025 473667 463165 453001 444106 434959 424736 414727
57913D14727q801q095p424n670l850l398l202j587L13L65p86j019n23j029k371
$$ 414727 405926 397831 390407 384737 380887 377489 374287 372700 373013 373378 372592 371573 371050 370021 367650
57898C67650k954k755k870k937j887m13k5l58pR00J404J929L278M480M184L184
$$ 367650 364696 361941 359071 356134 354247 353834 353809 353451 353444 354344 355748 357677 360955 365435 369619 372803
57882C72803L010L171K399J460J952L252L451K492J771J447P81K49P45J416R27
$$ 372803 375813 378984 381383 382843 384795 388047 391498 393990 395761 397208 397989 398238 398983 400399 401326
57867D01326N0M35J575J657P71N51J267J754J816K186K571K110J372J586K403
$$ 401326 401376 401811 403386 405043 405814 406365 407632 409386 411202 413388 415959 418069 419441 421027 423430
57852D23430K602K359K646L028K436J418J320J787J397J49q75j710l056m332m440
$$ 423430 426032 428391 431037 434065 436501 437919 439239 441026 442423 442572 441697 439987 436931 432599 428159
57837D28159l822l574l353k301j157j026j053J02J527J551R86J865L729M392L892
$$ 428159 424337 420763 417410 415109 413952 412926 411873 411975 413502 415053 416039 417904 421633 426025 429917
57822D29917M250N499N444L549J837J397R81j71j029j092j489k734l577l080k052
$$ 429917 434167 439666 445110 448659 450496 451893 452874 452703 451674 450582 449093 446359 442782 439702 437650
57807D37650j605j963l166n403q105j0080j0911j1042j0632r657q763q418p702
$$ 437650 436045 434082 430916 425513 417408 407328 396417 385375 374743 365086 356323 347905 340203
57794C40203n700l517k850l121k345n22L86j58m99L16J266J479J463J692J888
$$ 340203 334503 330986 328136 325015 322670 322148 322534 322376 321877 322193 323459 324938 326401 328093 329981
57779C29981K199L238M623N170M827M771N319N536N000M249L405K084O81m1n89
$$ 329981 332180 335418 340041 345211 350038 354809 360128 365664 370664 374913 378318 380402 381083 381042 380453
57764C80453k072l976m710m322m451n405n600m298k636j488l74Q68J397J108J145
$$ 380453 378381 374405 369695 365373 360922 355517 349917 345619 342983 341495 341121 341989 343386 344494 345639
57749C45639J958K568K450K452L162L964M372M777N235N046M095L271K970K542
$$ 345639 347597 350165 352615 355067 358229 362193 366565 371342 376577 381623 385718 388989 391959 394501
57735C94501J633P75K70k06o66p57p46j192j657j234l43k56r29j075n04m57j344
$$ 394501 396134 396909 397179 396973 396307 395550 394804 393612 391955 390721 390378 390122 389193 388118 387614 387157 385813
57718C85813k055j919j547j294o81K35O44N57R29J856K273J810J233Q01m5j061
$$ 385813 383758 381839 380292 378998 378317 378552 379196 379753 380682 382538 384811 386621 387854 388655 388610 387549
57702C87549j117n2J126K144L651N299N807N347N607O892P364N924L709J825k49
$$ 387549 386432 386380 387506 389650 393301 398600 404407 409754 415361 422253 429617 435541 439250 441075 440826
57687D40826k986n528p210q498r360q648o192l793k745k010o9K956O234R737J3592
$$ 440826 437840 432312 425102 416604 407244 398596 392404 388611 385866 383856 383787 386743 392977 402714 416306
57672D16306J7258K0636K4732L0260L6849M4563N4637O7222P9195Q5229Q0420
$$ 416306 433564 454200 478932 509192 546041 590604 645241 712463 791658 876887 957307
57661I57307O2094L1394n464l9173o2569p4007p5825p1261o3520n5554m8688m2212
$$ 957307 1019401 1050795 1045331 1006158 943589 869582 793757 722496 658976 603422 554734 512522
57649E12522l5415k9085k4274k0716j7603j4787j2297r724p006m881l753l116
$$ 512522 477107 448022 423748 403032 385429 370642 358345 348621 341615 336734 332981 329865
57637C29865k630k629k996k958k524k610l157k806j278k28p33j698j900j876k385
$$ 329865 327235 324606 321610 318652 316128 313518 310361 307555 306277 306049 305316 303618 301718 299842 297457
57622B97457k747k279j916k651l631l443k274j296q28n88p39j341j638j202q33
$$ 297457 294710 292431 290515 287864 284233 280790 278516 277220 276392 275804 275065 273724 272086 270884 270051
57607B70051j130j246l98N08K59o24p78j93J4n53j283j635j481q53k55n03j470
$$ 270051 268921 267675 267277 267785 268044 267420 266642 266449 266463 265910 264627 262992 261511 260658 260403 259900 258430
57590B58430j914j323q10j278j902j598p28j01M87J330J634P59l73p00p99j718
$$ 258430 256516 255193 254383 253105 251203 249605 248877 248776 249263 250593 252227 252986 252613 251913 251114 249396
57574B49396k913l111k446k085k222k149j805j786k085k211k234k517k813k715
$$ 249396 246483 243372 240926 238841 236619 234470 232665 230879 228794 226583 224349 221832 219019 216304
57560B16304k505k469k071r27J11J32l16j82L18L47J76P85K139L337M079M613
$$ 216304 213799 211330 209259 208332 208443 208575 208259 208077 208395 208742 208918 209703 211842 215179 219258 223871
57544B23871M521L117Q90o73q10o3O79R82R25J058J845K669K183K74j383j588
$$ 223871 228392 231509 232399 231726 230916 230853 231532 232514 233439 234497 236342 239011 241194 241468 240085 238497
57528B38497j247j582k033j436k38L08L10P58J427J198K08p2J002K454L077K577
$$ 238497 237250 235668 233635 232199 231961 232269 232579 233337 234764 235962 236170 236098 237100 239554 242631 245208
57512B45208J388L81N00J754K917L046K676K682K829K553K231K303K076R25k49
$$ 245208 246596 246977 247477 249231 252148 255194 257870 260552 263381 265934 268165 270468 272544 273469 273220
57497B73220l71j98j093k509k737j716r90j105j126o89n19p66o11K2J42n66j208
$$ 273220 272849 272651 271558 269049 266312 264596 263606 262501 261375 260686 260167 259401 258790 258812 258954 258388 257180
57480B57180j243j222j529j650j163m35N2J98j3n24r19r52j110j787k319j931
$$ 257180 255937 254715 253186 251536 250373 249938 249990 250188 250175 249651 248732 247780 246670 244883 242564 240633
57464B40633j154j019j239p17M98J285J337J425J824K026K064K533L207L060J908
$$ 240633 239479 238460 237221 236504 237002 238287 239624 241049 242873 244899 246963 249496 252703 255763 257671
57449B57671O98O0j31K52J528L030L458K670J833J586J449J262J673K773L603
$$ 257671 258369 258429 258298 258550 260078 263108 266566 269236 271069 272655 274104 275366 277039 279812 283415
57434B83415L578L232L107K951K500K046J831J758J924K519L063K811K022J694
$$ 283415 286993 290225 293332 296283 298783 300829 302660 304418 306342 308861 311924 314735 316757 318451
57420C18451J955J894J199P40J075J616J672J328Q77L48lL96J658L191M463N280
$$ 318451 320406 322300 323499 324239 325314 326930 328602 329930 330807 331155 331152 331548 333206 336397 340860 346140
57404C46140N354M490L223K331J724Q21j06j13P72J344R87N46J078K583M283N386
$$ 346140 351494 355984 359207 361538 363262 364083 363977 363864 364636 365980 366967 367513 368591 371174 375457 380843
57388C80843N455M719M097M288M946N441O008P133Q248Q312P456O781O683O656
$$ 380843 386298 391017 395114 399402 404348 409789 415797 422930 431178 439490 446946 453727 460410 467066
57374D67066O519O447N991M621L174L125M278M841M041L015K821L083L213L480
$$ 467066 473585 480032 486023 490644 493818 496943 501221 506062 510103 513118 515939 519022 522235 525715
57360E25715M191N026N788O770P953Q849R421J0130J0814J0731R934R477R916
$$ 525715 529906 534932 540720 547490 555443 564292 573713 583843 594657 605388 615322 624799 634715
57347F34715J0746J1468J2110J2454J2021J1066J0524J0735J1342J2303J3751
$$ 634715 645461 656929 669039 681493 693514 704580 715104 725839 737181 749484 763235
57336G63235J4948J4925J4266J4616J6224J7594J7929J8170J9188K0558K1743
$$ 763235 778183 793108 807374 821990 838214 855808 873737 891907 911095 931653 953396
57325I53396K3001K4493K5825K6997K8562L0460L2023L3454L5839L9333M2711
$$ 953396 976397 1000890 1026715 1053712 1082274 1112734 1144757 1178211 1214050 1253383 1296094
57314A296094M4873M5198M2467L5530K5694J6442J0141O615N338O695J0246J3995
$$ 1296094 1340967 1386165 1428632 1464162 1489856 1506298 1516439 1523054 1528392 1535087 1545333 1559328
57302A559328J6824J9819K3931K8104L1002L2843L3968L3039K8456K0638J1688
$$ 1559328 1576152 1595971 1619902 1648006 1679008 1711851 1745819 1778858 1807314 1827952 1839640
57291A839640L716j556k854m34L763P955J1776J5163J7459J8507J9258K0356K1317
$$ 1839640 1843356 1841800 1838946 1838512 1842275 1850230 1862006 1877169 1894628 1913135 1932393 1952749 1974066
57278A974066K1927K2946K4601K5854K6174K6419K7028K7039K6058K5418K6010
$$ 1974066 1995993 2018939 2043540 2069394 2095568 2121987 2149015 2176054 2202112 2227530 2253540
57267B253540K6711K6461K6288K7472K9288L0362L1000L2208L3612L4230L4391
$$ 2253540 2280251 2306712 2333000 2360472 2389760 2420122 2451122 2483330 2516942 2551172 2585563
57256B585563L5082L6160L6863L7312L7960L8297L7663L6603L6005L5700L5283
$$ 2585563 2620645 2656805 2693668 2730980 2768940 2807237 2844900 2881503 2917508 2953208 2988491
57245B988491L5421L6827L8808M0270M1455M3236M5570M7982N0631N3489N5381
$$ 2988491 3023912 3060739 3099547 3139817 3181272 3224508 3270078 3318060 3368691 3422180 3477561
57234C477561N5428N4513N3852N3086N1312M9002M7140M5389M3036M0902M0428
$$ 3477561 3532989 3587502 3641354 3694440 3745752 3794754 3841894 3887283 3930319 3971221 4011649
57223D011649M1429M2700M4189M6712M9931N2696N5114N8435O2929O7519P1427
$$ 4011649 4053078 4095778 4139967 4186679 4236610 4289306 4344420 4402855 4465784 4533303 4604730
57212D604730P4545P6296P5670P2723O8821O5249O2420O0157N7838N4596N0337
$$ 4604730 4679275 4755571 4831241 4903964 4972785 5038034 5100454 5160611 5218449 5273045 5323382
57201E323382M6181M3055M0591L8258L6751L7025L8803M1221M4141M7494N0201
$$ 5323382 5369563 5412618 5453209 5491467 5528218 5565243 5604046 5645267 5689408 5736902 5787103
57190E787103N1257N1284N1703N3072N5367N8926O3527O7454O9136O9086O8756
$$ 5787103 5838360 5889644 5941347 5994419 6049786 6108712 6172239 6239693 6308829 6377915 6446671
57179F446671O8427O7765O7488O8406O9467O8835O6525O4202O2713O1489O0185
$$ 6446671 6515098 6582863 6650351 6718757 6788224 6857059 6923584 6987786 7050499 7111988 7172173
57168G172173N9091N8047N6408N4038N1235M7987M4287M0563L6788L2034K6053
$$ 7172173 7231264 7289311 7345719 7399757 7450992 7498979 7543266 7583829 7620617 7652651 7678704
57157G678704K0202J5579J1349O329Q34m690j1314j9899k9033l6819m3634n0813
$$ 7678704 7698906 7714485 7725834 7732163 7732997 7728307 7716993 7697094 7668061 7631242 7587608 7536795
57145G536795n7784o2859o5872o7621o7544o4363n8269n0076l9172k4908r293
$$ 7536795 7479011 7416152 7350280 7282659 7215115 7150752 7092483 7042407 7003235 6978327 6969034
57134F969034M209J4022K0316K2439J9361J1969K445q024j8546k6609k9817k8775
$$ 6969034 6973243 6987265 7007581 7030020 7049381 7061350 7063795 7055771 7037225 7010616 6980799 6952024
57122F952024k5476j9746j0363J361J2334K1280K8413L2664L3068L2351L5266
$$ 6952024 6926548 6906802 6896439 6897800 6910134 6931414 6959827 6992491 7025559 7057910 7093176
57111G093176M3569N5918P1975R2749J17545J44857J76089K14791K62839L21343
$$ 7093176 7136745 7192663 7264638 7357387 7474932 7619789 7795878 8010669 8273508 8594851
57101H594851L94377M87376O02968P43214R14776J125966J378867J668948J990325
$$ 8594851 8989228 9476604 10079572 10822786 11737562 12863528 14242395 15911343 17901668
57092A7901668K335454K692742L053322L418621L792280M166555M524393M842248
$$ 17901668 20237122 22929864 25983186 29401807 33194087 37360642 41885035 46727283
57084D6727283N063453N070653M730388M007204L028991K010883J106014L35218
$$ 46727283 51790736 56861389 61591777 65598981 68627972 70638855 71744869 72080087
57076G2080087l57250j015846j645231k230457k752556l190053l526768l763134
$$ 72080087 71722837 70706991 69061760 66831303 64078747 60888694 57361926 53598792
57068E3598792l912971l989667m000184l948486l836893l665297l435904l159792
$$ 53598792 49685821 45696154 41695970 37747484 33910591 30245294 26809390 23649598
57060B3649598k855360k540882k231226j939169j674313j440155j235461j058685
$$ 23649598 20794238 18253356 16022130 14082961 12408648 10968493 9733032 8674347
57052H674347r08887p83300o77430n87747n12169m48230l93142l45648l05701
$$ 8674347 7765460 6982160 6304730 5716983 5204814 4756584 4363442 4017794 3712093
57043C712093k72226k43025k16863j93886j73936j56008j39591j25117j12731
$$ 3712093 3439867 3196842 2979979 2786093 2612157 2456149 2316558 2191441 2078710
57034B078710j01784r1736q2564p4083o5799n7544m9631m2197l5033k7986k0889
$$ 2078710 1976926 1885190 1802626 1728543 1662744 1605200 1555569 1513372 1478339 1450353 1429464
57023A429464j3213m420N446J6124K7534L8508M4874M0440K1552q948m2648p0576
$$ 1429464 1416251 1411831 1417277 1433401 1460935 1499443 1544317 1584757 1606309 1597361 1554713 1484137
57011A484137q7681r3794r1808q5425p7551o9574o1654n3824m6721m1016l6527
$$ 1484137 1396456 1302662 1210854 1125429 1047878 978304 916650 862826 816105 775089 738562
57000G38562l2439k8294k4226k0291j6336j2584r637p612n899m043k212n90J022
$$ 738562 706123 677829 653603 633312 616976 604392 594755 587143 581244 577201 574989 574399 575421
56987E75421K680M164N683P983J1183J4080J5105J3320Q341L21r251j7686k3003
$$ 575421 578101 582265 587948 595931 607114 621194 636299 649619 657960 658281 649030 631344 608341
56974F08341k5254k5492k4297k2016j9482j7306j5041j2044q595n395k469M55
$$ 608341 583087 557595 533298 511282 491800 474494 459453 447409 438814 433419 430950 431405
56962D31405L128N337P753J1248J5753K0618K5398K9148K9573K4322J3318q44
$$ 431405 434533 439870 447623 458871 474624 495242 520640 549788 579361 603683 617001 616157
56950F16157j4524k4559k9277k9325k7196k4889k2358j8870j4928j1535q397m570
$$ 616157 601633 577074 547797 518472 491276 466387 444029 425159 410231 398696 390299 385729
56938C85729l72L029N717R067J3744J9163K5013L1616L8308M2681M1985L4607
$$ 385729 385357 388386 394103 403170 416914 436077 461090 492706 531014 573695 615680 650287
56926F50287K0515J761j7194l1281l8078l8993l7112l4562l1991k9374k6623k3805
$$ 650287 670802 672563 655369 624088 586010 547017 509905 475343 443352 413978 387355 363550
56914C63550k1180j8870j6628j4267j2054j0188q304o207m586m116m201l631k255
$$ 363550 342370 323500 306872 292605 280551 270363 262059 255852 251266 247150 242949 239318 237063
56901B37063r66k43K66Q42J429K124L025L743M083M944P295J0486J2872J4117
$$ 237063 236097 235854 236120 236962 238391 240515 243540 247283 251366 256310 263605 274091 286963 301080
56887C01080J5571J8220K1444K3924K4516K2054J5789O658k781j0309j5232j7587
$$ 301080 316651 334871 356315 380239 404755 426809 442598 449256 446475 436166 420934 403347
56875D03347j7339j4928j1627q600o009l442o10K601O278J0283J4391J8723K3669
$$ 403347 386008 371080 359453 350853 344844 341402 340792 343393 349671 359954 374345 393068 416737
56862D16737K9375L5768M2972N0833N7761O0570N5933M2312K1196k906k4229l8638
$$ 416737 446112 481880 524852 575685 633446 694016 749949 792261 813457 810551 786322 747684
56850G47684m5332m5875m2240l6171k9331k2728j6220r415k685L540R868J7236
$$ 747684 702352 656477 614237 578066 548735 526007 509787 500372 497687 501227 511095 528331
56838E28331K5611L4458M4039N5042O7384Q0311R2508J00337R6960P6434L9915
$$ 528331 553942 588400 632439 687481 754865 835176 927684 1028021 1124981 1201415 1241330
56827A241330l418m2176o9090q2683q5505q1680p4576o5551n5051m4448l5384
$$ 1241330 1237912 1195736 1126646 1043963 958458 876778 802202 736651 681600 637152 601768
56816F01768k7689j9729j1068k951M222J1988K1644L2619M3889N5335O6271P3546
$$ 601768 574079 554350 543282 540331 544553 556541 578185 610804 654693 710028 776299 849845
56804H49845P2451N9520L4732K372k9854n4288o7500p1187o9004o3496n6032m7817
$$ 849845 922296 981816 1016548 1018920 989066 934778 867278 796091 727087 663591 607559 559742
56792E59742l9776l2272k5595j9973j4762q844k250L747Q764J4080K0653K7652
$$ 559742 519966 487694 462099 442126 427364 418520 416270 420017 428781 442861 463514 491166
56780D91166L3717L8061L9176L4143K1297L135j4977k8853l7423m1403m1717l9283
$$ 491166 524883 562944 602120 636263 657560 660695 645718 616865 579442 538039 496322 457039
56768D57039l5187l0532k6252k3012k0844j9206j7604j5944j4098j1804r268p306
$$ 457039 421852 391320 365068 342056 321212 302006 284402 268458 254360 242556 233288 225982
56756B25982o398o079n629m892m117l523l264l372l451l061k497k485k945k942
$$ 225982 219584 213505 207876 202984 198867 195344 192080 188708 185257 182196 179699 177214 174269 171327
56742A71327k068j059n99n05l98l29k56K08R92J304P68J29K31R52J615J872J694
$$ 171327 169259 168200 167601 167096 166698 166369 166113 166321 167313 168617 169385 169514 169745 170697 172312 174184 175878
56725A75878J176O84O64R52R31O03O33J112J232O28N8K12P10R20R49J153J386
$$ 175878 177054 177738 178402 179354 180285 180888 181521 182633 183865 184493 184551 184763 185473 186393 187342 188495 189881
56708A89881J335J111R56Q70Q88J170J609J875K016K254K227J369J08m58j91o6
$$ 189881 191216 192327 193283 194153 195041 196211 197820 199695 201711 203965 206192 207561 207669 207211 207020 206954
56692B06954m52o63m38m10n78P6J660K673K194J412J741K720L088K809K680K728
$$ 206954 206502 205839 205401 204991 204413 204489 206149 208822 211016 212428 214169 216889 219977 222786 225466 228194
56676B28194K460K005J794J491M50j165k584l389l497k751j355j10M61P23R93
$$ 228194 230654 232659 234453 235944 236394 235229 232645 229256 225759 223008 221653 221543 222004 222727 223720
56661B23720Q26l5p88n75K61Q04Q41O21Q6q20j598j759j469r89j89O97P62k52
$$ 223720 224546 224511 223723 223148 223409 224213 225054 225675 225761 224941 223343 221584 220115 219126 218937 219634 220396 220144
56643B20144j165r13m9L27L55R33K012K618K233J082m57j825k092r57M75Q60J99
$$ 220144 218979 218066 218017 218344 218699 219632 221644 224262 226495 227577 227120 225295 223203 222246 222721 223581 223780
56626B23780n91j231k083l035l497l334k847k024p19O00J173R05L14k49o40n45
$$ 223780 223189 221958 219875 216840 213343 210009 207162 205138 204419 205019 206192 207097 207411 207162 206522 205977
56610B05977R1N35P8q24j065m44J38ln74r41q86n92k84k2L07Q02J242J199N25
$$ 205977 206068 206603 206681 205857 204792 204348 204486 204483 203909 202968 202082 201490 201206 201184 201491 202293 203535 204734 205259
56591B05259n03j452j858j220L87J860K033J152M87N19N42K27K15Q11J305J209
$$ 205259 204756 203304 201446 200226 200613 202473 204506 205658 206145 206664 207206 207433 207648 208459 209764 210973
56575B10973J034J217J385J279J313J616J624J289J503K619L735M262M877O100
$$ 210973 212007 213224 214609 215888 217201 218817 220441 221730 223233 225852 229587 233849 238726 244826
56561B44826P265P969R210J1791J4713J6360J6255J4426J0310L890k917p586r341
$$ 244826 252091 260060 269270 281061 295774 312134 328389 342815 353125 357015 354098 346512 337171
56548C37171r099p863o280n073m537m192l756l765m301m279l142k112k349k990
$$ 337171 328072 320209 313929 308856 304319 300127 296371 292606 288305 284026 280884 278772 276423 273433
56534B73433k607j582j257j524j205l36j21q02j315j079o35m42l01j00l5q6o8
$$ 273433 270826 269244 267987 266463 265258 264922 264801 263999 262684 261605 260970 260528 260227 260127 260092 260006 259938
56517B59938n7j24o2M2l80j300j720j245r64j693k402j824n61j03n07p26n38n47
$$ 259938 259881 259757 259695 259737 259357 258057 256337 255092 254128 252435 250033 248209 247648 247545 247038 246312 245774 245227
56499B45227p48o91o51j186j850j772j118o88n05j39N9n38j482j724j140m07J64
$$ 245227 244479 243788 243137 241951 240101 238329 237211 236523 236018 235879 235938 235400 233918 232194 231054 230647 230811
56482B30811N16K26p68j449r53Q0O06P84J139J163L11m71j3J083J434J182J468
$$ 230811 231327 231553 230785 229336 228383 228463 229069 229853 230992 232155 232466 231995 231982 233065 234499 235681 237149
56465B37149K237K475K127J938J788R83j96r18j306j790j643o8J878K485K015
$$ 237149 239386 241861 243988 245926 247714 248697 248501 247583 246277 244487 242844 242776 244654 247139 249154
56450B49154K028K617K535J709J346J645J674J435J826K479J895l2j675k144k117
$$ 249154 251182 253799 256334 258043 259389 261034 262708 264143 265969 268448 270343 270311 268636 266492 264375
56435B64375k080j662j059j183j980k234j480n17R1N02N25k88j406j719j194o35
$$ 264375 262295 260633 259574 258391 256411 254177 252697 252180 252271 252773 253298 253010 251604 249885 248691 248056
56419B48056k3J119K046J524J45j49J052K202K380K213K110J629Q62N20L94l51
$$ 248056 248033 249152 251198 252722 252867 252718 253770 255972 258352 260565 262675 264304 265166 265686 266080 265729
56403B65729j171n66J250K204J414L36L19R24J317J557J802J735J401J236R82
$$ 265729 264558 263992 265242 267446 268860 269196 269515 270439 271756 273313 275115 276850 278251 279487 280469
56388B80469Pj130j092J32J097J103Q59Q78Q93R83J590K250K025J286J290K023
$$ 280469 280476 279346 278254 278386 279483 280586 281445 282323 283216 284199 285789 288039 290064 291350 292640 294663
56372B94663K235J618J117J074R29P58J123J523R54j11l51P0nj96Q78K722L282
$$ 294663 296898 298516 299633 300707 301636 302394 303517 305040 305994 305883 305532 305602 305597 305401 306279 309001 312283
56355C12283K242J310J142P21J2K93J451J829J238J272K150K198J118P05J475
$$ 312283 314525 315835 316977 317698 317710 318003 319454 321283 322521 323793 325943 328141 329259 329964 331439
56340C31439J687O82J78J013J628J107Q39J736K559K549L015M591N567M720L468
$$ 331439 333126 333808 333986 334999 336627 337734 338573 340309 342868 345417 348432 353023 358590 363310 366778
56325C66778L417L977M033L872L874L385K354K030K657K646J376M58Q70J254O57
$$ 366778 370195 374172 378205 382077 385951 389336 391690 393720 396377 399023 400399 400857 401727 402981 403638
56310D03638M39J647K878K743K242K719L513L693M136N845P922R143R936J0930
$$ 403638 404077 405724 408602 411345 413587 416306 419819 423512 427648 433493 441415 450558 460494 471424
56296D71424J1255J0033Q020O202M316K408J886L398N294N985O154P059Q322R054
$$ 471424 482679 492712 500732 506934 511250 513658 515544 518942 524236 530221 536375 543434 551756 560810
56282E60810R543J0231J0584J0470J0994J2543J3739J3666J3393J3923J4623J5075
$$ 560810 570353 580584 591168 601638 612632 625175 638914 652580 665973 679896 694519 709594
56270G09594J6365J8945K1260K2209K3065K5224K8003L0356L2849L6192L9696
$$ 709594 725959 744904 766164 788373 811438 836662 864665 895021 927870 964062 1003758
56259A003758M2913M7022N2956N9973O7509P6465Q7111R7906J08050J19055J32024
$$ 1003758 1046671 1093693 1146649 1206622 1274131 1350596 1437707 1535613 1643663 1762718 1894742
56248A894742J45568J58173J70436J83069J94837K04370K11831K17011K17972
$$ 1894742 2040310 2198483 2368919 2551988 2746825 2951195 3163026 3380037 3598009
56239C598009K13539K04806J92329J74273J49424J19637Q7180N2142J4743k2397
$$ 3598009 3811548 4016354 4208683 4382956 4532380 4652017 4739197 4791339 4806082 4783685
56229D783685n6795q8542j17719j41945j59302j71450j80974j87703j90355j89739
$$ 4783685 4726890 4638348 4520629 4378684 4219382 4047932 3866958 3679255 3488900 3299161
56219C299161j87371j82858j75519j66816j58434j49700j39564j29215j20132
$$ 3299161 3111790 2928932 2753413 2586597 2428163 2278463 2138899 2009684 1889552
56210A889552j11465j02065r3153q6214q0187p3516o7034o2021n7423n1943m6850
$$ 1889552 1778087 1676022 1582869 1496655 1416468 1342952 1275918 1213897 1156474 1104531 1057681
56199A057681m3619m0769l6249l1098k7563k5274k2494j9502j7503j5754j3018
$$ 1057681 1014062 973293 937044 905946 878383 853109 830615 811113 793610 777856 764838
56188G64838j0401r564r557q460o770o132o198n716n190n498n465l800j881j555
$$ 764838 754437 744873 735316 726856 720086 713954 707756 702040 696850 691352 685887 682087 680206 678651
56174F78651j809p20J001J480J058J132J256N78L43J878L741M070L965N364P458
$$ 678651 676842 676122 677123 678603 679661 680793 682049 682627 682970 684848 688589 692659 696624 701988 709446
56159G09446Q509R333J1468J3773J4403J4398J5763J7791J8830J9835K2522K5818
$$ 709446 717955 727288 738756 752529 766932 781330 797093 814884 833714 853549 876071 901889
56147I01889K7818K9456L2617L6605M0167M4942N2979O2884P2373Q2359R4289
$$ 901889 929707 959163 991780 1028385 1068552 1113494 1166473 1229357 1301730 1384089 1478378
56136A478378J05711J13090J16881J18972J17326J08527R4175P9627O7570N7683
$$ 1478378 1584089 1697179 1814060 1933032 2050358 2158885 2253060 2332687 2400257 2457940
56126B457940N1139M9664N0694M8620M0967K9383J5589O60j2675k1888k8381l5617
$$ 2457940 2509079 2558743 2609437 2658057 2699024 2728407 2743996 2744656 2731981 2710093 2681712 2646095
56114B646095m4534n4554o7134q3603j00857j13943j21622j25110j23371j14878
$$ 2646095 2601561 2547007 2479873 2396270 2295413 2181470 2059848 1934738 1811367 1696489
56104A696489j02399r0654q0278o9096n7820m9089m2237l4578k6798k1659j8493
$$ 1696489 1594090 1503436 1423158 1354062 1296242 1247153 1204916 1170338 1143540 1121881 1103388
56093A103388j4395r720o997n564k835M27J639J831L735O010N426L481M437P889
$$ 1103388 1088993 1079273 1072276 1066712 1063877 1064304 1065943 1067774 1071509 1077519 1082945 1086426 1090863 1098752
56079A098752R700R349R862J1300J0940R339R714J1773J2441J2063J3623J6575
$$ 1098752 1108452 1117801 1127663 1138963 1149903 1159242 1168956 1180729 1193170 1205233 1218856 1235431
56067A235431J7750J7539J8790K0629K0065J8489J9656K2328K2111J9414J8252
$$ 1235431 1253181 1270720 1289510 1310139 1330204 1348693 1368349 1390677 1412788 1432202 1450454
56056A450454J8329J6108J2642J2298J4476J4697J3212J4262J7494J8604J7865
$$ 1450454 1468783 1484891 1497533 1509831 1524307 1539004 1552216 1566478 1583972 1602576 1620441
56045A620441J9421K2607K2935K1247K2720K7015K8687K7422K8320L1998L3976
$$ 1620441 1639862 1662469 1685404 1706651 1729371 1756386 1785073 1812495 1840815 1872813 1906789
56034A906789L4115L6770M1298M2405M0545M1837M6983N0415N0993N3101N6489
$$ 1906789 1940904 1977674 2018972 2061377 2101922 2143759 2190742 2241157 2292150 2345251 2401740
56023B401740N5988N2343N2276N6523N8814N7941N9480O4230O6483O5533O7192
$$ 2401740 2457728 2510071 2562347 2618870 2677684 2735625 2795105 2859335 2925818 2991351 3058543
56012C058543P2239P5085P5569P9961Q8501R4293R6345J01052J09060J13827J15097
$$ 3058543 3130782 3205867 3281436 3361397 3449898 3544191 3640536 3741588 3850648 3964475 4079572
56001D079572J20247J30145J37558J41639J49669J62373J72337J79150J90613
$$ 4079572 4199819 4329964 4467522 4609161 4758830 4921203 5093540 5272690 5463303
55992E463303K06652K18209K24752K36006K53651K68806K80537K98463L23656
$$ 5463303 5669955 5888164 6112916 6348922 6602573 6871379 7151916 7450379 7774035
55983G774035L46124L64914L90817M25349M57909M87806N27264N78138O28771
$$ 7774035 8120159 8485073 8875890 9301239 9759148 10246954 10774218 11352356 11981127
55974A1981127O78691P42006Q21316R04162R90940J098940J232703J379944J543721
$$ 11981127 12659818 13401824 14223140 15127302 16118242 17217182 18449885 19829829 21373550
55965B1373550J747525K001675K299167K653977L107871L689640M403336N261702
$$ 21373550 23121075 25122750 27421917 30075894 33183765 36873405 41276741 46538443
55957D6538443O286965P472796Q799588J0303416J2083542J4240528J6870011
$$ 46538443 52825408 60298204 69097792 79401208 91484750 105725278 122595289
55950A22595289K0115135K4139767K9029126L4725296M0823338M5985872M7498522
$$ 122595289 142710424 166850191 195879317 230604613 271427951 317413823 364912345
55943C64912345M2129392K8434132Q634831j2073694k8525810l8258705m1793956
$$ 364912345 407041737 435475869 444110700 432037006 403511196 365252491 323458535
55936C23458535m1076920l7994469l3897429k9663112k5745043k2246567j9127218
$$ 323458535 282381615 244387146 210489717 180826605 155081562 132834995 113707777
55929A13707777j6361225j3926294j1770446r863971q227768o870512n747987
$$ 113707777 97346552 83420258 71649812 61785841 53558073 46687561 40939574
55922D0939574m811899m048270l441183k945731k525153k176768j898300j663817
$$ 40939574 36127675 32079405 28638222 25692491 23167338 20990570 19092270 17428453
55914A7428453j453675j275313j134287j013909r01156q04791p30876o65879n99827
$$ 17428453 15974778 14699465 13565178 12551269 11650113 10845322 10114446 9448567 8848740
55905H848740n42171m99901m62329m21400l85711l61018l37079l06640k78409
$$ 8848740 8306569 7806668 7344339 6922939 6537228 6176210 5839131 5532491 5254082
55896E254082k59185k41237k18937k00256j90459j81093j66081j52808j46757
$$ 5254082 4994897 4753660 4534723 4334467 4144008 3962915 3796834 3644026 3497269
55887C497269j40651j28982j18451j13956j08725r8060q8912q6035q2194p1821
$$ 3497269 3356618 3227636 3109185 2995229 2886504 2788444 2699532 2613497 2531303 2459482
55877B459482o1457n7117n3909m7686m4789n0309n7961o1071o3030o7767p0454
$$ 2459482 2398025 2340908 2286999 2239313 2194524 2144215 2086254 2025183 1962153 1894386 1823932
55866A823932o6795o1797o0392n8662n2725m7126m6005m4985m0064l5812l6484
$$ 1823932 1757137 1695340 1634948 1576286 1523561 1476435 1430430 1385445 1345381 1309569 1273085
55855A273085l7456l3686k8656k6897k5433k0739j6702j7608k0062j9597j8732
$$ 1273085 1235629 1201943 1173287 1146390 1120957 1100218 1083516 1065908 1045846 1026249 1007517
55844A007517k1015k3463k2327k0238k0576k0720j7702j4784j5547j7028j5389
$$ 1007517 986502 963039 940712 920474 899898 879178 861476 846692 831145 814117 798728
55833G98728j2970j3293j4331j3015j1257j1496j1287q251n379n624o322m639
$$ 798728 785758 772465 758134 745119 733862 722366 711079 702828 697449 691825 685503 680864
55821F80864l430n893r343j0071r670j0861j1863j0425q824r360r453o673l881
$$ 680864 677434 671541 662198 652127 642457 631596 619733 609308 600484 591124 581671 574998 571117
55808E71117l980m300j726J325J778K039N252Q858R048P638Q341R870Q793N897
$$ 571117 567137 562837 561111 562436 564214 566253 571505 580363 589411 597049 605390 615260 624053 629950
55794F29950L761J256l710q984j1379j2303j4731j7273j6811j4384j3046j2185
$$ 629950 633711 634967 631257 622273 610894 598591 583860 566587 549776 535392 522346 510161
55782E10161r246n128k884k823l377m832p863j0441j0347q792p842o691m141k018
$$ 510161 500915 495787 492903 490080 486703 481871 474008 463567 453220 444428 436586 429895 425754 423736
55768D23736k041k153o3K227J701n02j569j987l728n772n924n003n124n723n219
$$ 423736 421695 419542 419479 421706 423407 422905 421336 419349 415621 409849 403925 398922 393798 388075 382856
55753C82856m500m984n455m470l612m611n804n174m286n271o561n793m308m522
$$ 382856 378356 373372 367917 363447 359835 355224 349420 344246 339960 334689 328128 322335 318027 313505
55739C13505n296m408l157l990n658n385l884l645m097l006j098p85j691j749
$$ 313505 308209 303801 300644 296654 290996 285611 281727 278082 273985 270979 269881 269096 267405 265656
55725B65656j302k016l095k739j956k820m309l908k113j311j497j063m83j174
$$ 265656 264354 262338 259243 256504 254548 251728 247419 243511 241398 240087 238590 237527 237044 235870
55711B35870k011j037O11M58p90n97P49R61K11N12J527J116n26j321j343k437
$$ 235870 233859 232822 233433 233891 233101 232504 233253 234214 234425 234937 236464 237580 237054 235733 234390 231953
55695B31953m287m659l347k301k071j522p38q70j493j226n46q44j375l60J561
$$ 231953 227666 223007 219660 217359 215288 213766 213028 212158 210665 209439 208893 208049 206674 206314 207875
55680B07875K298K033K595L780L700K401J705J680O42j467k810k759k438k293
$$ 207875 210173 212206 214801 218581 222281 224682 226387 228067 228709 227242 224432 221673 219235 216942
55666B16942j754j073r52p92K90J424J439J320K583M270M445L629L700M403M170
$$ 216942 215188 214115 213163 212371 212661 214085 215524 216844 219427 223697 228142 231771 235471 239874 244044
55651B44044L409L601M003K745N05m60m02j588m090n619n484n281n617n445m745
$$ 244044 247453 251054 255057 257802 258307 257847 257445 255857 251767 246148 240664 235383 229766 224321 219576
55636B19576m783n461n326m254l487l113k165j000q23j133m10R57J224M06LP8
$$ 219576 214793 209332 204006 199752 196265 193152 190987 189987 189164 188031 187621 188578 189802 190208 190211 190289
55620A90289m77j218p36M10M26m51n16L6m64j653j565l80l41j771k594k014j368
$$ 190289 189812 188594 187858 188268 188694 188243 187727 187763 187299 185646 184081 183701 183360 181589 178995 176981 175613
55603A75613j099k16R37O46r45j755j385j615k821l148j993j205j847k573k241
$$ 175613 174514 174298 175235 175881 174936 173181 171796 170181 167360 164212 162219 161014 159167 156594 154353
55588A54353j505r46n7J088J488J148J208J786J895J657K125K954K859K413L430
$$ 154353 152848 151902 151845 152933 154421 155569 156777 158563 160458 162115 164240 167194 170053 172466 175896
55573A75896N465O121N238N429P735J0057J0908J1513J2851J3519J2166R533O672
$$ 175896 181361 187482 192720 198149 205884 215941 226849 238362 251213 264732 276898 286431 293103
55560B93103L371l88l524n674p826j0226j1647j1653j1467j1639j1037r131p225
$$ 293103 296474 296086 292562 286888 279062 268836 257189 245536 234069 222430 211393 202262 195037
55547A95037o344n837n025m373m122l600k683k178k132j608o31l82r20q91l6J72
$$ 195037 188693 182856 177831 173458 169336 165736 163053 160875 158743 157135 156504 156122 155202 154311 154275 154447
55531A54447q49j726j467p83l54Q8L07o56k454l294k639j974k171k263j606j053
$$ 154447 153598 151872 150405 149622 149268 149356 149663 149007 146553 143259 140620 138646 136475 134212 132606 131553
55515A31553j097j029p19j115k111k202j027m1J76Q10K072K223N91r53j010p55
$$ 131553 130456 129427 128708 127593 125482 123280 122253 122212 122388 123198 125270 127493 128084 127131 126121 125366
55499A25366j430j986j114L33Q25L98j60q20j460j125K94J181M76o14n93J44O11
$$ 125366 123936 121950 120836 121169 121994 122392 122232 121412 119952 118827 119121 120302 120778 120164 119571 119715 120326
55482A20326J105K176K975K433J121M22O54J244J824K151J751P19o2k16m41j095
$$ 120326 121431 123607 126582 129015 130136 130558 131212 132456 134280 136431 138182 138901 138839 138623 138182 137087
55466A37087j477j212j005j269j350r77j010j786k144j239K9M84L30K97K88Qj29
$$ 137087 135610 134398 133393 132124 130774 129797 128787 127001 124857 123618 123647 124131 124461 124758 125046 125054 124925
55449A24925K18N12K48k06l98n16p54q36p38q53j117r99o51p68j196r88j25M05
$$ 124925 125143 125655 125903 125697 125299 124783 124029 123193 122455 121602 120485 119486 118835 118067 116871 115883 115758 116163
55431A16163L89N81Q83K91r89j416o41o1k36K1J141J717R89K90P02J282J021O62
$$ 116163 116552 117133 118016 118307 117318 115902 115261 115200 114964 114985 116126 117843 118832 119122 119824 121106 122127 122789
55413A22789J107J732J752J669J913J659L91p38o23M6O8m61q58j168j590j733
$$ 122789 123896 125628 127380 129049 130962 132621 133012 132274 131651 131697 131765 131304 130446 129278 127688 125955
55397A25955j449j226j060k65R12J163L10j55M93J076P25J98K0m98j295q69J026
$$ 125955 124506 123280 122220 121955 122867 124030 124340 124185 124678 125754 126479 126677 126697 126199 124904 124035 125061
55380A25061K311J720P75R58J199K15r15q32n10j325k224j509O3N73J32J97O81
$$ 125061 127372 129092 129867 130825 132024 132239 131324 130492 129982 128657 126433 124924 124987 125560 125692 125889 126570
55363A26570L46o36r17l00J94K54L15K47l04p80m58J96L45J69J00l00j249j680
$$ 126570 126916 126280 125363 125063 125257 125511 125826 126073 125769 124989 124531 124727 125072 125241 125341 125041 123792 122112
55345A22112q50O8k02r24p95l10n46p88K63J818J953P00j66m0P2k29k37R0n4o66
$$ 122112 121262 121330 121128 120204 119409 119099 118553 117765 118028 119846 121799 122499 122333 122293 122365 122136 121899 121989 121935 121269
55325A21269p93k59K8m54j265j873j970j191L30J497J459Q44P41J103J264J244
$$ 121269 120476 120217 120245 119791 118526 116653 114683 113492 113822 115319 116778 117622 118363 119466 120730 121974
55309A21974J281Q34m73j674j632p70k24n3L03O05L99K41P62J288Q66n0m66n20
$$ 121974 123255 124089 123616 121942 120310 119540 119316 119263 119566 120171 120570 120811 121573 122861 123727 123677 123211 122691
55291A22691p37n95M17J228O32o09j023q83j269j585m49J511K249J434O31M77
$$ 122691 121954 121359 121776 123004 123636 123027 122004 121121 119852 118267 117818 119329 121578 123012 123643 124120
55275A24120K3j022j654j439j077q52l18L15K21m12n31l8J04k89l81M1K19r0l15
$$ 124120 124143 123121 121467 120028 118951 118099 117781 118096 118317 117905 117374 117336 117440 117151 116770 116811 117030 116940 116625
55256A16625k54j85O7P14R81J00r79o63P08J302O69J16K53K47k25l46J07L06J7
$$ 116625 116371 116186 116253 116967 117948 118048 117069 116406 117114 118416 119085 119201 119454 119701 119476 119130 119237 119543 119560
55237A19560J2L91K51n73j074q19n18m23P1Q55Q57m1m96J74R35Q28L65L19M30
$$ 119560 119572 119963 120214 119641 118567 117748 117230 116807 116878 117733 118590 118549 118053 118227 119162 119990 120355 120674 121104
55218A21104J62l20o17o41k81N29J134O95l60o16K46R47N99q1q1N38J168J546
$$ 121104 121266 120946 120329 119688 119407 119936 121070 121765 121405 120789 121035 121982 122581 122500 122419 122957 124125 125671
55200A25671J587J139L48m54j231j937j922p90L90J36j227j912j287n56n31m53
$$ 125671 127258 128397 128745 128291 127060 125123 123201 122411 122801 122937 121710 119798 118511 117955 117424 116971
55184A16971M04J439J808J601J283R38O62P35R81Q58M04J66R7l22q22n62K64M54
$$ 116971 117375 118814 120622 122223 123506 124444 125106 125841 126822 127680 128084 128250 128347 128025 127203 126641 126905 127359
55166A27359l28j092j243j280j343p07P12J752J678J208J161J302J135P75M32
$$ 127359 127031 125939 124696 123416 122073 121366 122078 123830 125508 126716 127877 129179 130314 131089 131521
55151A31521K2k34P2M64m6j197j514o70j94j039j982j501qJ012J018N07o6m61
$$ 131521 131543 131309 131381 131845 131799 130602 129088 128418 128224 127185 125203 123702 123694 124706 125724 126231 126165 125704
55133A25704m10rK15J26J69L91K32l00m42j04k15r56j087Q9J385J472Q24O85J063
$$ 125704 125294 125285 125500 125626 125795 126186 126418 126118 125676 125572 125357 124401 123314 123403 124788 126260 127084 127769 128832
55114A28832J114P21M61M66M94O61J088J270P42K6q9K25K21p7O1Q16J535J730
$$ 128832 129946 130667 131128 131594 132088 132749 133837 135107 135849 135875 135786 136011 136232 136155 136216 137032 138567 140297
55096A40297J634J636J696J519R93L40j68n21r92j609j948j669j025l54M80J516
$$ 140297 141931 143567 145263 146782 147775 148115 147947 147426 146434 144825 142877 141208 140183 139829 140309 141825
55080A41825J995J235l9l68M77J309J317R03O25M49L18L66L38j83q00o82l8R2
$$ 141825 143820 145055 145016 144648 145125 146434 147751 148654 149279 149728 150046 150412 150750 150567 149767 149085 149047 149139
55062A49139l75m08J83K72n66j184q01k56l95o39l39j74q73j664j436o02l66p76
$$ 149139 148764 148356 148539 148811 148245 147061 146260 146004 145609 144970 144631 144457 143584 141920 140484 139882 139516 138740
55044A38740q79m14l4r3k72l18l09k48p6K3j00k42j45J43N50J083J422J086L37
$$ 138740 137861 137447 137413 137320 137048 136730 136421 136173 136097 136120 136020 135778 135633 135776 136326 137409 138831 139917 140254
55025A40254J62Q35J317P24l75q38n24j59j23j49J2K70L76J51k79m12J9M49J50
$$ 140254 140416 141251 142568 143292 142917 142079 141555 141396 141273 141124 141136 141406 141782 141933 141654 141242 141261 141710 141860
55006A41860n79p80m01l42q38j030m44K85P10J213J860J868R68J36P9K57J25K17
$$ 141860 141281 140501 140100 139758 138920 137890 137446 137731 138441 139654 141514 143382 144350 144486 144565 144822 144947 145164
54988A45164R89J719J603R39L19l46j036j000m4O65K82k78J30R80J072N25K19
$$ 145164 146153 147872 149475 150414 150733 150387 149351 148351 148307 148972 149254 148976 149106 150086 151158 151683 151902
54971A51902L6o78j516j570j097j034j181n31P51J305O03l82o92l37L62J177J614
$$ 151902 151938 151260 149744 148174 147077 146043 144862 144331 145082 146387 146990 146608 145916 145579 145941 147118 148732
54954A48732J226N14N01J229J598R78L0l05KL16J92k53n36l21J49K95N5K1M16
$$ 148732 149958 150472 150973 152202 153800 154778 154808 154503 154505 154821 155013 154760 154224 153903 154052 154347 154402 154423 154839
54935A54839N57l1o37l47N50J062J059J289K083K960L480L669L663L679M223N585
$$ 154839 155396 155365 154728 154381 154931 155993 157052 158341 160424 163384 166864 170533 174196 177875 182098 187683
54919A87683P231Q341Q760Q782Q262O732M289J625q32l085n008o268o823o988
$$ 187683 194914 203255 212015 220797 229059 235791 240080 241705 240873 237788 232780 226512 219689 212701
54905B12701o975o782o412n784m722l355k262j757j469j073r61j528k235k181
$$ 212701 205726 198944 192532 186748 182026 178671 176409 174652 173183 172110 171149 169621 167386 165205
54891A65205j271j59P29J401J825J887J720J502J231J071J545K810M228N206O002
$$ 165205 163934 163775 164504 165905 167730 169617 171337 172839 174070 175141 176686 179496 183724 188930 194932
54876A94932P058Q031Q297P876P144O049M417K582Q79j070l660o241p731p992
$$ 194932 201990 210021 218318 226194 233338 239387 243804 246386 247265 246195 242535 236294 228563 220571
54862B20571p713p204o212m772l402k517k226k476k847k672j943j563j947k139
$$ 220571 212858 205654 199442 194670 191268 188751 186525 184049 181202 178530 176587 175024 173077 170938
54848A70938j297l34p77k476l821l958l447k874k141j236n27j23J71K53J4k6O44
$$ 170938 169641 169307 168530 166054 162233 158275 154828 151954 149813 148577 148050 147927 148098 148351 148365 148339 148983
54831A48983J428J283M10j2L40N49Q8n07p81j014j320j272p40k04J44O24J153
$$ 148983 150411 151694 152104 152092 152432 152981 153069 152562 151781 150767 149447 148175 147435 147231 147375 147999 149152
54814A49152J114N32L37R59J585J331M36l15n80l47M61J665K602K773K391J935
$$ 149152 150266 150798 151135 152094 153679 155010 155446 155131 154551 154204 154665 156330 158932 161705 164096 166031
54798A66031J532J072N44o0p74j371j467j095p88r14j238j287q72k27J10k89j114
$$ 166031 167563 168635 169179 169119 168345 166974 165507 164412 163624 162710 161472 160185 159313 159086 159196 158907 157793
54781A57793j311k98J068J501R93P02J215J952K344K646L205L804M192M596N247
$$ 157793 156482 156184 157252 158753 159746 160448 161663 163615 165959 168605 171810 175614 179806 184402 189649
54766A89649N997O724P663Q869R813R919R212Q122O830N072K550o07l679n827
$$ 189649 195646 202370 210033 218902 228715 238634 247846 255968 262798 267870 270420 269813 266134 260307
54752B60307o878p442q014q353q120p660p440p120n975m123k521j802j795k110
$$ 260307 253429 245987 237973 229620 221500 213840 206400 199280 193305 189182 186661 184859 183064 180954
54738A80954k431k359j714j001q36r55n78L09R97J323J894K910L746M052M365
$$ 180954 178523 176164 174450 173449 172613 171658 171080 171389 172386 173709 175603 178513 182259 186311 190676
54723A90676N180O203O859O975O605N811M911M301L775K588N02j861l882n512
$$ 190676 195856 202059 208918 215893 222498 228309 233220 237521 241296 243884 244386 242525 238643 233131
54709B33131o746p252o963o385n928n424m650l797l043k242j390r26j071j366
$$ 233131 226385 219133 212170 205785 199857 194433 189783 185986 182943 180701 179311 178385 177314 175948
54695A75948j266q72o25o15o26o42q76j297j485j087l66j06p78j779j985j170
$$ 175948 174682 173810 173185 172570 171944 171302 170426 169129 167644 166557 166191 166085 165307 163528 161543 160373
54679A60373l68m10p71n21J21K15k93m88j0M54L89J78K57L55J2p55j550j960j679
$$ 160373 160005 159595 158824 158303 158424 158639 158346 157858 157848 158302 158691 158869 159126 159481 159493 158738 157188 155228 153549
54660A53549q14m1R4K6N31J391J545P17j60l72l60p74j471j930j955j485l46J192
$$ 153549 152735 152694 152788 152814 153345 154736 156281 156998 156838 156466 156106 155332 153861 151931 149976 148491 148145 149337
54642A49337K178J868O47m24o60k06L53N28L28J23Mm61j381j863j059M23J109
$$ 149337 151515 153383 154030 153606 152946 152740 153093 153621 153949 154072 154076 153615 152234 150371 149312 149735 150844
54625A50844O65K47O69J353J418Q86L42J64N36J421K163J845M59r14j426j257
$$ 150844 151509 151756 152425 153778 155196 156082 156424 156588 157124 158545 160708 162553 163012 162098 160672 159415
54609A59415q49k36N46J148J451J646J483M27j070j578o35L86J96o16p14r1K11
$$ 159415 158566 158330 158876 160024 161475 163121 164604 165031 163961 162383 161748 162134 162330 161714 161000 160909 161120
54592A61120j17l72j29L23P03R60Q36N0j015j563j325p29j39M76J030J125N97
$$ 161120 161003 160631 160502 160825 161528 162488 163324 163374 162359 160796 159471 158742 158603 159079 160109 161234 161831
54575A61831j35n27m47j74M6K41N59R10R98P33M64M94O11M45J40J42M44O44O76
$$ 161831 161696 161169 160722 160548 160594 160835 161394 162304 163302 164035 164499 164993 165604 166049 166189 166331 166775 167419 168095
54556A68095Q22R47N73j41l53K02P00M15k79o43o62o80n31J79J152J586J221P03
$$ 168095 168917 169864 170437 170296 169943 170145 170845 171260 170981 170338 169676 168996 168465 168644 169796 171382 172603 173306
54538A73306P22J168J324P17k94q90p09j95J09K50N10P01M53k1j79k5m9l52n63
$$ 173306 174028 175196 176520 177237 176943 176053 175344 175149 175258 175508 176018 176719 177172 177151 176972 176947 176898 176546 175983
54519A75983o34r22j446j775j725j445q35K18J085R12l5n43j92K01Q4m0K22M48
$$ 175983 175349 174427 172981 171206 169481 168036 167201 167419 168504 169416 169381 168838 168646 168847 168931 168891 169113 169561
54501A69561M06O22J257J438N46o67j087o08J92R32J296Q35k63r50o34oJ37J08
$$ 169561 169967 170589 171846 173284 173830 173163 172076 171468 171660 172592 173888 174723 174460 173510 172876 172870 173007 173115
54483A73115N30J128J334J371J691J915J423N43O6n9m20q27m34Q66K141K662K594
$$ 173115 173645 174773 176107 177478 179169 181084 182507 183050 183116 183057 182637 181810 181376 182242 184383 187045 189639
54466A89639K376K070J568R90O78R20J550J843J149k55j382j770j867k073k126
$$ 189639 192015 194085 195653 196643 197321 198241 199791 201634 202783 202528 201146 199376 197509 195436 193310
54451A93310j840j597j595j374o89j05j13l33k98k70n58p44m34p7k22n77o36n92
$$ 193310 191470 189873 188278 186904 186215 186110 185997 185664 185366 185096 184538 183794 183360 183283 183061 182484 181848 181256
54433A81256p44o87o4N62N66L60N82Q26L95k24PR47J451J105N59L11K50L71P99
$$ 181256 180512 179825 179761 180323 180889 181249 181831 182657 183052 182828 182835 183782 185233 186338 186897 187208 187458 187829 188628
54414A88628J168R68M06M6j99o83r21j34J245J865J353O56L76N5o09j014o28K46
$$ 188628 189796 190764 191170 191216 191017 190334 189413 189279 190524 192389 193742 194398 194774 194829 194220 193206 192578 192824
54396A92824J125J898K370K063J003M7n3N56J244J598J484R30K38k28m69p74j154
$$ 192824 193949 195847 198217 200280 201283 201330 201277 201833 203077 204675 206159 207089 207327 207099 206630 205856 204702
54379B04702j356j337j212p81K23J432K080K085K158K702L272L375L149K977K982
$$ 204702 203346 202009 200797 200016 200239 201671 203751 205836 207994 210696 213968 217343 220492 223469 226451
54364B26451L119L350L380K734J369r5j029j389j530j649j658j416r93p18r26
$$ 226451 229570 232920 236300 239034 240403 240308 239279 237890 236360 234711 233053 231637 230644 229926 229000
54349B29000j516j987k044k000k233k575k534k038j554j534j957k342k152j424
$$ 229000 227484 225497 223453 221453 219220 216645 214111 212073 210519 208985 207028 204686 202534 201110
54335B01110r09j186j681j288k1Q23N18j34j61K24M55P36J343J648J012j7n54
$$ 201110 200201 199015 197334 196046 196025 196848 197366 197232 197071 197295 197750 198486 199829 201477 202489 202472 201918
54318B01918q12j457k112j848p94K0K31K73K13k57q06o85M3O37Q37Q58M85m94
$$ 201918 201106 199649 197537 195689 194895 194915 195146 195419 195632 195375 194569 193884 193927 194564 195401 196259 196744 196250
54300A96250j259p86M47J022P54O62Q72L98p49j161k88O27N92K75M89P68M92P5
$$ 196250 194991 194205 194652 195674 196428 197090 197962 198360 197611 196450 196162 196789 197381 197656 198145 198913 199405 199480
54282A99480nk16r34j437j040k79O0K41P47J054M49n62q84m56q5j5J95N79N98
$$ 199480 199475 199259 198325 196888 195848 195569 195629 195870 196617 197671 198120 197558 196674 196218 196133 196118 196313 196892 197490
54263A97490P1n64q78o35M19K199L772M028K988J769J226J106P26l8p74j178j331
$$ 197490 197561 196997 196119 195484 195903 198102 201874 205902 208890 210659 211885 212991 213717 213679 212905 211727 210396
54246B10396j355j105m35K74K76o01j525j615j037n81m24n6O64J207J252J062
$$ 210396 209041 207936 207501 207775 208051 207450 205925 204310 203273 202692 202268 202212 202876 204083 205335 206397
54230B06397P99L13j70qQ00J334R96K89j51n01j094j460r18L01J235J335Q28J29
$$ 206397 207196 207509 207339 207331 208131 209465 210461 210750 210599 210098 209004 207544 206626 206927 208162 209497 210325 210454
54212B10454n16r93j333j681k004k039j734j431j315j065m33J81K02k93o10k41
$$ 210454 209938 208945 207612 205931 203927 201888 200154 198723 197408 196343 195910 196091 196293 196000 195390 195149
54196A95149O30J314J208L46n18o34m9N42O61M04L0k72k11L42Q77P36J77K12J157
$$ 195149 195779 197093 198301 198647 198129 197495 197446 197988 198649 199053 199083 198811 198600 198942 199819 200555 200732 200944 202101
54177B02101K150K432K231J937J274K7j047r99m8N78J04j064k002k156j636r30
$$ 202101 204251 206683 208914 210851 212125 212152 211105 210106 210058 210636 210740 209676 207674 205518 203882 202952
54161B02952m08q0J41Q9l29o20j95O21P96O4o55o49m12o80j203j262q62n77n61
$$ 202952 202544 202464 202605 202694 202365 201745 201550 202171 202967 203031 202376 201727 201315 200635 199432 198170 197308 196731 196170
54142A96170n14m03m89o91o28l15j86l10j53O77J791K393K206J701J419J306R73
$$ 196170 195656 195253 194764 194073 193445 193130 192944 192634 192481 193158 194949 197342 199548 201249 202668 203974 204947
54125B04947N28N91J277J714J157K21J15R08J449J094N96R38K082L251L883L854
$$ 204947 205475 206066 207343 209057 210214 210435 210550 211458 212907 214001 214597 215535 217617 220868 224751 228605
54109B28605L299K675K634L453M783O022O574N889L868J383k96q25r87j522k376
$$ 228605 231904 234579 237213 240666 245449 251471 258045 263934 267802 269185 268889 268064 267077 265555 263179
54094B63179l174l742l897l558l221l598m490m886m385l642l109k337j064K0K52
$$ 263179 260005 256263 252366 248808 245587 241989 237499 232613 228228 224586 221477 219140 218076 218096 218348
54079B18348m3k13k14k24p1L84Q54J176J632K222K398K019J767J959J940J267
$$ 218348 218305 218092 217878 217654 217583 217967 218821 219997 221629 223851 226249 228268 230035 231994 233934 235201
54063B35201O68Q02J049M96n35j090j122j315j729j732j088j45P96J637K170K299
$$ 235201 235869 236671 237720 238216 237681 236591 235469 234154 232425 230693 229605 229460 230256 231893 234063 236362
54047B36362K255K129J677J154J510K968M183L877K719K390L295M404M965N161
$$ 236362 238617 240746 242423 243577 245087 248055 252238 256115 258834 261224 264519 268923 273888 279049
54033B79049N216N156N328O022O635O216M891L776L470L552L520L265K661J655
$$ 279049 284265 289421 294749 300771 307406 313622 318513 322289 325759 329311 332831 336096 338757 340412
54019C40412P62N36O04J75n39n59J18K26r69k588l431l485l550m026m604m830
$$ 340412 341174 341710 342314 342489 341950 341391 341509 341735 340766 338178 334747 331262 327712 323686 319082 314252
54003C14252m581m204m286m943n421m936l787k987k739k171p59P02J039J01j262
$$ 314252 309671 305467 301181 296238 290817 285881 282094 279107 276368 274197 273438 274140 275179 275280 274018
53988B74018k196k507k503k532k608k363j504k57P48J030O01m7k56K91J134J496
$$ 274018 271822 269315 266812 264280 261672 259309 257805 257548 258296 259326 259927 259880 259624 259915 261049 262545
53972B62545J314J341J976K674L045L697N261P137Q212Q371Q224P641N776K501
$$ 262545 263859 265200 267176 269850 272895 276592 281853 288990 297202 305573 313797 321438 327214 329715
53958C29715j183m292o497p571p261n950m637l822l098k029p96K68J169J916K271
$$ 329715 328532 324240 317743 310172 302911 296961 292324 288502 285404 283375 282579 282847 284016 285932 288203
53943B88203K162K029K394L314M396N183N506N609N780N836N256M061K981K370
$$ 288203 290365 292394 294788 298102 302498 307681 313187 318796 324576 330412 335668 339729 342710 345080
53929C45080J589J02j368j655o50Q56K366L722M420M132L695M250N493N994N417
$$ 345080 346669 346771 345403 343748 343098 343954 346320 350042 354462 358594 362289 366539 372032 378026 383443
53914C83443N038N812P093P765P623P107O524O048N775N411M457K975J501J78
$$ 383443 388481 394293 401386 409151 416774 423881 430405 436453 442228 447639 452096 455071 456572 456750
53900D56750j222k355k409j449o59q53j593k177k588l107l846n004o668q066q099
$$ 456750 455528 453173 450764 449315 448656 447803 446210 444033 441445 438338 434492 429488 422820 414754 406655
53885D06655p041o573p478q514q333p418o993p033o654n750m940m327l538k757
$$ 406655 399614 393041 385563 377049 368716 361298 354305 347272 340618 334868 329928 325601 322063 319306
53871C19306k532k728k724k622l182m432n352n164m222l284k605k089j762j713
$$ 319306 316774 314046 311322 308700 305518 301086 295734 290570 286348 283064 280459 278370 276608 274895
53857B74895j851k015k100j923j317n22j77o55j556k140k171j995j778j114K34
$$ 274895 273044 271029 268929 267006 265689 265167 264990 264335 262779 260639 258468 256473 254695 253581 253815
53842B53815J525J591L54q75j036o58q49j451j203K42J562J470L44m16j72N16
$$ 253815 255340 256931 257285 256410 255374 254716 253867 252416 251213 251455 253017 254487 254831 254415 254243 254759
53826B54759Q93Q09N84N32P38J043J209J126Q81O07L76K63L36O32J173J948K731
$$ 254759 255652 256461 257045 257577 258315 259358 260567 261693 262574 263181 263557 263820 264156 264788 265961 267909 270640
53809B70640L099K909K539K403K460K542K828L501M244M636M907N547O347O576
$$ 270640 273739 276648 279187 281590 284050 286592 289420 292921 297165 301801 306708 312255 318602 325178
53795C25178O092N525N258M995M514M132M057L916L282K336J682J649J938J741
$$ 325178 331270 336795 342053 347048 351562 355694 359751 363667 366949 369285 370967 372616 374554 376295
53781C76295N13j218k189k018j925l063m746n470n187n107n477n180l808k520
$$ 376295 376808 375590 373401 371383 369458 366395 361649 356179 350992 345885 340408 335228 331420 328900
53767C28900k329k923l773m943o057n902m164k400k147k952l354k934k264j571
$$ 328900 326571 323648 319875 314932 308875 302973 298809 296409 294262 291310 287956 285022 282758 281187
53753B81187q05m14q36j505j549j132j113j577j776j365p67l95k96n19j027j414
$$ 281187 280382 279968 279132 277627 276078 274946 273833 272256 270480 269115 268348 267953 267657 267138 266111 264697
53737B64697j338j078j012q63j94O64R83P13M30M16N28Q24J441K003J970J500
$$ 264697 263359 262281 261269 260406 260212 260876 261859 262572 263002 263418 263946 264770 266211 268214 270184 271684
53721B71684J161R62N53K29P37J972K849K779K369K352K548K351J653Q29K11m3
$$ 271684 272845 273807 274360 274589 275326 277298 280147 282926 285295 287647 290195 292546 294199 295028 295239 295196
53705B95196J89Q87J765K475K850K997L276M063N230O042N901N067M249L644K922
$$ 295196 295385 296272 298037 300512 303362 306359 309635 313698 318928 324970 330871 335938 340187 343831 346753
53690C46753K034J447J415J576J482J115O87K78j29m35m45q1M31O01P9q61j421
$$ 346753 348787 350234 351649 353225 354707 355822 356509 356787 356658 356223 355778 355697 356128 356729 356808 355947 354526
53673C54526j102k48L99M62N2n61j060j139q12m25j74J10M16K97l39p47k92N25
$$ 354526 353424 353176 353575 354037 354089 353528 352468 351329 350517 350092 349918 350028 350444 350741 350402 349655 349363 349888
53655C49888P54M10L00O35P28K02m43o60n59m13j45L43Q19J048J129J235J387
$$ 349888 350642 351052 351352 351987 352715 352917 352474 351814 351255 350842 350697 351040 351859 352907 354036 355271 356658
53638C56658J620K103K828L465L694L500L063K630K440K530K639K623K788L357
$$ 356658 358278 360381 363209 366674 370368 373868 376931 379561 382001 384531 387170 389793 392581 395938
53624C95938L805L413K523K390L470M559M197K463P93L23R64J948K681L034L236
$$ 395938 399743 403156 405679 408069 411539 416098 420295 422758 423551 423874 424838 426786 429467 432501 435737
53609D35737L658M438N223N456M914L926L008K484K436K769L176L278K956K551
$$ 435737 439395 443833 449056 454512 459426 463352 466360 468844 471280 474049 477225 480503 483459 486010
53595D86010K439K476K146J299M04j35n11j063j550j474r50o95j115j900k582
$$ 486010 488449 490925 493071 494370 494774 494639 494128 493065 491515 490041 489091 488396 487281 485381 482799
53580D82799k960k941k489j960j892k236k363k073j934k261k476k059j478j470
$$ 482799 479839 476898 474409 472449 470557 468321 465958 463885 461951 459690 457214 455155 453677 452207
53566D52207j886k005j673j274q29j7R21J180M58n14q25l60K67M37J56K0N99J664
$$ 452207 450321 448316 446643 445369 444540 444523 445444 446624 447082 446568 445743 445383 445650 446087 446243 446263 446862 448526
53548D48526K320K115J665J782K394K783K635K231J849J621J903K959M330N065
$$ 448526 450846 452961 454626 456408 458802 461585 464220 466451 468300 469921 471824 474783 479113 484178
53534D84178M831M271M233M958O070O963P287P391Q157R959J2009J3267J3749
$$ 484178 489009 493280 497513 502471 508541 515504 522791 530182 538339 548298 560307 573574 587323
53521E87323J4244J4943J5229J4905J4760J5575J7191J8892K0175K0878K1074
$$ 587323 601567 616510 631739 646644 661404 676979 694170 713062 733237 754115 775189
53510G75189K1199K1919K3508K5582K7511K8880K9492K9413K9116K9170K9590
$$ 775189 796388 818307 841815 867397 894908 923788 953280 982693 1011809 1040979 1070569
53499A070569K9829K9492K8662K7514K6050K4414K3036K2184K1705K1393K1272
$$ 1070569 1100398 1129890 1158552 1186066 1212116 1236530 1259566 1281750 1303455 1324848 1346120
53488A346120K1403K1662K1880K1961K1811K1442K1132K1093K1065K0630J9915
$$ 1346120 1367523 1389185 1411065 1433026 1454837 1476279 1497411 1518504 1539569 1560199 1580114
53477A580114J9483J9463J9367J8800J7842J6504J4512J1897R275P104N070K524
$$ 1580114 1599597 1619060 1638427 1657227 1675069 1691573 1706085 1717982 1727257 1734361 1739431 1741955
53465A741955p14m302p758j0663j2755j4149j5229j6175j6879j7351j7834j8354
$$ 1741955 1741241 1736939 1729181 1718518 1705763 1691614 1676385 1660210 1643331 1625980 1608146 1589792
53453A589792j8699j9037j9973k1695k3538k4764k5321k5371k4725k3373k2096
$$ 1589792 1571093 1552056 1532083 1510388 1486850 1462086 1436765 1411394 1386669 1363296 1341200
53442A341200k1747k2000k1631k0040j7827j5786j3927j1752r088o262l792k078
$$ 1341200 1319453 1297453 1275822 1255782 1237955 1222169 1208242 1196490 1187402 1181140 1177348 1175270
53430A175270j252j042q62k18R86K570M355O179P807R057J0067J1203J2711J4491
$$ 1175270 1174018 1172976 1172114 1171896 1172882 1175452 1179807 1185986 1193793 1202850 1212917 1224120 1236831 1251322
53416A251322J6351J8310K0470K2659K4506K5889K7094K8395K9770L1223L3057
$$ 1251322 1267673 1285983 1306453 1329112 1353618 1379507 1406601 1434996 1464766 1495989 1529046
53405A529046L5442L7857L9478M0209M0916M2456M4767M7194M9423N1714N4268
$$ 1529046 1564488 1602345 1641823 1682032 1722948 1765404 1810171 1857365 1906788 1958502 2012770
53394B012770N6757N8693O0031O1179O2436O3689O4620O5002O4666O3606O2283
$$ 2012770 2069527 2128220 2188251 2249430 2311866 2375555 2440175 2505177 2569843 2633449 2695732
53383B695732O1444O1142O0320N7937N4434N1282M9119M7093M4195M0392L6056
$$ 2695732 2757176 2818318 2878638 2936575 2991009 3042291 3091410 3138503 3182698 3223090 3259146
53372C259146L1168K5700K0157J4968R807M155j910q208j5267k3665l2783m1063
$$ 3259146 3290314 3316014 3336171 3351139 3360946 3365101 3363191 3354983 3339716 3316051 3283268 3242205
53360C242205m7467n2052n5252n7347n8713n9774o0603o1039o1181o1207o0841
$$ 3242205 3194738 3142686 3087434 3030087 2971374 2911600 2850997 2789958 2728777 2667570 2606729
53349B606729n9563n7386n4873n2544n0736m9877n0061n0546n0411m9663m8973
$$ 2606729 2547166 2489780 2434907 2382363 2331627 2281750 2231689 2181143 2130732 2081069 2032096
53338B032096m8344m6970m4437m1234l7905l4581l1484k9020k7072k4910k2197
$$ 2032096 1983752 1936782 1892345 1851111 1813206 1778625 1747141 1718121 1691049 1666139 1643942
53327A643942j9425j7206j5759j5256j5822j6972j7769j7894j7815j7679j6939
$$ 1643942 1624517 1607311 1591552 1576296 1560474 1543502 1525733 1507839 1490024 1472345 1455406
53316A455406j5424j3871j2902j2276j1598j0911j0035q272n493k765j018J97
$$ 1455406 1439982 1426111 1413209 1400933 1389335 1378424 1368389 1360117 1354624 1351859 1350841 1351038
53304A351038J706L216L845L836M554O791R946J2881J4951J6175J7022J8122J9782
$$ 1351038 1352744 1355960 1359805 1363641 1368195 1374986 1384932 1397813 1412764 1428939 1445961 1464083 1483865
53291A483865K1736K3619K5445K7331K9047L0283L0985L1067L0180K8313K6228
$$ 1483865 1505601 1529220 1554665 1581996 1611043 1641326 1672311 1703378 1733558 1761871 1788099
53280A788099K4597K3027K0721J7826J5268J3252J0883P537L772M74k295n117
$$ 1788099 1812696 1835723 1856444 1874270 1889538 1902790 1913673 1921210 1924982 1925456 1923161 1918044
53268A918044q234j1376j4391j7534k0945k4252k6945k8950l0548l1773l2385
$$ 1918044 1909810 1898434 1884043 1866509 1845564 1821312 1794367 1765417 1734869 1703096 1670711
53257A670711l2455l2565l3016l3361l3222l3111l3613l4073l3218l1103k9326
$$ 1670711 1638256 1605691 1572675 1539314 1506092 1472981 1439368 1405295 1372077 1340974 1311648
53246A311648k8887k9000k8638k8138k8353k9003k9123k8653k8349k8280k7544
$$ 1311648 1282761 1253761 1225123 1196985 1168632 1139629 1110506 1081853 1053504 1025224 997680
53235I97680k5703k3506k1809k0531j9044j7137j5167j3568j2536j2007j1708
$$ 997680 971977 948471 926662 906131 887087 869950 854783 841215 828679 816672 804964
53224H04964j1334j0825j0378j0170j0194j0395j0846j1693j2916j4261j5424
$$ 804964 793630 782805 772427 762257 752063 741668 730822 719129 706213 691952 676528
53213F76528j6309j6955j7227j6800j5613j4132j2813j1603j0307r211q725q650
$$ 676528 660219 643264 626037 609237 593624 579492 566679 555076 544769 535558 526833 518183
53201E18183q458q171q212q433q247p799p947q788r225q543p517p194p416p349
$$ 518183 509725 501554 493342 484909 476662 468863 460916 452128 442903 434360 426843 419649 412233 404884
53187D04884o790o134n584n163n052n155m825l789k823k723l096l102k827k923
$$ 404884 398094 391960 386376 381213 376161 371006 366181 362392 359569 356846 353750 350648 347821 344898
53173C44898l190k813j819j163j261j446j132o18m58o94j020j184j066q16r16
$$ 344898 341708 338895 337076 335913 334652 333206 332074 331456 330998 330304 329284 328100 327034 326218 325302
53158C25302j651k540k816k395j844j478j149q28p03o94m71l5K89L96L62k5r53
$$ 325302 323651 321111 318295 315900 314056 312578 311429 310601 309898 309204 308733 308698 308987 309383 309745 309720 308767
53141C08767j845j776p27L35P62Q69J086J241J041O15K15p8r1M44J278J595J003
$$ 308767 306922 305146 304419 304754 305516 306385 307471 308712 309753 310368 310583 310505 310414 310858 312136 313731 314734
53124C14734J58l1N56J304J693J705J597J597J790K161K693L351L817L554K411
$$ 314734 314892 314861 315417 316721 318414 320119 321716 323313 325103 327264 329957 333308 337125 340679 343090
53109C43090R71j10q67j648k294k378k060j956k186k291k077j764j323n45J22
$$ 343090 344061 343951 343084 341436 339142 336764 334704 332748 330562 328271 326194 324430 323107 322562 322684
53094C22684j98j459k552k829k854l123l050k016o31K4r6j51K17N74N58L34J08
$$ 322684 322486 321027 318475 315646 312792 309669 306619 304603 303972 303996 303900 303749 303966 304540 305098 305432 305540
53077C05540j59n52j033j527j868j809j320p27l24p9N9q1n67j139j587j984k185
$$ 305540 305381 304829 303796 302269 300401 298592 297272 296545 296221 296142 296201 296120 295553 294414 292827 290843 288658
53060B88658j697n05M56M41J0K05Q90R72J50n97n05J2L61P91J715K648K681J753
$$ 288658 286961 286456 286912 287353 287363 287568 288458 289430 289580 288983 288478 288490 288851 289642 291357 294005 296686 298439
53042B98439O66j00q48j830k606k545j650n53J19J57k65p78j073j138j208j411
$$ 298439 299105 299005 298157 296327 293721 291176 289526 288973 289092 289249 288984 288206 287133 285995 284787 283376
53026B83376j585j530j299j029o86k19J96L45L18L51M64N49P23J108J381J120
$$ 283376 281791 280261 278962 277933 277247 277028 277224 277569 277887 278238 278702 279251 279974 281082 282463 283583
53010B83583O21P20J633K559K698K087J142K2j052j535j207n91j47L66J097J330
$$ 283583 284204 284924 286557 289116 291814 293901 295043 295065 294013 292478 291271 290680 290533 290899 291996 293326
52994B93326M84o29p03J69O71L11O0P67K011K882L025K557J805J380J708K199
$$ 293326 293810 293181 292478 292647 293318 293629 293689 294456 296467 299349 302374 304931 306736 308116 309824 312023
52978C12023J761M34m55k00L29K49K6M16J000R06L05o3k32o60r43k14J244K130
$$ 312023 313784 314218 313763 313563 313892 314141 314167 314583 315583 316489 316794 316731 316499 315839 314896 314682 315926 318056
52960C18056J945J475J291R91L51J9L31M50m18j660k109j804j811k468k901k412
$$ 318056 320001 321476 322767 323758 324109 324128 324459 324909 324491 322831 320722 318918 317107 314639 311738 309326
52944C09326j480r18p48n02j99l11q94j342j210q04o78q80r72p24l60j55m2K21
$$ 309326 307846 306928 306180 305678 305479 305168 304274 302932 301722 300918 300240 299360 298388 297664 297304 297149 297107 297328
52926B97328O54J019J099R07N94K32j57l77j03O97J474J624J254J051J240J182
$$ 297328 297982 299001 300100 301007 301601 301833 301676 301299 301196 301893 303367 304991 306245 307296 308536 309718
52910C09718L84o04q80n22m26q79j187q99o09r68j530j345l55N38P92Q20J133
$$ 309718 310102 309498 308618 308096 307670 306791 305604 304705 304096 303128 301598 300253 299898 300436 301228 302048 303181
52893C03181J523J489J088Q16Q49Q63O62M83N19M61q1q87j259q26M6O94P84M91
$$ 303181 304704 306193 307281 308097 308946 309809 310471 310954 311473 311934 311853 310966 309707 308881 308927 309621 310405 310896
52875C10896L18P26J639K367K374K039K189K827L048K492K081K736L986M562L918
$$ 310896 311214 311940 313579 315946 318320 320359 322548 325375 328423 330915 332996 335732 339718 344280 348198
52860C48198K446N23j678l565m264l587k272j170p14j058k002k796k771k273k311
$$ 348198 350644 351167 349489 345924 341660 338073 335801 334631 333917 332859 330857 328061 325290 323017 320706
52845C20706l135l942m085l768l280k463j371o43o67r82j101j211j497j418m96
$$ 320706 317571 313629 309544 305776 302496 300033 298662 298019 297352 296370 295269 294058 292561 291143 290647
52830B90647O78J083O97M49Q44J406J552J272Q04J76o13j281j536j502j599j996
$$ 290647 291325 292408 293105 293554 294398 295804 297356 298628 299432 299608 298995 297714 296178 294676 293077 291081
52814B91081k285j900q21L23R70J169J174R22M07K83J162K351K264L90j901l070
$$ 291081 288796 286896 286075 286398 287368 288537 289711 290633 291040 291323 292485 294836 297100 297490 295589 292519
52798B92519l101k939k880k418j413n00l73j077k014k357j739p56m73j019j212
$$ 292519 289418 286479 283599 281181 279768 279268 278895 277818 275804 273447 271708 270952 270479 269460 268248
52783B68248q5J683K547J959P23k63p94r40o48L8Q48J508J792J500P64K10K46
$$ 268248 268163 269846 272393 274352 275075 274812 274018 273078 272430 272468 273316 274824 276616 278116 278880 279090 279336
52766B79336L68j38r79j092k00P14P71K96P9J53q0p96j402j290m70N52J300J541
$$ 279336 279704 279566 278587 277495 277295 278009 278780 279076 279155 279308 279228 278432 277030 275740 275270 275822 277122 278663
52748B78663J162J39j142j831j278J57J351J692J646J824K047J830J340J104J126
$$ 278663 279825 279964 278822 276991 275713 275870 277221 278913 280559 282383 284430 286260 287600 288704 289830
52733B89830J050J073J739K806L221K564J633J260J206Q05O2n34q64j179j530
$$ 289830 290880 291953 293692 296498 299719 302283 303916 305176 306382 307187 307249 306715 305851 304672 303142
52718C03142j753j898k092k088j532o44j65m34r95j164p41L4Q39J375J396R05
$$ 303142 301389 299491 297399 295311 293779 293135 292970 292536 291541 290377 289636 289670 290509 291884 293280 294185
52702B94185K32k95o17p48n43L5O00O47K03k10k74j67pM52J275J878J665R13M41
$$ 294185 294417 294122 293505 292757 292214 292249 292849 293496 293699 293489 293215 293048 293041 293493 294768 296646 298311 299224 299665
52683B99665M71M49O2k01J76R20J328J142O85L05Q1J7J38L98N96M79p7q95j479
$$ 299665 300136 300585 300647 300446 300622 301542 302870 304012 304697 305002 305083 305100 305238 305636 306232 306711 306634 305739 304260
52664C04260j372o27K81R63J352J426J172R11J137J840K413K521K585L012L421
$$ 304260 302888 302261 302542 303505 304857 306283 307455 308366 309503 311343 313756 316277 318862 321874 325295
52649C25295L180K417J836J684J470O75o71k193l424l828l065j444J12Q02N97
$$ 325295 328475 330892 332728 334412 335882 336557 335886 333693 330269 326441 323376 321932 322044 322846 323443
52634C23443J56J49P08J414J880K243L010M387O086P742R101R636Q609N832K122
$$ 323443 323599 323748 324456 325870 327750 329993 333003 337390 343476 351218 360319 369955 378564 384396 386518
52619C86518j399m106n758o181n647n066n075n199m583l251k000j228p43n39q70
$$ 386518 385119 381013 375255 369074 363427 358361 353286 348087 343504 340253 338253 337025 336282 335743 334873
52604C34873j457j487o83L36J022J521K043K294J959J277O73K14k20n36n51k65
$$ 334873 333416 331929 331246 331582 332604 334125 336168 338462 340421 341698 342371 342585 342365 341829 341278 341013
52588C41013K25Q00J182J103P77Q27J430J971J864J296P98N13L19L42P39J193
$$ 341013 341238 342038 343220 344323 345100 345927 347357 349328 351192 352488 353286 353799 354118 354460 355199 356392
52572C56392J215P91K93j72p60j278j239o34r2o0k45j97l1j38n16q85j261j888
$$ 356392 357607 358398 358691 358519 357759 356481 355242 354608 354516 354456 354211 354014 353983 353845 353329 352444 351183 349295
52554C49295k557k610j788o87m5Jk66o74j084j118o06r9k60p68n81N51J602J614
$$ 349295 346738 344128 342340 341653 341608 341609 341343 340669 339585 338467 337861 337762 337502 336734 336153 336704 338306 339920
52536C39920R18N15P44J148J293J138P78L55J66L59O35O09L42K16M04Q23J384
$$ 339920 340838 341353 342097 343245 344538 345676 346454 346809 346975 347334 347969 348578 348920 349136 349540 350363 351747
52519C51747J905K042J728J430J550J802J800J887K605L581L842L272K811L037
$$ 351747 353652 355694 357422 358852 360402 362204 364004 365891 368496 372077 375919 379191 382002 385039
52505C85039L386L130K338J376J45j557l295m357m600m524m564m665m435l481
$$ 385039 388425 391555 393893 395269 395414 393857 390562 386205 381605 377081 372517 367852 363417 359936
52491C59936j850l03J25q18k100k406j472k28L35J04k98k83J37M50K67j69j69
$$ 359936 358086 357783 357908 357090 354990 352584 351112 350884 351219 351323 351025 350742 350879 351329 351596 351427 351258
52474C51258N73J503J705R15n7m8J291L029L845L396K612K541L241M086M726N196
$$ 351258 351831 353334 355039 355954 355897 355849 357140 360169 364014 367410 370022 372563 375804 379890 384616 389812
52458C89812N235M283K312R2j625k799l761m628n276n613n501m797l730k949k842
$$ 389812 395047 399330 401642 401734 400109 397310 393549 388921 383645 378032 372531 367734 364004 361055 358213
52443C58213k994k672j725o74n2N7j64n25q75j124j295j462j508j138k62O44Q36
$$ 358213 355219 352547 350822 350148 350096 350153 349989 349464 348589 347465 346170 344708 343200 342062 341800 342444 343280
52426C43280J37p07p95j66L24K39J58O84J433J594J148P97Q60J014J143J615K490
$$ 343280 343417 342710 341915 341749 342073 342312 342470 343154 344587 346181 347329 348126 348986 350000 351143 352758 355248
52409C55248L190L372L520M190N173N931O565P773R887J2319J3926J3668J1117
$$ 355248 358438 361810 365330 369520 374693 380624 387189 394962 404849 417168 431094 444762 455879
52396D55879O720J612l009o449q564r459r324q452p214n945m832l829k814j939
$$ 455879 462599 464211 461202 454753 446189 436730 427406 418954 411740 405795 400963 397134 394320 392381
52382C92381j655k042k334j634j28J064J346J396K096L305M233M618M905N402
$$ 392381 390726 388684 386350 384716 384588 385652 386998 388394 390490 393795 398028 402646 407551 412953
52368D12953N851N888N484M785L868K786J651M92q07k236l382l632k819j553o87
$$ 412953 418804 424692 430176 434961 438829 441615 443266 443758 442951 440715 437333 433701 430882 429329 428642
52353D28642m12j13O76J519J639J066O68J026J741K130K139K213K522K745K660
$$ 428642 428230 428117 428793 430312 431951 433017 433685 434711 436452 438582 440721 442934 445456 448201 450861
52338D50861K609L149M301N348N599N274N339O312P627Q392Q554Q887J0021J1857
$$ 450861 453470 456619 460920 466268 471867 477141 482480 488792 496419 504811 513365 522252 532273 544130
52324E44130J3816J5350J6252J6808J7421J7923J7601J6317J5145J5181J6074
$$ 544130 557946 573296 589548 606356 623777 641700 659301 675618 690763 705944 722018
52313G22018J6597J6494J6691J7712J8935J9776K0580K1833K3209K4021K4104
$$ 722018 738615 755109 771800 789512 808447 828223 848803 870636 893845 917866 941970
52302I41970K3733K3161K2626K2401K2386K2075K1174J9830J8030J5424J2063
$$ 941970 965703 988864 1011490 1033891 1056277 1078352 1099526 1119356 1137386 1152810 1164873
52291A164873Q663N656K676m93l139m525n040n666o667p632q406r115r426q702
$$ 1164873 1173536 1179192 1181868 1181375 1178236 1173711 1168671 1163005 1156338 1148706 1140300 1131185 1121759 1113057
52277A113057p045n443m632m347l821k744j455l89M79J672L575N870P761Q839
$$ 1113057 1106012 1100569 1095937 1091590 1087769 1085025 1083570 1083181 1083660 1085332 1088907 1094777 1102538 1111377
52263A111377R370R684R823R966J0722J2488J4847J6943J8256J8817J9075J9696
$$ 1111377 1120747 1130431 1140254 1150220 1160942 1173430 1188277 1205220 1223476 1242293 1261368 1281064
52251A281064K0943K1984K1463J9111J6143J3637J1257Q315N183K663N13k105
$$ 1281064 1302007 1323991 1345454 1364565 1380708 1394345 1405602 1413917 1419100 1421763 1422276 1420171
52239A420171n041p221q362r389j0949j2580j3716j4613j5656j6478j6471j5808
$$ 1420171 1415130 1407909 1399547 1390158 1379209 1366629 1352913 1338300 1322644 1306166 1289695 1273887
52227A273887j5334j5472j5741j5366j4154j2663j1586j1094j0831j0443r800
$$ 1273887 1258553 1243081 1227340 1211974 1197820 1185157 1173571 1162477 1151646 1141203 1131403
52216A131403q758p138n176l549k643k125j565j089r43q05r0J222K633L737M428
$$ 1131403 1122645 1115507 1110331 1106782 1104139 1102014 1100449 1099360 1098417 1097612 1097522 1098744 1101377 1105114 1109542
52201A109542M651M554M548M823N024M888M845N387O255O940P641Q780R875R894
$$ 1109542 1114193 1118747 1123295 1128118 1133142 1138030 1142875 1148262 1154517 1161457 1169098 1177878 1187753 1197647
52187A197647Q728P337O348N452M327L086J494j212n091q794j0806j1037j0570
$$ 1197647 1206375 1213712 1220060 1225512 1229839 1232925 1234419 1233207 1228116 1219322 1208516 1197479 1186909
52174A186909j0297j0248j0047r445q467p339o275n248m140l037k125j241P2J982
$$ 1186909 1176612 1166364 1156317 1146872 1138405 1131066 1124791 1119543 1115403 1112366 1110241 1109000 1109072 1111054
$$ [...]
##END NTUPLES=NMR SPECTRUM
##END=
