##TITLE=AC1698_ROEFFECT0026_8637906_SslmmA38rP
##JCAMPDX= 6.0         $$ Bruker NMR JCAMP-DX V2.0
##DATA TYPE= NMR SPECTRUM
##DATA CLASS= NTUPLES
##ORIGIN= BRUKER
##OWNER= Administrator
$$ 1.72 TOPSPIN		Version 2.1
$$ 2014-05-22 23:36:24.698 -0700  Administrator@X
$$ Compression mode = diff/dup
##.OBSERVE FREQUENCY= 400.02188249412
##.OBSERVE NUCLEUS= ^1H
##.ACQUISITION MODE= SIMULTANEOUS (DQD)
##.ACQUISITION SCHEME= undefined
##.AVERAGES= 8
##.DIGITISER RES= 22
##SPECTROMETER/DATA SYSTEM= spect
##.PULSE SEQUENCE= zg30
##.SOLVENT NAME= COFFEE_meoh
##.SHIFT REFERENCE= INTERNAL, COFFEE_meoh, 1, 14.98509
##AUDIT TRAIL= $$ (NUMBER, WHEN, WHO, WHERE, PROCESS, VERSION, WHAT)
$$ ##TITLE= Audit trail, TOPSPIN		Version 2.1
$$ ##JCAMPDX= 5.01
$$ ##ORIGIN= Bruker BioSpin GmbH
$$ ##OWNER= Administrator
$$ $$ E:\/data/COFFEE/nmr/AC1698_ROEFFECT0026_8637906_SslmmA38rP/10/pdata/1/auditp.txt
$$ ##AUDIT TRAIL=  $$ (NUMBER, WHEN, WHO, WHERE, PROCESS, VERSION, WHAT)
(   1,<2014-05-22 23:36:18.245 -0700>,<Administrator>,<X>,<go>,<TOPSPIN 2.1>,
      <created by zg
	started at 2014-05-22 23:35:11.573 -0700,
	POWCHK enabled, PULCHK disabled,
       configuration hash MD5:
       C8 4E 4E 5D D3 5C D8 9E 9F 52 82 E0 59 8A DE 15
       data hash MD5: 64K
       26 F3 71 18 B2 35 32 69 36 DD 39 51 96 38 F2 D5>)
(   2,<2014-05-22 23:36:21.152 -0700>,<Administrator>,<X>,<proc1d>,<TOPSPIN 2.1>,
      <Start of raw data processing
       efp LB = 0 FT_mod = 6 PKNL = 1 PHC0 = 0 PHC1 = 0 SI = 32K 
       data hash MD5: 32K
       6C 4A ED 84 C9 EA 90 EC 66 B8 04 A8 84 50 25 51>)
(   3,<2014-05-22 23:36:21.448 -0700>,<Administrator>,<X>,<proc1d>,<TOPSPIN 2.1>,
      <pk PHC0 = 95.37781 PHC1 = 0 
       data hash MD5: 32K
       EF 42 7F 2E 0C F7 87 62 9D 49 A3 DA 3C AF 80 3E>)
(   4,<2014-05-22 23:36:21.542 -0700>,<Administrator>,<X>,<proc1d>,<TOPSPIN 2.1>,
      <abs ABSG = 1 
       data hash MD5: 32K
       C7 E4 9F 37 A7 E0 36 A4 92 F3 77 B4 A0 85 49 5E>)
(   5,<2014-05-22 23:36:21.636 -0700>,<Administrator>,<X>,<proc1d>,<TOPSPIN 2.1>,
      <abs ABSG = 2 
       data hash MD5: 32K
       F2 21 D2 E5 03 BE EC 22 8B 87 A6 98 DF 6F E0 AE>)
(   6,<2014-05-22 23:36:21.683 -0700>,<Administrator>,<X>,<proc1d>,<TOPSPIN 2.1>,
      <abs ABSG = 3 
       data hash MD5: 32K
       CB 39 AD 21 65 9A DD 05 E7 82 8D 31 23 F9 F7 9C>)
(   7,<2014-05-22 23:36:21.745 -0700>,<Administrator>,<X>,<proc1d>,<TOPSPIN 2.1>,
      <abs ABSG = 4 
       data hash MD5: 32K
       7F F9 AD 14 15 44 8E BE 77 C4 37 47 FA 7E B3 73>)
(   8,<2014-05-22 23:36:21.792 -0700>,<Administrator>,<X>,<proc1d>,<TOPSPIN 2.1>,
      <abs ABSG = 5 
       data hash MD5: 32K
       6E EA A5 00 C6 D0 51 AB 46 8F 45 31 E6 F5 D3 6E>)
$$ ##END=
$$ 
$$ $$ hash MD5
$$ $$ 6D 0E DD B2 FA 17 68 FD B7 47 55 7A 5F CA F1 89
##$RELAX= 
##$RELAX= 
##$RELAX= 
##$RELAX= 
##$RELAX= 
##$RELAX= 
##$RELAX= 
$$ Bruker specific parameters
$$ --------------------------
##$DU= <E:\>
##$EXPNO= 10
$$ [...]
150 150 150 150 150 150 150 150
##$TP07= 0
##$TPNAME0= <>
##$TPNAME1= <>
##$TPNAME2= <>
##$TPNAME3= <>
##$TPNAME4= <>
##$TPNAME5= <>
##$TPNAME6= <>
##$TPNAME7= <>
##$TPOAL= (0..7)
0.5 0.5 0.5 0.5 0.5 0.5 0.5 0.5
##$TPOFFS= (0..7)
0 0 0 0 0 0 0 0
##$TUNHIN= 0
##$TUNHOUT= 0
##$TUNXOUT= 0
##$USERA1= <user>
##$USERA2= <user>
##$USERA3= <user>
##$USERA4= <user>
##$USERA5= <user>
##$V9= 5
##$VALIST= <valist>
##$VCLIST= <CCCCCCCCCCCCCCC>
##$VD= 0
##$VDLIST= <DDDDDDDDDDDDDDD>
##$VPLIST= <PPPPPPPPPPPPPPP>
##$VTLIST= <TTTTTTTTTTTTTTT>
##$WBST= 2048
##$WBSW= 25
##$XGAIN= (0..3)
0 0 0 0
##$XL= 0
##$YL= 0
##$YMAX_a= 640763
##$YMIN_a= -541628
##$ZGOPTNS= <>
##$ZL1= 120
##$ZL2= 120
##$ZL3= 120
##$ZL4= 120
##$ABSF1= 14.98509
##$ABSF2= -5.573092
##$ABSG= 5
##$ABSL= 3
##$ALPHA= 0
##$AQORDER= 0
##$ASSFAC= 0
##$ASSFACI= 0
##$ASSFACX= 0
##$ASSWID= 0
##$AUNMP= <proc_prof1d_extract_pilot.lims>
##$AXLEFT= 0
##$AXNAME= <>
##$AXNUC= <1H>
##$AXRIGHT= 0
##$AXTYPE= 0
##$AXUNIT= <>
##$AZFE= 0.1
##$AZFW= 0.1
##$BCFW= 0
##$BC_mod= 0
##$BYTORDP= 0
##$COROFFS= 0
##$CY= 15
##$DATMOD= 1
##$DC= 0
##$DFILT= <>
##$DTYPP= 0
##$F1P= 0
##$F2P= 0
##$FCOR= 0.5
##$FTSIZE= 32768
##$FT_mod= 6
##$GAMMA= 0
##$GB= 0
##$INTBC= 1
##$INTSCL= 1
##$ISEN= 128
##$LB= 0
##$LEV0= 0
##$LPBIN= 0
##$MAXI= 10000
##$MC2= 0
##$MEAN= 0
##$ME_mod= 0
##$MI= 0
##$NCOEF= 0
##$NC_proc= -8
##$NLEV= 6
##$NOISF1= 0
##$NOISF2= 0
##$NSP= 0
##$NTH_PI= 0
##$NZP= 0
##$OFFSET= 14.98509
##$PC= 1
##$PHC0= 95.37781
##$PHC1= 0
##$PH_mod= 1
##$PKNL= yes
##$PPARMOD= 0
##$PPDIAG= 0
##$PPIPTYP= 0
##$PPMPNUM= 2147483647
##$PPRESOL= 1
##$PSCAL= 4
##$PSIGN= 0
##$PYNMP= <proc.py>
##$REVERSE= no
##$SF= 400.02
##$SI= 32768
##$SIGF1= 0
##$SIGF2= 0
##$SINO= 400
##$SIOLD= 32768
##$SPECTYP= <>
##$SREGLST= <1H.CDCl3>
##$SSB= 0
##$STSI= 32768
##$STSR= 0
##$SW_p= 8223.68421052631
##$SYMM= 0
##$S_DEV= 0
##$TDeff= 65536
##$TDoff= 0
##$TI= <>
##$TILT= no
##$TM1= 0
##$TM2= 0
##$TOPLEV= 0
##$USERP1= <user>
##$USERP2= <user>
##$USERP3= <user>
##$USERP4= <user>
##$USERP5= <user>
##$WDW= 1
##$XDIM= 32768
##$YMAX_p= 465631781
##$YMIN_p= -712374
##$CURPLOT= <Network HP LaserJet P1505>
##$CURPRIN= <$Network HP LaserJet P1505>
##$DFORMAT= <normdp>
##$LAYOUT= <+/1D_H.xwp>
##$LFORMAT= <normlp>
##$PFORMAT= <normpl>
##$SURQMSG= 1
$$ End of Bruker specific parameters
$$ ---------------------------------
##NTUPLES= NMR SPECTRUM
##VAR_NAME=  FREQUENCY,     SPECTRUM/REAL,   SPECTRUM/IMAG
##SYMBOL=    X,             R,               I
##VAR_TYPE=  INDEPENDENT,   DEPENDENT,       DEPENDENT
##VAR_FORM=  AFFN,          ASDF,            ASDF
##VAR_DIM=   32768,         32768,           32768
##UNITS=     HZ,            ARBITRARY UNITS, ARBITRARY UNITS
##FACTOR=    0.250966925370066, 1,           1
##FIRST=     8223.43324360094, -130006,      -87821
##LAST=      0,             -108237,         -142100
##MIN=       0,             -712374,         0
##MAX=       8223.43324360094, 465631781,    0
$$ Real data points
##PAGE= N=1
##DATA TABLE= (X++(R..R)), XYDATA
$$ [...]
19530e0863B21225b83471h6266D29605D3310K92019B7290c21699L5846A22977
19519c87435E4738h17B89510B8437h2203b6954p2873A2212a97034M9554L928h048
19506c15986J36434k0273N5074j01729B50191a39108B5222J7920J60175a16101
19495C71012h398j4650k50435B47843g1217b8368H1165C1049K11466E5208a56323
19483E3872h6073A71498a17813k2463l3416l1954Q6872l31140b19234R764F935
19471c44542i5234H3987c08764h8223d945j01409l4082j40624j26941c7839l595
19460d1434A67882P3002b36282c6092j34109b3861n676p3566A360h4896A09088
19448f5949A15588C0189a1437k9494I2063L1672b28548g5795A32263a5988B00
$$ plain form
19530 -50863 221225 -283471 -86266 429605 43310 335329 27290 -321699 -285853 122977
19519 -387435 54738 -817 289510 28437 -82203 -26954 -99827 12212 -197034 -147480 -143552 -8048
19506 -315986 -179552 -199825 -144751 -246480 250191 -139108 25222 43142 203317 -116101
19495 371012 -8398 -23048 -273483 247843 -71217 -28368 81165 31049 242515 55208 -156323
19483 53872 -86073 171498 -117813 -140276 -173692 -205646 -118774 -449914 -219234 -209470 6935
19471 -344542 -95234 83987 -308764 -88223 -4945 -106354 -140436 -281060 -408001 -37839 -41434
19460 -41434 167882 240884 -236282 -36092 -170201 -23861 -29537 -103103 1360 -84896 109088
19448 -65949 115588 30189 -11437 -40931 92063 123735 -228548 -75795 132263 -15988 200
19436f3097o3126K69r2225r6792C894L36230b47911f5337c503k73000L7860a1069
19423b50396G2408O4769A6656J8949b26017e5212m3683l51880A1687a75349C6886
19411F0673a40338j80893a5789k38609Q2220g1712p5740N0013B83359J2343i773
19399b13238A99447c23381A24869i6248m667k3567o8060B68158a17865n3614A09402
19387A43151a12777A19951b15454i3459l46377h5844D0263b52708b7846q3524
19377a11370c8488A00287L8361b3283j0097p9859A96770a91321d1623B26292h5614
19365a14515e4405m16297H7068h8916A12470a56907k22277a2182E4718j6276f7318
19353b17324b4471l92437g8133G6268L32803f6808k7491C29369a67417l7488B6646
$$ plain form
19436 -63097 -126223 -125954 -218179 -314971 3894 340124 -247911 -65337 -3503 -276503 -238643 -11069
19423 -250396 72408 137177 16656 35605 -226017 -55212 -98895 -450775 11687 -175349 36886
19411 60673 -140338 -321231 -15789 -254398 -172178 -71712 -147452 -97439 283359 295702 -9773
19399 -213238 199447 -323381 124869 -96248 -100915 -124482 -192542 268158 -117865 -171479 109402
19387 143151 -112777 119951 -215454 -93459 -439836 -85844 40263 -252708 -27846 -111370
19377 -111370 -38488 100287 138648 -23283 -33380 -113239 196770 -191321 -41623 226292 -85614
19365 -114515 -54405 -470702 87068 -88916 112470 -156907 -379184 -12182 54718 38442 -67318
19353 -217324 -24471 -416908 -78133 76268 409071 -66808 -94299 329369 -167417 -204905 26646
19341e2983A666f52004d7411c694j85043A75551G4518a00877k4897A18120a66674
19329B798K2663P7471O2986c4256B29231c2740j42957P9324C9850b78901A41220
19317a28508B00314l2115D6377a64451E7029i8910o8363k37424a41139C2074a03637
19305f1131k10182B5134a34047o9075P4666N9770q8974N3148L9318m58027G2035
19293e8665j10107K855E6962J60971c49591J61059d2476j58349J4984i0028A65879
19281B261J59375b41076j33418A04621a50396F0568d17157J93275a9987o9287
19271h9274j43776K826i0174G5435b14650q659m6461J9158E8758a99597L762P9779
19259a16056A10331b93999B0462J66198a60200D5332J55733b90966d7542j24137
$$ plain form
19341 -52983 1666 -652004 -47411 -3694 -188737 175551 74518 -100877 -125774 118120 -166674
19329 2798 25461 102932 165918 -34256 229231 -32740 -175697 -96373 39850 -278901 141220
19317 -128508 200314 168199 46377 -164451 57029 -98910 -167273 -404697 -141139 32074 -103637
19305 -61131 -271313 25134 -134047 -203122 -128456 -68686 -157660 -104512 -65194 -523221 72035
19293 -58665 -168772 -165917 56962 217933 -349591 -188532 -42476 -200825 -185841 -90028 165879
19281 2261 161636 -241076 -374494 104621 -150396 60568 -417157 -223882 -19987 -89274
19271 -89274 -233050 -230224 -90174 75435 -214650 -223309 -269770 -250612 58758 -199597 -195835 -116056
19259 -116056 110331 -293999 20462 186660 -160200 45332 201065 -290966 -47542 -171679
19249a71679j66519A49213c2163J0403A78014f0079j60290Q6201B38135c32698
19238d2044G0790C4935e0670a2687k43546g4294B4052i0642j22691g8576A83000
19226b0072n8802N154B59370D2950M9532L902d0278F6903a63297e8390p6250d4546
19213a19084j61820P2370N3502A84222a03569k59527g8680c3991A9380R8772N6864
19202A75016a18159A9784P2558b0946H075a14065c235A9463b49125a12834D4433
19190b45046G4980i2893l57614A76939k7544c0266j2498k4926A50536H168f554
19178b49963H1967g0965H9469A0239J21096J59281g2045k6175L733g039l52896
19167c59935e9933j52927A40724P8639f9241J4621j25686I551J11972a18243A93245
$$ plain form
19249 -171679 -338198 149213 -32163 -21760 178014 -60079 -220369 -134168 238135 -332698
19238 -42044 70790 34935 -50670 -12687 -256233 -74294 24052 -90642 -213333 -78576 183000
19226 -20072 -78874 -73720 259370 42950 92482 96384 -40278 66903 -163297 -58390 -134640 -44546
19213 -119084 -280904 -208534 -155032 184222 -103569 -363096 -78680 -33991 19380 118152 175016
19202 175016 -118159 19784 92342 -20946 8075 -114065 -3235 19463 -249125 -112834 44433
19190 -245046 74980 -92893 -450507 176939 149395 -30266 -42764 -67690 150536 8168 -6554
19178 -249963 81967 -70965 89469 10239 131335 290616 -72045 -98220 -94487 -7039 -359935
19167 -359935 -59933 -212860 140724 219363 -69241 -54620 -180306 9551 121523 -118243 193245
19155A34942i6188F8720c65591A90442a81005j98254B64313B8763b99714o3916
19145c63630F4058a01539D5642K3922f5846H2757a05746b7440D3486a34166A53611
19133c30850p092P9905A77007J36692C3313b97810J4360a36443r8891Q567A8726
19121A76093G8815k3173C371M2506K23709a42145G5677b03047j1197e5632a2976
19109d5019b1851l4519j55908c4484A2651J99801F3063b26011H8694M7835a10556
19097b47669C7148a7565j77696o8014j55790a01636m5809A1699L60422a47490
19086i7342j37456c14j71513p8763A3797a6751l08517m2278a17774j28880R3992
19075a52662R952N6373j04087G8431a08393l5860j31813p3330a45077K4613o5937
$$ plain form
19155 134942 -96188 68720 -365591 190442 -181005 -379259 264313 28763 -299714 -363630
19145 -363630 64058 -101539 45642 69564 -65846 82757 -105746 -27440 43486 -134166 153611
19133 -330850 -337942 -258037 177007 313699 33313 -297810 -283450 -136443 -235334 -226767 18726
19121 176093 78815 55642 3371 45877 269586 -142145 75677 -203047 -214244 -55632 -12976
19109 -45019 -21851 -56370 -212278 -34484 12651 212452 63063 -226011 88694 136529 -110556
19097 -247669 37148 -17565 -195261 -263275 -419065 -101636 -147445 11699 372121 -147490
19086 -97342 -234798 -314 -171827 -250590 13797 -16751 -325268 -367546 -117774 -246654 -152662
19075 -152662 -142710 -86337 -190424 78431 -108393 -144253 -276066 -349396 -145077 -120464 -186401
19064a86401C573b51190j28618a26927H0032c7386j61216d0568C31450b46091
19053c54920J48041k7631R4364f3573C2339O6202a31026A29044c6196k06650A55054
19041i9951j3672j0777j49560i9239I0257a13378K4644F9132i4153C24463H0806
19029B05532C029Q3424f9833q4371C73457A00719l2269D133L85a84766D6099c9530
19016G0715c82268I0656a79431E8525J14993a78069D606a16452A1579K1931e0647
19004B66236d42006b13091B9608J33179l7827b65668a7540j16356J433O65j02812
18993b34610I405M6193J53816e6490B88255A23269d8880j59374j72041h759B00357
18981B11507i8557a2538A11375c12384i3322D7568a01410H8561G676P0695b87632
$$ plain form
19064 -186401 3573 -251190 -379808 -126927 80032 -37386 -198602 -40568 331450 -246091
19053 -354920 -206879 -234510 -140146 -63573 32339 98541 -131026 129044 -36196 -242846 155054
19041 -99951 -113623 -124400 -273960 -99239 90257 -113378 -88734 69132 -94153 324463 80806
19029 205532 3029 86453 -69833 -154204 373457 100719 68450 4133 4518 -184766 46099 -39530
19016 70715 -382268 90656 -179431 58525 173518 -178069 4606 -116452 11579 33510 -50647
19004 266236 -442006 -213091 29608 162787 124960 -265668 -17540 -133896 -132463 -131798 -234610
18993 -234610 9405 55598 209414 -56490 288255 123269 -48880 -208254 -380295 -8759 200357
18981 211507 -98557 -12538 111375 -312384 -93322 47568 -101410 88561 7676 78371 -287632
18969d9004A30902g4880G5753b22379K2282M3317q3011O5140A32269a69759e2165
18957A35324g891k53539c9649A17229j7009K08536b6795q5461D0290J8283a08106
18945a567C25605D1981J63854D7793b51273j52626a54667n4183d2733l91503a37341
18933A4538c19823e8084P700A14232c34969g022E2520J93126c549p5039j44763
18922b23351g2799A09752c82710I9325C3221e10414d8944L857j22412c1162j09346
18911a40508B4663a46702B0449a45301p4400A05353O094M2955i992A64832J2293
18900A77125k8681a9202A6303b5239J2299l70757C80903G8878l9274a22997B36377
18888D13349f3433E6967a692I5090J50732a77186L2176q8020a01821L3946J0366
$$ plain form
18969 -49004 130902 -74880 75753 -222379 -200097 -156780 -239791 -174651 132269 -169759 -52165
18957 135324 -7891 -261430 -39649 117229 100220 308756 -26795 -112256 40290 58573 -108106
18945 -1567 325605 41981 205835 47793 -251273 -403899 -154667 -208850 -42733 -434236 -137341
18933 14538 -319823 -58084 -50384 114232 -334969 -7022 52520 245646 -3549 -78588 -223351
18922 -223351 -72799 109752 -382710 99325 33221 -510414 -48944 -45087 -167499 -31162 -140508
18911 -140508 24663 -146702 20449 -145301 -219701 105353 111447 154402 -9992 164832 177125
18900 177125 148444 -19202 16303 -25239 -12940 -383697 380903 78878 39604 -122997 236377
18888 413349 -63433 56967 -1692 95090 245822 -177186 -145010 -233030 -101821 -67875 -57509
18877e7509r5020A43969a16585E0298h9575k47498B17975c12556P3251J06540
18867a32765M1360j26321R5968N7494j54533g0607b4429A9669a52190A3116J18097
18856A31213P1569a91400k4305B70631A28614e4393B13633b09624d6878B04503
18845G335K620O5982h3489A88378a85124k5453h6256m4078p969G9865c07083p2217
18833c79300H3079J9131i4855C44347j02820b95327a9238A78292P9314H6125a47479
18821A53421d6752J365j42460B5034O9293M10363j8783C9612K2793b14405C1970
18809E7966K67780j8276O7977e2819n4426k9730M1105m8897g0456A78031d2586
18797a81063n7021J10475B6678c39241g342C3186b17946E4445b30867A42739c5657
$$ plain form
18877 -57509 -152529 143969 -116585 50298 -89575 -337073 217975 -312556 -239305 -132765
18867 -132765 -91405 -217726 -121758 -64264 -218797 -70607 -24429 19669 -152190 13116 131213
18856 131213 202782 -191400 -215705 270631 128614 -54393 213633 -209624 -46878 204503
18845 7335 9955 75937 -83489 188378 -185124 -210577 -86256 -130334 -138303 79865 -307083 -379300
18833 -379300 83079 102210 -94855 344347 241527 -295327 -19238 178292 257606 86125 -147479
18821 153421 -46752 -45387 -187847 25034 94327 504690 485907 39612 62405 -214405 31970
18809 57966 325746 307470 375447 -52819 -107245 -136975 -95870 -144767 -70456 178031 -42586
18797 -181063 -238084 -127609 26678 -339241 -7342 33186 -217946 54445 -230867 142739 -35657
18785b55039A29717J57844b33382E5593J70591B6619K06307h3372o0305F1566
18774c07683c194l73022H922c05226j40049I4483a17459j16552R5714d8364F8728
18762C5039L2295a85993N6420A76995c92310a17685j27271N2833b0390I9503L6187
18751A35690o5553I203N0559J02144c30853N7628F437g311r4230M0657j75487
18740b36371b3435n0165E9837N8953f4630A86747c61118c9388F0161f5774a9031
18728c20579a5942q0789j86872C6769b9552E5375a85084e2571k26868J05287n6278
18717b30430d4610o303m3181B24648o5268e3901k20788m7882a34925P519A3339
18705a19596c0452o6326m5505q8298P5311j88841a0449I3141c30384e2037j76525
$$ plain form
18785 -255039 129717 287561 -233382 55593 226184 26619 232926 -83372 -143677 61566
18774 -307683 -3194 -376216 8922 -305226 -445275 94483 -117459 -234011 -138297 -48364 68728
18762 35039 67334 -185993 -129573 176995 -392310 -117685 -244956 -192123 -20390 99503 135690
18751 135690 70137 9203 59762 161906 -330853 -273225 6437 -7311 -101541 -60884 -236371
18740 -236371 -23435 -73600 59837 118790 -64630 186747 -361118 -39388 60161 -65774 -19031
18728 -320579 -15942 -96731 -283603 36769 -29552 55375 -185084 -52571 -279439 -174152 -230430
18717 -230430 -44610 -50913 -94094 224648 159380 -53901 -274689 -322571 -134925 -127406 13339
18705 -119596 -30452 -96778 -142283 -230581 -155270 -344111 -10449 93141 -330384 -52037 -228562
18694b28562m4242a5372j32371l22771a86398q3237b0987j41321A21029a00049
18683a11250o6351g0521j74184O790A70932k4748a11461K2721A36960J0985J31321
18672B79266b46988R8912A84497n525C2511b23440j63586K6829a04080A09604
18661a28990K8390m8668j22486B17455c77675c1187m4055j39403j14114a15846
18650c44782J21607a05657K9725o4556C30273j32597e2140G039O2781i0343l140
18639i3483a769j4629k1551I9681g9790p5691J3777K1804m2342k02841e8957B81532
18626a03923A47642B6808a88980A1218b55188E0476P2254K12284j44072b236j54861
18615a57097a7426q6185B10359c10246d4710j82847D1582K980b3603C0956b60590
$$ plain form
18694 -228562 -272804 -15372 -147743 -470514 -186398 -269635 -20987 -162308 121029 -100049
18683 -111250 -177601 -70521 -244705 -237915 170932 146184 -111461 -88740 136960 147945 279266
18672 279266 -246988 -148076 184497 178972 32511 -223440 -387026 -360197 -104080 109604
18661 -128990 -100600 -149268 -271754 217455 -377675 -31187 -75242 -214645 -328759 -115846
18650 -344782 -223175 -105657 -75932 -140488 330273 197676 -52140 7039 69820 -90343 -93483
18639 -93483 -1769 -16398 -37949 99681 -79790 -155481 -141704 -119900 -162242 -365083 -58957 281532
18626 -103923 147642 26808 -188980 11218 -255188 50476 122730 335014 190942 -2236 -157097
18615 -157097 -17426 -103611 210359 -310246 -44710 -227557 41582 44562 -23603 30956 -260590
18603a11037j66913D2719I006a8470r5544c2900j46069A058a2765q3434k6564
18592a22763k88343c5240j60219q646c6447k41797m7687e2080p295A09503a06254
18580a23560j01640J7278A12658h6260F2204Q9534a22378F2819b68981a18645
18569d66129A72784a80356B29535a76933j34158N3908d1993D3976J36580C4185
18558a19699I5886b14643k13356i2378o1139J336l7209a2621k01281A88406p1913
18547A16493c60166f056B52637H5327J31924b06535H0855a67891j82339A06443
18536D4466a6306I6956a64808j86648A67511a52842r9141A00279b4737n4740A25349
18524B918a1662k5957B30096b57605B00074a85363B0704N8823J27832n7429O2007
$$ plain form
18603 -111037 -277950 42719 9006 -18470 -114014 -32900 -178969 1058 -12765 -96199 -122763
18592 -122763 -411106 -35240 -195459 -204105 -36447 -278244 -325931 -52080 -59375 109503 -106254
18580 -123560 -225200 -207922 112658 -86260 62204 151738 -122378 62819 -268981 -118645
18569 -466129 172784 -180356 229535 -176933 -311091 -257183 -41993 43976 180556 34185
18558 -119699 95886 -214643 -427999 -92378 -153517 -152181 -189390 -12621 -213902 188406 116493
18547 116493 -360166 -6056 252637 85327 217251 -206535 80855 -167891 -350230 106443
18536 44466 -16306 96956 -164808 -351456 167511 -152842 -251983 100279 -24737 -79477 125349
18524 2918 -11662 -37619 230096 -257605 200074 -185363 20704 79527 207359 149930 211937
18513B11937c90269B26810e3007l00914C2249a63012F7289C705J44019a62616
18502a45024A71986a63106H5271a5429A10373a42578e9102n5921j01581b17k71623
18491b71840A34029b1582j3952k08917e2503j02786c0989H6596l2754P6008i0399
18479C18239A31595a79598N6540j7283H5220N8205d0790j78012H4619A7953f5191
18467F8786M0437J1994a85538c1811j47561f3399j79539r1783J25632M1029l7422
18456b05482G834g3740A82735b32656A66889C8599Q3643f8801j61857K4426F2510
18444a92184N3353l0717q7435b7501E8422a51212C5006a61881B080f5421C8219
18432a01144J546H2057c83833J56585l3979C0704a38338M3093A64586c04267g720
$$ plain form
18513 211937 -390269 226810 -53007 -353921 32249 -163012 67289 3705 147724 -162616
18502 -145024 171986 -163106 85271 -15429 110373 -142578 -59102 -115023 -216604 -217 -271840
18491 -271840 134029 -21582 -35534 -244451 -52503 -155289 -30989 86596 53842 129850 -90399
18479 318239 131595 -179598 -123058 -140341 85220 143425 -40790 -218802 84619 17953 -65191
18467 68786 109223 121217 -185538 -31811 -179372 -63399 -242938 -334721 -209089 -168060 -205482
18456 -205482 7834 -73740 182735 -232656 166889 38599 122242 -68801 -230658 -206232 62510
18444 -192184 -138831 -169548 -256983 -27501 58422 -151212 35006 -161881 2080 -65421 38219
18432 -101144 -99598 82057 -383833 -227248 -261227 30704 -138338 -95245 164586 -304267 -7720
18420b38285B0909a45560C97867a23432j0043j94088C0926j1262K20308a0562
18409a96087j99202a51640M8912A88788q1527J02252a04321B71115F7118c21078
18398a25495d2474D1306P2727c34901E1372b1199m4236j47456N9881H5520b12709
18386C04415a51980H71L0495R0702c15850g5841B32472a847B81980b60745i3592
18374E6184b60640J8113e0815B50226i0916J1563A68235E231i1725C37661A47723
18362I6887K8189E615f6837j38277L1054A4258J5507F337a67396F3084M6562k1451
18350H8195a0494j57453g1227k6308D4937H878a27354N3504B25823c11992A05219
18338a45683A56451e0980G0091c69136E4362c4505F6584a97957P1968k67999a88199
$$ plain form
18420 -238285 20909 -145560 397867 -123432 -133475 -327563 30926 19664 239972 -10562
18409 -196087 -395289 -151640 -102728 188788 107261 209513 -104321 271115 67118 -321078
18398 -125495 -42474 41306 114033 -334901 51372 -21199 -65435 -212891 -153010 85520 -212709
18386 304415 -151980 871 31366 122068 -315850 -75841 232472 -1847 281980 -260745 -93592
18374 56184 -260640 -242527 -50815 250226 -90916 -79353 168235 5231 -91725 337661 147723
18362 96887 125076 5615 -66837 -205114 -174060 14258 29765 6337 -167396 63084 109646 88195
18350 88195 -10494 -167947 -71227 -97535 44937 8878 -127354 -73850 225823 -311992 105219
18338 -145683 156451 -50980 70091 -369136 54362 -34505 66584 -197957 -125989 -393988 -188199
18326c1375C273a78650A09217l9800a00910A00526C316J57293j2321K54728e3176
18314A46851J42669c16948E3718a70869j37492I221h9106p3747D8159J12707l9125
18303A21741a46868M7938j61894g1831k80797f5662C12475a8674A51310b19467
18292F8150l0038c23728F1250P2131d40648A0238c09348f70j08183r5705a01111
18280A10854a94662k06336C23843i0691C832d4609k8307A04792a75553B4680a99153
18268b54119J21311k1115D4542K21787a73170B0651g5492C0290K9745N335J18913
18257A84283Q96G7056K10182a09796A28170A0582a63256C5759P0520b24097A77566
18245a38505D0797O1049b18917g5881j37886j78242h0801L7419j0461r3018A28681
$$ plain form
18326 -31375 3273 -178650 109217 69417 -100910 100526 3316 160609 148288 403016 -53176
18314 146851 289520 -316948 53718 -170869 -308361 9221 -89106 -162853 48159 160866 121741
18303 121741 -146868 -98930 -260824 -71831 -352628 -65662 312475 -18674 151310 -219467
18292 68150 38112 -323728 61250 133381 -440648 10238 -309348 -670 -108853 -204558 -101111
18280 110854 -194662 -400998 323843 -90691 3832 -44609 -72916 104792 -175553 24680 -199153
18268 -254119 -132808 -153923 44542 266329 -173170 20651 -75492 30290 60035 65370 184283
18257 184283 185179 77056 287238 -109796 128170 10582 -163256 35759 106279 -224097 177566
18245 -138505 40797 101846 -218917 -75881 -213767 -392009 -80801 -43382 -53843 -146861 128681
18233b16770A16816H157a95791K7584E0727a40912C0100J44111A7555O9189M2036
18222A28780k4185i1782C3171a59465D24250a32691B61857a34350l161k6213H6820
18210a16408e2216D3676a817p9660L5649p1708A38580b03688k18737a1082k42725
18199b53807h2452A1188a9881R859A5235K56848a8739C9559a28271K2612B2808
18187A76389b46335L5599N6129c3050j24264e9835q4897a7669P557A71110o0500
18176A10610l7270j659L8537K2808C2783P9423a6579m5790b6194l2751b4709B40488
18163b3271j64594G9567b31908E7483j6325p286J09880k6083a33708A1259d7540
18151A46123b49374E6703k1639P5441M538k4059J36471N1976n0850b02874A63107
$$ plain form
18233 -216770 116816 8157 -195791 -168207 50727 -140912 30100 174211 17555 86744 128780
18222 128780 104595 -91782 33171 -159465 424250 -132691 261857 -134350 -137511 -163724 86820
18210 -116408 -52216 43676 -1817 -81477 -45828 -117536 138580 -203688 -422425 -11082 -253807
18199 -253807 -82452 11188 -19881 -10022 15235 272083 -18739 39559 -128271 -105659 22808
18187 176389 -246335 -210736 -154607 -33050 -157314 -59835 -144732 -17669 -10112 171110 110610
18176 110610 73340 71681 110218 133026 32783 112206 -16579 -62369 -26194 -58945 -24709 240488
18163 -23271 -187865 79567 -231908 57483 41158 33872 143752 117669 -133708 11259 -47540
18151 146123 -249374 56703 35064 110505 115043 90984 227455 279431 228581 -202874 163107
18139I5453r335b02309L9492K0356a5533B5908J08427B1902a88308D9675e6503
18127b9790F2625K88853A66477E9139K08470a08038o6854A77218C2866b76437
18116B6771g8291N19j43873b5955C7636e8219m0144A10292l5321b35635A95026
18104a82908J264M2785j5354E05233a76550f8227j38226i6308B23288e8725B48202
18092b74202A95699b05593J4375l5992A14699a12091l4440o3191g7159C92840
18081C32205j48366B8081i8811o0822B17928h0336p7973j22130A45202C4692i0227
18069b01970B0995J00346F454b24656I0918b578G3243c9947j5178A61744c9573
18057a00513l18130b8615A07722P2646G7330b57192J7377i0666B37905a51816
$$ plain form
18139 95453 86118 -202309 -162817 -142461 -15533 25908 134335 21902 -188308 49675 -56503
18127 -29790 62625 351478 166477 59139 267609 -108038 -174892 177218 32866 -276437
18116 26771 -78291 -77772 -221645 -25955 37636 -58219 -98363 110292 74971 -235635 195026
18104 -182908 -181644 -138859 -154213 505233 -176550 -68227 -206453 -96308 223288 -58725 248202
18092 -274202 195699 -205593 -191218 -227210 114699 -112091 -146531 -209722 -77159 392840
18081 332205 183839 28081 -98811 -159633 217928 -80336 -158309 -280439 145202 34692 -90227
18069 -201970 20995 121341 6454 -224656 90918 -2578 73243 -39947 -55125 161744 -39573
18057 -100513 -418643 -28615 107722 180368 77330 -257192 -239815 -90666 237905 -151816
18046c23002J05225G4936a6083j47405C63311a07087m2028D8355L8221K2917h3269
18034h5176j41774I5157P7683Q754J41732B7933N5316a42904B13094n1738B3134
18022b43098A65880J7881a72948c5984l01137a66229a9837E0319f8833p4359a0910
18010h3129L2882A12435m5373f6833C38305b70328A26950i257k58689B34085h8094
17998c1105E2610i0931A53404b69963D8754O4081O8032C1347b04929d0497F1776
17986A1030k832a8998j77268A19385J85355b57639m2719A15649m8031a9392F5400
17974e959A55838l5820c80504e7814j76789H3160P1348a162F8553j3183d68746
17962a97466a1553j11643j01832C28691G534a29467F5557K38873h3937D6056J20671
$$ plain form
18046 -323002 -217777 74936 -16083 -163488 363311 -107087 -149115 48355 86576 109493 -83269
18034 -85176 -226950 95157 172840 181594 323326 27933 83249 -142904 213094 161356 23134
18022 -243098 165880 183761 -172948 -35984 -337121 -166229 -19837 50319 -68833 -143192 -10910
18010 -83129 -50247 112435 67062 -66833 338305 -270328 126950 -9257 -267946 234085 -88094
17998 -31105 52610 -90931 153404 -269963 48754 112835 180867 31347 -204929 -40497 61776
17986 11030 8198 -18998 -196266 119385 304740 -257639 -300358 115649 67618 -19392 65400
17974 -5959 155838 120018 -380504 -57814 -234603 83160 154508 -1162 68553 55370 -468746
17962 -197466 -11553 -123196 -225028 328691 7534 -129467 65557 304430 -83937 46056 166727
17951A66727a58593B07776J6436C5626c4049o4747B73367J82090B14249e10045
17940c1664l24526d1920r724P547p0169L3455A82580a73193A71161C9116K9398
17929F8514Q092a21510D59094k27760i1878L2691k544F71717f1227A17207a82409
17917a78968B05932D500b90553A51980a23679D1079d5592q8104C41139A39397
17906g6219A89Q2284H104M4868h2627B48241a08570k30288b6701F6353J63679
17895B30032i1491K3171o3751k9366g3957C02134e8364A67795b26887h2381k13289
17884b95670J07809A14074Q1347I4184c64846c0475l8429m4346J9103C25530c38266
17872d4058J0097j31258A66284b7035B02417m8154N1147l5947R468b2828A8012
$$ plain form
17951 166727 -158593 207776 224212 35626 -34049 -98796 273367 455457 214249 -510045
17940 -31664 -356190 -41920 -51644 -44097 -114266 -80811 182580 -173193 171161 39116 68514
17929 68514 76606 -121510 459094 231334 -91878 -59187 -61731 671717 -61227 117207 -182409
17917 -178968 205932 4500 -290553 151980 -123679 41079 -45592 -133696 341139 139397
17906 -76219 189 82473 8104 52972 -82627 248241 -108570 -338858 -26701 66353 230032
17895 230032 -91491 -68320 -132071 -161437 -73957 302134 -58364 167795 -226887 -82381 -295670
17884 -295670 -187861 114074 195421 94184 -364846 -30475 -68904 -113250 -94147 325530 -338266
17872 -44058 -33961 -165219 166284 -27035 202417 154263 205410 169463 178931 -22828 18012
17860G9085b07467B6860L7377g4660I5420i3715j14508A44914a69749B28484c4780
17848a4750C05489j26788o5918a5204j43637I8693m8399Q624b9259a0309B48838
17836b34118c7786b311k67991F3970a30705j9600I376K19357q489a56821N7023
17825i9798C423Q9727Q7435o8373i656j77853B45217G6570a03976D834N0091a24939
17812G6163f7019K555C66264J03763C4701b6341j32843C7290b03549k1144A76880
17800C5545L28828N1681a6008l1581B86455A27187b33201B85595a94021h889j07501
17789a16390j43701f0144b3166j50582A35520K34682a12397A99760o3581M5189
17779A81368J14703A25380k1247C3386K33046a12405Q312A6256C003b9598k4528
$$ plain form
17860 79085 -207467 26860 64237 -74660 95420 -93715 -208223 144914 -169749 228484 -34780
17848 -14750 305489 178701 112783 -15204 -158841 98693 50294 58918 -29259 -10309 248838
17836 -234118 -37786 -2311 -270302 63970 -130705 -150305 9376 228733 220244 -156821 -99798
17825 -99798 3423 93150 180585 112212 -9656 -187509 245217 76570 -103976 4834 54925 -124939
17812 76163 -67019 -64464 366264 470027 34701 -26341 -159184 37290 -203549 -224693 176880
17800 35545 364373 416054 -16008 -47589 286455 127187 -233201 285595 -194021 -8889 -116390
17789 -116390 -260091 -60144 -23166 -173748 135520 370202 -112397 199760 136179 181368
17779 181368 296071 125380 104133 33386 266432 -112405 -104093 16256 3003 -29598 -54126
17768e4126C63575o3539H7197d8263B54384H3060j3305e8527j46647C4772b64949
17756B42990I4827C4085K6576J52419B1809J09341L1325a21492m19385c3807k06065
17745b39872h3790K6628C53167A57847n2223a83670B28450G6265b23211A4056
17734A73143d8311j00369B11870a71673A88733c4088A77364a14974d7977l6949
17724h4926A63280K1373O108J55395b26834C04928a4583H1470L31249a13177A42774
17712C93507a52346B25217a78733P8522q1894D86611f4319a8086A04686J55695
17702B60381A26016a54416B15404a53210G3110J08194K34965A38881m9363d5019
17691B96389i1194F0980d8695j46205Q3204B83203j38383L71731D4701a39223
$$ plain form
17768 -54126 363575 300036 87197 -48263 254384 83060 69755 -58527 -205174 34772 -264949
17756 242990 94827 34085 60661 213080 21809 131150 162475 -121492 -540877 -33807 -239872
17745 -239872 -83790 -57162 353167 157847 105624 -183670 228450 76265 -223211 14056
17734 173143 -48311 -148680 211870 -171673 188733 -34088 177364 -114974 -47977 -84926
17724 -84926 163280 184653 190761 346156 -226834 304928 -14583 81470 412719 -113177 142774
17712 393507 -152346 225217 -178733 -100211 -182105 486611 -64319 -18086 104686 260381
17702 260381 126016 -154416 215404 -153210 73110 181304 416269 138881 89518 -45019
17691 296389 -91194 60980 -48695 -194900 -111696 283203 144820 516551 44701 -139223
17680b44087A42253c3426B1551J56193a48363C67379a1198A82147J15624B6225
17669a11888A39568N4417M6980a6881B92618L4542n4045E832J06979c10729D04256
17657B5242c46260B24382f9251l5445A49193h2384B77349D2868P4548a36384I7547
17645b39846B22941P4430a52434j46434A11549A8177K27198E713L5871J02433
17635A44017N8806i2980A36001J26176l834E9993b04737A2015a42523k16007B60955
17623B03978a98699E2871J25487A4539a79733B23311p3067E8516a97030c8341
17612h3619B67441a89396l3824A1149K42337o2434b23003A26726J85448A31385
17601b81125B49304C6747i7164A6661N0930A1136J62174J27845a02120A30632
$$ plain form
17680 -244087 142253 -33426 21551 177744 -148363 367379 -11198 182147 297771 26225
17669 -111888 139568 193985 240965 -16881 292618 327160 273115 5832 112811 -310729 404256
17657 25242 -346260 224382 -69251 -104696 149193 -82384 277349 42868 117416 -136384 97547
17645 -239846 222941 297371 -152434 -298868 111549 18177 245375 5713 41584 144017
17635 144017 202823 -92980 136001 262177 258343 59993 -204737 12015 -142523 -358530 260955
17623 203978 -198699 52871 178358 14539 -179733 223311 150244 58516 -197030 -38341
17612 -83619 267441 -189396 -223220 11149 253486 191052 -223003 126726 312174 131385
17601 -281125 249304 36747 -97164 16661 67591 11136 173310 301155 -102120 130632
17590E2769b32717a01862C19199A54355E5088J75532E810K585a76494a1168D9230
17578a02656B44675o3418L70577A3700K400J08583A875J11621a05917A89181J1223
17567B00404d6108k0172E9745J33776c0188A6953J80246i1041G8339K0042C4066
17555C3912b65645B55481F5245J2458J02331n5185j0234M780a69360B79164l4752
17544B44412k4351n7988k6598j1446Q1799J11819A11271j9764R2496f2484C54293
17532d979A39073J15562a35143I7670c5924j64308A11613R666a99240C40545a12358
17520b38783A40590e3734r7879a7889B29098a72469B04899K50683i5945A09376
17509A63990A2449K97707B4041L87402j35900r4718D8011L5312L9514j6796K13070
$$ plain form
17590 52769 -232717 -101862 319199 154355 55088 230620 5810 8395 -176494 -11168 49230
17578 -102656 244675 181257 551834 13700 16100 124683 1875 113496 -105917 189181 200404
17567 200404 -46108 -66280 59745 193521 -30188 16953 197199 -91041 78339 98381 34066
17555 33912 -265645 255481 65245 77703 180034 124849 114615 119395 -169360 279164 244412
17544 244412 220061 162073 135475 124029 205828 317647 111271 91507 184003 -62484 354293
17532 -4979 139073 254635 -135143 97670 -35924 -200232 111613 121279 -199240 340545 -112358
17520 -238783 140590 -53734 -151613 -17889 229098 -172469 204899 455582 -95945 109376
17509 163990 12449 310156 24041 411443 275543 180825 48011 83323 122837 106041 319111
17498C19111A10091a8515B05019L0379a1907B10700m2343N3236m3724M8358B8379
17486E9480M05122A46377J96868e1191E1255L73522A6837L17412j22226a80016
17475D38981F2311J52415n6731E937K66732J66306H3044K03502o1472L3859H6148
17463C2545Q4224K04807c18955A80463k1507K70232j79757r8861J87177A5338
17452a24618E37258B11456m910P7882l2907J02410J09615J81248B4790O47116
17442F71906k01110L23476k00631A28719L20139A56362l4306K75197K76264o5183
17432F08334B9714K96291g4121B38859J69217B9280K42243J82248j97962I4354
17421B58854L28074A34426L66558m0985j2097j06970J16393k03863K33827j71312
$$ plain form
17498 319111 110091 -18515 205019 235398 -11907 210700 168357 221593 177869 226227 28379
17486 59480 464602 146377 343245 -51191 51255 424777 16837 334249 212023 -180016
17475 438981 62311 214726 157995 5937 272669 438975 83044 286546 225074 258933 86148
17463 32545 116769 321576 -318955 180463 158956 429188 249431 150570 337747 15338
17452 -124618 537258 211456 206546 284428 251521 353931 463546 644794 24790 671906
17442 671906 470796 794272 593641 128719 448858 156362 122056 397253 673517 608334
17432 608334 29714 326005 -74121 238859 408076 29280 271523 453771 255809 94354
17421 258854 586928 134426 500984 459999 447902 340932 457325 253462 487289 315977
17411C15977K047K94429d4190D51918A43922P9815j847h9118B37104J37402A63662
17399I8725J34177H4438K15076a29525N6442C74922j04002A26348L01821C6562
17388I4722Q4512k520m4630M2750L83772j09939i6907C03561D2991K5704K17744
17377B86439j42447J08764A4716J79224l424r0086K64903l2400J66403r7797n4263
17366C47276P32K22746A14502n1952B1861J09026M9416M5027J2388a7503A33619
17354B42510N8294j15494B7866K48382D46L39704b0383B79047J48583a11797B67096
17342c6737A63927N92455l47328J72538A61634K2026E4340f9383C62188o3553
17332B98635A43348K98640m2352j44175A24337J48637J8115J7606E4049L06172
$$ plain form
17411 315977 318024 612453 -44190 451918 143922 223737 221890 -89118 237104 374506 163662
17399 98725 232902 84438 299514 -129525 -73083 374922 270920 126348 428169 36562
17388 94722 179234 176714 132084 174834 558606 448667 -96907 303561 42991 68695 286439
17377 286439 143992 252756 14716 193940 190516 100430 365333 332933 499336 401539 347276
17366 347276 348008 570754 114502 62550 21861 130887 180303 225330 237718 -17503 133619
17354 242510 300804 185310 27866 276248 446 340150 -20383 279047 427630 -111797 267096
17342 -36737 163927 756382 409054 581592 161634 183660 54340 -69383 362188 298635
17332 298635 143348 441988 399636 255461 124337 272974 291089 308695 54049 360221
17322C60221j35888k7717j2097o3623k4804K89939A11953K43715A47061L44509
17312D91570A73737L55275A15641j6521L27271j65250A21072J17568E7056b30892
17301E23806B37599a4042B2643J33013l8495L6423K49187j85526M9146R7617G9354
17289f8443C35252F0711L36183d3905B1665L13119j33844K15747d2038B05140
17278C53743o7972q9173J17625Q2542j70988K01896j15950P3129A65419a5994
17267B62160Q2605J8293R918L4036r087k0865j88469r0474L24824K394j64870
17256B60465A6642J67614J72751J27529B20677H5923L70562j93066m4830K3463
17246B42052K32489A05936c7396C20098j02649N9850j36622J41817j2596a04290
$$ plain form
17322 360221 224333 196616 184519 120896 96092 386031 111953 355668 147061 491570
17312 491570 173737 529012 115641 99120 426391 261141 121072 238640 57056 -230892
17301 523806 237599 -14042 22643 155656 117161 153584 402771 217245 266391 364008 79354
17289 -68443 335252 60711 396894 -43905 21665 334784 200940 416687 -42038 205140
17278 353743 285771 196598 314223 396765 225777 427673 311723 384852 165419 -15994
17267 262160 344765 363058 372976 407012 397925 377060 188591 98117 422941 425335 260465
17256 260465 16642 184256 357007 484536 220677 85923 456485 263419 218589 242052
17246 242052 474541 105936 -37396 320098 217449 277299 140677 282494 269898 -104290
17235A93731a01922E15449D7716J77712j10169J88954J2525j06575J01686J39183
17225D51032j88961K4893A29268K09693K03522n3177m2833A73746L26380A46803
17214D31161n8819A02757J83280J09364G147M56650k326A78683N6159L0131J20564
17203C85537E8972L20429A37205J71639j06941J13665A10806R2610J36752J0045
17193C50213m309M7379o18N4095j50112J06052j25658P6478J22116K16304A63933
17181I8250K17322R9516J71307C0276L31016m7981O4905J92667j12412j5730j11331
17170C31410I4104K37589J30921P5504B43967J54371L54669B75841K97851j68566
17160D05126J09277k04767q8267L04457j8968k36679L6451J97354J26148k1005
$$ plain form
17235 193731 -101922 515449 47716 225428 115259 304213 316738 210163 311849 451032
17225 451032 262071 286964 129268 338961 542483 489306 446473 173746 500126 146803
17214 431161 372342 102757 286037 395401 7147 463797 461471 178683 234842 264973 385537
17203 385537 58972 379401 137205 308844 201903 315568 110806 203416 340168 350213
17193 350213 345904 393283 392665 446760 296648 402700 277042 353520 475636 691940 163933
17181 98250 315572 415088 586395 30276 361292 313311 378216 570883 458471 442741 331410
17170 331410 94104 331693 462614 538118 243967 398338 753007 275841 573692 405126
17160 405126 514403 309636 221369 525826 506858 270179 306630 503984 630132 609127
17150F09127j22882j94154J39042m4794A67365K81587q2216N967J83463k27278
17140C28888K6473A56389M24660j30297j70670L68165k43020A14733K61726J85755
17130E62214d706E61020Q0689j97707O9114j88706L94659j49042B77870J53811
17120D31681J64729n9834J69521l51024L94482j02240N5346j43721j12655m6226
17110D00059J56742O032n0609k423J80025J77205C85050j7087K05243L1253r8115
17099E06344o2670K35312L65k05411K3425J98238k82932J56171J4187J74538k6407
17088G31160j42481j4205M8577P7646o6353K48781C47921K92531k85896M41206
17078G95762k05414P4586k13911J21812J77545k42610K25054p4364j00988J46376
$$ plain form
17150 609127 486245 292091 431133 386339 167365 448952 366736 372703 556166 328888
17140 328888 355361 156389 581049 450752 280082 648247 405227 114733 376459 562214
17130 562214 -4706 561020 641709 444002 513116 324410 719069 570027 277870 431681
17120 431681 596410 536576 706097 355073 749555 647315 702661 558940 446285 400059
17110 400059 556801 562833 512224 509801 689826 867031 385050 367963 573206 604459 506344
17099 506344 443674 678986 679351 473940 497365 695603 412671 568842 583029 757567 731160
17088 731160 588679 574474 623051 700697 634344 883125 347921 640452 354556 795762
17078 795762 590348 664934 451023 572835 750380 507770 732824 658460 557472 703848
17068G03848j95761K09754m1928N79l8775P870k47669K76916p1554K25348k10522
17057F18106j50811M71562j91910O5780l72156J28630M01270k16090J22689k69076
17047F07994L37776B87303M38362J55956q7063j22370K16198m06982K91388m3819
17037G28973J11715k23887K53399j19345L60045E08535K93353J41175j25571J29425
17027I46917o0026j10908M7171j60912j87716L91769l26977O15557k79009N2714
17017I28580N1141l57351K9917L46818l12705n6624L66334k20888O6177J49321
17007I90720j13844j38755J89598R8015N0465m8532j22640J70441k16562l16295
16997E42611O76391k77047j34423K98240M550j09983p5226J75980N1446k49142
$$ plain form
17068 703848 508087 717841 675913 676492 637717 645587 397918 674834 603280 828628 618106
17057 618106 467295 938857 746947 812727 440571 569201 970471 754381 877070 607994
17047 607994 945770 287303 725665 881621 794558 672188 888386 481404 772792 728973
17037 728973 840688 616801 870200 750855 1110900 508535 801888 943063 817492 946917
17027 946917 886891 775983 823154 662242 474526 866295 539318 1154875 875866 928580
17017 928580 979721 622370 652287 999105 686400 629776 996110 775222 841399 990720
17007 990720 876876 738121 927719 1025734 1076199 1027667 905027 1075468 858906 542611
16997 542611 1219002 941955 807532 1105772 1110322 1000339 925113 1101093 1152539 903397
16987I03397O3995J07745q8113L34954m15943k04639K30751L60411j46626J89435
16977A335367l73685K93081j68041K3068k9501j4225M81576m86846L89809j44853
16967A305750J95047k68194J53816j52639L901K0374j49323L1416L33629l10336
16957A163441Q1313J15864r8133j89354K07879Q6559N3118k9414n7270M6724M3416
16946A424143K38189j00535J54098j56409j42596J23648r8283M11978n37327k7119
16936A289787J07050j03896L44605K00193l80435J17811J04254J98857l48060
16927A530166q4238N78796k86095q285j83916K05753L29534O0122j71236k60212
16917A710389l034L46025k99170J85764l83238O24471k06970J73484j98395k51732
$$ plain form
16987 903397 967392 1075137 987024 1321978 906035 701396 932147 1292558 1145932 1335367
16977 1335367 961682 1254763 1086722 1109790 1080289 1066064 1547640 1060794 1450603 1305750
16967 1305750 1500797 1232603 1386419 1233780 1237681 1258055 1108732 1140148 1473777 1163441
16957 1163441 1244754 1360618 1262485 1073131 1281010 1367569 1420687 1391273 1334003 1380727 1424143
16946 1424143 1662332 1561797 1715895 1559486 1416890 1540538 1442255 1854233 1316906 1289787
16936 1289787 1396837 1292941 1637546 1837739 1457304 1575115 1679369 1878226 1530166
16927 1530166 1445928 2024724 1738629 1730344 1546428 1752181 2081715 2141837 1970601 1710389
16917 1710389 1707355 2053380 1754210 1939974 1556736 2181207 1974237 2147721 1949326 1697594
16907A697594K23548K51706j64218L34472k62720j8487K47409j62913p456J54566
16897B293501k25451k21486L25032J83870j35069J33128J26147p7598K3156K1884
16887B447114k0324K72696n20886M52172K52866k94715j80259L87162k7941Q6163
16877B854048k57602J63362K76546o2634J52446q1165k80518J42687N269M69118
16867C381557p1317j20690q9206J44411n9304K92380j28993j30259M20603m6426
16857C592756L6323k43237K15687j05376M05147r4795M2166j56506K62425K2234
16847C976824J04886k66011K0885N33882j86181Q0332j61790K55463K36227j83762
16837D410755J68045J70962l81799L75983K40418k53366N79483j45589J51924
$$ plain form
16907 1697594 1921142 2172848 2008630 2343102 2080382 2061895 2309304 2146391 2138935 2293501
16897 2293501 2068050 1846564 2171596 2355466 2220397 2353525 2479672 2402074 2425230 2447114
16887 2447114 2426790 2699486 2178600 2630772 2883638 2588923 2408664 2795826 2767885 2854048
16877 2854048 2596446 2759808 3036354 2973720 3126166 3045001 2764483 2907170 2912439 3381557
16867 3381557 3310240 3189550 3100344 3244755 3185451 3477831 3348838 3218579 3639182 3592756
16857 3592756 3629079 3385842 3601529 3496153 3901300 3806505 3848671 3692165 3954590 3976824
16847 3976824 4081710 3815699 3836584 4370466 4184285 4264617 4102827 4358290 4594517 4410755
16837 4410755 4578800 4749762 4367963 4743946 4984364 4730998 5310481 5164892 5316816
16828E316816J03994O1057j30588K76956L0665J9227J3107K87130L10418m64147
16818E824635J01025L75471j92322L97732m2943K02994J71721m262L21193o9303
16808G085941j46203P04172l9841J86745J75124O8306p4875L73909J07279M94974
16798H935531J61929k04927O56928k69675N22044M03862O2483M9790O60741o4299
16788A0914407K00939j36789P25187J63768O19819k64906L11412M70576L29188
16779A3333601P85950m0946N35214L69142L74159M84968L50030N72903P56051
16770A7521072K99436O17803L64185L40992J315334K58791O98932R20963M00510
16761B2738018J237033L69019J245712J014872J053451R39452P36922R96936J669738
$$ plain form
16828 5316816 5420810 5481867 5351279 5628235 5658900 5678127 5691234 5978364 6288782 5824635
16818 5824635 5925660 6301131 6108809 6506541 6463598 6666592 6838313 6834051 7155244 7085941
16808 7085941 6939738 7643910 7604069 7790814 7965938 8034244 7959369 8333278 8440557 8935531
16798 8935531 9097460 8892533 9549461 9279786 9801830 10205692 10268175 10317965 10978706 10914407
16788 10914407 11115346 10978557 11703744 11867512 12487331 12222425 12533837 13004413 13333601
16779 13333601 14119551 14078605 14613819 14982961 15357120 15842088 16192118 16765021 17521072
16770 17521072 17820508 18438311 18802496 19143488 20458822 20717613 21416545 22337508 22738018
16761 22738018 23975051 24344070 25589782 26604654 27658105 28597557 29334479 30331415 32001153
16752C2001153J134091J645801J089277J766753J481343K208262J750399J966975
16744D5044054K282603K403587K299661K778281K527773L180794L515438L606565
16736F7638756L987841L820370M355082M310542N185524N185030N779399N477303
16728A05739847O734907O379085O761281P230784P432127P334302P406018P093288
16720A62111639O761932N823113N631132M867675L082150K150182J054429p46921
16712A90735331k045745k868001m241240n473100n639566o684102p272596p324054
16704A49186927p367177p247807p340475p372330p179938o132897o418700n831148
16696I4296455n638833n493102n195312m334186m464921m203482l932296l111461
$$ plain form
16752 32001153 33135244 34781045 35870322 37637075 39118418 41326680 43077079 45044054
16744 45044054 47326657 49730244 52029905 54808186 57335959 60516753 64032191 67638756
16736 67638756 71626597 75446967 79802049 84112591 89298115 94483145 100262544 105739847
16728 105739847 112474754 118853839 125615120 132845904 140278031 147612333 155018351 162111639
16720 162111639 168873571 174696684 180327816 185195491 188277641 190427823 191482252 190735331
16712 190735331 188689586 185821585 181580345 176107245 170467679 163783577 156510981 149186927
16704 149186927 141819750 134571943 127231468 119859138 112679200 106546303 100127603 94296455
16696 94296455 88657622 83164520 77969208 73635022 69170101 64966619 61034323 57922862
16688E7922862l622377l051173k794738k673072k182408k048945k332545k174005
16680C7043599j368374k099427j420791j621872j410869j583417q25612j054558
16672B5658679j115663o83351j548222n32750j185571q71783p48217r00959o95585
16663A7376578l26041n48019p02536o69204o24895k44138p08250l67572n56606
16654A2629317k80641k30737p00703K05094r81728l63635K15256n28667m53960
16645I509596r5058m65077j11211n00945q7098p9507m53813J18728k48028l20685
16635G266902l46434p8259k82519l1291j90277J16877n28168L6037j05461k12271
16625E645136j08174n8983k64179k1362m12381L82722n48535J04728n01996K77677
$$ plain form
16688 57922862 54300485 51249312 48454574 45781502 43599094 41550149 39217604 37043599
16680 37043599 35675225 33575798 32155007 30533135 29122266 27538849 26713237 25658679
16672 25658679 24543016 23859665 22311443 21778693 20593122 19721339 18973122 18072163 17376578
16663 17376578 17050537 16502518 15799982 15130778 14505883 14261745 13553495 13185923 12629317
16654 12629317 12348676 12117939 11417236 11622330 10640602 10276967 10492223 9963556 9509596
16645 9509596 9414538 8949461 8838250 8337305 8250207 8170700 7716887 7835615 7587587 7266902
16635 7266902 6920468 6842209 6559690 6528399 6338122 6454999 5926831 5962868 5857407 5645136
16625 5645136 5536962 5477979 5213800 5192438 4780057 5162779 4614244 4718972 4216976 4494653
16615D494653n1151j84033P1032l01393J74966k62994M04377p60644K14274l61849
16605C437238L08391j12801j07390j91724k3268K6727m8267l22557K16138k28895
16595B953592o1273N3184j76369n6868J9974j1243k00889J23868l39500K91706
16585B596182J19176m33848J76402j58401L19282m02102P1440P4290j6775j38067
16575B207579J29050o07601p3404L01818K59208k18621N2406k54758m7522L0009
16565A778164k2852L40310k46137k11314P1675q7324j13463Q0171J66435l95218
16555A360447J34272l2530j72548K93265l97634J11810J20509k04706M34267k11395
16545A435757j08274k61358L69196J33629l26703L17620m90677L54961k85280
$$ plain form
16615 4494653 4443502 4259469 4330501 4029108 4204074 3941080 4345457 3584813 3799087 3437238
16605 3437238 3745629 3632828 3525438 3333714 3310446 3337173 3288906 2966349 3182487 2953592
16595 2953592 2892319 2945503 2769134 2712266 2732240 2720997 2520108 2643976 2304476 2596182
16585 2596182 2715358 2281510 2457912 2299511 2618793 2216691 2288131 2362421 2345646 2207579
16575 2207579 2336629 1729028 1655624 1957442 2216650 1998029 2050435 1795677 1748155 1778164
16565 1778164 1755312 2095622 1849485 1638171 1709846 1622522 1509059 1589230 1755665 1360447
16555 1360447 1494719 1462189 1289641 1582906 1185272 1297082 1417591 1212885 1647152 1435757
16545 1435757 1327483 1066125 1435321 1568950 1242247 1559867 1069190 1424151 1138871
16536A138871m202K59008j59841l8081J15807m60632L95415k14960J39864M5341
16526A216590j84528n3378K51528l89628K65483n9307K86577k45766k19584N55602
16516A423589k93993j95741n5564J69923l42583J4721K96010k80870j6956j71095
16506E47441L03000j30095j72048J81600n4208N06774m50907j19077O2532n4168
16496F20844R5262j62049O728J73514j43429r784L35815j85173P4812k36479j3864
16485E56197j36005j06317L98518K90462m48605L8061j0366N135J74419J12101
16475H73600k45460J08406N2696l76855j42021M91590j14122J01589j15045l0861
16465F03517j67292J8937J15291j91749L10151A42340M50877A84385M61757j87057
$$ plain form
16536 1138871 1134669 1393677 1233836 1195755 1311562 850930 1246345 1031385 1171249 1216590
16526 1216590 1032062 978684 1230212 840584 1106067 1046760 1333337 1087571 867987 1423589
16516 1423589 1129596 933855 878291 1048214 705631 720352 1016362 735492 718536 547441
16506 547441 850441 720346 548298 729898 675690 1182464 731557 612480 675012 620844
16496 620844 716106 554057 560785 734299 590870 581086 916901 731728 806540 570061 556197
16485 556197 420192 313875 712393 1002855 554250 592311 581945 587080 761499 873600
16475 873600 628140 736546 789242 412387 270366 761956 647834 749423 634378 603517
16465 603517 436225 455162 570453 378704 688855 142340 593217 184385 646142 459085
16455D59085M53136l67291K74457B86547J4306J94018B19430M51577C6165L61894
16445C98059j8440L6991m0760G3858O7724K27217R5539J39343A58344K85213q8744
16434C54813j25546L12749j95237K75761l9117j37417A82568J30174M7857J21660
16424D82259j06445A01042L35796j57826K66438L9937o6379B41454L48573k18372
16414C71655j22337j08733L87654B50302L96817C1858J25918L23992G715K35457
16404B43172N7564c6224F53349k67426A04360J28062J555j08862M19684j83768
16394C61031O8307M9886J64671B99210D2990a74811F7808j2273R6754K0398J95561
16383C68248q8845I5746N3086o465R5048k3611n6615r704e8631C39209j63961
$$ plain form
16455 459085 912221 544930 819387 286547 300853 494871 219430 671007 36165 398059
16445 398059 379619 416610 375850 73858 141582 368799 464338 603681 158344 443557 354813
16434 354813 229267 542016 346779 622540 583423 446006 182568 312742 360599 482259
16424 482259 375814 101042 436838 279012 545450 585387 519008 241454 590027 371655
16414 371655 249318 140585 528239 250302 647119 31858 157776 481768 7715 243172
16404 243172 300736 -36224 653349 385923 104360 232422 233977 125115 544799 361031
16394 361031 429338 479224 643895 299210 42990 -174811 67808 55535 152289 172687 368248
16383 368248 279403 95746 148832 142367 237415 213804 157189 147485 -58631 339209 175248
16372A75248R3994o9034J15708j32759J01099J6054j17131J61402B8675L4845
16362F3520B5218a79341D09939E255N04934a95385B99917r9271G94a4297A02442
16350B2222J79098r7863J36127J70653i1262A0951C359Q8527b02284A12301l4242
16339G8059A1310J96069J18819r9925h0422L4987C80043l1435a64482A48067a45601
16327B20931D0944J95356K08225g3040p2307C13576a4375A27849L7665j8984a04541
16315B03074n3074m2401n0860K37669j43258p5397i9962A58464K34734d947C24630
16303C4114J57020p902l4312a82572B28774b39697k00681d2267A96819e8472j72630
16292b31102A66915b60662B64074A21720D0199J07099P102J26640E8812e6495
$$ plain form
16372 175248 269242 200208 315916 183157 284256 300310 183179 344581 28675 63520
16362 63520 25218 -179341 409939 5255 510189 -195385 299917 200646 794 -14297 102442
16350 22222 201320 103457 239584 410237 -91262 10951 3359 91886 -202284 112301 78059
16339 78059 11310 207379 326198 226273 -80422 -45435 380043 348608 -164482 148067 -145601
16327 220931 40944 236300 444525 -73040 -145347 313576 -14375 127849 165514 146530 -104541
16315 203074 150000 107599 56739 294408 151150 75753 -99962 158464 393198 -4947 324630
16303 34114 191134 183232 148920 -182572 228774 -239697 -440378 -42267 196819 -58472 -231102
16292 -231102 166915 -260662 264074 121720 40199 147298 154400 281040 58812 -56495
16281C09070r183K8825j52508n9328e4798C77225e8813k03218E7559K03190d9668
16269E8467L09121a90863B96739b16022N4671K4155B43395g5570A03467a99676
16258B14499h1247D5437J8330J65854o6962m8653C7195J73072M6761a1311A56131
16246B36841i3466B16786D5624g9470j25235C2611J52685D8253J2948L8066K4484
16235A23751J48940g1421I6799d8694Q376A49334O5751b3131j99513g005n1807
16224e8812j1060G100a03042K0388A2128i6200c8568B9830P7208a62586A86972
16212d4071n2238E5712f3338j30322Q2868A54017i1011l7700j45355j0362J34293
16201a50135I0441a46082I4486a09471k280h150A49117e2790C1221a23404D1515
$$ plain form
16281 309070 299887 328712 176204 116876 -54798 377225 -58813 -262031 57559 260749 -49668
16269 58467 367588 -190863 296739 -216022 -161351 -137196 243395 -75570 103467 -199676
16258 214499 -81247 45437 63767 229621 162659 114006 37195 210267 257028 -11311 156131
16246 236841 -93466 216786 45624 -79470 -204705 32611 185296 48253 61201 99267 123751
16235 123751 272691 -71421 96799 -48694 -40318 149334 215085 -23131 -222644 -7005 -58812
16224 -58812 -69872 7100 -103042 -82654 12128 -96200 -38568 29830 107038 -162586 186972
16212 -44071 -96309 55712 -63338 -193660 -110792 154017 -91011 -128711 -274066 -284428 -150135
16201 -150135 90441 -146082 94486 -109471 -111751 -8150 149117 -52790 31221 -123404 41515
16189b63430A21398K32153a72048A4196R0058b02848H053i2337k02147H8126a03452
16177F7037b61133D4438a41481A86606I3292a76155D4965K5782a94095h4782k76163
16166c60945M4175C11202A29295a47872B70474a75416b5450k00820A70361e5194
16155A01986e3398A94708J40690A30191a4269j74101P5858C2165Q3381j4296C9415
16143a59600k14771H6715a65543P4984j29002M9973P9705G2048J109c6325A06335
16131A42452a82890C4326c30916b3584j26390j02967G7494K85430p1920E2570
16120C6972L5766e9869j2981o4645n3100A64820b03348h8285D0964a31410D168
16108a38910f94r8825k5054n961o3548A74903b04033A48430C4665K72750j41372
$$ plain form
16189 -263430 121398 353551 -172048 14196 104254 -202848 8053 -92337 -294484 88126 -103452
16177 67037 -261133 44438 -141481 186606 93292 -176155 44965 70747 -194095 -84782 -360945
16166 -360945 -316770 311202 129295 -147872 270474 -175416 -25450 -226270 170361 -55194
16155 101986 -53398 194708 335398 130191 -14269 -188370 -112512 32165 115546 101250 39415
16143 -159600 -374371 86715 -165543 -90559 -219561 -169588 -89883 72048 73157 -36325 106335
16131 142452 -182890 34326 -330916 -23584 -149974 -252941 77494 362924 291004 52570
16120 36972 72738 -59869 -72850 -137495 -190595 164820 -203348 -88285 40964 -131410 4168
16108 -138910 -694 -99519 -124573 -130534 -194082 174903 -204033 148430 34665 307415 166043
16097A66043b88379e5730A70424K38953H1038c59140h2275j17681M3492e5796
16086a08020Q680o4310e8806n8555K8587C83135a17122A40192a25987B8318K0275
16075D8593a18576G5999J6825J875A6548b8225J3182C74480j85270a7741k01179
16064b18920A43288b6761k32835B62606k073b79239h1401j46606J09704a4061
16053H7561e1294F918b49076d7713C7901a29482B98091a10357C452J86611a86498
16041e2451j24090c212j93982G1990J70444C4544J8930b06934K0763A18701a20593
16029B3724c9643j50895O0513b0891C8990d30257a17903F8705b2967j2352J1996
16018b3323j61319d3223A17420i7952A91097b9530A15568a75985k4875A80916
$$ plain form
16097 166043 -288379 -55730 170424 409377 81038 -359140 -82275 -199956 -156464 -55796
16086 -108020 -99340 -163650 -58806 -117361 -88774 383135 -117122 140192 -125987 28318 48593
16075 48593 -118576 75999 92824 94699 16548 -28225 -15043 374480 189210 -17741 -218920
16064 -218920 143288 -26761 -259596 262606 260533 -279239 -81401 -228007 -118303 -14061
16053 87561 -51294 6918 -249076 -47713 37901 -129482 298091 -110357 3452 190063 -186498
16041 -52451 -176541 -3212 -197194 71990 242434 34544 53474 -206934 -186171 118701 -120593
16029 23724 -39643 -190538 -130025 -20891 38990 -430257 -117903 68705 -22967 -35319 -23323
16018 -23323 -184642 -43223 117420 -97952 191097 -29530 115568 -175985 -200860 180916
16007B42476A20004n8642d0734j75845A47783b23204D5769b68219a660B71979
15996c6597r7687l27830g6268o2989A30723A7431f7466C44173A00848m030J07706
15985B04524j6593J02298o5809J74797B5752L73449G1635L85113g3060p5468O6652
15974h1876j49468f5441G455J83580b84961A33981J81214a32920f5237b641B2865
15962I5346a93618E7925j5166l379h6787J8834B30090I7721M925n297a27261I9750
15949C7335a05093j31773i3938j49169E6255a50459B8310N25712A15692d75270
15938B4563b65128A43755b08113h981m72124A33103a56842L8478e4313N98k69701
15927c23416J31605p7782j42913J35539B36708b38567h0983j45656K4832L963
$$ plain form
16007 242476 120004 61362 -40734 -216579 147783 -223204 45769 -268219 -1660 271979
15996 -36597 -134284 -462114 -76268 -139257 130723 17431 -67466 344173 100848 96818 204524
15985 204524 187931 290229 224420 399217 25752 399201 71635 456748 -73060 -148528 -81876
15974 -81876 -231344 -65441 7455 191035 -284961 133981 315195 -132920 -65237 -2641 22865
15962 95346 -193618 57925 42759 39380 -86787 -67953 230090 97721 102646 97349 -127261 99750
15949 37335 -105093 -236866 -93938 -243107 56255 -150459 28310 554022 115692 -475270
15938 24563 -265128 143755 -208113 -8981 -481105 133103 -156842 -118364 -54313 -53715 -323416
15927 -323416 -191811 -269593 -412506 -276967 236708 -238567 -80983 -226639 -201807 -197844
15917a97844Q4459m5555A59778a98694A23646b48307j5054b7095A406i3577D3098
15905D9007L98858d332B40591b61538J11236o8282g7482C56852b5405k12680G1766
15893A82273b3599C10006j24506a61614G5914J09043b09421g7203j54556G3024
15882B7615A2970L45500j23963f5042j36681q795B85265I477d13048a7176j9492
15871c6668q9380j96959G4186J02448o0801D1730a00050G9414L187P2786j5839
15860A39548L5527d3636o7192j17911H9670C7182b30816J0093c9476A72487a03166
15848A53126d7269o8236b9137j57169D82524c02515e3264A92402b02324B68615
15837b7114A23910a47838r7235C6692J17887l1536e1549k96106A62797b57494
$$ plain form
15917 -197844 -113385 -158940 159778 -198694 123646 -248307 -263361 -27095 1406 -93577 43098
15905 49007 447865 -4332 240591 -261538 -150302 -218584 -77482 356852 -25405 -238085 71766
15893 182273 -23599 310006 185500 -161614 75914 184957 -209421 -77203 -231759 73024
15882 27615 12970 358470 234507 -65042 -201723 -210518 285265 9477 -413048 -17176 -36668
15871 -36668 -126048 -323007 74186 176634 115833 41730 -100050 79414 82601 155387 139548
15860 139548 175075 -43636 -110828 -228739 89670 37182 -230816 -220723 -39476 172487 -103166
15848 153126 -47269 -115505 -29137 -186306 482524 -302515 -53264 192402 -202324 268615
15837 -27114 123910 -147838 -245073 36692 154579 123043 -51549 -347655 162797 -257494
15826d337j2875j53516A27865N0084b42824G7760a64231E5498N0440b21395K6127
15815a95268k41341g2835m8812e8808E7139L82844a54384B9274P032J13626F4622
15803A86131N6176J5556j02106O7114c37501A69239B5029o417K10680A08049a56001
15791a17404k8184B03849b86857J15686J7808q375I0633f053H8798J3317a62990
15779g0850J6804k32089B99901b9342l84014a3531e226l78577a89270D503J96707
15768B01210b94688g8580k21771A84335K71260j78178A25380J14354i6430c1538
15757d7075A27466A4391L17333j58065a5919B25567h7739b9117P152j9432D0684
15745I729K52967a55439b5730j47355B23258a96174d016I1080a30352A98997h5903
$$ plain form
15826 -4337 -17212 -170728 127865 177949 -242824 77760 -164231 55498 105938 -221395 -195268
15815 -195268 -436609 -72835 -121647 -58808 57139 439983 -154384 29274 36306 149932 64622
15803 186131 242307 257863 155757 222871 -337501 169239 25029 18612 229292 108049 -156001
15791 -117404 -145588 203849 -286857 -171171 -153363 -161738 90633 -6053 88798 102115 -162990
15779 -70850 -54046 -286135 299901 -29342 -413356 -13531 -5226 -383803 -189270 4503 201210
15768 201210 -294688 -78580 -300351 184335 455595 277417 125380 239734 -96430 -31538
15757 -47075 127466 14391 331724 173659 -15919 225567 -87739 -29117 -21965 -41397 40684
15745 9729 262696 -155439 -25730 -173085 223258 -196174 -4016 91080 -130352 198997 -85903
15733A84554a63748j16047A67482H027J5730f8548q430H411a2409j24768G9600
15721B27101k4775a34501A1884a08620A60607c2295G3207a6546m4032a9184C5738
15709D09973a14325j87606R2520d5317P86j31137b5820A82682a34454N8626j088
15698g6916I6110L63868b80463A04560J41999a3633C0528K06930B8142b50196
15687b49878C38204F034b91159a38278J5242B61281b42881a00034E1619i6847
15676A61301D7112J26758J25473E1J83109a14768A96576J6830h5319B7016b61717
15664a97754o4878j71871A5701d49773G5102J94996f0285k62136a0283j66153
15654a76436J5802B6522L6411k5378a78671b7540A12176E3302h3259L4421m0433
$$ plain form
15733 184554 -163748 -279795 167482 8027 23757 -68548 -76978 8411 -12409 -137177 79600
15721 227101 202326 -134501 11884 -108620 160607 -32295 73207 -16546 -60578 -19184 35738
15709 409973 -114325 -301931 -209411 -45317 -44531 -175668 -25820 182682 -134454 -75828 -76916
15698 -76916 96110 459978 -280463 104560 246559 -13633 30528 237458 28142 -250196
15687 -249878 338204 6034 -291159 -138278 -123036 261281 -242881 -100034 51619 -96847
15676 161301 47112 173870 299343 51 183160 -114768 196576 213406 -85319 27016 -261717
15664 -197754 -262632 -434503 15701 -449773 75102 270098 -60285 -322421 -10283 -176436
15654 -176436 -160634 26522 62933 37555 -178671 -27540 112176 53302 -83259 -48838 -89271
15643h9271k51480M5297E55147F2442J68525G2695J20785h1121C461O4171b97996
15631A29038J13020a31270I7354B3486J33363b80058a4008A52002P4102J44577
15621C70681j44356f6595B05831H3479R3297K7063c8004F34J17740a48818C36125
15609F5862K4537B8890e7926k2816p7758f4627j34191H401d1115F2435K45781
15598C08216O1398g2239H5577a31729B43079a18925k34037f482G7040A48J02303
15587A02451D7627J1758K13595J19028a03614A31350E9562O6429a58829B4311
15576C7388a48570A30152F807L4843b9957q9786C11527e7359B34148j09234c7311
15564f7598k026i781k8357J6868B25975A02924D1090L7102P8620M03621a33949
$$ plain form
15643 -89271 -340751 -295454 555147 62442 230967 72695 193480 -81121 3461 67632 -297996
15631 129038 242058 -131270 97354 23486 156849 -280058 -14008 152002 226104 370681
15621 370681 226325 -66595 205831 83479 176776 203839 -38004 634 118374 -148818 336125
15609 65862 90399 28890 -57926 -80742 -158500 -64627 -198818 8401 -41115 62435 308216
15598 308216 369614 -72239 85577 -131729 243079 -118925 -352962 -6482 77040 148 102451
15587 102451 47627 59385 272980 392008 -103614 131350 59562 125991 -158829 24311
15576 37388 -148570 130152 6807 41650 -29957 -119743 311527 -57359 234148 124914 -37311
15564 -67598 -69624 -9781 -38138 -21270 225975 102924 41090 78192 156812 560433 -133949
15552b04773c4083H1625H594N53923a94197C517a21611a4450j55684a6497B01131
15540A98845g1038I8068M08885C3034J32927g8539A25700B0061b7182l4631a8485
15528C4715J29353G7990J43191r3087d80294A66416g4644c1943B67792H8720g3581
15516d4287j27184A52488a89756f5231B59159B3957J20546m8931L3004J83189
15506C11765B2475J32693J69610c20678f8371q2368I5202L5512J05511a91017
15495D8238b36414n4871P8820A3097a72934c4679k81562d6587A1215a85635A01939
15483A00052K51658e6580C43484B2259h226j74880H689f8992a0524A14584a62188
15471g0023C92590j05333J01843C3069b6745B71358a64695g5430B76865l0846
$$ plain form
15552 -204773 -34083 81625 8594 562517 -194197 3517 -121611 -14450 -170134 -16497 201131
15540 198845 -71038 98068 506953 33034 165961 -78539 125700 20061 -27182 -61813 -18485
15528 34715 164068 77990 221181 128094 -480294 166416 -74644 -31943 267792 88720 -73581
15516 -44287 -171471 152488 -189756 -65231 259159 23957 144503 95572 128576 311765
15506 311765 22475 155168 324778 -320678 -68371 -150739 95202 130714 236225 -191017
15495 48238 -236414 -291285 -212465 13097 -172934 -34679 -316241 -46587 11215 -185635 101939
15483 100052 351710 -56580 343484 22259 -8226 -183106 8689 -68992 -10524 114584 -162188
15471 -70023 392590 287257 389100 33069 -26745 271358 -164695 -75430 276865 246019
15461B46019F2175A2954J61398a04936A60862K4883Q5492K82836D259M6500b15035
15449C0657J6038a6286A20858f5889r3471C4012K17870j04584P868o4349K19701
15438C10518d5229B11133D2667J00332J80200p0424c9318B50369r4261n4340k8222
15427G3546J60935c3825D81345c39965A58639J20244a83592B8599K53652e7608
15416B46635b14263H6084H501R952D109h0947H0831b5796l48134R1927G9207b67162
15403B86222m7292D5194J83780A8796f509m6630C36417b4177k6856J2169j70078
15392b08942A08275b04037P0541C699a04406B928b63930E05587b03100A98855
15381B44184b5205l00781C28737q0269a62482A08133m1901a55739C1999Q4602
$$ plain form
15461 246019 62175 12954 174352 -104936 160862 185745 271237 554073 4259 50759 -215035
15449 30657 46695 -16286 120858 -65889 -159360 34012 251882 147298 155166 90817 310518
15438 310518 -45229 211133 42667 142999 323199 252775 -39318 250369 156108 101768 73546
15427 73546 234481 -33825 481345 -339965 158639 278883 -183592 28599 282251 -57608
15416 246635 -214263 86084 8501 18453 4109 -80947 80831 -25796 -373930 -282003 79207 -267162
15403 286222 238930 45194 228974 18796 -6509 -53139 336417 -24177 -51033 -38864 -208942
15392 -208942 108275 -204037 -133496 3699 -104406 2928 -263930 505587 -203100 198855
15381 244184 -25205 -325986 328737 248468 -162482 108133 66232 -155739 31999 116601
15371A16601O6052I0732J32443r1393a38328A40352B2976N0603N5330C6429c20132
15359b98634d1067j10181A30595i0923A65348d0098k10051g5169C20008E3115
15348A9217b6664G6463b18632B7672K54528B8954b17203H8378O9305H334c7343
15336a1868B0782L4226a41112f7377C8521J41487c4904H1973Q6969E1253K50232
15325C01485g347A11778K13282F1248J25389F8184j5662K26759h2258n0129l6529
15314a68916A57089c37911A42253J72910F6021c89378A64906a6075B14312K8167
15304B42479j0182L2667H1235K75139A67816a34652H2426K45529d8997A05359
15293B91472a3069A17330i5129A05164Q3530J92224A63339J6761K52456A84454
$$ plain form
15371 116601 182653 90732 223175 131782 -138328 140352 22976 73579 128909 36429 -320132
15359 -298634 -41067 -151248 130595 -90923 165348 -40098 -250149 -75169 320008 53115
15348 19217 -26664 76463 -218632 27672 282200 28954 -217203 88378 157683 8334 -37343
15336 -11868 20782 55008 -141112 -67377 38521 180008 -34904 81973 168942 51253 301485
15325 301485 -7347 111778 325060 61248 186637 68184 52522 279281 -82258 -132387 -168916
15314 -168916 157089 -337911 142253 315163 66021 -389378 164906 -16075 214312 242479
15304 242479 232297 264964 81235 356374 167816 -134652 82426 327955 -48997 105359
15293 291472 -13069 117330 -95129 105164 188694 380918 163339 180100 432556 184454
15282A38443N8853q5613J20358a66478C9837J86364E2716K6472J59494j09754
15272A28928b33968J14091A3395J39952Q9601K05667f1657F519a52013C00766
15261C42391j47049K01299e2372q150A74999J08989A9741i5307d1285A74424n8413
15250A16011J75007L65155j9477R1656Q71316m51426Q3352L20304D90519G4762
15239F04462A95543L51486G1793L44784P982F7278J03125m2942K49921a87860
15228B54591a08492E0744a00169L3959C8198L25662C2948R8282B6306L52314J07315
15217D85935b38708g8638j03403A95499a15081D19100J36346b97052A32865B7912
15206C07779r8764J15488d2463B24205c6021j42034q9843A68068a25513a8796
$$ plain form
15282 138443 197296 111683 232041 -166478 39837 226201 52716 79188 238682 128928
15272 128928 -233968 -119877 13395 153347 242948 448615 -61657 6519 -152013 300766
15261 342391 195342 396641 -52372 -60522 174999 283988 19741 -95307 -41285 174424 116011
15250 116011 291018 656173 636696 728352 1599668 1148242 1231594 1551898 490519 74762
15239 604462 195543 547029 71793 416577 424559 67278 170403 127461 377382 -187860
15228 254591 -108492 50744 -100169 -66210 38198 363860 32948 131230 26306 378620 485935
15217 485935 -238708 -78638 -182041 195499 -115081 419100 555446 -297052 132865 27912
15206 307779 209015 324503 -42463 224205 -36021 -178055 -267898 168068 -125513 -18796
15195A27706K07772G2758J46550a56315B96489a22694C08119G9396J41773J129
15185B22298b28737D33820a35284A53367J53131k3796N2225p30p4579D506J28863
15174A33369J99560o7586m9984J43299b7188B26935o4750L28516G5391a08673
15163B54732N5085C50b7609D5487A6882L40076c764A19326K0352g3485J9664B47975
15150I2471f1584B25781J6190A581K95052o373j1092b04028R1393A1314J98313
15139B09627p4819N42391C11738a60598D2360a05670C09745p4372j08826O08261
15129G34808C67179c0785C71791B7131J94903j09341a142A80648O2306M6241b56935
15117A86196L5951J20293A07497N4249N0618a18B61499j18568F3101a4722B46198
$$ plain form
15195 127706 335478 72758 219308 -156315 296489 -122694 308119 79396 221169 222298
15185 222298 -228737 433820 -135284 153367 306498 282702 334927 334197 259618 4506 133369
15174 133369 332929 265343 215359 358658 -27188 226935 162185 490701 75391 -108673
15163 254732 309817 350 -27609 45487 16882 356958 -3764 119326 139678 -73485 -53821 247975
15150 92471 -61584 225781 241971 1581 296633 290260 279168 -204028 -112635 11314 209627
15139 209627 134808 677199 311738 -160598 42360 -105670 309745 235373 126547 734808
15129 734808 367179 -30785 371791 27131 222034 112693 -1142 180648 242954 289195 -256935
15117 186196 222147 342440 107497 161746 212364 -118 261499 142931 63101 -14722 246198
15105B98591a74450C45925F8072R3085D4649J14366K48572A10445K18547J48204
15095D77196J03735B45915L3222J9691M6254j40606A3988K78162C7114R9994g6920
15083C66305o0478J42551A86163O5035P3553p9459J71945H3591L60002E8659R8149
15072A56808J67677l6160N4522J14074A36173J61238A27901J18651N9547j08542
15062A97557L62513A64516j9985J1617K3278D1353c1411F36539F5731L80976j5754
15051D30953I1007J84786n1977R0740j47851J82098O5618A10573J51877K28288
15041D90738A46647J39159p8278J23774j03731J55717j39519M7038A33386j3765
15031A19621c748D87978C1103K78618M6664j53081C2843J61870A9206M30192j98045
$$ plain form
15105 298591 -174450 345925 68072 161157 44649 159015 407587 110445 328992 477196
15095 477196 580931 245915 279137 298828 345082 204476 13988 292150 37114 137108 -76920
15083 366305 305827 448378 186163 251198 324751 245292 417237 83591 443593 58659 156808
15072 156808 324485 288325 342847 456921 136173 297411 127901 246552 306099 197557
15062 197557 560070 164516 144531 156148 179426 41353 -31411 636539 65731 446707 430953
15051 430953 91007 275793 223816 314556 166705 348803 414421 110573 262450 490738
15041 490738 146647 285806 207528 331302 227571 383288 243769 290807 133386 119621
15031 119621 -3748 487978 31103 309721 356385 203304 32843 194713 19206 449398 251353
15020B51353K49432e911C19529g2341E63011k67648j13453J08228K861F9491a45478
15008b5884D02077A25773L96660Q6010A04195J6392R6001D8227J44264K04322
14998C96813K8161Q6867a5076A73178E9044M43320G6986N63951k98314o8297K5191
14987B99517j35147J06188F6645N28740j47212a2545B29018M22235l19041K1335
14977C53547M25907A02222L7534Q51452D54453B26142J18187A29804L05598j64782
14967B70620K11715j80382O02654c5188D61280J60027B10044D8361M52444k33336
14957B67469J33024K4564m0958j24367J12840j57531K13610K155M4827A28719
14946B81866K38628j82686K85743r6516a6412B94317K38819j03040K6701j31219
$$ plain form
15020 251353 500785 -5911 319529 -72341 563011 295363 181910 290138 292999 69491 -145478
15008 -25884 402077 125773 522433 608443 104195 120587 216588 48227 192491 396813
14998 396813 424974 511841 -15076 173178 59044 502364 76986 640937 342623 274326 299517
14987 299517 164370 270558 66645 595385 448173 -12545 229018 651253 332212 353547
14977 353547 779454 102222 139756 991208 454453 226142 344329 129804 435402 270620
14967 270620 482335 301953 904607 -35188 461280 621307 210044 48361 500805 267469
14957 267469 400493 425057 384099 259732 372572 215041 428651 430806 475633 128719
14946 281866 520494 337808 623551 527035 -16412 294317 533136 430096 456797 325578
14936C25578J77823J26495f7914F40638C00065J03835K40146j59756A3797L54033
14926C67830M53242l07604K9517o3893E3886M80213r4547J64952k04865J27738
14916E27377B48597M29797j72221P2657F7395L13352P9686J48678j65793N142
14906D48460j74016K80230J5091l6343J84943r7946j07558K86025B77532M17084
14896F94616J55234l27092P5073J0730K30078k49871K074M737Q8716B94738J52732
14885D47470M26700k64127B87099O4989r9829L64712j65160R713j93048K62828
14875E31304o7903N1725k7185K34008j79355L36500C31011L43981k18864o4986
14865C91142L34149j57766K37733B54376M02313B57974K82120L81476D45491J97320
$$ plain form
14936 325578 503401 629896 -67914 640638 300065 403900 644046 484290 13797 367830
14926 367830 821072 513468 542985 479092 53886 534099 439552 604504 399639 527377
14916 527377 248597 678394 506173 578830 67395 380747 460433 609111 443318 448460
14906 448460 274444 554674 569765 533422 718365 620419 512861 798886 277532 694616
14896 694616 849850 522758 597831 608561 838639 588768 590842 595579 684295 294738 447470
14885 447470 874170 610043 287099 352088 252259 616971 451811 461524 268476 531304
14875 531304 463401 515126 487941 721949 542594 879094 331011 674992 456128 391142
14865 391142 725291 567525 805258 254376 656689 257974 540094 921570 445491 642811
14855F42811K91363D16171J83374j9609P3793O6067m7771Q2961l1504l51632R3687
14844D65537M0139o0185L34771l08705K20032o8307J66182j57633J31572l7396
14834G26007C04351J53301M22210D35583L26216k88376L62919N0356j95290N5210
14824G46618j47979J41848n5004J61067j70830J9817L26200B90025M11831j88964
14814E12892M15948J28020m93048j36172K9371Q7564J21592J48106m02674L09365
14804G20964R2843j80683j8470K24732k14688L04970l0916j06997R7312m5378
14794H43689k98873J18088J02183L7365r4103J29558j29831m2876j26663L25869
14784H64406M4259n4619j67567O5699m8255N9754R8630k54668K25850J74207L5931
$$ plain form
14855 642811 934174 416171 599545 579936 653729 719796 672025 754986 723482 371850 465537
14844 465537 505676 445491 780262 471557 691589 623282 789464 631831 763403 726007
14834 726007 304351 457652 879862 435583 761799 473423 836342 886698 691408 746618
14824 746618 598639 740487 685483 846550 675720 695537 1021737 290025 701856 512892
14814 512892 928840 1056860 563812 427640 457011 544575 666167 814273 411599 720964
14804 720964 813807 633124 614654 839386 624698 929668 898752 791755 889067 843689
14794 843689 544816 662904 765087 802452 708349 837907 708076 665200 538537 864406
14784 864406 908665 854046 686479 752178 703923 763677 862307 607639 833489 1007696 1043627
14773A043627k07090j81304J93760J04066j56796L3038J24157k49090M06226o6165
14763A044429j35997j31347L15167l33093K30197j84598L48766l19888N9186P2464
14753I65286j03573O9742o8791J26580Q6094j03635M456n0646l693J7388P269
14742I46477J09801k42972M18476l19412J11967k81063J13766p2205J31347M8619
14732I64801j0738m8212k03395L46660j58511j81547L85799r12O8323j29034O9811
14721A103045j37324j2591J5301L92831r0893q548j29046j89910l2349M97970
14711A408486q6166j98162O3732j3047j54637M26592k9140j77617k04297j56635
14701H79109J16521O1261M90527n02185J50883j65346J33579J14225q6499q6590
$$ plain form
14773 1043627 836537 655233 848993 953059 796263 829301 953458 704368 1110594 1044429
14763 1044429 908432 777085 1092252 759159 989356 804758 1153524 833636 892822 965286
14753 965286 861713 931455 862664 989244 1075338 971703 976159 925513 921820 939208 946477
14742 946477 1056278 813306 1231782 912370 1024337 743274 857040 784835 916182 964801
14732 964801 954063 905851 702456 1049116 890605 709058 1094857 1093945 1162268 1033234 1103045
14721 1103045 965721 953130 968431 1361262 1270369 1261821 1132775 942865 910516 1408486
14711 1408486 1322320 1124158 1187890 1174843 1020206 1446798 1417658 1240041 1035744 879109
14701 879109 995630 1056891 1547418 1045233 1196116 1030770 1164349 1278574 1192075 1105485
14691A105485K82075j9378L9175n42411K81317N8190k2870J74514J5835M5131
14681A417063l03542J22330k06969L80521j20743k05659J52187J78662p5581K80951
14671A619220l89329k6808M18895m75839L27018j77113J2997j99844M07552j69670
14661A347079p2481J06700J0639q1118q8665L64072j43820J74563J3829j99052
14651A431746J00003R3K74383l50667L92180k64708k17214L37786J58069j59432
14641A702239k00742j04510N01745k70041N76883m98627p4427J21852O9360j2371
14631A811361p1490J87202m04313l4691J94358J35673J00366J2665O651K20299
14621B158081O4193p16270K61073J21762j80447K20715o8211J34069Q1080J33344
$$ plain form
14691 1105485 1387560 1368182 1407357 864946 1146263 1204453 1181583 1356097 1371932 1417063
14681 1417063 1113521 1235851 1028882 1409403 1288660 1083001 1235188 1413850 1338269 1619220
14671 1619220 1229891 1203083 1621978 1146139 1473157 1296044 1309041 1109197 1516749 1347079
14661 1347079 1274598 1381298 1391937 1310819 1222154 1586226 1442406 1616969 1630798 1431746
14651 1431746 1531749 1531842 1806225 1455558 1847738 1583030 1365816 1703602 1861671 1702239
14641 1702239 1501497 1396987 1898732 1628691 2205574 1706947 1632520 1754372 1823732 1811361
14631 1811361 1739871 1927073 1522760 1488069 1682427 1818100 1918466 1931131 1937782 2158081
14621 2158081 2222274 1506004 1767077 1888839 1708392 1929107 1860896 1994965 2076045 2209389
14611B209389k78455L6606J7850J16627k04460L75642l14596p7923K01335J99494
14601B281509l10195J68247j5828m4576N4489J24455Q8177k9758K7623n77922
14591A766221N95611J21097m05219K42535r5686M2826J99260m1712j73836J80106
14581B431203J76986k60755p679l478P1413L32072p8759l6447l4738K45322K55285
14570C090425k50493M7668k29739J82069M8411J305M39359k73443o9119K91088
14560C277531O7196j23624K24048j21747K76826R0135L57340J64170L01158O26687
14550E139720P01760Q87326L139802P686070J9809730O838794B1431298j0646364
14542A0784934k578807l494773j140032l35788N8263j272k67848j05914J1935
$$ plain form
14611 2209389 1930934 1967540 1985390 2102017 1897557 2273199 1958603 1880680 2082015 2281509
14601 2281509 1971314 2139561 2123733 2079157 2133646 2258101 2346278 2316520 2344143 1766221
14591 1766221 2361832 2482929 2077710 2320245 2224559 2267385 2466645 2424933 2251097 2431203
14581 2431203 2608189 2347434 2339755 2336277 2407690 2739762 2661003 2624556 2589818 2835140 3090425
14570 3090425 2839932 2887600 2657861 2839930 2888341 2889646 3329005 3055562 2986443 3277531
14560 3277531 3344727 3221103 3445151 3323404 3600230 3690365 4047705 4211875 4513033 5139720
14550 5139720 5841480 6728806 9868608 17554678 37364408 44203202 21431298 10784934
14542 10784934 8206127 4711354 3571322 3235534 3293797 3292525 3024677 2918763 2930698
14533B930698j55650n5136L23946N698k59848K01241R9161q6966j10736J48016
14523C040424J59357p7515l2488J13640p5113L48258j30570K47022k78651j1000
14513C303364K95868l42741N47009k75754J17740j64749R878L84204q1264q7205
14503C706350M17888k3497m90041L11141K10824K5078J21134k63486j78590M07295
14493D244096j67469J13919L5627N0574O2141J48506J94962m46778K16950K03809
14483D656337R57j8022O7453J24239J67095k65571N6491O4186N04388l52574J77997
14472E182976l38221K28736J76082j16072j30810L52950J70714J28566J81962
14463E836883p2835J11P1373K20535j64229J07141J26483l23453L80609J21639
$$ plain form
14533 2930698 2775048 2719912 3043858 3049556 2789708 2990949 3090110 3003144 2892408 3040424
14523 3040424 3199781 3122266 3089778 3203418 3128305 3476563 3345993 3593015 3314364 3303364
14513 3303364 3599232 3256491 3803500 3527746 3645486 3480737 3490615 3874819 3793555 3706350
14503 3706350 4124238 4100741 3610700 3921841 4132665 4157743 4278877 4015391 3836801 4244096
14493 4244096 4076627 4190546 4226173 4276747 4338888 4487394 4682356 4235578 4452528 4656337
14483 4656337 4657294 4639272 4706725 4830964 4998059 4732488 4788979 4853165 5357553 5004979 5182976
14472 5182976 4844755 5073491 5249573 5133501 5002691 5355641 5526355 5654921 5836883
14463 5836883 5764048 5764159 5835532 6056067 5891838 5998979 6125462 5802009 6182618 6304257
14453F304257K24622r027J35485p0987M2889l22904Q33265j98865j41100L13668
14443G111303j81852K8948N15660l37689M02246q0182K59349L6044r4865k58137
14433G400825N01601K87035M8813L24400l03817L97491J1990j56814M44723j67622
14423H788625L68760K31417j4368m4058J4514M42297K06338m71430K43196L15431
14413A0080722M42924j3984J68036k73272P89791l43425J38193K63694L44321
14404A1597000K49092j50197K13576p09K73389K58325J24834K45309L25185K11742
14394A3347546J06339J10024K91385J19540J96645K06736J04181L14883J13908
14385A4911187M35960J77916L99921M61454K8693L71747M18062P9255K06480L82322
$$ plain form
14453 6304257 6528879 6519852 6655337 6584350 6627239 6304335 7137600 6938735 6797635 7111303
14443 7111303 6929451 6958399 7474059 7136370 7538616 7458434 7717783 7753827 7658962 7400825
14433 7400825 7902426 8189461 8238274 8562674 8258857 8656348 8668338 8511524 8956247 8788625
14423 8788625 9157385 9388802 9374434 9330376 9344890 9787187 9993525 9522095 9765291 10080722
14413 10080722 10523646 10509662 10677698 10404426 11194217 10850792 10988985 11252679 11597000
14404 11597000 11846092 11695895 11909471 11908762 12182151 12440476 12565310 12810619 13135804 13347546
14394 13347546 13453885 13563909 13855294 13974834 14171479 14378215 14482396 14797279 14911187
14385 14911187 15347147 15525063 15924984 16386438 16415131 16786878 17204940 17284195 17490675 17872997
14375A7872997L57154J08092M46237O00533J66474j1557N44782Q59206p8653N64598
14365B1429863N00275K89729l1700P64178N89767J73782O94446M71204O61839
14356B5543383L68932M31493R01507L84727N13360Q88938M64657O28765Q69098
14347C0994860J95638J017614Q94895N58167R73575J037382L32814J329969O63385
14338C7998299J273767R48540R21566J236546Q73616J598102O22444J330490J732219
14329D8535589J017060J780691J156469J838539J436751J647773J762845J971202
14321F1146919K107819K020860K369853K052275K734874K553956K248362K681893
14313G9916811K882302K982751K781314L765321L573453M065252L980114M322284
$$ plain form
14375 17872997 18230151 18338243 18784480 19385013 19551487 19539930 20084712 20943918 20865265 21429863
14365 21429863 21930138 22219867 22188167 22952345 23542112 23715894 24410340 24881544 25543383
14356 25543383 25912315 26343808 27245315 27630042 28143402 29032340 29496997 30125762 30994860
14347 30994860 31190498 32208112 33103007 33661174 34634749 35672131 36004945 37334914 37998299
14338 37998299 39272066 40220606 41142172 42378718 43252334 44850436 45472880 46803370 48535589
14329 48535589 49552649 51333340 52489809 54328348 55765099 57412872 59175717 61146919
14321 61146919 63254738 65275598 67645451 69697726 72432600 74986556 77234918 79916811
14313 79916811 82799113 85781864 88563178 92328499 95901952 99967204 103947318 108269602
14305A08269602M480888M605667N136850N250002N741659O163554O133123O657732
14297A52439077P470710P623191Q321039Q589400R015987R961172J0374667J0724291
14289B24519534J1470609J2230268J2710927J3362178J3783372J4313485J5176362
14282C17566735J5213150J5592604J5829105J5599177J5664639J4925227J4476201
14275D24866838J2950321J1499166R373169N529553N40939Q71795r86385r341095
14267D55304301k500375n394813j0578526j2422248j3943766j3847406j4581668
14260C82035499j4421727j4782535j4091421j4129038j4091205j3886845j3655492
14253B82977236j2573505j3322276j3509240j3186200j2361200j1654404j0700318
$$ plain form
14305 108269602 112750490 117356157 122493007 127743009 133484668 139648222 145781345 152439077
14297 152439077 159909787 167532978 175854017 184443417 193459404 203420576 213795243 224519534
14289 224519534 235990143 248220411 260931338 274293516 288076888 302390373 317566735
14282 317566735 332779885 348372489 364201594 379800771 395465410 410390637 424866838
14275 424866838 437817159 449316325 458689494 464219047 464759986 465631781 464645396 455304301
14267 455304301 452803926 447409113 436830587 424408339 410464573 396617167 382035499
14260 382035499 367613772 352831237 338739816 324610778 310519573 296632728 282977236
14253 282977236 270403731 257081455 243572215 230386015 218024815 206370411 195670093
14246A95670093j0934251r058481q399475q344426p850413p579760o852915o220446
14238A30429926n553581n697028n499736m929606n028413m067137m134410l772118
14230I1747897l477962l934348l298752l090127l035373k724272k808683k742574
14222F6635806k189855k181796k347954j804329k087160j824790k009827j795855
14214E0394240j347281j147837j663447j274392j740289j217854j195225p19164
14206D0088751j098193j162100j339634j114657j054268o77050n87148q72015
14198C2183686r90299j309861n19303o79996m03785q38341n47046j156250n22987
14189B5215818k39780q16192n52703n56882m81509q15905j53782n56304o06050
$$ plain form
14246 195670093 184735842 175677361 167277886 158933460 151083047 143503287 136650372 130429926
14238 130429926 124876345 119179317 113679581 108749975 103721562 99654425 95520015 91747897
14230 91747897 88269935 84335587 81036835 77946708 74911335 72187063 69378380 66635806
14222 66635806 64445951 62264155 59916201 58111872 56024712 54199922 52190095 50394240
14214 50394240 49046959 47899122 46235675 44961283 43220994 42003140 40807915 40088751
14206 40088751 38990558 37828458 36488824 35374167 34319899 33642849 33055701 32183686
14198 32183686 31193387 29883526 29364223 28684227 28280442 27442101 26895055 25738805 25215818
14189 25215818 24976038 24159846 23607143 23050261 22568752 21752847 21599065 21042761 20436711
14180B0436711j12568n50931j25533r72493K60709o64768m71010l49836m15810
14171A7034471l28338l98978k40652j49804j04966q44157J79043k7158p29983
14162A4389478n75068M08425n53723q8141j92674m65161l39347j09414l12279
14153A2162096K88043m42240l98703j8325l64976j31169m1614p719n21304O9257
14143A0593346j20964k00147k97933q2248m04564J81273k39678n39033O6780K8327
14133H985159n6969p9826n02786L93422n71399j76200M60132n30030M2949L24186
14123H288638n55276k02205j62216P4029J13052l56136m3558L60647l70573m35538
14113F710864p2579O6375l85675N08627n03229N661j90124L05381j93065k54418
$$ plain form
14180 20436711 20324143 19773212 19647679 18675186 18935895 18271127 17800117 17450281 17034471
14171 17034471 16706133 16307155 16066503 15916699 15811733 14967576 15146619 15119461 14389478
14162 14389478 13814410 14222835 13669112 13580971 13388297 12923136 12583789 12474375 12162096
14153 12162096 12450139 12007899 11609196 11590871 11225895 11094726 11053112 11045393 10524089 10593346
14143 10593346 10472382 10272235 9974302 9892054 9487490 9668763 9429085 8890052 8956832 8985159
14133 8985159 8928190 8848364 8345578 8739000 8167601 7991401 8451533 7921503 7964452 8288638
14123 8288638 7733362 7531157 7368941 7442970 7556022 7199886 7156328 7516975 7146402 6710864
14113 6710864 6638285 6704660 6318985 6827612 6324383 6330044 6139920 6445301 6252236 5997818
14103E997818P917j2082n46846L63212J48836m32641J8581l386o6942O8438k97578
14092E245327l500p7709J65334j87217K77641m32789K08698j72288j26297R1298
14082D988498l15621Q6828j89804J53740k0340J5361k48517j41438Q5919J833
14072D416459J45779l23597K27223j92962P8249k20918k21433r4934L94471l29794
14062C878543k9712R3829J60228l0554k27417n6660K88577l63632m0257J46322
14052C819267J83863m81251j31349K44347q5682q1154l6627J14135j42714k19891
14042C182944o5738N582m51203O89460k61023j57749N661P9678P3419r3304M73553
14031C481280m06502m47K09289l25646k44858K14115j06084l39505J99731q0685
$$ plain form
14103 5997818 6005735 5993653 5446807 5810019 5958855 5526214 5544795 5541409 5474467 5542905 5245327
14092 5245327 5241827 5164118 5329452 5142235 5419876 4987087 5195785 5023497 4897200 4988498
14082 4988498 4672877 4759705 4569901 4723641 4703301 4718662 4470145 4328707 4414626 4416459
14072 4416459 4562238 4238641 4465864 4272902 4351151 4130233 3908800 3813866 4208337 3878543
14062 3878543 3848831 3942660 4102888 4072334 3844917 3788257 4076834 3713202 3672945 3819267
14052 3819267 4003130 3521879 3390530 3634877 3549195 3468041 3431414 3545549 3402835 3182944
14042 3182944 3117206 3122788 2671585 3361045 3100022 2942273 2947934 3027612 3101031 3007727 3481280
14031 3481280 3074778 3074331 3283620 2957974 2713116 2927231 2821147 2481642 2681373 2600688
14021B600688j06369n3386Q3604l989k35078M20729J47620n36377J29641J28232
14011B575315k03985m1265j3879r2921M12731m92770K26990m67537j8234N42949
14001B427394l51075L50525l53749K41338n53666K02289n4146k33279M70990Q3179
13991B229800J97480K3470n994J976641N490920J7846826J9255287k0489299j2335531
13982A4189600n732293k449227j259358o27802l62749k09197j04873m59304k68844
13973B715953J63041N666j15808j43547k18568J532o7857o8573R6234p2676l61820
13962A933577K50232j27163p3388J71628K50603p56532M50410J83883l17087L31408
13952B297571n32144L05447k93011J66610Q442j34735q978j15867l50474K68210
$$ plain form
14021 2600688 2494319 2440933 2524537 2520548 2285470 2706199 2853819 2317442 2447083 2575315
14011 2575315 2371330 2330065 2316186 2223265 2635996 2143226 2370216 1902679 1884445 2427394
14001 2427394 2076319 2426844 2073095 2314433 1760767 1963056 1908910 1675631 2146621 2229800
13991 2229800 2427280 2450750 2444756 4421397 9912317 27759143 47014430 26525131 14189600
13982 14189600 8457307 6008080 4748722 4120920 3758171 3548974 3444101 2984797 2715953
13973 2715953 2878994 2884660 2768852 2625305 2406737 2408269 2340412 2271839 2368073 2295397 1933577
13962 1933577 2183809 2056646 1983258 2154886 2405489 1648957 2099367 2283250 1966163 2297571
13952 2297571 1765427 2070874 1777863 1944473 1952915 1818180 1809202 1693335 1342861 1611071
13942A611071M47966m69092j14460N21883j23070o7340l50149J66874K7014N1657
13932A702354j97992J71122k458l23195K78574L8088j24164j35152Q197P3749
13922A489123j7158j16233J88044k34640J94159J60376j47273k59024K66485m43210
13912A080649M10992J39428o40227N20055k77099Q5388o0827K44374n8672j503
13902A442558p8661l27563K19725o1443J91201l10147L66611k86642R3399J34374
13892A383412K08039k23544k23707K91288k22732k6683L1475p9370K964j94264
13882I46878K47128k42147K77681J0959k03274P7638k384J45129J42781l36223
13872A064166k77802j74488O53429M7864l42530j58237L70806R0886j20066K4454
$$ plain form
13942 1611071 2059037 1589945 1475485 1997368 1874298 1806958 1456809 1623683 1650697 1702354
13932 1702354 1504362 1675484 1673026 1349831 1628405 1666493 1542329 1407177 1415374 1489123
13922 1489123 1471965 1355732 1543776 1309136 1503295 1663671 1516398 1257374 1523859 1080649
13912 1080649 1491641 1631069 990842 1510897 1233798 1319186 1258359 1502733 1444061 1442558
13902 1442558 1363897 1036334 1256059 1194616 1385817 1075670 1442281 1155639 1249038 1383412
13892 1383412 1591451 1367907 1144200 1435488 1212756 1186073 1217548 1138178 1141142 946878
13882 946878 1194006 951859 1229540 1240499 1037225 1114863 1112479 1257608 1400389 1064166
13872 1064166 786364 611876 1265305 1313169 970639 812402 1183208 1274094 1154028 1178482
13862A178482n50m03094J3223N85937j24094m92010K44602k6591M80458m79604
13852I76759K22296l95056n931j25170L30961k15313L40090p8462j17089j79455
13842G53630L42345k56211R2402K32643l77265O6618K76559k40222l9562m6263
13832H04674L157M5503l1450R8746l78413K86671k12341L5885M09489k70560K80791
13821A072152m27214O0905J80545k69464J99821J10949k54321K16465k01723J74216
13811H62331j17487J92908j87830J80216j17125j48806K44717j89776j11601Q9885
13801F97432J80512k88960K59176l03368K78526r8558k44J90880j19181r2958
13791G03257J04887j42185r0498R5342j5738l5309J81268R2926D16623K88804
$$ plain form
13862 1178482 1177932 774838 788061 1373998 1249904 757894 1002496 975905 1456363 976759
13852 976759 1199055 803999 798068 672898 1003859 788546 1128636 1050174 933085 753630
13842 753630 1095975 839764 932166 1164809 787544 854162 1130721 890499 850937 804674
13832 804674 807831 853334 821884 920630 542217 828888 616547 652432 1061921 791361 1072152
13821 1072152 644938 705843 886388 616924 816745 927694 673373 889838 688115 862331
13811 862331 744844 937752 749922 930138 813013 664207 908924 719148 607547 697432
13801 697432 877944 588984 848160 544792 823318 724760 724516 915396 796215 703257
13791 703257 808144 665959 575461 670803 655065 619756 801024 893950 416623 705427
13781G05427R371L2047J13740k72804o4739N63855m50437q8603J20534m51J44906
13770H12846J02809l26112O9117M2415J59363k32130l0098J70466l16566K71670
13760G23780P011j76806N3092J73426o0704j9985L8296k83948L64758k38719q6788
13749D93413k07060O0749M95651k05354j32645M9294j34068M04618C67772K74924
13739F42696J9102J18818C85399M10645l79014J35589o365k60385L60139J7549
13729F63557J45617j61396l08846K00914J35486j69069q2576j15397J7549J06101
13719D31940K33852k8874k76280K72307j32755L64657l86613l6078J48134p9930
13709E10360q1353N2987J30762j5200j68598j48927L39481J50627l31746N0839
$$ plain form
13781 705427 714798 746845 860585 587781 523042 1086897 636460 547857 668391 667940 812846
13770 812846 915655 589543 658660 701075 860438 628308 598210 768676 452110 723780
13760 723780 730791 553985 607077 780503 719799 699814 738110 454162 818920 580201 493413
13749 493413 286353 347102 842753 637399 504754 554048 419980 824598 367772 642696
13739 642696 661798 780616 385399 796044 417030 552619 546254 285869 646008 663557
13729 663557 809174 647778 338932 539846 675332 506263 423687 308290 325839 431940
13719 431940 665792 636918 360638 632945 500190 864847 478234 442156 590290 510360
13709 510360 429007 481994 612756 597556 428958 280031 619512 770139 438393 489232
13699D89232N3184N3237J69251j67675p3383j3356Q0069A37143L48216j12312
13689C73047P9750j88612K46142K05527p0078l13948K95638j39405G6955K56990
13679C33945L47337l23123J67055B00945M26974j65627r5524J2446R1093k18621
13669B51686K02910q5275L46064k64601A87266K07096p0394L41141p7226O1664
13659F49547B22364J49287K13549R3669C0660O05678B07001N7721f608G92082
13648A74475J73482J79008j26822m3432J73209c23115C10455o2650K3840L02370
13638E74015p7753Q8558R3802B08005N31929B55495N07492B05607E7670J51542
13628B09212J99671N8264n3526J07578B49963J31322r7096K08395L738k31498
$$ plain form
13699 489232 542416 595653 764904 597229 523846 510490 590559 137143 485359 373047
13689 373047 452797 264185 510327 715854 645776 331828 627466 488061 76955 333945
13679 333945 681282 358159 525214 200945 627919 462292 366768 379214 470307 251686
13669 251686 454596 369321 715385 450784 187266 394362 323968 665109 587883 649547
13659 649547 222364 371651 585200 678869 30660 636338 207001 264722 -6608 792082
13648 174475 347957 526965 400143 356711 529920 -323115 310455 247805 271645 574015
13638 574015 496262 584820 678622 208005 739934 255495 762987 205607 57670 209212
13628 209212 408883 467147 413621 521199 249963 381285 284189 492584 496322 264824
13618B64824I6811K00454K39694J42104p7943A80237k8413j4692a1499D56518
13607C06013J61011B02556p7432L72681j23394O3161k3686j6124q426A59153J2757
13596A71910K52872j73078K33974a36685B54476F9328K3940J00197M04352j2740
13586E85077j3277j4871L7712k91228L46281l18484j50206K98710j62289J03130
13576D20555B151Q2789l797N29683k74945Q5112j25699A09946K32883K86416k56474
13565C72771j57022J39468o1094r2036K59694k17629p3513O5J46219J64762A17073
13553I9687K86170j08569C8196K80894j55940J11016J34858A07902J00457J00498
13543C08857J46547d9608D7083J10510f1698C39769E6456K96864j44691b074C50810
$$ plain form
13618 264824 96811 297265 536959 679063 601120 180237 151824 137132 -11499 456518
13607 306013 467024 202556 125124 497805 374411 437572 413886 397762 389336 159153 171910
13596 171910 424782 251704 485678 -136685 254476 69328 93268 193465 597817 585077
13586 585077 571800 556929 594641 303413 649694 331210 181004 479714 317425 420555
13576 420555 2151 84940 81143 610826 335881 420993 295294 109946 342829 629245 372771
13565 372771 215749 355217 294123 202087 461781 244152 170639 170704 316923 481685 117073
13553 99687 385857 277288 38196 319090 163150 274166 409024 107902 208359 308857
13543 308857 455404 -49608 47083 157593 -61698 339769 56456 353320 208629 -2074 350810
13531B98693N5739r7530m5015I278M03565j02459K2512j28072P27j735K31544
13520D35360A28857K96731j58509A16838K4997P9308m5832m1988J36503L31378
13510F01204k03272q3270N8169k2677a62426D52166M3722r0579L9236l3662j13292
13499B97591K37386k60105I0758K57005J49440a21009D49711F3099f1460C65937
13488E37786D6448L13253o1522J6367A10917M19671j13937a35920B83295a96348
13477B88034B2483R0523J00638a9810m4012C34811A60101b61822g0561B92740
13466B51699K09396a86903B00542H8793C431J40922K01035A03006J30483N1769
13456B85258K0516J31890B6941K45873J89710p9243B1505K79185K1876G5830J68131
$$ plain form
13531 298693 354432 256902 211887 9278 412843 310384 332896 204824 205551 203816 435360
13520 435360 128857 425588 267079 116838 141835 221143 175311 133323 269826 601204
13510 601204 397932 314662 372831 350154 -162426 452166 495888 405309 444545 410883 297591
13499 297591 534977 274872 90758 347763 497203 -121009 449711 63099 -61460 365937
13488 537786 46448 359701 298179 314546 110917 530588 416651 -135920 283295 -196348
13477 288034 22483 113006 213644 -19810 -63822 334811 160101 -261822 -70561 292740
13466 251699 461095 -186903 200542 88793 3431 144353 345388 103006 233489 285258
13456 285258 305774 437664 26941 272814 462524 383281 21505 300690 322566 75830 243961
13445B43961P0355F7701J3432J4469Q6877E9833L79770A41544K75845a95947B45177
13433A83892J84070j25125P3254j4016B2935M06180E3467O4734K62693K13066
13423E93960a69064D17158j52046b7844B63959r0218L2907Q8365I2650P8241P1607
13412B42498J1119q6761q1988j2323K41141n7473h9742E35684j70263j51541D8782
13400A02073J14703a31663B37546J9684l1523J79845R9553A44991d3436C976M3463
13389D7439J49109J12154p5416K54816j81313P123F8119h7224B64176g7312B49020
13377B41701G7844K7340O7147A7500M46713A80489J56523n5859J7426a02649B22437
13365c3268C34513A65781L54420I1524c7221D08318j51597E2470a1308A31116
$$ plain form
13445 243961 314316 67701 81133 95602 182479 59833 439603 141544 417389 -195947 245177
13433 183892 367962 242837 316091 302075 22935 429115 53467 118201 380894 593960
13423 593960 -169064 417158 265112 -27844 263959 173741 206648 295013 92650 170891 242498
13412 242498 253617 166856 84868 72545 313686 256213 -89742 535684 365421 213880 48782
13400 102073 216776 -131663 237546 257230 225707 405552 505105 144991 -43436 3976 47439
13389 47439 196548 308702 233286 488102 306789 313912 68119 -87224 264176 -77312 249020
13377 241701 77844 105184 172331 17500 464213 180489 337012 281153 298579 -102649 222437
13365 -33268 334513 165781 520201 91524 -37221 408318 256721 52470 -11308 131116
13354B71110j19664F3457L1967K5441A9575J62729J71552j0958A13630J13453
13344B27083k4087N8190O5241D4313J3993K28725K82232A87547e0181B73746A01183
13332B51444A12361a10669E3005M1343M889J19288O2311A14908L97819B52000
13321C78159B6592b28355C29533o4241P2408G7876B4388N5943P8603a79591B44590
13309E70710k49878a50122f9396A32781N6367I2060j6726J5357N3495o5464P8999
13298A57721N0063K3042j0847C0867K26684j6143a4058A27809o1325a79558G2405
13286B44590f3112C36851F2823J76660A3750J56799l2604g3567a088C09051l0596
13275B78455B040a27464B80197a10928A04986a66665c6874A60744b02061C64987
$$ plain form
13354 271110 151446 63457 95424 120865 19575 182304 353856 342898 113630 227083
13344 227083 202996 261186 326427 44313 58306 287031 569263 187547 -50181 273746 101183
13332 251444 112361 -110669 53005 94348 99237 218525 280836 114908 512727 252000
13321 378159 26592 -228355 329533 265292 337700 77876 24388 80331 158934 -179591 244590
13309 570710 320832 -150122 -69396 132781 189148 92060 75334 90691 144186 78722 157721
13298 157721 207784 230826 219979 30867 257551 241408 -14058 127809 66484 -179558 72405
13286 244590 -63112 336851 62823 239483 13750 170549 137945 -73567 -1088 309051 278455
13275 278455 2040 -127464 280197 -110928 104986 -166665 -36874 160744 -202061 364987
13264g7572I2952L0508M89441A07604a08461B34917j7317r7802N0643A6239i3588
13252F0487K73869j03190a07150F385a96129B38913c475C30281F2935c5926k17952
13241b53878a06232I57N2438f3503A19349a92256A24363m2813g4369A41603o7965
13230G3638R5328n071P2385m896I2886M10558B18774Q0735A15427A2999L33443
13219C46442f0306C7709A51J60732a54710A21653f346j71977C79831F2896k8703
13208C4193m430a95669C11626j43729F9560K94493j00213n6698J79990a6113q4490
13197a00603b0823A95107d8644F8218M91985A15921K39243A75970C3886I865R2594
13186A02459g9380J7500A08166K8544e337F0315a40856C0500d591j12630B59058
$$ plain form
13264 -77572 92952 123460 612901 107604 -108461 234917 217600 119798 170441 16239 -93588
13252 60487 334356 231166 -107150 6385 -196129 238913 -3475 330281 62935 -35926 -253878
13241 -253878 -106232 957 53395 -63503 119349 -192256 124363 81550 -74369 141603 73638
13230 73638 168966 163895 236280 231384 92886 503444 218774 299509 115427 12999 346442
13219 346442 -60306 37709 151 160883 -154710 121653 -6346 -178323 379831 62896 34193
13208 34193 29763 -195669 311626 167897 69560 364053 263840 207142 387132 -16113 -100603
13197 -100603 -20823 195107 -48644 68218 560203 115921 355164 175970 33886 9865 102459
13186 102459 -79380 -61880 108166 136710 -5337 60315 -140856 30500 -4591 -117221 259058
13174d19l124E0367J83801F1940a27979A88078I0673J2329R7856L7708a30779
13162a12677D9032a01479q7840c0227A71847b72617H3713n264g933F4770j1363
13151E3407J45998C0204L7154J9026a48654a474B5429K3214J55914a20702A41081
13139I0139a62653A36012Q5365a64752A33145J60089N388h8761B69959a3830A96068
13127A21826a25591j3338r1471B418L48709a66296d000B55390a02371k942E6275
13115A61402J12964b47927C083Q8732C369a42999D11055a21712r7204j09143a13901
13103d1566A60069c42184J19133A06142J7545c5161B98839K9581I0322K19127
13093C09449I6891K16132b3499o1177A35129i7659B37543b26780b9900q4502M3166
$$ plain form
13174 -419 -3543 50367 234168 61940 -127979 188078 90673 103002 200858 238566 -130779
13162 -112677 49032 -101479 -189319 -30227 171847 -272617 83713 78449 -7933 64770 53407
13151 53407 199405 30204 67358 86384 -148654 -1474 25429 48643 204557 -120702 141081
13139 90139 -162653 136012 221377 -164752 133145 293234 298622 -88761 269959 -13830 196068
13127 121826 -125591 -138929 -230400 2418 351127 -166296 -4000 255390 -102371 -105313 56275
13115 161402 274366 -247927 3083 91815 3369 -142999 411055 -121712 -218916 -328059 -113901
13103 -41566 160069 -342184 -223051 106142 123687 -35161 298839 328420 90322 309449
13093 309449 96891 313023 -23499 -84676 135129 -97659 237543 -226780 -29900 -114402 -71236
13082g1236j59819C71692d5519A13060d5886l3222E6327N8983J3070K2742k1142
13071A29980L26932a3984F0100K11505r7484a52702N5813C4204a0929D87355A80241
13059C51482J23593B32138H2007a669I2841d6685B14166M4411A4805i1790A28431
13047B14185I8374c3021B71038d951A13787C3827K3476h1291P889l5888B6002
13035C89379a40729A75100g6669q9345E36736g1668l2301f437B18779p1751N7126
13024B04154a1818E6265R0580l3266k4388a9614H7531l9263J01965N34514F7097
13012c148o178j09177p9365B21761E2241K55405H2051J31231A3545e7032A73024
13000D19479o6252j59590N0285J1083F9582J25657a08028a0226j19491k47113
$$ plain form
13082 -71236 -231055 371692 -45519 113060 -45886 -79108 56327 115310 128380 151122 129980
13071 129980 456912 -13984 60100 271605 174121 -152702 -96889 34204 -10929 487355 180241
13059 351482 475075 232138 82007 -1669 92841 -46685 214166 258577 14805 -91790 128431
13047 214185 98374 -33021 271038 -4951 113787 33827 57303 -81291 -73402 -109290 26002
13035 389379 -140729 175100 -76669 -166014 536736 -71668 -103969 -6437 218779 147028 204154
13024 204154 -11818 56265 146845 113579 89191 -19614 87531 48268 150233 684747 67097
13012 -3148 -9326 -118503 -197868 221761 52241 307646 82051 213282 13545 -57032 173024
13000 419479 353227 193637 243922 255005 69582 195239 -108028 -10226 -129717 -376830
12990c76830I2392a77688B7288J77398d8840a660A77259b7698r2224A84129i0266
12978B40730C1835K35152a17287k43607C6486J16697b34835a1398H7918P0019
12968A57937a43491M7221l11296J37448e4705B4518J29993K51691i1893b8421
12957E37825k30771b40628e0022k3155B30529d2536k930j64354A09082b1878e633
12945F698J31854o4783J48736F2073b08043M8329A82329a24582k9148k59304F6340
12933B90498J18019I2879J30870J55796e9577m021B16990b37535A28003m7506
12923H0497b08427C0115i8159p8846A36060o4015L7553J19447B3092Q1310R1988
12912A96390a49653C9080a15138c8579A50868g12374a42420e1248g070A1255a29926
$$ plain form
12990 -376830 92392 -177688 27288 204686 -48840 -1660 177259 -27698 -119922 184129 -90266
12978 240730 31835 266987 -117287 -360894 36486 153183 -234835 -11398 87918 157937
12968 157937 -143491 -96270 -407566 -270118 -54705 24518 154511 406202 -91893 -28421
12957 537825 307054 -240628 -50022 -73177 230529 -42536 -45466 -209820 109082 -21878 -5633
12945 6698 138552 73769 222505 62073 -208043 -159714 182329 -124582 -153730 -413034 66340
12933 290498 408517 92879 223749 379545 -59577 -63598 216990 -237535 128003 80497
12923 80497 -208427 30115 -98159 -177005 136060 72045 109598 229045 23092 104402 196390
12912 196390 -149653 39080 -115138 -38579 150868 -712374 -142420 -51248 -7070 11255 -129926
12900A02711P86a39605A11605N3170b04468a3097p6785A34357k1630K1505k048
12889A32184a86845a3242H8538J54401q1778a6473D16410I3365a11872A89230
12878g632b152r4339B5195a557B5479J64275C649a79683a3741e14D874N41090
12866E45964A04119b63422A57282b78437a17208H4346B1508i3977B6364i9082
12855F6820N9365j7486h191r9128B9820A0390O0356g1513A17560a43517B22283
12843B96884A16335f9305k05182F9406B0580d3721C49090d6898A72994d9065A96457
12831b21672A35856b8357l04462a19503F8319f3994j88157e1439n1251A19050
12820H3816K4407a41266D23954i0499m9766B52740I4861a5536j5158l0399k6309
$$ plain form
12900 102711 103497 -139605 111605 164775 -204468 -13097 -89882 134357 112727 134232 132184
12889 132184 -186845 -13242 88538 242939 161161 -16473 416410 93365 -111872 189230
12878 -7632 -2152 -96491 25195 -1557 25479 189754 3649 -179683 -13741 -514 4874 545964
12866 545964 104119 -263422 157282 -278437 -117208 84346 21508 -93977 26364 -99082
12855 66820 126185 108699 -8191 -107319 29820 10390 70746 -71513 117560 -143517 222283
12843 296884 116335 -69305 -274487 69406 20580 -43721 349090 -46898 172994 -49065 196457
12831 -221672 135856 -28357 -332819 -119503 68319 -63994 -252151 -51439 -102690 119050
12820 83816 108223 -141266 423954 -90499 -140265 252740 94861 -15536 -30694 -61093 -87402
12809h7402p8008j3412d2629C6340K6252a5453A84299E6391b1873A14039b80270
12797a67740B81403a0332m6799i319H5308b6150I6457J76758F5796N1516O6104
12786A83416a38956e3175F2767b20487R2381L1437I9757a70240b0961E2498j7243
12775C5255N8796b5194j12273A53700R4696h6613A04596a22499j5275E6201Q4425
12764A40626n5772b62115A95412D6726H565b9689k4618p3407e0122a2868D8007
12752B4050K3692a53603C7444J53551B1526a31430c2477l8124F2143a9914A633
12740C5783f6445A10029G071j749L0044O0594J02485g1863l0161D432L24054f1730
12727C15581C6042c04981A5496J29844b1383k4253j56659R1957A80500m9720K82679
$$ plain form
12809 -87402 -165410 -178822 -42629 36340 62592 -15453 184299 56391 -21873 114039 -280270
12797 -167740 281403 -10332 -57131 -9319 85308 -26150 96457 273215 65796 117312 183416
12786 183416 -138956 -53175 62767 -220487 -128106 -96669 99757 -170240 -20961 52498 35255
12775 35255 94051 -25194 -137467 153700 248396 -86613 104596 -122499 -137774 56201 140626
12764 140626 84854 -262115 195412 46726 8565 -29689 -54307 -127714 -50122 -12868 48007
12752 24050 47742 -153603 37444 190995 21526 -131430 -32477 -70601 62143 -19914 1633
12740 35783 -66445 110029 7071 5322 35366 95960 198445 -71863 -102024 4432 328486 -61730
12727 315581 36042 -304981 15496 145340 -21383 -45636 -202295 -110338 180500 130780 413459
12716D13459a97082C8334b03888I7142l3027Q8280m514d2780D19430j59881n9229
12705B00320J1333a8407j35157C20410A57800K39685j15485I7376C6834m176g6558
12693a21993M9522j69963H5044a49592I6107c0747a1197j16526D2348n108J67795
12682B05035i537A90906p538K10303B2567a00772H5210L96863B21712N5248j38414
12671A38546j9757N4462P5891F9716g0189C4105r766a23731A9339d2711A51455
12659c9359I0716J37516a51010K1495c4510A99950B0758L4074p929K10067q4158
12648A72812J49082b3886K985o4320A25866L619c26307B98519H6563a30756C13929
12636a84944f8581I6995m1543m521L19023A872b14420H5194B129J28446O8674
$$ plain form
12716 413459 -197082 38334 -203888 97142 64115 152395 147881 -42780 419430 259549 200320
12705 200320 211653 -18407 -153564 320410 157800 397485 282000 97376 36834 32658 -76558
12693 -121993 -72471 -242434 85044 -149592 96107 -30747 -11197 -127723 42348 37240 205035
12682 205035 -9537 190906 183368 393671 22567 -100772 85210 482073 221712 276960 138546
12671 138546 118789 173251 249142 69716 -70189 34105 24339 -123731 19339 -42711 151455
12659 -39359 90716 228232 -151010 -129515 -34510 199950 20758 54832 46903 256970 172812
12648 172812 321894 -23886 -20901 -85221 125866 129485 -326307 298519 86563 -130756 313929
12636 -184944 -68581 96995 55452 50931 369954 1872 -214420 85194 2129 130575 199249
12625A99249R3945A30648R4555C5719K8018j1118J9101J53926l0653e2558h93
12613B00004J0207e4824F479f3178D9765l287J38608G0582L84713A52608D3442
12601B14588l772J53376J6972A57930o7140L05166b61271H8883j7695e409m3032
12590d8441C29891m0148a71851m7317j7018e8005E0842K11776c75897D66807b3968
12578a1217r6753o260E2518a10772A52280Q0418a0486E8290k5275i9973p7249
12567a77222F5518J08889J30091m8013G572K50406c7949A08682L15085B09940
12556C41956r5768d10783A57552G5887a04211j21396A25646F1726b2595C15947
12545b52119A077O8764a14957e1993A311c61216H6340K22175E3943a10625j78467
$$ plain form
12625 199249 293194 130648 225203 35719 63737 52619 71720 225646 194993 -52558 -893
12613 200004 210211 -54824 6479 -63178 49765 46478 185086 70582 455295 152608 43442
12601 214588 210816 364192 381164 157930 90790 395956 -261271 88883 71188 -5409 -48441
12590 -48441 329891 289743 -171851 -219168 -236186 -58005 50842 262618 -375897 466807 -23968
12578 -11217 -107970 -114230 52518 -110772 152280 232698 -10486 58290 33015 -99973 -177222
12567 -177222 65518 174407 304498 256485 7572 257978 -37949 108682 423767 209940
12556 341956 246188 -410783 157552 75887 -104211 -225607 125646 61726 -22595 315947
12545 -252119 1077 69841 -114957 -51993 1311 -361216 86340 308515 53943 -110625 -289092
12534b89092C74626a16824m9988n8366g5906A12086D8704a72414A14892A9747
12523B21881b76193c3483B27429C6327K6297a14124d2995G9207Q6979e8461B70268
12511a42543L8482d6104A61980A6776a72234c5798q3081I2515J27228J00326a48851
12499B5330c9355D1218J91845E0944a93813c9460r7444A23804l025g507j39909
12488a47416A84415d0383A31138D5540j0945a03841m44183e422H8653a30364q913
12477a39277K8639k88691a60333b7238C22175A7883J04954a63532O1558k49946
12467c51920a67170g6027p0142f7301B5631a2180C5424J85235c8708B59024r8336
12456A60688j2646L395b01972B82581H8185c7309g184j74942e5121A81807H0076
$$ plain form
12534 -289092 374626 -116824 -166812 -225178 -75906 112086 48704 -172414 114892 19747
12523 221881 -276193 -33483 227429 36327 62624 -114124 -42995 79207 166186 -58461 270268
12511 -142543 -104061 -46104 161980 16776 -172234 -35798 -118879 92515 219743 320069 -148851
12499 25330 -39355 41218 233063 50944 -193813 -39460 -136904 123804 120779 -7507 -147416
12488 -147416 184415 -40383 131138 45540 34595 -103841 -548024 -5422 88653 -130364 -139277
12477 -139277 -110638 -399329 -160333 -27238 322175 17883 122837 -163532 -101974 -351920
12467 -351920 -167170 -76027 -146169 -67301 25631 -12180 35424 220659 -38708 259024 160688
12456 160688 148042 151437 -201972 282581 88185 -37309 -7184 -182126 -55121 181807 80076
12444C19928d52003a60983e0054D8251c7085j06251d9295A75550Q9192N8496f4642
12432A6324b71423J29727I7546J40921c67901d1627F0978A9916J63144D68K71439
12421B71907c8303k48826D9834R5323j9940J82811b22038C0661J345E061a01966
12409A20648n7808h4288C1688i9690C01014b58520a24185d921F0202g112j44016
12398a51128B2868K6986J0769O9679J20466F4642J66919J16539A27656K45916
12388C73572B391K14400j02985M372h2539j18672A85368c02381n4097E3292a86098
12376B8217N4965Q1683I317i7028D10727G3433b87653n3902J34407D562L07126
12365C11688b69704N8684R5271l1142B70313F3854b06163A12435J31945m1797
$$ plain form
12444 319928 -452003 -160983 -50054 48251 -37085 -143336 -49295 175550 264742 323238 -64642
12432 16324 -271423 -141696 97546 238467 -367901 -41627 60978 19916 183060 468 271907
12421 271907 -38303 -287129 49834 145157 125217 308028 -222038 30661 32006 5061 -101966
12409 120648 62840 -84288 31688 -99690 301014 -258520 -124185 -4921 60202 -7112 -151128
12398 -151128 22868 49854 60623 130302 250768 64642 231561 348100 127656 373572
12388 373572 2391 216791 113806 118178 -82539 -201211 185368 -302381 -356478 53292 -186098
12376 28217 83182 164865 9317 -97028 410727 73433 -287653 -341555 -207148 4562 311688
12365 311688 -269704 -211020 -115749 -146891 270313 63854 -206163 112435 244380 202583
12355B02583K59952c4958C0838g2637I3304d17436H9502b52404f0991j47495A06437
12343a63444m5797M7250I2533a8700j93438A66918h8382C51753j55452b56026
12332a9096B25808b1590j94584G3281c1881G9719a91318A86222a4797D17535I1530
12320a12010a4047C025J05810i2118L8497A21619J30411k7867k141M1912b01965
12308c90617J72907A32272m4364a39200A48230b21539C31310A0229K08742k5551
12298A93420a23207D2521K27838k7801q9667a17591A4951b98990h6714c7911C23352
12286C4771L22870j5549b9649o5188B88707n0289c7442B56484G024J15422C3747
12274B81828p1048M47610A51848R296a26400C22427B4269i4029C52122h71A14673
$$ plain form
12355 202583 462535 -34958 30838 -72637 93304 -417436 89502 -252404 -60991 -208486 106437
12343 -163444 -209241 -161991 92533 -18700 -212138 166918 -88382 351753 196301 -256026
12332 -19096 225808 -21590 -216174 73281 -31881 79719 -191318 186222 -14797 417535 91530
12320 -112010 -14047 3025 108835 -92118 -53621 121619 252030 224163 222022 263934 -201965
12308 -390617 -217710 132272 87908 -139200 148230 -221539 331310 10229 218971 193420
12298 193420 -123207 42521 270359 242558 152891 -117591 14951 -298990 -86714 -37911 323352
12286 34771 357641 342092 -29649 -94837 288707 238418 -37442 256484 7024 122446 33747
12274 281828 210780 658390 151848 161144 -126400 322427 24269 -94029 352122 -871 114673
12262A84723J89217p9522r2837a12781d5032D0934N0188K01087A22660J10358
12252B33018i9872B09803D5132K49347a50424j0138g4300P194H8867C4564d8486
12240b13887B10809h7625A54326E2901n203K24025J75686A65473C9376p010b9567
12228A32105J31639o3211P3803A36658m515o2116K53472I3707N7304n8967l0815
12217F1229K37461K1353J38407a20442A87846a20834C74698a62585B98918D8526
12206d0011A61377P0475p4850d38608C99786a20112A24337c23340B93919K34402
12196E28321C7383f9148C33507P1608e4187G7556j3788L26610A71852J24476K5171
12185C21499G0961N7597a08768A63125Q9736F7709L73271g6669D5972L28034D0253
$$ plain form
12262 184723 373940 294418 201581 -112781 -45032 40934 91122 292209 122660 233018
12252 233018 -99872 209803 45132 294479 -150424 -160562 -74300 -67106 88867 34564 -48486
12240 -213887 210809 -87625 154326 52901 47698 271723 447409 165473 39376 32366 -29567
12228 132105 263744 200533 274336 136658 132143 70027 323499 93707 151011 92044 61229
12217 61229 298690 320043 458450 -120442 187846 -120834 374698 -162585 298918 48526
12206 -40011 161377 231852 157002 -438608 399786 -120112 124337 -323340 293919 528321
12196 528321 37383 -69148 333507 405115 -54187 77556 63768 390378 171852 296328 321499
12185 321499 70961 128558 -108768 163125 252861 67709 440980 -76669 45972 374006 40253
12173e1214p9795A95753J08866p614R824B7363K64788c2154C7637K94378r5192
12162B36823g0789j77175b4949k44371D89471j61234j03603k8630J50362f3339
12151A07472J57676a82942C28221G7832l6051c77596A55269a07203A47560a27450
12140A1431a7743A25989A1126L14870a17749d6958F2843O2920E9367K34143h4237
12128d55699a55600D79125a4651B96796J45363l5934C3474L83545a66679A45481
12117A59482a34276l8581G8901h8394l1997B7516d08891A9589L0683a68959d8608
12105B51379A8906K06772p1963J4075b41355A86699d0783k0590A22020a16257
12094c389m7264j95522M6030A31508i1183B59890a38603j5178A99197c44866A5349
$$ plain form
12173 -51214 -131009 195753 304619 297005 306829 27363 292151 -32154 37637 332015 236823
12162 236823 -70789 -247964 -24949 -269320 489471 328237 224634 196004 346366 -63339
12151 107472 265148 -182942 328221 77832 41781 -377596 155269 -107203 147560 -127450
12140 11431 -17743 125989 11126 325996 -117749 -46958 62843 125763 59367 293510 -84237
12128 -455699 -155600 479125 -14651 296796 442159 406225 33474 417019 -166679 145481
12117 159482 -134276 -172857 78901 -88394 -120391 27516 -408891 19589 50272 -168959 -48608
12105 251379 18906 225678 153715 167790 -241355 186699 -40783 -61373 122020 -116257
12094 -3389 -50653 -246175 -200145 131508 -91183 259890 -138603 -153781 199197 -344866 15349
12082a7203D38759o9221J237636Q25126A109053n02947I0263B7861J31136b00230
12071A55517R4387i0978H553a79530K1712B78480b7455B97789C3029a56783D7505
12059C5444b27390C2366K34576b14528I5160b538k02211b5564A66502i6825I7935
12047G5790a18021A41451B7803f0139j08230L7820A09341a64827o7779I0619c790
12035A05944b49181A88225E8246J20473d530j30156B395J26465b73070a05227
12024b8733A86702A2132a19316B99679A46340K9606a23320L9199A8114h477B5667
12012b3271B0250d9233B28677a48204k02C44895d4319G597d59944a03256k60502
12001c63758J55348N4125D9635g7536l45598J50429C1421A606K33957c01041r2193
$$ plain form
12082 -17203 438759 369538 1607174 2432300 1109053 606106 90263 27861 158997 -200230
12071 155517 249904 -90978 8553 -179530 -157818 278480 -27455 297789 33029 -156783 47505
12059 35444 -227390 32366 266942 -214528 95160 -2538 -204749 -25564 166502 -96825 97935
12047 75790 -118021 141451 27803 -60139 -168369 -130549 109341 -164827 -232606 90619 -3790
12035 105944 -249181 188225 58246 178719 -4530 -134686 2395 128860 -273070 -105227
12024 -28733 186702 12132 -119316 299679 146340 175946 -123320 -84121 18114 -8477 25667
12012 -23271 20250 -49233 228677 -148204 -148406 344895 -44319 7597 -459944 -103256 -363758
12001 -363758 -208410 -154285 49635 -77536 -423134 -272705 31421 1606 235563 -301041 -393234
11990c93234f0416j41782A47518L0530Q536b08920j70426A92225c37229g1464
11979A1553K19876m8381a87503B79924p2958B7744b3897C9945b27292i9223l56576
11968d55799b11453A27420p773K74600e9089H5067a53806A3762K15450c07503
11957a7575C37595b42675B52024b48757K504f5667l0537C2337b76602a05400A45188
11945b73588f3723A09387b84791c226B7568a16805b5228A06203L55360h9282l4088
11934a23370e6586D1615K45912c34617A26234m2339C5638J48079e6158B47288
11923d0430F3702k6281c7972A02397a51407d5210A20119b62887e8248D7731l915
11912D3816b97322F6762b60772M1261A73643h3714A15210b49447B30329f0110
$$ plain form
11990 -393234 -60416 -202198 147518 178048 186584 -208920 -379346 192225 -337229 -71464
11979 11553 231429 183048 -187503 279924 206966 27744 -23897 39945 -227292 -99223 -455799
11968 -455799 -211453 127420 119647 394247 -59089 85067 -153806 13762 229212 -307503
11957 -17575 337595 -242675 252024 -248757 -246253 -65667 -96204 32337 -276602 -105400 145188
11945 -273588 -63723 109387 -284791 -3226 27568 -116805 -25228 106203 461563 -89282 -123370
11934 -123370 -56586 41615 287527 -334617 126234 83895 35638 183717 -56158 247288
11923 -40430 63702 37421 -37972 102397 -151407 -45210 120119 -262887 -58248 47731 43816
11912 43816 -297322 66762 -260772 -219511 173643 -83714 115210 -249447 230329 -60110
11901B99907h8813n9579A13304D6719b32200B7371a05371E861f2532l07685C37236
11889f544n7453l77065J59883B0439P4764M6272a41883D09176b90739C17309b67560
11877C25431b88948P5358j32204a42075o5388j55035A24679D3458f4030C3931
11866B81490j32488a3932B99248k4343c501A35796D9969c50412b502B77330H0441
11854a36767L4783l76712A17089J02948A5602a83301d2221l30253J05423J22455
11844a44596k10650B21799b72145E5509c74726h48C36129A63618a74910k9111
11834b04021E0881O435K36197f8790F5298B2643i5733F5468b05096J634H066g3990
11821a8597G1908a40122B72917q1600h0092i144B20448c325H0934b19786A66220
$$ plain form
11901 299907 -88813 -148392 113304 46719 -232200 27371 -105371 5861 -62532 -370217 337236
11889 -6544 -63997 -441062 -281179 20439 95203 141475 -141883 409176 -290739 317309 -267560
11877 325431 -288948 -213590 -345794 -142075 -207463 -362498 124679 43458 -64030 33931
11866 281490 149002 -13932 299248 274905 -3501 135796 49969 -350412 -2502 277330 80441
11854 -136767 -101984 -478696 117089 220037 15602 -183301 -42221 -372474 -267051 -144596
11844 -144596 -355246 221799 -272145 55509 -374726 -848 336129 163618 -174910 -204021
11834 -204021 50881 57316 293513 -68790 65298 22643 -95733 65468 -205096 -203462 8066 -73990
11821 -18597 71908 -140122 272917 191317 -80092 -9144 220448 -3325 80934 -219786 166220
11809a80947B42805c5984J5626C7224g1057k89791h2446A20077p477C681a40835
11797b80725A73144a16699C17909b8249A60685h8093r5858D540b40554A51254
11786d434j62826g3530A32507f2517j61733D16066D7853b44997A96219b4641j33479
11775a58120g0068q4300A55172g0193k42297N8107G6583a03243M2614J6330l9622
11764h3921o4121F3733N6143K64661n0094A6904a3876B5525J20601b16228E1573
11752B06208e3722p1505A3067b20581L292Q6232a3772B95351A18348K1476B0590
11740a61120e6227H6484L0355b4835m0737I5209H857J0477K27887C3196Q5596
11729A18792c6826A73703n5811a1419j4887j03214N4326I0959g8572A60544M5749
$$ plain form
11809 -180947 242805 -35984 -20358 37224 -71057 -360848 -82446 120077 112600 3681 -140835
11797 -280725 173144 -116699 317909 -28249 160685 -88093 -183951 4540 -240554 151254
11786 -4434 -167260 -73530 132507 -62517 -224250 416066 47853 -244997 196219 -24641 -158120
11775 -158120 -70068 -154368 155172 -70193 -312490 -254383 76583 -103243 -60629 -44299 -83921
11764 -83921 -148042 63733 119876 384537 334443 16904 -13876 25525 146126 -216228 51573
11752 206208 -53722 -125227 13067 -220581 -217289 -131057 -13772 295351 118348 139824 20590
11740 -161120 -56227 86484 116839 -24835 -65572 95209 8857 19334 247221 33196 118792
11729 118792 -36826 173703 117892 -11419 -26306 -129520 -75194 90959 -78572 160544 206293
11718B06293k8217k4122i4250k46314b357C45813I2790k9728B6865J9802J87738
11707B34405I4247A0838L61972A46884k5306D1069h0411q4791B14333a74072f4270
11695C07150H9824J54831I331a01077B61315k0679H8693N8092a05171a7938q8957
11684a06895D05742D2771N0005a18414A90677b59017j06380a67715O0550h297
11673a00761C0278K59769B6096J16547N1447J03830j23266O5810O6919E6923j3413
11662D3510A8246J81174g4436A05308J62250m3290J81698a6038l5550A58021a07914
11650b7628B4800a24758F3652J32623f7268E325J45029c80169A68558b47844C7582
11638B66301C7082Q7030b48257H7850a47050A6231P1782i8407k34636P6971M8591
$$ plain form
11718 206293 178076 153954 -94250 -340564 -2357 345813 92790 63062 26865 46667 234405
11707 234405 94247 10838 372810 146884 121578 41069 -80411 -165202 214333 -174072 -64270
11695 307150 89824 244655 9331 -101077 261315 240636 88693 146785 -105171 -17938 -106895
11684 -106895 405742 42771 92776 -118414 190677 -259017 -365397 -167715 -107165 -8297
11673 -100761 30278 290047 26096 142643 194090 297920 174654 240464 307383 56923 43510
11662 43510 18246 199420 -74436 105308 267558 224268 405966 -16038 -51588 158021 -107914
11650 -27628 24800 -124758 63652 196275 -67268 5325 150354 -380169 168558 -247844 37582
11638 266301 37082 124112 -248257 87850 -147050 16231 88013 -98407 -333043 -256072 -207481
11627b07481e2757H6983B7363h2923K6780l03762a1003D0976L6503C3162b9701
11615F9578K1162A415J13227K7710P5492b2209A61573c7249C73296a38313f3159
11603A7581J39071n6630J28407E5044d6264j24387F585R7071K44753f9202A75388
11591d15222a12902c1585m8751P889C9738b6821G5743Q8636O2956LH7908J83989
11579B71897r1930b05715L1113M9615F1126J9648a30167A88437a53550j70570
11569c24120B14739N338a48405A86353a53562F8325L1542J70671b58314d282B13388
11557A75579j7667n3916A2129P121F866J22923d9623A27082p108E3190j7671J02805
11545A38324a74014B80355e0120H6877b41308B10199q1423n1509A7105M05797
$$ plain form
11627 -207481 -52757 86983 27363 -82923 -56143 -359905 -11003 40976 77479 33162 -29701
11615 69578 90740 1415 114642 142352 217844 -22209 161573 -37249 373296 -138313 -63159
11603 17581 156652 100022 228429 55044 -46264 -170651 6585 103656 348409 -69202 175388
11591 -415222 -112902 -31585 -80336 -72447 39738 -26821 75743 164379 227335 227338 87908 271897
11579 271897 179967 -205715 -174602 -124987 61126 80774 -130167 188437 -153550 -324120
11569 -324120 214739 220077 -148405 186353 -153562 68325 99867 270538 -258314 -4282 213388
11557 175579 157912 103996 12129 19250 6866 129789 -49623 127082 119974 53190 35519 138324
11545 138324 -174014 280355 -50120 86877 -241308 210199 128776 77267 17105 422902
11535D22902j05524a10307L5344E34235A06218P4093a59452E4510f1415A93888
11524A0989c8695A76308L2257F6898R2247B5971L49669b2189N719B44290i4076
11512B51362b71465a03268K608C21470I427b0618B68737A04938b05481B8777K13437
11501B42214j4564K3717r8004B5261J40870J2039K92615a33062A1973K54201n0199
11490B15975C4305d9399C52116A22802E9585e0168q5068A54125J28924D4820M01845
11479D46665j84849l451i0833A73454N0395D8684J58180a59938B39019J70064
11469D09083J96048B76704l9459a22280A54230k1231k4834J8958B8956d5337E0655
11457I8672J55039l1125N4479n2431m9042d8322A10723E852g2143I8177J14260
$$ plain form
11535 422902 317378 -110307 -74963 534235 106218 180311 -159452 54510 -61415 193888
11524 10989 -38695 176308 208565 66898 159145 25971 375640 -22189 -16470 244290 -94076
11512 251362 -271465 -103268 -100660 321470 9427 -20618 268737 104938 -205481 28777 242214
11501 242214 227650 251367 153363 25261 166131 178170 470785 -133062 11973 266174 215975
11490 215975 34305 -49399 352116 122802 59585 -50168 -135236 154125 283049 44820 446665
11479 446665 261816 258365 -90833 173454 223849 48684 206864 -159938 239019 409083
11469 409083 605131 276704 237245 -122280 154230 132999 108165 127123 28956 -45337 50655
11457 98672 253711 222586 277065 224634 175592 -48322 110723 5852 -72143 98177 212437
11446B12437F9810K00708J40146q8102h8537H6813k762a61678C62842A31568f0058
11434b8169K889A30840a0761G8626b79304B32266p0021o6092P2082b69566G9915
11422b3602E6107L0297a17114B06467D8672J67002I5625b67127c3703H3677c71115
11410C8159a58847G7623a82408G4536M9951b0990A93771p8535c4116D22775a87663
11398a88835C19360A47098L0189k2573c5139C2723a49203G659J71137D8226g5897
11386b09699B49504b420k09429j9982C8213J74617l6922J894b393l0530A38595
11374I2800a64824h36A64000a22038M7219j28179A10120a70257L8940L9507P264
11363h4546A26633a08348Q717D69J02195q139m6337f1299K5643p2334r7267C29702
$$ plain form
11446 212437 69810 270518 410664 322562 -88537 86813 84051 -161678 362842 131568 -60058
11434 -28169 -25280 130840 -10761 78626 -279304 232266 162245 96153 168235 -269566 79915
11422 -23602 56107 86404 -117114 206467 48672 215674 95625 -267127 -33703 83677 -371115
11410 38159 -158847 77623 -182408 74536 124487 -20990 193771 115236 -34116 422775 -187663
11398 -188835 319360 147098 177287 154714 -35139 32723 -149203 7659 178796 48226 -75897
11386 -209699 249504 -2420 -211849 -231831 38213 212830 175908 177802 -2393 -32923 138595
11374 92800 -164824 -836 164000 -122038 -74819 -202998 110120 -170257 -131317 -91810 -84546
11363 -84546 126633 -108348 -99631 469 102664 94525 48188 -61299 -35656 -107990 -205257 329702
11350d7165A88487c9846j28359d3438C42747A03846M09820G4804I004R3166a77887
11338A33620I745J4677J94327b9691A63342a74346F1237b98566B39024F2699b71984
11326A4252d51816E8319C671g3397A13875a98113B2963b5618k32031B47729a796
11314b31556Q9199O6555A85304o0158h6625m1966B0035h0667C29312a44737E2536
11302d8032k148A01980b79162E9201e26303G9381i1375B13129H7937a61797A33453
11290f335A22243J95795i2778K5707j70331q6100H5494k0630a36188f7438B2121
11278E6112b13370A85911B9581a32038e0125k93232J54493C8088b0210l2074k00933
11267b53217a22806K0622D53a71827P3081M1149H0767d36146b02523C3273h7397
$$ plain form
11350 -47165 188487 -39846 -168205 -43438 342747 103846 513666 74804 9004 102170 -177887
11338 133620 9745 24422 218749 -29691 163342 -174346 61237 -298566 239024 62699 -271984
11326 14252 -451816 58319 3671 -73397 113875 -198113 22963 -25618 -257649 247729 -1796
11314 -231556 -142357 -75802 185304 125146 -86625 -128591 20035 -80667 329312 -144737 52536
11302 -48032 -50180 101980 -279162 59201 -526303 79381 -91375 213129 87937 -161797 133453
11290 -6335 122243 318038 -92778 -67071 -237402 -323502 85494 64864 -136188 -67438 22121
11278 56112 -213370 185911 29581 -132038 -50125 -343357 -188864 38088 -20210 -52284 -253217
11267 -253217 -122806 -102184 453 -171827 -98746 -57597 80767 -436146 -202523 33273 -87397
11255b07066c0509C9906R7012a475l46729B3268e5932J639N703J3629j29865B64848
11242a29912A01493d68320J75706h7214A39617D0021N6980j2477e5059H2080b47345
11230b00869A93162J17686q8664o9830C0584a11843D9823a02070A54508E0818
11219F8870d7591B9024j2474a20956N3741l40981i4852A0498J70336c94828C3415
11207A27296a86561k900J6564F455P2230k3392a27497q7070A06839B2228d87400
11195g0903C77108H489c36133P1002H4796M7474C7526J45904b36676o5876b7529
11183a93252F7948K78576a8735j16575I8502k0611q262a74760Q7230l5105d603
11171a74774H3345c23631a7640p017F9249a25473e0267p2781d3851j15726C01197
$$ plain form
11255 -207066 -30509 39906 136918 -1475 -348204 23268 -55932 -54293 -48590 -34961 -164826 264848
11242 -129912 101493 -468320 -292614 -87214 139617 40021 97001 84524 -55059 82080 -247345
11230 -200869 193162 310848 222184 152354 30584 -111843 49823 -102070 154508 50818
11219 68870 -47591 29024 16550 -120956 -67215 -408196 -94852 10498 180834 -394828 33415
11207 127296 -186561 -189461 -172897 6455 78685 55293 -127497 -214567 106839 22228 -487400
11195 -70903 377108 8489 -336133 -265131 84796 132270 37526 183430 -236676 -302552 -27529
11183 -193252 67948 346524 -18735 -135310 98502 77891 69629 -174760 -87530 -122635 -4603
11171 -174774 83345 -323631 -17640 -24657 69249 -125473 -50267 -123048 -43851 -159577 301197
11159e2199A88230F6761a34613A5272a42783b7028l57969E8336i1513I846f708
11147C09729b84175J40415A05186a3744C0113F102M4517a99864f4625A05565c9676
11135d32517A10106a55723A31048K45890J88582D1636c9436A62501a49792A24988
11124B89582o556a39487M8976B00214p6975J6517J6006J33358I5304E081O3778
11113F8859M8532a14276A75978J98088A75163m4467a10666B256a50878A52720
11102A78821k7011K21465d8171p571C16002c2883B30184J95826j75119j3664L86263
11091F23490A41980L2098M8746K3583J42939j18454F9132L7669K87993G630b8170
11079C29966H2582L06228j02416A14157R4552N8472M6004h524D79401m5948D5791
$$ plain form
11159 -52199 188230 66761 -134613 15272 -142783 -27028 -384997 58336 -91513 9846 -6708
11147 309729 -284175 -143760 105186 -13744 30113 6102 50619 -199864 -64625 105565 -39676
11135 -432517 110106 -155723 131048 376938 565520 41636 -39436 162501 -149792 124988
11124 289582 283026 -139487 -90511 200214 123239 139756 155762 289120 95304 5081 68859
11113 68859 117391 -114276 175978 374066 175163 130696 -110666 2256 -150878 152720
11102 178821 151810 373275 -48171 -55742 316002 -32883 230184 426010 250891 237227 623490
11091 623490 141980 174078 222824 246407 389346 270892 69132 106801 394794 7630 -28170
11079 329966 82582 388810 286394 114157 208709 267181 313185 -8524 479401 433453 45791
11067A38350J75215J2689Q2667A08763J7452K84072j8581j33326K90308K07279
11057G55967m0690k39905J25745j73454M72068O3983m62138K10059L04807l76243
11047F40199J46778P2015m1616J22096o0646J27449o4971j99585M3208j78856
11037F06071L3261J14049N9585L1316j25573K68419k46272q3791o9197L13137
11027I01005o9104k22231P0666R8078p2273m4011L13187m24107K91671C78494
11016F59218J42757k36761J28898M7120k96367L10949j19314j76225L28211j0197
11006G78289l13463P5760L00967k44578K60614k36562L40211r4191C44750L03913
10996F48663j35624M77351k23655L25261l40762L47634l68419O0915J52111J47445
$$ plain form
11067 138350 313565 326254 408921 108763 126215 410287 391706 258380 548688 755967
11057 755967 715277 475372 601117 427663 899731 963714 501576 711635 1016442 640199
11047 640199 786977 858992 817376 939472 878826 1006275 941304 741719 784927 606071
11037 606071 639332 753381 812966 844282 718709 987128 740856 657065 587868 901005
11027 901005 831901 609670 680336 778414 706141 662130 975317 551210 842881 378494
11016 659218 801975 565214 694112 741232 444865 755814 636500 460275 788486 778289
11006 778289 464826 540586 841553 596975 857589 621027 961238 867047 344750 648663
10996 648663 513039 990390 766735 1091996 751234 1098868 730449 791364 943475 1090920
10986A090920p0819j71657L09633j13832j91096L27710L10160j99855K23108j83318
10976A330954J51514J25881O01424L79118R5766J47156J27216o25226N11114k69384
10966B575533k18033l80017L10539k93161l46205M59913k09405k00719J00869
10957A799314m5514j6626J47014l33294P1661j71628m49379J89133j58373D97608
10946H89492m16600J64196l16664H64O70688l18227j54815J08336m2439A05271
10935B21928o2975o3106R7522K49948j75537O4962l7955l149D417K18276i9195
10923A6790L87970H2928d2310B13561b658B47869B3976i1810A87299E8344c08027
10911a43274A06827b40781h4299I235L2160K01342L0571J5964b825l4256j0989
$$ plain form
10986 1090920 1020101 848444 1158077 1044245 853149 1180859 1491019 1291164 1514272 1330954
10976 1330954 1482468 1608349 2209773 2588891 2684657 2831813 2959029 2333803 2844917 2575533
10966 2575533 2357500 1977483 2288022 1994861 1648656 2108569 1899164 1698445 1799314
10957 1799314 1753800 1737174 1884188 1550894 1622555 1450927 1001548 1190681 1032308 497608
10946 889492 472892 637088 320424 864 671552 353325 198510 306846 264407 105271
10935 221928 158953 95847 193369 443317 267780 332742 294787 291638 4417 222693 -99195
10923 16790 404760 82928 -42310 213561 -2658 247869 23976 -91810 187299 58344 -308027
10911 -143274 106827 -240781 -84299 9235 41395 242737 273308 289272 -2825 -37081 -48070
10900d8070j27364J9554a6570k93372D0620d7565k18435D0530c81797a4010A40824
10888a77676m1639O1711B5784A1007e40771a12719B9832J66448i1758C14144A25410
10876C04566d3128j02325g0273A26625J98175b2895m1522J4979k69259B40190
10865f7090l00096a32790a010B37353a89234A18543L3363h5294H4860K71133A73065
10853A53161a9579j27957r0656O384a14292n1680e3048k43197N0334C80537A22091
10841a07186j31753B76653b46700F9919e5633l5939A61161c72616c2215n2484
10831h4699G4481L38399g9731R329B21194g3471E2855h1859j69504B32735I2588
10819a19188b9930j2965j19637b8400j52178B80973b40373f1766B0784J10535
$$ plain form
10900 -48070 -175434 -155880 -16570 -309942 40620 -47565 -266000 40530 -381797 -14010 140824
10888 -177676 -219315 -157604 25784 11007 -540771 -112719 29832 196280 -91758 314144 125410
10876 304566 -43128 -145453 -70273 126625 324800 -22895 -64417 -49438 -318697 240190
10865 -67090 -367186 -132790 -1010 237353 -189234 118543 151906 -85294 84860 355993 173065
10853 153161 -19579 -147536 -238192 -231808 -114292 -165972 -53048 -296245 -245911 380537 122091
10841 -107186 -238939 276653 -246700 69919 -55633 -91572 161161 -372616 -32215 -84699
10831 -84699 74481 412880 -79731 -70402 221194 -73471 52855 -81859 -251363 232735 92588
10819 -119188 -29930 -42895 -162532 -28400 -180578 280973 -240373 -61766 20784 131319
10809A31319a41794B4413d66958J94344B3709a18788N7859B74032l1223a51341
10798a2457A35306A558a10508H2841O1266K219c10699A2253a64350j99792R4793
10787b69349F476J25993n501b47300d2219l6801A92645c9355n6459Q66n8126m8182
10775b01256A53866h0758D019a78110F9310O3312a61160E3368b66834c7118j60204
10764a97322F9261K73537A09839R2124d06048B05720g7152c1402B78970j24269
10754A54701a30237L3130l5597A16919a29365I3405A2637a80218A64850a9809
10743C0987K3817b6638B09394C2858O194e6788I0405J7120K43142a11580E028
10731F1031j7613a76368A8929K4786A767c04012R6892q1788A54884a87916Q0128
$$ plain form
10809 131319 -141794 24413 -466958 -272614 23709 -118788 -60929 274032 242809 -151341
10798 -12457 135306 1558 -110508 82841 144107 146326 -310699 12253 -164350 -364142 -269349
10787 -269349 6476 132469 126968 -247300 -42219 -79020 192645 -39355 -95814 -94948 -153074 -201256
10775 -201256 153866 -80758 4019 -178110 69310 132622 -161160 53368 -266834 -37118 -197322
10764 -197322 69261 342798 109839 201963 -406048 205720 -77152 -31402 278970 154701
10754 154701 -130237 -97107 -132704 116919 -129365 93405 12637 -180218 164850 -19809
10743 30987 54804 -26638 209394 32858 39052 -56788 90405 107525 350667 -111580 5028
10731 61031 43418 -176368 18929 43715 1767 -304012 -207120 -288908 154884 -187916 -107788
10720a07788l9702E65b59929K0239O9330e1116j62888i0514q3346P4877D8303
10708b46689a13286A26290B7054a23311C7502J80524h3930I761a19529A39143
10697E8965a89852d7556j4500A19697A0294b70716h6421A08746N7712b70138p5218
10686c45356F5451N3430f3035m4680n7616L4183b2282j23852k44197A36761c06800
10674a02393F7591a15918A9462L45215b92713a0066D08283a43146A81980E9483
10663a47207b8403H7138B9234b69613b818q4824L6753A695P1812C1121L4363e4743
10650f5698A48842E5769a00647l9909N3326j4125B99596c38529i8320M736A60465
10638i4112B3638c7558j2369j80726C3558a62849H6563a46712o0067l7134A41666
$$ plain form
10720 -107788 -147490 565 -259929 -239690 -170360 -51116 -214004 -90514 -173860 -98983 48303
10708 -246689 -113286 126290 27054 -123311 37502 218026 -83930 9761 -119529 139143
10697 58965 -189852 -47556 -62056 119697 10294 -270716 -86421 108746 166458 -270138 -345356
10686 -345356 65451 118881 -63035 -107715 -165331 -131148 -22282 -146134 -390331 136761 -306800
10674 -102393 67591 -115918 19462 364677 -292713 -10066 408283 -143146 181980 59483
10663 -147207 -28403 87138 29234 -269613 -2818 -87642 -50889 1695 73507 31121 65484 -54743
10650 -65698 148842 55769 -100647 -140556 -87230 -101355 299596 -338529 -98320 -93584 160465
10638 -94112 23638 -37558 -49927 -230653 33558 -162849 86563 -146712 -206779 -243913 141666
10626b35235A33758h2319G6624J52775b19491j37237A06877b67727A97056j6750
10616A80306b08559j52995A36861k93D2226j6820P5794a39672o4376j8649c4220
10604a84748B0794b4099F1555b04338B8559f6377H7852m3418K00339a94350j3232
10593b07582g7695A86664b86549B45743a82777B93256j10656b73774J26825C6825
10582C667e488D3131b49265J22280B98694j47001G0551K6415N3976a73387A26825
10570c65341J75745d925o2738b8857B0238h815k19728A12046a13514k06622Q5530
10559b34606B32028b43624F1108K06540b5246I1861K23742C1606c48679A10327
10548b12970O4394B280a41199d3911k31019C86607D1236K54500B6190b22153q6038
$$ plain form
10626 -235235 133758 -82319 76624 229399 -219491 -356728 106877 -267727 197056 180306
10616 180306 -208559 -361554 136861 136568 42226 25406 101200 -139672 -204048 -222697 -34220
10604 -184748 20794 -24099 61555 -204338 28559 -66377 87852 44434 244773 -194350 -207582
10593 -207582 -77695 186664 -286549 245743 -182777 293256 182600 -273774 -146949 36825
10582 3667 -5488 43131 -249265 -126985 298694 151693 70551 96966 150942 -173387 126825
10570 -365341 -189596 -4925 -67663 -28857 20238 -8815 -228543 112046 -113514 -320136 -234606
10559 -234606 232028 -243624 61108 267648 -25246 91861 315603 31606 -348679 110327
10548 -212970 -148576 2280 -141199 -43911 -274930 386607 41236 295736 26190 -222153 -308191
10537c08191e2229k29015J37128n6210L6410c3547B23173f549k48426A69741E1575
10525b30633D0178a79629e1571q4289A52675P418m7206Q7940G2186J4766k5968
10514F0984a62097A45551a26408G409c1098j40338a9881r5320A257L35782a48102
10502A39561b73658h4036j24361f1793I7626J01774a86887J9891k89119b24518
10491d19179c8749A9583h5467L778B02061d5247k11282A30748b86102A91900F7952
10479E60534B46442L16133k45296K06367c92370G460hr841A83115b78302D3676
10467D04984B2717J45511G7628O78c07535a088r2124C52391q8236b41565A32823
10455b23247g171k81481B7741a77982p3997I2845a85716c6835A08951l3614b3647
$$ plain form
10537 -308191 -52229 -281244 -144116 -200326 -163916 -33547 223173 -6549 -254975 169741 51575
10525 -230633 40178 -179629 -51571 -135860 152675 160093 112887 200827 72186 86952 60984
10514 60984 -162097 145551 -126408 7409 -31098 -171436 -19881 -115201 1257 337039 -148102
10502 139561 -273658 -84036 -208397 -61793 97626 199400 -186887 -166996 -456115 -224518
10491 -419179 -38749 19583 -85467 -81689 202061 -45247 -256529 130748 -286102 191900 67952
10479 560534 246442 562575 317279 523646 -392370 7460 -8 -9849 183115 -278302 43676
10467 404984 22717 168228 77628 78306 -307535 -1088 -93212 352391 264155 -241565 132823
10455 -223247 -7171 -288652 27741 -177982 -251979 92845 -185716 -36835 108951 75337 -23647
10443A8968J95211A4842c101l4268A13439d44181G201a9516A7020R8628a2787
10431A06758J10866a65348A19264N0946d3686J962j14040k8908N1691J8353m3404
10420a58032b352m8750P832K1598k57599A61150c8228A82080f9539k8366j6352
10409a14257d4278j65797B62476I564b93736D62063b204j76765a177I2436D4709
10397c53319J30836J07319D1582i467j86353N9764C6933K00121j17981K9022R4824
10386B42919a66k39988A28498L4004J37110R0745A14613L70725e6666C95767a74386
10374B4864J66482M7117j14117J09059J78929R2031Q4084B71574M81423k37450
10364E15547P4317J21166j61126I3629h129A180a99978B88082D8710J80379r5597
$$ plain form
10443 18968 214179 14842 -3101 -37369 113439 -444181 7201 -19516 17020 115648 -12787
10431 106758 217624 -165348 119264 170210 -43686 -41724 -155764 -184672 -132981 -114628 -158032
10420 -158032 -2352 -51102 -43270 -21672 -279271 161150 -38228 182080 -69539 -97905 -114257
10409 -114257 -44278 -210075 262476 9564 -293736 462063 -2204 -178969 -1177 92436 44709
10397 -353319 -222483 -115164 41582 -9467 -195820 -136056 36933 237054 119073 148095 242919
10386 242919 -166 -240154 128498 162502 299612 390357 114613 485338 -56666 395767 -174386
10374 24864 191346 238463 124346 233405 412334 504365 588449 271574 752997 515547
10364 515547 589864 711030 549904 93629 -8129 1180 -199978 288082 48710 229089 133492
10353A33492R5272K36951j18919J15769K02916r0225j75976j45146K21321j23737
10343C51718R4631O5542q5193j73998m4275C125N54335B11068k052J46960A3287
10331A21395O1292a01985B21076B204J08706b00796D61798j03923j48085J34799
10321C44589a8766A77661J80956j43777K04072j26027E7234L5399J9724c04259
10310a8790D0449c83514g1971r9248D0674M16606C0235J95981G2481Q4805d03107
10298b57003J27164C99545b99769j30927D31478d66151A43153a52017j5734M7566
10288a20185N7537i038C1415h5513C774g5601c3404I469b15927j08526B16614
10276a55122K6983C00857A29017a77210c8479k9484j59436i9403A7991q53e77416
$$ plain form
10353 133492 228764 465715 346796 462565 665481 575256 399280 254134 475455 351718
10343 351718 446349 511891 426698 252700 208425 3125 557460 211068 209016 355976 13287
10331 121395 182687 -101985 221076 2204 110910 -200796 461798 357875 209790 344589
10321 344589 -18766 177661 358617 214840 418912 292885 57234 92633 112357 -304259
10310 -18790 40449 -383514 -71971 -171219 40674 457280 30235 226216 72481 157286 -403107
10298 -257003 -129839 399545 -299769 -430696 431478 -466151 143153 -152017 -167751 -120185
10288 -120185 -62648 -9038 31415 -85513 3774 -75601 -33404 9469 -215927 -324453 216614
10276 -155122 -128139 300857 129017 -177210 -38479 -67963 -227399 -99403 17991 17138 -577416
10264A26437c95125c5662j22481D4425N2325J37703M01052C9083M22615A31299
10253g2428C95571C2570a27966C16061o2148i6569p434o0840j29428o7034d5817
10241a54771G631d0416j14123B09161o393c6884A72364a42835B6817K63483B5530
10229A9184K4182e64855e1658r179o1668f0905I0448f1668j86815m6596J07003
10218a88076C63979G663L02110a89906f6435k5649B2967M7033b25836j4866D9140
10206b15835C6375a75125D5576J76301G1634b24042A07715A808R7664Q4802C0801
10194c860j89324n7582e8321j93847j1127a02166k2299l5393D610M8415K04659
10183B57684d32264b01505A55291a91074A28606a73988M6795B12099D8486K616
$$ plain form
10264 126437 -395125 -35662 -158143 44425 96750 234453 635505 39083 461698 131299
10253 -72428 395571 32570 -127966 316061 253913 -96569 -104003 -164843 -294271 -361305 -45817
10241 -154771 7631 -40416 -154539 209161 202768 -36884 172364 -142835 26817 290300 25530
10229 19184 43366 -564855 -51658 -60837 -122505 -60905 90448 -61668 -248483 -295079 -188076
10218 -188076 363979 7663 309773 -189906 -66435 -92084 22967 70000 -225836 -240702 49140
10206 -215835 36375 -175125 45576 221877 71634 -224042 107715 1808 99472 184274 30801
10194 -3860 -193184 -250766 -58321 -252168 -263295 -102166 -124465 -159858 4610 53025 257684
10183 257684 -432264 -201505 155291 -191074 128606 -173988 -127193 212099 48486 51102
10173E1102f2945j16791L9592I3130d67540A26439b4584p9104k5708D4251J50887
10162A95138B1481A9c13025i4463j0409p4976e5697J1179k41897D3828b91063
10150a06720A10658a32839H9268b83634A91266b15942E113e7850J8227j58228
10140a97851A7237b15265B11017H8766d44834A39560b51069l2420A7637c11839
10129E3358J854b36291B37195A01806a6236C5509b15263A29309c9039k72650J16094
10118a95595Q509I447f3529j24571A31798c38791a01875F4070h1707r1278l9008
10107b11993N1856o0860k34258J97763a18706B045a16654e6974N033k91642e0362
10095F9770a4219r4090A9110a3199A23708A4164J49982b87568j0751i9163A86876
$$ plain form
10173 51102 -62945 -179736 -140144 93130 -467540 126439 -24584 -103688 -129396 44251 195138
10162 195138 21481 19 -313025 -94463 -104872 -179848 -55697 -44518 -286415 43828 -291063
10150 -106720 110658 -132839 89268 -283634 191266 -215942 5113 -57850 -39623 -197851
10140 -197851 17237 -215265 211017 88766 -444834 139560 -251069 -283489 17637 -311839
10129 53358 55212 -236291 237195 101806 -16236 35509 -215263 129309 -39039 -311689 -195595
10118 -195595 -187086 9447 -63529 -188100 131798 -338791 -101875 64070 -81707 -172985 -211993
10107 -211993 -160137 -220997 -455255 -257492 -118706 2045 -116654 -56974 -51941 -343583 -50362
10095 69770 -14219 -108309 19110 -13199 123708 14164 164146 -287568 -298319 -99163 186876
10083a77706B7162a35726N9657A40100a73989D15066F5484j6425a66025j42944
10073c08969C95065h3052n473k07849M383j23692J90049L0579h7027k01070i148
10061c49058H3139L3177d40086g0993L0524A59326c41675G2959b05800p9201B10682
10049a29422b9170k02770d0057A09363a03671C01262a44077c1542j7827m42149
10039d91518a84926B36408i6844I8013J97941a1494k03062h3904j36783j63715
10029c84402e9058B1081f8636p2378l8843l04928J92679K1591k28967c9079j77516
10018b16595Q376Q977A61207n2915n3361e182o4197m4123j96553L4689j34004
10007d09370a72830j20946g9552k5072C84019a98771c343F3596K00392q9265p7403
$$ plain form
10083 -177706 27162 -135726 -76069 140100 -173989 415066 65484 49059 -166025 -308969
10073 -308969 395065 -83052 -88525 -296374 -291991 -415683 -225634 -195055 -87027 -288097 -9148
10061 -349058 83139 116316 -440086 -70993 -40469 159326 -341675 72959 -205800 -285001 210682
10049 -129422 -29170 -231940 -40057 109363 -103671 301262 -144077 -31542 -49369 -491518
10039 -491518 -184926 236408 -96844 98013 295954 -11494 -214556 -83904 -220687 -384402
10029 -384402 -59058 21081 -68636 -141014 -179857 -484785 -292106 -270515 -499482 -39079 -216595
10018 -216595 -208219 -199242 161207 108292 54931 -5182 -69379 -113502 -310055 -275366 -409370
10007 -409370 -172830 -293776 -79552 -104624 384019 -198771 -3343 63596 263988 174723 97320
9996I7320a30104o5541b6268p9884d5889j88417f9568A37767a25352m24373G2762
9984C02565a1847k28162A18727h016k30606B7140O8308e3355j24168B6265K8085
9973E4350c04948C07225a90720I4611J41332q2263p236b75701G1402D892O347
9962A1239P8362c24533A86935a00842j19369P5316j42465f5487G3129i6175j22440
9951b18615B81436d30990A35636q921a13201l6842l43013B80246a56583o9797
9941b26380j12284A75176b93646A8194R5389A9914a46737d6270A5933h9735J9616
9930g0119F1696J33014b16564K3732J5029I2785a18335J5564M962l487q269B6424
9917e0639A21014c40225I2785a07478A90591a1709j16149k63785j296A37476J82830
$$ plain form
9996 97320 -130104 -195645 -26268 -106152 -45889 -234306 -69568 137767 -125352 -549725 72762
9984 302565 -11847 -240009 118727 -8016 -238622 27140 95448 -53355 -177523 26265 54350
9973 54350 -304948 307225 -190720 94611 235943 153680 146444 -275701 71402 4892 11239
9962 11239 89601 -324533 186935 -100842 -220211 -144895 -287360 -65487 73129 -96175 -218615
9951 -218615 281436 -430990 135636 126715 -113201 -150043 -493056 280246 -156583 -226380
9941 -226380 -338664 175176 -293646 18194 113583 19914 -146737 -46270 15933 -89735 -70119
9930 -70119 61696 194710 -216564 -192832 -177803 92785 -118335 -102771 -97809 -101296 -109565 26424
9917 -50639 121014 -340225 92785 -107478 190591 -11709 -127858 -391643 -392939 137476 320306
9906C20306d5094m6547b4102n4239k72765e423j49093P5457n5857G6178h3017
9894b45948K3392g0192F2100i4891k49723A02431c30996a10345G2157c16097J55762
9883a60335A41367K1529i1959K0161k25664e119j1901g00o3858j23849j96227
9872c84634a16955D4611a40602A88845c584k14283J01081D7121A7154a55380j06379
9861b61759A07602c022j25195B5271J86302r8296a43021B90026A5003J07415J54259
9850B76677A00564n0128a53610l3996H6281a4325l9798C59458E9635J33053a29526
9838a13156j72602i5290J7069A51325g5389k12763f0798A48983E1380N6002e9095
9826i1030l14523a39249a7083n7393j21861q7890c7178k30038O4173A87337a65111
$$ plain form
9906 320306 -45094 -91641 -24102 -78341 -351106 -5423 -154516 -79059 -134916 76178 -83017
9894 -245948 -222556 -70192 62100 -94891 -344614 102431 -330996 -110345 72157 -316097 -160335
9883 -160335 141367 162896 -91959 -71798 -297462 -5119 -17020 -700 -64558 -188407 -384634
9872 -384634 -116955 44611 -140602 188845 -3584 -217867 -116786 47121 17154 -155380 -261759
9861 -261759 107602 -3022 -128217 25271 211573 113277 -143021 290026 15003 122418 276677
9850 276677 100564 50436 -153610 -187606 86281 -14325 -54123 359458 59635 192688 -129526
9838 -113156 -285758 -95290 -78221 151325 -75389 -288152 -60798 148983 51380 107382 -59095
9826 -91030 -405553 -139249 -17083 -74476 -196337 -284227 -37178 -267216 -203043 187337 -165111
9814A60253n1345f0215A31771i0843n6701k5327e7925A30621b93347e5849j81011
9803b36860h5652r5350F125a04225A07411b59539C11968B2531K4226b54723A11166
9791B22360h1364l2013G2659Q8062K6796a7211A43227b62854E4067O3664c77058
9779a06786n211j68460I6108M43e9879l4250A3313b48550a5426q6920j05199O7251
9767a40294E0800A1111L0611a15975e5079J2682A75071d2086l90879A62574d07780
9755b60449k33327a59300F6539j7863g0956k20211i2648J2417F5430e58607A98284
9743f2956J3526m7880k52577F0784e1694j49783h9998A0295J15487P6420f5468
9731a46088d1458E0496b16192B42587C2199c9965c633A17641d75654h6521J9531
$$ plain form
9814 160253 108908 -60215 131771 -90843 -147544 -172871 -57925 130621 -293347 -55849 -236860
9803 -236860 -85652 -181002 6125 -104225 107411 -259539 311968 22531 46757 -254723 111166
9791 222360 -81364 -113377 72659 160721 187517 -17211 143227 -262854 54067 117731 -377058
9779 -106786 -111997 -280457 96108 96551 -59879 -94129 13313 -248550 -15426 -102346 -207545 -140294
9767 -140294 50800 11111 41722 -115975 -55079 -42397 175071 -42086 -432965 162574 -407780
9755 -260449 -493776 -159300 66539 48676 -70956 -291167 -92648 -80231 65430 -558607 198284
9743 -62956 -49430 -97310 -349887 60784 -51694 -201477 -89998 10295 125782 202202 -65468
9731 -146088 -41458 50496 -216192 242587 32199 -39965 -3633 117641 -475654 -86521 -66990
9720f6990E6220J42353a10626A4774K6881a1804j73271M5887f9005j40351c2988
9708h2501k20616a26270A60313B8357L248e58857a81057B4766b70502h5057n8583
9697a43640j88321e7645r1664j47770I7288Q5081F2333J8085b14365O2767B6063
9685b33173A7937c99613A39657a39153N1246j9315B1957J3086a46699M7842k457
9674a01314F8897J88577A23365O8826b14093B05183a01031l72009a13274o7030
9664a80304N6228k3043d9594l8776m4810B1654d2463l64943A76653a69357K8472
9653a40885B21246c11516f0078k6513m1132B11867m2943d7143j33053B35505a27134
9641A8288K801J59546R8807a16265r3146A1150a43829j30124E5715K70297a78139
$$ plain form
9720 -66990 56220 198573 -110626 14774 41655 -11804 -185075 -139188 -69005 -209356 -32988
9708 -82501 -303117 -126270 160313 28357 31605 -558857 -181057 24766 -270502 -85057 -143640
9697 -143640 -331961 -57645 -149309 -297079 97288 182369 62333 80418 -214365 -151598 26063
9685 -233173 17937 -399613 139657 -139153 -87907 -107222 21957 35043 -146699 -98857 -101314
9674 -101314 68897 257474 123365 192191 -214093 205183 -101031 -473040 -113274 -180304
9664 -180304 -124076 -147119 -49594 -88370 -133180 21654 -42463 -407406 176653 -169357 -140885
9653 -140885 221246 -311516 -60078 -86591 -127723 211867 168924 -47143 -180196 235505 -127134
9641 18288 21089 180635 279442 -116265 -209411 11150 -143829 -273953 55715 326012 -178139
9629A6067J9086J65008a32279b3721G4012b0115k33783I1860c81699R6423r4182
9618c79458C0603a69436A31282J44417j09437N850a23813O0472N099k42193g2206
9606c35608k8291A11527h4203p1298F5449c18760R8778A21268C8510a23011b4945
9594g5501A5010c00137C05314E0161L686i1179j76951a24310K2834b9674m6253
9583g5927n1982O646k76764a78954A51180a35738C7101e9085A16539a3037j6742
9572b9779q1269A48598c9219b000k77392A15735M6829d4400n6664j37242l8994
9561b77300f192l12133F851b79826B760O8014Q0099b62096L4318F1944a78134
9549b6659l7946A43070l9273g0496j86391K1186d8242A08748K02713d1424K0538
$$ plain form
9629 16067 35153 200161 -132279 -23721 74012 -20115 -253898 91860 -381699 -285276 -379458
9618 -379458 30603 -169436 131282 275699 166262 172112 -123813 -63341 -58242 -300435 -72206
9606 -335608 -363899 111527 -84203 -155501 65449 -318760 -219982 121268 38510 -123011 -24945
9594 -75501 15010 -300137 305314 50161 53847 -91179 -268130 -124310 -101476 -29674 -75927
9583 -75927 -127909 -121263 -398027 -178954 151180 -135738 37101 -59085 116539 -13037 -29779
9572 -29779 -111048 148598 -39219 -2000 -279392 115735 162564 -44400 -101064 -238306 -277300
9561 -277300 -6192 -318325 6851 -279826 2760 70774 150873 -262096 -227778 61944 -178134
9549 -26659 -64605 143070 103797 -70496 -256887 -235701 -48242 108748 311461 -41424 -20886
9538b0886A4039K4026a6363l989k01819B79298e5459l14223A68074i4811j98112
9527b92923H9740b555A28508b44201J4924C8165R309h5720C81017a12717e0403
9515b02172R9278L504j2465B7578a91582h3052A68908k2142g796j63486E8415
9503C31073a76847j59754Q3091J25947r507j23978j45189b5392j17708f9157E153
9491c1978A28152f4631p3481A31982b152m24381R2563h6827M1750G8001a55231
9479H9288Q3269e954k38055Q3673k0492q2455A99346p7187g8026K460j48234N8524
9467a65276G560a534G4368b04008B2655L8849J7272k8301b85338J16770K4538
9456a44030G4127h5180K6256b0376I5828J77088d74318c5035m2362A63033e951
$$ plain form
9538 -20886 14039 38065 -16363 -20352 -222171 279298 -55459 -369682 168074 -94811 -292923
9527 -292923 89740 -2555 128508 -244201 -229277 38165 47474 -85720 381017 -112717 -50403
9515 -202172 -102894 -99390 -111855 27578 -191582 -83052 168908 146766 -7796 -171282 58415
9503 331073 -176847 -336601 -253510 -127563 -137070 -261048 -406237 -25392 -143100 -69157 5153
9491 -31978 128152 -64631 -138112 131982 -2152 -426533 -333970 -86827 -45077 78001 -155231
9479 89288 172557 -5954 -244009 -160336 -180828 -263283 199346 122159 -78026 -75566 -223800 -165276
9467 -165276 7560 -1534 74368 -204008 22655 61504 78776 50475 -285338 -168568 -144030
9456 -144030 74127 -85180 -58924 -20376 95828 272916 -474318 -35035 -77397 163033 -5951
9444c58079A54230i06j42076j56463q5162D7332e7131r4056K5824A09286l6077
9433G3209i397A8438P5952b90037c4282l6831m1979r4697H8917a54666j04095
9422b58761A96151b44380B4674b02813n5663A315a25182j88125A12903f1848k8915
9411i0763l32376g307A96933f5100A16113K2850c88034A12662J73298i7346j8988
9400a16334A439a63433j10381m72J03705r7145A06723a23263j34238j93962D5607
9388a67603B09176G2289a99800A1814d66829a96024A33299b97407A29899a18185
9377A94165b16425F273b43931d9190q8181A67970a08033l70775a49739e7646a0040
9365a05468j07075f3377A4342b37719C05187F2469h107o9604j31119B31679a53367
$$ plain form
9444 -358079 154230 -906 -142982 -299445 -384607 47332 -57131 -151187 -125363 109286 73209
9433 73209 -9397 18438 94390 -290037 -34282 -71113 -113092 -207789 88917 -154666 -258761
9422 -258761 196151 -244380 24674 -202813 -258476 1315 -125182 -313307 112903 -61848 -90763
9411 -90763 -423139 -7307 196933 -65100 116113 138963 -388034 112662 285960 -97346 -116334
9400 -116334 1439 -163433 -273814 -274286 -170581 -267726 106723 -123263 -257501 -451463 45607
9388 -167603 209176 72289 -199800 11814 -466829 -196024 133299 -297407 129899 -118185
9377 194165 -216425 6273 -243931 -49190 -137371 167970 -108033 -478808 -149739 -57646 -10040
9365 -105468 -212543 -63377 14342 -237719 305187 62469 -8107 -77711 -208830 231679 -153367
9353a60772f0776j6043o108I0688d984A34707a61697g053k46253B19006c25035
9341A44930b01793J00633A22765d26145a55948A85402h1784m7209N164o5429l30020
9330e19278B90933H0942i9570n017A24453b36695f1648Q502a8569d145l7026m6854
9318h8025A25558b56717E9809d8196J3317B47036i1111A53263a69054j05023N1233
9307b22844l5144Q1852G4961N2574a8586A68496a11225j33685j55907e1586r9836
9296a51422m517K6055o3738k1627A3582N9123J87737b87595I7909c24225J03974
9285b20251O6754a7641l06956I0677a53002c9092J7032m80605A52596b24168A64988
9273A0984c0167H2328a30144M0997k7440B25396B7150a22099i10G1768a20341
$$ plain form
9353 -160772 -60776 -76819 -82927 90688 -4984 134707 -161697 -7053 -253306 219006 -325035
9341 144930 -201793 -101160 122765 -426145 -155948 185402 -81784 -128993 -123829 -189258 -519278
9330 -519278 290933 80942 -99570 -104587 124453 -236695 -61648 -53146 -18569 -4145 -41171 -88025
9318 -88025 125558 -256717 59809 -48196 -34879 247036 -91111 153263 -169054 -274077 -222844
9307 -222844 -257988 -176136 74961 127535 -18586 168496 -111225 -244910 -400817 -51586 -151422
9296 -151422 -155939 -129884 -193622 -215249 13582 72705 260442 -287595 97909 -324225 -220251
9285 -220251 -153497 -17641 -324597 90677 -153002 -39092 -22060 -502665 152596 -224168 164988
9273 10984 -30167 82328 -130144 -89147 -116587 225396 27150 -122099 -910 71768 -120341
9261c8156j46301p9067A99256j364H6093g8542n2108A9066J059b31520L9457o1510
9249b53573j03475B23173b71757J27257A69881a10573I5301L07869b58602a03916
9238f5526C26226A0015a3947k64673B23510b87424A4719K2522K345c32062a02924
9226d26425a08345C3353a2580n2296K4950l55558H6050b44656D9729L27405a44030
9214a79657A60786j1394d1078j39159B72296d48853a86333B0196a24832L8562
9204h6270l49921A28078J71136d04736b0909n1413D0000a45120p9562j5944i4611
9192a72787n2256L7525d5531C36219c43070B33565c59378A26676j3686a32957
9181a83985P296d6787r6078b6912k04306I8801f1944k28061a02295l9957M4717
$$ plain form
9261 -38156 -184457 -263524 199256 197892 86093 -78542 -130650 19066 20125 -231520 -192063 -253573
9249 -253573 -357048 223173 -271757 -144500 169881 -110573 95301 403170 -258602 -103916
9238 -65526 326226 10015 -13947 -278620 223510 -287424 14719 37241 39586 -332062 -102924
9226 -426425 -108345 33353 -12580 -64876 -39926 -395484 86050 -244656 49729 377134 -144030
9214 -179657 160786 149392 -41078 -180237 272296 -448853 -186333 20196 -124832 -86270
9204 -86270 -436191 128078 299214 -404736 -20909 -72322 40000 -145120 -224682 -240626 -94611
9192 -172787 -225043 -187518 -45531 336219 -343070 233565 -359378 126676 112990 -132957
9181 -183985 -176689 -46787 -142865 -26912 -231218 98801 -61944 -290005 -102295 -142252 -97535
9170i7535m8284j49098H1850f8452j60872L080g2562B28659D5540L8186c9552
9158h2808j46024d9935j16203G4413j696R736J05131B7146R4507a6115H8758E848
9145A18839d6635j09230j86877J21475g1774L3934j26390j01958g8617k1399o9079
9134a69095I9079l2144i6167o4973n0795B84495g0924A68793m4517D0517a02j13449
9122a13551j07785o330m1712B49931b02585A03905J58908m084a83883j7386I0753
9110B05759b38668R6352C6100a10750a5596r2482B424R0009a10248j37336d7283
9098B38807B1066b05233k34078b1577j09894j4021E5640K71127b71601B90838
9087C57791a64448j39597J28442k64297A6403b06092o6764q1967A56102c95666
$$ plain form
9170 -97535 -145819 -294917 81850 -68452 -229324 -226244 -72562 228659 45540 83726 -39552
9158 -82808 -228832 -49935 -166138 74413 72717 82453 187584 27146 121653 -16115 88758 5848
9145 118839 -46635 -155865 -342742 -221267 -71774 -37840 -164230 -266188 -78617 -100016 -169095
9134 -169095 99079 66935 -96167 -161140 -211935 284495 -70924 168793 124276 40517 -102 -113551
9122 -113551 -221336 -227666 -269378 249931 -202585 103905 262813 258729 -183883 -201269 90753
9110 205759 -238668 -142316 36100 -110750 -15596 -108078 2424 92433 -110248 -247584 -47283
9098 238807 21066 -205233 -439311 -21577 -131471 -145492 55640 326767 -271601 290838
9087 357791 -164448 -304045 -175603 -439900 16403 -206092 -272856 -354823 156102 -395666
9076B0677J95767a26978q6854f1345a3873B32619a33395I4445b42921k93052b14690
9064i6354k25348h4674d1515o6454k12129d2221B37208a08974C9828c26990d0671
9052d2687m04741a02767k29224c8547q1651p4074B80546b30006D6051d3069m61991
9041e05060a70103N9838m2191A2476J53690b66849I7460i2228E4544A4807N31498
9030E46305a64689O6746l35280H0243B3731a77801A72141C3560Q6565R0039c40571
9018a34334m2287l5186j58853A49663n7837l4522J8754e3109k9909a8762n9609
9007g8371L4086B41444b41057f6021m4138A76596b21376a04836m866k62056J39348
8996b32410R3970J5359O0654J906o7120r8207B82836I4042b43708D4567J50147
$$ plain form
9076 20677 216444 -126978 -213832 -61345 -13873 232619 -133395 94445 -242921 -535973 -214690
9064 -96354 -321702 -84674 -41515 -107969 -320098 -42221 237208 -108974 39828 -326990 -40671
9052 -42687 -447428 -102767 -331991 -38547 -120198 -194272 280546 -230006 46051 -43069 -505060
9041 -505060 -170103 -110265 -152456 12476 166166 -266849 97460 -92228 54544 14807 546305
9030 546305 -164689 -97943 -433223 80243 23731 -177801 172141 33560 120125 210164 -340571
9018 -134334 -176621 -211807 -370660 149663 91826 57304 76058 -53109 -83018 -18762 -78371
9007 -78371 -44285 241444 -241057 -66021 -110159 176596 -221376 -104836 -109702 -371758 -232410
8996 -232410 -138440 -123081 -62427 -60521 -127641 -225848 282836 94042 -243708 44567 194714
8985A94714q2268c78453J07258H0923O6775i1661C04801r9133h1152j25621l5580
8974b42353o5065J18301I9207b8243k44300I0731b12424B44463b69249A53184
8963a73930a6770B1925a82233D7170M0143a67751E5602P9578d50111b4611j9020
8952d3631j23586I8677c7472n48F9368b3597H0264i5220c5388k8945A698e5325
8939B40725h1986j09358N5277m684C41638J01309i412A79972a57820L4978B32759
8927d8931C98417E7572L51358o992J059850L273302N707107C745640A242673D97878
8916D87865B34967K9497a16667E8244Q8770J43035a15965j799D11486n0904b05999
8904c41910C48603A31501a67250r9004J21613B45377a32302N3309j66170A26894
$$ plain form
8985 194714 112446 -378453 -271195 80923 147698 -91661 304801 205668 -81152 -206773 -242353
8974 -242353 -307418 -189117 99207 -28243 -272543 90731 -212424 244463 -269249 153184
8963 -173930 -16770 21925 -182233 47170 87313 -167751 55602 135180 -450111 -24611 -43631
8952 -43631 -167217 98677 -37472 -38020 69368 -23597 80264 -95220 -35388 -64333 1698 -55325
8939 240725 -81986 -191344 -136067 -140751 341638 442947 -9412 179972 -157820 -122842 232759
8927 -48931 398417 57572 408930 401938 1461788 4735090 10442197 3745640 1242673 497878
8916 487865 234967 264464 -116667 58244 147014 290049 -115965 -117764 411486 360582 -205999
8904 -341910 348603 131501 -167250 -266254 -144641 245377 -132302 -78993 -245163 126894
8893f5833k1792a0890k37584b7583l6616e260F5371K68162b32706G3923e03192
8881A15951c11194A61860a41454k06735A73912J023a15922b9761j53117C5045
8870D2319K83179c3743A75484a65806L4686k03148J30151h1564j23103i7883H2491
8858e9761j71990j22034b9528p1003l814A32592J44525J10502H8800J26211A4049
$$ plain form
8893 -65833 -87625 -10890 -248474 -27583 -64199 -5260 65371 333533 -232706 73923 -503192
8881 115951 -311194 161860 -141454 -348189 173912 174935 -115922 -29761 -182878 35045
8870 42319 325498 -33743 175484 -165806 -131120 -334268 -204117 -81564 -204667 -97883 82491
8858 -59761 -231751 -353785 -29528 -100531 -104345 132592 277117 387619 88800 215011 14049
$$ [...]
##END NTUPLES=NMR SPECTRUM
##END=
