##TITLE=AC1698_ROEFFECT0026_8637906_SslmmA38rP
##JCAMPDX= 6.0         $$ Bruker NMR JCAMP-DX V2.0
##DATA TYPE= NMR SPECTRUM
##DATA CLASS= NTUPLES
##ORIGIN= BRUKER
##OWNER= Administrator
$$ 1.72 TOPSPIN		Version 2.1
$$ 2014-05-22 23:49:23.075 -0700  Administrator@X
$$ Compression mode = diff/dup
##.OBSERVE FREQUENCY= 400.02188249412
##.OBSERVE NUCLEUS= ^1H
##.ACQUISITION MODE= SIMULTANEOUS (DQD)
##.ACQUISITION SCHEME= undefined
##.AVERAGES= 64
##.DIGITISER RES= 22
##SPECTROMETER/DATA SYSTEM= spect
##.PULSE SEQUENCE= noesygpps1d.comp
##.SOLVENT NAME= COFFEE_meoh
##.SHIFT REFERENCE= INTERNAL, COFFEE_meoh, 1, 14.96111
##AUDIT TRAIL= $$ (NUMBER, WHEN, WHO, WHERE, PROCESS, VERSION, WHAT)
$$ ##TITLE= Audit trail, TOPSPIN		Version 2.1
$$ ##JCAMPDX= 5.01
$$ ##ORIGIN= Bruker BioSpin GmbH
$$ ##OWNER= Administrator
$$ $$ E:\/data/COFFEE/nmr/AC1698_ROEFFECT0026_8637906_SslmmA38rP/12/pdata/1/auditp.txt
$$ ##AUDIT TRAIL=  $$ (NUMBER, WHEN, WHO, WHERE, PROCESS, VERSION, WHAT)
(   1,<2014-05-22 23:49:18.200 -0700>,<Administrator>,<X>,<go>,<TOPSPIN 2.1>,
      <created by zg
	started at 2014-05-22 23:37:48.464 -0700,
	POWCHK enabled, PULCHK disabled,
       configuration hash MD5:
       C8 4E 4E 5D D3 5C D8 9E 9F 52 82 E0 59 8A DE 15
       data hash MD5: 64K
       8C 58 DB CC A7 27 88 39 AE 10 B8 65 D9 84 74 6C>)
(   2,<2014-05-22 23:49:21.138 -0700>,<Administrator>,<X>,<proc1d>,<TOPSPIN 2.1>,
      <Start of raw data processing
       efp LB = 0.3 FT_mod = 6 PKNL = 1 PHC0 = 0 PHC1 = 0 SI = 128K 
       data hash MD5: 128K
       CE 1C 84 34 4A 3C 9B CE 39 95 54 FE F8 D0 A8 F1>)
(   3,<2014-05-22 23:49:22.075 -0700>,<Administrator>,<X>,<proc1d>,<TOPSPIN 2.1>,
      <pk PHC0 = -82.1228 PHC1 = 0 
       data hash MD5: 128K
       FB DE 62 5F 24 D6 01 52 C5 C0 F1 07 61 75 1F 4F>)
(   4,<2014-05-22 23:49:22.497 -0700>,<Administrator>,<X>,<proc1d>,<TOPSPIN 2.1>,
      <abs ABSG = 1 
       data hash MD5: 128K
       2D 88 4A 7C BB B7 D5 D6 2D C9 C9 DE 2A 7E A0 0E>)
(   5,<2014-05-22 23:49:22.606 -0700>,<Administrator>,<X>,<proc1d>,<TOPSPIN 2.1>,
      <abs ABSG = 2 
       data hash MD5: 128K
       E1 54 F7 A6 B1 08 C4 58 2B EF 24 95 9A 47 83 EA>)
(   6,<2014-05-22 23:49:22.700 -0700>,<Administrator>,<X>,<proc1d>,<TOPSPIN 2.1>,
      <abs ABSG = 3 
       data hash MD5: 128K
       F7 0D 77 2A 6C D0 8B 0B 6D 9D CB CF AA D9 CC 15>)
(   7,<2014-05-22 23:49:22.778 -0700>,<Administrator>,<X>,<proc1d>,<TOPSPIN 2.1>,
      <abs ABSG = 4 
       data hash MD5: 128K
       D5 C1 AD A3 28 9B 0C 78 E1 23 30 6C C1 ED DB A6>)
(   8,<2014-05-22 23:49:22.872 -0700>,<Administrator>,<X>,<proc1d>,<TOPSPIN 2.1>,
      <abs ABSG = 5 
       data hash MD5: 128K
       5C 3A 4B 98 56 F8 65 03 C2 52 85 F7 39 CE 97 F5>)
$$ ##END=
$$ 
$$ $$ hash MD5
$$ $$ DE A8 8E 27 9F 3F F1 65 06 B2 61 6D 5E 11 09 1F
##$RELAX= 
##$RELAX= 
##$RELAX= 
##$RELAX= 
##$RELAX= 
##$RELAX= 
##$RELAX= 
##$RELAX= 
$$ Bruker specific parameters
$$ --------------------------
##$DU= <E:\>
##$EXPNO= 12
$$ [...]
##$TP07= 0
##$TPNAME0= <>
##$TPNAME1= <>
##$TPNAME2= <>
##$TPNAME3= <>
##$TPNAME4= <>
##$TPNAME5= <>
##$TPNAME6= <>
##$TPNAME7= <>
##$TPOAL= (0..7)
0.5 0.5 0.5 0.5 0.5 0.5 0.5 0.5
##$TPOFFS= (0..7)
0 0 0 0 0 0 0 0
##$TUNHIN= 0
##$TUNHOUT= 0
##$TUNXOUT= 0
##$USERA1= <user>
##$USERA2= <user>
##$USERA3= <user>
##$USERA4= <user>
##$USERA5= <user>
##$V9= 5
##$VALIST= <valist>
##$VCLIST= <CCCCCCCCCCCCCCC>
##$VD= 0
##$VDLIST= <DDDDDDDDDDDDDDD>
##$VPLIST= <PPPPPPPPPPPPPPP>
##$VTLIST= <TTTTTTTTTTTTTTT>
##$WBST= 2048
##$WBSW= 25
##$XGAIN= (0..3)
0 0 0 0
##$XL= 0
##$YL= 0
##$YMAX_a= 10183315
##$YMIN_a= -19596879
##$ZGOPTNS= <>
##$ZL1= 120
##$ZL2= 120
##$ZL3= 120
##$ZL4= 120
##$ABSF1= 14.96111
##$ABSF2= -5.597072
##$ABSG= 5
##$ABSL= 3
##$ALPHA= 0
##$AQORDER= 0
##$ASSFAC= 0
##$ASSFACI= 0
##$ASSFACX= 0
##$ASSWID= 0
##$AUNMP= <proc_prof1d_extract.lims>
##$AXLEFT= 0
##$AXNAME= <>
##$AXNUC= <1H>
##$AXRIGHT= 0
##$AXTYPE= 0
##$AXUNIT= <>
##$AZFE= 0.1
##$AZFW= 0.1
##$BCFW= 0
##$BC_mod= 0
##$BYTORDP= 0
##$COROFFS= 0
##$CY= 15
##$DATMOD= 1
##$DC= 0
##$DFILT= <>
##$DTYPP= 0
##$F1P= 0
##$F2P= 0
##$FCOR= 0.5
##$FTSIZE= 131072
##$FT_mod= 6
##$GAMMA= 0
##$GB= 0
##$INTBC= 1
##$INTSCL= 1
##$ISEN= 128
##$LB= 0.3
##$LEV0= 0
##$LPBIN= 0
##$MAXI= 10000
##$MC2= 0
##$MEAN= 0
##$ME_mod= 0
##$MI= 0
##$NCOEF= 0
##$NC_proc= -2
##$NLEV= 6
##$NOISF1= 0
##$NOISF2= 0
##$NSP= 0
##$NTH_PI= 0
##$NZP= 0
##$OFFSET= 14.96111
##$PC= 1
##$PHC0= -82.1228
##$PHC1= 0
##$PH_mod= 1
##$PKNL= yes
##$PPARMOD= 0
##$PPDIAG= 0
##$PPIPTYP= 0
##$PPMPNUM= 2147483647
##$PPRESOL= 1
##$PSCAL= 4
##$PSIGN= 0
##$PYNMP= <proc.py>
##$REVERSE= no
##$SF= 400.020009594579
##$SI= 131072
##$SIGF1= 0
##$SIGF2= 0
##$SINO= 400
##$SIOLD= 131072
##$SPECTYP= <>
##$SREGLST= <1H.CDCl3>
##$SSB= 0
##$STSI= 131072
##$STSR= 0
##$SW_p= 8223.68421052631
##$SYMM= 0
##$S_DEV= 0
##$TDeff= 65536
##$TDoff= 0
##$TI= <>
##$TILT= no
##$TM1= 0
##$TM2= 0
##$TOPLEV= 0
##$USERP1= <user>
##$USERP2= <user>
##$USERP3= <user>
##$USERP4= <user>
##$USERP5= <user>
##$WDW= 1
##$XDIM= 131072
##$YMAX_p= 394509147
##$YMIN_p= -12134
##$CURPLOT= <Network HP LaserJet P1505>
##$CURPRIN= <$Network HP LaserJet P1505>
##$DFORMAT= <normdp>
##$LAYOUT= <+/1D_H.xwp>
##$LFORMAT= <normlp>
##$PFORMAT= <normpl>
##$SURQMSG= 1
$$ End of Bruker specific parameters
$$ ---------------------------------
##NTUPLES= NMR SPECTRUM
##VAR_NAME=  FREQUENCY,     SPECTRUM/REAL,   SPECTRUM/IMAG
##SYMBOL=    X,             R,               I
##VAR_TYPE=  INDEPENDENT,   DEPENDENT,       DEPENDENT
##VAR_FORM=  AFFN,          ASDF,            ASDF
##VAR_DIM=   131072,        131072,          131072
##UNITS=     HZ,            ARBITRARY UNITS, ARBITRARY UNITS
##FACTOR=    0.0627417313425164, 1,          1
##FIRST=     8223.62146879497, 3017,         -75527
##LAST=      0,             5295,            -75003
##MIN=       0,             -12134,          0
##MAX=       8223.62146879497, 394509147,    0
$$ Real data points
##PAGE= N=1
##DATA TABLE= (X++(R..R)), XYDATA
$$ [...]
$$ plain form
61111 1597989 1603140 1607301 1610693 1613941 1617307 1620716 1624063 1627200 1629766 1631170 1630621 1627268 1620534 1610273
61097 1610273 1596419 1578775 1557559 1533829 1508779 1482766 1455655 1427912 1400601 1374332 1348989
61086 1348989 1324561 1301453 1279871 1259648 1240809 1223546 1207484 1191853 1176665 1162910 1151127
61075 1151127 1140474 1129680 1118331 1106922 1096281 1087307 1080615 1075923 1072264 1069131 1066867 1065669 1064925
61062 1064925 1064020 1063141 1062784 1063030 1063850 1065594 1068604 1072751 1077827 1084053 1091748 1100829 1110953 1121890 1133613
61047 1133613 1146427 1161054 1177948 1196387 1214965 1233073 1251142 1269334 1287137 1304628 1322949
61036 1322949 1342825 1363528 1384060 1404496 1425364 1446535 1467578 1488554 1509665 1530757 1551931
61025 1551931 1573982 1597553 1622515 1648892 1677600 1709430 1744022 1780642 1819258 1860042 1902727
$$ packed form
61111A597989N151M161L392L248L366L409L347L137K566J404n49l353o734j0261
61097A610273j3854j7644k1216k3730k5050k6013k7111k7743k7311k6269k5343
61086A348989k4428k3108k1582k0223j8839j7263j6062j5631j5188j3755j1783
61075A151127j0653j0794j1349j1409j0641q974o692m692l659l133k264j198p44
61062A064925r05q79l57K46Q20J744L010M147N076O226P695R081J0124J0937J1723
61047A133613J2814J4627J6894J8439J8578J8108J8069J8192J7803J7491J8321
61036A322949J9876K0703K0532K0436K0868K1171K1043K0976K1111K1092K1174
61025A551931K2051K3571K4962K6377K8708L1830L4592L6620L8616M0784M2685
$$ plain form
61014 1902727 1947480 1995737 2049219 2108866 2175584 2250996 2336128 2430265 2532571 2644329 2768522
61003 2768522 2908281 3067486 3252412 3471341 3733452 4050008 4436241 4910686 5493994
60994 5493994 6211037 7093208 8174782 9484624 11038428 12827413 14795642 16817416
60986 16817416 18706693 20274413 21403299 22087183 22413856 22519424 22550435 22635842 22849043
60977 22849043 23164290 23446591 23503405 23172343 22384388 21168751 19618935 17858165 16017099
60968 16017099 14213828 12533779 11021778 9691584 8540963 7559605 6731076 6035653
60960 6035653 5454213 4969420 4564918 4225777 3939690 3696611 3487662 3305352 3144278
60951 3144278 3000505 2870567 2751758 2642685 2542618 2450666 2366208 2289268 2219438 2154932
$$ packed form
61014A902727M4753M8257N3482N9647O6718P5412Q5132R4137J02306J11758J24193
61003B768522J39759J59205J84926K18929K62111L16556L86233M74445N83308
60994E493994P17043Q82171J081574J309842J553804J788985J968229K021774
60986A6817416J889277J567720J128886O83884L26673J05568L1011Q5407K13201
60977B2849043L15247K82301N6814l31062p87955j215637j549816j760770j841066
60968A6017099j803271j680049j512001j330194j150621r81358q28529o95423
60960F035653n81440m84793m04502l39141k86087k43079k08949j82310j61074
60951C144278j43773j29938j18809j09073j00067r1952q4458p6940o9830o4506
$$ plain form
60941 2154932 2093521 2033894 1975353 1916941 1858045 1799403 1742408 1687595 1634764 1584255 1537040
60930 1537040 1493583 1453483 1416216 1381412 1348477 1316795 1286393 1257742 1230874 1205372 1181248
60919 1181248 1159045 1138863 1119971 1101719 1084335 1068500 1054493 1042155 1031428 1022520 1015466 1009714
60907 1009714 1004360 998874 993512 988789 984602 980242 975342 970428 966239 962821 959571 955888 951421 945873
60893 945873 939070 931239 922966 914926 907811 902341 898948 897429 897158 897683 898886 900519 901863 902055 900812
60878 900812 898669 896457 894573 892804 890748 888107 884610 880126 875115 870624 867378 865087 863030 861036
60864 861036 859452 858338 857327 856161 854855 853393 851886 850893 850934 851679 852359 852976 854299 856434 858308 858942
60848 858942 858517 857684 856516 854750 852587 850589 849015 847689 846212 843879 839727 833243 824973 816063 807338
$$ packed form
60941B154932o1411n9627n8541n8412n8896n8642n6995n4813n2831n0509m7215
60930A537040m3457m0100l7267l4804l2935l1682l0402k8651k6868k5502k4124
60919A181248k2203k0182j8892j8252j7384j5835j4007j2338j0727q908p054n752
60907A009714n354n486n362m723m187m360m900m914m189l418l250l683m467n548
60893I45873o803p831q273q040p115n470l393j519k71N25J203J633J344J92j243
60878I00812k143k212j884j769k056k641l497m484n011m491l246k291k057j994
60864H61036j584j114j011j166j306j462j507r93M1P45O80O17J323K135J874O34
60848H58942m25q33j168j766k163j998j574j326j477k333m152o484q270q910q725
$$ plain form
60833 807338 799076 791468 784878 779559 775294 771368 767080 762497 758590 756226 755155 754446 753839 753974 755226
60818 755226 757088 758971 760914 763129 765430 767559 769550 771306 772342 772418 772011 771702 771485 771064 770353 769143
60802 769143 766795 762950 758298 754063 750846 748375 746171 743924 741446 738671 735723 732691 729544 726434
60788 726434 723731 721507 719373 717137 715134 713478 711501 708579 705124 702126 699993 698507 697593 697357 697410
60773 697410 696945 695672 694147 693084 692737 692992 693627 694383 695128 696063 697539 699706 702565 706161 710361 714578
60757 714578 718211 721332 724504 727879 730950 733336 735389 737727 740397 742880 744899 746995 750112 754592
60743 754592 759741 764566 768759 772631 776167 778680 779655 779495 779070 778813 778650 778559 778739 779268 779923 780349 780220
60726 780220 779295 777526 775056 772016 768457 764572 760754 757246 753922 750566 747195 743969 741011 738421
$$ packed form
60833H07338q262p608o590n319m265l926m288m583l907k364j071p09o07J35J252
60818G55226J862J883J943K215K301K129J991J756J036P6m07l09k17m21p11j210
60802G69143k348l845m652m235l217k471k204k247k478k775k948l032l147l110
60788G26434k703k224k134k236k003j656j977k922l455k998k133j486r14k36N3
60773F97410m65j273j525j063l47K55O35P56P45R35J476K167K859L596M200M217
60757G14578L633L121L172L375L071K386K053K338K670K483K019K096L117M480
60743G54592N149M825M193L872L536K513R75j60m25k57j63r1J80N29O55M26j29
60726G80220r25j769k470l040l559l885l818l508l324l356l371l226k958k590
$$ plain form
60712 738421 736230 734266 732343 730640 729485 728680 727513 725662 723575 721688 719876 718076 716879 716817 717428
60697 717428 717711 717313 716684 716266 716123 716295 716904 717835 718791 719692 720713 721962 723466 725428 728132 731554 735371
60680 735371 739304 743233 747072 750856 754891 759531 764773 770253 775537 780320 784521 788360 792127 795632
60666 795632 798126 798997 798348 796722 794537 792101 789765 787706 785822 784238 783614 784433 786199 787859 788918
60651 788918 789704 790637 791768 793025 794430 795971 797511 798939 800226 801357 802245 802563 801702 799258 795747
60636 795747 792357 789707 787304 784580 781895 779976 778855 778057 777528 777658 778535 779873 781508 783357 785038
60621 785038 786230 787288 788809 790615 791932 792593 793313 794619 796167 797373 798094 798443 798479 798443 798810 799751 800813
60604 800813 801437 801534 801365 801145 801043 801346 802301 803799 805394 806631 807370 807837 808356 808992 809579 810121 810936 812307
$$ packed form
60712G38421k191j964j923j703j155q05j167j851k087j887j812j800j197o2O11
60697G17428K83l98o29m18j43J72O09R31R56R01J021J249J504J962K704L422L817
60680G35371L933L929L839L784M035M640N242N480N284M783M201L839L767L505
60666G95632K494Q71o49j626k185k436k336k059j884j584o24Q19J766J660J059
60651G88918P86R33J131J257J405J541J540J428J287J131Q88L18q61k444l511
60636G95747l390k650k403k724k685j919j121p98n29J30Q77J338J635J849J681
60621G85038J192J058J521J806J317O61P20J306J548J206P21L49L6l6L67R41J062
60604H00813O24R7j69k20j02L03R55J498J595J237P39M67N19O36N87N42Q15J371
$$ plain form
60586 812307 814217 816557 819253 821947 823996 825248 826477 828515 831253 834011 836641 839578 843001 846648
60572 846648 850469 854735 859462 864386 869691 876062 883744 892053 900100 907614 914828 921959 929099 936277
60558 936277 943285 949629 954766 958291 959937 959824 958768 957916 957783 957914 957701 957324 957638 959303 962249 965945
60542 965945 970039 974619 979784 985046 989541 993084 996807 1002378 1010673 1021392 1033789 1047411 1062342
60529 1062342 1079057 1097915 1118414 1139049 1158282 1175484 1190627 1203396 1213156 1219502 1222191 1220722
60517 1220722 1214756 1204958 1192684 1178834 1163733 1148188 1133731 1121459 1111274 1102657 1095565 1090229
60505 1090229 1086648 1084781 1084803 1086766 1090424 1095810 1103610 1114524 1128556 1145350 1164891 1187423 1212850
60492 1212850 1240562 1269680 1299074 1327369 1353447 1376960 1398041 1416520 1431784 1443502 1452279
$$ packed form
60586H12307J910K340K696K694K049J252J229K038K738K758K630K937L423L647
60572H46648L821M266M727M924N305O371P682Q309Q047P514P214P131P140P178
60558I36277P008O344N137L525J646j13j056q52j33J31k13l77L14J665K946L696
60542I65945M094M580N165N262M495L543L723N571Q295J0719J2397J3622J4931
60529A062342J6715J8858K0499K0635J9233J7202J5143J2769R760O346K689j469
60517A220722n966r798j2274j3850j5101j5545j4457j2272j0185q617p092n336
60505A090229l581j867K2J963L658N386P800J0914J4032J6794J9541K2532K5427
60492A212850K7712K9118K9394K8295K6078K3513K1081J8479J5264J1718Q777
$$ plain form
60481 1452279 1459457 1466391 1474007 1482940 1493745 1506617 1520790 1534403 1545191 1551203 1550902 1543002 1526811
60468 1526811 1502689 1471863 1435822 1396122 1354463 1312394 1270932 1230877 1193372 1159497 1129284
60457 1129284 1101801 1076416 1053395 1033015 1014774 997969 982624 969239 957861 947933 938997 931143
60445 931143 924712 919798 916087 913117 910720 909195 908902 909643 910661 911309 911525 911559 911465 911031 910014 908312
60429 908312 906023 903538 901456 900269 900001 900098 899733 898481 896909 896264 897338 899765 902690 905806 909317
60414 909317 913120 916635 919443 921544 922967 923679 924043 924875 926826 929992 934214 939302 944822 950109 954758
60399 954758 958872 962777 966786 971207 976095 980960 985172 988717 992129 995661 999148 1002685 1006684 1011027
60385 1011027 1014952 1018194 1021478 1025403 1029519 1033157 1036509 1040099 1043663 1046554 1049013 1052035 1055931 1059901
$$ packed form
60481A452279P178O934P616Q933J0805J2872J4173J3613J0788O012l01p900j6191
60468A526811k4122l0826l6041l9700m1659m2069m1462m0055l7505l3875l0213
60457A129284k7483k5385k3021k0380j8241j6805j5345j3385j1378r928q936p854
60445I31143o431m914l711k970k397j525k93P41J018O48K16L4r4m34j017j702
60429I08312k289k485k082j187k68R7l65j252j572o45J074K427K925L116L511
60414I09317L803L515K808K101J423P12L64Q32J951L166M222N088N520N287M649
60399I54758M114L905M009M421M888M865M212L545L412L532L487L537L999M343
60385A011027L925L242L284L925M116L638L352L590L564K891K459L022L896L970
$$ plain form
60371 1059901 1063221 1066107 1068988 1071606 1073436 1074676 1076230 1078649 1081533 1084238 1086967 1090781 1096458 1103603
60357 1103603 1111095 1118229 1125100 1132082 1139513 1147923 1157919 1169412 1181350 1192650 1203076 1212821 1221561
60344 1221561 1228497 1233173 1235626 1235745 1233103 1227648 1220153 1211777 1203520 1196203 1190397 1185865 1181411 1175916
60330 1175916 1169597 1163742 1159163 1155360 1151385 1147034 1142725 1138575 1134269 1129780 1125604 1122110 1119238 1117117
60316 1117117 1116495 1118102 1121874 1127252 1134033 1142444 1152456 1163476 1174808 1186054 1196955 1207035 1215543
60303 1215543 1221784 1225665 1227996 1230009 1232431 1235128 1237636 1239569 1240294 1238827 1234616 1228154 1220264 1211001
60289 1211001 1199898 1187213 1174341 1162886 1153682 1146569 1140683 1135036 1129260 1123742 1118744 1113673 1107808
60276 1107808 1101513 1095968 1091698 1087951 1083514 1077585 1070006 1061456 1053498 1047604 1043809 1040865 1037864 1035091
$$ packed form
60371A059901L320K886K881K618J830J240J554K419K884K705K729L814N677P145
60357A103603P492P134O871O982P431Q410R996J1493J1938J1300J0426R745Q740
60344A221561O936M676K453J19k642n455p495q376q257p317n806m532m454n495
60330A175916o319n855m579l803l975m351m309m150m306m489m176l494k872k121
60316A117117o22J607L772N378O781Q411J0012J1020J1332J1246J0901J0080Q508
60303A215543O241L881K331K013K422K697K508J933P25j467m211o462p890r263
60289A211001j1103j2685j2872j1455r204p113n886n647n776n518m998n071n865
60276A107808o295n545m270l747m437n929p579q550p958n894l795k944l001k773
$$ plain form
60262 1035091 1033140 1031940 1031044 1030308 1029886 1029920 1030562 1031896 1033633 1035309 1036987 1039357 1042865 1047128 1051413
60247 1051413 1055232 1058318 1060493 1061874 1062856 1063619 1063934 1063620 1062840 1061797 1060527 1059139 1057943 1057279 1057471 1058855
60231 1058855 1061383 1064345 1067089 1069975 1073953 1079300 1085603 1092971 1102195 1113369 1125342 1137096 1148895
60218 1148895 1161532 1175131 1189323 1203928 1218830 1233644 1248132 1262623 1277574 1293043 1308839
60207 1308839 1324676 1339911 1353799 1366436 1378829 1391567 1404035 1415392 1425594 1434875 1442966 1449610
60195 1449610 1455223 1460168 1463792 1465066 1463862 1460866 1456552 1451066 1444830 1438366 1431542 1423694 1414589 1404788
60181 1404788 1395177 1386567 1379533 1374089 1369592 1365452 1361810 1359139 1357453 1356395 1355858 1355888 1356100 1355748 1354331
60166 1354331 1351718 1347817 1342591 1336317 1329438 1322192 1314737 1307494 1301030 1295664 1291439 1288324 1286164 1284651
$$ packed form
60262A035091j951j200q96p36m22L4O42J334J737J676J678K370L508M263M285
60247A051413L819L086K175J381R82P63L15l14p80j043j270j388j196o64J92J384
60231A058855K528K962K744K886L978N347O303P368R224J1174J1973J1754J1799
60218A148895J2637J3599J4192J4605J4902J4814J4488J4491J4951J5469J5796
60207A308839J5837J5235J3888J2637J2393J2738J2468J1357J0202R281Q091O644
60195A449610N613M945L624J274j204k996m314n486o236o464o824p848r105r801
60181A404788r611q610p034n444m497m140l642k671j686j058n37L0K12l52j417
60166A354331k613l901n226o274o879p246p455p243o464n366m225l115k160j513
$$ plain form
60152 1284651 1283574 1283018 1283233 1284554 1287386 1291670 1296287 1299702 1301563 1303060 1305404 1308640 1312327 1316467
60138 1316467 1321143 1326014 1331018 1336920 1344340 1352767 1361374 1370212 1379698 1389450 1398661 1407189 1415257 1422420
60124 1422420 1427976 1432229 1436232 1440413 1444507 1448764 1454078 1460751 1468143 1475793 1484031 1493189 1502942 1512688
60110 1512688 1522015 1530619 1538295 1545027 1550621 1554419 1556092 1556561 1557252 1558435 1559161 1558875 1558159 1557729 1557625 1557724
60094 1557724 1558183 1558939 1559385 1558913 1557251 1554021 1548644 1541058 1531970 1522105 1511682 1500830 1489937 1479219
60080 1479219 1468566 1458176 1448828 1441069 1434535 1428425 1422280 1415910 1408995 1401271 1392944 1384516 1376320
60067 1376320 1368439 1360914 1353792 1347059 1340647 1334430 1328174 1321763 1315568 1310312 1306430 1303656 1301307 1298887
60053 1298887 1296395 1294186 1292501 1291150 1289895 1289221 1290251 1293506 1298117 1302847 1307599 1313252 1320171 1327616
$$ packed form
60152A284651j077n56K15J321K832M284M617L415J861J497K344L236L687M140
60138A316467M676M871N004N902P420Q427Q607Q838R486R752R211Q528Q068P163
60124A422420N556M253M003M181M094M257N314O673P392P650Q238R158R753R746
60110A512688R327Q604P676O732N594L798J673M69O91J183P26k86p16m30j04R9
60094A557724M59P56M46m72j662l230n377p586r088r865j0423j0852j0893j0718
60080A479219j0653j0390r348p759o534o110o145o370o915p724q327q428q196
60067A376320p881p525p122o733o412o217o256o411o195n256l882k774k349k420
60053A298887k492k209j685j351j255o74J030L255M611M730M752N653O919P445
$$ plain form
60039 1327616 1334594 1340598 1345432 1349079 1352024 1355036 1358256 1360897 1362156 1362031 1360961 1358996 1355723 1350814
60025 1350814 1344377 1336806 1328453 1319445 1309873 1300159 1290979 1282611 1274619 1266508 1258466 1251012 1244113 1237259
60011 1237259 1230365 1224039 1218878 1214934 1211910 1209440 1207123 1204715 1202464 1200928 1200408 1200789 1201829 1203259
59997 1203259 1204682 1205827 1206923 1208446 1210528 1213026 1216094 1220216 1225651 1232258 1239931 1248762 1258670 1269129
59983 1269129 1279361 1288612 1296364 1302467 1306960 1309613 1309995 1308204 1305076 1301313 1296851 1291605 1286257 1281601
59969 1281601 1277566 1273700 1270190 1267557 1265683 1264129 1263202 1263713 1265857 1269361 1274533 1281925 1290891 1299692
59955 1299692 1307239 1313656 1318953 1322410 1323778 1323996 1324112 1324324 1324521 1324858 1325240 1325093 1324273 1323488 1323326 1323550 1323842
59938 1323842 1324396 1325227 1325809 1326168 1327647 1331757 1338723 1347804 1358339 1369665 1380540 1389744 1397067 1403014
$$ packed form
60039A327616O978O004M834L647K945L012L220K641J259j25j070j965l273m909
60025A350814o437p571q353r008r572r714r180q368p992q111q042p454o899o854
60011A237259o894o326n161l944l024k470k317k408k251j536n20L81J040J430
59997A203259J423J145J096J523K082K498L068M122N435O607P673Q831R908J0459
59983A269129J0232R251P752O103M493K653L82j791l128l763m462n246n348m656
59969A281601m035l866l510k633j874j554r27N11K144L504N172P392Q966Q801
59955A299692P547O417N297L457J368K18J16K12J97L37L82j47q20p85j62K24K92
59938A323842N54Q31N82L59J479M110O966R081J0535J1326J0875R204P323N947
$$ plain form
59924 1403014 1407719 1410868 1412572 1413610 1414859 1416955 1420412 1425540 1432272 1440441 1450076 1461057 1472657
59911 1472657 1483961 1494669 1505070 1515205 1524365 1531431 1535512 1536335 1534236 1529849 1523742 1516405 1508401
59898 1508401 1500139 1491506 1482202 1472650 1464161 1457921 1454102 1452164 1451584 1452016 1453179 1455075 1458108 1462609
59884 1462609 1468385 1475006 1482345 1490492 1499336 1508609 1518361 1529079 1541170 1554289 1567153 1578163 1586409
59871 1586409 1592158 1596261 1599196 1600838 1600929 1599371 1596180 1591607 1586314 1581027 1576022 1571311 1567182 1564068
59857 1564068 1561907 1560185 1558595 1557073 1555125 1551794 1546546 1539755 1532172 1524424 1517211 1511412 1507652 1506051
59843 1506051 1506576 1509297 1514181 1520977 1529441 1539340 1550169 1561135 1571481 1580753 1589015 1597157 1606564
59830 1606564 1617891 1630488 1643498 1656939 1670719 1683216 1692296 1697685 1700993 1703366 1704681 1705379 1707420
$$ packed form
59924A403014M705L149J704J038J249K096L457N128O732Q169R635J0981J1600
59911A472657J1304J0708J0401J0135R160P066M081Q23k099m387o107p337q004
59898A508401q262q633r304r552q489o240l819j938n80M32J163J896L033M501
59884A462609N776O621P339Q147Q844R273R752J0718J2091J3119J2864J1010Q246
59871A586409N749M103K935J642R1j558l191m573n293n287n005m711m129l114
59857A564068k161j722j590j522j948l331n248o791p583p748p213n799l760j601
59843A506051N25K721M884O796Q464R899J0829J0966J0346R272Q262Q142R407
59830A606564J1327J2597J3010J3441J3780J2497R080N389L308K373J315O98K041
$$ plain form
59817 1707420 1712381 1719634 1727282 1734104 1739769 1743949 1746164 1746079 1743383 1737875 1730209 1721947 1714345 1707555
59803 1707555 1701375 1695977 1691334 1686631 1680960 1674081 1666012 1656583 1646045 1635549 1626282 1618397 1611237
59790 1611237 1604161 1596815 1589222 1581971 1575750 1570295 1564537 1558157 1552220 1547788 1544736 1542424 1540702 1539656
59776 1539656 1539299 1540115 1542977 1547721 1552772 1557003 1561085 1566100 1571801 1577388 1583059 1589481 1596402 1603134
59762 1603134 1609932 1617613 1626201 1635258 1645218 1657085 1670876 1685510 1700160 1714708 1728972 1742546
59750 1742546 1755366 1767497 1778445 1787523 1794756 1800586 1804893 1807252 1807926 1807640 1806512 1804224 1801076 1797773
59736 1797773 1794243 1789782 1784438 1779175 1774539 1770218 1766168 1763139 1761692 1761441 1761611 1761766 1761818 1761997 1762954 1765152
59720 1765152 1767912 1769695 1769570 1767906 1765609 1763393 1761923 1761895 1763534 1766468 1770420 1775691 1782851 1792310 1804252
$$ packed form
59817A707420M961P253P648O822N665M180K215q5k696n508p666q262p602o790
59803A707555o180n398m643m703n671o879q069r429j0538j0496r267p885p160
59790A611237p076p346p593p251o221n455n758o380n937m432l052k312j722j046
59776A539656l57Q16K862M744N051M231M082N015N701N587N671O422O921O732
59762A603134O798P681Q588R057R960J1867J3791J4634J4650J4548J4264J3574
59750A742546J2820J2131J0948R078P233N830M307K359O74k86j128k288l148l303
59736A797773l530m461n344n263m636m321m050l029j447k51J70J55N2J79R57K198
59720A765152K760J783j25j664k297k216j470k8J639K934L952N271P160R459J1942
$$ plain form
59705 1804252 1818580 1834851 1852622 1871861 1892579 1914208 1935888 1957416 1979416 2002527 2026835
59694 2026835 2052059 2077732 2103086 2127181 2149254 2168687 2184766 2196916 2205187 2210197 2212660 2213254
59682 2213254 2212695 2211516 2209856 2207689 2204963 2201193 2195406 2187153 2177298 2167227 2157550 2148150 2139144 2131071
59668 2131071 2124356 2119277 2116324 2115972 2118235 2122986 2130452 2140790 2153519 2168015 2184238 2202248 2221407
59655 2221407 2240923 2260765 2281066 2300831 2318345 2332733 2344062 2351927 2355030 2352311 2343514 2328531
59643 2328531 2307189 2280037 2248589 2214482 2178953 2143123 2108033 2074279 2042301 2013023 1987436
59632 1987436 1965539 1946481 1929601 1914374 1899490 1883260 1865209 1846149 1826419 1805299 1782677
59621 1782677 1760059 1739083 1719918 1701978 1685367 1670656 1657722 1645843 1634749 1624825 1616421 1609609
$$ packed form
59705A804252J4328J6271J7771J9239K0718K1629K1680K1528K2000K3111K4308
59694B026835K5224K5673K5354K4095K2073J9433J6079J2150Q271N010K463N94
59682B213254n59j179j660k167k726l770n787q253r855j0071r677r400r006q073
59668B131071o715n079k953l52K263M751P466J0338J2729J4496J6223J8010J9159
59655B221407J9516J9842K0301J9765J7514J4388J1329P865L103k719q797j4983
59643B328531k1342k7152l1448l4107l5529l5830l5090l3754l1978k9278k5587
59632A987436k1897j9058j6880j5227j4884j6230j8051j9060j9730k1120k2622
59621A782677k2618k0976j9165j7940j6611j4711j2934j1879j1094r924q404o812
$$ plain form
59609 1609609 1604570 1601626 1600752 1601353 1602622 1603975 1605199 1606374 1607714 1609456 1611771 1614542 1617200 1619119
59595 1619119 1620387 1621841 1624054 1626738 1629556 1632932 1637293 1641873 1645182 1646503 1646125 1644257 1640731 1635865
59581 1635865 1630709 1626099 1622059 1618234 1614251 1609653 1604198 1598353 1592804 1587448 1581681 1575755 1570887 1567710
59567 1567710 1565475 1563233 1561057 1559570 1558816 1558144 1556929 1555094 1553230 1552295 1552761 1553931 1554579 1554385 1554298 1555476
59551 1555476 1558397 1563009 1568981 1575599 1582124 1588598 1595764 1603925 1612482 1620966 1630083 1641284 1655593
59538 1655593 1673067 1693192 1715501 1739740 1765296 1790440 1812650 1830152 1842804 1851108 1855108 1855136
59526 1855136 1853037 1851243 1850644 1850423 1849978 1849749 1849991 1849924 1848548 1845449 1840488 1833612 1825285 1816280 1806737 1796191
59510 1796191 1784723 1773168 1761992 1750969 1740274 1730762 1722668 1715048 1707236 1699997 1694594 1691489 1690598
$$ packed form
59609A609609n039k944q74O01J269J353J224J175J340J742K315K771K658J919
59595A619119J268J454K213K684K818L376M361M580L309J321l78j868l526m866
59581A635865n156m610m040l825l983m598n455n845n549n356n767n926m868l177
59567A567710k235k242k176j487p54o72j215j835j864r35M66J170O48j94q7J178
59551A555476K921M612N972O618O525O474P166Q161Q557Q484R117J1201J4309
59538A655593J7474K0125K2309K4239K5556K5144K2210J7502J2652Q304M000K8
59526A855136k099j794n99k21m45k29K42o7j376l099m961o876q327r005r543j0546
59510A796191j1468j1555j1176j1023j0695r512q094p620p812p239n403l105q91
$$ plain form
59497 1690598 1692067 1695964 1701697 1708423 1715741 1723580 1731926 1741050 1751411 1762927 1774820 1786498 1797938
59484 1797938 1808855 1818273 1825521 1831125 1836075 1840637 1844344 1846807 1848142 1848956 1850097 1852008 1854191 1855828
59470 1855828 1856965 1858332 1859911 1860618 1859735 1857727 1855321 1852710 1850188 1848569 1848287 1848857 1849980 1852503 1857570
59455 1857570 1865435 1875638 1887680 1900791 1913762 1925783 1937018 1947697 1957260 1965079 1971415 1976800
59443 1976800 1980895 1982830 1982450 1980533 1977935 1975119 1972313 1969575 1966900 1964673 1963794 1964879 1967527 1970713
59429 1970713 1973727 1976572 1979791 1984191 1990389 1998361 2007672 2018108 2029656 2041969 2054635 2068029 2083007
59416 2083007 2099521 2116413 2132872 2149308 2166555 2185134 2205424 2227096 2247571 2262239 2267379
59405 2267379 2262504 2249599 2231292 2210597 2191089 2175736 2165866 2162047 2164981 2174137 2186046 2195452
$$ packed form
59497A690598J469L897N733O726P318P839Q346R124J0361J1516J1893J1678J1440
59484A797938J0917R418P248N604M950M562L707K463J335Q14J141J911K183J637
59470A855828J137J367J579P07q83k008k406k611k522j619k82N70J123K523N067
59455A857570P865J0203J2042J3111J2971J2021J1235J0679R563P819O336N385
59443A976800M095J935l80j917k598k816k806k738k675k227q79J085K648L186
59429A970713L014K845L219M400O198P972R311J0436J1548J2313J2666J3394J4978
59416B083007J6514J6892J6459J6436J7247J8579K0290K1672K0475J4668N140
59405B267379m875j2905j8307k0695j9508j5353r870l819K934R156J1909R406
$$ plain form
59393 2195452 2198322 2193191 2180352 2161188 2138263 2114695 2092907 2074193 2059190 2048014 2040199 2035332
59381 2035332 2033709 2035770 2041029 2048241 2056499 2065569 2075279 2085236 2095151 2104905 2114309 2123074 2130948 2137618
59367 2137618 2142783 2146586 2149625 2152245 2154237 2155517 2156529 2157548 2158133 2157859 2157200 2157207 2158671 2161900 2166863
59352 2166863 2173143 2180345 2188972 2200311 2215050 2232614 2252200 2273578 2296297 2319067 2340776 2361386
59340 2361386 2380994 2398686 2413212 2424161 2431566 2435022 2434272 2430131 2423786 2415517 2405024 2392611 2378987
59327 2378987 2364222 2347865 2329929 2310897 2291062 2270681 2250519 2231250 2212580 2193902 2175749
59316 2175749 2159623 2146312 2135143 2124912 2114908 2104962 2095064 2085080 2074690 2063777 2053025 2043602
59304 2043602 2035926 2029276 2023014 2017583 2013787 2011827 2011665 2013633 2017924 2024099 2031859 2041736 2054315 2069419
$$ packed form
59393B195452K870n131j2839j9164k2925k3568k1788j8714j5003j1176p815m867
59381B035332j623K061N259P212Q258R070R710R957R915R754R404Q765P874O670
59367B137618N165L803L039K620J992J280J012J019N85k74o59PJ464L229M963
59352B166863O280P202Q627J1339J4739J7564J9586K1378K2719K2770K1709K0610
59340B361386J9608J7692J4526J0949P405L456p50m141o345q269j0493j2413j3624
59327B378987j4765j6357j7936j9032j9835k0381k0162j9269j8670j8678j8153
59316B175749j6126j3311j1169j0231j0004r946r898r984j0390j0913j0752r423
59304B043602p676o650o262n431l796j960j62J968M291O175P760R877J2579J5104
$$ plain form
59290 2069419 2086697 2106066 2126613 2145885 2161518 2173005 2180929 2185269 2185930 2184410 2183357 2184519 2188186
59277 2188186 2194411 2203568 2215786 2230852 2248563 2268348 2288848 2308826 2328160 2347000 2364432 2379150
59265 2379150 2391065 2401048 2409270 2414968 2417595 2417087 2413228 2405951 2396140 2385039 2373006 2359816 2345767
59252 2345767 2331328 2316094 2299489 2282318 2266196 2251537 2237437 2223509 2210484 2199000 2189134
59241 2189134 2181188 2175563 2171736 2168612 2166038 2164711 2164513 2164292 2163508 2162762 2162415 2162010 2161332 2160785 2160306 2159160
59225 2159160 2157222 2155275 2153561 2151193 2147507 2142983 2138311 2133573 2128855 2124618 2120819 2116511 2110923 2104277
59211 2104277 2097086 2089401 2081286 2073347 2066295 2060402 2055679 2052034 2049048 2046206 2043536 2041539 2040457 2040224
59197 2040224 2041051 2043297 2046817 2051321 2057285 2065492 2075628 2086370 2097031 2108110 2119950 2131851 2142845
$$ packed form
59290B069419J7278J9369K0547J9272J5633J1487P924M340O61j520j053J162L667
59277B188186O225R157J2218J5066J7711J9785K0500J9978J9334J8840J7432J4718
59265B379150J1915R983Q222N698K627n08l859p277r811j1101j2033j3190j4049
59252B345767j4439j5234j6605j7171j6122j4659j4100j3928j3025j1484r866
59241B189134p946n625l827l124k574j327j98k21p84p46l47m05o78n47m79j146
59225B159160j938j947j714k368l686m524m672m738m718m237l799m308n588o646
59211B104277p191p685q115p939p052n893m723l645k986k842k670j997j082k33
59197B040224Q27K246L520M504N964Q207J0136J0742J0661J1079J1840J1901J0994
$$ plain form
59184 2142845 2152473 2160514 2166745 2171201 2173946 2174479 2172230 2167699 2162150 2156077 2148935 2140546 2131722 2123243
59170 2123243 2115232 2107771 2101189 2095500 2090470 2086369 2083688 2082056 2080551 2079223 2079020 2080012 2081072 2081721 2082894
59155 2082894 2085202 2087762 2089518 2090589 2091478 2092026 2092046 2092110 2092732 2093410 2093208 2091622 2088269 2082552 2074499 2065396
59139 2065396 2056807 2049319 2042767 2037107 2032462 2028775 2026000 2024335 2023939 2024829 2027306 2031964 2038977 2047859
59125 2047859 2058105 2069456 2081438 2093428 2105423 2118031 2131444 2145158 2158915 2173047 2187582
59114 2187582 2201834 2215267 2227995 2240046 2250959 2260453 2268745 2275835 2281261 2284894 2287264 2288781 2289388
59101 2289388 2289231 2288737 2287808 2285841 2282912 2279944 2277297 2274186 2269977 2265164 2260623 2256837 2254339 2253834 2255165
59086 2255165 2257036 2258411 2259470 2260653 2261630 2261886 2261556 2260981 2260064 2258614 2256743 2254548 2252103 2250081 2249533
$$ packed form
59184B142845R628Q041O231M456K745N33k249m531n549o073p142q389q824q479
59170B123243q011p461o582n689n030m101k681j632j505j328k03R92J060O49J173
59155B082894K308K560J756J071Q89N48K0O4O22O78k02j586l353n717q053r103
59139B065396q589p488o552n660m645l687k775j665l96Q90K477M658P013Q882
59125B047859J0246J1351J1982J1990J1995J2608J3413J3714J3757J4132J4535
59114B187582J4252J3433J2728J2051J0913R494Q292P090N426L633K370J517O07
59101B289388j57m94r29j967k929k968k647l111m209m813m541l786k498n05J331
59086B255165J871J375J059J183R77K56l30n75r17j450j871k195k445k022n48
$$ plain form
59071 2249533 2250594 2252219 2253545 2254588 2255239 2254715 2252714 2250141 2247939 2246001 2243850 2241477 2238797 2235205
59057 2235205 2230470 2225382 2220814 2216831 2213306 2210623 2209152 2208805 2209643 2212085 2215923 2220091 2224068 2228511
59043 2228511 2233736 2238576 2241713 2243350 2244623 2246110 2247784 2249690 2251705 2253261 2254237 2255606 2258421 2262731
59029 2262731 2268227 2275151 2283707 2293328 2303605 2315396 2329920 2347097 2365667 2384504 2402853 2419549
59017 2419549 2433106 2442726 2448658 2451590 2452059 2450311 2446466 2441008 2435119 2429976 2425635 2421357 2417203 2414436
59003 2414436 2414040 2415742 2418938 2423577 2429557 2436194 2442990 2450119 2457501 2464240 2469687 2474330 2478925 2483424
58989 2483424 2487400 2490840 2493932 2496802 2500006 2504501 2510602 2517771 2525924 2536037 2548930 2564451 2582407
58976 2582407 2603161 2626536 2651238 2676222 2701635 2727602 2753124 2777041 2799004 2818573 2834525
$$ packed form
59071B249533J061J625J326J043O51n24k001k573k202j938k151k373k680l592
59057B235205m735n088m568l983l525k683j471l47Q38K442L838M168L977M443
59043B228511N225M840L137J637J273J487J674J906K015J556R76J369K815M310
59029B262731N496O924Q556R621J0277J1791J4524J7177J8570J8837J8349J6696
59017B419549J3557R620N932K932M69j748l845n458n889n143m341m278m154k767
59003B414436l96J702L196M639N980O637O796P129P382O739N447M643M595M499
58989B483424L976L440L092K870L204M495O101P169Q153J0113J2893J5521J7956
58976B582407K0754K3375K4702K4984K5413K5967K5522K3917K1963J9569J5952
$$ plain form
58965 2834525 2846210 2854667 2861250 2865982 2868276 2868283 2866312 2861775 2853992 2843357 2830664 2815979 2799282
58952 2799282 2781379 2763018 2743871 2723598 2703252 2684407 2667493 2652122 2638404 2626805 2617328
58941 2617328 2609975 2605423 2604160 2605447 2608155 2611995 2617001 2622548 2627919 2633102 2638010 2641778 2643940 2645417
58927 2645417 2647139 2648584 2648969 2648908 2649396 2650034 2649906 2649522 2650147 2651707 2653023 2653842 2655140 2657617 2661339 2666579
58911 2666579 2673627 2681928 2690731 2700444 2712227 2726479 2742751 2760715 2780050 2799865 2819501 2839587
58899 2839587 2861146 2883978 2907004 2929713 2952196 2974354 2996233 3018550 3041640 3064576 3086605
58888 3086605 3108693 3132241 3157034 3182048 3207453 3233935 3260571 3285394 3307876 3329070 3349426
58877 3349426 3368209 3385009 3400111 3413288 3423653 3430657 3433967 3432756 3426730 3417507 3407220 3395928
$$ packed form
58965B834525J1685Q457O583M732K294Pj971m537p783j0635j2693j4685j6697
58952B799282j7903j8361j9147k0273k0346j8845j6914j5371j3718j1599r477
58941B617328p353m552j263J287K708L840N006N547N371N183M908L768K162J477
58927B645417J722J445L85o1M88O38j28l84O25J560J316Q19J298K477L722N240
58911B666579P048Q301Q803R713J1783J4252J6272J7964J9335J9815J9636K0086
58899B839587K1559K2832K3026K2709K2483K2158K1879K2317K3090K2936K2029
58888C086605K2088K3548K4793K5014K5405K6482K6636K4823K2482K1194K0356
58877C349426J8783J6800J5102J3177J0365P004L310j211o026r223j0287j1292
$$ plain form
58865 3395928 3382218 3366128 3349384 3332648 3314673 3294757 3274157 3254331 3235257 3216250 3197232
58854 3197232 3178520 3160392 3143376 3128066 3114252 3100946 3087367 3073129 3057668 3040562 3022321
58843 3022321 3003776 2984807 2964828 2944339 2924730 2906583 2889453 2873346 2859147 2847490 2838328
58832 2838328 2831644 2827424 2824968 2823337 2822537 2823253 2825605 2829210 2834132 2840531 2847682 2854694 2861941 2870451
58818 2870451 2880129 2889961 2899608 2909300 2918432 2925976 2932165 2938116 2943853 2948317 2951239 2953364 2954834 2954981
58804 2954981 2953727 2951508 2947904 2942154 2935113 2928805 2923823 2918972 2913701 2909030 2905753 2903628 2902806 2904212
58790 2904212 2907864 2912507 2917620 2924282 2933436 2944775 2957938 2973292 2990896 3010066 3030622 3053209
58778 3053209 3077780 3102945 3127344 3150457 3171632 3189664 3203761 3213722 3218812 3217817 3210672 3198861
$$ packed form
58865C395928j3710j6090j6744j6736j7975j9916k0600j9826j9074j9007j9018
58854C197232j8712j8128j7016j5310j3814j3306j3579j4238j5461j7106j8241
58843C022321j8545j8969j9979k0489j9609j8147j7130j6107j4199j1657r162
58832B838328o684m220k456j631q00P16K352L605M922O399P151P012P247Q510
58818B870451R678R832R647R692R132P544O189N951N737M464K922K125J470J47
58804B954981j254k219l604n750p041o308m982m851n271m671l277k125q22J406
58790B904212L652M643N113O662R154J1339J3163J5354J7604J9170K0556K2587
58778C053209K4571K5165K4399K3113K1175J8032J4097R961N090r95p145j1811
$$ plain form
58766 3198861 3183931 3166858 3148907 3131415 3114315 3096552 3078516 3062504 3050105 3040596 3032553 3025565
58754 3025565 3019620 3014179 3008815 3003762 2999179 2994772 2990614 2987310 2985068 2983657 2983501 2985578 2990010 2996001
58740 2996001 3003285 3012301 3022769 3033567 3044195 3054857 3064983 3073420 3080390 3087558 3095700 3103986 3111904
58727 3111904 3120038 3128413 3135885 3141978 3147677 3153760 3159973 3166545 3174819 3185585 3198288 3212521 3228627
58714 3228627 3246064 3262906 3277871 3291341 3303560 3313375 3319609 3322134 3320714 3314406 3303097 3288281
58702 3288281 3271371 3252523 3231822 3210136 3187981 3164981 3141379 3118708 3098208 3079850 3063561
58691 3063561 3049962 3039224 3030679 3024138 3020044 3017834 3016010 3014473 3014817 3017461 3020544 3022653 3024608 3027344
58677 3027344 3030037 3031786 3033316 3035438 3037460 3038720 3040272 3043504 3048325 3054030 3060746 3068850 3078279 3089505
$$ packed form
58766C198861j4930j7073j7951j7492j7100j7763j8036j6012j2399r509q043o988
58754C025565n945n441n364n053m583m407m158l304k242j411j56K077M432N991
58740B996001P284R016J0468J0798J0628J0662J0126Q437O970P168Q142Q286P918
58727C111904Q134Q375P472O093N699O083O213O572Q274J0766J2703J4233J6106
58714C228627J7437J6842J4965J3470J2219R815O234K525j420o308j1309j4816
58702C288281j6910j8848k0701k1686k2155k3000k3602k2671k0500j8358j6289
58691C063561j3599j0738q545o541m094k210j824j537L44K644L083K109J955K736
58677C027344K693J749J530K122K022J260J552L232M821N705O716Q104R429J1226
$$ plain form
58663 3089505 3103665 3120417 3137076 3151126 3162166 3170329 3174617 3174403 3171044 3166228 3159996 3151981 3143326
58650 3143326 3135657 3129151 3123159 3117792 3113452 3109764 3106311 3103578 3101997 3101063 3100546 3101441 3104495 3108845 3113311
58635 3113311 3118016 3123611 3129924 3136398 3142828 3148757 3153340 3156654 3159865 3163313 3165971 3167645 3169903 3173773
58621 3173773 3178315 3182674 3187639 3193825 3200221 3206117 3212641 3220734 3229408 3237704 3246565 3256845 3267254
58608 3267254 3276359 3285026 3294726 3304916 3314322 3323408 3333206 3342880 3350849 3357407 3363990 3370690 3376688 3382340
58594 3382340 3388704 3395605 3402192 3408885 3416912 3426491 3437176 3449375 3463864 3480404 3498378 3518011
58582 3518011 3539415 3561279 3582140 3602132 3621878 3640558 3656717 3670197 3681732 3691653 3700660 3710829
58570 3710829 3723978 3739830 3757452 3777575 3801700 3829780 3860650 3894061 3930491 3969548 4010062
$$ packed form
58663C089505J4160J6752J6659J4050J1040Q163M288k14l359m816o232q015q655
58650C143326p669o506n992n367m340l688l453k733j581r34n17Q95L054M350M466
58635C113311M705N595O313O474O430N929M583L314L211L448K658J674K258L870
58621C173773M542M359M965O186O396N896O524Q093Q674Q296Q861J0280J0409
58608C267254R105Q667R700J0190R406R086R798R674P969O558O583O700N998N652
58594C382340O364O901O587O693Q027R579J0685J2199J4489J6540J7974J9633
58582C518011K1404K1864K0861J9992J9746J8680J6159J3480J1535R921R007J0169
58570C710829J3149J5852J7622K0123K4125K8080L0870L3411L6430L9057M0514
$$ plain form
58559 4010062 4051035 4090986 4127282 4157704 4181942 4200250 4211848 4216320 4215499 4212186 4207870 4203186
58547 4203186 4199358 4197288 4196135 4194516 4192145 4188798 4182917 4173053 4159561 4143201 4123374 4099587 4073351
58534 4073351 4046692 4020079 3993734 3969471 3948884 3930964 3913876 3898009 3884983 3874778 3866221
58523 3866221 3859352 3854902 3852261 3850170 3848638 3848152 3848118 3848145 3849528 3853099 3856983 3859060 3860411 3863595 3868675
58508 3868675 3873867 3879076 3885645 3893255 3900182 3906325 3913139 3920835 3928304 3935489 3943219 3950982 3957530 3963510
58494 3963510 3971022 3980615 3991019 4001601 4012908 4025073 4037817 4051756 4067731 4085343 4104068 4125005
58482 4125005 4149414 4176403 4204369 4233735 4265801 4299718 4333070 4364556 4393517 4417806 4435052
58471 4435052 4445411 4450482 4450349 4444423 4434344 4422988 4411301 4399028 4387817 4380427 4377382 4377461 4380969
$$ packed form
58559D010062M0973L9951L6296L0422K4238J8308J1598M472q21l313m316m684
58547D203186l828k070j153j619k371l347n881r864j3492j6360j9827k3787k6236
58534D073351k6659k6613k6345k4263k0587j7920j7088j5867j3026j0205q557
58523C866221o869m450k641k091j532m86l4K7J383L571L884K077J351L184N080
58508C868675N192N209O569P610O927O143O814P696P469P185P730P763O548N980
58494C963510P512R593J0404J0582J1307J2165J2744J3939J5975J7612J8725K0937
58482D125005K4409K6989K7966K9366L2066L3917L3352L1486K8961K4289J7246
58471D435052J0359N071j33n926j0079j1356j1687j2273j1211p390l045P9L508
$$ plain form
58458 4380969 4389425 4402480 4418398 4437189 4460050 4485935 4511856 4536389 4559742 4580588 4596114
58447 4596114 4605242 4608779 4606559 4597678 4583641 4568077 4553030 4538332 4524558 4513525 4505708 4500046
58435 4500046 4496516 4496132 4498462 4501903 4506462 4513515 4522993 4533575 4545430 4559901 4576693 4594214 4612291
58422 4612291 4631532 4650353 4665800 4677105 4685491 4690894 4692102 4689746 4685917 4681152 4674949 4668683 4664593
58409 4664593 4662328 4659963 4657760 4657278 4657601 4656587 4655403 4657463 4663054 4669333 4675594 4684050 4695151 4706589
58395 4706589 4717491 4729318 4742047 4753663 4764114 4775690 4788733 4800892 4811319 4821784 4833044
58384 4833044 4843907 4854349 4865736 4877603 4888126 4897990 4909654 4922676 4934221 4944474 4956859
58373 4956859 4972367 4988371 5003747 5020428 5039068 5057929 5077057 5098827 5123267 5147571 5171247
$$ packed form
58458D380969Q456J3055J5918J8791K2861K5885K5921K4533K3353K0846J5526
58447D596114R128L537k220q881j4037j5564j5047j4698j3774j1033p817n662
58435D500046l530l84K330L441M559P053R478J0582J1855J4471J6792J7521J8077
58422D612291J9241J8821J5447J1305Q386N403J208k356l829m765o203o266m090
58409D664593k265k365k203m82L23j014j184K060N591O279O261Q456J1101J1438
58395D706589J0902J1827J2729J1616J0451J1576J3043J2159J0427J0465J1260
58384D833044J0863J0442J1387J1867J0523R864J1664J3022J1545J0253J2385
58373D956859J5508J6004J5376J6681J8640J8861J9128K1770K4440K4304K3676
$$ plain form
58362 5171247 5196955 5225052 5252304 5277363 5302587 5328720 5352591 5372014 5388518 5403452 5415719
58351 5415719 5425156 5433912 5442838 5450538 5457365 5466097 5477441 5489195 5500980 5515167 5532063 5549105
58339 5549105 5566183 5586698 5611785 5638422 5664859 5692925 5723343 5753831 5783562 5814482 5846462
58328 5846462 5876081 5901865 5925687 5947598 5964692 5976772 5987719 5999492 6010267 6020044 6032143
58317 6032143 6047280 6062090 6075532 6090763 6108779 6126528 6143537 6163852 6188898 6214883 6239850
58306 6239850 6266635 6296060 6324052 6348794 6374072 6402172 6429977 6455507 6481735 6510403 6538595
58295 6538595 6564939 6592619 6622777 6651719 6678263 6706852 6739718 6773093 6805014 6839445 6878415
58284 6878415 6917577 6954164 6991992 7033924 7076769 7118484 7162855 7211949 7261438 7308696 7358008
$$ packed form
58362E171247K5708K8097K7252K5059K5224K6133K3871J9423J6504J4934J2267
58351E415719R437Q756Q926P700O827Q732J1344J1754J1785J4187J6896J7042
58339E549105J7078K0515K5087K6637K6437K8066L0418L0488K9731L0920L1980
58328E846462K9619K5784K3822K1911J7094J2080J0947J1773J0775R777J2099
58317F032143J5137J4810J3442J5231J8016J7749J7009K0315K5046K5985K4967
58306F239850K6785K9425K7992K4742K5278K8100K7805K5530K6228K8668K8192
58295F538595K6344K7680L0158K8942K6544K8589L2866L3375L1921L4431L8970
58284F878415L9162L6587L7828M1932M2845M1715M4371M9094M9489M7258M9312
$$ plain form
58273 7358008 7412447 7468196 7522423 7578983 7640524 7702787 7762794 7825012 7893220 7963969 8034300
58262 8034300 8108051 8188039 8269700 8348912 8428277 8509434 8587523 8659899 8731925 8807393 8881883
58251 8881883 8952479 9024976 9104312 9187077 9270851 9361212 9461688 9566756 9672918 9786558
58241 9786558 9912332 10044299 10177490 10317520 10469496 10628529 10790902 10963103 11149619
58232 11149619 11343666 11540664 11748726 11974684 12212504 12457269 12717366 13000248 13299782
58223 13299782 13610872 13942618 14303250 14686860 15089692 15524157 16001207 16514943 17061172
58214 17061172 17654414 18309247 19022970 19795583 20647938 21600081 22652139 23808840 25101972
58205 25101972 26565980 28215788 30075671 32206222 34676838 37542536 40883422 44841768
$$ packed form
58273G358008N4439N5749N4227N6560O1541O2263O0007O2218O8208P0749P0331
58262H034300P3751P9988Q1661P9212P9365Q1157P8089P2376P2026P5468P4490
58251H881883P0596P2497P9336Q2765Q3774R0361J00476J05068J06162J13640
58241I786558J25774J31967J33191J40030J51976J59033J62373J72201J86516
58232A1149619J94047J96998K08062K25958K37820K44765K60097K82882K99534
58223A3299782L11090L31746L60632L83610M02832M34465M77050N13736N46229
58214A7061172N93242O54833P13723P72613Q52355R52143J052058J156701J293132
58205B5101972J464008J649808J859883K130551K470616K865698L340886L958346
$$ plain form
58197 44841768 49593156 55326595 62304649 70913457 81616617 94917682 111430406 131913067
58189 131913067 157100346 187438443 222851596 262350176 303382444 341549009 371530034
58182 371530034 389024762 392307370 382317638 361675597 333721065 301980484 269704436
58175 269704436 239336428 212255099 188942475 169270715 152673272 138336684 125512969
58168 125512969 113742128 102814718 92635124 83190908 74567074 66867937 60112112
58161 60112112 54235287 49159603 44808111 41077945 37857444 35067215 32652547 30550244
58153 30550244 28696999 27057950 25615076 24336866 23185982 22145143 21208450 20356464
58145 20356464 19564187 18824411 18139991 17501436 16893821 16317696 15782094 15283835 14812909
$$ packed form
58197D4841768M751388N733439O978054Q608808J0703160J3301065J6512724K0482661
58189A31913067K5187279L0338097L5413153L9498580M1032268L8166565K9981025
58182C71530034J7494728L282608r989732k0642041k7954532l1740581l2276048
58175B69704436l0368008k7081329k3312624j9671760j6597443j4336588j2823715
58168A25512969j1770841j0927410j0179594r444216q623834p699137o755825
58161F0112112n876825n075684m351492l730166l220501k790229k414668k102303
58153C0550244j853245j639049j442874j278210j150884j040839r36693q51986
58145B0356464p92277p39776o84420o38555o07615n76125n35602m98259m70926
$$ plain form
58136 14812909 14371013 13965706 13592403 13239882 12907566 12600408 12312539 12032501 11759561
58127 11759561 11499465 11249424 11002482 10761730 10535313 10321557 10113045 9911049 9722312
58118 9722312 9545557 9374471 9210393 9059295 8919557 8784936 8656432 8539576 8433179
58109 8433179 8331998 8237261 8153475 8077972 8004422 7933670 7870611 7813471 7756691 7701511 7653326
58098 7653326 7611221 7570243 7531440 7499658 7473764 7448790 7425504 7408242 7395372 7381407 7366767
58087 7366767 7356243 7349538 7342239 7334493 7329861 7327104 7321733 7314239 7308511 7303629 7295562 7285498 7278171
58074 7278171 7273216 7266296 7257579 7251020 7246397 7240045 7232494 7227516 7224516 7219710 7214057 7212246 7214414 7216435
58060 7216435 7217868 7222004 7228378 7232801 7234774 7237666 7241476 7242542 7240624 7239447 7239936 7239498 7238231 7239330
$$ packed form
58136A4812909m41896m05307l73303l52521l32316l07158k87869k80038k72940
58127A1759561k60096k50041k46942k40752k26417k13756k08512k01996j88737
58118I722312j76755j71086j64078j51098j39738j34621j28504j16856j06397
58109H433179j01181r4737q3786p5503p3550p0752o3059n7140n6780n5180m8185
58098G653326m2105m0978l8803l1782k5894k4974k3286j7262j2870j3965j4640
58087G366767j0524o705p299p746m632k757n371p494n728m882q067j0064p327
58074G278171m955o920q717o559m623o352p551m978l000m806n653j811K168K021
58060G216435J433M136O374M423J973K892L810J066j918j177M89m38j267J099
$$ plain form
58046 7239330 7243068 7246712 7250623 7257990 7268153 7276561 7282054 7288167 7296519 7304738 7311723 7319243 7327465 7334252
58032 7334252 7339714 7346427 7354525 7361459 7366952 7373254 7380290 7385600 7389376 7394482 7401229 7407180 7412352 7419453
58018 7419453 7428659 7437324 7445286 7455223 7467216 7478182 7487468 7497934 7510606 7523186 7534822 7547491
58006 7547491 7561571 7574755 7586543 7599396 7614276 7629312 7643963 7660228 7678616 7696984 7714447
57995 7714447 7732526 7751424 7769098 7785049 7801267 7818536 7835389 7851453 7868058 7884840 7899594
57984 7899594 7912287 7925520 7940290 7955003 7969317 7985137 8003000 8021230 8039513 8059691 8082251
57973 8082251 8105618 8129597 8155761 8183695 8210534 8235055 8258575 8281108 8300351 8315399 8327814
57962 8327814 8338162 8345057 8348485 8350550 8352115 8352257 8351728 8353197 8357228 8361702 8366011 8372001 8379927 8387588
$$ packed form
58046G239330L738L644L911P367J0163Q408N493O113Q352Q219O985P520Q222O787
58032G334252N462O713Q098O934N493O302P036N310L776N106O747N951N172P101
58018G419453R206Q665P962R937J1993J0966R286J0466J2672J2580J1636J2669
58006G547491J4080J3184J1788J2853J4880J5036J4651J6265J8388J8368J7463
57995G714447J8079J8898J7674J5951J6218J7269J6853J6064J6605J6782J4754
57984G899594J2693J3233J4770J4713J4314J5820J7863J8230J8283K0178K2560
57973H082251K3367K3979K6164K7934K6839K4521K3520K2533J9243J5048J2415
57962H327814J0348O895L428K065J565J42n29J469M031M474M309N990P926P661
$$ plain form
57948 8387588 8394652 8403779 8415998 8428888 8440976 8454204 8470168 8487481 8504787 8523168 8543658 8565318
57936 8565318 8587516 8611298 8636899 8662625 8687610 8712904 8738565 8762585 8783916 8803662 8822056
57925 8822056 8837447 8849608 8860871 8872450 8882760 8890945 8898951 8908397 8918387 8928202 8939234 8952404
57913 8952404 8966497 8980920 8997395 9016972 9037953 9058616 9079428 9100683 9120587 9137729 9153154
57902 9153154 9168018 9181421 9192458 9202290 9212340 9222473 9232631 9244198 9257891 9272272 9286019
57891 9286019 9299845 9314738 9330270 9346073 9362965 9381158 9399338 9416870 9434833 9453657 9472050
57880 9472050 9489625 9508124 9528369 9548391 9566380 9583322 9600856 9618623 9635670 9652557 9670237
57869 9670237 9688570 9707565 9728268 9750845 9773666 9795881 9819032 9844505 9871271 9897785 9924211
$$ packed form
57948H387588P064R127J2219J2890J2088J3228J5964J7313J7306J8381K0490K1660
57936H565318K2198K3782K5601K5726K4985K5294K5661K4020K1331J9746J8394
57925H822056J5391J2161J1263J1579J0310Q185Q006R446R990R815J1032J3170
57913H952404J4093J4423J6475J9577K0981K0663K0812K1255J9904J7142J5425
57902I153154J4864J3403J1037R832J0050J0133J0158J1567J3693J4381J3747
57891I286019J3826J4893J5532J5803J6892J8193J8180J7532J7963J8824J8393
57880I472050J7575J8499K0245K0022J7989J6942J7534J7767J7047J6887J7680
57869I670237J8333J8995K0703K2577K2821K2215K3151K5473K6766K6514K6426
$$ plain form
57858 9924211 9951129 9977997 10004574 10031992 10060676 10089033 10115861 10142150 10168835 10194796 10218971
57847 10218971 10242476 10266529 10290077 10311639 10331854 10351984 10371347 10388529 10403983 10419402 10435505
57836 10435505 10452191 10469804 10488522 10507519 10526246 10545464 10565688 10585906 10605295 10624785 10645421
57825 10645421 10666555 10687201 10707742 10728738 10749491 10769467 10789734 10811239 10832966 10853529 10873362
57814 10873362 10893648 10914338 10934939 10956104 10978715 11002387 11026489 11051557 11078115 11105113 11130990
57803 11130990 11155344 11178311 11199604 11219562 11239794 11261233 11282857 11303841 11325580 11349811 11376024
57792 11376024 11402497 11428788 11455411 11482079 11508035 11533251 11557735 11580577 11601202 11620679 11640354
57781 11640354 11660184 11679745 11699678 11720668 11742144 11763456 11785166 11807682 11829941 11851124 11872405
$$ packed form
57858I924211K6918K6868K6577K7418K8684K8357K6828K6289K6685K5961K4175
57847A0218971K3505K4053K3548K1562K0215K0130J9363J7182J5454J5419J6103
57836A0435505J6686J7613J8718J8997J8727J9218K0224K0218J9389J9490K0636
57825A0645421K1134K0646K0541K0996K0753J9976K0267K1505K1727K0563J9833
57814A0873362K0286K0690K0601K1165K2611K3672K4102K5068K6558K6998K5877
57803A1130990K4354K2967K1293J9958K0232K1439K1624K0984K1739K4231K6213
57792A1376024K6473K6291K6623K6668K5956K5216K4484K2842K0625J9477J9675
57781A1640354J9830J9561J9933K0990K1476K1312K1710K2516K2259K1183K1281
$$ plain form
57770 11872405 11895107 11918254 11939812 11959411 11978038 11996004 12013095 12029990 12047705 12066167 12084826
57759 12084826 12103940 12123916 12144211 12164337 12185049 12207135 12229981 12252739 12275860 12300084 12325039
57748 12325039 12350310 12376633 12404400 12432190 12458563 12484177 12510426 12537147 12563575 12590317 12618325
57737 12618325 12646866 12674573 12701674 12729240 12757147 12784734 12812585 12841555 12870873 12899273 12927268
57726 12927268 12956232 12986007 13015609 13045473 13076640 13108265 13138384 13166853 13195208 13223832 13251628
57715 13251628 13278482 13305780 13334189 13362868 13391147 13419198 13446774 13472974 13497634 13521627 13545570
57704 13545570 13569388 13593138 13617078 13641066 13664993 13689582 13715668 13743063 13771196 13800215 13830234
57693 13830234 13860280 13889482 13918605 13948792 13979406 14008808 14036699 14064013 14091113 14117905 14145255
$$ packed form
57770A1872405K2702K3147K1558J9599J8627J7966J7091J6895J7715J8462J8659
57759A2084826J9114J9976K0295K0126K0712K2086K2846K2758K3121K4224K4955
57748A2325039K5271K6323K7767K7790K6373K5614K6249K6721K6428K6742K8008
57737A2618325K8541K7707K7101K7566K7907K7587K7851K8970K9318K8400K7995
57726A2927268K8964K9775K9602K9864L1167L1625L0119K8469K8355K8624K7796
57715A3251628K6854K7298K8409K8679K8279K8051K7576K6200K4660K3993K3943
57704A3545570K3818K3750K3940K3988K3927K4589K6086K7395K8133K9019L0019
57693A3830234L0046K9202K9123L0187L0614K9402K7891K7314K7100K6792K7350
$$ plain form
57682 14145255 14174425 14205421 14237581 14271360 14307673 14346008 14385242 14426095 14470759 14520294 14574422
57671 14574422 14633847 14700759 14776900 14862950 14959683 15067242 15182372 15297668 15404047 15493135
57661 15493135 15558143 15595232 15605292 15593420 15566204 15530116 15491606 15456331 15427428 15405644 15391319
57650 15391319 15385009 15386236 15393197 15404142 15418067 15434237 15452309 15472801 15496022 15520655 15544794 15568248
57638 15568248 15592277 15617224 15642051 15666267 15690572 15715334 15740001 15764410 15789315 15815264 15842124
57627 15842124 15869775 15898148 15926519 15954109 15981374 16009409 16038081 16066078 16092856 16119222 16146010
57616 16146010 16173498 16201987 16231570 16261385 16290497 16319401 16349239 16379803 16409939 16439759 16470570
57605 16470570 16502540 16534289 16565083 16595705 16626786 16657948 16689024 16720612 16752909 16785323 16817671
$$ packed form
57682A4145255K9170L0996L2160L3779L6313L8335L9234M0853M4664M9535N4128
57671A4574422N9425O6912P6141Q6050R6733J07559J15130J15296J06379Q9088
57661A5493135O5008L7089J0060j1872k7216l6088l8510l5275k8903k1784j4325
57650A5391319o310J227O961J0945J3925J6170J8072K0492K3221K4633K4139K3454
57638A5568248K4029K4947K4827K4216K4305K4762K4667K4409K4905K5949K6860
57627A5842124K7651K8373K8371K7590K7265K8035K8672K7997K6778K6366K6788
57616A6146010K7488K8489K9583K9815K9112K8904K9838L0564L0136K9820L0811
57605A6470570L1970L1749L0794L0622L1081L1162L1076L1588L2297L2414L2348
$$ plain form
57594 16817671 16850514 16884016 16917620 16951054 16984483 17017666 17050294 17083066 17117024 17151861 17186369
57583 17186369 17220413 17254768 17289087 17321951 17353110 17383785 17414473 17444368 17473310 17502333 17531717
57572 17531717 17560374 17587838 17615155 17643131 17671464 17700231 17730384 17761874 17793008 17822812 17852546
57561 17852546 17883794 17916349 17949035 17981460 18013907 18046454 18079135 18112205 18145663 18179385 18214054
57550 18214054 18250775 18289346 18328135 18366155 18403982 18442042 18479424 18515235 18549942 18584526 18619251
57539 18619251 18653944 18688590 18723037 18757011 18790799 18825011 18859466 18893401 18926905 18960765 18994713
57528 18994713 19027449 19058797 19090251 19122788 19155774 19188675 19222218 19256918 19292003 19326817 19361932
57517 19361932 19397892 19434140 19470164 19506460 19543345 19580056 19616047 19652051 19688777 19725625 19761710
$$ packed form
57594A6817671L2843L3502L3604L3434L3429L3183L2628L2772L3958L4837L4508
57583A7186369L4044L4355L4319L2864L1159L0675L0688K9895K8942K9023K9384
57572A7531717K8657K7464K7317K7976K8333K8767L0153L1490L1134K9804K9734
57561A7852546L1248L2555L2686L2425L2447L2547L2681L3070L3458L3722L4669
57550A8214054L6721L8571L8789L8020L7827L8060L7382L5811L4707L4584L4725
57539A8619251L4693L4646L4447L3974L3788L4212L4455L3935L3504L3860L3948
57528A8994713L2736L1348L1454L2537L2986L2901L3543L4700L5085L4814L5115
57517A9361932L5960L6248L6024L6296L6885L6711L5991L6004L6726L6848L6085
$$ plain form
57506 19761710 19797166 19832396 19867007 19900549 19933526 19966670 19999908 20032787 20065214 20097171 20128572
57495 20128572 20159989 20192467 20225959 20259037 20290869 20322375 20354582 20386958 20418282 20448169 20476820
57484 20476820 20504221 20530564 20556618 20582792 20608543 20633508 20658408 20684162 20710870 20738271 20766291
57473 20766291 20794580 20822435 20849772 20877194 20904656 20931243 20956798 20982394 21008542 21034328 21059142
57462 21059142 21083834 21109268 21135138 21161235 21188351 21216727 21244985 21271954 21298239 21324637 21350367
57451 21350367 21374541 21398236 21423302 21449886 21476873 21504075 21532207 21561060 21589411 21616685 21643423
57440 21643423 21670190 21697069 21724096 21751294 21778489 21805819 21834025 21863497 21893562 21923350 21952718
57429 21952718 21981592 22009202 22034902 22059113 22082633 22105687 22128381 22151239 22174316 22196628 22217398
$$ packed form
57506A9761710L5456L5230L4611L3542L2977L3144L3238L2879L2427L1957L1401
57495B0128572L1417L2478L3492L3078L1832L1506L2207L2376L1324K9887K8651
57484B0476820K7401K6343K6054K6174K5751K4965K4900K5754K6708K7401K8020
57473B0766291K8289K7855K7337K7422K7462K6587K5555K5596K6148K5786K4814
57462B1059142K4692K5434K5870K6097K7116K8376K8258K6969K6285K6398K5730
57451B1350367K4174K3695K5066K6584K6987K7202K8132K8853K8351K7274K6738
57440B1643423K6767K6879K7027K7198K7195K7330K8206K9472L0065K9788K9368
57429B1952718K8874K7610K5700K4211K3520K3054K2694K2858K3077K2312K0770
$$ plain form
57418 22217398 22237166 22256788 22276232 22295276 22314450 22334206 22354093 22373918 22394791 22417750 22442138
57407 22442138 22466544 22490492 22513852 22535564 22554537 22571261 22587061 22602285 22616672 22630889 22646096
57396 22646096 22662279 22678519 22694691 22711512 22729084 22746771 22764422 22782409 22800507 22817850 22833996
57385 22833996 22849088 22863164 22876335 22889439 22903471 22918436 22933581 22948433 22962734 22975770 22986872
57374 22986872 22996396 23005277 23013834 23021775 23028947 23035134 23039662 23042249 23043854 23045673 23047673 23049112 23049983 23050765
57360 23050765 23051168 23050380 23048314 23045505 23042121 23038153 23034259 23031126 23028189 23024163 23018704 23012502 23005901 22998558
57346 22998558 22990353 22981535 22972040 22961575 22950261 22938278 22925095 22910029 22893473 22876657 22860265 22844024
57334 22844024 22827346 22809640 22790346 22769473 22747789 22725828 22703325 22680341 22657971 22636789 22615461
$$ packed form
57418B2217398J9768J9622J9444J9044J9174J9756J9887J9825K0873K2959K4388
57407B2442138K4406K3948K3360K1712J8973J6724J5800J5224J4387J4217J5207
57396B2646096J6183J6240J6172J6821J7572J7687J7651J7987J8098J7343J6146
57385B2833996J5092J4076J3171J3104J4032J4965J5145J4852J4301J3036J1102
57374B2986872R524Q881Q557P941P172O187M528K587J605J819K000J439Q71P82
57360B3050765M03p88k066k809l384l968l894l133k937m026n459o202o601p343
57346B2998558q205q818r495j0465j1314j1983j3183j5066j6556j6816j6392j6241
57334B2844024j6678j7706j9294k0873k1684k1961k2503k2984k2370k1182k1328
$$ plain form
57323 22615461 22592353 22567854 22543587 22519836 22495419 22469769 22443445 22416682 22389028 22360507 22331681
57312 22331681 22302511 22272456 22241696 22210878 22179642 22146835 22112349 22077382 22042628 22007515 21971515
57301 21971515 21934989 21898313 21861134 21822955 21783644 21743231 21701915 21660294 21618806 21576997 21534166
57290 21534166 21490439 21446307 21401406 21354962 21307172 21258889 21210021 21159602 21107446 21054438 21001093
57279 21001093 20947055 20892174 20836818 20780927 20723915 20665748 20607063 20548089 20488472 20428264 20367984
57268 20367984 20307622 20246777 20185865 20125985 20067368 20009116 19950644 19892157 19833475 19773729 19712686
57257 19712686 19651238 19590053 19528645 19466227 19402573 19337706 19271611 19204623 19137257 19069286 18999663
57246 18999663 18927606 18853045 18775992 18696288 18613994 18529178 18441257 18349477 18253980 18155448 18053797
$$ packed form
57323B2615461k3108k4499k4267k3751k4417k5650k6324k6763k7654k8521k8826
57312B2331681k9170l0055l0760l0818l1236l2807l4486l4967l4754l5113l6000
57301B1971515l6526l6676l7179l8179l9311m0413m1316m1621m1488m1809m2831
57290B1534166m3727m4132m4901m6444m7790m8283m8868n0419n2156n3008n3345
57279B1001093n4038n4881n5356n5891n7012n8167n8685n8974n9617o0208o0280
57268B0367984o0362o0845o0912n9880n8617n8252n8472n8487n8682n9746o1043
57257A9712686o1448o1185o1408o2418o3654o4867o6095o6988o7366o7971o9623
57246A8999663p2057p4561p7053p9704q2294q4816q7921r1780r5497r8532j01651
$$ plain form
57235 18053797 17948336 17839227 17727497 17613449 17496288 17375599 17252045 17126393 16999014
57226 16999014 16870683 16742639 16615349 16488175 16360698 16233526 16107544 15983240 15860986
57217 15860986 15741032 15622975 15506190 15390989 15278465 15169130 15062724 14959322 14859394
57208 14859394 14762622 14667964 14575130 14484762 14396948 14310906 14226392 14143962 14063351 13983113 13902495
57197 13902495 13822266 13742868 13663064 13581402 13497905 13413324 13327609 13240146 13150847 13060090 12968066
57186 12968066 12874738 12779944 12683100 12583468 12481040 12376484 12269931 12160705 12048589 11934353
57176 11934353 11818591 11701043 11581531 11460574 11338471 11214763 11089225 10962486 10835060
57167 10835060 10706742 10577662 10448988 10321753 10195785 10070573 9946443 9824069 9703557
$$ packed form
57235A8053797j05461j09109j11730j14048j17161j20689j23554j25652j27379
57226A6999014j28331j28044j27290j27174j27477j27172j25982j24304j22254
57217A5860986j19954j18057j16785j15201j12524j09335j06406j03402r9928
57208A4859394r6772r4658r2834r0368q7814q6042q4514q2430q0611q0238q0618
57197A3902495q0229p9398p9804q1662q3497q4581q5715q7463q9299r0757r2024
57186A2968066r3328r4794r6844r9632j02428j04556j06553j09226j12116j14236
57176A1934353j15762j17548j19512j20957j22103j23708j25538j26739j27426
57167A0835060j28318j29080j28674j27235j25968j25212j24130j22374j20512
$$ plain form
57158 9703557 9584932 9469009 9356878 9248887 9144725 9044104 8946724 8851961 8759263 8668669
57148 8668669 8580567 8495228 8412890 8333858 8258122 8185085 8113789 8043111 7971731 7898595 7823558
57137 7823558 7747085 7669238 7589519 7507618 7423490 7336631 7246142 7151796 7054354 6954682 6853260
57126 6853260 6750685 6647831 6545359 6443780 6344159 6248029 6156625 6071080 5993401 5926274
57116 5926274 5871680 5830502 5803412 5790990 5792683 5806645 5831113 5865512 5910453 5967770 6040782
57105 6040782 6133708 6250844 6397205 6580042 6809003 7095287 7452103 7896409 8449763 9138345
57095 9138345 9993934 11055399 12368508 13984033 15955269 18333793 21162508 24468798
57087 24468798 28260727 32524611 37222087 42288619 47632506 53128873 58614823 63909972
$$ packed form
57158I703557j18625j15923j12131j07991j04162j00621r7380r4763r2698r0594
57148H668669q8102q5339q2338p9032p5736p3037p1296p0678p1380p3136p5037
57137G823558p6473p7847p9719q1901q4128q6859r0489r4346r7442r9672j01422
57126F853260j02575j02854j02472j01579r9621r6130r1404q5545p7679o7127
57116E926274n4594m1178k7090j2422J693J3962K4468L4399M4941N7317P3012
57105F040782R2926J17136J46361J82837K28961K86284L56816M44306N53354O88582
57095I138345Q55589J061465J313109J615525J971236K378524K828715L306290
57087B4468798L791929M263884M697476N066532N343887N496367N485950N295149
$$ plain form
57079 63909972 68871450 73441884 77627746 81403197 84618765 87004109 88271705 88241924
57071 88241924 86903134 84383322 80874118 76566977 71635041 66251090 60606553 54906667
57063 54906667 49346377 44086744 39242791 34881303 31025832 27667795 24778978 22319805
57055 22319805 20243689 18501287 17044388 15826985 14805292 13940247 13200734 12563414
57047 12563414 12010088 11526573 11102755 10730818 10402714 10110274 9846952 9607677 9387395
57038 9387395 9181360 8986381 8800071 8619246 8440691 8263085 8086573 7910875 7735447
57029 7735447 7560976 7388851 7219309 7051716 6886438 6724939 6568258 6416822 6271463
57020 6271463 6133230 6002451 5878661 5759679 5638457 5501908 5336152 5134075 4897136
$$ packed form
57079F3909972M961478M570434M185862L775451L215568K385344J267596k9781
57071H8241924j338790k519812l509204m307141m931936n383951n644537n699886
57063E4906667n560290n259633m843953m361488l855471l358037k888817k459173
57055B2319805k076116j742402j456899j217403j021693q65045p39513o37320
57047A2563414n53326m83515m23818l71937l28104k92440k63322k39275k20282
57038I387395k06035j94979j86310j80825j78555j77606j76512j75698j75428
57029G735447j74471j72125j69542j67593j65278j61499j56681j51436j45359
57020F271463j38233j30779j23790j18982j21222j36549j65756k02077k36939
$$ plain form
57011 4897136 4631264 4343706 4043302 3740053 3442406 3155900 2884618 2632129 2400408
57002 2400408 2189391 1998367 1826822 1673761 1537539 1416753 1310337 1216794 1134494 1062672
56992 1062672 1000986 948265 903003 864804 833957 809905 791780 780190 776499 780074 787784 796255
56980 796255 802996 805386 800759 788249 769137 744976 716765 686218 656045 628210 603135 580994
56968 580994 562378 547210 534451 523625 515560 511117 510338 513371 521074 534105 552216 574717 600548
56955 600548 627331 651206 668124 675054 670419 654598 630117 600312 567650 534022 501961 473986
56943 473986 450758 431374 415526 404012 397137 394282 395240 400591 410616 425429 446392 475573
56931 475573 512964 555258 597572 635167 663606 679270 680808 669185 646167 613893 575832 536127
$$ packed form
57011D897136k65872k87558l00404l03249k97647k86506k71282k52489k31721
57002B400408k11017j91024j71545j53061j36222j20786j06416r3543q2300p1822
56992A062672o1686n2721m5262l8199l0847k4052j8125j1590l691L575P710Q471
56980G96255O741K390m627j2510j9112k4161k8211l0547l0173k7835k5075k2141
56968E80994j8616j5168j2759j0826q065m443p79L033P703J3031J8111K2501K5831
56955F00548K6783K3875J6918O930m635j5821k4481k9805l2662l3628l2061k7975
56943D73986k3228j9384j5848j1514o875k855R58N351J0025J4813K0963K9181
56931D75573L7391M2294M2314L7595K8439J5664J538j1623k3018l2274l8061l9705
$$ plain form
56919 536127 497309 460030 425327 395296 370830 350454 332430 316611 303371 292189 282370 273943
56907 273943 266826 260173 253516 247574 243023 239405 236128 233584 232343 232067 232089 232422 233454 235286 238028
56892 238028 242195 248339 256837 268308 283467 302272 323902 347649 372847 397708 419337 435245
56880 435245 444060 444923 437700 424161 407552 390411 373781 358645 346583 338464 333892 332584 335038
56867 335038 341428 351343 365325 385260 412512 447050 489055 539630 598414 661370 721844 773044
56855 773044 809188 826200 823103 802385 768307 725414 678716 633407 592953 558237 529364 507228
56843 507228 492620 485247 484912 492770 510396 538650 578483 631811 700304 783758 879916 984135
56831 984135 1087705 1177844 1241790 1271787 1266496 1229377 1167221 1089079 1004139 919539 840076
$$ packed form
56919E36127l8818l7279l4703l0031k4466k0376j8024j5819j3240j1182r819q427
56907B73943p117o653o657n942m551l618l277k544j241k76K2L33J032J832K742
56892B38028M167O144Q498J1471J5159J8805K1630K3747K5198K4861K1629J5908
56880D35245Q815Q63p223j3539j6609j7141j6630j5136j2062q119m572j308K454
56867C35038O390R915J3982J9935K7252L4538M2005N0575N8784O2956O0474N1200
56855G73044L6144J7012l097k0718l4078m2893m6698m5309m0454l4716k8873k2136
56843E07228j4608p373l35P858J7626K8254L9833N3328O8493Q3454R6158J04219
56831I84135J03570R0139O3946K9997n291l7119o2156p8142q4940q4600p9463
$$ plain form
56820 840076 769005 708096 657524 616804 585741 564103 551281 547178 552972 570220 599692 641574
56808 641574 695892 761649 835452 911103 979971 1032128 1059231 1057994 1030932 983700 922605 854292
56796 854292 785332 720272 660805 607674 562276 525553 496796 474909 459895 451938 450203 453938
56784 453938 463848 480964 505020 535099 570672 610005 648037 677670 693441 693385 678280 650786
56772 650786 615023 575312 534731 495201 458406 425584 396739 371031 347898 327283 309223
56761 309223 293805 280996 269988 259456 249088 240096 233454 228467 223858 219354 215291 211523 207774
56748 207774 204335 201445 198686 195783 193174 190953 188308 185038 182504 181784 181906 181311 180153 179609 179692 179382
56732 179382 178494 177818 177709 177923 178636 180299 182593 184538 185579 185807 185532 185384 186261 188283 190350 191543
$$ packed form
56820H40076p1071o0909n0572m0720l1063k1638j2822m103N794J7248K9472M1882
56808F41574N4318O5757P3803P5651O8868N2157K7103j237k7062m7232o1095o8313
56796H54292o8960o5060n9467n3131m5398l6723k8757k1887j5014p957j735L735
56784D53938R910J7116K4056L0079L5573L9333L8032K9633J5771n6j5105k7494
56772F50786l5763l9711m0581l9530l6795l2822k8845k5708k3133k0615j8060
56761C09223j5418j2809j1008j0532j0368q992o642m987m609m504m063l768l749
56748B07774l439k890k759k903k609k221k645l270k534p20J22n95j158n44Q3l10
56732A79382q88o76j09K14P13J663K294J945J041K28k75j48Q77K022K067J193
$$ plain form
56716 191543 192270 193252 194308 195148 196328 198128 199413 199088 197984 197897 199277 201198 203010 204692 206115 207249
56700 207249 208638 210532 212144 212877 213476 214768 216179 216902 217543 218988 220534 221017 221024 222041 223964 225516
56684 225516 226742 228962 232267 235123 236656 237667 239211 241653 245181 249663 253826 256060 256267 255687 254927
56669 254927 253487 251230 248841 246690 244540 242550 241350 240958 240687 240205 239668 238919 237630 236235 235720 236508
56653 236508 238313 240768 243352 245284 246503 248138 250836 253409 254529 254934 256270 258426 259896 260347 260857
56638 260857 261858 262787 263679 265168 266855 267497 266894 265828 264136 260752 255915 251425 248291 245763 243164
56623 243164 241043 239950 239437 238825 237791 235925 232963 229760 227809 227518 228051 228881 230247 232016 233457
56608 233457 234314 234963 235470 235670 236006 236955 237820 237515 236388 235780 235984 236222 236383 237020 237782 237808 237656 238896
$$ packed form
56716A91543P27R82J056Q40J180J800J285l25j104q7J380J921J812J682J423J134
56700B07249J389J894J612P33N99J292J411P23O41J445J546M83PJ017J923J552
56684B25516J226K220L305K856J533J011J544K442L528M482M163K234K07n80p60
56669B54927j440k257k389k151k150j990j200l92k71m82n37p49j289j395n15P88
56653B36508J805K455K584J932J219J635K698K573J120M05J336K156J470M51N10
56638B60857J001R29Q92J489J687O42o03j066j692l384m837m490l134k528k599
56623B43164k121j093n13o12j034j866k962l203j951k91N33Q30J366J769J441
56608B33457Q57O49N07K00L36R49Q65l05j127o08K04K38J61O37P62K6j52J240
$$ plain form
56590 238896 241583 244083 245580 246832 248208 249033 249289 249944 251096 251692 251641 252237 253883 255340 255952 256679
56574 256679 258106 259438 260474 262652 266873 271867 275971 279216 282577 286465 291071 297000 304486 313054
56560 313054 322788 334829 349672 365946 381574 395085 405218 410603 410826 406952 400320 391802 382590
56547 382590 374325 367657 361814 356219 351364 347507 343912 340196 337168 335403 334065 332064 329466 326984
56533 326984 324988 323663 323206 323191 322634 321266 319950 319401 319390 319530 319792 319950 319544 318745 318190 317788 316826 315415
56515 315415 314432 313823 312451 309953 307331 305301 303526 301820 300584 299639 298201 296440 295464 295301 294577 292687
56499 292687 290594 288960 287341 285837 285617 286910 288218 288453 288232 288312 288473 288770 290016 291991 292991 292261
56483 292261 291183 291014 291216 291152 291579 293014 294287 294214 293341 292751 292497 292450 293216 294914 296457 297276 298358 300338
$$ packed form
56590B38896K687K500J497J252J376Q25K56O55J152N96n1N96J646J457O12P27
56574B56679J427J332J036K178M221M994M104L245L361L888M606N929P486Q568
56560C13054R734J2041J4843J6274J5628J3511J0133N385K23l874o632q518r212
56547C82590q265o668n843n595m855l857l595l716l028j765j338k001k598k482
56533C26984j996j325m57j5n57j368j316n49j1J40K62J58m06p99n55m02r62j411
56515C15415r83o09j372k498k622k030j775j706j236r45j438j761r76j63p24j890
56499B92687k093j634j619j504k20J293J308K35k21Q0J61K97J246J975J000p30
56483B92261j078j69K02o4M27J435J273p3q73n90k54m7P66J698J543Q19J082J980
$$ plain form
56465 300338 302092 302590 302591 303036 303257 302440 301560 302161 304230 306755 309345 311903 313771 314636 315371 316744 318327
56448 318327 319831 322273 326485 331603 336306 340472 344298 347010 347825 347257 346212 344851 343439 343022 343944
56433 343944 344893 344670 343729 342759 341200 338680 336574 336431 337839 339336 340442 341350 341730 341449 341548 343007 345242
56416 345242 347092 348406 349620 350747 351918 353805 356401 358565 359778 360967 362527 363197 362209 360878 360495
56401 360495 360358 359602 359365 361084 364063 366735 369110 372014 375003 377079 378502 380061 381495 382379 383506
56386 383506 385622 387783 388797 389202 390051 390912 390996 391173 392745 395113 396692 397366 398109 398988 399469 400057 401759
56369 401759 404474 407480 410789 414555 418027 420634 423087 425947 428297 429414 430421 432475 434718 435965
56355 435965 437049 439359 442369 444890 447568 451717 456677 460654 463319 465382 466582 466444 466063 466788 467998
$$ packed form
56465C00338J754M98JM45K21q17q80O01K069K525K590K558J868Q65P35J373J583
56448C18327J504K442M212N118M703M166L826K712Q15n68j045j361j412m17R22
56433C43944R49k23r41r70j559k520k106j43J408J497J106R08L80k81R9J459K235
56416C45242J850J314J214J127J171J887K596K164J213J189J560O70r88j331l83
56401C60495j37p56k37J719K979K672K375K904K989K076J423J559J434Q84J127
56386C83506K116K161J014M05Q49Q61Q4J77J572K368J579O74P43Q79M81N88J702
56369D01759K715L006L309L766L472K607K453K860K350J117J007K054K243J247
56355D35965J084K310L010K521K678M149M960L977K665K063J200j38l81P25J210
$$ plain form
56340 467998 468541 469420 472540 477566 482534 486919 491649 496778 501615 506619 512633 518734 523280 526656 530704
56325 530704 535877 541201 546464 552042 557070 560225 561932 563594 565172 565838 566370 568387 571617 574347 576207
56310 576207 578193 580475 582609 585449 590307 596607 602750 608921 616675 626262 636808 648577 662344
56297 662344 676890 689765 700348 709727 718103 724917 731091 738275 746134 753180 760023 768950 780327
56284 780327 792331 804254 817273 831762 846507 860877 875322 889627 903150 916804 932375
56273 932375 949857 967847 986435 1007156 1030229 1054463 1079860 1107683 1138063 1170227 1205119
56262 1205119 1245115 1291072 1342249 1399070 1463332 1535671 1615589 1704089 1803663 1915716 2040539
56251 2040539 2179570 2334717 2505522 2689876 2887415 3099138 3323633 3556749 3794996
$$ packed form
56340D67998N43Q79L120N026M968M385M730N129M837N004O014O101M546L376M048
56325E30704N173N324N263N578N028L155J707J662J578O66N32K017L230K730J860
56310E76207J986K282K134K840M858O300O143O171P754R587J0546J1769J3767
56297F62344J4546J2875J0583R379Q376O814O174P184P859P046O843Q927J1377
56284G80327J2004J1923J3019J4489J4745J4370J4445J4305J3523J3654J5571
56273I32375J7482J7990J8588K0721K3073K4234K5397K7823L0380L2164L4892
56262A205119L9996M5957N1177N6821O4262P2339P9918Q8500R9574J12053J24823
56251B040539J39031J55147J70805J84354J97539K11723K24495K33116K38247
$$ plain form
56242 3794996 4035893 4274636 4503758 4716845 4909797 5078153 5216334 5320333 5388492 5419324
56232 5419324 5411465 5366278 5287755 5179514 5044560 4887927 4716204 4533900 4343204 4147471
56222 4147471 3951702 3759103 3570382 3386990 3211790 3045909 2888164 2738348 2598103
56213 2598103 2467934 2346442 2233120 2128812 2032924 1943368 1859860 1783985 1715454 1651659
56203 1651659 1591695 1537411 1489576 1446332 1406382 1370505 1338916 1310244 1284022 1261150 1241046
56192 1241046 1221486 1202075 1184858 1170804 1158689 1147922 1139190 1131860 1124217 1116808 1112047 1110006
56180 1110006 1108207 1105938 1104911 1105243 1105057 1104682 1106812 1111478 1115276 1116733 1118050 1120298 1121523 1121173 1121888
56165 1121888 1124979 1128382 1130889 1134193 1138949 1143143 1146388 1151604 1160322 1170457 1180792 1193469 1209857
$$ packed form
56242C794996K40897K38743K29122K13087J92952J68356J38181J03999O8159L0832
56232E419324p859m5187p8523j08241j34954j56633j71723j82304j90696j95733
56222D147471j95769j92599j88721j83392j75200j65881j57745j49816j40245
56213B598103j30169j21492j13322j04308r5888q9556q3508p5875o8531o3795
56203A651659n9964n4284m7835m3244l9950l5877l1589k8672k6222k2872k0104
56192A241046j9560j9411j7217j4054j2115j0767q732p330p643p409m761k041
56180A110006j799k269j027L32j86l75K130M666L798J457J317K248J225l50P15
56165A121888L091L403K507L304M756M194L245N216Q718J0135J0335J2677J6388
$$ plain form
56152 1209857 1228117 1247248 1269435 1296020 1325185 1356082 1391352 1433173 1480796 1534369 1597166
56141 1597166 1671516 1756227 1850180 1954228 2067025 2183141 2297903 2410106 2517706 2615620
56131 2615620 2700915 2776049 2844005 2904369 2957047 3005140 3050373 3089472 3118545 3137561 3147548
56120 3147548 3147460 3137138 3119482 3096132 3064354 3021091 2966341 2899788 2818609 2722336 2616199 2506415
56108 2506415 2395888 2287343 2186111 2096016 2016380 1946327 1887899 1841656 1803723 1770827 1743971
56097 1743971 1723732 1706756 1690866 1678843 1672810 1669522 1665652 1663187 1664918 1668974 1672637 1677379 1685241
56084 1685241 1694229 1702093 1710704 1721949 1733290 1742192 1750994 1762573 1775132 1786140 1797535 1812155
56072 1812155 1828905 1846103 1865591 1888747 1912571 1934478 1956656 1980964 2004250 2023849 2042888
$$ packed form
56152A209857J8260J9131K2187K6585K9165L0897L5270M1821M7623N3573O2797
56141A597166P4350Q4711R3953J04048J12797J16116J14762J12203J07600R7914
56131B615620Q5295P5134O7956O0364N2678M8093M5233L9099K9073J9016R987
56120C147548q8j0322j7656k3350l1778m3263n4750o6553q1179r6273j06137j09784
56108B506415j10527j08545j01232r0095p9636p0053n8428m6243l7933l2896k6856
56097A743971k0239j6976j5890j2023o033l288l870k465J731M056L663M742P862
56084A685241Q988P864Q611J1245J1341Q902Q802J1579J2559J1008J1395J4620
56072A812155J6750J7198J9488K3156K3824K1907K2178K4308K3286J9599J9039
$$ plain form
56061 2042888 2064613 2086250 2104232 2120779 2139244 2157568 2172637 2186791 2203648 2221625 2237922
56050 2237922 2254816 2275683 2298747 2320942 2343911 2370126 2397366 2423212 2450562 2482431 2515926
56039 2515926 2547754 2580851 2618892 2659196 2698103 2738401 2784193 2833246 2881782 2931926 2986883
56028 2986883 3043622 3097906 3151644 3207661 3262494 3312352 3360958 3413436 3467799 3520669 3575695
56017 3575695 3637627 3703699 3769639 3838375 3913788 3991975 4068112 4145836 4230283 4318362 4405795
56006 4405795 4496904 4596893 4701558 4805705 4914458 5034595 5162085 5290475 5424132 5570219
55996 5570219 5724995 5881583 6043983 6219508 6404814 6593722 6791236 7005073 7231325
55987 7231325 7463897 7709719 7978456 8265931 8564732 8881899 9228097 9599024 9986929
$$ packed form
56061B042888K1725K1637J7982J6547J8465J8324J5069J4154J6857J7977J6297
56050B237922J6894K0867K3064K2195K2969K6215K7240K5846K7350L1869L3495
56039B515926L1828L3097L8041M0304L8907M0298M5792M9053M8536N0144N4957
56028B986883N6739N4284N3738N6017N4833M9858M8606N2478N4363N2870N5026
56017C575695O1932O6072O5940O8736P5413P8187P6137P7724Q4447Q8079Q7433
56006D405795R1109R9989J04665J04147J08753J20137J27490J28390J33657J46087
55996E570219J54776J56588J62400J75525J85306J88908J97514K13837K26252
55987G231325K32572K45822K68737K87475K98801L17167L46198L70927L87905
$$ plain form
55978 9986929 10400676 10854089 11344833 11866673 12431911 13058552 13746496 14491245 15309488
55969 15309488 16224770 17240643 18357046 19600557 21008254 22597088 24384430 26424774
55961 26424774 28790573 31536674 34729697 38499509 43021922 48481560 55118330 63299115
55953 63299115 73490065 86194011 101998236 121645324 145917704 175382664 210177281
55946 210177281 249684502 291848712 332581633 366299605 387844236 394509147 386637226
55939 386637226 366706561 338101232 304405105 268999985 234586736 202836578 174499010
55932 174499010 149785040 128622338 110728045 95696892 83127493 72658730 63933764
55925 63933764 56616907 50451491 45252211 40848033 37077145 33825248 31018916 28581891
$$ packed form
55978I986929M13747M53413M90744N21840N65238O26641O87944P44749Q18243
55969A5309488R15282J015873J116403J243511J407697J588834J787342K040344
55961B6424774K365799K746101L193023L769812M522413N459638O636770Q180785
55953F3299115J0190950J2703946J5804225J9647088K4272380K9464960L4794617
55946B10177281L9507221M2164210M0732921L3717972K1544631O664911p871921
55939C86637226j9930665k8605329l3696127l5405120l4413249l1750158k8337568
55932A74499010k4713970k1162702j7894293j5031153j2569399j0468763q724966
55925F3933764p316857o165416n199280m404178l770888l251897k806332k437025
$$ plain form
55917 28581891 26433764 24523837 22827718 21312870 19939086 18687470 17556514 16531680
55909 16531680 15586750 14711518 13910565 13176792 12491346 11847457 11250369 10695429 10168686
55900 10168686 9667533 9199543 8762330 8344589 7945436 7573254 7226653 6895046 6576812
55891 6576812 6278992 6000069 5730401 5469057 5223569 4993548 4770493 4553444 4349396
55882 4349396 4158408 3973215 3793622 3626982 3474205 3328977 3190890 3065833 2952883
55873 2952883 2843521 2734405 2628867 2525794 2419360 2310368 2206154 2108569 2013090 1920090
55863 1920090 1835732 1761008 1690597 1623278 1563107 1509745 1457912 1407238 1362789 1325142 1289505
55852 1289505 1255182 1226231 1201985 1176439 1148018 1120920 1095958 1069079 1039898 1012904 989038
$$ packed form
55917B8581891k148127j909927j696119j514848j373784j251616j130956j024834
55909A6531680r44930q75232q00953p33773o85446o43889n97088n54940n26743
55900A0168686n01153m67990m37213m17741l99153l72182l46601l31607l18234
55891F576812k97820k78923k69668k61344k45488k30021k23055k17049k04048
55882D349396j90988j85193j79593j66640j52777j45228j38087j25057j12950
55873B952883j09362j09116j05538j03073j06434j08992j04214r7585r5479r3000
55863A920090q4358p4724p0411o7319o0171n3362n1833n0674m4449l7647l5637
55852A289505l4323k8951k4246k5546k8421k7098k4962k6879k9181k6994k3866
$$ plain form
55841 989038 964567 939236 917200 898791 879592 858733 840112 824350 807524 788990 772695
55830 772695 759544 746044 731684 720103 711760 702827 692578 684526 679000 671812 661714 652174 644377
55817 644377 635469 625079 616713 611142 605162 598388 594599 594687 594822 593375 593352 596222 599521 602290 606872
55802 606872 613601 619556 624192 630357 638066 643108 643464 641386 637495 628726 614152 597343 580878 563749
55788 563749 545970 530473 518461 507874 498226 492019 489686 488086 485657 484133 483574 480819 474720
55775 474720 468055 462521 456651 450363 446559 446239 446675 446260 446542 447721 446919 442936 438207 434092 428650
55760 428650 420948 413160 406501 399464 391921 386568 384310 382578 380142 379202 380668 381734 380402 378337
55746 378337 377009 374984 371215 367115 363213 357620 349839 342311 336123 329077 320101 311661 305620 300487
$$ packed form
55841I89038k4471k5331k2036j8409j9199k0859j8621j5762j6826j8534j6295
55830G72695j3151j3500j4360j1581q343q933j0249q052n526p188j0098r540p797
55817F44377q908j0390q366n571n980o774l789Q8J35j447k3K870L299K769M582
55802F06872O729N955M636O165P709N042L56k078l891q769j4574j6809j6465j7129
55788E63749j7779j5497j2012j0587r648o207k333j600k429j524n59k755o099
55775D74720o665n534n870o288l804l20M36m15K82J179q02l983m729m115n442
55760D28650p702p788o659p037p543n353k258j732k436r40J466J066j332k065
55746C78337j328k025l769m100l902n593p781p528o188p046q976q440o041n133
$$ plain form
55732 300487 295047 290903 288988 287152 283768 280445 278763 277465 275125 272499 270113 266617 261706 257655
55718 257655 255832 254535 252172 249634 247731 245367 242115 239639 238804 238309 237706 238545 240966 242555 242313
55703 242313 242340 243765 244467 242855 240454 238612 235973 231487 226808 223539 221094 219193 219202 221020 221988 221088
55687 221088 220896 223197 226062 227559 228842 230997 232359 231799 231437 233153 235435 236560 237807 240403 242299
55672 242299 241425 239548 239465 240602 240685 239742 239230 238993 238128 237328 237648 238477 239138 240716 244009 247528 249936
55655 249936 252485 256625 261144 264142 265921 267463 267958 266348 263490 260354 255945 249433 242500 237033
55641 237033 232291 226811 221344 217369 214431 211436 208955 207830 207196 206309 206579 209332 213250 216546 219867
55626 219867 224433 229018 231619 232622 233512 233922 232688 230558 228995 227471 224600 220912 217913 215372 212146
$$ packed form
55732C00487n440m144j915j836l384l323j682j298k340k626k386l496m911m051
55718B57655j823j297k363k538j903k364l252k476q35m95o03Q39K421J589k42
55703B42313K7J425P02j612k401j842k639m486m679l269k445j901RJ818R68r00
55687B21088j92K301K865J497J283K155J362n60l62J716K282J125J247K596J896
55672B42299q74j877q3J137Q3r43n12k37q65q00L20Q29O61J578L293L519K408
55655B49936K549M140M519K998J779J542M95j610k858l136m409o512o933n467
55641B37033m742n480n467l975k938k995k481j125o34q87K70K753L918L296L321
55626B19867M566M585K601J003Q90M10j234k130j563j524k871l688k999k541l226
$$ plain form
55611 212146 208747 206581 205440 204128 202788 202357 202526 202371 202185 202632 202926 201806 199415 196397 192328 187001
55595 187001 182032 179067 177407 175412 173103 171352 169766 167543 165297 163899 162632 160578 158635 157992
55581 157992 157830 156805 155628 155837 157116 158246 159736 163009 167824 172884 178205 184618 191679 198385 205236
55566 205236 213296 221892 229380 235450 240503 243587 243338 240432 236855 233166 228552 222977 217190 211070
55552 211070 204091 197062 191473 187443 183932 180462 177145 173833 170827 169378 169749 169924 168195 165770 164683
55537 164683 164384 162913 160427 158865 158738 158884 158931 159464 160042 159469 157826 156108 154129 150960 147105 144063
55521 144063 141956 139639 136994 135043 134018 133213 132498 132179 131702 130356 128867 128434 128678 128395 127767 127769 127949
55504 127949 126985 125113 123866 123697 123823 124060 124783 125468 125360 125279 126647 128990 130500 130816 131210 132274 133447
$$ packed form
55611B12146l399k166j141j312j340m31J69j55j86M47K94j120k391l018m069n327
55595A87001m969k965j660j995k309j751j586k223k246j398j267k054j943o43
55581A57992j62j025j177K09J279J130J490L273M815N060N321O413P061O706O851
55566B05236Q060Q596P488O070N053L084k49k906l577l689m614n575n787o120
55552B11070o979p029n589m030l511l470l317l312l006j449L71J75j729k425j087
55537A64683k99j471k486j562j27J46M7N33N78n73j643j718j979l169l855l042
55521A44063k107k317k645j951j025q05p15l19m77j346j489m33K44k83o28KJ80
55504A27949r64j872j247j69J26K37P23O85j08q1J368K343J510L16L94J064J173
$$ plain form
55487 133447 134639 136316 138190 139757 141803 145402 149796 153260 155659 158054 160294 161273 161219 161273 161043 159040
55471 159040 155440 151955 148986 145404 141253 138110 136311 134211 130795 127020 124096 122299 121785 122678 124002
55456 124002 124341 123772 123427 123220 122063 120290 119594 120314 120982 120900 120996 121609 121626 120485 119178 118600 118579 118974 120044
55437 120044 121336 121907 121936 122414 123057 122488 120798 119906 120819 122344 123075 122912 122161 120896 119746 119688 120514 120996
55419 120996 120877 121112 122012 122875 123663 125129 127047 128217 128580 129398 130975 132136 132374 132497 132744 132389 131706
55402 131706 132090 133446 133649 131614 128933 127419 126870 126336 125819 125574 125237 124767 124898 125762 126400 126411 126675 127710
55384 127710 128749 129153 129281 129280 128564 127171 126069 125412 124189 122349 121461 122272 123278 122876 121397 119940 118693
55367 118693 117601 117271 117875 118280 117464 115884 114530 113637 113150 113384 114352 115388 116127 116911 117738 117963 117490
$$ packed form
55487A33447J192J677J874J567K046L599M394L464K399K395K240R79n4N4k30k003
55471A59040l600l485k969l582m151l143j799k100l416l775k924j797n14Q93J324
55456A24002L39n69l45k07j157j773o96P20O68q2R6O13J7j141j307n78k1L95J070
55437A20044J292N71K9M78O43n69j690q92R13J525P31j63p51j265j150n8Q26M82
55419A20996j19K35R00Q63P88J466J918J170L63Q18J577J161K38J23K47l55o83
55402A31706L84J356K03k035k681j514n49n34n17k45l37m70J31Q64O38J1K64J035
55384A27710J039M04J28jp16j393j102o57j223j840q88Q11J006m02j479j457j247
55367A18693j092l30O04M05q16j580j354q93m87K34R68J036P39P84Q27K25m73
$$ plain form
55350 117490 116998 116620 115856 115163 115831 117634 118504 117484 116197 116302 117235 117731 117895 118319 118588 118248 118030 118653
55332 118653 119448 119481 119055 118817 118408 117274 115895 114973 114309 113602 113410 114104 114810 114608 114000 114027 114720 115506 116336
55313 116336 117352 118195 118684 119384 120519 121166 120580 119431 118730 118335 117657 117023 117204 118244 119734 121472 122942
55296 122942 123068 121669 120332 120580 121824 122370 121865 121489 122121 123479 124849 125713 125802 125299 124806 124586 124259
55279 124259 123636 123192 123185 123072 122407 121580 120990 120297 119186 118122 117565 117204 116684 116364 116615 117121 117546 118095 118739
55260 118739 118768 117892 116899 116472 116206 115605 115072 115038 115046 114723 114797 116101 118238 120220 121662 122479 122255 121063 120156
55241 120156 120677 122135 123123 123027 122162 120867 119416 118258 117459 116407 114887 113792 113920 114690 114971 114608 114316
55224 114316 114619 115631 117224 118701 119123 118741 119213 121474 124280 125870 126175 126195 126049 125068 123287 121514
$$ packed form
55350A17490m92l78p64o93O68J803Q70j020j287J05R33M96J64M24K69l40k18O23
55332A18653P95L3m26k38m09j134j379r22o64p07j92O94P06k02o08K7O93P86Q30
55313A16336J016Q43M89P00J135O47n86j149p01l95o78o34J81J040J490J738J470
55296A22942J26j399j337K48J244N46n05l76O32J358J370Q64Q9n03m93k20l27
55279A24259o23m44pj13o65q27n90o93j111j064n57l61n20l20K51N06M25N49O44
55260A18739K9q76r93m27k66o01n33l4Ql23P4J304K137J982J442Q17k24j192r07
55241A20156N21J458R88r6q65j295j451j158p99j052j520j095J28P70K81l63k92
55224A14316L03J012J593J477M22l82M72K261K806J590L05K0j46r81j781j773
$$ plain form
55208 121514 120151 119008 118055 117466 117246 117546 118821 120950 122817 123600 123783 124073 124134 123424 122469 122067 121861
55191 121861 120992 119720 119114 119438 120035 120549 121170 121856 122309 122600 123028 123562 124095 124891 126036 126917 126985 126639
55173 126639 126598 126838 126902 126803 126909 127325 128019 128936 129508 128840 127060 125566 125160 124970 124137 123440 123967 125148 125617
55154 125617 125338 125418 126311 127541 128798 129996 130647 130422 129976 130080 130299 129708 128445 127374 126662 125912 125315
55137 125315 125396 125888 126036 125745 125441 125172 124922 125201 126160 126696 125817 124388 124088 124978 125553 124952 123696 122476
55119 122476 121614 121576 122694 124406 125958 127584 129811 131995 133060 133428 134555 136642 138366 138993 139191 139610
55103 139610 140138 140797 141956 143282 143762 143148 142209 141373 140309 139131 138690 139261 140104 140756 141692 143188 144629
55086 144629 145532 146340 147590 148934 149569 149166 148014 146669 145696 145362 145480 145838 146607 147944 149471 150684
$$ packed form
55208A21514j363j143r53n89k20L00J275K129J867P83J83K90O1p10r55m02k06
55191A21861q69j272o06L24N97N14O21O86M53K91M28N34N33P96J145Q81O8l46
55173A26639m1K40O4r9J06M16O94R17N72o68j780j494m06j90q33o97N27J181M69
55154A25617k79Q0Q93J230J257J198O51k25m46J04K19n91j263j071p12p50n97
55137A25315Q1M92J48k91l04k69k50K79R59N36q79j429l00Q90N75o01j256j220
55119A22476q62l8J118J712J552J626K227K184J065L68J127K087J724O27J98M19
55103A39610N28O59J159J326M80o14r39q36j064j178m41N71Q43O52R36J496J441
55086A44629R03Q08J250J344O35m03j152j345r73l34J18L58P69J337J527J213
$$ plain form
55070 150684 151570 152240 152469 152260 152306 152988 153456 152755 151355 150456 150263 150154 150008 150009 149537 147879 145842 145045 145591
55051 145591 145985 145425 144620 144172 143742 143173 142973 143161 142908 141796 140315 138826 137178 135658 135050 135359 135629
55034 135629 135397 135124 134946 134332 133458 133471 134700 135871 135949 135657 136302 137981 139772 140997 141518 141401 140958 140669
55016 140669 140621 140471 140158 139992 139908 139473 138874 138985 140113 141529 142542 143167 143434 143089 142419 142403 143454 144814
54998 144814 145721 146351 147130 147900 148307 148336 148001 147209 146339 146155 146751 147299 147273 147100 147179 147159 146774 146569 147121 148137
54978 148137 148930 149248 149184 148875 148716 149246 150352 151160 151114 150554 149949 149328 148859 149188 150601 152500 154176 155495
54960 155495 156389 156445 155577 154538 154116 154299 154651 154991 155265 155333 155327 155640 156142 156031 154965 153719 153212 153466 154002
54941 154002 154702 155612 156442 156911 157268 157935 158922 160040 161345 162942 164638 166211 167863 170117 173411 177908
$$ packed form
55070A50684Q86O70K29k09M6O82M68p01j400q99j93j09j46Jm72j658k037p97N46
55051A45591L94n60q05m48m30n69k00J88k53j112j481j489j648j520o08L09K70
55034A35629k32k73j78o14q74J3J229J171P8k92O45J679J791J225N21j17m43k89
55016A40669m8j50l13j66q4m35n99J11J128J416J013O25K67l45o70j6J051J360
54998A44814R07O30P79P70M07K9l35p92q70j84N96N48k6j73P9k0l85k05N52J016
54978A48137P93L18o4l09j59N30J106Q08m6n60o05o21m69L29J413J899J676J319
54960A55495Q94N6q68j039m22J83L52L40K74O8oL13N02j11j066j246n07K54N36
54941A54002P00R10Q30M69L57O67R87J118J305J597J696J573J652K254L294M497
$$ plain form
54925 177908 183428 189528 195924 202800 210334 218070 225285 231749 237420 241611 243388 242731 240350 236365
54911 236365 230384 222979 215778 209571 203531 196934 190541 185409 181360 177581 174081 171547 170201 169643
54897 169643 169515 169644 169764 169700 169571 169472 169271 169057 169377 170647 172689 175112 177762 180588 183605 187200 191978
54880 191978 198052 204971 212428 220363 228239 235066 240397 244558 247567 248682 247395 244069 239156 232650
54866 232650 224795 216605 209040 202312 196441 191757 188305 185429 182547 179801 177505 175546 173765 172283
54852 172283 171012 169531 167844 166543 165781 164857 163296 161551 160127 158783 157223 155759 154677 153587 152025
54837 152025 150094 148055 146016 144487 144312 145474 146754 147247 147397 147986 149040 150399 152303 154507 155755
54822 155755 155179 153498 151953 150823 149907 149563 150089 150733 150571 149848 149392 149187 148665 147985 147916 148690 149899 151227
$$ packed form
54925A77908N520O100O396O876P534P736P215O464N671M191J777o57k381l985
54911B36365n981p405p201o207o040o597o393n132m049l779l500k534j346n58
54897A69643j28J29J20o4j29r9k01k14L20J270K042K423K650K826L017L595M778
54880A91978O074O919P457P935P876O827N331M161L009J115j287l326m913o506
54866B32650p855q190p565o728n871m684l452k876k882k746k296j959j781j482
54852A72283j271j481j687j301p62r24j561j745j424j344j560j464j082j090j562
54837A52025j931k039k039j529j75J162J280M93J50N89J054J359J904K204J248
54822A55755n76j681j545j130r16l44N26O44j62p23m56k05n22o80o9P74J209J328
$$ plain form
54804 151227 152442 153150 153396 154014 155490 157018 157669 157879 158616 159677 160142 160122 160584 161580 162087 161645 160952 160641
54786 160641 160628 160782 161214 161643 161501 160992 161173 162672 164984 167259 169175 170888 172773 175454 179544 185141
54770 185141 191863 199326 207209 215089 222806 230766 239219 247299 253474 256968 258146 257593 255475 251889
54756 251889 247189 241776 235899 229727 223385 216996 210889 205494 200791 196292 191921 188360 186001 184172
54742 184172 182098 180034 178610 177553 176141 174609 174029 174849 176468 178222 179910 181396 182618 184122 186784
54727 186784 190886 196060 202111 209094 216608 223833 230381 236383 241596 245192 246592 245889 243253 238606
54713 238606 232176 224825 217498 210636 204250 198262 192692 187834 184160 181772 180035 178145 175942 173818
54699 173818 172050 170710 170001 170070 170537 170724 170331 169510 168459 167399 166752 166786 167131 167087 166290 164769 162688 160482
$$ packed form
54804A51227J215P08K46O18J476J528O51K10P37J061M65k0M62R96N07m42o93l11
54786A60641j3J54M32M29j42n09J81J499K312K275J916J713J885K681M090N597
54770A85141O722P463P883P880P717P960Q453Q080O175L494J178n53k118l586
54756B51889m700n413n877o172o342o389o107n395m703m499m371l561k359j829
54742A84172k074k064j424j057j412j532n80Q20J619J754J688J486J222J504K662
54727A86784M102N174O051O983P514P225O548O002N213L596J400p03k636m647
54713B38606o430p351p327o862o386n988n570m858l674k388j737j890k203k124
54699A73818j768j340p09O9M67J87l93q21j051j060o47L4L45m4p97j521k081k206
$$ plain form
54681 160482 158902 158332 158260 157953 157336 156785 156454 156421 156986 158096 158858 158452 157172 155860 154713 153540 152719
54664 152719 152779 153325 153499 153356 153637 154303 154503 154092 153938 154503 155255 155802 156563 157832 159062 159623 159542 159047 158045
54645 158045 156528 154995 154025 153801 154253 155209 156260 156912 157082 157059 156983 156791 156579 156448 156051 154979 153592 152755
54627 152755 152701 152816 152566 151945 151070 150157 149916 151046 153070 154541 154667 154001 153389 153122 153433 154841 157305
54610 157305 159768 161173 161557 161712 162223 163224 164576 165799 166205 165600 164635 164132 164292 164772 165228 165507 165517
54593 165517 165133 164227 162821 161302 160211 159525 158490 156695 155024 154755 155848 156931 157007 156460 156273 156993
54577 156993 158568 160470 161757 161669 160429 158977 157864 157015 156490 156611 157182 157454 157165 156882 157051 157467 157974
54560 157974 158872 160207 161372 161940 162321 163154 164560 166313 168157 169600 170082 169824 169931 171140 172901 174210
$$ packed form
54681A60482j580n70p2l07o17n51l31l3N65J110P62m06j280j312j147j173q21
54664A52719O0N46J74j43K81O66K00m11j54N65P52N47P61J269J230N61q1m95j002
54645A58045j517j533r70k24M52R56J051O52J70k3p6j92k12j31l97j072j387q37
54627A52755n4J15k50o21q75r13k41J130K024J471J26o66o12k67L11J408K464
54610A57305K463J405L84J55N11J001J352J223M06o05r65n03J60M80M56K79J0
54593A65517l84r06j406j519j091o86j035j795j671k69J093J083P6n47j87P20
54577A56993J575J902J287q8j240j452j113q49n25J21N71K72k89k83J69M16N07
54560A57974Q98J335J165N68L81Q33J406J753J844J443M82k58J07J209J761J309
$$ plain form
54544 174210 174879 175474 176353 177308 177986 178297 178518 179146 180442 182050 183348 184141 184571 184447 183312 181288 179172
54527 179172 177491 176078 174772 173887 173701 174059 174700 175412 175725 175201 174283 174019 174672 175412 175747 176250 177282
54510 177282 177976 177423 176204 175730 176417 177370 177607 176847 175333 173641 172578 172571 173152 173469 173290 173092 173307 173900
54492 173900 174606 175174 175432 175427 175480 175920 176790 177871 178842 179394 179517 179750 180769 182567 184407 185704 186551 187217
54474 187217 187645 187732 187679 187783 188226 189269 191189 193818 196598 199335 202390 205845 209045 211302 212546 212910
54458 212910 212279 210726 208876 207218 205477 203236 200841 199039 197977 197167 196316 195608 195178 194785 194093 193017
54442 193017 191755 190617 189780 189135 188495 187952 187730 187682 187324 186449 185354 184343 183471 182904 183008 183806 184762 185352
54424 185352 185503 185310 184839 184391 184506 185394 186797 188474 190335 191939 192573 192166 191500 191145 190830 190222 189602
$$ packed form
54544A74210O69N95Q79R55O78L11K21O28J296J608J298P93M30j24j135k024k116
54527A79172j681j413j306q85j86L58O41P12L13n24r18k64O53P40L35N03J032
54510A77282O94n53j219m74O87R53K37p60j514j692j063pN81L17j79j98K15N93
54492A73900P06N68K58nN3M40Q70J081R71N52J23K33J019J798J840J297Q47O66
54474A87217M28Q7n3J04M43J043J920K629K780K737L055L455L200K257J244L64
54458B12910o31j553j850j658j741k241k395j802j062q10q51p08m30l93o92j076
54442A93017j262j138q37o45o40n43k22m8l58q75j095j011q72n67J04P98R56N90
54424A85352J51j93m71m48J15Q88J403J677J861J604O34m07o66l55l15o08o20
$$ plain form
54407 189602 189242 188785 187933 187254 187587 189006 190955 193093 195374 197582 199349 200530 201167 201332 201335 201779 202981
54390 202981 204616 206187 207514 208517 209019 209124 209272 209556 209534 209143 209175 210253 211861 213028 213553 213959 214705
54373 214705 216118 218612 222178 225910 228720 230371 231222 231323 230467 228924 227378 226190 225263 224551 224235 224458
54357 224458 225318 226895 228913 230630 231458 231484 231018 230072 228649 227057 225412 223267 220357 217271 214753 212723
54341 212723 210706 208812 207528 206851 206413 206190 206332 206469 206005 204946 203758 202624 201582 201087 201550 202411
54325 202411 202588 201871 201103 200951 201259 201725 202394 203277 204066 204465 204394 203856 203017 202337 202110 202011 201579 200943 200429
54306 200429 199762 198476 196932 195999 195724 195241 194160 193111 192688 192721 192937 193496 194402 195078 195115 194920 195142 195825
54288 195825 196601 197361 198296 199482 200828 202291 203863 205410 206672 207358 207296 206652 205908 205330 204574 203234 201749
$$ packed form
54407A89602l60m57q52o79L33J419J949K138K281K208J767J181O37J65LM44J202
54390B02981J635J571J327J003N02J05J48K84k2l91L2J078J608J167N25M06P46
54373B14705J413K494L566L732K810J651Q51J01q56j543j546j188r27p12l16K23
54357B24458Q60J577K018J717Q28K6m66r46j423j592j645k145k910l086k518k030
54341B12723k017j894j284o77m38k23J42J37m64j059j188j134j042m95M63Q61
54325B02411J77p17p68j52L08M66O69Q83P89L99p1n38q39o80k27r9m32o36n14
54306B00429o67j286j544r33k75m83j081j049m23L3K16N59R06O76L7j95K22O83
54288A95825P76P60R35J186J346J463J572J547J262O86o2o44p44n78p56j340j485
$$ plain form
54271 201749 201172 201866 202896 203016 202009 200823 200567 201565 203282 205062 206807 208794 210890 212430 213134 213640
54255 213640 214667 216059 217241 218189 219166 219820 219519 218536 217916 218033 218183 217851 217361 216891 215784 213584 211033
54238 211033 209230 208229 207231 205931 204887 204605 204921 205396 205848 206275 206552 206417 205706 204590 203603 203339 203939
54221 203939 204934 205711 206090 206329 206609 206726 206371 205577 204708 204011 203377 202694 202246 202408 203002 203363 203171 202853 202947
54202 202947 203407 203796 203860 203573 202931 202126 201681 201956 202626 203040 203040 203106 203722 204931 206352 207404 207639 207239 207024
54183 207024 207729 209454 212030 215459 219501 223176 225474 226525 227498 229327 231955 234706 236848 237823 237515
54168 237515 236343 234677 232317 229071 225641 223091 221381 219333 216354 213435 211873 211645 211666 211369 211287 211988
54152 211988 212975 213022 211590 209613 208608 209052 210046 210645 210961 211576 212391 212861 213049 213610 214683 215601 215903 215962
$$ packed form
54271B01749n77O94J030J20j007j186k56R98J717J780J745J987K096J540P04N06
54255B13640J027J392J182R48R77O54l01r83o20J17J50l32m90m70j107k200k551
54238B11033j803j001r98j300j044k82L16M75M52M27K77j35p11j116r87k64O00
54221B03939R95P77L79K39K80J17l55p94q69o97o34o83m48J62N94L61j92l18R4
54202B02947M60L89O4k87o42q05m45K75O70M14%O6O16J209J421J052K35m00k15
54183B07024P05J725K576L429M042L675K298J051R73J829K628K751K142R75l08
54168B37515j172j666k360l246l430k550j710k048k979k919j562k28K1k97q2P01
54152B11988R87M7j432j977j005M44R94N99L16O15Q15M70J88N61J073R18L02N9
$$ plain form
54134 215962 216318 216913 217349 217463 217348 217160 217202 217913 219406 221183 222567 223358 223926 224743 225898 226993 227520
54117 227520 227413 227125 227060 227076 226726 225820 224493 222971 221584 220815 220919 221623 222496 223457 224541 225445 225799 225673
54099 225673 225365 224880 224158 223577 223513 223580 223082 222191 221860 222462 223295 223697 223933 224596 225682 226678 227165 227031 226404
54080 226404 225692 225445 225972 227200 228911 230862 232752 234485 236451 239155 242567 246190 249706 253083 256171
54065 256171 258692 260575 261791 261977 260870 259055 257557 256616 255587 254112 252615 251436 250301 249020 248060
54050 248060 247974 248771 250146 251845 253590 255165 256867 259270 262332 265384 268289 271813 276403 281348 285796
54035 285796 289966 294647 300031 305861 312332 319891 328259 336422 343642 349839 354932 358536 360656 362162
54021 362162 364058 366399 368312 369154 369407 370141 371673 373059 373050 371335 368572 365394 361807 357572 352791 347949
$$ packed form
54134B15962L56N95M36J14j15j88M2P11J493J777J384P91N68Q17J155J095N27
54117B27520j07k88o5J6l50r06j327j522j387p69J04P04Q73R61J084R04L54j26
54099B25673l08m85p22n81o4O7m98q91l31O02Q33M02K36O63J086R96M87j34o27
54080B26404p12k47N27J228J711J951J890J733J966K704L412L623L516L377L088
54065B56171K521J883J216J86j107j815j498r41j029j475j497j179j135j281r60
54050B48060q6P97J375J699J745J575J702K403L062L052K905L524M590M945M448
54035B85796M170M681N384N830O471P559Q368Q163P220O197N093L604K120J506
54021C62162J896K341J913Q42K53P34J532J386rj715k763l178l587m235m781m842
$$ plain form
54005 347949 343477 339375 335272 330939 326708 323015 319521 315347 310539 306634 305022 305224 305579 305267 304707
53990 304707 304260 303799 303653 304853 307966 312411 317195 321567 324677 325485 323553 319430 313984 307883 301937
53975 301937 297122 293777 291252 288751 286135 283707 281714 280275 279285 278313 277137 276380 276821 278007 278510
53960 278510 277826 277050 277278 278297 279348 280251 281108 281790 282476 283954 286560 289408 291433 292703 294060 296048
53944 296048 298901 303025 308565 314791 320597 325520 329870 334264 339365 345407 351466 355818 357722 358261
53930 358261 358842 359548 359778 359757 360344 361705 363282 364874 366944 369926 373917 378849 384358 389813 395158 401307
53914 401307 408988 417622 426193 434809 444337 454744 464889 473925 481899 488958 494893 499591 503091 505107
53900 505107 505341 504406 503589 503355 502802 500885 497591 493576 489196 484280 478515 471724 463998 455714 447277
$$ packed form
54005C47949m472m102m103m333m231l693l494m174m808l905j612K02L55l12n60
53990C04707m47m61j46J200L113M445M784M372L110Q08j932m123n446o101n946
53975C01937m815l345k525k501k616k428j993j439r90r72j176p57M41J186N03
53960B78510o84p76K28J019J051R03Q57O82O86J478K606K848K025J270J357J988
53944B96048K853M124N540O226N806M923M350M394N101O042O059M352J904N39
53930C58261N81P06K30k1N87J361J577J592K070K982L991M932N509N455N345O149
53914D01307P681Q634Q571Q616R528J0407J0145R036P974P059N935M698L500K016
53900E05107K34r35q17k34n53j917l294m015m380m916n765o791p726q284q437
$$ plain form
53885 447277 438781 430135 421427 412940 404862 397251 390181 383680 377693 372353 367954 364289 360407 355593
53871 355593 350340 345771 342294 339403 336582 333654 330328 326211 321449 316837 313077 310238 307932 305683
53857 305683 303201 300698 298783 297652 296638 295087 293386 292396 292037 291299 289669 287730 286158 284937 283864
53842 283864 283150 283058 283391 283715 283767 283363 282259 280414 278232 276300 275060 274757 275397 276562 277513 277770 277547
53825 277547 277533 278228 279454 280466 280660 280213 279918 280301 281199 282247 283365 284548 285590 286458 287531 289068
53809 289068 290825 292640 295006 298420 302543 306703 310964 315904 321425 326646 331098 335309 340017 345378
53795 345378 351142 357148 363367 369767 376230 382397 387713 391962 395606 399208 402605 405139 406548 407125
53781 407125 407131 406588 405562 404042 401513 397327 391654 385572 380048 375186 370534 365728 360720 355703 350930
$$ packed form
53885D47277q496q646q708q487q078p611p070o501n987n340m399l665l882m814
53871C55593n253m569l477k891k821k928l326m117m762m612l760k839k306k249
53857C05683k482k503j915j131j014j551j701r90l59p38j630j939j572j221j073
53842B83864p14r2L33L24N2m04j104j845k182j932j240l03O40J165R51K57k23
53825B77547j4O95J226J012J94m47k95L83Q98J048J118J183J042Q68J073J537
53809B89068J757J815K366L414M123M160M261M940N521N221M452M211M708N361
53795C45378N764O006O219O400O463O167N316M249L644L602L397K534J409N77
53781D07125On43j026j520k529m186n673o082n524m862m652m806n008n017m773
$$ plain form
53766 350930 346489 342374 338855 336389 334781 332946 330073 326660 323729 321389 318973 316301 313823 311622
53752 311622 309273 306784 304744 303395 302341 301322 300482 299724 298674 297471 296812 296921 297242 297349 297372 297309 296862
53735 296862 296275 296406 297398 298195 298013 297523 297805 298785 299560 299803 299963 300322 300710 301091 301748 302869 304373 306167
53717 306167 308203 310362 312538 314807 317222 319585 321663 323446 324992 326180 326947 327694 329147 331735 335127
53702 335127 338366 340573 341787 343134 345893 350377 355971 362094 368580 375096 380855 385312 388713 391599
53688 391599 394084 395928 396995 397335 397024 396286 395635 395560 396096 396831 397246 397029 396327 395754 395873 396516 396835 396187
53670 396187 394768 393260 392160 391609 391597 392026 392626 393009 392897 392346 391788 391699 392085 392446 392391 392082 391857 391675 391315
53651 391315 390821 390327 389718 388965 388548 388932 389819 390595 391340 392674 394681 396805 398800 400919 403088 404768
$$ packed form
53766C50930m441m115l519k466j608j835k873l413k931k340k416k672k478k201
53752C11622k349k489k040j349j054j019q40p58j050j203o59J09L21J07K3o3m47
53735B96862n87J31R92P97j82m90K82R80P75K43J60L59L88L81O57J121J504J794
53717C06167K036K159K176K269K415K363K078J783J546J188P67P47J453K588L392
53702C35127L239K207J214J347K759M484N594O123O486O516N759M457L401K886
53688C91599K485J844J067L40l11p38o51p5N36P35M15k17p02n73J19O43L19o48
53670C96187j419j508j100n51j2M29O00L83j12n51n58q9L86L61n5l09k25j82l60
53651C91315m94m94o09p53m17L84Q87P76P45J334K007K124J995K119K169J680
$$ plain form
53635 404768 405860 406908 408159 409201 409851 410578 411659 412731 413652 415021 417243 419694 421465 422451 423189
53620 423189 424085 425328 427056 429105 431045 432962 435704 439739 444266 448129 451256 454491 458287 462250
53606 462250 465851 468971 471786 474590 477759 481520 485718 489963 493854 497051 499480 501613 504056 506620
53592 506620 508370 508912 508981 509293 509450 508667 507043 505309 503686 501845 499746 497684 495642 493418 491368 490160
53576 490160 489649 488793 486923 484471 482197 480292 478662 477554 477258 477421 477245 476467 475744 475844 476659 477353 477409
53559 477409 477190 477217 477256 476563 474977 473290 472424 472656 473708 475231 476984 478855 480944 483348 485801 487858
53543 487858 489570 491549 494138 496934 499409 501624 503993 506727 509916 513883 518979 525113 531802 538698
53529 538698 545920 553904 562955 572809 582730 592380 602481 614122 627419 641424 655406 669510 683981
$$ packed form
53635D04768J092J048J251J042O50P27J081J072R21J369K222K451J771R86P38
53620D23189Q96J243J728K049J940J917K742M035M527L863L127L235L796L963
53606D62250L601L120K815K804L169L761M198M245L891L197K429K133K443K564
53592E06620J750N42O9L12J57p83j624j734j623j841k099k062k042k224k050j208
53576D90160n11q56j870k452k274j905j630j108k96J63j76p78p23J00Q15O94N6
53559D77409k19K7L9o93j586j687q66K32J052J523J753J871K089K404K453K057
53543D87858J712J979K589K796K475K215K369K734L189L967N096O134O689O896
53529E38698P222P984R051R854R921R650J0101J1641J3297J4005J3982J4104J4471
$$ plain form
53516 683981 698596 713393 729233 746991 766620 787620 809942 833811 858964 884794 911125
53505 911125 938265 966329 994849 1023012 1050038 1075597 1100085 1124247 1148312 1171891 1194836
53494 1194836 1217605 1240412 1262673 1283841 1304209 1324334 1344212 1363729 1383411 1403906 1425086
53483 1425086 1446430 1467965 1489990 1512092 1533364 1553580 1573402 1593431 1613640 1633671 1652989
53472 1652989 1670750 1686176 1699099 1709681 1717729 1722892 1725392 1725814 1724207 1720090 1713379 1704671 1694541
53459 1694541 1683230 1671070 1658530 1645614 1631776 1616640 1600307 1582808 1563837 1543309 1521718
53448 1521718 1499654 1477333 1454848 1432567 1411010 1390447 1370763 1351619 1332787 1314550 1297703
53437 1297703 1282906 1270119 1258971 1249519 1242216 1237168 1233866 1231720 1230490 1230144 1230637 1231904 1233916 1236754
$$ packed form
53516F83981J4615J4797J5840J7758J9629K1000K2322K3869K5153K5830K6331
53505I11125K7140K8064K8520K8163K7026K5559K4488K4162K4065K3579K2945
53494A194836K2769K2807K2261K1168K0368K0125J9878J9517J9682K0495K1180
53483A425086K1344K1535K2025K2102K1272K0216J9822K0029K0209K0031J9318
53472A652989J7761J5426J2923J0582Q048N163K500M22j607m117o711q708j0130
53459A694541j1311j2160j2540j2916j3838j5136j6333j7499j8971k0528k1591
53448A521718k2064k2321k2485k2281k1557k0563j9684j9144j8832j8237j6847
53437A297703j4797j2787j1148r452p303n048l302k146j230l46M93J267K012K838
$$ plain form
53423 1236754 1240779 1246501 1253984 1262628 1271979 1282512 1295120 1310028 1326789 1345282 1365967 1389040
53411 1389040 1413924 1439845 1466473 1493856 1522150 1551632 1582600 1614972 1648212 1681890 1716247
53400 1716247 1752087 1790232 1831081 1874590 1920625 1969295 2020719 2074447 2129515 2185307 2242049
53389 2242049 2300158 2359461 2419476 2480046 2541096 2602005 2661830 2720067 2776696 2831612 2884528
53378 2884528 2935331 2983983 3030092 3073049 3112490 3148203 3179765 3206831 3229607 3248348 3262466
53367 3262466 3270750 3272482 3267702 3256431 3238319 3213199 3181447 3143732 3100963 3054476 3005628 2954970
53355 2954970 2902299 2847601 2791489 2734710 2677834 2621539 2566594 2513427 2462145 2412967 2365986
53344 2365986 2320450 2275002 2228884 2182395 2136045 2089969 2044429 2000155 1957718 1917042 1877942
$$ packed form
53423A236754M025N722P483Q644R351J0533J2608J4908J6761J8493K0685K3073
53411A389040K4884K5921K6628K7383K8294K9482L0968L2372L3240L3678L4357
53400A716247L5840L8145M0849M3509M6035M8670N1424N3728N5068N5792N6742
53389B242049N8109N9303O0015O0570O1050O0909N9825N8237N6629N4916N2916
53378B884528N0803M8652M6109M2957L9441L5713L1562K7066K2776J8741J4118
53367C262466Q284J732m780j1271j8112k5120l1752l7715m2769m6487m8848n0658
53355B954970n2671n4698n6112n6779n6876n6295n4945n3167n1282m9178m6981
53344B365986m5536m5448m6118m6489m6350m6076m5540m4274m2437m0676l9100
$$ plain form
53333 1877942 1840786 1806272 1774902 1746965 1722644 1701716 1683365 1666554 1650470 1634534 1618254
53322 1618254 1601214 1583065 1563572 1542925 1521919 1501436 1481785 1462878 1444887 1428260 1413219
53311 1413219 1399840 1388490 1379469 1372284 1366074 1360846 1357480 1356402 1357006 1358613 1361178 1364786 1369358 1375279
53297 1375279 1383507 1394469 1407471 1421728 1437374 1455025 1474969 1497321 1522288 1549556 1577890
53286 1577890 1606059 1633818 1661443 1688701 1714962 1739955 1763767 1786245 1806993 1825789 1842565
53275 1842565 1857153 1869470 1879601 1887258 1891455 1891327 1887047 1879463 1869092 1856076 1840834 1823978
53263 1823978 1805556 1785045 1762194 1737385 1711036 1683151 1653706 1623086 1591847 1560228 1528116
53252 1528116 1495532 1463006 1431411 1401356 1372763 1345092 1317850 1290720 1263369 1235586 1207645
$$ packed form
53333A877942l7156l4514l1370k7937k4321k0928j8351j6811j6084j5936j6280
53322A618254j7040j8149j9493k0647k1006k0483j9651j8907j7991j6627j5041
53311A413219j3379j1350r021p185o210n228l366j078O04J607K565L608M572N921
53297A375279Q228J0962J3002J4257J5646J7651J9944K2352K4967K7268K8334
53286A577890K8169K7759K7625K7258K6261K4993K3812K2478K0748J8796J6776
53275A842565J4588J2317J0131P657M197j28m280p584j0371j3016j5242j6856
53263A823978j8422k0511k2851k4809k6349k7885k9445l0620l1239l1619l2112
53252A528116l2584l2526l1595l0055k8593k7671k7242k7130k7351k7783k7941
$$ plain form
53241 1207645 1180067 1152884 1125512 1097587 1069553 1042228 1016119 991358 967987 946061 925733
53230 925733 907373 891216 876822 863404 850825 839645 829878 820437 810338 799802 789441 778878
53218 778878 767051 753619 739169 724134 708370 691923 675451 659514 643931 628196 612319
53207 612319 597035 583249 571318 560732 550554 540329 530453 521547 513586 505903 497867 489282 480220
53194 480220 470775 461044 451192 441551 432700 425140 418732 412687 406350 399800 393520 387790 382666 378237
53180 378237 374466 370917 367050 362735 358246 353882 349870 346463 343847 342026 340963 340626 340660 340384 339490
53165 339490 338470 337920 337648 336968 335698 334305 333106 331933 330645 329447 328456 327337 325709 323779 322353
53150 322353 322098 322842 323616 323556 322720 321783 320989 319873 318220 316736 316301 316859 317529 317591 316894 315585 314092 313253
$$ packed form
53241A207645k7578k7183k7372k7925k8034k7325k6109k4761k3371k1926k0328
53230I25733j8360j6157j4394j3418j2579j1180r767r441j0099j0536j0361j0563
53218G78878j1827j3432j4450j5035j5764j6447j6472j5937j5583j5735j5877
53207F12319j5284j3786j1931j0586j0178j0225r876q906p961p683q036q585r062
53194D80220r445r731r852r641q851p560o408o045o337o550o280n730n124m429
53180C78237l771l549l867m315m489m364m012l407k616j821j063l37L4k76q94
53165C39490j020n50k72o80j270j393j199j173j288j198r91j119j628j930j426
53150C22353k55P44P74o0q36r37p94j116j653j484m35N58O70O2o97j309j493q39
$$ plain form
53132 313253 313749 315301 316867 317839 318581 319715 321315 322977 324355 325450 326704 328941 332866 338340 344339
53117 344339 349826 354548 358888 363188 367423 371349 374697 377258 378974 379954 380232 379551 377534 374203 370177
53102 370177 366207 362489 358662 354456 350084 345894 341952 338233 334929 332131 329443 326421 323311 320765
53088 320765 318826 316854 314509 312187 310309 308864 307884 307601 307680 307096 305444 303806 303583 304878 306698 308289
53072 308289 309399 309620 308577 306775 305292 304424 303378 301482 299017 296587 294383 292441 291039 290339 289960
53057 289960 289371 288559 287968 287868 288030 287992 287513 286838 286570 287223 288841 291008 293114 294592 295124 294875 294372 293917
53039 293917 293246 292011 290448 289175 288397 287724 286855 286058 285814 286224 287005 287985 289361 291288 293252 294171 293520
53022 293520 292198 291795 292855 294355 295112 295113 295092 295328 295493 295322 294817 294019 293189 293077 294356 296801 299470 301620
$$ packed form
53132C13253M96J552J566R72P42J134J600J662J378J095J254K237L925N474N999
53117C44339N487M722M340M300M235L926L348K561J716R80K78o81k017l331m026
53102C70177l970l718l827m206m372m190l942l719l304k798k688l022l110k546
53088C20765j939j972k345k322j878j445r80k83P9n84j652j638k23J295J820J591
53072C08289J110K21j043j802j483q68j046j896k465k430k204j942j402p00l79
53057B89960n89q12n91j00J62l8m79o75k68O53J618K167K106J478N32k49n03m55
53039B93917o71j235j563j273p78o73q69p97k44M10P81R80J376J927J964R19o51
53022B93520j322m03J060J500P57Jk1K36J65j71n05p98q30j12J279K445K669K150
$$ plain form
53004 301620 303006 303495 303037 302058 301323 301280 301869 302859 303951 304708 304974 305290 306379 308241 310292 312259 314317
52987 314317 316397 318131 319505 320806 321785 321738 320698 319766 319784 320317 320495 320280 320319 320895 321634 322092 322180 322117 322244
52968 322244 322707 323166 323116 322725 322948 324414 326503 327999 328486 328640 329232 330303 331349 331943 332016 331723 331193 330370
52950 330370 329070 327208 325031 323086 321887 321471 321264 320560 319303 318209 317958 318438 319012 319295 319342 319302 319375
52933 319375 319926 321095 322347 322933 322800 322479 322141 321498 320739 320742 321951 323666 324936 325628 326125 326441 326219 325290
52915 325290 323722 321580 319172 317303 316765 317561 318959 320224 321001 321246 321184 321201 321413 321523 321400 321521 322280
52898 322280 323085 322837 321328 319601 318759 318960 319735 320744 321791 322508 322528 321932 321194 320760 320801 321274 321954 322538
52880 322538 322988 323744 325337 327814 330781 333969 337386 340853 343870 346267 348588 351362 354172 355993 356442
$$ packed form
53004C01620J386M89m58r79p35m3N89R90J092P57K66L16J089J862K051J967K058
52987C14317K080J734J374J301R79m7j040r32J8N33J78k15L9N76P39M58Q8o3J27
52968C22244M63M59n0l91K23J466K089J496M87J54N92J071J046N94P3k93n30q23
52950C30370j300j862k177j945j199m16k07p04j257j094k51M80N74K83M7m0P3
52933C19375N51J169J252N86j33l21l38o43p59LJ209J715J270O92M97L16k22r29
52915C25290j568k142k408j869n38P96J398J265P77K45o2J7K12J10j23J21P59
52898C22280Q05k48j509j727q42K01P75J009J047P17K0n96p38m34M1M73O80N84
52880C22538M50P56J593K477K967L188L417L467L017K397K321K774K810J821M49
$$ plain form
52865 356442 356113 355635 354975 353944 352834 352054 351495 350674 349317 347465 345247 342958 341078 339714 338210 335862
52849 335862 332888 330183 328163 326365 324162 321371 318179 315048 312705 311670 311615 311704 311603 311624 311757 311332
52833 311332 310001 308503 307914 308514 309725 310870 311572 311732 311508 311140 310546 309392 307782 306466 305923 305584
52817 305584 304474 302488 300531 299495 299510 300178 301130 302237 303500 304802 305646 305332 303657 301405 299805 299409
52801 299409 299669 299580 298594 296905 295094 293591 292401 291237 289902 288535 287508 287132 287372 287733 287509 286362
52785 286362 284665 283116 282060 281449 281362 282123 283779 285845 287803 289519 290890 291410 290592 288766 287033 286266
52769 286266 286328 286396 285959 285285 284893 284753 284347 283519 282849 282938 283680 284623 285753 287346 289250 291002 292556 294198
52751 294198 295622 295891 294622 292592 290859 289861 289700 290642 292751 295479 298129 300453 302438 303965 305120
$$ packed form
52865C56442l29m78o60j031j110p80n59q21j357j852k218k289j880j364j504k348
52849C35862k974k705k020j798k203k791l192l131k343j035n5Q9j01K1J33m25
52833C11332j331j498n89O00J211J145P02J60k24l68n94j154j610j316n43l39
52817C05584j110j986j957j036J5O68R52J107J263J302Q44l14j675k252j600l96
52801B99409K60q9r86j689j811j503j190j164j335j367j027l76K40L61k24j147
52785B86362j697j549j056o11q7P61J656K066J958J716J371N20q18j826j733p67
52769B86266O2O8m37o74l92j40m06q28o70Q9P42R43J130J593J904J752J554J642
52751B94198J424K69j269k030j733r98j61R42K109K728K650K324J985J527J155
$$ plain form
52736 305120 306361 307860 309081 309536 309581 309811 310125 310085 309943 310475 311897 313642 315120 316006 315897 314491 312241
52719 312241 310089 308390 306714 304902 303595 303373 303921 304505 304907 305470 306453 307654 308600 308914 308629 308199 308055
52702 308055 308155 308163 308020 307947 307909 307577 306954 306579 306858 307573 308326 309072 309844 310282 309921 308884 307875 307523 307971
52683 307971 309035 310432 311830 312969 313902 314932 316182 317277 317603 316944 315805 315028 315029 315499 315891 316081 316324
52666 316324 316695 316953 317065 317540 318896 320928 322753 323625 323603 323454 324077 325949 328932 332481 336067 339464
52650 339464 342609 345347 347473 349004 350148 350863 350700 349343 347236 345344 344212 343523 342677 341503 340206
52635 340206 338940 337861 337540 338820 342077 346879 352525 358689 365414 372656 380023 386775 391988 394876
52621 394876 395164 393091 389047 383485 377266 371638 367436 364441 361953 359903 358927 359272 360126 360427 360099 360092
$$ packed form
52736C05120J241J499J221M55M5K30L14m0j42N32J422J745J478Q86j09j406k250
52719C12241k152j699j676j812j307k22N48N84M02N63R83J201R46L14k85m30j44
52702C08055J00Qj43p3l8l32o23l75K79P15P53P46P72M38l61j037j009l52M48
52683C07971J064J397J398J139R33J030J250J095L26o59j139p77JM70L92J90K43
52666C16324L71K58J12M75J356K032J825Q72k2j49O23J872K983L549L586L397
52650C39464L145K738K126J531J144P15j63j357k107j892j132o89q46j174j297
52635C40206j266j079l21J280L257M802N646O164O725P242P367O752N213K888
52621C94876K88k073m044n562o219n628m202k995k488k050r76L45Q54L01l28p
$$ plain form
52605 360092 361174 362999 364455 364732 363864 362404 360915 359840 359517 359989 360850 361544 361783 361592 361105 360582 360543
52588 360543 361449 363138 364833 365844 366038 365660 365045 364668 365079 366450 368355 370194 371719 372955 373834 374142
52572 374142 373722 372607 371112 369859 369375 369459 369233 368146 366667 365623 365068 364257 362701 360778 359211 358279
52556 358279 357687 357019 356162 355349 354821 354458 353886 352980 352093 351656 351769 352372 353519 355142 356750 357796 358244
52539 358244 358416 358330 357707 356680 356034 356463 357934 359973 362293 364741 366866 368053 368231 368188 368855 370365 371987
52522 371987 372978 373311 373502 373987 374946 376571 379030 382109 385245 388143 391113 394556 398373 402120 405546
52507 405546 408683 411476 413608 414676 414382 412641 409717 406151 402306 398052 393137 387911 383394 380471
52493 380471 379083 378248 376900 374755 372455 370840 370131 369879 369637 369388 369322 369496 369882 370483 371240 372068 373167
$$ packed form
52605C60092J082J825J456K77q68j460j489j075l23M72Q61O94K39j91m87n23l9
52588C60543R06J689J695J011J94l78o15l77M11J371J905J839J525J236Q79L08
52572C74142m20j115j495j253m84Q4k26j087j479j044n55q11j556j923j567r32
52556C58279n92o68q57q13n28l63n72r06q87m37J13O03J147J623J608J046M48
52539C58244J72q6o23j027o46M29J471K039K320K448K125J187J78m3O67J510J622
52522C71987R91L33J91M85R59J625K459L079L136K898K970L443L817L747L426
52507D05546L137K793K132J068k94j741k924l566l845m254m915n226m517k923
52493C80471j388q35j348k145k300j615p09k52k42k49o6J74L86O01P57Q28J099
$$ plain form
52476 373167 374983 377540 380065 381639 382170 382465 383476 385662 388900 392680 396492 400260 404343 408958 413823
52461 413823 418535 422940 426714 428951 428772 426311 422595 418518 414339 410088 405810 401323 396378 391310
52447 391310 387043 384087 381933 379795 377622 375923 374817 373811 372596 371570 371296 371655 371870 371349 370171
52432 370171 368678 366950 364965 363092 361969 361863 362466 363340 364200 364825 365141 365613 367061 369784 373148 376292
52416 376292 378840 380731 381856 382359 382901 384084 385841 387799 389934 392408 395175 398435 403135 410154 419007
52401 419007 428083 436221 443371 449645 454557 457474 458218 456879 453538 448530 442560 436265 429951 423965
52387 423965 418922 415252 412820 411249 410378 410139 410293 410597 411082 411970 413416 415461 418099 421288 425013 429376
52371 429376 434433 439937 445464 450782 455850 460401 463927 466158 467265 467501 466956 465780 464320 462828 461267
$$ packed form
52476C73167J816K557K525J574N31K95J011K186L238L780L812L768M083M615M865
52461D13823M712M405L774K237j79k461l716m077m179m251m278m487m945n068
52447C91310m267k956k154k138k173j699j106j006j215j026k74L59K15n21j178
52432C70171j493j728j985j873j123j06O03Q74Q60O25L16M72J448K723L364L144
52416C76292K548J891J125N03N42J183J757J958K135K474K767L260M700P019Q853
52401D19007R076Q138P150O274M912K917P44j339l341n008n970o295o314n986
52387D23965n043l670k432j571q71k39J54L04M85Q88J446K045K638L189L725M363
52371D29376N057N504N527N318N068M551L526K231J107K36n45j176j460j492j561
$$ plain form
52356 461267 459587 457977 456687 455849 455598 456116 457320 458694 459710 460391 461321 463127 465986 469499 472975
52341 472975 475870 478024 479537 480603 481555 482839 484732 487221 490419 494832 500869 508248 516334 525012
52327 525012 534749 545805 557886 570698 584364 599028 614304 629403 643719 657246 670481 683911
52315 683911 697535 711065 724648 739062 754898 772037 790354 810423 832720 856460 880195
52304 880195 903519 927270 951949 976957 1001637 1026163 1050894 1075529 1099354 1121669 1141624
52293 1141624 1158309 1171590 1182316 1191202 1197989 1202132 1203788 1203622 1202162 1199856 1197139 1193847 1189129
52280 1189129 1182725 1175816 1169775 1164471 1158812 1152735 1147561 1144251 1142293 1140692 1139363 1139022 1140152 1142531
52266 1142531 1145607 1149002 1152757 1157335 1163380 1171308 1181071 1192249 1204444 1217761 1232933 1250781 1271340
$$ packed form
52356D61267j680j610j290q38k51N18J204J374J016O81R30J806K859L513L476
52341D72975K895K154J513J066R52J284J893K489L198M413O037P379Q086Q678
52327E25012R737J1056J2081J2812J3666J4664J5276J5099J4316J3527J3235J3430
52315F83911J3624J3530J3583J4414J5836J7139J8317K0069K2297K3740K3735
52304H80195K3324K3751K4679K5008K4680K4526K4731K4635K3825K2315J9955
52293A141624J6685J3281J0726Q886O787M143J656j66j460k306k717l292m718
52280A189129o404o909o041n304n659o077n174l310j958j601j329l41J130K379
52266A142531L076L395L755M578O045P928R763J1178J2195J3317J5172J7848K0559
$$ plain form
52253 1271340 1293652 1316481 1339054 1361017 1381992 1401454 1418878 1433767 1445669 1454386 1460083 1463147
52241 1463147 1464090 1463554 1461976 1459099 1454282 1447519 1439641 1431177 1421565 1410074 1397035 1383473 1369728
52228 1369728 1355243 1339683 1323606 1307858 1292781 1278171 1263669 1249114 1234791 1221327 1209112
52217 1209112 1197902 1187355 1177801 1169913 1163628 1158012 1152429 1147389 1143888 1142197 1141654 1141441 1141257 1141360
52203 1141360 1142277 1144524 1148311 1153308 1158741 1163908 1168734 1173845 1180011 1187520 1196058 1205047 1213973 1222531
52189 1222531 1230696 1238552 1245745 1251180 1253703 1253223 1250785 1247410 1243214 1237800 1231037 1223155 1214454 1205294
52175 1205294 1196133 1187286 1178851 1171080 1164473 1159193 1154747 1150653 1147132 1144747 1143612 1143436 1144130 1145855
52161 1145855 1148560 1151903 1155526 1159053 1161957 1163873 1164968 1165630 1165880 1165414 1164105 1162160 1160008 1158400 1158318
$$ packed form
52253A271340K2312K2829K2573K1963K0975J9462J7424J4889J1902Q717N697L064
52241A463147R43n36j578k877m817o763p878q464r612j1491j3039j3562j3745
52228A369728j4485j5560j6077j5748j5077j4610j4502j4555j4323j3464j2215
52217A209112j1210j0547r554p888o285n616n583n040l501j691n43k13j84J03
52203A141360R17K247L787M997N433N167M826N111O166P509Q538Q989Q926Q558
52189A222531Q165P856P193N435K523m80k438l375m196n414o763p882q701r160
52175A205294r161q847q435p771o607n280m446m094l521k385j135j76O94J725
52161A145855K705L343L623L527K904J916J095O62K50m66j309j945k152j608q2
$$ plain form
52146 1158318 1160112 1162847 1165155 1166764 1168621 1171439 1174738 1177523 1179398 1180697 1181890 1183214 1184697 1186340
52132 1186340 1188322 1191130 1195386 1201555 1209899 1220546 1233334 1247748 1263338 1280184 1298653 1318745
52120 1318745 1340007 1362023 1384622 1407644 1430882 1454308 1477892 1501133 1523101 1543164 1561490
52109 1561490 1578767 1595617 1612271 1628601 1644468 1660194 1676619 1694389 1713207 1731973 1749590
52098 1749590 1765413 1779123 1790521 1799340 1804987 1806666 1804201 1798487 1790613 1780687 1768145 1753090 1736560
52085 1736560 1719506 1702302 1685373 1669311 1653937 1638058 1620908 1603314 1586735 1571530 1556909
52074 1556909 1542434 1528807 1517150 1508070 1501540 1497213 1494647 1493528 1493963 1496431 1501347 1508740 1518426
52061 1518426 1530325 1544531 1561101 1579857 1600326 1621864 1643791 1665526 1686575 1706429 1724450
$$ packed form
52146A158318J794K735K308J609J857K818L299K785J875J299J193J324J483J643
52132A186340J982K808M256O169Q344J0647J2788J4414J5590J6846J8469K0092
52120A318745K1262K2016K2599K3022K3238K3426K3584K3241K1968K0063J8326
52109A561490J7277J6850J6654J6330J5867J5726J6425J7770J8818J8766J7617
52098A749590J5823J3710J1398Q819N647J679k465n714p874r926j2542j5055j6530
52085A736560j7054j7204j6929j6062j5374j5879j7150j7594j6579j5205j4621
52074A556909j4475j3627j1657r080o530m327k566j119M35K468M916P393R686
52061A518426J1899J4206J6570J8756K0469K1538K1927K1735K1049J9854J8021
$$ plain form
52050 1724450 1739990 1752700 1762690 1770200 1775085 1776836 1775165 1770397 1763210 1754259 1744198 1733693 1723001
52037 1723001 1711681 1699047 1684886 1669514 1653360 1636843 1620513 1604812 1589652 1574543 1559124
52026 1559124 1543277 1526852 1509797 1492658 1476440 1461689 1447863 1433724 1418275 1401433 1384170
52015 1384170 1367983 1353910 1341830 1330901 1320582 1310952 1302037 1293215 1283492 1272174 1259247 1245238
52003 1245238 1230693 1215646 1199723 1182934 1166083 1150041 1134862 1120094 1105701 1092037 1078966
51992 1078966 1065724 1051739 1036980 1021408 1004727 986814 967784 947487 925635 902730 880197
51981 880197 859210 839833 821611 804312 787678 771148 754551 738665 724469 712206 701843
51970 701843 694047 689873 689500 691917 695907 700857 706639 713267 720825 729286 738276 747202 755673 763547
$$ packed form
52050A724450J5540J2710R990P510M885J751j671m768p187q951j0061j0505j0692
52037A723001j1320j2634j4161j5372j6154j6517j6330j5701j5160j5109j5419
52026A559124j5847j6425j7055j7139j6218j4751j3826j4139j5449j6842j7263
52015A384170j6187j4073j2080j0929j0319r630q915q822r723j1318j2927j4009
52003A245238j4545j5047j5923j6789j6851j6042j5179j4768j4393j3664j3071
51992A078966j3242j3985j4759j5572j6681j7913j9030k0297k1852k2905k2533
51981H80197k0987j9377j8222j7299j6634j6530j6597j5886j4196j2263j0363
51970G01843p796m174l73K417L990M950N782O628P558Q461Q990Q926Q471P874
$$ plain form
51956 763547 770668 777008 783238 790931 801966 817611 838029 862357 889082 916215 941123 960597
51944 960597 971855 973986 968350 957431 943451 928107 913029 899806 889554 882612 878517 876002
51932 876002 873351 869323 863830 857439 850225 841355 829835 815473 799123 782029 764784 746896 727579
51919 727579 707020 686500 667122 649018 632159 617301 605305 595891 588003 581451 577271 576302 578110
51906 578110 581670 586354 591748 597106 601676 605371 608489 610837 611633 610284 606806 601381 593936 584405
51892 584405 573195 561105 548892 537104 526267 516939 509491 504044 500707 499682 500887 503645 507115
51879 507115 511083 516038 522407 530079 538767 548366 558523 568150 575942 581438 585229 588108 590370 591902
51865 591902 592538 592151 590801 589050 587904 588146 589808 592434 595645 599241 602888 606021 608065 608588 607264
$$ packed form
51956G63547P121O340O230P693J1035J5645K0418K4328K6725K7133K4908J9474
51944I60597J1258K131n636j0919j3980j5344j5078j3223j0252o942m095k515
51932H76002k651m028n493o391p214q870j1520j4362j6350j7094j7245j7888j9317
51919G27579k0559k0520j9378j8104j6859j4858j1996r414p888o552m180r69J808
51906E78110L560M684N394N358M570L695L118K348P96j349l478n425p445r531
51892E84405j1210j2090j2213j1788j0837r328p448n447l337j025J205K758L470
51879E07115L968M955O369P672Q688R599J0157R627P792N496L791K879K262J532
51865E91902O36l87j350j751j146K42J662K626L211L596L647L133K044N23j324
$$ plain form
51850 607264 603946 598815 592322 584859 576537 567273 557062 546178 535224 524933 515736 507498 499870
51837 499870 492946 487363 483624 481542 480560 480419 481207 482830 484812 486667 488223 489537 490740 491984 493160
51822 493160 493569 492337 489532 486496 484614 483909 483273 481964 480325 479056 478335 477967 477943 478418 479203 479685 479353
51805 479353 478287 477053 476188 475906 476337 477856 480877 485253 490120 494516 497998 500540 502139 502818 502849 502606
51789 502606 502269 501828 501165 499858 497267 493335 489084 485683 483115 480382 477044 473826 471607 470561 470671
51774 470671 472389 476210 481949 488992 496980 505848 515392 525262 535180 544798 553407 560124 564379 566139
51760 566139 565842 564224 561877 558725 554184 548111 541261 534521 528019 521434 514834 508660 503017 497560
51746 497560 492134 487048 482637 478912 475744 473082 470900 469267 468564 469351 471774 475298 479231 483468 488532
$$ packed form
51850F07264l318n131o493p463q322r264j0211j0884j0954j0291r197q238p628
51837D99870o924n583l739k082r82j41P88J623J982J855J556J314J203J244J176
51822D93160M09j232k805l036j882p05o36j309j639j269p21l68k4M75P85M82l32
51805D79353j066j234q65k82M31J519L021M376M867M396L482K542J599O79L1k43
51789E02606l37m41o63j307k591l932m251l401k568k733l338l218k219j046J10
51774D70671J718L821N739P043P988Q868R544R870R918R618Q609O717M255J760
51760E66139k97j618k347l152m541o073o850o740o502o585o600o174n643n457
51746D97560n426n086m411l725l168k662k182j633p03P87K423L524L933M237N064
$$ plain form
51731 488532 494842 501963 508698 514007 517827 520874 523734 526492 529323 533007 538357 545204 552250 557985
51717 557985 561597 563109 562895 561203 558062 553685 548906 544949 542466 540932 539180 536467 532844 528751
51703 528751 524684 521213 518834 517501 516552 515328 513733 511979 509906 506894 502615 497680 493311 490383
51689 490383 488946 488632 489180 490346 491592 492255 492005 490890 488960 486231 482963 479646 476625 474040 472167
51674 472167 471404 471712 472439 472977 473414 474370 476446 480031 485503 493396 504376 518982 537044 557240 577452
51659 577452 595659 610376 620534 625626 626249 623936 620080 615298 609985 604952 601089 598710 597519 596794
51645 596794 595323 591669 585089 575992 565150 552882 539427 525548 512060 499081 486526 475083
51633 475083 465802 458763 452966 447757 443566 440956 439577 438603 437815 437700 438576 440019 441224 441781 441924 442072
$$ packed form
51731D88532O310P121O735N309L820L047K860K758K831L684N350O847P046N735
51717E57985L612J512k14j692l141m377m779l957k483j534j752k713l623m093
51703E28751m067l471k379j333r49j224j595j754k073l012m279m935m369k928
51689D90383j437l14N48J166J246O63k50j115j930k729l268l317l021k585j873
51674D72167p63L08P27N38M37R56K076L585N472P893J0980J4606J8062K0196K0212
51659E77452J8207J4717J0158N092O23k313l856m782n313n033l863k379j191p25
51645E96794j471l654o580r097j0842j2268j3455j3879j3488j2979j2555j1443
51633D75083r281p039n797n209m191k610j379r74p88j15Q76J443J205N57J43J48
$$ plain form
51617 442072 442221 441959 440981 439366 437344 435116 432984 431271 429854 428128 425722 423001 420659 419157 418738
51602 418738 419483 420989 422524 424072 426737 431425 437566 443946 450573 458825 469758 482927 496776 509366
51588 509366 518725 523495 523736 520771 516081 510687 505392 500803 496969 493704 491427 491049 492851 496218 500722
51573 500722 506687 514297 522930 532052 542205 554355 568537 583709 598716 612929 626259 639245
51561 639245 653103 669129 687821 708820 731651 756284 782961 811668 841665 871270 898122
51550 898122 919934 935125 942835 942626 934463 918942 897261 870875 841247 809816 777920 746538
51538 746538 716173 687131 659961 635484 614279 596203 580595 566938 555097 544977 536296 528815
51526 528815 522424 516786 511294 505735 500702 496858 494013 491374 488561 485865 483568 481521 479477 477453
$$ packed form
51617D42072J49k62r78j615k022k228k132j713j417j726k406k721k342j502m19
51602D18738P45J506J535J548K665M688O141O380O627Q252J0933J3169J3849J2590
51588E09366R359M770K41k965m690n394n295m589l834l265k277l78J802L367M504
51573E00722N965P610Q633R122J0153J2150J4182J5172J5007J4213J3330J2986
51561F39245J3858J6026J8692K0999K2831K4633K6677K8707K9997K9605K6852
51550H98122K1812J5191P710k09q163j5521k1681k6386k9628l1431l1896l1382
51538G46538l0365k9042k7170k4477k1205j8076j5608j3657j1841j0120q681p481
51526E28815o391n638n492n559n033l844k845k639k813k696k297k047k044k024
$$ plain form
51512 477453 475694 474533 474225 474642 475194 475385 475292 475241 475279 475446 476200 477892 479950 481324 481772 482011 482548 483077
51494 483077 483167 482823 482159 481169 480126 479566 479539 479372 478493 477035 475378 473575 471534 469270 466692 463548 459905
51477 459905 456265 453002 450116 447742 446311 445884 445821 445500 444890 444080 442765 440629 437890 435110 432783 431329
51461 431329 430922 431047 430792 430014 429668 430583 432552 435185 438901 444235 450657 457017 462915 468782 474726 480134
51445 480134 484486 487926 490959 494068 497621 501708 506057 510497 515313 520644 525686 529164 530632 530801
51431 530801 530529 529986 528821 526625 523061 517982 511644 504572 497177 489736 482752 476916 472591 469548 467288
51416 467288 465466 464029 463162 463160 464115 465710 467406 468819 469877 470775 471793 472972 473911 474258 474478 475643
51400 475643 478168 481277 484132 486944 490363 494250 497892 501238 505099 510115 516196 522994 530314 537986
$$ packed form
51512D77453j759j161l08M17N52J91r3n1L8J67P54J692K058J374M48K39N37N29
51494D83077R0l44o64r90j043n60k7j67q79j458j657j803k041k264k578l144l643
51477D59905l640l263k886k374j431m27o3l21o10q10j315k136k739k780k327j454
51461D31329m07J25k55p78l46R15J969K633L716N334O422O360N898N867N944N408
51445D80134M352L440L033L109L553M087M349M440M816N331N042L478J468J69
51431E30801k72n43j165k196l564n079o338p072p395p441o984n836m325l043k260
51416D67288j822j437q67kR55J595J696J413J058Q98J018J179R39L47K20J165
51400D75643K525L109K855K812L419L887L642L346L861N016O081O798P320P672
$$ plain form
51386 537986 545962 554629 564528 575714 588038 602171 619671 641740 668339 698708 732184 768277
51374 768277 806389 845733 885086 922277 954353 978715 993997 999777 995916 982643 961049 933085
51362 933085 901032 866981 832450 798174 764429 731767 701264 673816 649377 627166 606541
51351 606541 587450 570127 554658 540925 528834 518434 509634 501866 494286 486566 479279 473132 467958
51338 467958 462908 457620 452607 448365 444654 441004 437451 434357 431884 430053 429038 428859 428983 428746 428151
51323 428151 427764 427909 428396 429074 430089 431442 432851 434281 436193 438857 441752 444099 445852 447725 450305
51308 450305 453517 456895 459954 462278 463657 464304 464594 464443 463374 461351 459140 457467 456161 454593 452660
51293 452660 450808 449193 447423 445149 442477 439741 437286 435524 434823 435185 436303 437934 439951 442209 444809
$$ packed form
51386E37986P976Q667R899J1186J2324J4133J7500K2069K6599L0369L3476L6093
51374G68277L8112L9344L9353L7191L2076K4362J5282N780l861j3273k1594k7964
51362I33085l2053l4051l4531l4276l3745l2662l0503k7448k4439k2211k0625
51351F06541j9091j7323j5469j3733j2091j0400q800p768p580p720p287o147n174
51338D67958n050n288n013m242l711l650l553l094k473j831j015j79J24k37n95
51323D28151l87J45M87O78J015J353J409J430J912K664K895K347J753J873K580
51308D50305L212L378L059K324J379O47K90j51j069k023k211j673j306j568j933
51293D52660j852j615j770k274k672k736k455j762p01L62J118J631K017K258K600
$$ plain form
51278 444809 448407 453606 460066 466781 473215 479324 484426 487180 487258 486127 485463 485467 485500 485650 486687 488900
51262 488900 491977 495720 499952 503895 506616 508133 509200 510052 510229 509653 508945 508340 507086 504310 499931
51247 499931 494487 488621 482996 478130 474010 470215 466590 463357 460550 457970 455781 454483 453975 453308 451783
51232 451783 449786 448219 447545 447753 448734 450286 452155 454367 457069 459782 461493 461954 462335 463923 466642
51217 466642 469473 471879 474047 476030 477583 478820 480259 482124 484128 486011 487749 489202 490173 490949 492264
51202 492264 494549 497657 501498 506369 512335 518600 523906 527423 529044 529100 528027 526133 523412 519754 515511
51187 515511 511614 508739 506480 503791 500303 496812 494295 492748 491367 489690 488148 487372 487306 487291 486937 486582
51171 486582 486782 487518 488154 488237 488162 488785 490409 492444 494248 496048 498605 502115 506006 509951 514429 519821
$$ packed form
51278D44809L598N199O460O715O434O109N102K754P8j131o64ML3J50J037K213
51262D88900L077L743M232L943K721J517J067Q52J77n76p08o05j254k776m379
51247D99931n444n866n625m866m120l795l625l233k807k580k189j298n08o67j525
51232D51783j997j567o74K08R81J552J869K212K702K713J711M61L81J588K719
51217D66642K831K406K168J983J553J237J439J865K004J883J738J453R71P76J315
51202D92264K285L108L841M871N966O265N306L517J621N6j073j894k721l658m243
51187E15511l897k875k259k689l488l491k517j547j381j677j542p76o6j5l54l55
51171D86582K00P36O36Q3p5O23J624K035J804J800K557L510L891L945M478N392
$$ plain form
51155 519821 525403 529870 532682 534286 535134 535191 534537 533694 532952 531856 529811 526913 523759 520684 517645 514737
51139 514737 512345 510727 509745 509132 508776 508622 508492 508220 507961 508187 509228 510848 512462 513886 515717 518802
51123 518802 523361 528750 533966 538157 540879 542302 543235 544511 546211 547755 548820 549763 550975 552262 553129
51108 553129 553374 553137 552712 552655 553706 556094 559078 561638 563502 565144 566903 568675 570384 572181 573982
51093 573982 575376 576235 577014 578027 578738 578250 576495 574519 573470 573516 573895 573888 573515 573297 573600 574384 575533 577149
51075 577149 579368 582059 584908 587800 590954 594676 599116 604307 610266 617000 624519 632928 642447 653227
51061 653227 665183 678055 691580 705491 719439 733053 746003 757804 767528 773964 776361 775096
51049 775096 771586 767641 764934 764712 767434 772449 778289 783570 787652 790495 792180 792695 791995 789979 786589
$$ packed form
51155E19821N582M467K812J604Q48N7o54q43p42j096k045k898l154l075l039k908
51139E14737k392j618r82o13l56j54j30k72k59K26J041J620J614J424J831L085
51123E18802M559N389N216M191K722J423R33J276J700J544J065R43J212J287Q67
51108E53129K45k37m25n7J051K388K984K560J864J642J759J772J709J797J801
51093E73982J394Q59P79J013P11m88j755j976j049M6L79pl73k18L03P84J149J616
51075E77149K219K691K849K892L154L722M440N191N959O734P519Q409R519J0780
51061F53227J1956J2872J3525J3911J3948J3614J2950J1801R724O436K397j265
51049G75096l510l945k707k22K722N015N840N281M082K843J685N15p00k016l390
$$ plain form
51034 786589 782214 777939 775061 774210 774956 776138 776529 775424 772947 769798 766495 762956 759053 755339 752756
51019 752756 751662 751610 752213 753741 756590 760523 764795 768765 772018 774062 774479 773488 772052 771125 770795 770303
51003 770303 768917 766707 764422 762686 761474 760396 759364 758762 759018 760219 762161 764671 767819 771879 777089
50988 777089 783399 790630 798986 809186 821790 836433 852102 868179 884969 903225 923477 945925
50976 945925 970533 996908 1024215 1051514 1078250 1104448 1130654 1157840 1187276 1220315 1258093
50965 1258093 1301229 1349676 1403039 1461192 1524407 1592568 1664553 1738837 1814601 1891620 1968984
50954 1968984 2044571 2116105 2182266 2242477 2296070 2342208 2380347 2410338 2432214 2446309 2453539
50943 2453539 2455207 2452529 2446536 2438295 2428869 2418971 2408748 2397809 2385427 2370941 2354266 2335932
$$ packed form
51034G86589m375m275k878q51P46J182L91j105k477l149l303l539l903l714k583
51019G52756j094n2O03J528K849L933M272L970L253K044M17r91j436r27l30m92
51003G70303j386k210k285j736j212j078j032o02K56J201J942K510L148M060N210
50988G77089O310P231Q356J0200J2604J4643J5669J6077J6790J8256K0252K2448
50976I45925K4608K6375K7307K7299K6736K6198K6206K7186K9436L3039L7778
50965A258093M3136M8447N3363N8153O3215O8161P1985P4284P5764P7019P7364
50954A968984P5587P1534O6161O0211N3593M6138L8139K9991K1876J4095P230
50943B453539J668k678n993q241r426r898j0223j0939j2382j4486j6675j8334
$$ plain form
50931 2335932 2316438 2295668 2273026 2248005 2220349 2189872 2156377 2119717 2079716 2036133 1988935
50920 1988935 1938608 1886054 1832194 1777779 1723452 1669873 1617831 1568265 1521936 1478941 1438795
50909 1438795 1401148 1366202 1334197 1304816 1277468 1251922 1228235 1206217 1185458 1165893 1147928
50898 1147928 1131975 1118200 1106691 1097422 1089897 1083244 1076902 1070962 1065726 1061254 1057558 1054902 1053528
50885 1053528 1053243 1053618 1054547 1056316 1059206 1063323 1068800 1075745 1083830 1092343 1101024 1110592 1122040 1135478
50871 1135478 1150122 1165385 1181444 1198510 1216151 1233826 1251722 1270507 1290441 1311381 1333634
50860 1333634 1358260 1386423 1418930 1456402 1499309 1547728 1601720 1662246 1731188 1809999 1898789
50849 1898789 1997120 2105225 2223816 2353036 2492249 2640805 2798311 2964014 3136282 3312744
$$ packed form
50931B335932j9494k0770k2642k5021k7656l0477l3495l6660m0001m3583m7198
50920A988935n0327n2554n3860n4415n4327n3579n2042m9566m6329m2995m0146
50909A438795l7647l4946l2005k9381k7348k5546k3687k2018k0759j9565j7965
50898A147928j5953j3775j1509r269p525o653o342n940n236m472l696k656j374
50885A053528k85L75R29J769K890M117N477O945Q085Q513Q681R568J1448J3438
50871A135478J4644J5263J6059J7066J7641J7675J7896J8785J9934K0940K2253
50860A333634K4626K8163L2507L7472M2907M8419N3992O0526O8942P8811Q8790
50849A898789R8331J08105J18591J29220J39213J48556J57506J65703J72268J76462
$$ plain form
50839 3312744 3490656 3667037 3838695 4002164 4153521 4288508 4403285 4495190 4562801 4605667
50829 4605667 4624458 4621215 4598887 4560495 4509098 4448454 4383095 4317434 4255019 4198649 4150518
50818 4150518 4111600 4080946 4055955 4033442 4010473 3984413 3952615 3912296 3860846 3796405 3718308
50807 3718308 3626994 3523496 3409108 3285527 3155135 3020886 2885777 2752377 2622698 2498333
50797 2498333 2380601 2270595 2169218 2077204 1995011 1922625 1859521 1804955 1758286 1718897 1685889
50786 1685889 1658109 1634577 1614875 1599040 1587114 1578630 1572379 1566779 1560767 1554375 1548217 1542414 1536265
50773 1536265 1528962 1520323 1510785 1500965 1491204 1481174 1469871 1456470 1441346 1425860 1410911 1396192
50761 1396192 1381103 1365882 1351402 1338239 1326477 1316149 1307352 1300107 1294545 1291103 1290138 1291502 1294943
$$ packed form
50839C312744J77912J76381J71658J63469J51357J34987J14777R1905O7611M2866
50829D605667J8791l243k2328l8392n1397o0644o5359o5661o2415n6370m8131
50818D150518l8918l0654k4991k2513k2969k6060l1798m0319n1450o4441p8097
50807C718308r1314j03498j14388j23581j30392j34249j35109j33400j29679j24365
50797B498333j17732j10006j01377r2014q2193p2386o3104n4566m6669l9389l3008
50786A685889k7780k3532j9702j5835j1926q484o251n600o012o392o158n803o149
50773A536265p303q639r538r820r761j0030j1303j3401j5124j5486j4949j4719
50761A396192j5089j5221j4480j3163j1762j0328q797p245n562l442r65J364L441
$$ plain form
50748 1294943 1300746 1309470 1321126 1335117 1351039 1369111 1389813 1413465 1440310 1470750 1505419 1545064
50736 1545064 1590267 1641156 1697665 1760218 1829702 1906326 1988835 2075429 2165153 2257787 2352586
50725 2352586 2447926 2542238 2634579 2724119 2809633 2889686 2962805 3027232 3080924 3121994 3148854
50714 3148854 3160004 3154298 3131808 3094219 3044366 2985782 2922596 2859105 2798855 2744191 2696630
50703 2696630 2657151 2625975 2602566 2586133 2575774 2569858 2565703 2560165 2550372 2533894 2508897 2474540
50691 2474540 2430872 2378073 2316232 2246229 2170371 2091636 2012556 1935170 1861511 1793326 1731400
50680 1731400 1675740 1626425 1583770 1547720 1517721 1493401 1474956 1462664 1456275 1455141 1458706 1466556
50668 1466556 1478065 1492228 1508011 1524852 1542709 1561534 1580771 1599499 1617104 1633629 1649512
$$ packed form
50748A294943N803Q724J1656J3991J5922J8072K0702K3652K6845L0440L4669L9645
50736A545064M5203N0889N6509O2553O9484P6624Q2509Q6594Q9724R2634R4799
50725B352586R5340R4312R2341Q9540Q5514Q0053P3119O4427N3692M1070K6860
50714C148854J1150n706k2490l7589m9853n8584o3186o3491o0250n4664m7561
50703B696630l9479l1176k3409j6433j0359n916m155n538r793j6478k4997l4357
50691B474540m3668n2799o1841p0003p5858p8735p9080p7386p3659o8185o1926
50680A731400n5660m9315m2655l6050k9999k4320j8445j2292o389j134L565P850
50668A466556J1509J4163J5783J6841J7857J8825J9237J8728J7605J6525J5883
$$ plain form
50657 1649512 1665225 1681195 1697663 1714408 1730858 1746776 1762658 1779164 1796301 1813527 1830616
50646 1830616 1848102 1866872 1887600 1910754 1936937 1966981 2001606 2040905 2084197 2130458 2178944
50635 2178944 2229234 2280653 2331946 2381740 2429131 2473592 2514606 2551900 2586005 2618080 2649005
50624 2649005 2678935 2707674 2734843 2759232 2778483 2790217 2793656 2789920 2780918 2768567 2755143 2743471
50612 2743471 2735884 2733039 2734204 2738659 2746315 2756963 2769447 2781795 2791780 2797069 2795243 2784177 2762498
50599 2762498 2729573 2685260 2629907 2564520 2490700 2410465 2326156 2240245 2154883 2071599 1991454
50588 1991454 1915247 1843421 1776085 1713502 1656355 1605174 1559579 1518445 1480834 1446544 1415913
50577 1415913 1389392 1367242 1349323 1335140 1324292 1316814 1312914 1312566 1315558 1321666 1330421 1340986 1352786
$$ packed form
50657A649512J5713J5970J6468J6745J6450J5918J5882J6506J7137J7226J7089
50646A830616J7486J8770K0728K3154K6183L0044L4625L9299M3292M6261M8486
50635B178944N0290N1419N1293M9794M7391M4461M1014L7294L4105L2075L0925
50624B649005K9930K8739K7169K4389J9251J1734L439l736r002j2351j3424j1672
50612B743471p587k845J165M455P656J0648J2484J2348R985N289j826j1066k1679
50599B762498l2925m4313n5353o5387p3820q0235q4309q5911q5362q3284q0145
50588A991454p6207p1826o7336o2583n7147n1181m5595m1134l7611l4290l0631
50577A415913k6521k2150j7919j4183j0848p478l900l48K992O108Q755J0565J1800
$$ plain form
50564 1352786 1366119 1381597 1399057 1417553 1436330 1455245 1474321 1493651 1513949 1536420 1561679
50553 1561679 1589194 1618096 1648046 1678964 1710315 1741147 1770621 1798281 1824076 1848424 1872028
50542 1872028 1895395 1918722 1942460 1967714 1995872 2028158 2065754 2109942 2161610 2220574 2285510
50531 2285510 2354518 2425856 2498733 2573788 2652654 2736733 2826436 2921565 3021957 3127443 3237447
50520 3237447 3350920 3466460 3582239 3695956 3805042 3906749 3997990 4075652 4137475 4182518
50510 4182518 4210617 4221665 4215624 4192791 4153740 4099433 4031864 3954212 3869878 3781642 3692326
50499 3692326 3605899 3527070 3459613 3405509 3365618 3340446 3329994 3333409 3349257 3375900 3411287
50488 3411287 3452374 3494869 3533522 3562715 3577229 3572982 3547453 3499664 3429973 3339868 3231970
$$ packed form
50564A352786J3333J5478J7460J8496J8777J8915J9076J9330K0298K2471K5259
50553A561679K7515K8902K9950L0918L1351L0832K9474K7660K5795K4348K3604
50542A872028K3367K3327K3738K5254K8158L2286L7596M4188N1668N8964O4936
50531B285510O9008P1338P2877P5055P8866Q4079Q9703R5129J00392J05486J10004
50520C237447J13473J15540J15779J13717J09086J01707R1241P7662O1823M5043
50510D182518K8099J1048o041k2833l9051n4307o7569p7652q4334q8236q9316
50499C692326q6427p8829o7457n4104l9891k5172j0452L415J5848K6643L5387
50488C411287M1087M2495L8653K9193J4514m247k5529m7789o9691r0105j07898
$$ plain form
50477 3231970 3110117 2979148 2844063 2709019 2577027 2450393 2330986 2219958 2117677
50468 2117677 2024276 1940042 1864991 1798443 1739536 1687934 1643560 1605776 1573494 1546152 1524011
50457 1524011 1507251 1495285 1487326 1483238 1483343 1487559 1495222 1505807 1519362 1535960 1555006 1575588
50445 1575588 1597542 1621841 1649828 1682378 1719949 1762865 1810731 1861421 1911096 1955450 1990888
50434 1990888 2014960 2026654 2026838 2018064 2003424 1985507 1966260 1947181 1929226 1912885 1898771 1887779
50422 1887779 1880349 1875905 1873536 1873057 1874972 1879658 1887196 1897962 1912838 1932618 1957521 1987402 2022209
50409 2022209 2062134 2107343 2157514 2211631 2268399 2326816 2385999 2444424 2499983 2551279 2598310
50398 2598310 2641257 2678959 2709296 2730770 2742857 2744888 2735668 2714486 2681768 2638364 2584842 2522135
$$ packed form
50477C231970j21853j30969j35085j35044j31992j26634j19407j11028j02281
50468B117677r3401q4234p5051o6548n8907n1602m4374l7784l2282k7342k2141
50457A524011j6760j1966p959m088J05M216P663J0585J3555J6598J9046K0582
50445A575588K1954K4299K7987L2550L7571M2916M7866N0690M9675M4354L5438
50434A990888K4072J1694J84q774j4640j7917j9247j9079j7955j6341j4114j0992
50422A887779p430m444k369m79J915M686P538J0766J4876J9780K4903K9881L4807
50409B022209L9925M5209N0171N4117N6768N8417N9183N8425N5559N1296M7031
50398B598310M2947L7702L0337K1474J2087K031r220k1182l2718m3404n3522o2707
$$ plain form
50386 2522135 2452429 2378863 2304448 2231601 2162381 2098632 2041855 1993256 1953903 1924531 1905163
50375 1905163 1895130 1893547 1899583 1912255 1930097 1951161 1973267 1994116 2011226 2022102 2024878 2019038
50363 2019038 2005393 1985214 1959291 1927709 1890191 1846497 1796781 1741955 1683798 1624442 1565682
50352 1565682 1508809 1454926 1405016 1359516 1318115 1280299 1246153 1216447 1191800 1171897 1155718
50341 1155718 1142520 1132299 1125135 1120433 1117229 1115045 1113936 1113718 1113723 1113477 1113173 1113294 1114258 1116648 1121203
50326 1121203 1128088 1136546 1145686 1155268 1165407 1176021 1187142 1199358 1213197 1228324 1244039 1260326
50314 1260326 1277555 1295239 1312066 1327440 1342155 1357206 1372616 1388018 1403902 1421803 1443555
50303 1443555 1470903 1505510 1548663 1600781 1661481 1729862 1803890 1878854 1946666 1997610 2023999
$$ packed form
50386B522135o9706p3566p4415p2847o9220o3749n6777m8599l9353k9372j9368
50375A905163j0033j583O036J2672J7842K1064K2106K0849J7110J0876K776n840
50363B019038j3645k0179k5923l1582l7518m3694m9716n4826n8157n9356n8760
50352A565682n6873n3883m9910m5500m1401l7816l4146k9706k4647j9903j6179
50341A155718j3198j0221p164m702l204k184j109k18Nk46l04J21R64K390M555
50326A121203O885Q458R140R582J0139J0614J1121J2216J3839J5127J5715J6287
50314A260326J7229J7684J6827J5374J4715J5051J5410J5402J5884J7901K1752
50303A443555K7348L4607M3153N2118O0700O8381P4028P4964O7812N0944K6389
$$ plain form
50292 2023999 2023128 1997430 1952284 1893724 1827498 1758920 1692415 1630900 1575781 1527510 1486014 1450806
50280 1450806 1421235 1396924 1377937 1364590 1357181 1355842 1360475 1370919 1387246 1409649 1437827 1470662
50268 1470662 1506781 1545260 1585485 1626494 1666874 1705268 1740656 1772296 1799882 1823919 1845589
50257 1845589 1865953 1885277 1902979 1917945 1928852 1934339 1933021 1923547 1905129 1878276 1844823 1807032
50245 1807032 1766886 1726370 1687782 1653027 1622621 1595703 1570796 1546204 1520184 1491722 1461338
50234 1461338 1430589 1400709 1372139 1345265 1320907 1299808 1282065 1267212 1254473 1242886 1231680
50223 1231680 1220768 1210633 1201581 1193307 1185114 1176307 1166534 1156155 1146126 1137041 1128416 1119465 1110450
50210 1110450 1102556 1096430 1091594 1087414 1083808 1080654 1077211 1072764 1067509 1062290 1057560 1052790 1046830 1038904
$$ packed form
50292B023999q71k5698m5146n8560o6226o8578o6505o1515n5119m8271m1496l5208
50280A450806k9571k4311j8987j3347p409j339M633J0444J6327K2403K8178L2835
50268A470662L6119L8479M0225M1009M0380L8394L5388L1640K7586K4037K1670
50257A845589K0364J9324J7702J4966J0907N487j318r474j8418k6853l3453l7791
50245A807032m0146m0516l8588l4755l0406k6918k4907k4592k6020k8462l0384
50234A461338l0749k9880k8570k6874k4358k1099j7743j4853j2739j1587j1206
50223A231680j0912j0135r052q274q193q807r773j0379j0029r085q625q951r015
50210A110450p894o126m836m180l606l154l443m447n255n219m730m770n960p926
$$ plain form
50196 1038904 1029568 1020617 1013572 1008289 1003524 998741 994597 991621 989321 986975 984550 982345 980397 978791
50182 978791 977950 977933 977857 976682 974378 971755 969351 967031 964577 962214 960496 959966 960871 962999 965831 969062
50166 969062 972865 977648 983761 991512 1001195 1012969 1026986 1043779 1064244 1089123 1118833 1153852
50154 1153852 1194900 1242610 1297328 1359176 1427707 1501290 1577326 1653361 1727634 1798570 1864589
50143 1864589 1924918 1980112 2031329 2079293 2123916 2164127 2197646 2221613 2234034 2234259 2221848 2195824
50131 2195824 2155788 2103209 2040961 1971938 1898638 1823434 1748345 1674781 1604101 1538049 1477960
50120 1477960 1423894 1375282 1332034 1294216 1261016 1231061 1203726 1179311 1158003 1139568 1124108
50109 1124108 1112246 1104259 1099644 1097746 1098228 1100704 1104392 1108451 1112277 1115277 1116661 1115700 1112122 1106245
$$ packed form
50196A038904r336q951p045n283m765m783m144k976k300k346k425k205j948j606
50182I78791q41j7p6j175k304k623k404k320k454k363j718n30R05K128K832L231
50166I69062L803M783O113P751R683J1774J4017J6793K0465K4879K9710L5019
50154A153852M1048M7710N4718O1848O8531P3583P6036P6035P4273P0936O6019
50143A864589O0329N5194N1217M7964M4623M0211L3519K3967J2421K25j2411k6024
50131B195824m0036n2579o2248o9023p3300p5204p5089p3564p0680o6052o0089
50120A477960n4066m8612m3248l7818l3200k9955k7335k4415k1308j8435j5460
50109A124108j1862p987m615j898M82K476L688M059L826L000J384r61l578n877
$$ plain form
50095 1106245 1098837 1090654 1081968 1072734 1063361 1054835 1047722 1041540 1035617 1030131 1025594 1021763 1017922 1014028
50081 1014028 1010699 1008203 1006266 1004808 1004050 1004003 1004743 1007098 1011975 1018808 1025775 1031932 1038172 1045685 1054441
50066 1054441 1063794 1073611 1083922 1094008 1102745 1109646 1115015 1119354 1123130 1126786 1130352 1133185 1134501
50053 1134501 1134108 1132413 1130113 1128159 1127502 1128302 1129633 1130536 1131162 1132577 1135762 1141300 1149733 1161472 1176397
50038 1176397 1194149 1214918 1239575 1269025 1303717 1343688 1388611 1437750 1490227 1545322 1602181
50027 1602181 1659205 1714141 1764957 1810545 1850811 1886451 1918607 1948137 1974988 1998364 2017284
50016 2017284 2030426 2035376 2028834 2008249 1973278 1925610 1867871 1803052 1734437 1665066 1596917 1530875
50004 1530875 1467642 1408372 1354332 1306284 1264405 1228522 1198159 1172611 1151335 1134215 1121145
$$ packed form
50095A106245p408q183q686r234r373q526p113o182n923n486m537l831l841l894
50081A014028l329k496j937j458p58m7P40K355M877O833O967O157O240P513Q756
50066A054441R353R817J0311J0086Q737O901N369M339L776L656L566K833J316
50053A134501l93j695k300j954o57Q00J331R03O26J415L185N538Q433J1739J4925
50038A176397J7752K0769K4657K9450L4692L9971M4923M9139N2477N5095N6859
50027A602181N7024N4936N0816M5588M0266L5640L2156K9530K6851K3376J8920
50016B017284J3142M950o542k0585l4971m7668n7739o4819o8615o9371o8149o6042
50004A530875o3233n9270n4040m8048m1879l5883l0363k5548k1276j7120j3070
$$ plain form
49993 1121145 1111463 1104126 1098388 1093907 1090082 1085756 1079885 1072220 1062995 1052179 1039459 1024912 1009272
49980 1009272 993430 977957 963173 949361 936627 924735 913375 902603 892870 884561 877611 871632
49968 871632 866296 861486 857112 852935 848645 844065 839240 834476 830361 827576 826421 826536 827296 828465 830314
$$ packed form
49993A121145r682p337n738m481l825m326n871p665r225j0816j2720j4547j5640
49980A009272j5842j5473j4784j3812j2734j1892j1360j0772r733q309o950n979
49968H71632n336m810m374m177m290m580m825m764m115k785j155J15P60J169J849
$$ [...]
##END NTUPLES=NMR SPECTRUM
##END=
