##TITLE=AC1699_ROEFFECT0026_8637862_u2uq81Qffw
##JCAMPDX= 6.0         $$ Bruker NMR JCAMP-DX V2.0
##DATA TYPE= NMR SPECTRUM
##DATA CLASS= NTUPLES
##ORIGIN= BRUKER
##OWNER= Administrator
$$ 1.72 TOPSPIN		Version 2.1
$$ 2014-05-22 22:59:59.507 -0700  Administrator@X
$$ Compression mode = diff/dup
##.OBSERVE FREQUENCY= 400.02188249412
##.OBSERVE NUCLEUS= ^1H
##.ACQUISITION MODE= SIMULTANEOUS (DQD)
##.ACQUISITION SCHEME= undefined
##.AVERAGES= 8
##.DIGITISER RES= 22
##SPECTROMETER/DATA SYSTEM= spect
##.PULSE SEQUENCE= zg30
##.SOLVENT NAME= COFFEE_meoh
##.SHIFT REFERENCE= INTERNAL, COFFEE_meoh, 1, 14.98509
##AUDIT TRAIL= $$ (NUMBER, WHEN, WHO, WHERE, PROCESS, VERSION, WHAT)
$$ ##TITLE= Audit trail, TOPSPIN		Version 2.1
$$ ##JCAMPDX= 5.01
$$ ##ORIGIN= Bruker BioSpin GmbH
$$ ##OWNER= Administrator
$$ $$ E:\/data/COFFEE/nmr/AC1699_ROEFFECT0026_8637862_u2uq81Qffw/10/pdata/1/auditp.txt
$$ ##AUDIT TRAIL=  $$ (NUMBER, WHEN, WHO, WHERE, PROCESS, VERSION, WHAT)
(   1,<2014-05-22 22:59:51.648 -0700>,<Administrator>,<X>,<go>,<TOPSPIN 2.1>,
      <created by zg
	started at 2014-05-22 22:58:45.929 -0700,
	POWCHK enabled, PULCHK disabled,
       configuration hash MD5:
       C8 4E 4E 5D D3 5C D8 9E 9F 52 82 E0 59 8A DE 15
       data hash MD5: 64K
       90 67 F1 FF FF 4C 12 F5 AD 66 E8 34 04 4E E3 FE>)
(   2,<2014-05-22 22:59:54.586 -0700>,<Administrator>,<X>,<proc1d>,<TOPSPIN 2.1>,
      <Start of raw data processing
       efp LB = 0 FT_mod = 6 PKNL = 1 PHC0 = 0 PHC1 = 0 SI = 32K 
       data hash MD5: 32K
       9A 2B A6 EE 36 7D AB 4B F8 52 11 91 14 03 E8 92>)
(   3,<2014-05-22 22:59:54.851 -0700>,<Administrator>,<X>,<proc1d>,<TOPSPIN 2.1>,
      <pk PHC0 = 90.10986 PHC1 = 0 
       data hash MD5: 32K
       96 D0 ED 22 F1 CA 13 2A AF 3B 4D 18 7F 5F 77 99>)
(   4,<2014-05-22 22:59:54.961 -0700>,<Administrator>,<X>,<proc1d>,<TOPSPIN 2.1>,
      <abs ABSG = 1 
       data hash MD5: 32K
       38 2E 1E A9 EB DF E0 F0 88 CB 6F A3 8B 3F 6B 8C>)
(   5,<2014-05-22 22:59:55.023 -0700>,<Administrator>,<X>,<proc1d>,<TOPSPIN 2.1>,
      <abs ABSG = 2 
       data hash MD5: 32K
       00 6A 8A BD B4 84 EA 90 57 B4 59 E7 B8 4D 17 AA>)
(   6,<2014-05-22 22:59:55.086 -0700>,<Administrator>,<X>,<proc1d>,<TOPSPIN 2.1>,
      <abs ABSG = 3 
       data hash MD5: 32K
       91 45 3F 48 03 1C 4F 24 C9 5E B6 B0 4B FD 0C 9F>)
(   7,<2014-05-22 22:59:55.164 -0700>,<Administrator>,<X>,<proc1d>,<TOPSPIN 2.1>,
      <abs ABSG = 4 
       data hash MD5: 32K
       C8 DB FA 53 19 79 55 BC 07 21 50 06 A0 BE 33 2F>)
(   8,<2014-05-22 22:59:55.211 -0700>,<Administrator>,<X>,<proc1d>,<TOPSPIN 2.1>,
      <abs ABSG = 5 
       data hash MD5: 32K
       AF 55 EC 90 17 7A 92 89 DB 76 1F 2A 62 E7 40 8E>)
$$ ##END=
$$ 
$$ $$ hash MD5
$$ $$ 43 84 F3 5B 93 20 57 F3 DC AC 2C D8 A7 2B EA 3A
##$RELAX= 
##$RELAX= 
##$RELAX= 
##$RELAX= 
##$RELAX= 
##$RELAX= 
##$RELAX= 
$$ Bruker specific parameters
$$ --------------------------
##$DU= <E:\>
##$EXPNO= 10
$$ [...]
150 150 150 150 150 150 150 150
##$TP07= 0
##$TPNAME0= <>
##$TPNAME1= <>
##$TPNAME2= <>
##$TPNAME3= <>
##$TPNAME4= <>
##$TPNAME5= <>
##$TPNAME6= <>
##$TPNAME7= <>
##$TPOAL= (0..7)
0.5 0.5 0.5 0.5 0.5 0.5 0.5 0.5
##$TPOFFS= (0..7)
0 0 0 0 0 0 0 0
##$TUNHIN= 0
##$TUNHOUT= 0
##$TUNXOUT= 0
##$USERA1= <user>
##$USERA2= <user>
##$USERA3= <user>
##$USERA4= <user>
##$USERA5= <user>
##$V9= 5
##$VALIST= <valist>
##$VCLIST= <CCCCCCCCCCCCCCC>
##$VD= 0
##$VDLIST= <DDDDDDDDDDDDDDD>
##$VPLIST= <PPPPPPPPPPPPPPP>
##$VTLIST= <TTTTTTTTTTTTTTT>
##$WBST= 2048
##$WBSW= 25
##$XGAIN= (0..3)
0 0 0 0
##$XL= 0
##$YL= 0
##$YMAX_a= 603234
##$YMIN_a= -522833
##$ZGOPTNS= <>
##$ZL1= 120
##$ZL2= 120
##$ZL3= 120
##$ZL4= 120
##$ABSF1= 14.98509
##$ABSF2= -5.573092
##$ABSG= 5
##$ABSL= 3
##$ALPHA= 0
##$AQORDER= 0
##$ASSFAC= 0
##$ASSFACI= 0
##$ASSFACX= 0
##$ASSWID= 0
##$AUNMP= <proc_prof1d_extract_pilot.lims>
##$AXLEFT= 0
##$AXNAME= <>
##$AXNUC= <1H>
##$AXRIGHT= 0
##$AXTYPE= 0
##$AXUNIT= <>
##$AZFE= 0.1
##$AZFW= 0.1
##$BCFW= 0
##$BC_mod= 0
##$BYTORDP= 0
##$COROFFS= 0
##$CY= 15
##$DATMOD= 1
##$DC= 0
##$DFILT= <>
##$DTYPP= 0
##$F1P= 0
##$F2P= 0
##$FCOR= 0.5
##$FTSIZE= 32768
##$FT_mod= 6
##$GAMMA= 0
##$GB= 0
##$INTBC= 1
##$INTSCL= 1
##$ISEN= 128
##$LB= 0
##$LEV0= 0
##$LPBIN= 0
##$MAXI= 10000
##$MC2= 0
##$MEAN= 0
##$ME_mod= 0
##$MI= 0
##$NCOEF= 0
##$NC_proc= -8
##$NLEV= 6
##$NOISF1= 0
##$NOISF2= 0
##$NSP= 0
##$NTH_PI= 0
##$NZP= 0
##$OFFSET= 14.98509
##$PC= 1
##$PHC0= 90.10986
##$PHC1= 0
##$PH_mod= 1
##$PKNL= yes
##$PPARMOD= 0
##$PPDIAG= 0
##$PPIPTYP= 0
##$PPMPNUM= 2147483647
##$PPRESOL= 1
##$PSCAL= 4
##$PSIGN= 0
##$PYNMP= <proc.py>
##$REVERSE= no
##$SF= 400.02
##$SI= 32768
##$SIGF1= 0
##$SIGF2= 0
##$SINO= 400
##$SIOLD= 32768
##$SPECTYP= <>
##$SREGLST= <1H.CDCl3>
##$SSB= 0
##$STSI= 32768
##$STSR= 0
##$SW_p= 8223.68421052631
##$SYMM= 0
##$S_DEV= 0
##$TDeff= 65536
##$TDoff= 0
##$TI= <>
##$TILT= no
##$TM1= 0
##$TM2= 0
##$TOPLEV= 0
##$USERP1= <user>
##$USERP2= <user>
##$USERP3= <user>
##$USERP4= <user>
##$USERP5= <user>
##$WDW= 1
##$XDIM= 32768
##$YMAX_p= 467002304
##$YMIN_p= -754993
##$CURPLOT= <Network HP LaserJet P1505>
##$CURPRIN= <$Network HP LaserJet P1505>
##$DFORMAT= <normdp>
##$LAYOUT= <+/1D_H.xwp>
##$LFORMAT= <normlp>
##$PFORMAT= <normpl>
##$SURQMSG= 1
$$ End of Bruker specific parameters
$$ ---------------------------------
##NTUPLES= NMR SPECTRUM
##VAR_NAME=  FREQUENCY,     SPECTRUM/REAL,   SPECTRUM/IMAG
##SYMBOL=    X,             R,               I
##VAR_TYPE=  INDEPENDENT,   DEPENDENT,       DEPENDENT
##VAR_FORM=  AFFN,          ASDF,            ASDF
##VAR_DIM=   32768,         32768,           32768
##UNITS=     HZ,            ARBITRARY UNITS, ARBITRARY UNITS
##FACTOR=    0.250966925370066, 1,           1
##FIRST=     8223.43324360094, 167644,       -53471
##LAST=      0,             -118389,         -217290
##MIN=       0,             -754993,         0
##MAX=       8223.43324360094, 467002304,    0
$$ Real data points
##PAGE= N=1
##DATA TABLE= (X++(R..R)), XYDATA
$$ [...]
23841 -420510 40324 24179 31860 -57020 -190309 3722 219431 -110232 67922 328606 -72650
23829 -347598 -333910 -196219 -15991 67202 172666 -213008 -32234 -229451 170095 -166774
23818 -94667 -238028 -42942 85362 102033 -250598 19731 279402 171972 -228149 179358
23807 28348 17399 56362 -21116 18298 15616 -76122 -4352 -34298 174987 -142263 112814
23795 231814 -122133 -56859 -32886 -15712 186028 -214376 -79866 108219 -159333 211280
23784 -81645 -223206 343614 128900 190777 -27331 135025 -175115 -125386 189873 -257056
23773 304066 -157274 16620 -4636 81343 -8065 12128 194136 7180 -6742 -110582 -229332
23762 -229332 46121 16981 -134028 -318122 -285694 -245274 -165206 70652 -105364 -111967 -833
23750 92449 -298369 -148214 -246585 197781 -181730 124928 -27059 -250553 -467502 -147899
23739 42581 -149231 122129 4876 -134575 -293268 -186438 164519 -33278 -105704 -39369 84627
23727 -330078 -264941 88050 58533 148289 52055 -131199 124455 50615 -48413 -108783 -142976
23716 -142976 -126932 94272 -325190 -381429 -148283 194217 -115407 -115052 -27952 -823 -115933
23705 -115933 118667 -116120 205 -56102 -30058 70348 2375 116568 -12895 -71307 -165207
23694 -165207 38147 -355927 4773 104173 -159890 -256613 185766 -37440 33172 -102407 105792
23682 -60288 -85247 157961 160211 263779 20199 333850 189149 -170557 324586 -7380 -200972
23671 -200972 -36081 61655 -292933 -89365 -49495 -1808 291687 -300228 -179788 -210535 171437
23659 61298 172454 -252369 -101284 111222 227694 -90840 153576 233430 46348 -272539
23648 -160940 44872 86463 8593 -167553 13993 99548 200492 178734 288705 -441568 309391
23636 78239 -238166 227770 114529 -23548 152120 101258 280464 115001 -297902 149142
23625 112368 -303900 108885 -19898 -87421 -12274 -68033 -32263 428707 -47396 -23949 299917
23613 238120 -297547 -245641 -174505 -114846 -152192 -90725 -63437 129026 57775 -51421 224446
23601 94980 -26518 -6493 -122426 18597 -108272 222792 -238669 36853 19222 155627 1756
23589 -124697 76120 -60471 -87843 -41524 254795 162969 -257291 -122499 968 -71630 -200160
23578 -200160 140813 -34791 -169753 -133274 234233 -187771 -176933 8640 180542 277176 -410612
23566 -245324 111409 -146022 -547914 188191 61682 87679 -43214 -107592 105426 261875
23556 261875 188364 132000 67184 18250 -123310 169507 150739 -55453 35648 36452 -293152
23544 104712 -356877 258597 -457762 -162508 -185179 79835 -181976 -173015 -152313 -198935 35362
23532 -323652 240246 -206233 119975 69291 -148508 183801 61254 -120573 -394027 -84489
23521 297115 10587 112766 142697 -82413 -409532 62136 -101013 -101665 -121990 -329756 6802
23509 67567 -184265 115198 -248715 -296299 345618 -202382 170030 -268680 -266768 -185256
23499 -185256 -124245 42954 -286624 -33828 -163456 87517 113526 -274331 -67177 -225847 283559
23487 124112 771 65375 60587 -41523 -19140 -190112 29723 8022 271915 125431 1804 190885
23475 190885 -25924 -164698 -96390 41613 51620 -417172 -124084 -138650 -180266 342969 -3510
23463 -92637 -214986 212627 -149682 118540 -289230 153244 -212861 14293 -102226 -136163
23453 -136163 34679 -106803 97651 533019 -77682 -228482 -56374 -170441 104881 193884
23443 193884 235905 296119 -4594 43832 -417207 160461 150643 -72946 -30873 -143275 225648
23431 -128125 53335 -226952 301117 -170662 193473 135549 -180018 215977 215652 -262412
23420 -66035 -68557 84135 -159370 232037 -85775 -158028 387947 -182914 -401582 170527 -51346
23408 160372 53573 -21760 286742 130622 -29735 -68839 -136946 172173 -28314 142148 290813
23397 290813 91121 -136572 191326 -372361 -121951 -71481 376983 -123491 92695 89366
23387 89366 83572 -75208 -260834 -149717 31766 275617 -179146 -189743 -156955 195571 -89980
23375 142889 -116846 53849 42072 215419 -92371 -106148 62022 93491 -12082 -71550 -170821
23364 -170821 33336 131823 128525 -81360 21882 51496 89734 -143212 -84696 320450 170791
23353 170791 139549 -25752 -32251 -247164 192022 -215814 -189814 151362 13489 -220691 -210645
23342 -210645 286494 -52689 61778 -21600 -18697 270016 297735 29062 -188054 -191817 19952
23330 -161576 171444 -38979 -101217 94094 -233784 -61250 325266 -63722 27964 -370357 -454330
23319 -454330 -1669 -120186 -184423 286940 69569 -236061 -149942 -90363 52006 241558 244053
23308 244053 -221870 225258 -74259 12564 117869 193484 -247940 -257757 -153255 -279322
23298 -279322 -206734 54562 -59942 -177195 -313223 2903 151034 -325732 92033 -166925 -170257
23287 -170257 36517 -314295 -116272 -217627 -308932 -80018 73570 -116294 376203 126497
23276 -212030 -37293 -10350 82880 -261049 -94587 -2145 -76402 -134510 -226745 115444 382097
23265 382097 -281699 53498 58546 -14951 279783 90417 -111967 247729 -240701 37149 -36936
23253 -138208 -130282 -145253 -206068 -201451 75303 64897 25172 -102801 10183 204554 -171297
23241 -101110 49985 -201933 -77993 338361 45278 -16565 -132080 -121878 128649 226425 99699
23229 82632 242037 -128447 -17308 -13298 -265008 202407 3827 -140876 98137 153343 -88168
23217 -191093 43031 -58289 228970 -118461 10104 72817 227366 52898 -95032 152215 -115430
23205 -292405 82543 -205800 -12695 -11914 254658 253861 39501 70085 -5412 329060 97445 -145943
23192 -74710 -267954 -85801 -452813 -7740 114971 135196 -186840 -63450 431086 164174 109872
23181 109872 -101555 -72821 106457 -52493 -314591 -323714 -98011 -87415 305611 105169 -5147
23169 49833 -72284 -55720 -99126 -306999 43160 -83438 -339888 -74594 -67148 -339142 76021
23157 -122569 119839 -190911 -459903 18573 -406774 -70857 -141331 -348101 139910 -156674
23146 109947 -82679 130548 -148208 125589 -78743 -36654 -133011 -174169 576 -55061 128675
23134 -236795 294744 -177618 -24712 -244061 72460 -121505 -47091 49458 224268 -62285
23123 -289338 2794 63764 167871 162637 -166286 257581 -262864 42561 -199503 -150631 95566
23111 132712 135756 138369 -88 -65402 -72332 -61056 47759 -251576 155595 -37583 -362690 50832
23098 142139 114370 -167468 84715 289077 -133041 1406 -9765 91933 161908 -334284 32300
23086 3375 129933 431699 -27294 79783 -230443 220645 73155 -264428 -193973 81947 -42343
23074 108569 303459 467762 -176462 126742 -268965 -68758 -71957 -225444 66557 187630
23064 187630 -119665 -319057 -131790 -366753 249477 142018 240760 153898 111913 -169405
23053 56603 67736 133201 17584 110604 -187062 -38681 -31664 16314 -103584 -27558 -166969
23042 -166969 338 -182426 -52381 -175151 -202411 221339 -216498 -152472 -209563 206200 206731
23031 206731 313936 129620 179890 -283796 -204204 298756 -381810 -62446 -52225 64339
23020 62148 -81988 5167 87638 -265898 -164903 -207633 -192216 -204869 97081 -178694 12515
23008 -211470 -202543 133721 26915 6074 -150424 -68342 100109 179414 3554 -313598 -69326
22996 -143123 -343230 150671 111627 180471 -365170 334007 -166637 61764 -365976 -180831
22985 130072 57227 -59658 3707 88571 96674 -17645 -240536 15058 162635 78825 -83435
22973 18340 -421228 -43575 -11643 275724 128372 -58489 -246632 -46342 117986 25992 141907
22962 141907 166135 -93480 125088 -319556 -44202 300118 94611 -411517 -31947 242741
22951 54559 -59121 44825 -175812 8001 -377191 -131318 96795 -368989 62121 -94623 -1728
22939 17091 -233029 -62901 -156666 156017 -147381 -254442 -265777 -314471 -184138 -8670 95954
22927 -172843 292216 96792 44854 -281380 -23635 228879 -97084 177918 67599 32688 -96206
22915 -267738 93470 -7138 186294 89512 -41947 -275428 203533 17658 -33897 -258579 -29080
22903 -274494 -146877 -221148 -299782 -217751 -211021 -204374 -308869 -15866 599 -153029 -367536
22892 -367536 344412 302829 247893 -52318 -371838 60517 31586 -57013 164572 42706 46605
22881 46605 162224 127072 -158095 -166545 -517652 -111474 -60966 372814 -29743 20904 194632
22870 194632 -72465 195441 -58919 180499 139992 351255 -62317 -405082 3986 200670 7072
22858 229194 210946 100209 -40786 114312 5301 -368304 -125118 242556 -223174 204746
22847 -132389 -15971 88816 -222101 -401130 -115981 159646 -49939 -149134 -334334 7348 -87413
22835 -138618 143586 -230838 -185980 -88505 -259597 33928 -352891 -29552 141287 -131036
22824 22611 283161 -131698 -193810 -447625 -176092 -76419 -27461 -152131 74701 -113213
22813 -92965 102908 -171433 -11740 -210956 5890 -313318 215114 -69304 91535 230591 123148
22802 123148 -225410 4938 195375 -13959 31750 -22931 153941 -62177 161385 -17248 -208048
22791 -208048 -140183 241146 20846 -291432 263151 309810 139247 -36841 -199865 142553
22780 -14620 28042 -679 -1832 -12454 -47150 94483 -141005 214087 -148429 157414 -107331
22768 275465 -287946 84424 -399437 -94431 188038 153504 249309 -77789 237966 153096 -269335
22756 -87272 -7171 -443098 -241223 -13856 117671 221841 -60343 -79678 -120040 -99001 -195329
22745 -195329 188571 33708 157810 271155 -112922 -107605 181434 54037 -207670 127743
22734 53124 442449 155745 -92677 -201956 37681 -100702 -193808 -49887 -181991 372 79355
22723 79355 196862 -16202 137715 -69701 -414067 -123329 101524 34833 -167627 7714 180312
22712 180312 76552 -173341 123350 -225081 -53507 -203368 -72420 -160457 -82533 -552866
22702 -552866 -468161 105303 -25259 -331990 -237205 113695 144669 -381600 -106021 -16916
22691 93312 -101103 -17860 117268 37200 -173357 -193914 137027 -41466 -240457 228711
22680 238014 -83296 67021 -4284 -177848 -1614 366800 -126717 -145592 -110372 50461 17046
22668 65530 -385782 20223 -71521 49657 -256102 288780 -336873 -176831 -226921 76024 2894
22656 -86409 20755 -152349 -125992 -112807 -18281 96950 -119935 -105804 -108095 -325421 -117371
22644 94039 -66590 -287566 -320218 -347969 -230817 -185145 65815 17728 338638 -23355 -53769
22633 -53769 433447 145506 116350 210243 -122437 -38481 -11354 -155799 41749 -27445 -205490
22622 -205490 -61108 41601 -153113 71255 -147047 83579 -102253 313288 -46324 62625 281620
22611 281620 75955 -69100 106755 391552 -59612 110536 -77342 88685 10312 -64542 90906
22599 -115974 9138 -111259 -189116 -154014 -35387 31713 -89038 107241 -204093 -165808 -226497
22588 -226497 -117254 -60574 -120198 -139664 -160111 -199443 88592 25242 88703 156560 -50401
22576 -177343 -64490 -52960 283957 -156246 70091 94506 3411 -44827 45499 -314599 -90585
22564 -58910 -294741 -283985 -407240 -91321 -150280 -58033 -259805 34909 110299 -243535 -77883
22552 -51240 -25738 80671 -195063 130230 -56743 87581 10307 -296465 111908 -280696 -58962
22540 -14283 -393166 441580 357855 348995 -112795 -67410 -14130 -93823 412649 60908 45982
22529 45982 133370 -148943 335882 66867 268371 134542 -337260 -275753 75024 -19688 -136535
22518 -136535 25408 -127161 20939 -62378 198687 -177923 100193 -30477 -213313 -70443
22507 -273287 -51263 -174988 248351 -303653 -160438 91032 135140 -233202 30111 96794
22497 96794 207678 -95113 158870 -286855 -172078 -29046 -209320 144560 3107 -171222
22486 -127666 232430 98945 -164518 -239505 -214978 -276082 -143063 -78766 -276471 114023
22475 -178730 -102648 35006 -88624 -38631 -65578 -152672 -63897 -121825 -58831 15500 -159964
22463 39342 221043 -108125 -15705 178573 68035 -44878 -246528 337547 -239323 168074
22452 11023 -110015 -114325 -92711 -256576 -298147 347928 147248 141463 178749 33245 15843
22440 -107169 -84175 -218651 -228694 34631 145285 -279423 -126304 -112802 171500 468429
22430 468429 -182828 241600 -85060 -243873 17075 -216996 58499 -353382 16697 129453
22420 129453 -427450 304866 160024 -400779 114215 113116 -202837 -67544 -152036 -386935
22410 -386935 385 -91860 -139105 -116541 150265 158090 -6355 -264387 -76307 146565 -1919 -52042
22398 -52042 -342017 -151286 -46199 110082 165434 -306254 -155697 -200387 165622 19050
22387 2325 -16865 -77955 -88153 231402 -370768 189756 -88152 170647 202724 -61605 -146905
22376 -146905 -44036 -59760 -315176 -29737 44572 -281894 -237165 -158141 338970 -377316 133751
22364 35585 36551 -120412 118384 -39178 37828 75841 3908 259450 -107857 144729 35043
22352 153333 39066 15912 -254987 -206177 -197150 169898 -183664 234805 259895 148361 -267394
22340 -62409 -136938 159833 -110280 -116802 -171505 -34108 -270918 -152014 -250458 133219 -27678
22328 -17295 -242090 -19678 -149020 -52749 -42283 -116310 103428 -464149 -5181 -45789 -58 -91028
22316 -91028 138444 52032 91585 -103468 -115129 204933 -104592 -96141 123350 -230474 -143755
22305 -143755 -210555 -393366 6046 -195658 18629 -29386 84869 -49425 100326 -34014 146400
22293 -17433 -277346 -52885 -54866 41506 240910 282938 61915 -3367 -327664 -224384 210692
22281 -193494 -81093 13790 -142284 -235480 108339 -116312 117844 -60905 -98023 -98480 -309060
22270 -309060 -223943 59724 -53900 186280 132045 503833 213149 175606 -215883 -69609 -268855
22259 -268855 196449 67115 190624 -172918 258017 -133251 -91560 135834 300284 -21127
22248 -249193 -155175 -113285 -109199 186396 74704 -180519 108458 -75659 93548 76865 435737
22237 435737 349271 89566 -63893 -53570 80664 -155780 -110544 85296 56825 -243293 -265672
22226 -265672 -111241 16129 -22419 57215 146478 339146 -141529 -187246 -105647 -117730 7795
22214 -336110 -180073 -257576 -199752 170663 16660 -73025 29058 -147608 -203487 -225477 91385
22202 -323420 50012 -139026 -2075 124616 -125912 -35660 9338 -288054 124016 153460 -25794
22190 -5605 -125183 -116 -5778 12071 -65236 -131460 -446709 203026 -205769 -348212 -225218
22179 -225218 16928 -149246 -217695 203580 152006 -64399 381942 12821 -246690 -4769 -178520
22168 -178520 214461 -159368 285018 -65230 -322934 -89019 11950 -154596 -59186 13378
22157 91447 -78506 -31813 249348 186349 -15998 40789 480538 -19447 -213616 -60701 -37865
22146 -37865 92459 -298830 304048 -13791 -44468 121667 260875 -54464 -119879 302431 164055
22135 164055 -28208 163790 -102096 -172073 131743 45840 -144764 -115382 231569 -182595
22124 -52125 -11003 -134819 66610 -238296 -321575 -128462 -19131 -65632 -185360 -6443 215874
22112 274143 -116855 -111988 26428 -287260 21108 -233701 97497 -244610 -5612 -368648 19592
22100 -303181 -73510 -43209 30585 -197186 -104503 433621 -63848 -201053 267448 -65550 -31422
22088 -128032 12774 -87050 119074 -130059 133196 -207468 20671 -67484 -250724 -141458
22078 -141458 -102815 -241352 131171 21962 -348524 -120948 -190039 -142875 -275885 -163426
22068 -163426 262051 -35062 73514 14561 118922 109547 108945 -297446 -215379 -74950 -61004
22057 -61004 -72087 -310434 -260428 11530 -122079 95449 390904 5438 -172218 -8304 209418
22045 -142528 -92129 -26298 208213 199548 107527 -109108 112848 -81641 -105251 35784 -136339
22033 -313037 -49417 -135292 -1915 -135649 -127754 -116526 10126 -180629 119573 -218519 -30454
22021 2179 -385771 39044 339970 93498 213066 -337988 -15012 139764 -118568 -305807
22011 -305807 -268307 -19463 286736 -60358 -8055 174396 217201 -79720 -7500 -115800 -36628
21999 -30041 33185 -135351 402124 110909 40542 198553 51526 -172253 -363890 -140135
21988 -155827 -340843 -204444 254125 236462 172418 -365952 295535 -111850 -54827 -46483
21978 -46483 199144 -199619 -159539 -90597 40873 -279130 -285994 -402330 168642 -155870 31999
21966 148677 -331407 -29683 -288439 353120 -216236 189638 141422 -331844 -52654 -32232
21956 -32232 36611 69180 -63448 -67559 -116909 -26106 262199 -21559 158522 337643 -56380
21944 -168424 79137 221720 -129344 33905 -146021 -183496 -65192 -327180 -312849 263940
21933 -225339 -47036 368900 -78169 -110178 37887 -136801 -143114 18894 -39460 -220272 -107109
21921 -110273 -132232 -69972 232813 -230742 -139194 -170181 -62380 182411 57026 -15433 -16413
21910 -16413 128379 -115154 -279938 41418 75693 -27690 -331159 -116964 -318664 -73325
21899 128365 -128159 -259678 -206035 262608 195457 -16301 20518 -343931 231358 -1324 -106981
21888 -106981 -90024 -55261 3636 159057 34387 79126 -139645 -291835 25311 9023 68587
21877 68587 -184251 -41755 -218828 -330756 -40128 7915 253159 15817 -122818 193815 -752
21865 -471520 235712 -48641 -16729 93195 -85093 -22156 39282 -128161 -135817 45457 -311609
21853 -124700 -174648 371789 -129952 -277232 -354700 96076 -262479 -34293 -242633 264918
21842 70205 44352 89202 -270154 111382 26637 -141442 -173548 -30571 161965 -147142 67165
21830 -5047 -37130 -148707 -62406 -260480 -171443 -235760 -126285 70751 -54596 -140135 -177763
21819 -177763 -335873 176679 49623 157736 -201431 4152 -68371 15478 191234 -21181 89329
21807 345969 -23066 -82467 36095 -35201 92901 153564 121236 -102774 -180430 69089 -9087
21795 -111421 44034 -259829 -213968 350575 -118660 23667 -212249 -181157 -178661 129305 -84711
21783 -46022 42416 141198 39242 31049 229316 57473 82970 179309 -213212 -222443 -28880 304550
21770 -43672 89471 171173 -107766 -282657 -109345 -130740 -13135 -97981 -142499 20115 -29987
21758 -250254 -177450 -186094 25874 -90136 -94899 69849 137312 85882 66400 49322 -32185 1650
21745 -133491 -66330 236910 74211 407318 18979 -91558 -321022 169351 -30454 155538
21734 -113403 -143310 -154270 -60957 127857 197777 12207 -113797 127300 -187705 -182101 -46274
21722 -140340 -201976 -197610 -103676 -121132 -211900 -912 -204609 9188 99395 -51651 51652 -55620
21709 -108498 -12705 54483 71520 -297937 217824 247974 -19545 -30447 34070 -19354 -137246
21698 -137246 -290972 -228725 363548 140760 14987 -44370 50594 -121546 12088 -128400
21687 -65090 -509206 115671 -49884 78520 2338 8663 -111620 -144427 95877 75998 -175610
21675 -19910 -25539 189820 -93728 -24912 -97903 -112902 -324906 -80669 -97176 -155136 212485
21663 -330545 -243838 362951 -88545 27403 -142812 -10706 -185393 6995 105477 -249858 22681
21651 -64832 -251505 -248260 92696 -208932 156024 71827 299490 156003 134474 36560 -19535
21639 -267658 -113018 228516 -162154 -312756 -295137 153225 85091 182252 -121630 -338972
21629 -338972 -128834 -130549 -22428 102503 96843 -325268 57230 32266 -84774 88887 171746
21618 171746 -266938 -122191 -205801 190447 9332 -3956 104135 -120493 313695 -122667
21607 -33178 -134210 300477 -251160 122192 -477505 -171475 164812 -39036 219021 82181
21596 -245598 -91426 307300 -158930 38381 -95548 -36984 -161830 -2382 -53140 49066 -196038
21584 -119163 81848 -33315 -136742 -153061 -36049 114188 -188407 142088 -116919 24221
21573 -106174 57799 -82063 219485 23062 -10185 -122665 16668 115696 64493 -57531 -237205
21562 -237205 101084 -163911 -81037 -211798 250129 40836 -337045 -2466 -151079 108542
21551 -215985 394857 -133598 -34170 -31842 -106767 -143393 -153936 -4097 -147478 -29273 -58891
21540 -58891 -23829 131791 -189369 -163684 -75653 -236239 57497 51864 169350 -11110 -357081
21529 -357081 -68789 -29887 -87089 -176206 -22825 130535 76825 12268 97543 -356710 -94495
21517 147623 -354574 -158 -35153 -126605 38843 6119 25980 -128668 -443850 -89140 -182417
21506 -182417 226561 -99129 67541 198321 -16582 195999 -302967 -171403 -141331 -21128
21495 -94353 -78683 -139781 100449 -48869 -297184 9410 117869 -24718 619 -179173 174199
21483 181037 -112454 95693 -286846 -33306 118266 -56283 -1580 -368340 -9096 3042 -6968
21471 -92776 -33565 -225131 33003 -365530 200747 14531 -45991 -158404 85336 -327478 -123479
21459 -501457 80333 -170830 149408 249280 159991 -64129 -36436 -303925 -95328 -307215 -5592
21447 -346224 -95259 -85956 91409 69093 257991 219564 -75884 -94923 89426 -70296 287069
21435 104665 152316 430092 24567 319814 -15062 -136190 -356912 -15816 -222987 54650
21424 -17093 14171 8091 -379324 17769 30437 -62400 -228168 -265184 -159855 -213051 -70182
21412 -178442 -89448 -25162 92715 -17507 31567 -83956 -186438 -74553 245667 108 -34612
21400 -8186 -26642 -290322 -62645 40905 -161452 165767 -180480 -104904 -87378 -146373 -205158
21389 -205158 -76550 -188556 282332 -59796 -104102 -7606 -227404 -35765 -158035 34248 -95371
21377 -66626 1740 -64814 -260398 79085 147603 114998 -249539 -77466 233733 -65554 27910
21365 -71080 -138973 -48205 -6878 71305 -7507 -189279 50235 -145426 -19305 -327568 -124446
21353 205967 178940 -47214 -261267 129217 95230 48293 -351397 -12294 -14005 -13268 -430914
21342 -430914 3924 -47913 -123829 -112648 -161881 -442672 -294552 179761 134681 -244706 -40107
21330 -130976 199865 -58267 13704 261926 -15853 -80535 -25640 -8087 -60541 -89913 -125686
21319 -125686 141990 12818 1969 -82306 -111305 -24368 -253333 216292 -65519 3413 -31186
21307 65070 -16482 -249233 -146825 -185015 111487 -156394 38019 -41127 -16691 138393 -54734
21295 113928 -10668 112120 194522 257805 -223336 4300 172951 -211204 -192101 -131617 -69791
21284 -69791 -279235 -382305 154176 47255 -349368 -116409 -12695 -193809 39947 -29725
21273 129667 -223884 -120096 19004 -245905 -58641 45382 -26340 69341 18180 37147 31104
21262 31104 -58778 28777 144306 -291467 64115 168625 -61061 66556 -165326 170619 -20836
21250 -398266 -232519 12410 -121190 314456 -57522 117878 -140360 195618 -498392 -108934
21239 211353 -98775 -184912 -115629 15883 33203 -28016 100712 -22730 -125006 -373893 -79046
21227 -177994 38682 326733 -198551 87915 -243969 -35931 -83808 188268 -116383 -263699
21217 -263699 136418 131826 139608 191149 -262515 -104827 89060 -77947 -45878 -2502 165202
21205 -364357 230703 -52182 -292238 -53020 -16601 16141 -152419 -316802 -334461 26551 2598
21193 -52493 -174031 -23438 1445 -207694 -71330 -193509 -29818 -39891 -14787 -76718 -64719
21182 -64719 325736 113639 -66466 -127067 91010 1249 -106612 -24938 -314954 152071 -227209
21170 165441 120704 -1176 42418 63862 -64236 -42552 -283859 102169 -414117 -103514 148403
21158 -51481 108407 -135491 -72636 -82796 -136908 -109160 -216520 -205253 130228 -177972 -177332
21147 -177332 -200129 205522 361249 188172 -38275 -121494 94831 7636 30482 -202471 95670
21135 132042 -199064 145383 244864 30555 102403 -77117 285544 -252449 -239517 -32251 -182309
21124 -182309 -55424 -167620 41963 4155 32755 -66591 -21563 -302900 -69318 -145910 18715
21112 -50689 -2433 265439 -175000 -38254 87492 -283003 -87808 -1844 -184992 -120522 -154126
21101 -154126 477409 73669 272765 124189 28257 62270 -240388 -260381 -434219 -126971
21090 -1486 75916 -305543 203367 -371907 104460 114547 331191 248443 25027 -240439 79709
21078 46587 134099 -155513 -266528 210083 -288287 -221026 -359611 -28310 5250 66070 -351537
21066 63869 135221 -350959 123365 -24235 -38112 -243416 102674 -106838 84200 -89948 -67300
21055 -67300 -187440 -189810 200251 218869 -142120 83188 26500 -234310 -94837 9112 33340
21044 33340 18042 329725 -16457 -42227 -317704 203515 15214 -120570 -108439 -245700 74695
21032 63723 273453 -122727 7085 -21910 120013 169385 -188531 -584258 -206579 113373
21021 -354033 -283008 -71465 40409 -213757 -196652 93973 -41969 -1551 256411 172641 -92130
21009 206778 235861 -70337 -259594 -142155 60251 -42695 -97750 -100573 -165260 164489 -202589
20997 118356 250814 36454 158306 -149267 -66295 6990 -139639 21675 -75679 -77264 181951
20985 144910 -298254 -181278 39976 -69018 -355507 -57585 -160760 -79197 -158808 137201
20974 -186386 -144353 -1013 223852 -66384 -9582 -326456 -2027 21842 -30358 -277720 -191193
20963 -191193 -70672 -345488 -145780 -39182 6350 252661 -348567 -38546 -56614 -233088 122811
20951 99967 -155827 -82047 -138089 255395 6336 -374985 325085 59336 -9165 -121672 -84217
20940 -84217 280123 43660 69398 -105402 111360 -104852 -16080 41109 -74516 -169355 -179229
20929 -179229 -38824 153703 -233554 -195988 5927 17849 -152443 -78459 84110 -297082 69202
20917 -40643 270904 124885 -165377 -431795 -138979 -51403 -114442 -111623 -149743 -54756 -98930
20906 -98930 -281122 30070 65970 -313414 -313655 62900 -212412 -137840 -170227 16755 36561
20895 36561 -151929 -2917 189230 -325288 -155779 -412597 -101869 -104117 35769 42084 107171
20884 107171 -43706 291810 -128801 6720 158323 -60852 -24694 182931 -89659 -37521 52679
20872 -11467 328876 -41000 26853 -338461 -212530 -168140 50439 -219741 175952 -342746
20861 145831 125712 316668 332989 4105 171096 99674 -22039 -187320 -75920 -40262 75611
20849 -361816 -18379 -236366 -102471 211941 -94420 -237388 -48723 -71273 246192 -101994
20838 90403 -93763 -99123 204150 -191856 -73951 109081 -166300 -253930 120262 34686 -185019
20826 93464 287515 -182494 60022 -71892 -105189 -153335 317108 276542 -141960 -223671 50512
20814 2372 370935 -386608 -88000 61576 -245157 -12999 -76928 29723 13624 76074 -47101
20802 -204159 -54292 -67151 -10840 106451 -522934 -79164 -144300 -315569 -273618 352480 -49611
20790 58389 71384 85932 -72719 -22207 -18234 31512 21888 -111434 204519 -51760 -33721 -57880
20778 -57880 37197 34493 60219 190565 -151797 -156694 22784 209179 -31326 -109950 237727
20766 -183686 -194408 -206636 -246109 -68766 -338408 209428 -315446 50379 -346165 116992
20755 -114593 -13324 69843 -188268 -179863 -230630 -447809 -316067 -19263 -114545 171310 415577
20744 415577 -177846 -460352 -196624 -87521 -186762 5411 47005 63220 17395 185147 -234398
20732 -381110 117918 -89049 -122314 136332 42877 -238122 -183759 -99652 -79193 38483 -28237
20720 135881 -536214 53552 -196114 194140 -57198 -111326 27312 -187382 -201785 -160586 -93739
20709 -93739 -41298 -195646 315015 -265493 29632 -132675 51058 -271976 37944 61174 193487
20698 193487 102170 145905 -7464 57325 -40048 -331908 72986 136736 137987 -80801 -371087
20687 -371087 117441 45435 62542 -206687 -104716 -100421 -93553 -146748 -378067 -108963 137081
20675 -292185 -252873 -117731 -206648 -56108 116161 -130587 154619 66219 -27543 93487 -220608
20663 -5746 113313 -264343 139568 376600 -170945 103653 -98692 -2353 118935 261646
20653 261646 -209850 -10664 -453895 74289 116228 -434601 -402417 -365561 105880 168869 -58521
20641 210209 -209278 -175177 36209 -221744 91778 -232256 -280348 -84089 12457 328566 -283029
20629 -167127 -270213 79863 -261443 70925 236446 -202305 29052 7102 158971 -60935 -288684
20618 -288684 22766 240195 -271657 -125986 -45766 711 -65390 -101906 -46619 20885 -12194
20606 -46309 135336 -24675 -36188 295373 74040 -12139 -506285 -216362 -75072 19086 -66918
20594 -45750 -428977 -233214 273443 -3980 -179306 310180 -167816 -28841 -37074 221630 39025
20582 -311870 -28493 115240 -3466 28203 -91180 -110755 81663 -212377 -202873 -111268 290642
20570 -13999 -230772 86605 28166 141111 108609 -11272 246579 253863 -147319 -397206 3280
20558 232563 188278 -221478 -42377 -62499 -1019 -67050 -167417 -207608 -357132 -122651 223170
20546 280910 219054 -167490 211308 -26286 -235706 6942 -146254 -281545 116123 98267
20536 98267 64343 -478766 -34551 -99116 39354 38137 -210455 -133690 -40417 -8476 149721
20524 -154951 9564 57059 283763 -62440 82090 157764 50545 -86022 -37026 27084 33567 -221697
20511 -145776 -97796 -162589 -43280 -249098 -36841 -145354 -160554 -2590 -32175 -7228 -167102
20500 -167102 35954 -293174 279881 -237951 -241820 157450 59089 -17010 -69589 48522 -229505
20488 29870 -210050 -52394 13737 319621 -204510 127766 71438 -219919 -56528 -239807
20478 -239807 43721 -35207 -138634 -80593 37837 -206770 26416 -63314 32996 -45018 -192419
20467 -192419 -444463 114890 -68029 -50847 -213957 -29964 163432 -58486 -244649 -32080
20456 113790 2992 -48205 -231607 -102621 -28695 -87601 -125307 138480 183363 81470 -331169
20444 -129326 -225164 -276513 -81445 131768 225382 -176308 -91606 -200577 50336 -20652 -9064
20432 265784 -73778 -336070 27262 146931 -128666 -118277 -541664 145519 -125425 73780
20421 264748 -60846 95905 -141637 -110175 -236963 -208864 79526 80151 57514 211532 -149150
20409 -151330 -95505 -61244 -445636 231859 -20938 -162946 379376 176539 317028 138143
20398 -89563 -202671 -61275 136886 -229852 35394 -106998 -302040 -171135 -132655 -82698
20388 -82698 171705 -136286 -71013 13407 -241145 -121311 71442 -209175 147465 244927
20378 244927 -129024 -161488 174556 -7936 -323229 -108642 202138 14624 -27112 -69612 -89928
20367 -89928 -78770 -303332 -198278 -134285 47095 84029 -62693 -60920 -135166 139520 -179364
20355 116018 -186860 -301416 135585 -420891 -71958 -173322 58343 55185 -166210 86542
20344 133096 -219939 -140194 135007 -46646 15552 -76572 -55381 36919 81390 48918 -13994
20332 -229122 170749 21146 -122809 95683 -28475 -184111 -19007 89871 -95681 79271 -154661
20320 -165730 -260937 -244100 -242217 188135 -57415 117501 10089 -157152 35231 -96570 107609
20308 -166356 -274102 91950 -274886 31446 -126801 -190199 23186 301123 -165450 -196007
20298 -196007 -150256 -32893 -48096 -114560 -10470 31611 180998 109845 -26614 -201722 -39887
20286 183633 -927 -56927 -349671 -317185 127751 -224179 233942 -287136 -119913 -166534 -28236
20274 26120 -164908 100598 -19080 -54066 -118706 -471314 23416 23360 -371156 -92800 -33785
20262 59448 104320 25379 -304385 -169558 -198435 -87149 -273064 -516719 -55817 -269082 -151769
20251 -151769 -62526 -86594 -353740 75880 -274337 135325 -337823 33018 50616 -76041 -235171
20240 -235171 -209634 9202 492 132089 50559 38377 142863 -48095 -246807 201268 -116293
20228 -149038 -66342 -269280 -91696 16787 -221563 -402815 -67737 48529 -150968 -278854
20218 -278854 -23152 285959 -204442 126558 -183991 61130 -92960 -175477 290243 -2997 -220054
20207 -220054 -30047 147082 -316427 31860 -57152 274295 21952 -36986 -398190 221269
20196 118337 23409 -76265 -168368 -59704 -265875 -48847 -81745 -95883 -290182 95584 -10029
20184 235143 49636 -36790 -117521 -98608 -201321 -314612 -84794 -250662 139408 -140284
20173 -21717 71974 -51316 241271 20894 471799 67062 36328 66823 -14374 82910 32165
20161 217254 -413687 -14682 -273357 102087 -42622 72132 97283 -7976 -253796 81683 375805
20150 375805 -31110 -231035 -218977 -206149 -33419 35362 -36460 -176753 175487 62395 -54429
20138 -226765 -41480 -386086 -215011 31838 117282 -62152 -104808 -7832 -144396 252431 15313
20126 -138021 123597 -267386 -265038 -136766 114457 -161022 99133 -103801 -54125 -17369
20115 63563 74266 46591 -214500 41597 -81660 125562 -278326 146829 -22592 29818 -385830
20103 -9818 273256 126158 168146 187767 -298677 -41225 217423 -160510 -52019 -140014 31071
20091 -58288 -229683 -190945 139514 -157156 -14017 -294513 74558 196547 70073 3655 -107990
20079 28559 -6992 36976 62555 -25036 -147794 -229429 174263 111223 -205474 -196378 307197
20067 133262 -231416 -166467 -153921 -260992 -303633 -86899 -73314 -193534 -18562 227697 -385580
20055 -371013 56784 -120989 -160864 146001 -22244 81768 -481 -240857 -9881 -331212 -191788
20044 -191788 127756 28917 81372 -449506 -192635 195857 -199108 -159952 74176 -143614
20033 318697 -134351 -230033 -190644 -162629 193707 -138595 18133 -276646 692 127867 40074
20021 61915 -229855 -37591 159449 -1952 -135891 -260400 6861 8686 -242899 -156021 -176246
20010 -176246 -78374 -248155 -136472 31558 -100089 -123268 -297832 -178468 315373 -451635
19999 131054 -612619 146502 211995 124513 -43244 -212142 54979 107797 -63453 285889 71824
19987 -199458 78391 131097 103165 197635 36553 307156 -34100 -116103 174071 -6624 -406370
19976 -406370 45398 -116117 436312 168130 130555 316983 247318 137417 -248662 83528
19965 176693 290568 -112420 -267492 204722 -50209 -203934 45454 58037 -193779 34572
19954 -27422 -172771 -360145 -37545 243831 -336183 139068 196989 -120151 -323231 -16783
19943 -126617 -50711 40335 -161483 349688 142523 219440 122965 -306597 102768 -120646
19932 -241449 5529 -398111 -158589 2147 140060 -117655 -175241 177645 -105632 280253
19921 93325 103221 -168887 -118335 -202898 29584 -333056 87395 207208 183789 -83398 95625
19909 256858 34427 180508 -515050 -159333 52 -100591 -5250 -242310 -160096 -288185 190702
19897 87040 -170238 -15464 53284 -85061 -278564 -212012 -94222 -231388 267895 173681 -319948
19885 -171032 183705 -20738 309861 69787 -106374 38580 -123331 -39027 -61102 -5428 -134637
19874 -134637 -37357 55741 -56953 86783 91509 -45897 151644 -26956 -399413 -180440 -198568
19863 -198568 -90881 6469 -291941 -454556 148146 -325428 -53229 75133 -143618 86774 208433
19852 208433 -184630 -55026 -232676 65078 -24037 -133869 -127372 89344 -361192 -539156 -616833
19841 -616833 -74107 -273441 710 -323213 16778 68487 -119904 261762 59845 -114853 -342399
19830 -342399 53932 133361 -242793 -308592 -514506 47247 29284 391164 -118920 46957 -223110
19818 65673 -18663 -347781 20820 -122877 98540 -136702 -444083 -218149 -6462 -43844 -467251
19807 -467251 221877 -148126 71114 186231 -8450 -214806 -63874 99926 29110 -3278 -97732
19796 -97732 130342 -118556 445793 -75615 -278594 -202465 -79096 -112582 6269 -73527 -168573
19785 -168573 -80656 394249 277889 -234022 116694 -221235 9902 -78308 -73155 -205810 -55800
19773 -146078 -294937 -201115 -113340 -147223 32901 37116 -59181 264094 -186493 -95806 -396915
19762 -396915 -48034 238991 17494 53729 5845 -20748 -336813 -48699 -48055 -142892 175270
19750 -109121 -65710 -93676 64510 -148707 -30679 -101980 -14799 -202435 -92637 -223551 156287
19738 -2976 -40071 37543 -68034 -33082 49119 69709 -138239 109864 55395 159827 -23544
19726 298608 -81736 8408 33742 -101552 -131067 37424 -203784 -379817 -27422 122000 77867
19715 77867 -5900 -169838 49421 -138819 99691 16895 -130565 -192948 -96134 207840 48644
19703 75113 -177880 75817 208252 -116134 -139154 -80480 96520 -68639 -82850 -297958 21323
19691 131958 -124450 36969 51029 191153 -248904 37667 15564 -322733 68026 -102565
19680 -67322 153352 103157 -48377 -130655 -214317 412 236398 -23605 -92427 -213298 -283392
19669 -283392 -44901 -184873 -73507 -213045 159946 -203994 88127 -335831 -37131 -108448
19659 -108448 166974 -47338 -153143 -56013 -360832 -316603 -370687 -250108 35897 -258543
19648 -278982 -337207 35182 17304 70380 94657 138406 -199136 255780 -22425 174603 -202086
19636 159670 -89793 -597459 107662 -24525 371851 -210010 -325508 -41798 157281 64584
19625 -124034 52553 -151121 201985 -87371 136514 171324 135951 -39881 -155596 -22289 -3362
19613 -133404 -135257 278910 -51852 -270815 -163941 -31580 137466 78582 -416517 -179124
19602 -31039 -289607 -158610 -210818 59437 157786 -216406 -40626 342849 36641 -106106 138816
19590 14690 70556 -353474 -335117 -102295 -197642 79549 108983 60966 -319008 -192402 140209
19578 -281944 -265316 -238185 -17016 438964 129709 -61274 -113069 62556 145193 -196613 122668
19566 -13838 206859 -231893 15082 -266772 -216712 -24472 -26090 -113298 155810 22071 -155444
19554 -5160 -25884 -219661 -59919 -23152 -233257 -263756 -79008 149998 -56639 -13102 -14291
19543 -14291 -122818 -132212 -99469 -36449 100522 245413 -222575 -142216 -204716 184727 54058
19531 -373446 -141981 92143 -35887 -28836 -39873 -122621 -254060 24019 -413967 90138 -293753
19519 -69241 -187927 -426444 -177280 51356 -282437 -178514 -4 -98172 -65932 -220864 -228576
19508 -228576 88565 149269 -166071 -186021 3792 90228 123312 454 -211745 -197040 -59938 -60146
19496 -60146 244991 -19298 -318551 -208875 28185 46181 64493 -105270 -337948 88110 290730
19485 290730 -328309 -55383 -29630 -341002 29135 -252108 -151088 -188409 -273773 -260064 -168793
19474 -168793 134435 158714 -41280 -18718 86861 -55494 127297 263739 -137244 154610
19463 -217404 -29697 -115686 210997 -248341 103651 136782 -272294 208532 -165831 179101
19452 92888 -148104 156706 191601 -283410 5674 -322267 -178209 316949 -94642 -323685
19442 -323685 -188002 -172337 -81445 -275347 -96718 257591 -116175 196018 -348420 289793
19431 39672 -317481 -335506 -160434 79405 -215040 -50007 -285483 -186312 67652 150654 -77264
19419 74046 -37508 -205712 -153797 334119 286136 -70672 -31676 -185838 -199921 -8323 -122654
19408 -122654 10890 2426 157291 -97422 -322743 -322862 59868 -197409 -43281 269895 -256733
19396 -148241 -35546 11815 -106180 -32562 -125051 -166049 -129125 -230331 -140549 -84193 -7134
19384 -136970 7611 106979 -151811 79155 -65718 -237766 -205297 -164886 145199 -3965 246907
19372 -61130 276302 -165722 -252397 -94613 -122677 -232370 -329424 70792 -70123 316991 -23330
19360 304392 205244 -160314 -194229 258850 -91557 -16337 -127553 -323501 -177322 -466986
19350 -466986 109558 139683 -125129 107594 -16968 -191400 -498942 54898 106097 -19227
19339 -137876 90169 -161147 154820 185788 -211848 25282 -86385 -78950 7909 45686 -181075
19327 164184 126636 4873 218329 367280 74099 -180918 -224609 351736 52531 237924 126947
19316 126947 -51254 93681 -40394 -195739 -335760 -2470 -124067 -163691 205069 46770 48835
19305 48835 -21453 -336879 -360153 -748989 -459579 -337744 -168964 23097 113799 275910
19295 275910 -129257 -174067 -55144 235499 -257306 133152 -304506 -149610 -220268 -26864
19284 -38149 -123173 47124 -84496 -44330 -6327 -340206 258185 -195730 -221089 -231985 164513
19272 147811 71784 -104143 -14102 -160362 130690 98070 72443 -323233 -183156 -12946
19261 111652 123376 -153582 242888 -73740 -130352 -15044 -93617 184763 -55363 42266 -336440
19249 -65857 36576 -127074 194932 -205447 -89635 -25579 -156258 -226129 -29823 142361 182259
19238 182259 146748 -108955 -143444 229755 158544 -26069 -145579 -49696 225459 -245103
19227 94531 -110990 42441 334411 -113614 136603 -338506 -24139 169621 99662 -192077
19216 -201767 -187250 -116353 -155768 -69155 47086 205444 -1444 -156971 -118089 14775 -315890
19204 -266136 -45592 1703 -419847 517107 -136305 -127902 154126 -238034 121221 141647 72953
19193 72953 -170600 -66535 -145289 -158846 -163987 -501286 -320011 -142056 -326817 53294 184912
19182 184912 194201 -33343 106299 -163004 -68397 -109702 5879 -195325 -89035 224910 -881
19170 -149908 109848 -20701 -110307 -51159 -58135 -41824 171861 -151920 42199 -246696 297404
19158 -94743 -196193 -210997 -6106 -47953 -302204 314351 222 77433 -30264 -75290 143897
19146 -49423 -173402 -201922 -187161 17159 -112069 56830 -266271 -216734 37105 74631 66406
19135 66406 -131100 -319749 104664 131340 41723 -151285 -43679 72891 -129697 -56783 -56594
19124 -56594 -650 -270617 -58975 -189348 117676 95505 233535 47612 -217484 53176 113309
19113 113309 286992 -321588 -58692 -42889 -211007 89096 76100 -282211 30654 -94789 202136
19101 71765 -138600 126164 -39444 -83164 -160066 -13176 -215409 -161324 111096 -291123 -224961
19090 -224961 64387 -69652 -144113 62567 29946 -254854 -108499 -266761 -42376 -125092 123203
19078 -20980 102639 -40032 -193819 -21473 -125059 -112090 -138810 -145744 -55329 -66628 148062
19066 49372 -266628 -228412 -329284 66286 440397 306193 68857 -545438 -427763 -30337
19055 -208933 164642 -147336 -239748 -20701 83003 -59964 -170565 -220486 -175367 162950 103529
19044 103529 -312292 72608 -369935 224113 -72720 -164763 -300441 37400 194590 -193124
19033 -221363 150780 231543 178849 -6753 242124 -7370 -38313 -261209 56409 -82943 108676
19021 -10007 136755 111257 10691 143686 -18992 108724 -426073 119684 39463 37279 163816
19010 163816 -56282 99764 123550 -71792 -146708 -16579 -62874 117241 133601 -201463 -93533
18998 141376 -2822 105157 -368523 -8909 13495 -352642 143289 -134969 -76882 109298 182131
18987 182131 -212912 -479654 -226075 -209112 -147526 162252 -47760 205397 -131048 14765
18976 -223775 98677 -205131 -14425 -12140 -110244 -92358 -37800 13881 -123304 -189480 -44757
18964 -536769 -3333 -225369 146263 13757 24009 -42634 -76872 -82019 -289225 -164162 347177
18952 67720 7588 -137044 62576 -12356 -320217 -66528 824 -266176 -22938 115723 3590 143265
18940 143265 -213904 118653 -46622 118378 -141642 2271 20853 -115298 5014 100152 -123444
18928 26527 11617 288921 187014 3431 -62236 10529 141781 -79638 -36252 108767 -232312
18916 -198697 -177711 -367118 165209 296723 92225 -400283 -89105 -62306 28558 137350
18906 137350 192521 -163803 200921 -129172 -141836 -381204 -272044 -83142 -17815 123132
18895 162 -144732 79767 -541229 122379 21638 -101091 289091 87037 33284 -211291 -123920
18884 -123920 -112324 236988 21711 -121223 23787 -97712 -181321 -607989 181096 -156198
18873 -41872 -223234 261501 -63526 -22215 -232789 199234 -116185 241569 304999 143463
18862 -318174 -365572 29845 -325194 -146052 -127996 -55447 -77518 -145884 125155 366714 22111
18850 182308 -147633 66655 -37667 127 78405 218438 40151 -77242 5456 46398 -40482 -336902
18838 -336902 162299 -226401 -136591 -72809 -252202 7404 143549 126596 -38031 -38357 -262969
18827 -262969 -103879 -39815 100389 49984 -138339 -53472 -210679 32138 95423 91181 -5207
18815 401834 60510 19949 76498 42030 284047 83249 -7832 -55670 331091 40382 -9578
18803 62073 -70618 -236741 170424 98672 -53724 -192197 -133353 -63353 -188036 -49985 -117963
18792 -117963 -125420 356454 -121730 398294 -85672 -197458 -285127 93768 96765 -169785 30806
18780 -8105 145514 -99861 -187692 -367442 -268229 27746 61484 -138685 -39827 148680 -225270
18768 17937 -88527 -229878 37095 71818 73872 127575 275419 -287879 -190186 -188476 23396
18756 -69729 -202113 -383263 -22272 68407 -106101 140401 234363 -27077 219968 17783 251244
18745 251244 -190308 166959 136854 80822 -202877 -139753 -25453 77179 -37963 571373 57408
18733 13464 -110486 -12097 -146084 -103155 -135613 -259147 -63209 -253016 21341 -107844 -174199
18722 -174199 33104 85494 161823 -72511 20390 -132623 41496 25346 -85833 -33564 5529
18710 -13645 145636 33288 118708 -7088 35462 244947 29662 7008 -49447 42006 -192465
18698 -227291 -143179 -318645 -274548 -616833 -271412 130444 -162438 -24972 -22002 -316567
18688 -316567 138298 171031 128766 -211194 79431 -94889 -26516 -135533 -96336 -14485 -48867
18677 -48867 254008 -90010 -146602 34946 140947 -69221 -101012 -74477 -149773 -109995 -164904
18666 -164904 12583 9446 203110 188260 160215 -238781 -2622 -224823 -71895 202845 12396
18654 2277 -49352 -282006 -85538 224825 32423 -5018 51646 -63158 175287 205994 112636
18643 112636 -148648 266015 -51069 -114716 -130171 -24302 -8910 -241168 309050 -182593 -158887
18632 -158887 -43609 1359 27101 -281053 -34555 -6146 -68173 -364473 236229 -32710 231819
18620 -1293 31607 271908 -325372 -268065 238055 -97301 -64662 135689 124252 -107035 -198120
18609 -198120 -357391 -108649 -242371 136622 -262851 -171047 322145 89628 -82954 -263405
18599 -263405 -41618 -229350 159427 -119146 -32033 171799 57830 -65759 -351562 -71231
18588 -296690 -70627 -43019 -18825 -100484 -114865 52248 38383 251432 242132 -52233 -181993
18577 -181993 122493 -512970 57215 -322010 -387634 64419 -139934 201305 -77477 -63003
18567 -63003 9399 83783 -328783 -331075 -12201 -81269 -90761 79206 -265578 46785 -96233 -82433
18555 -82433 35283 -363816 -168002 25770 -117280 -379057 58269 -61791 -134673 199670 -46017
18543 160158 -139446 -127450 -11115 -67340 -85356 76131 -192921 -133990 -131110 466559 166200
18531 -269222 -198269 -39280 -22480 32094 89254 189649 -197096 89802 -16821 -111534 -130080
18520 -130080 5109 -79626 133696 35413 -269458 -157818 100235 -147186 30102 153682
18510 153682 -223187 78427 -72229 -46046 -112063 -8235 17811 -185465 -256463 -248384 -56869
18498 -128368 -193469 9021 -121282 -69594 13092 9798 -172147 -413331 -136329 84578 302140
18487 302140 -19391 82800 -163054 33224 -135675 -176637 -169007 71322 -296576 56907 -96165
18475 -293768 158120 -299167 61426 52774 -74799 -230651 91353 1412 -261521 11809 61749
18464 61749 -96446 -307292 -162619 -348597 147555 -192248 66515 227590 118627 97272
18454 97272 -273086 -185316 -178333 55932 71777 163770 -63722 -157280 441661 179766 79067
18442 82345 -32534 -67958 -258299 -214430 165915 -92952 -228266 152959 87254 -237443 -27765
18430 -106999 -92595 -108080 -156161 -154131 -91625 -77002 -305813 5195 -141470 -37230 -143864
18419 -143864 48000 -301939 28421 -29338 125732 -74797 -86319 -257091 19805 33421 -28727
18407 316033 -264184 -241556 -214454 275057 373216 189429 156215 62082 -89205 -77521 277870
18395 118026 -50813 35094 -175035 20175 -110232 35871 218169 -85359 94338 231743 -171914
18383 -151265 322433 -50698 232896 -160439 146943 -140184 75036 -80405 53151 -174753
18372 17682 -193492 -299105 53165 -256900 54857 -299928 -28071 460432 -83440 -232594
18362 -232594 -237145 105294 -207701 -82262 189501 -111910 150355 -53070 -152555 32314 -414117
18350 146794 53153 9094 -92542 -90200 271409 61704 103133 -182148 126833 -43349 -210879
18339 -210879 -118490 -298190 222407 -313508 -247635 -88061 -379580 -76124 -229085 -146967
18329 -146967 -35478 -303572 -136317 -246994 152145 -389444 135157 -21896 21367 -497381
18318 -306642 279357 -18021 -34390 163422 -175725 289443 19633 -197247 236461 165855
18308 165855 -52603 -147770 -320335 -361591 -107164 -45768 -37388 -208418 -421792 -16254 -214930
18297 -214930 283552 7479 91829 72440 -90497 -63798 221329 -402230 -34637 -23174 -152294
18286 -152294 -75773 -48368 190070 -322451 174767 140936 -297774 -95016 102881 -54464
18275 92033 274098 -114904 5659 -169501 -145128 -54045 -184300 106782 353478 235435
18265 235435 -23060 59837 64338 113650 -291207 -44436 71500 -403332 6710 -147537 -247279
18254 -247279 -39554 -476689 -74645 -34778 -45038 55718 85457 -35779 -1428 -15510 -82882
18243 -82882 40896 -140569 -1572 -182924 -145377 174890 -26836 175575 -4567 218712 77428
18231 -238991 -134705 -36870 -410906 -235055 -229430 -13159 -228672 68543 -301954 -187756
18221 -187756 -175771 187666 110436 -224550 -141303 108625 -16838 -13906 333410 -195345 -57795
18209 -273880 -155695 123698 13033 -369174 127746 -141826 -98828 -85438 -234886 -122171
18199 -122171 295939 -178063 -194300 -104439 -9112 78164 43547 -229541 -43074 -31473 15707
18187 98514 -155506 99936 -188227 -245702 -160782 -138655 62579 -358639 49260 -67385 103112
18175 310133 -161693 -130045 5961 -195984 -109963 79676 -308108 -194757 55582 507998 56652
18163 -5842 -76825 -147370 -171137 -52274 -19020 338089 249663 -123702 113073 39305 -115636
18151 31514 151341 -224095 -108634 -260291 -216942 -119358 -482072 419004 -342124 -149757
18140 -139011 350724 -108729 -20092 55751 -178147 -38052 -122542 -192774 241725 -99296 92437
18128 46882 -509607 27679 -447030 -47806 100350 -298825 -144867 -93379 -12719 78955 -21060
18116 203043 224427 -46210 -69417 23981 -122965 134724 28526 -175881 -185652 -362416 -370106
18105 -370106 -291185 -142643 116074 132581 -31107 -56465 -89500 99037 151291 82014 83692
18094 83692 4325 25138 -116507 84431 18884 71000 94851 107850 99303 11946 6302 -377496
18081 -88369 -434138 36367 169478 -80142 194094 -22596 45433 125761 -65059 -43127 -78929
18070 -78929 -308798 68223 33920 13763 -12564 16213 -65186 -174092 -218567 254117 189232
18059 189232 -55821 -20520 -8102 -42813 170597 -243244 317776 112731 -205861 29679 -280761
18047 -255837 -13723 402555 -172067 -29647 -71467 362726 -268878 -17216 184324 -98707
18036 -237009 104740 18214 -288647 -313776 -10056 -55540 76089 17344 259933 52421 -78302
18024 177812 136787 -121495 -382362 -37626 265501 211047 -929 237439 152266 376258 188403
18013 188403 -334392 -26428 -225951 -62594 -354812 298915 -51163 138519 -87240 -82328 137728
18001 131750 130138 84405 9422 344743 27526 -206554 -32851 284966 -108789 85660 -158361
17989 -234254 341946 -16920 123407 -70064 -241632 25172 197328 220033 154118 33038 -131703
17977 271552 -233149 245042 -330051 -9119 -103972 -16110 -15861 111493 272117 33545 85138
17966 85138 109135 47107 174494 -178610 9450 8830 151250 -86313 -17919 -80178 -356452
17955 -356452 82389 190069 -182873 266647 -158792 -119650 189310 -509174 -49303 -475695
17945 -475695 118626 -77476 56915 70253 -104846 -132501 -298183 9913 -274096 -50292 168442
17933 77023 82484 -212022 -227367 16510 217894 -103383 184517 -69544 -469928 89462 -395848
17921 -158030 34806 -225394 74344 175288 374285 7139 -281188 474791 -110317 18910
17910 -424982 23409 204089 147789 -452398 48002 -207874 174585 330171 52608 146989
17900 146989 11231 170421 7038 -98953 108929 -140105 -99240 -12951 -141692 26619 99007
17889 99007 -561980 68626 -64020 227769 89136 -85980 -98659 167960 83060 -112165 -270575
17878 -270575 -171936 69731 103308 -310059 195433 2607 60269 49427 143809 -175987 -51383
17866 -207417 180713 -484902 378976 22474 338643 392313 -173674 42976 -27432 -31601 162111
17854 26794 102210 78713 -82169 -52102 -286083 -11888 -138176 87110 47071 173707 -14915
17842 -312742 328728 33930 74368 6057 8441 -66886 650 98366 34481 76627 -65166 -21645
17829 439067 -27178 176170 -30415 -16567 -30367 31877 108289 147657 -172617 35127 -220649
17817 -244803 -136161 -59283 -161411 73705 197715 -29893 151629 -129322 232413 216955
17807 216955 138997 -97038 -292676 -72402 -171756 -92733 43570 321515 -70881 174033 -47945
17795 56123 -168307 228989 -48631 9963 51535 -199204 -146721 343238 21863 166631 382949
17784 382949 -204489 -20243 -113075 69069 169155 14429 -60247 -47094 129030 219837 -151785
17772 302822 -61031 28881 -16055 -194307 319480 -121573 58275 -23877 22064 136813 -81487
17760 106970 -122664 -150826 -242208 -203981 153 93209 -51236 472650 -7064 -40983 -68148 -236857
17748 -236857 -155702 -5278 -352732 -152656 -44920 -70880 91115 45927 113578 -56619 102709
17736 147294 -89389 243428 214440 -165754 -100697 82063 -112583 81172 -76058 300377 -234794
17724 -26412 -15645 -366327 190990 -230990 -288811 105826 -18506 102600 6669 89858 -140399
17712 145376 131072 184667 -13308 -217391 3971 33941 151698 -25757 170003 119428 52890
17700 -90005 46145 -49759 46373 -118426 -108104 -24322 -113045 -117715 104559 238038 -51232
17688 25642 56238 -84297 -107007 327131 -48557 163833 354048 -89776 44328 -11509 33830
17676 5203 78518 -226688 50394 176130 81759 -107890 -255640 403387 -97951 67657 23038
17664 85563 196396 -31159 -64654 -110888 105047 -45912 82602 -78858 420017 -55219 -235404
17653 -235404 102464 111003 301284 59707 101464 -24418 150955 -168739 -85212 121866 -129559
17641 10466 183348 -156291 -203361 -75149 -218330 50061 -128218 58786 -158942 -186238 265518
17629 -207737 -60552 -45804 48317 80995 82279 9470 36459 -195053 178366 -148358 254807
17617 309648 -161046 -47397 -2508 200102 -264815 -156636 223456 323724 45147 -145122
17606 -270578 -134726 -38413 -143112 -84916 146989 -136212 -179883 273722 68700 24912
17595 29307 -186302 -47433 -420427 98060 375092 -7707 56100 -94283 -21866 146539 -264917
17583 78198 29981 -172716 -230591 279342 51490 -271198 -151483 -18755 276106 -300458
17572 -61612 189912 -57815 -154752 104841 -122600 76622 137240 86504 54375 352170 511052
17561 511052 27676 -57342 -72570 95484 412969 143085 -46177 79714 111052 -164266 21686
17549 201618 69339 223232 -27901 -55634 10614 228533 -126984 270927 126492 242311
17539 242311 -17691 -63275 58844 -22509 -220284 28404 -109079 322974 86578 108547 -242749
17527 -120808 -159158 -268422 -29497 32421 -114173 268285 -40325 134372 156107 157224 214748
17516 214748 34759 205546 259702 -142534 -20166 -17170 82216 231616 -40480 114945 108772
17505 108772 13298 163481 131522 -263960 250951 -176614 32710 38063 67037 200749 -101480
17493 -71736 83600 -209405 381280 180104 256472 111557 -14843 243945 309358 96199 64064
17482 64064 70476 147619 244902 51617 134562 -33915 152092 365527 63115 343738 547579
17471 547579 -76579 -235477 264318 -43666 218996 -48811 156679 -84956 199792 359286
17461 359286 179691 282880 129214 201659 315397 46376 -246809 169979 536469 395302
17451 395302 203697 117138 193691 353493 545269 340199 169062 427173 407798 113668
17440 -78569 273977 91557 32763 -1101 118761 305942 170310 108172 228796 323158 312508
17429 312508 -10746 109124 108175 368792 156782 146691 380371 248732 105426 345493
17419 345493 186516 508740 180951 370872 132332 278858 213330 266548 353257 43449
17408 24689 79852 82536 -95148 329435 98813 84947 154622 336716 263810 295777 205061
17397 205061 260449 115476 109470 -59907 38896 -86667 -62573 187983 58963 -7087 -91850
17386 -91850 259303 23749 337507 183556 141131 -225356 -30117 6880 200525 232314 263866
17375 263866 204091 93471 -55787 284632 -298771 283188 264523 430239 316840 192478
17365 192478 246285 40303 110885 103603 88758 -75525 48675 263521 354077 117783 -119467
17353 150637 190342 -108595 245585 -152284 233348 132804 -171035 71126 444488 252574
17343 252574 141985 108832 -149133 89590 -170410 -13582 170315 -24999 -378262 -193475
17333 -193475 -103089 775499 119478 250558 -420970 153964 122207 179730 176370 69826 122656
17322 122656 120284 -59224 144359 159566 -264730 256593 149357 184520 54586 17605 -25401
17310 258422 -44452 457725 -179580 16022 -28903 -135623 472638 -75162 403418 121100
17299 -2083 134232 256607 329440 305727 423323 -46502 285933 -37103 -138290 107779 63321
17288 63321 382525 203781 182779 -113604 -67465 162395 275428 -33698 313938 309673 152517
17276 295640 193172 420137 137327 163031 418420 -46408 -142349 -133093 343040 29828 32503
17265 32503 406800 53366 219188 -38572 241440 498252 -57192 -121516 -153887 -74756 138977
17253 82127 214748 -109998 234731 86472 7054 -10250 87587 94481 18430 -73619 109171
17241 397482 289745 203944 260033 26271 291934 541360 61649 246314 88474 87231 65200
17230 65200 56035 266248 371295 234709 316029 -7656 289260 -70157 122120 -14314 195482
17218 -52427 292631 96604 169491 277801 83393 109572 245742 341674 165175 506858 254598
17207 254598 32881 329223 444435 362713 216831 404141 275073 140895 294788 514816
17197 514816 -97238 301111 142460 -67387 70205 357615 407483 103008 427043 14 441181
17186 441181 43032 168208 232221 211248 279300 102726 52176 366496 323018 -29538 197390
17174 242096 210170 84187 337630 320080 240687 -23884 310863 348418 193392 57118 294320
17163 294320 182009 435015 125884 276077 207938 432100 479565 306937 47332 329515
17153 329515 321568 231918 567725 323265 301559 53383 454584 403002 481413 209469 148974
17142 148974 253374 -5802 240166 313711 651861 164590 360267 161979 114779 474635
17132 474635 311232 360479 448415 358570 551438 351837 165462 124029 154653 61224 396256
17121 396256 627929 384688 196460 640787 -25326 574144 483186 251028 577774 445654
17111 445654 410119 417977 189092 153868 401494 156793 263713 264464 415347 -56661 468424
17099 217264 170195 579539 504525 498401 393990 417721 365792 449588 457552 541719 59947
17087 186619 411209 254589 249191 227684 86001 594594 334875 251818 353983 413141 486764
17076 486764 678413 516003 406854 379932 338729 276973 517567 589686 259457 419282
17066 419282 294788 145931 490938 587025 260119 821017 599356 666255 292876 485740
17056 485740 363770 385058 449639 312854 647819 726557 567816 486940 806136 543970
17046 543970 485691 382989 578877 725958 737585 463353 699969 810232 386060 579445
17036 579445 534625 297733 427191 875634 540406 574407 556940 421925 554705 533684
17026 533684 351684 886822 489781 552105 1181207 396180 701961 476460 178328 871402
17016 871402 757097 478758 823302 675605 228221 805525 918350 513699 670940 373871
17006 373871 666055 440540 471640 554167 701229 727705 545290 874816 355881 819829
16996 819829 654612 788639 629657 772102 972530 623415 632691 508680 881344 815127
16986 815127 646647 680938 1080408 754222 1200804 839251 623948 647857 867449 734694
16976 734694 855479 933192 1089479 701547 760252 1038143 811898 1149054 864350 711343
16966 711343 1046725 614273 1051781 1064123 967723 1047033 886176 1205829 719819 1120196
16956 1120196 857977 1294965 1002215 697843 1113544 1143815 495144 782502 1191579 950296
16946 950296 716107 1215966 1271658 924969 851910 962890 757841 1081717 1206541 1228507
16936 1228507 741130 1113940 1191034 1370036 1255914 1292254 1008550 1246083 1170910 1361039
16926 1361039 1199905 1157135 913272 1332616 1199899 1265244 1441319 1245188 1473795 1342622
16916 1342622 1023081 1389830 1033979 1369214 1398807 1438514 1430020 1576116 1517417 1146765
16906 1146765 1495568 1497544 1377684 1162108 1406671 1886619 1859762 1564797 1907485 1853303
16896 1853303 1662248 1946987 1789826 1860516 1666994 1801615 1866180 1990674 1846387 2057286
16886 2057286 2061632 1921767 1999666 2147317 2317796 2273110 1861151 1980782 2082142 1906419
16876 1906419 2051976 2187309 2019135 2270663 2183847 2320395 2367881 2536615 2518721 2481432
16866 2481432 2877874 2601872 2663796 2235678 2362812 2797727 2557234 2684457 2814951 2632420
16856 2632420 2979135 3064786 3173925 2994919 3081733 3290101 3052103 2998848 3166076 3309824
16846 3309824 3043788 2903006 3419932 3600261 3307718 3311170 3600998 3650971 3485252 3675099
16836 3675099 3239927 3818697 3945758 4033145 4180923 4288322 4372942 4278941 4368896 4401531
16826 4401531 4295313 4660405 4712762 4421847 4578826 5010773 4744929 5454102 5127867 5035970
16816 5035970 5138276 5343164 5932162 5756396 5825452 5496673 6086207 6130449 6451142 6337958
16806 6337958 6505465 6462868 6591175 6928008 7106283 7126575 7427644 7516726 7722242 7931284
16796 7931284 8170506 7919558 8407592 8668848 8946564 9340302 9447694 9887990 10066308
16787 10066308 10193424 10417919 10789846 11087901 11512117 11753905 11824328 12202851 12301164 13131029
16777 13131029 13652770 14236054 14425989 14710715 15494445 15624371 16232480 16738466 17331392
16768 17331392 18423001 18631190 19326848 20220283 21003598 21579257 22407769 23174901 24168071
16759 24168071 25131483 26469844 27354333 28375657 29725048 30762813 32342503 34014944
16751 34014944 35529374 37087340 38962724 40617075 42887982 45191240 47420745 49867435
16743 49867435 52324001 55431714 58312742 61661518 65509169 68894885 73085920 77310001
16735 77310001 81925641 86780160 91643348 97368166 103218483 109220152 115698470 122058659
16727 122058659 129194304 136219274 143031654 150063812 157411399 163592267 169526606 175151549
16719 175151549 179926621 183247084 185718447 186704755 186682920 185772658 183171038 179475105
16711 179475105 175145815 169284249 162799457 156428818 149180263 141628176 134314815 127081632
16703 127081632 119944578 113213746 106210894 100392432 94491915 88879587 83238953 78252644
16695 78252644 73641248 69806959 65647284 61703471 58393459 55024378 51965453 49356920
16687 49356920 46666593 44058804 42281440 40048123 38097350 36430625 34195901 33174515
16679 33174515 31240010 29693176 28429868 27418857 26247430 24928829 23838527 22846594
16671 22846594 22027246 21204362 20420597 19731527 18933383 17957519 17335944 16871560 16377157
16662 16377157 15416059 15275507 14953560 14285706 13609102 13397927 12913931 12337041 12031512
16653 12031512 11557516 11294143 11009071 10502782 10223009 9748572 9828185 9597282 9425912
16644 9425912 8921765 8807000 8396415 7936847 8157356 7842115 7523696 7156062 7017076
16635 7017076 6820244 6819090 6487987 6734749 6372166 6628963 6079708 5696901 5509097 5200923
16625 5200923 5715626 5406831 5330084 5091687 5212818 4865821 5079162 4724498 5206893 4411704
16615 4411704 4312774 4425744 4159085 4321225 4136492 3973180 3953033 3678831 3680840 3533944
16605 3533944 3626693 3571537 3889840 3746488 3405277 3322456 3441870 3216512 3102933 3137200
16595 3137200 3148519 2878811 3002515 2797348 3107057 2524062 2609603 2634075 2472050 2786902
16585 2786902 2542536 2807581 2372197 2253607 2511512 2219973 2396101 2142038 1928905
16576 1928905 2079222 1978310 2334157 2152787 2166093 2306247 2345361 1919927 1839560 1743377
16566 1743377 1935896 1824203 1951357 1741811 1656243 1496679 1845052 1854793 1568052 1675787
16556 1675787 1665087 1666098 1586667 1527439 1584133 1326105 1462204 1446437 1534203 1502123 1333225
16545 1333225 1416997 1433890 1386532 1178473 1323804 1093603 1437478 1211986 1322855 1441051
16535 1441051 928240 776625 1271964 1260903 1056174 1285896 1119138 1130880 1074916 1203291
16525 1203291 931358 1107292 1397094 845734 693795 793419 1042233 703190 1110102 1000767
16515 1000767 1022793 1044327 877732 1106705 737372 1475355 805194 1058108 736467 1058063
16505 1058063 882178 523974 851858 1088945 952254 880718 691032 821822 672324 748599
16495 748599 852722 815492 563718 624299 691525 678019 648457 454274 795191 815067 574466
16484 574466 725540 755947 677460 712489 583593 393053 883482 748496 680382 508429
16474 508429 619399 682073 679478 474785 468881 558547 255056 318434 799342 789388 660233
16463 660233 847539 845293 493510 601814 500295 605830 579036 624546 400585 660999
16453 660999 408050 514611 489043 858612 276167 401168 554823 835081 714700 299682
16442 635946 525267 405000 736967 569542 644803 350101 512261 275351 372091 430475
16432 430475 531976 551489 631476 228276 203482 184457 99107 419675 602096 725431
16422 725431 285122 339164 335768 520590 342051 16219 53000 285953 574833 732282
16412 732282 175375 312207 161129 103436 312176 11221 221896 346245 264753 290770
16402 290770 217475 616796 157918 139655 134870 437476 229561 508356 410870 448075 -66062
16390 53087 268510 222142 233094 142033 337999 122000 488784 271103 -1975 163045 367384
16379 367384 38590 415911 139778 205309 409993 302723 257833 459198 321155 419813
16369 419813 30156 140463 318419 315162 446503 47248 175409 219889 397784 103515
16358 397461 307501 61997 245522 61572 106647 -48444 201863 179352 352572 353246 348355
16347 348355 480482 463550 261755 294924 385113 198897 172678 633930 255698 129108
16337 129108 -116304 246436 63780 -170310 206463 317152 39818 306307 136651 167278
16327 167278 -45377 -11420 53569 468841 468294 186074 248902 303494 -9053 375419 71409
16315 215079 253422 571857 97952 -71846 -84256 -252189 -203674 285613 80184 -62108 -24898
16303 124395 133061 96090 -2284 317112 189626 336762 285580 -184551 -993 292209 269261
16292 269261 -37154 -45615 164569 135081 458686 185612 311265 43650 422425 227424
16282 227424 344281 -82641 21589 267272 -17995 38627 87132 291160 142659 -157628
16271 -154672 232129 228032 256285 -104874 308501 193092 71139 -67118 181085 -150430
16260 -31732 120822 -16966 89951 102071 93568 41839 32185 199811 -33608 -113606 34678 -8815
16247 27038 -128107 254251 95456 139572 30395 59627 -118245 -89508 163584 20679 -106528
16235 -276393 -35891 269994 45854 -106130 165850 8674 11600 -19092 -101133 -51412 1410
16223 42022 162492 -136797 -146980 -129026 263936 51103 -99710 109956 155327 -106059 117304
16211 88707 406440 -190045 79727 142397 147557 66443 89374 351507 177037 150945 -297521
16199 38566 -63933 35251 -36556 142158 -109147 -109508 -42903 -77982 244277 195834 11180
16187 223775 -264376 417200 27424 -179448 -175427 -109779 18575 259968 -11597 7528 54860
16176 54860 81980 72850 516357 256410 224491 8422 -185656 -15118 356300 251618 -14830
16164 -220029 -193373 -79629 135742 109573 -235009 -47654 203604 33063 -130624 31238 -132535
16152 143375 -8922 353356 -28636 220949 -161792 -11278 -15537 235591 160427 307208 175620
16141 175620 -120480 313175 -53612 361974 87746 19223 129398 84290 -6550 144435 -27710
16129 -226359 -171800 -250112 113447 120001 31882 -46203 -319504 316761 148281 -33116 117899
16117 72836 142850 115868 80514 -32180 -106184 102026 -187159 -65621 107667 -382568 -214568
16106 -214568 -142225 30746 -49610 -180832 -79519 -50962 -2273 -179187 11245 59490 73488
16095 73488 93879 -410826 242005 -159669 -25260 6170 168910 206209 -49919 146988 18338
16083 -179517 -88157 13270 -263587 -94498 -14257 -114845 87057 156785 -42212 -94971 275511
16071 -337988 173636 -323868 -245729 -324561 203904 -107230 -253123 -45543 99784 -175962
16060 5881 -238442 -318469 49865 -74841 392506 87602 16486 -230754 42680 -25332 -152062
16049 -152062 221024 104798 -118219 -306916 -249 -116134 58649 -278420 39218 188817
16039 188817 -131481 -71571 -197595 101786 -207540 144032 168702 144567 45920 84757
16029 84757 109707 335752 -9995 9604 35050 -234266 87094 -153028 -37377 119816 94401
16018 94401 -30109 20067 112272 -128879 -180446 219421 -181257 -179308 -122895 -43958 383866
16006 93801 -7505 84974 -173869 -345945 -165987 -307926 48439 155100 129203 256455 -205568
15994 -233405 364512 277698 -223618 484251 200846 -133416 365685 265321 100971 -54572
15983 588807 605157 483759 151011 372154 421707 327606 248141 -22578 -292531 -276769 185022
15971 390089 -162260 3506 -309812 -118568 9261 -122707 322347 96121 378419 247387
15961 247387 149814 137194 33401 188343 -65939 1158 141232 -301366 -167851 -99935 -542392
15950 -542392 -274321 -192438 67357 -63373 25859 -55527 121224 -155735 -244438 162907 -151187
15938 75714 -168153 10075 -122168 53418 34600 79681 -183257 20116 -318570 -235298 -104938
15926 -154620 138008 -232082 -299829 -304220 -202804 141442 -413334 -119059 -384225 -318287
15916 -318287 -126200 -261818 -219823 147646 139962 90857 26293 -267787 36996 -7656 -140858
15905 -140858 -123177 -224894 517893 -366765 -40651 -62776 -22827 88295 4238 121444 -23393
15893 -66700 57184 -178237 -262695 8097 -430120 -204158 -109592 -256945 230928 124878 -128231
15881 114162 -337296 -237554 134225 313109 248335 -169646 123432 12727 -173146 -72821
15870 27053 4316 -10947 -102340 -91467 -421 -2313 -183848 88227 96525 -50603 63933 -447648
15857 -133026 -25164 340028 90785 160657 110141 130070 -30599 102993 -351835 -128465 -124481
15846 -124481 -65175 139000 -77582 20221 61907 -78109 172972 194299 -310910 27800 -82982
15834 -119023 59915 -107854 -157885 85824 -341281 155415 -54462 143371 -199733 61558
15823 -344542 23262 151568 -168620 42754 -310883 -155125 207479 20092 -120446 95373
15812 -121891 -125701 -112895 325357 -80426 -44754 -113983 182799 -98707 239887 28505 100183
15801 100183 -153485 -416567 63306 53935 -221169 -56501 38813 253350 -76822 -106058 -167963
15790 -167963 -174716 -297518 -33800 -273581 70859 -253546 55778 -119505 -192805 165890 -198323
15778 -120800 446102 -67328 -62131 -202071 -55453 -67621 -221937 -306829 82779 333454 -231954
15766 96526 -34387 -213800 -180119 93997 103088 279532 191752 170271 -21364 90722 -31698
15754 -25846 61456 282061 4274 -342061 -7991 20136 18837 64714 -75178 169451 91639 -331655
15741 -101855 -397089 -169236 242727 -118423 -77745 -124517 -184894 35865 210120 326608
15731 326608 -95907 -282361 -123584 -100279 69103 -14198 5676 -351404 386 -197129 129384
15719 -69571 119645 -13430 241493 240713 -194050 -124667 88750 -65303 349572 242610 -84059
15707 -318689 -90178 121914 -148042 -411999 -265013 20565 -183537 -92936 93828 -48105
15696 -220857 -121140 406694 18348 -28552 139067 -32325 172795 8533 -109492 -87207 288262
15684 113855 111237 -35453 -255452 101951 -299364 144094 -160763 40603 58122 -6714 -80885
15673 -80885 -223394 60542 255599 10602 -138291 -32817 169228 27865 -256875 272707
15662 49976 -94941 166698 -13561 11129 205732 15300 -113819 -66553 -78291 125875 25800
15650 58161 -203667 -36921 -44630 47183 147060 225871 -99398 137968 147810 -61160 -221276
15639 -221276 76165 -138649 -94851 112142 124884 121224 117791 -109985 18136 220667 -25651
15627 124770 -131088 -36991 -77700 60467 -72375 468533 -46848 273251 -10353 87725 21232
15615 -140094 -58464 -315838 -54320 -66188 -55057 -84882 74427 -109151 -103025 254518 -2698
15603 162667 -27207 168161 -32131 -11512 -90384 280248 268854 123709 70019 -48834 -33785
15592 -33785 187226 80416 3651 36174 -58024 2890 -166108 11044 179120 347314 12082
15580 351414 -312186 -258346 142162 -179305 -463983 55247 -466264 -106522 -93253 -51204
15570 -51204 16756 7269 -92601 47203 51963 -159551 -85812 37920 183312 117311 343273
15559 343273 277265 504513 -187104 -298167 128999 355277 288616 -117354 -56506 -88976
15549 -88976 -69426 42353 97005 -2214 30285 36915 24953 -48512 -115057 189244 31918 -19482
15536 246611 -177144 -226553 28005 92104 19169 -29152 52753 168121 -445677 165330 -14948
15524 -20400 -1698 -130292 -274681 -7401 -14198 -152146 -218509 -46469 -121518 -16622 167192
15512 147284 142731 -184117 405738 -42496 -102583 -27849 -123805 346145 191029 -195078 -74108
15500 -423729 -65794 -84210 -48616 27071 67388 176025 -83256 -55229 112175 55283 -113416
15488 -246903 11179 -333177 27584 23427 -156271 -240947 -149448 7200 -96176 -14566 261525
15476 -115642 -172414 -40217 -174948 199168 37491 213193 164481 -297325 183348 -265847
15465 102058 -146837 -100204 186161 -17782 64783 44859 80609 10426 -198232 -8040 141262
15453 -301994 166982 -15137 -258918 -35321 -130857 -85681 197972 -34202 215117 354923
15443 354923 -33361 327259 -264855 113630 -33142 -117355 -175329 -96106 184601 145241 248126
15432 248126 -17544 -155339 -105855 -85812 -332036 159976 -11266 89439 -135541 23558 -273434
15420 -397696 116272 -58274 161167 295209 -242965 489599 -4261 68254 -70406 16106 138140
15409 138140 -281024 -117674 101500 383789 -124760 -290016 129603 150512 83943 172833
15399 172833 59508 -310631 -326139 -30452 -219954 -206052 -141919 -237280 77303 -49928 20126
15387 -318772 -323092 -292581 222641 -231868 -409754 155544 129213 381354 10401 73282 -387513
15375 -11493 289923 -167043 260569 219238 98277 119269 -30138 166947 -41088 -134427 -15500
15363 57342 146288 207790 -144902 142842 -34632 29973 -136104 329878 89889 145405 26506
15351 334143 59613 217031 179702 241370 247937 425139 -207521 -686 9528 69533 -14571 246451
15338 69882 -44468 -269164 -195211 67227 -93899 423626 -455228 -205415 72691 -228716 104875
15326 -117349 155690 409225 246846 399972 331068 -185864 -76258 155072 -53341 154748
15315 -302826 -127842 113937 14463 174282 58832 -151020 132659 100684 141829 306873
15305 306873 219300 -21355 167414 197316 -5191 -65319 90284 -114423 -28810 195270 228191
15294 228191 280766 -33590 -85482 -102650 131862 -75498 -86228 35699 141794 339397 -9346
15282 35257 134923 -193394 160914 -61727 24496 107723 -170369 98597 209216 82493 -90835
15270 34616 186902 23937 256321 -3767 73905 -187297 162114 -102142 -23650 -105547 113408
15258 -949 50806 -1511 -91941 278402 -155673 -204846 -45209 -61205 58071 274279 329136 951065
15246 951065 1505692 1135496 1267318 445365 76417 -15073 258748 127582 227 48618 87607
15235 87607 72163 -69184 -10001 165312 178628 56024 -219098 162031 106675 -160525 338033
15223 170655 -304250 391199 84338 390928 141361 358687 243746 130637 -178142 -283914
15213 -283914 21908 17009 160144 130808 -40844 65814 -54861 188828 250526 242605 -11959
15201 190531 415557 -55367 -21746 -81172 -348508 -84010 -134575 64659 -114153 -10490 177691
15189 182593 -70043 77583 109911 -37940 268406 -294760 174782 -91033 -134193 -21946 -26759
15178 -26759 -38408 -5462 -206760 146952 106265 254156 491822 173897 69923 233241 30054
15166 111949 88323 357123 383256 35726 170293 -10179 64218 184328 412761 1165 -313709
15154 -128582 121265 20341 220142 -44345 155339 241392 -32756 -215048 -158302 137192
15143 271525 -12476 187427 -104468 270448 246828 -54194 92793 223316 -10820 220222
15132 149744 106735 -72712 70015 -208420 17689 255771 48359 196378 302893 225705 9060
15120 -139811 196331 202633 110037 -272386 51455 -13843 -40943 -159360 31524 158379 83970
15109 83970 -53238 224979 322743 361107 56867 204920 53591 28286 170774 12548 131439
15098 131439 -41576 33718 -77960 194487 241062 115536 73470 -222172 551858 278417
15088 278417 364943 426889 422691 327132 -62198 165350 126476 -87133 51552 259710 98527
15076 205243 76109 379817 211611 330168 420888 213866 -52901 116110 -15676 257056
15065 294474 81 74654 13665 54140 -286133 142834 46365 319416 -154912 -90534 418356
15053 132461 171088 119497 355275 440184 163585 70270 -22651 107405 214806 322609
15043 322609 96259 88625 13309 400720 258516 400337 28018 32084 -47772 218883 481802
15032 481802 64392 80513 134822 236698 265311 33118 182651 149245 -73992 472374 149852
15020 162372 66054 15980 439275 109521 343064 232206 277060 307511 577 470587 242225
15009 242225 32079 123286 425766 158395 278838 150505 -23269 43819 48266 232254 444078
14998 444078 199086 118270 139290 236677 336391 -55756 411602 262074 -296510 355469
14987 271739 377251 394889 187873 -143054 75763 -163854 261338 77891 318684 -97604
14976 -16212 235910 310957 -27070 526103 22149 293162 234595 297407 325142 192982 -1228
14964 159245 510102 -59468 497202 321797 406334 162933 177360 527968 288392 54369
14953 77858 218553 245431 439846 401675 212355 256544 275298 201664 268519 89997 165555
14942 165555 419709 294268 370991 500178 191200 186948 193244 157030 118496 355150 176229
14930 290388 193350 294840 505281 316734 198247 415223 460005 226108 487153 430669
14920 430669 206310 453246 65907 521903 332203 133106 385620 216810 359867 394241
14910 394241 368595 493197 352314 316810 533434 299420 270365 318914 175413 153934
14900 153934 294270 375832 413625 341820 35987 443506 602523 509361 336678 182571
14890 182571 457199 120465 386871 313312 -33839 631864 486712 125013 33233 155916
14880 155916 -8765 281393 401693 433706 132623 228357 105539 521222 340263 545260
14870 545260 601534 340466 290923 421905 389910 454942 342749 465819 395871 430743 182513
14858 386236 467822 514329 57303 278842 229839 501069 433319 425889 155869 232710 483568
14847 483568 397436 476069 74826 126860 783802 540374 558717 425885 397922 295584 209361
14836 209361 362953 628812 568494 597257 315925 464671 254721 573901 334967 47995
14825 246811 284832 367243 214559 246877 533330 561811 443884 252789 189203 362512
14815 362512 54081 304829 425200 319386 447212 441187 227195 290327 511943 371641
14805 371641 373764 462308 628083 245910 599875 477296 111944 184859 273192 436892
14795 436892 598814 784500 318832 144800 473507 70569 -7569 771593 448595 557717
14785 557717 468604 331591 484159 612745 454348 510420 411559 582585 582453 567778 205000
14773 745162 459925 371505 313946 577476 525307 498762 305792 254658 465987 658661
14763 658661 697478 591076 560091 500178 368833 397406 542823 704680 125151 457606
14753 457606 707861 813476 770851 624427 542879 540326 728153 409050 709545 873769
14743 873769 663473 418713 657189 931504 573322 485531 616002 629931 559419 755268
14733 755268 451670 853256 681243 282001 584739 454095 623543 547198 1004380 686976
14723 686976 690201 966640 591052 1007403 783500 562365 894792 651949 973428 529443
14713 529443 869610 616195 742144 958432 626774 673802 980056 753542 1051079 698059
14703 698059 774425 954135 471155 616680 862284 875841 758129 697513 640272 974289
14693 974289 824576 851839 960413 438371 758390 860199 680771 877101 662051 835381
14683 835381 769617 670745 804921 997743 1131661 930646 904720 883844 951734 979232 681800
14672 681800 479452 876993 520935 972599 890477 1022152 875100 1059078 598651 1011583
14662 1011583 968140 1075497 846464 1192171 912603 955723 1211124 1049779 1061814 1024059
14652 1024059 990113 824103 1159719 710224 1017316 1009905 957896 664112 911432 972701
14642 972701 995890 962222 1255599 1080253 1031405 1171296 973090 1364542 759011 1141243
14632 1141243 1215907 1097026 779848 1030068 766991 1417383 1300208 1083254 913457 1238929
14622 1238929 1158754 1241452 1151204 1461631 1522090 1325108 1119861 1450603 1229091 1297416
14612 1297416 1429683 1370948 1152306 1204829 1306716 993381 1164263 1388041 1360363 1111586
14602 1111586 1303378 1690747 1198325 1299910 1330895 1160175 1454476 1606536 1368457 1670979
14592 1670979 1583968 1821077 1545893 1291351 1606262 1549171 1548165 1449361 1501511 1747709
14582 1747709 1532951 1511491 1688048 2053518 1635325 2090697 1562591 1800566 1794542 2067115
14572 2067115 2199714 1848494 1789251 2044749 1985565 1996432 1993998 2474537 1929342 2555131
14562 2555131 2322458 2529697 2357307 2570689 2967013 2510339 2946055 3173807 3149395 3042589
14552 3042589 3666353 4311482 5457635 7735653 11150649 17208567 32634931 47890242
14544 47890242 21954139 10921639 5123722 2475934 1827082 2121674 1620633 1407441
14536 1407441 1958530 1638783 1537640 1789840 1662466 1953649 1947989 2000624 1951306 2027707
14526 2027707 2173302 2124559 2121687 1909746 2042509 2161622 2199011 2331768 2203620 2433126
14516 2433126 2433053 2403549 2058338 2299221 2459406 2515266 2183538 2600235 2245169 2420196
14506 2420196 2511677 2616300 2625346 2706362 2579579 2650983 2701862 2533265 2706672 2508636
14496 2508636 2686309 3099091 3213920 2673061 2819390 3253653 3226998 3022411 3094028 3147636
14486 3147636 2797307 3196239 3078289 3145799 3314836 3458743 3234016 3276102 3509902 3337791
14476 3337791 3650818 3493343 3519649 3620836 3465099 3552071 3858245 4069292 3882068 3745140
14466 3745140 3971363 4065522 3897241 4057329 4171013 4321709 4286810 4718629 4435137 4368188
14456 4368188 4356653 4644531 4700660 4826623 4799524 4745591 5057638 5261670 5087012 4748539
14446 4748539 5312897 5287775 5331715 5257387 5142826 5195041 5662354 5420202 5479487 5541142
14436 5541142 5309750 5961895 5698869 5819571 6118595 6131946 6388146 6480240 6003718 6411662
14426 6411662 6406619 6706570 6747961 6575377 6906093 7106294 7014245 7471381 7385607 7262369
14416 7262369 7536181 7696418 7674946 8249705 7870533 7799148 7892662 8227191 8444976 8546675
14406 8546675 8504478 8487031 8845898 8847758 9263910 9047987 9498423 9242550 9518542 10061341
14396 10061341 9804480 9992460 10387573 10403859 10842102 10692035 11039110 11040969 11532113 11505597
14386 11505597 11951682 12046297 12120770 12316358 12487651 13183161 13261784 13569943 13738669 14040059
14376 14040059 14116063 14443924 14755357 15091364 15308148 15567066 15929982 16343042 16770830
14367 16770830 17228950 17032031 17741408 17941831 18648279 19141712 19310885 19928973 20128885
14358 20128885 20768858 21393524 21770645 22184824 22753367 23130074 23791335 24471090 24858942
14349 24858942 25484854 26470172 27176832 27634814 28489936 29395610 29673089 30638812 31334447
14340 31334447 32422099 33429240 34092326 35003735 36386336 37473774 38542574 39946881
14332 39946881 40855772 42396702 43455679 44885900 46386326 48078533 49554005 51288490
14324 51288490 53027875 54938729 57099479 59083720 61498476 63484501 65935829 68789087
14316 68789087 71175375 73997220 76889437 80115078 83398562 87288593 90736910 94600351
14308 94600351 99514645 103988068 108793892 113891704 119488606 124750254 130844402 137285833
14300 137285833 144501270 151950303 159623246 168169177 176561913 186205483 195722663 205838079
14292 205838079 217026658 228775788 241144276 254080744 267292584 281854704 296339109
14285 296339109 311332887 326986997 342860991 359073240 374950526 390712669 406148147
14278 406148147 420696663 434557566 447200683 457849808 465092747 466442260 466350912 466999097
14270 466999097 467002304 466611834 462394094 455851658 449292470 436791356 422256119 406307799
14262 406307799 389511668 372215754 354729397 337529426 320372499 304219975 288034214
14255 288034214 272464978 258374195 245067790 232118968 219690679 208365035 196706196
14248 196706196 186743070 177053670 168005891 159753724 152222451 144440604 137286965 130772625
14240 130772625 124605478 118933412 114078719 108722110 103803778 99492108 94548254 90972916
14232 90972916 87324232 83976485 80714761 77122963 74145396 71274172 68617780 66220630
14224 66220630 63409887 61319964 59429620 57194658 55470025 53184612 51676657 49847171
14216 49847171 48040956 46502759 45643860 44311816 42665175 41323424 40244105 39056259
14208 39056259 37729224 37069438 36160532 34873061 33782478 32682359 31983159 30808978
14200 30808978 30727334 29548227 29136098 28035047 27236983 27013037 26272840 25556567 24646823
14191 24646823 24146850 23925225 23110894 22337246 22060323 21540996 21151539 20457385 20052443
14182 20052443 19603033 19348495 18928717 18368919 18608044 17790873 17333907 16799898 16707737
14173 16707737 16401602 16110581 15754711 15241679 15434639 14792780 14586025 14392279 13910337
14164 13910337 13735964 13465778 13232163 12893221 12841070 12687997 12683685 12419464 11872888 11618158
14154 11618158 11566438 11379728 11208941 10961495 10840235 10516871 10222285 10225961 10122027 10075681
14144 10075681 10074159 9828718 9445966 9228661 9243649 9201270 9199379 8941194 8675663 8371143
14134 8371143 8779446 8582924 8225929 7923949 7698049 7860279 7705074 7419721 7786253
14125 7786253 7759286 7387340 7308365 7296681 7297413 6913841 6940833 6923506 6463901 6550420 6687451
14114 6687451 6343092 6320395 6162385 5984710 5777376 5938860 6216225 5772003 5797603 5660196
14104 5660196 5397359 5502383 5414882 5500925 5704840 5415040 5261951 5188438 4988145 5164083
14094 5164083 4911300 5009073 5007247 4698718 4926064 4621855 4640628 4640601 4630133 4646075 4324337
14083 4324337 4142159 4360478 4605543 4335393 4427324 4178618 4008140 3836984 4154740 3951062
14073 3951062 4172705 3710220 3920320 3918632 3842375 4141379 3745854 3860147 3575627 3832247
14063 3832247 3810853 3631830 3748397 3844294 3901020 3920032 3769095 3685652 3318194 3429461
14053 3429461 3244931 3264647 3218824 3508635 3261651 2994529 2793671 3107692 3251825 2943070
14043 2943070 3035826 3088049 3241791 3121121 2821144 2777439 2977057 2911297 2660021 2909845
14033 2909845 2905883 2845721 2524912 2452097 2310326 2913593 2607159 2671560 2465811 2411992
14023 2411992 2618927 2435858 2518504 2190851 2578997 2375756 2280578 2315228 2291629 2244782
14013 2244782 2157858 2114216 2539959 2187889 2317989 2335387 1994474 2359625 2021162 2101043
14003 2101043 2112275 2122699 2240652 1955341 1921743 1843067 1868721 1964139 1906613 2070014 1855089
13992 1855089 2140051 2433776 3110623 3905785 6660203 11875659 25191836 46809870
13984 46809870 27392608 13570382 7154269 4717393 4255768 3436497 3213313 3096018
13976 3096018 2770572 2646339 2619862 2630012 2426057 2263225 2326300 2280449 2280274 2315467 2200827
13965 2200827 2005361 1902030 2060967 2096722 1771190 2077731 1981906 1882737 1911440 2238493
13955 2238493 1766870 1934848 1814284 1850483 1745909 1864814 1481112 1734040 1595012 1740962
13945 1740962 1607375 1766189 1792095 1628276 1754388 1566171 1577589 1740756 1337208 1719456
13935 1719456 1226754 1594303 1673390 1742477 1481990 1330055 1292207 1587616 1242634 1224394
13925 1224394 1683531 1359823 1425247 1463673 1303752 1284910 1277085 1299152 1169802 1279679
13915 1279679 1094787 1221473 1402614 938161 1410224 1436018 1330147 1436522 1533574 1126127
13905 1126127 1295969 952020 1082326 1351596 1654459 1435103 1305931 920483 1262856
13896 1262856 995855 1220557 1423797 1240004 1129478 1475388 1110728 1271798 1282042 1241993
13886 1241993 1009401 1133803 913831 1135396 1067850 989067 1106496 1312947 1121725 1465503
13876 1465503 1020091 568863 1292735 1360268 1153814 1147685 855252 1011326 945344 1222067
13866 1222067 947390 1055137 1021915 1166186 808595 769436 822283 1281860 1063218 955806
13856 955806 928940 924797 1104363 823227 576222 1181872 1261574 875816 703767 1318656
13846 1318656 817824 740095 1109974 744447 1065176 661363 923622 702547 976757 744311
13836 744311 823504 871275 916387 948477 740092 638497 977691 881126 837016 848919 1017838
13825 1017838 952039 909404 469662 617783 633033 707477 796555 981982 742614 820473
13815 820473 598773 868224 771156 742157 795684 720618 809123 885631 548987 659644 757592
13804 757592 969391 722097 658990 595820 706611 752208 678775 976138 950488 933451 603316
13793 603316 909162 857303 1051817 551028 676165 512012 805309 754808 675742 709515
13783 709515 487154 857264 632348 666764 761936 621385 672693 868587 685353 723841
13773 723841 426345 437428 587763 651850 695678 585615 788681 314639 481618 882241
13763 882241 966442 693780 685321 599469 616394 566128 605463 630859 672768 497130 489289
13752 489289 678853 496884 418598 459879 849374 518724 415996 695681 331522 273684
13742 273684 519674 195237 635789 189270 347148 719088 530744 420329 800337 515172
13732 515172 856791 374694 517389 664293 137267 250414 458463 964857 402492 564635
13722 564635 361582 287704 341185 362170 439910 500985 535915 428365 765645 87861 300552
13711 300552 763078 478962 588947 626795 348044 412412 449575 121853 423687 688172
13701 688172 568463 342781 490968 378556 607073 517135 439730 519526 380856 488106
13691 488106 639089 609582 560088 472522 553712 295218 579948 562908 465647 540020 603873
13680 603873 532771 182730 638076 531334 406294 275071 352600 474197 634471 478116
13670 478116 489343 405888 289553 292277 644067 451865 321691 653315 729495 152086
13659 480081 357318 581971 373246 436738 10029 609441 332729 371988 364055 550483
13649 550483 694756 541886 760142 200154 123847 400724 332840 521445 654462 140114
13638 181663 412105 335961 318097 430064 527011 453589 587670 512386 489174 256012 586326
13627 586326 201590 444453 -101468 472065 364893 220736 73728 202997 357897 70875
13616 371096 87711 256089 302463 514266 311636 378105 327281 51837 252671 291604 366991
13605 366991 450847 359355 411416 491296 434801 285507 166011 332422 653531 406904
13595 406904 535465 557809 504027 450228 451277 247711 246811 316790 332283 -15414 303471
13583 -115224 272113 202091 391751 712224 274630 203740 -66185 418014 -113547 590038
13572 477237 470385 282363 160684 172228 599497 356279 202533 391604 479061 242406
13562 242406 -60697 496509 395972 436306 281378 371032 278221 538782 180534 20062
13551 289144 459688 514876 330030 85171 364614 384318 480579 392815 267843 698015
13541 698015 377651 566283 141366 -32731 232104 471006 154107 3719 195600 408436
13531 408436 127425 96761 441780 433409 468358 176957 211246 292168 275087 202475 233007
13520 233007 95344 61016 164695 10751 432447 317930 328256 342970 157603 201931 78360
13508 50133 317885 194214 276018 408154 211434 -98539 57233 238991 293313 481009
13498 481009 444340 252832 421731 80054 5554 180657 -49626 178748 416983 275995
13488 275995 146898 310935 -44531 225648 208402 380931 94151 291140 190627 231200
13478 231200 347730 296667 23918 -192347 402769 299884 273796 73016 213542 392956
13468 392956 213430 307812 115839 74203 268612 189450 638598 57167 97829 241151
13458 241151 97748 182559 468932 178436 133493 201863 144216 400856 -258703 455456
13447 158002 367739 372976 214210 507509 109257 120359 212465 308080 316877 322198 340555
13436 340555 449563 222998 -64569 221607 49303 243505 126755 142156 155181 45745
13425 99973 69894 261121 325551 263639 157403 -234438 251514 -246860 220465 420353
13415 420353 508279 243818 149206 124284 212546 419896 150653 120662 175935 58993 290328
13404 290328 226005 87134 272215 319875 167581 -124627 86428 27933 211183 -52972 -119206
13393 -119206 224963 51597 217792 248258 259899 175152 -11750 138694 387786 20130 229046
13382 229046 -63527 -33314 75466 151457 173554 -102523 38719 304263 -24095 160708 378233
13371 378233 -50085 245164 487238 166455 39759 454732 438578 109886 251327 311780
13361 311780 -15452 219627 -72733 -54596 179566 126322 187149 226960 319846 37139 498578
13350 498578 555016 428601 -58427 74958 751761 79454 189465 318222 110040 155200
13340 155200 227708 95573 104163 36351 160008 236645 143832 50092 226860 575092 -81404
13328 -76007 368705 261413 23804 87740 269950 -8108 299172 -128217 297250 246360 194398
13317 194398 235186 284554 39415 37527 293007 -21524 237378 246660 339908 164329 157144
13306 157144 -52600 -133357 241654 173065 272179 210850 176715 316361 320160 191692 220507
13295 220507 421998 206371 -78650 66668 197904 108068 115654 8368 -113577 13469 -45347
13283 300763 181119 398958 47920 86721 -123991 -144804 238967 219621 265698 206648 95218
13271 156955 -299499 343342 173625 203154 -3608 180727 -63717 -71055 187325 -227868 118054
13259 197533 281425 267895 -22495 161782 102698 202139 129980 -229003 291391 236335 -59394
13247 137714 -45578 251467 103854 -126041 110818 264724 212462 27906 68817 454075
13237 454075 236887 -101853 165400 196138 13274 -88252 236529 -151359 147709 -333799
13226 8369 207769 29692 -174529 -17260 309780 314114 -85812 167090 312870 -24338 -150377
13215 -150377 -12013 85160 28816 35748 174794 338706 388591 -157037 -75562 139146 -246724
13203 -140766 104060 526134 -295857 89537 526541 101543 443680 448735 28197 137948
13193 137948 -1460 78585 437699 -36808 -147397 80248 193937 96481 116107 -301453 -18280
13181 147220 318441 81281 315114 271814 428289 32881 107982 -39478 80288 22501 -57323
13169 25005 57740 -43828 -112776 308976 36560 262519 -48293 -74166 320265 355091 375467
13158 375467 90946 -97531 -72771 49538 -380099 5302 187835 78251 -39851 -198123 112224
13146 473949 149817 57238 -7672 109244 141161 -121579 -139800 -113311 29820 191117 483573
13135 483573 -115956 -35562 189549 3943 -44226 66913 -201733 174989 99970 35382 27597
13124 27597 235155 282346 108257 146960 423710 67291 325614 -27555 61457 20511 -91979
13112 -59124 -30847 4261 -133444 281174 -134961 -56829 -149316 -194115 198993 258883 79576
13100 257092 -77290 188480 122935 -169626 -27537 25567 -133516 84496 -46750 13948 202549
13089 202549 -16296 142698 132789 357785 91293 78756 -86556 203289 -246727 58776 -40228
13077 116790 -365732 64267 -315692 281439 -110405 111321 -69284 -105351 -22844 -54431
13067 -54431 35887 71156 261580 26095 226396 328532 -143241 -42866 206590 23624 -21860
13055 248106 -51562 223739 -92817 -25787 46689 -12372 126242 60801 -293798 198480 -31630
13043 204685 124203 239 -178991 110254 302351 -221830 166009 165377 162125 356964 81350
13031 367834 52378 549741 18541 -186513 166393 119616 64975 28981 159121 84114 11390
13019 -95992 147859 106115 7625 119027 291613 -82149 327117 237914 144459 231502 208649
13008 208649 -116529 78779 329144 -376230 -69249 415543 237885 68723 -129599 -116354
12998 -116354 -29072 192076 273409 68053 140536 116799 15206 129357 97921 118783 284510
12987 284510 294354 106532 -218262 56884 411367 78663 5899 283752 -222471 -101497 -136588
12976 -136588 -44818 136757 -383734 -203475 -246701 87294 -64828 -87134 90044 179992 -137503
12964 76115 277450 -305351 -58751 -1432 -206292 325466 -33750 573655 65014 229660 153558
12953 153558 -141881 209168 -245383 143484 -86466 57486 -72988 -39845 -81419 59580 -239522
12941 -426438 -208407 66207 -208549 25667 505379 -177303 -127107 134142 335933 -244999
12930 -321820 -217445 -235924 41769 81234 124896 -166026 -259965 6239 163906 225657 87613
12918 317016 -62815 36401 -68003 -109237 251909 218963 -58769 -113198 -155074 316718 58483
12906 -36299 268799 108300 207419 37193 278050 -98392 -282489 65469 -215685 -133728 -135906
12895 -135906 -96609 237643 -29378 78688 33324 -49819 236690 150520 -51276 68360 82083
12884 82083 60473 205954 -38757 213085 90112 -228929 -84720 78101 21385 197467 8806
12872 -161509 -8932 -258070 95632 -16156 80721 -51896 -163591 83579 -45574 215145 -84376
12860 98320 114074 -73490 67792 51442 266399 -217601 -101371 -234043 184108 -47650 -69073
12849 -69073 47118 94826 122759 15872 -129879 -119945 63173 -9383 166942 -93699 -174337 250467
12836 -138156 -5022 206471 46707 205186 35547 288834 351713 -125461 304203 -145724
12825 -45812 -160616 22040 170381 -32373 13465 174375 229452 108322 -121892 187897
12814 30410 -268229 -363000 86606 -133444 293961 -170564 -204411 -18896 -48356 181923 -39900
12802 66271 326297 147815 477201 102938 -10037 -180518 -87668 -232989 42197 -273461
12791 22640 181452 21902 229867 -170843 41626 -79517 187067 -265902 112537 117101 -142063
12779 -45453 -88025 7660 -96985 175208 77742 -252519 -46074 1760 91770 -254755 -62893
12767 376129 281943 1821 52969 148544 -102052 -18965 -277026 195192 -276842 -164764 -97344
12756 -97344 127786 -65844 22876 420155 69605 -46596 198513 220169 28333 242142 40862
12744 257158 179919 -236419 221585 162932 -88732 120421 287625 138193 -56272 149300
12733 231692 180446 127694 262114 -31980 142503 -152724 -168453 -275459 -264721 95873 14614
12721 -112630 -2732 -60817 336584 -174514 547 -42812 10134 65279 -199881 9886 251711
12710 251711 -272234 137197 175465 355775 -31134 -26160 42866 -13494 109708 348874 413482
12699 413482 197160 87447 285312 -155359 213218 -218943 -262210 244456 -61618 25293
12688 186458 -299782 128050 -172336 -129037 83950 -267073 -114875 34008 188037 38198
12677 60345 321908 -4923 -131368 123898 -45850 144958 -50441 -39817 100284 145524 94400
12666 94400 30314 -85834 338056 318728 235124 199537 -215436 59626 -27532 102500 312017
12655 312017 217719 187351 -191892 205886 -85975 55720 21879 -73420 238926 114004 227153
12644 227153 345462 -159988 84591 -183069 -54340 122752 419062 9146 -31146 208726
12633 -2528 187135 188034 -2047 -58370 90222 -1884 141649 176259 342514 127465 -55133 44086
12620 22909 -121677 -66525 -994 191594 22082 -177820 55687 27612 -39926 -73689 263748
12608 -90280 283436 300759 225031 54153 246819 -219970 -293749 1927 173709 31336 272756
12597 272756 101552 85375 235645 105745 -234668 142424 111417 163273 -23936 -111932
12587 -111932 -110781 -28874 -163684 35448 218770 231815 211115 272652 -145161 -146669 -181613
12576 -181613 274665 115922 153094 115773 187338 131876 -94493 241593 133096 -225524
12565 -19710 55205 -9170 -81928 88374 148650 227763 20595 231282 -40472 113421 -148019
12553 -301883 -244942 8892 -2829 103474 210603 -33929 3099 -209367 -49414 -167 210156 149162
12541 149162 -206731 -302595 -112653 -78579 -91953 -193849 62794 -251406 298270 15266
12530 242502 106667 -7268 286176 -40967 153142 -145169 36590 51797 300019 -254926
12519 60340 -300971 247127 246200 66511 248281 223294 -33276 100289 -7129 -2065 185625
12507 114002 41771 132724 -216146 93527 -95916 -204475 -135339 -208133 -437648 62584 -84931
12495 -53053 120709 37797 -80272 102102 7589 151666 -145984 19446 -305506 -78354 70862
12483 -240224 -180276 -239500 -25765 7936 55851 -50363 305144 -126593 163851 -380217 88652
12471 321351 173278 54106 253444 -273641 -406366 -160130 -177535 264957 -17836 -323232
12461 -323232 -91735 47257 87468 340504 -43423 -108641 103125 390008 -81823 -266294 -76754
12449 -229584 -36645 -35374 303281 -182918 413402 -147696 -230818 205258 -161112 197734
12438 129927 304432 -336329 -57678 138551 -134038 419518 -96302 -285467 -108578 -158252
12428 -158252 -52737 36423 400855 -192670 107995 135512 296130 126616 58334 227150
12418 227150 207694 7008 181577 -113732 -97194 191694 223590 169795 -147498 -32470 389917
12406 170938 94644 82125 -363844 110975 49629 56826 -453374 142131 -108012 42381 -46776
12394 218525 -20723 267633 -123727 -469458 -100486 307096 -12222 28183 8809 86185 220929
12383 220929 -82251 30953 -93617 118423 -303776 343368 25977 85327 -64270 -198 73325
12371 -168448 -48927 -228935 -45605 135176 123938 363343 -482614 388573 -26235 28549
12360 261289 -9294 111461 223513 -184032 -232548 172455 71289 -240240 268495 -53662
12349 113608 47245 204970 -32000 -162757 15433 108890 228034 11774 230425 -217467
12338 -80076 48746 188117 -192088 75027 -39574 34241 -38095 172023 -49272 330090 304034
12327 304034 -323690 -203153 -40698 -44638 115956 -113522 185098 -68114 -176246 221218
12316 126062 43672 -125543 22208 15040 142142 84444 -265169 240541 -80233 -966 246513
12304 248490 144193 215539 122807 -341076 151392 233180 170937 108854 -37073 -318021 -129255
12292 -132448 170962 74477 -27967 -36639 -125824 334786 208004 24887 127567 203033 219669
12281 219669 303710 241468 -112038 -18525 185182 -55315 114754 -76267 550709 2932 344762
12270 344762 189543 228626 -7127 -17737 -18842 36870 21987 121858 225446 8018 128992
12259 128992 295330 45924 83987 41007 123370 84125 165171 -15087 -204924 -127601 222874
12247 252544 354100 287627 113895 88936 104249 96297 -76727 -16300 415116 147116 61594
12235 7026 57431 168312 25191 212675 259805 288930 148297 167398 171559 98130 79301
12224 79301 424581 510347 168040 360714 5204 207770 139264 352953 159466 518398
12214 518398 189811 286263 323676 -14887 196155 166578 -186367 43702 216882 215160 162230
12203 162230 586754 246414 -62611 -14096 96716 57318 252117 181062 162875 -110036 190151
12191 133310 135947 428107 55633 236238 66611 -175580 232971 157037 249406 64620 120354
12180 120354 -58196 193106 102356 198315 -14237 93042 -258294 509320 96508 -54565 96563
12168 93178 119567 34369 327907 385911 440031 297507 8280 36260 -137324 2051 9546 -18903
12155 18137 54633 -68423 155272 -203240 -41083 402919 415126 -191571 114937 72229 -125704
12143 206032 -5087 66727 113225 6339 -141907 27451 131714 66731 204232 43319 139980
12132 139980 -1378 437606 67625 70463 252190 43431 -135079 -37276 -77742 85373 360230
12121 360230 -147707 53033 44387 92935 31684 -23557 216684 -48293 -140006 442115 203287
12109 -12132 72302 13811 23080 141155 -73936 -21891 32794 -13274 -270484 -214311 -153813
12098 -153813 -91676 166447 -230151 238345 -161665 19067 8869 -135235 122127 232482
12088 232482 15472 -245440 -110365 -33419 235108 -84364 232971 712525 605919 1841341
12078 1841341 1133445 413015 183391 -81178 -60542 -105885 -438252 -80001 647423 162198
12067 -157840 156944 102695 -242929 -66653 -348805 -194107 49908 140412 68024 -40912 145291
12055 14010 18104 126338 421091 -354240 -144933 -138678 -90266 -90484 -63903 -1348 59494 114509
12043 114509 -154579 133935 -155495 35078 -144778 57139 -174220 26173 -45972 -312789
12033 -312789 87280 209395 59670 169004 -425970 -112155 140913 14857 -181777 -84094
12022 155178 3902 142018 -190159 128623 14052 -174576 -89912 25868 -14813 171296 239546
12011 239546 149947 -176134 -8399 1865 406501 56034 13899 3934 -139595 -25738 65260
11999 361962 -235834 -173735 258293 60735 -88031 -282120 -1398 -85594 333351 -172206 178839
11987 71692 58336 -28556 -128769 -64136 -206461 -114402 121689 -156421 40071 -381729 -71551
11975 155716 65662 -180603 24589 191801 -56944 -182256 -209957 67394 169798 -64671 17421
11963 -126858 -32030 11277 -301793 -168309 -123956 -219744 203046 39763 85345 173426 -210745
11951 75250 82204 112559 69078 -29591 63545 107019 64917 146247 -197071 306768 13564
11939 -364895 -194566 13128 -76363 354452 -227315 -395943 218127 264409 -91248 229306
11928 239826 608688 -270642 197387 76633 221050 -305525 -269135 -193863 -7741 -193995
11918 -193995 93779 -240395 338133 172515 -456644 54042 213737 -83414 190797 -61547
11907 167617 253255 146945 40836 275405 -189789 217623 -5364 -44993 -86268 -156234 -183204
11896 -183204 443908 86176 -368256 -243543 -208293 -201496 -211356 -214591 -148326 -149218 -14580 -232309
11884 -232309 135017 -126605 295648 -38150 57516 -21063 236501 146533 75118 175723
11874 175723 -215677 -112508 -138363 -17434 92189 -21753 -49594 -93458 -163569 167064 -174751
11862 114943 69142 -27605 -177684 111883 -255831 -117899 -198664 136669 95618 72434
11852 72434 43335 -98523 -39428 -62889 -318386 157150 -207977 -86118 117647 157357 -81066
11840 73216 -222459 -118586 -11203 -181089 -188995 -39889 122417 206266 -372034 20472 -305497
11828 39775 -125767 64739 -78786 23988 -91446 -257650 263559 238930 -142916 78246 -14462
11816 79926 -123255 -290407 -17155 -90307 -10681 -124317 -126236 97521 9466 37166 -12260
11804 -64964 3623 75753 -170440 123512 -389098 101900 -291798 220260 147277 -212850
11793 58031 -223559 217214 96536 129036 -420339 15024 53192 -84364 -105480 71911 102830
11782 102830 -286661 -133353 -27547 -126273 -54749 -212387 -107561 22667 107610 -47011 -90449
11771 -90449 -62009 -363723 -15085 -29176 -11853 -240062 -164678 105462 184469 -481427 213997
11759 6174 -144568 -98060 50782 -60255 143555 222737 -43546 -292778 156719 -113885 101263
11747 -57913 -124237 87904 -65071 23880 -220114 -27723 196179 43894 -42870 108321 201866
11736 201866 -109523 -84364 185023 -98347 267093 -35427 366972 95899 128051 224536 62722
11724 176609 24006 -11309 187011 -238103 -33647 -61458 -148866 2147 -77524 65109 -25107
11712 149055 8337 -36543 -65148 59254 297463 -415572 96865 -200993 152036 203115 278345
11701 278345 84926 228689 -51754 -202194 -94220 209462 -79734 -122731 7908 425427 -137192
11689 -84563 41246 293957 -235746 250845 -283415 409444 372597 435174 295109 -186242
11678 95797 -35606 -239199 -80440 89040 -38725 71863 450914 159094 -81776 -281851 -98195
11666 -361805 -95841 76051 -200052 -126382 167235 29533 34634 151507 148977 357311 -80264
11654 66226 29544 -98035 274433 -80004 -187037 -205684 105186 70084 -60530 130610 -187301
11642 -69404 263199 -8533 162087 -10924 -154737 145566 -137601 150058 -138315 107084
11631 117595 332491 -60057 -27590 -223842 -42152 326998 145171 -105941 -242424 238771
11620 -135329 524917 -95291 129493 -8063 -77500 182722 66833 49338 -53782 176075 -274714
11608 -87935 91072 -74689 25741 -22941 315734 -90043 276588 513055 27037 377337 8534
11596 290797 27606 27450 50968 190299 -191614 -49898 229245 287822 134305 -15522 188510
11584 -171226 217587 237390 -424929 106006 115269 262232 323890 88997 -21183 -72632 125466
11572 237198 -32834 53255 168473 415306 -157115 10978 205999 47854 -115881 124280
11561 233000 218872 119932 172595 97958 198168 -104749 233066 155455 -185403 111021
11550 67582 -45289 133381 -197118 -189051 278838 44262 -38155 -55607 409961 84841 -44351
11538 -74299 -46801 74823 -6560 -184526 -102087 -28354 424532 335983 -12588 66308 376634
11527 376634 -32357 -182883 76245 124482 300633 178516 -22244 -113338 -152377 -33214 38437
11515 164961 18091 212285 92514 -204598 431699 -269670 -21654 95647 -15520 -97511 181637
11503 161927 120713 263113 120927 -4207 57407 144472 -16721 122091 214435 -251865 240539
11491 -15631 180670 275382 -139816 94208 97024 -14895 108635 39650 75823 214404 258078
11480 258078 -133022 239831 289975 -80267 289927 -116380 631395 46711 32133 105269
11470 105269 8479 11247 46964 68772 -198743 407837 67930 107178 -37841 -96629 -210886
11459 -210886 -10492 330409 126476 191850 147841 463629 63762 350656 104554 -82098
11448 50886 -48023 82412 -147556 364320 493253 167988 20667 -222461 92519 202403
11438 202403 262415 218020 47705 -39474 178437 117710 -159949 -33727 77483 -208003 13573
11426 -113776 -65974 -26860 -138371 40278 -81937 -93147 -156060 -12725 -487228 234869 90707
11414 166702 131827 118941 -195898 -80208 401300 63912 185064 -394957 217570 -13074
11403 212801 -177086 292206 169494 -314789 -117664 186499 183474 164206 256615 -11819
11392 -19043 -117535 -294446 -278973 154797 -323558 157016 77497 -121789 -163741 129954
11381 -52432 -46216 -40536 269574 260172 398579 77499 248523 -27102 -191580 55693 6979 -160768
11368 -265280 192863 -277992 102168 -136249 -48577 34354 47819 186131 -96096 -204386
11358 -204386 148733 -192239 -244603 -200048 -317693 45316 -33624 -109858 201146 -451 -32925
11347 -32925 -208949 -16276 -289396 -114248 -46278 164006 -142966 100873 245359 -3365
11336 -344727 -45622 -509275 -196427 119109 51324 -100412 -125109 -327496 -59998 107101
11325 -124403 153198 40379 -84437 90261 140541 104055 -163968 -40654 -35155 -108754 -169563
11314 -169563 254591 97316 192438 -134472 -33533 42196 -154443 -32165 44236 -151623 -66928
11302 176147 7594 172592 -24650 65734 -267918 -397930 -204461 -257939 84366 -171805 25046
11290 -63698 29699 -7625 -106050 245474 -342756 127407 -62674 29992 -188920 105597 -80512
11278 16860 139914 -151487 -21319 54690 36440 -255589 247339 50491 258150 -42614 -46783
11267 -46783 -14244 9767 -140868 93944 -109876 -163409 -211990 206661 65320 -33818 -145165
11256 -145165 -151380 139035 -16230 -91190 -206015 -199648 64279 59775 137252 -184300 -301665
11245 -301665 -298011 54409 -23930 195456 -122993 58965 81058 -139963 -394970 4913 135065
11234 135065 -100807 -35249 -36716 271261 -252929 -127799 199894 -104451 -347586 -165905
11223 -102740 50612 -35975 -28171 -90 -76607 30331 306094 175451 -174775 -61782 -294186
11212 -294186 -79503 -64604 23380 -25770 217285 -307148 90087 -28866 161933 -84108 36418
11200 280792 -175522 43080 -93122 157303 -293931 306621 -59358 -213784 -150850 -171589
11190 -171589 194041 -289567 -50154 -49542 -274490 -29850 31916 -62372 -46926 -31389 -104339
11179 -104339 -193197 -54342 237765 -400838 -182352 -130261 -133089 -165255 5612 430967 -187650
11167 175672 23767 168893 -112669 276648 -183235 14408 141945 -292905 143644 -35128
11156 261419 -46088 -66859 349839 9968 199422 -190460 -84672 -143329 -208061 120407 -377324
11144 109711 159462 -100902 38425 -9332 -236704 224209 146035 261573 20784 -150701 -64913
11132 -115871 333729 110555 -103598 176517 369683 140777 139451 42493 163819 116274
11122 116274 108847 216940 -1693 -272 105147 336687 -61756 -15799 70226 128337 37047 -199357
11109 62251 185883 -2703 13174 101745 348460 74698 393046 146071 158621 147301 133315
11098 133315 37542 329417 63284 -20081 -67873 190454 23666 175283 378782 2893 235941
11087 235941 263398 344851 87859 183674 -4138 445087 249682 212012 94906 223658 228737
11076 228737 -43305 363971 293543 -35580 532854 270030 55877 584645 351539 252917
11066 252917 292802 163991 470993 531448 335308 367780 454759 434689 541597 470821 757286
11055 757286 771731 502114 993923 571978 789995 300530 543079 512882 804812 525929
11045 525929 429197 449012 617031 694148 753987 897399 551712 837296 873963 470413
11035 470413 627415 601836 645203 700368 540512 690811 725175 875286 788378 468188
11025 468188 476140 590597 673527 154522 576962 529535 645073 518268 567018 832035
11015 832035 447594 194883 940401 544173 511339 556160 472649 760193 337358 502932
11005 502932 522838 693358 500028 404180 617671 694682 466505 423033 789186 385985
10994 737492 588763 508140 755787 432976 943924 598268 626754 714019 990227 903198
10984 903198 1040937 1024129 1012277 1008749 879955 1384527 1474116 1541954 1691607 1556606 2165329
10973 2165329 2394934 2413274 2612776 2563249 2775448 2574132 2422172 2373331 1763326 1599302
10963 1599302 1387524 1632644 1669522 1507895 1615899 1929167 1876870 1551313 1738520 1617822
10953 1617822 1785799 1381745 1245493 1093184 863706 721203 750528 512485 345031 182908
10943 182908 325442 237135 369821 303005 250279 202542 80143 78065 -113702 219084 28259
10931 -346844 364221 -122548 243326 -141360 132503 67545 30621 49948 46424 241590
10921 241590 189318 -180527 220263 -305521 231482 147918 180141 183992 -162216 299235
10910 143064 261391 -135566 41642 23039 -367920 112209 -4157 -26904 -228830 -99892 -188243
10899 -188243 -184964 -126950 -6152 271039 50254 37794 244001 43731 94964 90778 -75061 -51281
10887 -51281 118244 61347 -421070 -236766 429678 146362 148669 -146036 71380 -147382
10876 -206675 -442200 -233833 196448 -247911 45697 -3108 13992 119428 156524 -46405 94409
10864 172362 -1536 326252 210973 295142 -75357 -133710 -69573 -152539 152172 206373 -110625
10852 -201661 -146079 -221751 -321279 -340517 -17038 -370892 -177946 -73222 186362 150047 -215775
10840 -41871 31369 -6207 -14941 21490 158098 -138871 125440 11578 -111484 -147213 67147
10828 55091 -53052 -285545 -113268 -97224 86099 101543 -74303 -49563 -105767 196094 -167162
10816 -176952 172885 -225403 186770 212438 -325008 143500 35925 -104731 -63126 327593
10805 101302 -364984 -265228 122217 196283 -21964 -106932 17337 -188437 -93451 -180708 -172279
10794 -172279 -73904 -100907 71249 88232 -153223 -26372 14899 -78174 182875 -73898 -334373
10783 -334373 70404 -270606 -87143 -97282 63185 -236046 -123400 256219 34581 10868 -59640
10771 -106054 -103924 -137889 424826 114055 -117915 -248958 107264 -118783 31631 -308453
10760 48944 -254064 -110439 -171950 -158950 234826 -301890 7203 189132 -108753 -468624
10750 -468624 -199409 -158802 -159831 -383937 -102216 181000 120408 212200 -187039 81348 -70148
10738 -162750 178660 114722 -271345 74164 -57953 -298696 -106727 -119521 -253300 171413
10727 -323286 -243115 -136545 -178816 -273428 -61889 -37899 26781 -164123 148887 -187865 277135
10715 -51557 -440682 9409 -13161 -227688 -45091 -79050 -197533 14388 -194833 66680 -178774
10703 -197737 64093 -124472 -88377 -227821 -77885 148289 -245784 371095 129873 -267803
10692 163571 36088 -20818 840 31269 -28056 49964 179780 79893 -182708 -629 -301630 -119705
10679 2523 -86172 -217846 59473 -135729 30856 357862 194910 -38161 -77868 -41000 -52369
10668 -52369 -155041 -205638 317959 -28638 104114 -4875 8097 -99607 -4289 190077 -157280
10656 -281557 158322 -201023 209028 -337787 -100179 -125772 2344 7553 242184 86766 -226190
10644 463651 -119632 -340958 9249 -217524 213880 -74467 105699 22041 -128083 -259097
10634 -259097 14176 -130389 27192 154205 53547 -153148 68862 -107746 -61868 -89027 7645
10622 -280735 45692 -81282 -186807 182470 55461 29929 270930 18880 30290 21313 -228004
10610 -9771 -104031 -303841 -24201 53607 -191350 -499331 67941 -92350 54051 -273739 268695
10598 -65427 -18253 -11525 44124 166817 -170035 -229913 -125256 214915 212803 -16609 -177923
10587 -177923 -229798 -18250 -13684 -78082 -70766 -6247 -161502 -156571 20953 -105580 172368 49944
10574 -336486 -187916 -84482 145265 -225615 27802 -167008 -91017 -50081 -51969 -469363 -184883
10562 -55293 -94336 291981 291065 162597 87597 186602 122053 -451503 -113985 -69852 -23077
10550 -183893 149859 -30951 -93814 -196403 181100 205736 218268 104293 -82414 88884 27011
10538 -218561 -172712 155918 -65856 25810 -69119 -19191 -130997 -230340 -37284 -14238 107179
10526 213486 -17280 -92374 -93813 -313960 -30986 -98762 97169 -8784 -185925 -7687 -151052
10515 -151052 -97954 155556 113220 -95040 135011 -76684 -387480 -361443 -351045 -155110 178301
10503 174163 -104394 -754993 -9151 -216955 -164425 173914 -205907 104236 73181 -75930
10492 71721 -534385 -96324 265308 150758 206280 49387 54466 178587 276629 149881 220671
10481 220671 309400 415743 446967 358707 413464 124289 207404 -171954 146056 225955 208475
10470 208475 477 361320 28884 -225157 30686 222763 277733 -1666 -107082 -119690 -6994
10458 -175494 231728 152517 133569 -74665 -103993 -253310 135845 -278751 -155718 -196307
10448 -196307 -335191 188287 80083 -76721 177256 -158792 153742 291384 61941 85511
10438 85511 -186837 84969 -13304 -52839 -301668 74172 -101305 -65314 42147 194538 28913
10426 210605 228483 -35053 48713 194784 -111499 -30010 154537 170478 -223491 59185 -103598
10414 -149962 91846 -32599 47284 24452 -161859 -206493 -152852 -3393 56380 -92665 88748
10402 -97551 17401 92151 -98226 -273172 83612 12818 90151 -14128 -104214 9225 302416
10391 302416 216644 31112 -142138 132719 307513 496353 -170129 -231965 -186019 318193
10380 -77330 -217615 184239 -114636 197659 276914 -77765 256759 192827 318586 -25093
10369 14794 256678 474780 200795 654012 814945 313557 245035 345139 23320 475363
10359 475363 183962 59765 -123900 363178 -77299 234053 381035 438268 367654 331841
10349 331841 646865 528048 227214 245831 269710 504927 687696 742661 188136 217347
10339 217347 188945 19116 242835 118022 -40215 171148 101138 212953 31523 202468
10329 202468 -158519 259630 66307 164515 192087 285629 280002 80562 27314 386679 32979
10317 206738 400278 133714 -12426 -12407 367374 67646 363336 -134271 121329 -39400 -31825
10306 -31825 13160 -279885 -226797 41531 -256961 -51 125358 161027 -40604 132140 -213549
10294 -81699 -257439 -287299 156694 161773 -226364 43394 -192671 -183830 103678 20916 -275927
10282 -114003 91355 -278181 -328668 -126390 345236 -92379 -308203 -220090 148623 74613
10272 74613 -105624 -13264 109321 84472 -240176 -222532 -68497 318033 228907 77392 -344330
10260 176243 489310 433121 172870 83134 218991 150525 153566 351724 112153 49752 -179636
10248 -136745 -50912 253658 -222808 -98609 -140442 83519 83768 -384279 55607 31740 -52934
10236 305803 -146392 -215598 -285985 176132 256145 -24284 -95143 -112736 68987 -193755 -181715
10225 -181715 -162554 91686 -47067 53078 -18491 -344265 -157577 267461 -55642 -105614 -228972
10214 -228972 131504 -251549 -217540 55766 6322 -48448 31089 -317781 -364726 -11800 71650
10202 19309 -354768 54092 -105715 -245658 -16186 121416 -58251 21631 83893 139250 49516
10190 -20815 66326 123550 79342 163129 -197908 131886 -149123 -243190 39408 -412717 -187153
10178 27627 11983 166797 -218965 -319927 185076 -32194 342498 -215571 -153557 -517532
10168 -517532 -262310 8437 17032 69953 73833 -189080 41905 -104088 -251116 -14367 6548
10156 208262 -147277 -162004 -93525 -227957 79379 -106353 -24836 -372819 -162324 -157154 -14046
10144 -235628 -211085 -279298 -384735 279713 -87402 -175175 147337 -63751 -181564 52015 14624
10132 -123875 -39482 -42100 -209406 118510 -268086 -126319 55686 160562 -71380 -138008 -191683
10121 -191683 212073 360088 -163569 -313700 41694 132401 -32209 -146714 -68258 -256921
10111 -256921 -255280 -3472 153879 159805 -22299 -178508 239083 -80768 344833 137838 -97084
10099 9781 -268605 -25607 140571 44153 -92234 -199839 -206831 -26773 59201 -2541 113484
10087 -45938 -74782 -82620 91433 193269 -110304 154209 102517 165881 40962 73884 -427408
10075 330692 14955 194087 141978 44320 141689 -256297 126603 -17741 -9429 -289889 -192368
10064 -192368 -394892 24708 23791 -108174 12138 -88145 286793 -82898 36332 -125241 296490
10052 23650 -229058 91189 -103627 -58156 30607 13963 -58873 -11746 212589 47197 125490
10041 125490 -140518 -294568 -524752 -353750 -55821 -132707 47322 -234378 -514127 72475
10030 -307770 -266357 94840 -191581 -279687 -341898 201523 -165704 -347462 -157712 286456
10019 -94863 -259668 -309834 9839 -68039 44609 12837 43458 134901 -149029 -127587 -71063
10008 -71063 -194134 -80748 42880 -356220 237829 126807 165901 -24395 55585 27975 -70455
9996 -233310 -247178 139492 -11481 -257894 -75967 -5273 -391460 93101 -35307 -33080 1602 -132739
9983 -127351 24991 -96843 67786 228998 41416 6984 -205635 -315420 -98175 -393754 -180267
9971 -106135 -32779 -81001 177889 237478 300965 -97749 4992 -4021 101901 -175354 19827
9959 -5555 185337 30298 106703 15753 67197 21012 -56877 205036 -11570 -80705 16457 110966
9947 110966 -317777 280 -143932 -95039 -163212 -365889 -40001 -2808 -83084 -332113 -37156
9935 -203455 273226 10877 87728 80072 44812 16675 -52378 -165155 -33415 -154543 -184411
9924 -184411 308345 -91382 -258439 -41304 42336 -148057 132519 154071 -301416 -69611 164661
9912 -119136 18617 17303 27133 56955 26230 -68200 177579 -109101 -73091 -154385 -20399 -71822
9900 -71822 150286 -42709 54777 73796 -131143 -38978 27802 -25540 142255 -171841 -152394
9889 -152394 -41760 209175 -427998 -105956 -127124 -544606 -40125 -62428 -315957 -252430 235808
9877 -28776 -147713 68402 -289557 -90516 -96176 -216625 103453 49474 28928 269719 -311767
9865 -107177 131410 -85860 -245500 -13844 94811 -430425 -141906 -115146 -164556 59400 144416
9854 144416 -214948 -453571 -129204 -55693 92413 97314 -300601 178189 190655 -160304 -344172
9843 -344172 -40078 -281510 -40293 -191080 51544 68952 -95580 55779 -241407 -9795 -228551
9832 -228551 -46220 151635 270969 -140188 -99790 -397971 236730 98839 -215323 194360
9821 -51328 -163114 -235875 -251494 208044 202137 -221503 149242 14298 253620 122649 301004
9810 301004 -150000 -237730 -4833 -288813 64522 117758 224182 54702 123255 -159435 -123702
9799 -123702 -27441 -421747 -88478 20131 -253178 -142680 163102 -231891 -67265 -10269 -88752
9788 -88752 -61414 86908 -109213 -52949 -18171 -169338 -178169 113848 -222889 110483 22055
9776 -34885 237454 -233811 -352511 -91645 -109306 144137 292734 -215040 -65378 -55880 -80051
9765 -80051 -95309 -333237 -258790 -24912 192437 -32752 302723 -178286 202951 34870 229450
9754 229450 -29798 -342237 68132 -112578 221276 271903 -142385 373399 -14633 -334463
9744 -334463 23401 -241614 7575 -48582 130985 201267 -69141 -201020 -83406 -59291 -152359
9733 -152359 297218 46837 58224 -205026 -221601 -165337 -500437 -73406 97841 -86574 182269
9721 198247 -155042 173432 -120555 -338976 190531 -103029 130795 -240473 -158056 -151030
9711 -151030 13344 62929 -14431 -141800 -37686 -114636 -98699 -29283 -616 -264518 -110649
9699 -88317 -575684 20446 -39039 -232494 85280 1258 -45361 -131119 -208106 158174 -303536
9687 250335 35851 115983 -221572 -164636 -105244 -262174 59891 -11949 68736 -421294 39908
9675 37062 -278315 -367304 110104 -29113 293952 143860 -42838 103610 -143880 -193194 237920
9663 -105916 -4833 -235145 -391402 -293862 -258509 -125015 -36007 -72982 10405 -211197 5502
9651 81326 104992 25588 114841 -116768 -84771 51159 -137350 -188324 -177334 -243189 -134347
9640 -134347 -90930 -135485 -293880 -337824 83600 -52084 59683 -184464 -113704 80874 -59355
9628 -38946 -45391 -175974 56387 -343149 -464825 -152579 -1148 -12152 -92362 -72787 -61388
9617 -61388 -164476 -199186 -56731 303058 -125475 -333145 -345625 -5732 -229829 73771 -243636
9605 166298 4364 -21443 -58203 -184697 -195457 -308827 42832 -144598 -138975 123921 -58146
9593 2418 5673 21892 -396560 -52980 529464 258840 -393462 -154540 7491 -38062 219863
9581 -278404 54759 -320051 7944 92584 -311138 269065 109064 -58202 29977 -341413 -141871
9569 -113392 -13551 -339793 -408620 -307482 -167272 317799 -66830 -194750 -178308 102363
9558 24537 29007 78941 497810 375362 54923 -77756 -184644 -125309 -23163 99382 -353290
9546 -278795 11203 -199156 -29585 -217785 -198572 176234 -79141 -106636 -99405 -179391 -96283
9535 -96283 -123868 -234787 -236375 5382 49486 205070 -35229 -91845 -46142 394551 225103
9524 225103 223177 -237633 48361 -156517 -35358 -17126 128777 -308706 -8693 170379 -72618
9512 -7975 -157784 -9555 -107214 -29110 69085 67468 -334011 -306919 -10181 -51643 185416 -18778
9499 153144 -109086 10171 -82984 -339309 15395 -119462 -328110 42581 121825 -31543 -149230
9488 -149230 -399043 183399 -65669 -158908 -230489 -100309 -221104 -96791 -26267 240235 -133877
9476 -167058 -260605 -138021 68163 -308220 -62153 -110029 -446046 -56031 -82965 -59559 -187422
9465 -187422 -221600 -34643 111385 -178142 63556 187046 -184237 -235403 -96464 -75195 -263578
9454 -263578 -284586 177896 -17423 -136622 113502 20151 -101302 -316285 -262192 72565 114171
9443 114171 109585 -379219 -278032 -89451 73611 -378404 44501 -74822 -32213 117329 11029
9431 -231042 -256349 197128 -180240 -304217 44436 -218672 232958 -390473 -156702 364803
9420 -9394 -214138 -172823 234211 74508 59693 -277748 -143236 227323 -51364 -32822 -37073
9409 -37073 134551 -253092 -133297 -182043 46114 229672 53849 -309070 72638 -230377 -383184
9398 -383184 -112290 -58191 11191 351137 -54605 -477474 -240717 -58295 -81851 -100020 -177604
9387 -177604 72559 25311 -183976 244841 172392 -57462 -70300 45136 94767 102053 -338620
9375 -247201 -121811 25445 -35526 -126764 -192253 -53377 -16375 -97203 48098 206785 203811
9364 203811 -411667 -33478 -457313 57850 115850 15258 -70477 239275 -25952 -90847 -537282
9353 -537282 -114806 -9425 113256 60201 -430474 -266608 -341598 66356 119192 -36212 162489
9341 -58352 -282222 -301104 -297391 37932 -203740 -103582 -359001 -48849 78711 143005 -175541
9329 14596 57452 117312 -181261 24765 -33996 56434 -22108 188369 -271498 -14337 -152641
9318 -152641 104103 -70307 53441 -443748 215124 -222582 -266029 -51587 -883 -322326 -9147
9306 -287819 -406167 246061 -23228 182051 -234848 -180286 6223 -18190 29612 58776 -258452
9294 -350502 -20895 -75162 -481648 -212862 -116309 -256245 -206098 -76431 -88982 -121305 -113777
9283 -113777 -168689 176780 -173438 -174164 -119026 -150751 -180045 -77444 3977 143541 191036 227406
9271 227406 -83293 -231959 -67446 61306 -94936 35137 -3199 77486 62413 -114089 91115
9259 80661 -110675 -502275 13955 287785 -104359 327102 -9559 149410 13951 31880 110878
9248 110878 -242404 200485 89431 -84525 162179 64097 284543 -209854 -35308 -73469 -4827
9236 127256 -24264 104086 -192597 -331613 -135900 -358338 -164436 -35857 28947 147917
9226 147917 100200 -55083 -207008 -290447 -191593 -447643 101291 -244739 -68126 -57206 -163670
9215 -163670 221954 -100754 -33402 208621 -116490 50463 -209782 -236441 41056 -14184 -164990
9204 -164990 -204148 33071 -158226 -78802 -61560 -76897 -167374 -23961 -41979 -114831 18756
9192 -69970 -252568 -221047 66687 -381246 -102108 168434 -484373 289137 -150018 -63665
9181 48104 -56250 -205564 51909 77545 -51356 182790 -177752 -236070 -241357 -271340 -192632
9170 -192632 279755 17364 -201102 3113 196818 -281772 71081 37363 -326192 238419 -265050
9158 88012 6300 9275 18496 383642 -174195 222479 425313 67470 -356903 10284 39663
9147 39663 -193704 -157990 -50499 186966 56688 -171029 -46831 -80772 -100391 25207 -267553
9135 -52677 182973 16266 -84729 -221293 -41596 137202 -90303 -171300 -81143 53922 -95612
9123 -163679 28670 -426776 94722 -47049 -65907 -83113 -39680 188335 -67263 175003 43064
9111 -58216 5191 -152635 -115154 170060 43402 -346961 -54755 270484 68513 -396506 345311
9099 82553 -233624 -294756 -283505 60038 -45345 26356 133312 -234037 -305238 -58955 45818
9087 -216181 262496 44187 -251093 -282743 -305365 64701 20299 199269 99130 78873 -262732
9075 49863 48836 111529 -138403 -73416 105705 -51471 -271567 -116832 -158767 -21755 -183142
9064 -183142 -78762 47899 51970 51652 -65853 -274224 -320680 -244023 231710 -226951 3500 117640
9052 117640 98157 -192245 -43278 -321832 -267473 307308 111967 134319 57453 -358638 122748
9040 -78685 75399 -6922 -122521 -139282 156357 254835 -177335 -39842 163860 123055 91211
9029 91211 -356258 -20745 199494 -211401 -12502 -197106 -184235 108808 -215247 -114441
9019 -114441 -72146 177102 24945 87582 -143594 268438 290828 10747 30075 -228348 -287531
9008 -287531 -52784 8269 -272705 -68667 117347 85995 -87605 -284860 -285848 127056 45204
8996 150157 -97430 -29984 281845 -78540 -123189 18585 -76293 -101240 -59939 105689 -300751
8984 127138 212281 -260548 -128116 -166588 -104726 -18337 -2365 -219569 -86718 99926 -33946
8972 -198010 40145 -60807 -224628 294503 -80908 -106760 -230217 31205 -41052 -227639 5081
8960 -225509 48709 65840 88844 27461 -13980 80228 -105897 -46102 184218 -235039 -277414
8949 -277414 279900 -335438 41532 -276730 -484473 -176265 -23397 70293 319364 285104
8939 285104 -92910 -34553 286643 -94569 -79346 357086 187943 121008 -17046 131049 -126403
8927 392848 92392 40459 700799 724148 1597181 3779878 11300473 5406368 1526973 246702
8916 -55704 28002 84550 158436 30040 -359217 -24228 147206 111312 207096 290738 18892
8904 61779 -398371 -119734 -94806 119718 -85516 -216282 -195474 -195616 230019 118593 -27230
8892 -407066 161006 -60178 -141373 -18214 -69636 267772 198756 102236 -121520 -72941 -53615
8881 -53615 -288400 -16501 -293793 146859 -174830 200168 76153 146460 86144 -42069 -479842
8870 -479842 8424 -232033 -13401 -215399 -159592 -150873 -254592 -186500 -198877 -92747 -149427
8859 -149427 -182656 -237151 -382833 -60230 100722 -649042 195331 -105176 -67733 292648
8848 303231 -329496 -9571 16633 -209082 -136284 -132604 57194 128664 -108607 70861 228272
8837 228272 -99981 -186955 -48990 68792 427788 -171248 -231388 -205867 -308273 10230 -31881
8825 146267 44138 -10597 -155020 -185004 211702 63382 -119089 -138182 -164271 -267444 -110284
8813 106487 -17382 -32739 -206416 31166 95620 -8834 -95926 164393 424082 111767 211694
8802 211694 48069 20071 -124686 -346341 177767 -117827 -290612 99503 58690 31237 116712
8791 116712 32511 -311315 80744 -176502 -107132 -151431 -82315 68517 127176 30053 -177617
8779 68859 37954 -111455 83861 -30002 2604 136148 63246 82193 -30754 189584 -162326
8767 37728 -101672 -70045 71618 152117 164206 -51925 -121324 -10248 -31450 -107344 97746 85910
8755 85910 242209 121753 -162274 131491 80536 -15078 73392 -70451 -266300 -193152 302904
8743 139176 -41695 -5393 199097 -9477 -338687 3042 -254911 199364 -261850 23866 -88759
8731 -142072 43039 178178 131566 65869 -229033 -135491 1580 -267713 27488 1277 95833
8720 95833 -175948 -54185 185638 -96557 -141323 -20195 -162134 157302 -170492 -80575 -202210
8709 -202210 -190677 41126 -48511 19915 -101599 94037 -226717 -107209 18906 -181572 -115811
8698 -115811 -189914 -170695 -225943 97681 43897 -68460 145951 -98060 355393 72412 -134615
8686 -263849 -62474 174250 -91410 -158174 127433 63032 -278784 -154676 -137271 -182815 32990
8674 119901 -362690 -83295 -340175 -37419 74356 42258 -158507 85967 -243258 -207004 -114831
8663 -114831 300582 83353 327420 -153828 -242868 -12819 -78463 -95890 -97918 -241439 -366261
8652 -366261 -122997 -101649 24725 -113261 -226207 -256276 -258423 -20575 -57952 166261 -232993
8640 -61111 57767 4082 49395 4706 407927 -218404 253434 -300286 27535 -97331 -18757
8628 -73932 -103544 -35337 -181877 19157 142864 -16189 -63281 -91753 -130429 -40556 -198277
8617 -198277 -338415 -233469 272373 -54490 -187265 -136660 1044 -17883 -31575 83655 253596
8606 253596 -69820 -22447 -372005 134319 106673 -64862 -353283 -368952 72043 -56123 -363363
8595 -363363 -386057 -245084 -295799 -205622 -131390 -117215 116310 -312886 -103628 -127597 -251489
8584 -251489 -100494 165426 125575 -234236 97126 -30613 85893 45604 93411 -2001 -327189
8573 -327189 -154681 187180 5113 16644 -22418 -253525 96076 -147564 -134353 -13577 146281
8561 -34413 136697 83740 -165180 -159372 -26745 -128408 -233284 14471 283007 -128674 -151410
8550 -151410 -185773 -210478 -318598 -268560 -113195 -106486 51854 -235231 32996 -163323 -79083
8538 -13600 -31515 14385 61691 223546 -115295 61062 1506 -124763 -231907 69718 -277127
8526 -63100 255676 -142367 -206290 -106276 193338 -136750 21594 87533 -18898 -220575 370
8514 70472 38666 178093 -74220 -108515 184989 -275843 -66973 -151118 -130612 -109959 -420732
8503 -420732 246731 -288015 281507 154837 -194500 69124 121101 4661 -111517 -197383 173662
8491 -114179 -148117 271662 3975 -136192 -293068 46085 210525 -95920 -276167 -145480 -177155
8480 -177155 35003 -100600 -104810 148031 -13674 -214592 -448393 25854 177476 308795 88059
8468 175946 147070 -139164 -360178 -328058 19396 -110568 -80793 -125553 -204808 -262846 -335447
8457 -335447 -97357 -145358 266831 -38045 188622 -257292 -230094 145816 -40274 92846 177777
8446 177777 -165129 -150442 -222436 326214 -179509 -180122 -308648 -96538 144358 -144939 -322664
8435 -322664 -182209 -183895 84538 221305 120083 -202030 65124 128712 -97803 111968 -122790
8423 9413 73089 -327446 -24934 44497 2527 160882 75909 110146 110000 -19275 -51979 102971
8410 55440 -154201 43908 103425 214881 179923 150733 -178419 -281525 -19251 49015 -293545
8398 -21048 -57539 37853 132134 2828 146969 102230 137662 -95770 -50471 -87714 251693 -565776
8385 8452 278856 137507 -272440 -38372 41239 14836 110887 -50168 -174089 107107 -43744
8373 216015 -390911 -249909 -101010 -247193 -294249 -370396 -121537 -149091 290869 77439
8362 -10872 30711 80800 265626 -73315 -68291 -1987 111900 -153085 -260470 97634 -251778
8350 -102450 356368 128893 52654 -413060 439738 -203276 50066 44568 -336005 97217 -262841
8338 -8720 -881 -127571 -72773 -104780 -22838 -231958 -171601 -256349 274196 -167824 108908
8326 175056 133789 196529 42173 -228158 -257329 -460946 -227 17430 9755 24925 150505 -375491
8313 31054 135349 -11524 -116030 -31614 -24078 -117756 -293264 -21710 168747 -49043 31538
8301 36460 127800 -335289 -234830 -258210 13193 70304 -354206 -108849 36695 -141157 -315732
8290 -315732 27610 150414 20871 122732 -294879 -106972 -223470 -86767 -202935 166692
8279 200499 33399 -66241 57297 -345695 -258494 -6135 302273 -85648 -56907 18833 59634
8268 59634 -88519 -285489 73191 -253981 -287519 -83078 133514 -158954 59153 109846 -97915
8256 -170223 181003 -19640 62868 -70192 156221 -74802 -57627 -222675 -8503 46675 -396483
8244 3887 -133759 133619 16971 -98273 -60143 149308 109746 -53878 -310043 17119 -165020
8232 5070 -37728 -78513 2032 -44450 -63359 -44751 182151 220577 -61221 138587 -232288 -46808
8219 100261 130211 -157794 54578 137809 -36629 90969 18183 168724 81514 108924 -123384
8207 110744 186095 -279375 -222515 -140423 36285 253313 -71657 -308360 -125188 244463 69666
8195 -304159 -272487 -203596 -27302 -81834 -47929 -156132 -132996 -51860 175110 65509 -409661
8183 -220743 -154203 -180933 -34937 57088 122349 -112980 -67989 279378 -138690 -311469 -191037
8172 -191037 6288 94940 -41870 -344139 88607 254446 -250667 -193740 94900 -346843 -133407
8160 -177710 197970 -86855 -113156 -63797 -145610 -152133 -104293 -96383 141125 -259268 47406
8148 175535 -124055 119078 182369 -56794 -100391 -358588 21359 -58386 30645 -290593 212728
8136 -118665 124845 132110 -33232 141900 -108533 160782 5886 -288444 -64882 80874 13439
8124 -249391 -407147 -103687 -64196 236407 2823 107868 -79741 183770 -32338 -252965 -163320
8113 -163320 175762 142363 -108342 -310183 -323335 -113606 183224 -380209 -10794 162776
8102 -324985 -206071 -148881 91931 -64621 177649 258372 199706 333627 -173318 181413 -15850
8090 -176624 72907 -46796 -5267 -69161 -323292 -198824 -11472 43662 58714 -154339 -136882
8079 -136882 -58402 -355750 212460 -40923 -342101 -347484 172976 -3172 149206 -106190 -21468
8067 10747 -149504 57126 -16288 -210429 -2432 -144305 -20965 201434 -76942 217641 213719
8056 213719 -107446 133537 42676 150582 -145701 22392 261452 -70266 22318 37400 -80715
8044 -99211 279119 -24021 -6169 214519 -6468 53558 -182231 -182415 -220382 -66058 14072 94296
8032 94296 -170219 -139389 -57047 -138894 -197049 -159209 -101814 -308159 45797 137697 -177637
8020 -88992 176499 160930 -215360 162404 -53763 120059 -68512 64391 -48088 167231 -140723
8008 6183 -191088 164802 -337938 180706 287561 -345683 153263 -69269 -152077 -364901
7998 -364901 -171750 147014 88264 -179438 -119811 215750 -54395 41293 221068 -258103
7987 -149339 42922 339883 148242 -19472 -45417 -7236 -15291 -184170 83189 -331807 -189771
7976 -189771 -41635 59899 26973 -232269 -328590 -32247 126218 103798 -206170 -103391 -59475
7965 -59475 16164 66579 -95598 -392673 -118065 -82974 197519 -406664 305379 -127787 -246308
7954 -246308 -113143 101699 16714 -62536 38907 -48770 -214098 51967 79348 -378685 174253
7942 -255909 -51100 -230067 -25022 -496335 126744 -196142 -232103 355244 66875 -9788 -42038
7931 -42038 -115932 189891 -275925 106481 -176985 86752 -46039 -89499 216858 108718 153621
7920 153621 18498 382135 -26009 388497 -93116 195276 -164148 16822 -162839 -115238 -60158
7909 -60158 58581 -64558 -51063 -11964 -39834 -251271 -1888 307130 -99878 -31408 379443
7897 84527 136858 -115001 -121907 -53558 -104960 -23677 -173624 55112 -443702 -215308 193147
7885 34491 -40316 -123039 -60074 90724 -29207 321836 -189699 -173239 11571 52420 87601
7874 87601 200120 -127768 121377 -44006 -169768 -263385 188131 23603 -83443 20647 -33799
7862 -48066 307639 -32379 364226 -158345 -153914 25869 -12193 136847 114360 260908 -211926
7850 -264027 -67120 37180 -94268 -313977 -156694 137667 -188657 -195118 53746 -26414 -328987
7839 -328987 -304032 -56891 -167299 -136325 258589 -57306 -243351 -60610 218012 -75765 143895
7827 -297564 -207960 -119149 151325 122467 -105255 -44832 -188152 -99207 -227677 -181047 131970
7815 -125174 -254014 -124845 -267438 49341 -70479 25577 244817 -217529 12148 -107325
7804 -53278 -25098 112100 -224624 -172792 -39425 -85637 219185 -59190 -159680 42080 -416262
7792 -84195 34628 416655 -352185 396834 -26296 -149411 18706 201045 260310 -408705 -71556
7780 -115027 129950 -67779 57696 48054 -116592 -139000 -9055 -2104 -141634 -117172 16609 -30947
7767 91059 5650 -82560 -188793 -25636 6725 227071 -624728 140402 63773 -124900 -96767
7756 -96767 120277 -178540 -281568 -337437 -495282 97217 144545 -14012 125452 -382172 -384813
7745 -384813 -189757 49289 -89381 87127 -126699 -51169 140438 -52209 -21647 179772 151729
7734 151729 -77147 -20315 -93296 122089 15617 60248 171418 33342 102362 185232 94349
7723 94349 -114928 253239 -314722 -150362 168283 -207053 132259 -238622 146175 -299957
7712 131044 -236714 110672 -249267 -122881 -63236 -159352 -142362 -105749 -130959 -211304 -147102
7701 -147102 -122312 45779 185171 -89324 -148119 -185147 -338583 -37016 175767 -221837 -169620
7690 -169620 -135556 -40591 42686 63873 2611 25990 -141610 20476 -240361 -116503 145971
7678 -103022 -41756 53068 294264 236608 -42555 130089 86105 -19492 -118236 -113233 -19431
7666 39761 -174172 -141477 -9516 -155620 275705 -102047 180016 -305784 -262242 236363 -18310
7654 13213 140138 -82382 -126454 -51181 118861 -391929 41984 146403 -105363 5854 53964
7643 53964 9520 379534 -118513 -79438 175303 -177211 -90910 -242437 -98251 130576 24813
7631 46524 160361 -245484 28425 -71090 -173515 -191173 -25917 -224374 326194 280737 -195102
7619 -218429 155196 -43094 210968 -96820 -366856 184330 24078 -207183 147307 -12479
7608 197777 -69429 208375 45685 167406 210503 -288273 585737 -199738 305056 -332669
7597 236794 -172863 -102977 -135498 -2011 -173500 -29986 65325 -348187 431027 -133099 29247
7585 -74260 -143662 123824 -96768 174838 -193001 -199871 135078 -78769 -227918 -71585 199399
7573 42607 14333 42542 74418 297074 -81907 58403 96694 268647 97012 -208521 -178164
7562 -178164 52908 144588 101755 162256 -234724 -53575 193793 -263710 68961 -104567 2502
7550 141980 -254887 -16845 -101199 -142600 74554 -115003 -202459 -152933 -115904 11742 -68843
7538 -31519 -279084 27988 -314196 79767 -123634 118500 22793 9189 57236 79418 166943
7527 166943 -10043 113442 -38076 78306 -277706 -35695 -4108 168633 89173 -147282 230548
7515 -224240 -327692 122972 -163850 -33909 -171273 -215430 -74684 357432 -150645 -59958
7504 -14532 -68971 104112 -191808 -91098 -79300 -46554 11698 -369004 -16011 -300902 -177739
7493 -177739 -507417 -352716 56858 71136 -123154 100953 -78101 -64769 -266652 -106333
7482 -83725 8645 -106811 -256490 -29939 -83007 -79863 81128 71690 86758 -116217 20931 78873
7470 78873 50710 17640 320958 74055 -49349 -100420 69037 74670 123145 -120575 168667
7458 -317255 -255352 -28768 78152 -277463 -101171 -46379 -173015 -107526 -156557 89564 -143572
7446 -43571 -241333 -231435 -16589 -134541 -257831 214371 -211485 402979 -52891 229486 48223
7434 49509 72313 -264307 -19927 -161967 151602 133842 -188560 91357 -209579 -113107 37665
7422 -22351 379649 -150404 153636 33325 23143 -398 -43596 204418 -65928 -84436 -110121
7411 -110121 241276 150905 -112338 -268747 -207573 8792 -140529 65918 -109475 107048 718125
7400 718125 -172386 -63358 -26567 247222 19618 -88612 -181462 38096 -147921 87437 -217318
7388 81722 -59454 16893 -13185 359008 6093 96952 85446 36234 -257936 -269722 -125983
7376 232866 1350 -447472 125385 -66069 263296 -208910 -17673 269985 -148412 -129188 103050
7364 207226 -209064 103035 891 63106 -194409 -150504 -242229 -152639 40875 4407 19965 -64673
7351 77885 71578 193395 150283 242402 -244405 -254718 -140634 -322478 -278853 341651 641
7339 59122 -72316 112236 -364422 47053 -151570 -111829 226161 -17240 44341 -425212 152650
7327 197692 290339 -64695 150765 -14035 -28970 -233980 137231 -18161 -84257 92808 -335451
7315 189505 205298 -302625 17706 -37805 -424524 -396104 271574 287251 -58938 -96713 -14092
7303 66983 -10344 69492 -121866 -418898 -219551 -41540 111013 104750 -110095 228328 149397
7292 149397 -306988 -38850 69886 41795 72276 -260085 352327 993 -240034 56831 105407
7281 105407 24714 -312210 96782 10246 180407 -130373 222718 -230453 -273634 -84630 24136
7269 108007 -255335 69089 -138101 -6921 -138985 -165466 -125299 124226 -228336 24591 211465
7258 211465 -123908 37637 255099 -224433 53311 -57735 69445 -119104 100652 -27362 49478
7246 3690 223622 -300882 -48135 -43999 -60746 -180021 265058 -218978 -25835 111220 173417
7235 173417 54800 -52018 38513 83228 -167363 260666 -95860 86731 -31738 18234 -229992
7223 -97692 -188639 232910 -137311 -75063 -165695 151902 134868 6587 -204576 28047 -5778
7211 44425 -67040 -94488 -140745 -208644 48560 105527 136940 427 -62573 -6679 154668 -292254
7198 18611 95614 4564 286905 -59850 -80277 -46846 -199192 -266144 -184295 -42050 2856 25195
7186 25195 80683 -30002 -96675 27636 -206174 206771 154749 31397 95093 -152354 -70989
7174 -409379 -353050 -119715 -130943 -242424 -61130 -114414 -195706 56734 -112815 -81054 -6495
7162 -171853 -13613 -3724 -319715 2583 -384286 -149111 -171766 272827 495973 -108926 108787
7150 -574968 40058 -230040 15338 -161967 55970 -27588 231304 105442 -240398 -98966 63214
7138 -103384 -78019 -2781 -165794 -357708 196291 -355631 -341489 124086 -63132 218774 -119409
7126 350646 146923 -117818 -194089 129234 56180 -142974 1420 -51070 79187 -33540 -177794
7115 -177794 158458 -51778 53388 -269298 -120399 222674 77072 101062 -61666 -91575 -204879
7104 -204879 83551 234331 -150043 -405767 340580 40708 -160965 288357 -120543 125040
7093 -37311 58478 -33854 -124965 148059 -21405 -66589 -242655 -136163 -171350 30792 -228935
7081 70933 -55114 51545 -225565 41828 -212249 23998 50914 134831 -27161 45019 -157011
7069 -36181 -103391 -7528 -185484 -243342 189090 197968 65542 -463952 -153985 -103450 -155534
7058 -155534 18353 120684 84999 -204738 53700 150336 578198 5795 -2134 465855 75081
7046 286197 -226077 -68444 -206089 41873 141630 -106278 145158 -78620 226702 117201
7036 117201 -85221 -77250 -110213 -149491 -199368 -274649 -90684 65500 -16926 -68277 -3286 -158662
7024 -158662 -31071 -43775 -98153 -43524 21615 -220923 -213217 -14272 -112845 214176 -127945
7012 -135813 -349095 -167617 -220428 255572 131100 58256 -231548 -58783 -54685 -81834 171049
7000 -185978 180686 65045 -153215 -127300 -179468 3746 -121719 66549 -165760 318549 -50309
6988 -161681 259597 243071 -283400 -43958 -258914 -62894 352903 -162599 -69569 -71288 -230114
6977 -230114 -106534 -148127 118607 204129 235340 1945 -466863 184386 -137339 208116 245017
6966 245017 82700 26434 168992 118995 -165381 -244539 -240151 -283298 -10319 61012 98008
6955 98008 -112160 107551 105602 89759 -227527 -298083 -29429 -22610 -176789 43204 113929
6944 113929 -72448 -165408 7572 108588 -164840 -325401 -150204 105913 94157 64520 -342641
6932 -73703 -285995 100911 -144895 -39714 -276370 -9116 22007 -61188 174440 -48578 420694
6920 145490 -42297 217652 -284703 -324796 31581 62044 46747 67727 38228 32016 -129030
6908 -237266 132635 -148431 -96112 386991 149669 -87123 -46490 14345 -32194 -48111 -70390
6897 -70390 -98952 -131074 -135401 31294 114320 45410 102912 24326 25034 -169549 47132 16104
6884 5064 -134871 -69957 -185390 140441 68330 -139453 278321 -104120 -11232 7623 136345
6873 136345 -80116 -128095 -36201 197315 32249 56213 -33666 10938 -10793 6855 -19125 -66502
6861 -66502 -302507 33789 76730 -13068 -155896 122331 -23485 205906 -214922 160308 -109437
6849 -21801 -179564 213256 112719 -261101 -337439 -169103 156435 -98436 -284921 -127247
6838 -156017 -118234 -86063 -218397 110089 138869 165499 40895 -117272 -141072 -127554 76019
6826 148258 234250 -108866 -95959 18215 14092 -49220 -334121 -95044 208338 -153532 139542
6814 -69234 -232693 -49175 64372 -34635 99743 -271098 -60060 258159 -345611 210410 372468
6803 372468 4463 -36975 -123173 92522 -380234 365880 -136579 -153405 -154912 110724 -224082
6791 -472793 -26160 -194672 -180821 -331140 225415 12540 -220450 33962 39079 192202 -548880
6779 241802 -52838 -309402 48439 54506 -140200 173652 -130120 -374314 -272027 -55020 65625
6767 108167 112346 -110632 -111783 -251236 -68239 -226483 -66950 -28968 100613 145710 -119429
6755 102919 -297866 -84316 -123808 -38908 -223450 195348 55601 -83489 186173 148670 -32728
6743 54767 156276 193749 -60865 75370 88942 157646 -81926 241463 -264266 -349393 -155366
6731 -17510 53968 247048 183458 -152417 244214 19670 149555 -20511 -188293 260462 -138592
6719 -36519 -125697 67306 74941 104127 34394 91127 102537 -68432 -349550 -155430 -17839 -95414
6707 -95414 181144 180230 195035 236203 -75380 358352 8786 137139 -40276 81037 17095 -163364
6694 216862 -121836 -357318 132132 212640 337045 26949 120652 -227850 50942 -204770
6683 -55059 -28097 467896 -49520 263157 -161040 -220591 -197566 -254224 -38143 -166383 -57558
6671 88322 -243685 -140639 -242270 37344 -142303 -182972 181920 -91183 -11669 -26151 -973
6659 -157172 -51744 -330818 70062 -19707 -58817 247609 -105701 30200 300508 -236840 -9377
6647 132145 -72681 -104828 21289 156754 -208654 -109000 -36662 -80198 11808 64062 -77700
6635 -82077 -113165 139759 106441 -154690 17034 -181881 183642 -38353 334719 -307658 137939
6623 306130 -4574 -281706 -296760 -29375 -267485 -213196 270645 -335576 -103683 -80337 268180
6611 -171543 21567 79859 136548 -271554 47886 -72325 -131878 152612 124339 -106112 163348
6599 -242351 -201887 -127544 -123844 9903 -169034 -24508 25502 -90033 -161360 264180 56042 96062
6587 96062 -90761 37286 67189 -182007 -321691 -323478 -339485 -53460 -103772 40292 55122 -119699
6574 25367 -132706 109704 112391 42119 98434 87408 -333238 -20284 -479558 37119 -157866
6562 -381649 -114274 79921 -376173 -71511 113501 -250933 94730 -203185 130819 34139
6551 53039 220629 -22988 -73367 -91521 82791 -20677 -139867 116066 121980 -60563 370926
6539 36637 -183374 -77357 -150323 -83948 204624 397150 61692 139760 -19215 -168692 132078
6527 65130 -64362 -115426 146411 193432 -80707 -281508 -177477 159137 217646 31683 30405
6516 30405 58210 -121867 -100903 -212026 -51772 48024 328486 -21102 -191964 133727 -67508
6504 84140 43604 111706 -46165 112452 -179065 201971 158916 -18281 41925 -137104 -432061
6493 -432061 -223655 -287459 -261843 -49789 140796 297087 179967 -20420 258086 76163 200271
6482 200271 -283044 -81832 -99649 -231184 201753 2892 45789 49659 -142467 57350 -125783
6470 274590 221547 -96242 -270937 -148995 10730 -205758 98700 -73750 -150581 137576 -262389
6458 -108887 -292829 141884 117625 -122403 135093 157676 -206986 -106051 -64661 -82634
6448 -82634 45119 303552 185176 -36088 20584 100732 115533 45688 199525 79971 -65152
6436 129690 -211192 82457 -8317 -124314 125091 141229 187329 15392 -96467 556127 231510
6424 7476 153592 164771 154777 -15399 -109609 84167 48960 330335 5428 230648 -9465 -13856
6412 -13856 -88640 47063 -537970 10905 27226 12118 -76585 -40880 135767 85564 -43374
6400 97727 -57132 -271933 33537 87851 -95711 -116534 24714 121655 18662 191723 114722
6389 114722 -64974 164787 180666 82395 38703 156132 115715 -68626 -117126 37872 -404387
6377 -48709 50200 -90329 33960 -378818 -63170 -4886 95873 168974 -97295 -220868 118413
6365 -164058 110132 177655 -175031 -136228 161462 17325 277393 242790 -88433 -51049 -164513
6354 -164513 -146281 -110717 111170 -241402 283651 -115452 155205 -497385 -144538 -184635
6344 -184635 -196543 -106340 -154253 56720 -120548 -189993 -329657 -150538 -175228 25468 -115638
6332 -209852 191494 295270 -45316 46795 -52667 -223459 -2241 -128643 5966 66899 178557
6321 178557 303428 -43898 350120 -421312 217732 -75919 -31162 89358 -173104 -46523 138463
6309 -199533 161086 -50313 266526 278620 138058 368254 181477 -70691 8752 44861 -234234
6297 113220 260411 -85544 64943 -39007 147171 133124 7335 128490 214492 45349 -11309
6285 -65599 15018 168243 -135635 -314689 -116158 191720 -307417 35122 176084 -147351
6274 167056 179904 -45564 -170792 -96529 -97129 -44936 169343 -281245 -41505 322509 -167783
6262 -261598 54782 559748 -134527 -44527 108802 122644 -56545 -282956 64453 -219605 -146129
6251 -146129 88236 -100421 -383464 14195 -150066 211052 91681 -85731 222278 -121026
6240 -5557 14165 -268562 -8960 -120271 -107188 -388344 -30069 -345502 191777 -59127 -166025
6229 -166025 -80002 35373 -28815 179112 250247 39152 57632 -180469 119904 -325606 -148274
6217 -46741 160393 -62680 -53322 -226161 53971 -29206 -338483 -144983 102372 110407 107266
6206 107266 106199 212884 -49422 53223 -224326 -44231 -160413 20621 -184571 17576 23840
6195 23840 151272 149169 -252141 -159163 62666 6452 190012 321067 2528 322204 -200544
6183 -196150 -126965 139730 359559 271626 -359332 -270374 -155702 282473 -66398 -129437 -126768
6172 -126768 141629 248943 199127 -322918 189700 75183 -20799 431107 107609 -196470
6161 -260200 94443 210540 207124 256326 187320 91346 84605 126306 686 61403 -176487 -120942
6149 -120942 122321 71933 29834 1956 -197125 -53076 -52188 53570 -45090 7974 160682 -292278
6136 -219141 89367 -375821 160803 -171327 -99407 -215172 192163 -326780 100627 -80400
6125 23071 -176703 -197920 329461 -444497 76792 69375 -135112 9756 112870 136584 27642
6113 -204349 -147029 106529 -217099 -101382 369274 -185457 -241537 -109109 -166366 -300364
6103 -300364 139536 -38734 -298716 -120641 239315 -104465 -335101 294140 73638 319638
6093 319638 247616 -49619 -100213 14606 -61965 84187 -121513 -384054 261885 -150264 50412
6081 400810 77244 98708 -47207 71353 52575 -51534 36977 145123 -39327 69749 28729
6069 40404 391735 -344291 -182838 -327627 -194815 171922 4844 -93412 -378745 79899 -141029
6057 111265 -19995 -70687 376190 288756 -31931 71534 -179041 -145098 37888 106991 -155086
6045 -182006 313200 130452 -171364 -187517 -100850 -324451 -39712 -112157 83227 235665 6246
6033 34459 -199673 43202 209606 314388 52413 255513 -17146 176610 -183269 -240557 -8218
6021 378122 166780 -8151 -170362 196023 -37810 -287376 290758 -392553 64799 -16945 135158
6009 -199312 159923 -62953 -169167 -100761 193485 158177 -46799 -81761 180493 394976 -32039
5997 -53866 -155039 -174500 -45371 -40928 196001 41384 -68509 -63413 -256072 -190760 46822 -234114
5984 -118076 21335 16501 -170582 34988 307239 -47492 -71776 -75849 -247570 164253 103314
5973 103314 7840 377585 -224068 -2108 -130047 -52369 17122 -44946 32121 91502 -25522
5961 587592 73101 -166155 9148 231578 63551 -480262 -174984 137860 -28601 -596318 237770
5949 -25995 227168 -133973 -350494 -204962 248 -196439 174475 22369 68130 -258390 18108
5937 39967 -72828 -189179 -347857 -68257 -256739 13156 48663 -51831 -194360 -28955 470786
5925 -145446 -4098 -236969 406509 274071 -121002 -24789 230827 -100940 39340 147951
5915 147951 -133044 32421 -90893 54946 79410 -160117 -110975 -157780 -239303 -288238 14199
5903 -118336 -163224 83280 89840 269525 90714 3598 -95792 50051 -88472 33121 -57865 -179034
5891 -179034 65200 -132604 -254059 31045 44565 227447 -6299 -96362 -104233 47627 -94063
5879 124576 -184863 3461 -321882 -26138 -39996 -61539 12577 99101 234499 -80577 129233
5867 -160178 -12678 239850 -279681 169023 187773 -110272 56829 98546 -3173 97375 19879
5855 44618 -372952 233020 -74985 35652 -460329 264202 -175225 -228062 109605 -114335
5844 -109173 29243 -56433 -75737 -277690 -28485 -109179 -262212 -32345 -178246 97208 25798
5832 -186157 -20039 47696 114264 377954 -74656 31485 18603 -65106 -165078 -143114 1823 178134
5820 178134 215693 -167200 -27709 29710 -71746 165429 -61269 55765 82320 -54612 24911
5808 89933 290611 -114483 -78152 129124 -110526 231511 303837 -24683 10855 116625 118444
5797 118444 -84852 27992 -164739 313376 138138 154168 65877 -38217 236542 -47545 163511
5785 -17953 -73946 -131095 50687 -14444 120901 50853 234715 187841 64490 -139309 7970
5773 -112988 -18932 246928 141258 -306260 -38302 302625 -285873 -107823 -95216 -118253
5763 -118253 -54085 210759 344220 -58937 -39389 166016 -121614 201170 354039 -119071
5752 -80638 -29024 211 -10954 -4594 497 -9123 7444 282907 -63976 -61736 200930 -193912 -16140
5738 -107883 121180 -230912 377831 -239734 125376 182846 -75529 -425162 -213648 256958
5727 -103100 -281658 206331 -15043 -259353 -251563 -131062 -101929 86249 -177937 44867 -184845
5715 90691 8423 -46090 -309750 -51671 -169626 98877 89965 -7110 140629 10996 227038 112814
5702 315994 -12375 -6130 -65624 260237 168863 -66037 -204307 4406 -113286 12671 -1613 -385275
5690 -385275 -53131 33019 -134232 -78736 115050 -184794 180408 293305 -94643 -680056
5680 -680056 -203519 -80563 210882 223409 -321394 -249187 14450 -7871 378453 -146608 -106369
5669 -106369 112210 -142413 308657 195596 -143167 -62531 95506 142478 -58939 117260
5658 112822 -155027 -7751 176904 -105240 135160 103799 -269204 -8742 285974 -62574 -100531
5647 -100531 -221286 145379 -62776 -36640 76482 -59219 -62619 228564 162875 78553 -26870
5635 142461 182283 220603 -325090 145039 19918 93649 -94431 -80498 -86513 32307 -114331
5623 -51807 125724 138067 -138978 32810 -141464 25908 -190944 -116666 -247228 194190 -404330
5611 180358 133202 155075 -52300 -98017 51775 488786 -125369 22050 -133031 106630 -148908
5599 -16922 -378943 35202 -18828 41212 -51792 289093 -85107 -340118 -132699 22898 -61368
5587 -138286 40688 -81764 220060 -76132 -239268 -234247 216064 194575 -21142 -131881 -171322
5576 -171322 245129 -139503 -132632 114568 76684 -289946 6215 133914 155822 -186618 50904
5564 40637 3774 336257 300179 -64606 -94688 179080 111769 99029 355106 153357 407130
5553 407130 -199403 -87665 -104454 -150674 287512 -115426 73964 -418779 -125209 55404 -73925
5541 -456034 420136 159199 -276997 -241197 19091 -313609 129948 109139 74866 -176634
5530 48503 150002 -274020 -98689 36303 102521 90049 86220 -86586 -264385 230775 -214349
5518 -22617 277722 -23284 73839 -243204 244554 -115173 202767 -140721 60637 10237 219620
5507 219620 -70355 165882 -14751 142543 234555 -187750 149579 -67306 226569 -258576
5496 86485 200922 -285320 46914 231065 87333 -273666 -4425 199889 -169174 26341 295756
5485 295756 235404 54095 98013 42292 171645 -325799 41713 134819 38463 30527 -156031
5473 -138350 138094 -113770 -103706 -52961 -210267 111397 -276158 73902 186133 56212
5462 48943 4151 2431 -170833 222092 37706 -52968 426581 363916 303466 118636 385814
5451 385814 -113850 67706 -50143 -161458 137600 -94706 -71598 8540 -203638 -94025 -140691
5440 -140691 75680 -81599 -103628 47815 91592 -124988 -313738 -146528 -87647 125675 202546
5429 202546 -94803 -25602 70894 228197 -146833 400713 -146684 164912 -19286 58286 43086
5418 43086 -183215 -21867 -323469 -108040 -33392 38890 190526 -66721 115176 -26058 -198639
5407 -198639 -402519 -282876 -186410 136385 -155131 -46364 -209978 -99577 25626 -60468 -15654
5395 -39820 -87590 -90327 -210092 -673 -69807 15446 236025 -175197 -476797 70365 -22607 177002
5382 -258867 68465 131603 -212055 -88624 127371 -122004 2696 107829 145184 -251912 -56466
5370 197304 -22579 142830 321905 -257184 -87144 -91956 202465 30504 219277 -4074 -19452
5359 -19452 -194656 -88130 -69551 39586 -149990 376171 284311 -309905 -70264 -58459 -42955
5348 -42955 110080 168392 11639 86323 457949 -124112 -155403 5557 135344 83605 -123976
5336 147306 59392 -154459 -387248 -151071 -266664 59458 -10002 220668 32755 128572 319176
5325 319176 -78281 -41780 -181766 322897 -196301 204789 8226 -126720 -215346 5247 148407
5314 148407 265695 -134282 21123 -120446 -207113 93886 44564 -38533 55178 166290 253316
5303 253316 197814 264766 218042 18108 -19337 166540 -302525 91878 -114323 -28431 -36191
5292 -36191 79706 -183063 230310 -186744 -159089 163722 72639 -64218 117368 -31182 -252560
5281 -252560 200380 127799 56518 39952 -94379 -102242 -163108 357779 29107 -41132 60929
5269 -170976 -220486 59942 302855 -20560 129996 268739 -137306 -6582 -310150 -262328 -281307
5258 -281307 -284157 -64913 -217437 -146051 128527 174761 2456 -254867 -34027 -213081 113358
5246 95342 -5937 146081 106370 101303 237261 -66151 -29890 -2805 -98332 39840 94884 -194529
5233 -216487 -153249 -269182 141903 218199 143444 168846 -41221 37247 -268493 116332 41392
5221 2700 -110267 99806 176266 116867 -112265 -199349 -76022 -221512 14142 115178 -86037
5209 -33368 -293796 -435723 -56251 161829 -342532 -238358 -119420 -93420 -18421 -103858 -73849
5198 -73849 -63562 -30881 138443 350717 188345 347055 -29431 305347 270812 163144 56009
5186 11690 287164 155073 195241 299531 -184519 -37935 26368 375602 -81485 -91164 76485
5174 -186312 -240338 -13638 -90846 -136702 -282710 245063 282270 148206 -195948 118363 -81084
5162 -142929 280643 -100617 73381 -159046 -271046 53361 176613 30699 167196 82418
5151 -35371 -42247 59003 -4268 -230178 152025 -1856 126272 62533 25607 -5299 -39715 138125
5138 -81581 -145172 -360785 217308 169761 -276639 111324 63930 167112 195973 -290755 -107970
5126 175308 -233524 17242 76251 -59136 116165 199710 265663 11461 -154352 118701 534
5114 61945 -206941 -411764 -48452 75356 -148868 3311 307544 124704 -69781 7716 184026
5103 184026 -206581 52493 72383 51633 -270823 86049 -145044 -84846 -209907 -253027 -16541
5091 226658 213459 49846 -20926 -503376 -63344 -69335 -113980 118127 332498 -26474 135818
5079 -43327 224345 213969 -113220 -229755 150174 129839 46117 -140378 -181356 -69789 277074
5067 27950 -7977 -104934 -279538 179455 -45837 -40531 308228 -230001 -239632 -13089 53867 -32505
5054 54497 79164 -162727 -45392 324614 2704 85844 180194 44098 -103760 153847 266328
5043 266328 -36032 -166173 -94442 -147495 -311058 72434 -352292 -107075 124579 -2979 167566
5031 -154396 40498 -293223 -89044 -230300 -267037 19091 -166054 -127646 -86890 -130007 -265447
5020 -265447 179569 -258405 -93086 -95512 122611 138918 93285 50433 92030 111836 67804
5009 67804 -199804 -221345 280457 164607 419219 -2645 74089 -208118 -149813 152125 -162106
4997 253537 211681 72302 -175320 -6804 -158464 20558 -23797 -274899 136414 -204135 147136
4985 44605 6536 -228468 -173694 288545 -33248 -433050 97110 -185197 116135 102171 107604
4974 107604 11230 35082 -458573 211269 407818 48645 199033 -60832 -149951 -493452 -243245
4962 -28162 283636 -297111 -160326 -29167 223669 135623 254090 159221 -219979 -100653
4951 -73904 -251598 173852 57009 -318 21427 159055 148510 -216256 160717 28311 242811
4940 242811 -10330 283674 -76455 -98836 -64102 -177109 162738 -349976 -168284 157469
4929 135698 -6829 139169 230490 -107148 325540 -108094 84941 -210595 -315259 76801 44178
4918 44178 -37164 67826 186963 94946 -158099 87155 21995 85633 -145684 -23236 47032
4906 -171640 381646 288477 40789 292721 211163 -195786 101136 -78616 -187028 181221
4895 108976 -177521 -141663 -20578 -177585 -168999 -141214 52653 -105610 204270 128584 -15152
4883 -87511 -3762 387665 -47866 -462100 -173243 -279695 15291 -298386 -53241 -265443 -1481
4871 -173145 166982 108664 -167141 -38687 -271245 82747 -177859 220682 79537 33792 89347
4860 89347 -209005 -109851 227418 -89871 -201600 204751 -327476 -25325 318018 -259342
4849 -27150 -107281 -191716 1962 303108 -200628 -133747 -24814 -171630 -123054 -103911 138967
4837 -144985 -128179 108602 -39479 49679 248573 -11358 260766 167179 2280 -260738 -309925
4826 -309925 -86586 101243 479572 -151861 323480 286071 42333 -117 -639250 145270 281894
4815 281894 2223 -30735 176699 186863 -276338 288128 -47282 -40568 -223564 144040 -53308
4803 244166 35709 281785 217151 148913 26219 -175856 279888 -32654 -2584 233511 131238
4792 131238 -125160 -7287 -14125 279500 19695 204633 150867 198916 -70212 349862 -275128
4780 105541 57531 134286 -182931 -121669 -253835 216030 103030 -120362 -19219 305809
4769 522319 -18535 -104554 144182 -84441 107964 198702 2264 229016 72967 -396034 22320
4757 -138943 116859 -230681 22099 -209020 -74745 94700 -307628 -12288 289766 -78471 -198960
4746 -198960 9846 -131613 189983 131581 -191472 -53600 -102140 102038 -128147 282549 41163
4734 -148906 165218 -59926 37231 -217930 124526 -75745 308801 342056 524882 -327988
4723 2053 154280 -79165 -138596 -110090 289280 216924 -127913 197326 -126781 -96522 33417
4711 106839 -9620 -26873 -56743 160440 206963 -106827 101468 117281 32301 -11095 -163413
4700 -163413 -89219 -153211 -410655 121928 -97124 -51775 29928 -213386 -129519 -99701 93119
4688 -55894 63326 -58608 -98905 19406 123909 78809 165007 181729 30269 -328758 -289895
4677 -289895 70057 270040 35663 -289705 28992 35254 -248704 69774 279929 275144 -14210
4665 -45470 248113 -87026 -49136 99385 304460 -213774 -278573 19753 226541 187149 193678
4654 193678 139977 -158959 109436 -126185 -26611 -124677 -90576 160466 73905 149997 53737
4642 -134146 137061 58678 71389 229413 24275 9030 -222846 259389 -139817 -17337 232944
4630 304509 -189666 220229 2589 -192805 -125009 -25011 -103037 -294797 -90456 166436 -233837
4618 145342 345898 -14046 67621 177026 15909 120723 205363 -100005 145314 -1266 265278
4606 -4663 121885 -98747 33248 171981 -39511 179115 -22713 56968 129512 -63129 88190
4594 -5793 -157967 58469 193173 -23774 -64869 -13108 34014 260360 148565 -12174 142808
4582 -28344 36526 -158641 -30123 41359 307316 -107259 -84094 -1405 95649 -286313 10429
4570 162591 63538 241898 244686 -230441 221144 100674 311546 225263 -26148 -12627 148184
4558 -255687 312408 309903 -238805 -26297 41113 199090 252513 -33332 -20390 144543 62290
4546 125076 -77937 -140353 64960 160263 -118905 -43567 -96210 -259647 101620 284820 -188894
4534 37107 -399780 91346 -187487 -71293 -146523 -171402 -61864 -180100 10548 484784 66470
4522 -16336 -114254 -323446 -181631 -30646 -177708 -163642 1971 -142810 -162207 225893 -5718
4510 -76684 69505 -240086 113022 -297131 37440 58077 84591 -11218 -84787 286449 13163
4498 72548 -564311 31362 162886 -61966 -61317 123369 39897 368466 60310 103376 244877
$$ [...]
##END NTUPLES=NMR SPECTRUM
##END=
