##TITLE=AC1699_ROEFFECT0026_8637862_u2uq81Qffw
##JCAMPDX= 6.0         $$ Bruker NMR JCAMP-DX V2.0
##DATA TYPE= NMR SPECTRUM
##DATA CLASS= NTUPLES
##ORIGIN= BRUKER
##OWNER= Administrator
$$ 1.72 TOPSPIN		Version 2.1
$$ 2014-05-22 23:12:57.947 -0700  Administrator@X
$$ Compression mode = diff/dup
##.OBSERVE FREQUENCY= 400.02188249412
##.OBSERVE NUCLEUS= ^1H
##.ACQUISITION MODE= SIMULTANEOUS (DQD)
##.ACQUISITION SCHEME= undefined
##.AVERAGES= 64
##.DIGITISER RES= 22
##SPECTROMETER/DATA SYSTEM= spect
##.PULSE SEQUENCE= noesygpps1d.comp
##.SOLVENT NAME= COFFEE_meoh
##.SHIFT REFERENCE= INTERNAL, COFFEE_meoh, 1, 14.9614
##AUDIT TRAIL= $$ (NUMBER, WHEN, WHO, WHERE, PROCESS, VERSION, WHAT)
$$ ##TITLE= Audit trail, TOPSPIN		Version 2.1
$$ ##JCAMPDX= 5.01
$$ ##ORIGIN= Bruker BioSpin GmbH
$$ ##OWNER= Administrator
$$ $$ E:\/data/COFFEE/nmr/AC1699_ROEFFECT0026_8637862_u2uq81Qffw/12/pdata/1/auditp.txt
$$ ##AUDIT TRAIL=  $$ (NUMBER, WHEN, WHO, WHERE, PROCESS, VERSION, WHAT)
(   1,<2014-05-22 23:12:52.962 -0700>,<Administrator>,<X>,<go>,<TOPSPIN 2.1>,
      <created by zg
	started at 2014-05-22 23:01:23.103 -0700,
	POWCHK enabled, PULCHK disabled,
       configuration hash MD5:
       C8 4E 4E 5D D3 5C D8 9E 9F 52 82 E0 59 8A DE 15
       data hash MD5: 64K
       95 CA 6A 9F E3 82 69 25 83 D9 BD 0E 2D 44 90 62>)
(   2,<2014-05-22 23:12:55.962 -0700>,<Administrator>,<X>,<proc1d>,<TOPSPIN 2.1>,
      <Start of raw data processing
       efp LB = 0.3 FT_mod = 6 PKNL = 1 PHC0 = 0 PHC1 = 0 SI = 128K 
       data hash MD5: 128K
       A6 DC C9 27 26 4F 27 53 94 ED CC 81 7B 2D 11 4A>)
(   3,<2014-05-22 23:12:56.853 -0700>,<Administrator>,<X>,<proc1d>,<TOPSPIN 2.1>,
      <pk PHC0 = -87.62695 PHC1 = 0 
       data hash MD5: 128K
       19 04 93 57 3E 5C 80 4A E3 F1 60 CA 3C 16 BF CB>)
(   4,<2014-05-22 23:12:57.353 -0700>,<Administrator>,<X>,<proc1d>,<TOPSPIN 2.1>,
      <abs ABSG = 1 
       data hash MD5: 128K
       CE A3 E0 78 CC BB 13 B4 AD 3E BA CA 11 4C C1 5E>)
(   5,<2014-05-22 23:12:57.447 -0700>,<Administrator>,<X>,<proc1d>,<TOPSPIN 2.1>,
      <abs ABSG = 2 
       data hash MD5: 128K
       88 22 9F 1D 43 76 09 E8 58 CE DA 90 1A 2D F1 65>)
(   6,<2014-05-22 23:12:57.540 -0700>,<Administrator>,<X>,<proc1d>,<TOPSPIN 2.1>,
      <abs ABSG = 3 
       data hash MD5: 128K
       C3 EA 62 00 CA E2 3B B7 E8 BF D8 F1 59 72 C9 54>)
(   7,<2014-05-22 23:12:57.634 -0700>,<Administrator>,<X>,<proc1d>,<TOPSPIN 2.1>,
      <abs ABSG = 4 
       data hash MD5: 128K
       40 3C 1A 9D 50 67 96 ED 16 B9 D4 17 13 23 D1 D9>)
(   8,<2014-05-22 23:12:57.728 -0700>,<Administrator>,<X>,<proc1d>,<TOPSPIN 2.1>,
      <abs ABSG = 5 
       data hash MD5: 128K
       7F 2B 98 9E A8 3D F4 6B D4 1D 47 4E 34 CD 25 F6>)
$$ ##END=
$$ 
$$ $$ hash MD5
$$ $$ AE CA CE C1 55 2B 70 BA 4A 3F 4E F2 75 F1 3E D0
##$RELAX= 
##$RELAX= 
##$RELAX= 
##$RELAX= 
##$RELAX= 
##$RELAX= 
##$RELAX= 
##$RELAX= 
$$ Bruker specific parameters
$$ --------------------------
##$DU= <E:\>
##$EXPNO= 12
$$ [...]
150 150 150 150 150 150 150 150
##$TP07= 0
##$TPNAME0= <>
##$TPNAME1= <>
##$TPNAME2= <>
##$TPNAME3= <>
##$TPNAME4= <>
##$TPNAME5= <>
##$TPNAME6= <>
##$TPNAME7= <>
##$TPOAL= (0..7)
0.5 0.5 0.5 0.5 0.5 0.5 0.5 0.5
##$TPOFFS= (0..7)
0 0 0 0 0 0 0 0
##$TUNHIN= 0
##$TUNHOUT= 0
##$TUNXOUT= 0
##$USERA1= <user>
##$USERA2= <user>
##$USERA3= <user>
##$USERA4= <user>
##$USERA5= <user>
##$V9= 5
##$VALIST= <valist>
##$VCLIST= <CCCCCCCCCCCCCCC>
##$VD= 0
##$VDLIST= <DDDDDDDDDDDDDDD>
##$VPLIST= <PPPPPPPPPPPPPPP>
##$VTLIST= <TTTTTTTTTTTTTTT>
##$WBST= 2048
##$WBSW= 25
##$XGAIN= (0..3)
0 0 0 0
##$XL= 0
##$YL= 0
##$YMAX_a= 6112876
##$YMIN_a= -12789957
##$ZGOPTNS= <>
##$ZL1= 120
##$ZL2= 120
##$ZL3= 120
##$ZL4= 120
##$ABSF1= 14.9614
##$ABSF2= -5.596782
##$ABSG= 5
##$ABSL= 3
##$ALPHA= 0
##$AQORDER= 0
##$ASSFAC= 0
##$ASSFACI= 0
##$ASSFACX= 0
##$ASSWID= 0
##$AUNMP= <proc_prof1d_extract.lims>
##$AXLEFT= 0
##$AXNAME= <>
##$AXNUC= <1H>
##$AXRIGHT= 0
##$AXTYPE= 0
##$AXUNIT= <>
##$AZFE= 0.1
##$AZFW= 0.1
##$BCFW= 0
##$BC_mod= 0
##$BYTORDP= 0
##$COROFFS= 0
##$CY= 15
##$DATMOD= 1
##$DC= 0
##$DFILT= <>
##$DTYPP= 0
##$F1P= 0
##$F2P= 0
##$FCOR= 0.5
##$FTSIZE= 131072
##$FT_mod= 6
##$GAMMA= 0
##$GB= 0
##$INTBC= 1
##$INTSCL= 1
##$ISEN= 128
##$LB= 0.3
##$LEV0= 0
##$LPBIN= 0
##$MAXI= 10000
##$MC2= 0
##$MEAN= 0
##$ME_mod= 0
##$MI= 0
##$NCOEF= 0
##$NC_proc= -2
##$NLEV= 6
##$NOISF1= 0
##$NOISF2= 0
##$NSP= 0
##$NTH_PI= 0
##$NZP= 0
##$OFFSET= 14.9614
##$PC= 1
##$PHC0= -87.62695
##$PHC1= 0
##$PH_mod= 1
##$PKNL= yes
##$PPARMOD= 0
##$PPDIAG= 0
##$PPIPTYP= 0
##$PPMPNUM= 2147483647
##$PPRESOL= 1
##$PSCAL= 4
##$PSIGN= 0
##$PYNMP= <proc.py>
##$REVERSE= no
##$SF= 400.020009477429
##$SI= 131072
##$SIGF1= 0
##$SIGF2= 0
##$SINO= 400
##$SIOLD= 131072
##$SPECTYP= <>
##$SREGLST= <1H.CDCl3>
##$SSB= 0
##$STSI= 131072
##$STSR= 0
##$SW_p= 8223.68421052631
##$SYMM= 0
##$S_DEV= 0
##$TDeff= 65536
##$TDoff= 0
##$TI= <>
##$TILT= no
##$TM1= 0
##$TM2= 0
##$TOPLEV= 0
##$USERP1= <user>
##$USERP2= <user>
##$USERP3= <user>
##$USERP4= <user>
##$USERP5= <user>
##$WDW= 1
##$XDIM= 131072
##$YMAX_p= 378111461
##$YMIN_p= -11569
##$CURPLOT= <Network HP LaserJet P1505>
##$CURPRIN= <$Network HP LaserJet P1505>
##$DFORMAT= <normdp>
##$LAYOUT= <+/1D_H.xwp>
##$LFORMAT= <normlp>
##$PFORMAT= <normpl>
##$SURQMSG= 1
$$ End of Bruker specific parameters
$$ ---------------------------------
##NTUPLES= NMR SPECTRUM
##VAR_NAME=  FREQUENCY,     SPECTRUM/REAL,   SPECTRUM/IMAG
##SYMBOL=    X,             R,               I
##VAR_TYPE=  INDEPENDENT,   DEPENDENT,       DEPENDENT
##VAR_FORM=  AFFN,          ASDF,            ASDF
##VAR_DIM=   131072,        131072,          131072
##UNITS=     HZ,            ARBITRARY UNITS, ARBITRARY UNITS
##FACTOR=    0.0627417313425164, 1,          1
##FIRST=     8223.62146879497, -3712,        -61564
##LAST=      0,             -1805,           -63005
##MIN=       0,             -11569,          0
##MAX=       8223.62146879497, 378111461,    0
$$ Real data points
##PAGE= N=1
##DATA TABLE= (X++(R..R)), XYDATA
$$ [...]
$$ plain form
61380 705284 712976 721147 730430 741434 754283 768629 783854 799357 814684 829388 842944 854998
61368 854998 865543 874451 880945 883944 883048 878855 872273 863840 853848 842781 831324 820058 809291
61355 809291 799133 789700 781288 774321 768988 764965 761666 758714 755932 752973 749298 744607 739011 732748
61341 732748 726104 719706 714477 710902 708502 706380 704168 702160 700541 698919 696813 694424 692587 691967
61327 691967 692517 693843 695877 698863 702721 706864 710838 714882 719540 724923 730716 736838 743721 751906
61313 751906 761653 772936 785500 798861 812546 826447 840763 855588 870820 886395 902173 917494
61301 917494 931257 942619 951325 957276 960210 960062 957149 951698 943593 932950 920527 907079 892624
61288 892624 876892 860256 843669 827859 813123 799705 787666 776482 765511 754983 745898 738823
$$ packed form
61380G05284P692Q171R283J1004J2849J4346J5225J5503J5327J4704J3556J2054
61368H54998J0545Q908O494K999q96m193o582q433r992j1067j1457j1266j0767
61355H09291j0158r433q412o967n333m023l299k952k782k959l675m691n596o263
61341G32748o644o398n229l575k400k122k212k008j619j622k106k389j837o20
61327F91967N50J326K034K986L858M143L974M044M658N383N793O122O883Q185
61313G51906R747J1283J2564J3361J3685J3901J4316J4825J5232J5575J5778J5321
61301I17494J3763J1362Q706N951K934j48k913n451q105j0643j2423j3448j4455
61288H92624j5732j6636j6587j5810j4736j3418j2039j1184j0971j0528r085p075
$$ plain form
61276 738823 733453 729523 727367 727084 727835 728621 729365 730635 732568 734717 736785 738951 741458 744390 747948
61261 747948 752492 758222 765046 772825 781447 790591 799685 808215 815987 823102 829917 837078 845389 855453
61247 855453 867330 880560 894597 909422 925629 943531 962087 979107 992691 1002138 1007270 1007632
61235 1007632 1003051 994607 984145 972868 961106 949441 939217 931686 927274 925953 927725 932380 939286
61222 939286 947895 958128 969943 982757 995509 1006961 1015881 1021538 1024361 1025593 1025840 1024426 1020605
61209 1020605 1014877 1008469 1002043 995721 990033 985854 983379 982052 981609 982455 984840 988492 993399 1000180
61195 1000180 1009160 1019601 1030346 1040739 1050349 1058280 1063606 1066368 1067403 1067100 1064936 1060418 1053937
61182 1053937 1046382 1038355 1030122 1022004 1014264 1006656 998565 989748 980605 971643 962982 954652 947102 941020
$$ packed form
61276G38823n370l930k156k83P51P86P44J270J933K149K068K166K507K932L558
61261G47948M544N730O824P779Q622R144R094Q530P772P115O815P161Q311J0064
61247H55453J1877J3230J4037J4825J6207J7902J8556J7020J3584R447N132L62
61235A007632m581q444j0462j1277j1762j1665j0224p531m412j321J772M655O906
61222I39286Q609J0233J1815J2814J2752J1452Q920N657K823J232K47j414l821
61209A020605n728o408o426o322n688m179k475j327m43Q46K385L652M907O781
61195A000180Q980J0441J0745J0393R610P931N326K762J035l03k164m518o481
61182A053937p555q027q233q118p740p608q091q817r143q962q661q330p550o082
$$ plain form
61168 941020 936656 933626 931427 929857 928898 928502 928722 929854 932302 936430 942595 950998 961257 972479
61154 972479 984225 997356 1013438 1033195 1055774 1079607 1103655 1127609 1151120 1173216 1192655
61143 1192655 1208736 1221698 1232289 1241058 1248080 1253193 1256216 1256912 1255129 1251136 1245558 1238786 1230756
61130 1230756 1221535 1211736 1201903 1191778 1180721 1168693 1156277 1143927 1131934 1121129 1112708 1106917
61118 1106917 1102606 1098591 1095026 1092975 1093029 1094976 1098411 1102956 1107863 1112099 1115062 1116996 1118595 1120412
61104 1120412 1122556 1124614 1125798 1125393 1123085 1118667 1111625 1101450 1088356 1073253 1056825 1039012 1019594
61091 1019594 998990 978108 957532 937163 916716 896397 876958 859094 842843 827748 813676
61080 813676 801221 790884 781942 772677 762040 750707 740150 731001 722846 715419 709224 704729 701522
$$ packed form
61168I41020m364l030k199j570r59l96K20J132K448M128O165Q403J0259J1222
61154I72479J1746J3131J6082J9757K2579K3833K4048K3954K3511K2096J9439
61143A192655J6081J2962J0591Q769P022N113L023O96j783l993n578o772q030
61130A230756r221r799r833j0125j1057j2028j2416j2350j1993j0805q421n791
61118A106917m311m015l565k051N4J947L435M545M907M236K963J934J599J817
61104A120412K144K058J184m05k308m418p042j0175j3094j5103j6428j7813j9418
61091A019594k0604k0882k0576k0369k0447k0319j9439j7864j6251j5095j4072
61080H13676j2455j0337q942r265j0637j1333j0557r149q155p427o195m495l207
$$ plain form
61067 701522 698730 696029 693781 692299 691411 690785 690300 690017 690051 690726 692622 696220 701467 707769 714472 721348
61051 721348 728704 736997 746318 756352 766945 778515 791601 806098 821287 836642 852155 867834
61039 867834 883445 899071 915388 932882 951186 969750 988843 1009247 1031121 1053909 1077292
61028 1077292 1101533 1126848 1153239 1181154 1211507 1244634 1279854 1316526 1354946 1395678 1438686
61017 1438686 1483931 1532523 1586464 1647455 1716705 1795876 1887430 1993953 2117733 2261080 2426391
61006 2426391 2615672 2830700 3074086 3349904 3663311 4020526 4430003 4903333 5454613
60997 5454613 6099545 6855845 7742980 8777664 9965662 11295544 12738273 14248986 15764477
60988 15764477 17197942 18442977 19397182 19999361 20258311 20252825 20101309 19917977 19775959
$$ packed form
61067G01522k792k701k248j482q88o26m85k83L4O75J896L598N247O302O703O876
61051G21348P356Q293R321J0034J0593J1570J3086J4497J5189J5355J5513J5679
61039H67834J5611J5626J6317J7494J8304J8564J9093K0404K1874K2788K3383
61028A077292K4241K5315K6391K7915L0353L3127L5220L6672L8420M0732M3008
61017A438686M5245M8592N3941O0991O9250P9171R1554J06523J23780J43347J65311
61006B426391J89281K15028K43386K75818L13407L57215M09477M73330N51280
60997E454613O44932P56300Q87135J034684J187998J329882J442729J510713J515491
60988A5764477J433465J245035R54205O02179K58950n486j51516j83332j42018
$$ plain form
60979 19775959 19687889 19604381 19428043 19041713 18347186 17303265 15946186 14379792 12738723
60970 12738723 11144609 9678272 8376945 7247648 6282086 5465660 4781671 4213419 3744841
60961 3744841 3360233 3044526 2784360 2568561 2387581 2233265 2099610 1982962 1880684
60952 1880684 1789939 1708281 1634854 1569846 1512605 1461095 1413440 1369237 1328879 1292046 1257402
60941 1257402 1223476 1189325 1154573 1119406 1084603 1051082 1019160 988455 958581 929717 902368
60930 902368 876879 853412 832251 813716 797629 783087 769026 755061 741638 729359 718380
60919 718380 708594 700122 693154 687339 681779 675897 670011 664814 660616 657464 655671 655530 656541 657550
60905 657550 657892 657921 658140 658297 657758 656425 654713 652793 650415 647519 644471 641546 638561 635278 631789 628233
$$ packed form
60979A9775959q8070q3508j76338l86330o94527j043921j357079j566394j641069
60970A2738723j594114j466337j301327j129297r65562q16426o83989n68252m68578
60961C744841l84608l15707k60166k15799j80980j54316j33655j16648j02278
60952A880684r0745q1658p3427o5008n7241n1510m7655m4203m0358l6833l4644
60941A257402l3926l4151l4752l5167l4803l3521l1922l0705k9874k8864k7349
60930I02368k5489k3467k1161j8535j6087j4542j4061j3965j3423j2279j0979
60919G18380r786q472o968n815n560n882n886n197m198l152j793j41J011J009
60905F57550L42K9K19J57n39j333j712j920k378k896l048k925k985l283l489l556
$$ plain form
60889 628233 624386 619993 615447 611714 609415 608190 607109 605608 603951 602876 602859 603545 603798 602454 599179
60874 599179 594574 589438 584133 578812 573923 569984 566924 564157 561500 559563 558904 559124 559253 558882 558450
60859 558450 558451 558811 559211 559678 560539 561845 563072 563490 562849 561646 560610 559880 558885 557059 554448 551442 548281
60842 548281 545200 542769 541406 540524 538780 535402 530816 525771 520324 514123 507314 500683 495014 490637
60828 490637 487472 485124 483030 480817 478561 476508 474677 472991 471656 471049 471175 471589 471939 472349 473139 474303
60812 474303 475452 476168 476330 476091 475625 474974 474136 473136 471894 470123 467710 465118 463009 461366 459382 456475
60796 456475 452985 449527 446131 442518 438877 435642 432699 429631 426738 425007 424816 425361 425643 425334 424307
60781 424307 422131 418875 415873 414622 414930 414969 413335 410444 407709 405995 405247 405082 405181 405337 405600 406348 407858
$$ packed form
60889F28233l847m393m546l733k299j225j081j501j657j075j7O86K53j344l275
60874E99179m605n136n305n321m889l939l060k767k657j937o59K20J29l71m32
60859E58450JL60M00M67Q61J306J227M18o41j203j036p30r95j826k611l006l161
60842E48281l081k431j363q82j744l378m586n045n447o201o809o631n669m377
60828D90637l165k348k094k213k256k053j831j686j335o07J26M14L50M10P90J164
60812D74303J149P16J62k39m66o51q38j000j242j771k413k592k109j643j984k907
60796D56475l490l458l396l613l641l235k943l068k893j731j91N45K82l09j027
60781D24307k176l256l002j251L08L9j634k891k735j714p48j65R9J56K63P48J510
$$ plain form
60764 407858 409902 412016 414140 416639 419748 423334 427277 431706 436583 441362 445397 448639 451600 454564
60750 454564 457126 458675 459196 459403 460081 461450 463196 465003 466927 469270 472178 475419 478508 480975 482542
60735 482542 483128 482792 481705 480177 478581 477183 475988 474818 473569 472336 471248 470309 469456 468612 467505
60720 467505 465517 462075 457251 451801 446550 441926 438059 434985 432532 430291 427994 425780 423919 422421
60706 422421 421143 420023 418982 417809 416507 415537 415242 415134 414271 412395 410288 408944 408762 409522 410668 411470
60690 411470 411439 410886 410777 411795 413838 416529 419750 423409 427154 430748 434415 438426 442604 446656 450719
60675 450719 455141 459862 464451 468656 472484 475877 478779 481458 484229 486796 488263 487984 486150 483489
60661 483489 480703 478244 476318 474916 473969 473536 473660 474057 474201 473828 473156 472618 472541 473066 474131 475427 476654
$$ packed form
60764D07858K044K114K124K499L109L586L943M429M877M779M035L242K961K964
60750D54564K562J549N21K07O78J369J746J807J924K343K908L241L089K467J567
60735D82542N86l36j087j528j596j398j195j170j249j233j088r39q53q44j107
60720D67505j988l442m824n450n251m624l867l074k453k241k297k214j861j498
60706D22421j278j120j041j173j302r70k95j08q63j876k107j344j82P60J146Q02
60690D11470l1n53j09J018K043K691L221L659L745L594L667M011M178M052M063
60675D50719M422M721M589M205L828L393K902K679K771K567J467k79j834k661
60661D83489k786k459j926j402r47m33J24L97J44l73o72n38p7N25J065J296J227
$$ plain form
60644 476654 477844 479240 480748 481737 481540 480017 477587 474855 472255 469866 467443 464809 462271 460480 459736
60629 459736 459583 459268 458505 457617 457063 457031 457511 458502 459964 461693 463428 465098 466746 468192 469044 469286 469649
60612 469649 471025 473572 476694 479803 482608 484682 485443 484911 483977 483479 483406 483475 484041 485688 488106 490104
60596 490104 490824 490402 489403 488189 487024 486277 486189 486694 487642 489006 490808 493086 495968 499427 502902 505486
60580 505486 506688 506831 506663 506830 507651 509073 510761 512566 514931 518445 522980 527743 532271 536928 542232
60565 542232 548159 554350 560547 566518 571919 576608 580840 584852 588465 591391 593699 595757 597885 600215
60551 600215 602657 604849 606513 608031 610239 613413 616921 620276 624025 629013 635124 641395 647253 652991
60537 652991 659108 665808 673216 681569 691038 701766 714090 728289 744062 760739 778089 796389
$$ packed form
60644D76654J190J396J508R89j97j523k430k732k600k389k423k634k538j791p44
60629D59736j53l15p63q88n54l2M80R91J462J729J735J670J648J446Q52K42L63
60612D69649J376K547L122L109K805K074P61n32r34m98p3O9N66J647K418J998
60596D90104P20m22r99j214j165p47q8N05R48J364J802K278K882L459L475K584
60580E05486J202J43j68J67Q21J422J688J805K365L514M535M763M528M657N304
60565E42232N927O191O197N971N401M689M232M012L613K926K308K058K128K330
60551F00215K442K192J664J518K208L174L508L355L749M988O111O271N858N738
60537F52991O117O700P408Q353R469J0728J2324J4199J5773J6677J7350J8300
$$ plain form
60525 796389 815440 834015 850605 864386 875075 882229 885206 883717 877972 868316 855236 839760
60513 839760 823372 807194 791506 776370 762525 751260 743406 738770 736640 736502 738099 741195 745761
60500 745761 752318 761648 774023 788983 805977 824977 846265 869754 894714 920124 945096 968963
60488 968963 991028 1010418 1026364 1038675 1047830 1054420 1058709 1060947 1061963 1063145 1065890 1071355 1080548
60475 1080548 1094004 1111029 1129556 1147026 1161332 1171008 1174953 1172238 1161955 1143204 1115674 1080455
60463 1080455 1039911 996444 951690 907008 864059 824229 787787 754271 723562 696028 671749
60452 671749 650286 631291 614808 600797 588844 578562 569940 563020 557512 552914 548848 545157 541879
60439 541879 539262 537592 536883 536840 537183 537761 538277 538250 537488 536427 535663 535239 534703 533865 533197 533330 534326 535553
$$ packed form
60525G96389J9051J8575J6590J3781J0689P154K977j489n745r656j3080j5476
60513H39760j6388j6178j5688j5136j3845j1265p854m636k130j38J597L096M566
60500G45761O557R330J2375J4960J6994J9000K1288K3489K4960K5410K4972K3867
60488I68963K2065J9390J5946J2311R155O590M289K238J016J182K745N465R193
60475A080548J3456J7025J8527J7470J4306R676L945k715j0283j8751k7530l5219
60463A080455m0544m3467m4754m4682m2949l9830l6442l3516l0709k7534k4279
60452F71749k1463j8995j6483j4011j1953j0282q622o920n508m598m066l691l278
60439E41879k617j670p09m3L43N78N16k7p62j061p64m24n36q38o68J33R96J227
$$ plain form
60421 535553 536248 536114 535530 535303 536122 538049 540605 543500 547107 551808 556968 561176 563814 565894 568853
60406 568853 572935 577335 581572 585843 590121 593928 597300 601167 606241 612115 617941 623542 629322 635488
60392 635488 641927 648542 655133 661203 666444 671315 676582 682353 687954 692650 696112 698380 699876 701381
60378 701381 703520 706258 709201 712181 715124 717616 719313 720695 722732 725680 728839 731559 733833 735737
60364 735737 737048 737987 739709 743323 748542 753892 758266 761906 765787 770480 775859 781676 787977 794780
60350 794780 801664 808074 813977 819768 825394 829951 832474 832788 831253 828018 823035 816595 809310 801547
60336 801547 793367 784970 776804 769166 762052 755407 749235 743523 738368 734064 730693 727776 724765 721706
60322 721706 718897 716101 712775 709098 706061 704428 704196 705222 707690 711709 716995 723247 730333 737881
$$ packed form
60421E35553O95j34n84k27Q19J927K556K895L607M701N160M208K638K080K959
60406E68853M082M400M237M271M278L807L372L867N074N874N826N601N780O166
60392F35488O439O615O591O070N241M871N267N771N601M696L462K268J496J505
60378G01381K139K738K943K980K943K492J697J382K037K948L159K720K274J904
60364G35737J311R39J722L614N219N350M374L640L881M693N379N817O301O803
60350G94780O884O410N903N791N626M557K523L14j535l235m983o440p285p763
60336H01547q180q397q166p638p114o645o172n712n155m304l371k917l011l059
60322G21706k809k796l326l677l037j633k32J026K468M019N286O252P086P548
$$ plain form
60308 737881 745242 752078 758477 764240 768628 771161 772196 772434 772303 772087 772073 772161 771812 770706 768949 766347
60292 766347 762119 755836 748053 739477 730164 720174 710405 701845 694409 687375 680718 675080 670533 666273
60278 666273 661656 656859 652396 648546 645331 642475 639342 635445 631134 627282 624234 621579 619019 616836
60264 616836 615280 613979 612354 610436 609009 609002 610752 613708 616925 619963 623120 626640 630085 632939 635425
60249 635425 638090 640797 642937 644581 646594 649384 652197 653993 654504 654217 653787 653694 654033 654433 654605 655077
60233 655077 656844 660117 664029 667897 672110 677409 683902 691439 700378 711277 724049 738076 753000
60220 753000 768887 785772 803622 822594 842699 863179 882797 900908 917911 934554 951160
60209 951160 967624 983787 999570 1014922 1029804 1044206 1058144 1071688 1084892 1097634 1109640
$$ packed form
60308G37881P361O836O399N763M388K533J035K38j31k16j4Q8l49j106j757k602
60292G66347m228o283p783q576r313r990r769q560p436p034o657n638m547m260
60278F66273m617m797m463l850l215k856l133l897m311l852l048k655k560k183
60264F16836j556j301j625j918j427pJ750K956L217L038L157L520L445K854K486
60249F35425K665K707K140J644K013K790K813J796N11k87m30r3L39M00J72M72
60233F55077J767L273L912L868M213N299O493P537Q939J0899J2772J4027J4924
60220G53000J5887J6885J7850J8972K0105K0480J9618J8111J7003J6643J6606
60209I51160J6464J6163J5783J5352J4882J4402J3938J3544J3204J2742J2006
$$ plain form
60198 1109640 1120809 1131322 1141267 1150322 1158046 1164314 1169171 1172443 1173880 1173622 1172176 1169936 1167089 1163920
60184 1163920 1160823 1157900 1154927 1151812 1148790 1146025 1143341 1140528 1137765 1135567 1134392 1134342 1135078 1135988 1136564
60169 1136564 1136620 1135976 1134104 1130436 1125009 1118319 1110475 1100956 1089479 1076718 1063847 1051607 1040130
60156 1040130 1029469 1019922 1011910 1005730 1001331 998247 995945 994454 994336 995811 998171 1000462 1002470 1004586
60142 1004586 1006827 1008562 1009259 1009085 1008650 1008434 1008519 1008584 1008191 1007424 1007222 1008657 1011766 1015479 1018830 1021818 1024906
60125 1024906 1028199 1031465 1034639 1037828 1041076 1044564 1048976 1055221 1063708 1074189 1086290 1099955 1115286
60112 1115286 1132159 1150136 1168678 1187423 1206325 1225472 1244751 1263726 1281897 1298941 1314660
60101 1314660 1328955 1342036 1354405 1366269 1377031 1385685 1391754 1395595 1397741 1398188 1396397 1391760 1383983
$$ packed form
60198A109640J1169J0513R945R055P724O268M857L272J437k58j446k240k847l169
60184A163920l097k923k973l115l022k765k684k813k763k198j175n0P36R10N76
60169A136564N6o44j872l668n427o690p844r519j1477j2761j2871j2240j1477
60156A040130j0661r547q012o180m399l084k302j491j18J475K360K291K008K116
60142A004586K241J735O97j74m35k16Q5O5l93p67k02J435L109L713L351K988L088
60125A024906L293L266L174L189L248L488M412O245Q487J0481J2101J3665J5331
60112A115286J6873J7977J8542J8745J8902J9147J9279J8975J8171J7044J5719
60101A314660J4295J3081J2369J1864J0762Q654O069L841K146M47j791m637p777
$$ plain form
60088 1383983 1373150 1359552 1343425 1324833 1303839 1280715 1255986 1230424 1205103 1181194 1159361
60077 1159361 1139440 1121014 1104199 1089471 1076735 1065085 1053703 1042649 1032478 1023366 1014965 1007029
60065 1007029 999763 993479 988061 982991 977860 972744 967913 963177 957814 951399 944509 938251 933087 928458
60051 928458 923592 918298 912918 907875 903482 899903 897073 894826 893167 892094 891154 889735 888065 887401 888674
60036 888674 891319 894009 896199 898253 900247 901556 901787 901436 901228 901283 901228 900701 899420 897156 894071 890831
60020 890831 887978 885347 882448 879182 875779 872191 868090 863469 858770 854257 849667 844709 839553 834578
60006 834578 829837 825049 819991 814657 809141 803670 798657 794427 790821 787338 783804 780693 778661 777913
59992 777913 778232 779540 782270 787146 794636 804511 815800 827306 838330 848938 859385 869412 878359
$$ packed form
60088A383983j0833j3598j6127j8592k0994k3124k4729k5562k5321k3909k1833
60077A159361j9921j8426j6815j4728j2736j1650j1382j1054j0171r112q401p936
60065A007029p266o284n418n070n131n116m831m736n363o415o890o258n164m629
60051I28458m866n294n380n043m393l579k830k247j659j073r40j419j670o64J273
60036H88674K645K690K190K054J994J309K31l51k08N5n5n27j281k264l085l240
60020H90831k853k631k899l266l403l588m101m621m699m513m590m958n156m975
60006H34578m741m788n058n334n516n471n013m230l606l483l534l111k032p48
59992G77913L19J308K730M876P490R875J1289J1506J1024J0608J0447J0027Q947
$$ plain form
59979 878359 885922 892461 898349 903252 906370 907368 906803 905587 904193 902413 899719 895701 890337 884101 877865
59964 877865 872529 868557 865867 864205 863586 864287 866436 869713 873486 877124 880177 882462 884117 885526 886951
59949 886951 888225 888988 889296 889877 891652 895056 899807 905199 910519 915305 919471 923296 927212 931537 936433
59934 936433 942091 948866 957093 966763 977426 988466 999483 1010494 1021802 1033690 1046114 1058635
59922 1058635 1070668 1081894 1092479 1102951 1113972 1126174 1140024 1155613 1172622 1190626 1209350
59911 1209350 1228482 1247321 1264861 1280145 1292282 1300223 1303042 1300607 1293614 1282715 1268038 1249838
59899 1249838 1229184 1207441 1185235 1162491 1139484 1117382 1097716 1081639 1069646 1061470 1056153 1052638
59887 1052638 1050615 1050553 1052855 1057235 1063052 1069878 1077599 1086308 1096307 1107921 1121039 1135042 1149376
$$ packed form
59979H78359P563O539N888M903L118R98n65j216j394j780k694m018n364o236o236
59964H77865n336l972k690j662o19P01K149L277L773L638L053K285J655J409J425
59949H86951J274P63L08N81J775L404M751N392N320M786M166L825L916M325M896
59934I36433N658O775Q227R670J0663J1040J1017J1011J1308J1888J2424J2521
59922A058635J2033J1226J0585J0472J1021J2202J3850J5589J7009J8004J8724
59911A209350J9132J8839J7540J5284J2137P941K819k435o993j0899j4677j8200
59899A249838k0654k1743k2206k2744k3007k2102j9666j6077j1993q176n317l515
59887A052638k023o2K302M380N817O826P721Q709R999J1614J3118J4003J4334
$$ plain form
59874 1149376 1163873 1178284 1191809 1203519 1213074 1220689 1226503 1230350 1232121 1231970 1230083 1226564 1221715
59861 1221715 1216294 1211318 1207614 1205562 1205189 1206424 1209167 1213040 1217154 1220321 1221596 1220569 1217140 1211243
59847 1211243 1202923 1192554 1180887 1169007 1158254 1149855 1144387 1141632 1141088 1142399 1145171 1148655 1152060
59834 1152060 1155188 1158574 1163043 1169281 1177738 1188508 1201161 1214819 1228524 1241495 1253170 1263305
59822 1263305 1272282 1281234 1291660 1304769 1321109 1340745 1363592 1389318 1416890 1444520 1470406 1493438
59810 1493438 1512891 1527571 1535944 1537420 1533131 1525057 1514613 1502419 1489134 1475789 1463055 1450548
59798 1450548 1437108 1421708 1404089 1384777 1364625 1344302 1324063 1303960 1284215 1265302 1247704
59787 1247704 1231593 1216752 1202724 1189150 1175966 1163266 1151006 1139125 1128044 1118769 1112161 1108136
$$ packed form
59874A149376J4497J4411J3525J1710R555P615N814L847J771j51j887l519m849
59861A221715n421m976l704k052l73J235K743L873M114L167J275j027l429n897
59847A211243q320j0369j1667j1880j0753q399n468k755n44J311K772L484L405
59834A152060L128L386M469O238Q457J0770J2653J3658J3705J2971J1675J0135
59822A263305Q977Q952J0426J3109J6340J9636K2847K5726K7572K7630K5886K3032
59810A493438J9453J4680Q373J476m289q074j0444j2194j3285j3345j2734j2507
59798A450548j3440j5400j7619j9312k0152k0323k0239k0103j9745j8913j7598
59787A247704j6111j4841j4028j3574j3184j2700j2260j1881j1081r275o608m025
$$ plain form
59775 1108136 1105827 1104568 1104469 1106020 1109354 1114072 1119682 1125982 1133023 1140835 1149349 1158488 1168151 1178110
59761 1178110 1188175 1198624 1210221 1223505 1238226 1253820 1270325 1288359 1308150 1329010 1349848
59750 1349848 1369759 1387908 1403260 1414877 1422346 1425763 1425574 1422568 1417672 1411426 1403886 1395198 1385854
59737 1385854 1376102 1365554 1353912 1341747 1329983 1318871 1308141 1298087 1289749 1283820 1279944 1277349
59725 1277349 1275701 1275033 1275181 1275780 1276719 1278272 1280722 1283983 1287700 1291634 1295914 1300920 1307008 1314485 1323814
59710 1323814 1335637 1350535 1368860 1390809 1416412 1445430 1477517 1512531 1550350 1590322 1631396
59699 1631396 1673056 1715688 1759622 1804220 1848355 1891378 1933019 1972685 2009674 2043949 2075944
59688 2075944 2105473 2131471 2153050 2170239 2183481 2192901 2198401 2200081 2198240 2193174 2185271 2175112
$$ packed form
59775A108136k309j259r9J551L334M718N610O300P041P812Q514R139R663R959
59761A178110J0065J0449J1597J3284J4721J5594J6505J8034J9791K0860K0838
59750A349848J9911J8149J5352J1617P469L417j89l006m896o246p540q688r344
59737A385854r752j0548j1642j2165j1764j1112j0730j0054q338n929l876k595
59725A277349j648o68J48N99R39J553K450L261L717L934M280N006O088P477R329
59710A323814J1823J4898J8325K1949K5603K9018L2087L5014L7819L9972M1074
59699A631396M1660M2632M3934M4598M4135M3023M1641L9666L6989L4275L1995
59688B075944K9529K5998K1579J7189J3242R420N500J680j841n066p903j0159
$$ plain form
59676 2175112 2163254 2149988 2135454 2119897 2103802 2087930 2073255 2060691 2050842 2044117 2040982 2041891
59664 2041891 2047030 2056384 2069970 2087758 2109459 2134805 2163912 2196884 2232935 2270308 2307251 2342780
59652 2342780 2376367 2407215 2433992 2455022 2468630 2473544 2469065 2454663 2429511 2392987 2345911 2290853
59640 2290853 2230815 2167774 2102793 2037197 1972988 1911918 1854564 1800630 1750032 1703304 1660900
59629 1660900 1622462 1587061 1553841 1521938 1489967 1456397 1420748 1383873 1346690 1309254 1271597
59618 1271597 1234863 1200759 1170123 1142757 1118435 1097185 1078663 1062197 1047719 1035904 1027114
59607 1027114 1020810 1016210 1012966 1010955 1009984 1009922 1010563 1011196 1010978 1009966 1009101 1008798 1008339 1007139 1005829 1005296
59591 1005296 1005212 1004454 1002743 1000980 999923 999257 998098 995859 992511 988437 984197 980020 975396 969426 961731
$$ packed form
59676B175112j1858j3266j4534j5557j6095j5872j4675j2564r849o725l135R09
59664B041891N139R354J3586J7788K1701K5346K9107L2972L6051L7373L6943L5529
59652B342780L3587L0848K6777K1030J3608M914m479j4402k5152l6524m7076n5058
59640B290853o0038o3041o4981o5596o4209o1070n7354n3934n0598m6728m2404
59629A660900l8438l5401l3220l1903l1971l3570l5649l6875l7183l7436l7657
59618A271597l6734l4104l0636k7366k4322k1250j8522j6466j4478j1815q790
59607A027114o304m600l244k011r71o2O41O33k18j012q65l03m59j200j310n33
59591A005296q4p58j711j763j057o66j159k239l348m074m240m177m624n970p695
$$ plain form
59576 961731 952791 943364 933904 924689 916111 908430 901365 894431 887840 882658 879664 878217 876771 874556
59562 874556 872234 870736 870068 869761 869965 871304 873882 877222 881204 886283 892655 899942 908021 917469 928757
59547 928757 941424 954592 968010 982215 997799 1014875 1033141 1052267 1072169 1092974 1114696
59536 1114696 1137113 1160160 1184202 1209427 1235050 1259469 1280990 1297925 1308480 1311773 1309207 1303846
59524 1303846 1297885 1291393 1283797 1275539 1267483 1259468 1250466 1239866 1227776 1214326 1199481 1183504 1166907
59511 1166907 1149895 1132338 1114367 1096625 1079861 1064550 1050910 1039040 1029050 1021126 1015343 1011411
59499 1011411 1008924 1007992 1009350 1013621 1020748 1030214 1041423 1053762 1066797 1080726 1096184 1113271 1131215
59486 1131215 1149209 1167035 1184449 1200520 1214196 1225210 1233903 1240381 1244241 1244964 1242340 1236878 1229958
$$ packed form
59576I61731q940r427r460r215q578p681p065o934o591n182k994j447j446k215
59562H74556k322j498o68l07K04J339K578L340L982N079O372P287Q079R448J1288
59547I28757J2667J3168J3418J4205J5584J7076J8266J9126J9902K0805K1722
59536A114696K2417K3047K4042K5225K5623K4419K1521J6935J0555L293k566n361
59524A303846n961o492p596q258q056q015r002j0600j2090j3450j4845j5977j6597
59511A166907j7012j7557j7971j7742j6764j5311j3640j1870r990p924n783l932
59499A011411k487r32J358M271P127R466J1209J2339J3035J3929J5458J7087J7944
59486A131215J7994J7826J7414J6071J3676J1014Q693O478L860P23k624n462o920
$$ plain form
59473 1229958 1223024 1216253 1208586 1199462 1189823 1180908 1172780 1164872 1157385 1151191 1146684 1143618 1141854 1141445
59459 1141445 1142156 1143702 1146414 1150986 1157602 1165857 1175356 1185822 1196763 1207695 1218449 1228695 1237404
59446 1237404 1243512 1246903 1248042 1246944 1243329 1237577 1230576 1222659 1213587 1203653 1193886 1185042 1177206 1170560
59432 1170560 1165795 1163426 1163226 1164494 1166378 1167977 1168831 1169505 1171092 1174070 1178130 1183058 1189099 1196357 1204545
59417 1204545 1213411 1222818 1232390 1241869 1251879 1263549 1277170 1291872 1306674 1320989 1333877 1343753
59405 1343753 1349242 1349563 1343872 1331437 1313446 1293892 1277573 1267168 1262631 1262824 1266756 1273206 1279974
59392 1279974 1284117 1283067 1275735 1262808 1246170 1228032 1210453 1195118 1183014 1174343 1169129 1167761
59380 1167761 1170495 1176695 1185242 1195675 1208198 1222572 1237815 1253156 1268493 1283630 1297809 1310455
$$ packed form
59473A229958o934o771p667r124r639q915q128p908p487o194m507l066j764m09
59459A141445P11J546K712M572O616Q255R499J0466J0941J0932J0754J0246Q709
59446A237404O108L391J139j098l615n752p001p917r072r934r767q844p836o646
59432A170560m765k369k00J268J884J599Q54O74J587K978M060M928O041P258Q188
59417A204545Q866R407R572R479J0010J1670J3621J4702J4802J4315J2888R876
59405A343753N489L21n691j2435j7991j9554j6319j0405m537J93L932O450O768
59392A279974M143j050p332j2927j6638j8138j7579j5335j2104q671n214j368
59380A167761K734O200Q547J0433J2523J4374J5243J5341J5337J5137J4179J2646
$$ plain form
59368 1310455 1321784 1332263 1342024 1351171 1360085 1368923 1377194 1384294 1390145 1395018 1399160 1402917 1406826
59355 1406826 1411238 1416189 1421865 1428809 1437488 1448176 1461469 1478308 1499067 1523140 1549718 1578422
59343 1578422 1608808 1639965 1671102 1701888 1731565 1758367 1780664 1798315 1812086 1822091 1827608
59332 1827608 1828291 1824654 1817302 1806415 1792119 1774721 1754260 1730304 1702601 1671813 1639365 1606532
59320 1606532 1573667 1540363 1506393 1472442 1439733 1409046 1380459 1353942 1329554 1306871 1284784
59309 1284784 1262408 1239877 1217991 1197424 1178608 1161897 1147381 1134779 1123988 1115479 1109784 1106847
59297 1106847 1106287 1108037 1112305 1119112 1128229 1139300 1151602 1163891 1174910 1183861 1190182 1193360 1193617
59284 1193617 1192432 1191653 1192123 1193747 1196755 1202131 1210618 1221909 1235180 1250124 1267150 1286635 1308112
$$ packed form
59368A310455J1329J0479R761R147Q914Q838Q271P100N851M873M142L757L909
59355A406826M412M951N676O944Q679J0688J3293J6839K0759K4073K6578K8704
59343A578422L0386L1157L1137L0786K9677K6802K2297J7651J3771J0005N517
59332A827608O83l637p352j0887j4296j7398k0461k3956k7703l0788l2448l2833
59320A606532l2865l3304l3970l3951l2709l0687k8587k6517k4388k2683k2087
59309A284784k2376k2531k1886k0567j8816j6711j4516j2602j0791q509n695k937
59297A106847n60J750M268O807R117J1071J2302J2289J1019Q951O321L178K57
59284A193617j185p79M70J624L008N376Q487J1291J3271J4944J7026J9485K1477
$$ plain form
59271 1308112 1330206 1351494 1371474 1390478 1408545 1424809 1438334 1449171 1458062 1465263 1470147 1471922
59259 1471922 1470238 1465147 1456970 1446276 1433579 1418868 1401743 1382119 1360557 1337861 1314631 1291289
59247 1291289 1268225 1245701 1223694 1202073 1181043 1161352 1143970 1129341 1116982 1105956 1095752
59236 1095752 1086468 1078200 1070691 1063786 1057787 1052978 1049021 1045220 1041283 1037575 1034713 1033092 1032619 1032676 1032485
59221 1032485 1031725 1030667 1029577 1028219 1026122 1023048 1018997 1014131 1008987 1004327 1000297 995954 990177 982939
59207 982939 975256 968013 961353 955195 949899 946290 945243 947206 951875 958381 966064 975040 985776 998316
59193 998316 1012259 1027436 1044189 1062917 1083661 1106070 1129475 1152773 1174484 1193171 1207921
59182 1207921 1218450 1224723 1226428 1222948 1214101 1200749 1184244 1165265 1143719 1119943 1095359 1071464
$$ packed form
59271A308112K2094K1288J9980J9004J8067J6264J3525J0837Q891P201M884J775
59259A471922j684n091q177j0694j2697j4711j7125j9624k1562k2696k3230k3342
59247A291289k3064k2524k2007k1621k1030j9691j7382j4629j2359j1026j0204
59236A095752r284q268p509o905n999m809l957l801l937l708k862j621m73N7j91
59221A032485p60j058j090j358k097l074m051m866n144m660m030m343n777p238
59207I82939p683p243o660o158n296l609j047J963M669O506P683Q976J0736J2540
59193I98316J3943J5177J6753J8728K0744K2409K3405K3298K1711J8687J4750
59182A207921J0529O273J705l480q847j3352j6505j8979k1546k3776k4584k3895
$$ plain form
59170 1071464 1048659 1026602 1005399 985869 968757 954224 942002 931705 923043 916087 911162 908235
59158 908235 906697 906101 906785 909224 913136 917894 923610 930989 940011 949481 958095 965414 971559 976495 979935
59143 979935 981567 980952 977423 970487 960383 948102 934866 921673 909257 898271 889291 882529 877729
59130 877729 874635 873515 874872 878614 884005 890647 898993 909489 921592 934166 946622 959170 972091
59117 972091 985190 997980 1010017 1021044 1031026 1039932 1047328 1052405 1054702 1054576 1052738 1049604 1045419
59104 1045419 1040646 1035700 1030453 1024476 1017652 1010292 1002870 995973 990186 985563 981429 977169 972947 969255
59090 969255 966077 963060 960219 957815 955769 953853 952311 951637 951800 952321 952997 953946 955035 955995 957069 958846
59074 958846 961366 964070 966634 969211 971747 973761 974990 975627 975723 974888 972761 969256 964207 957398 949165
$$ packed form
59170A071464k2805k2057k1203j9530j7112j4533j2222j0297q662o956m925k927
59158I08235j538n96O84K439L912M758N716P379R022R470Q614P319O145M936L440
59143I79935J632o15l529o936j0104j2281j3236j3193j2416j0986q980o762m800
59130H77729l094j120J357L742N391O642Q346J0496J2103J2574J2456J2548J2921
59117I72091J3099J2790J2037J1027R982Q906P396N077K297j26j838l134m185
59104A045419m773m946n247n977o824p360p422o897n787m623m134m260m222l692
59090I69255l178l017k841k404k046j916j542o74J63N21O76R49J089R60J074J777
59074I58846K520K704K564K577K536K014J229O37R6q35k127l505n049o809q233
$$ plain form
59059 949165 940441 931928 923566 914987 906056 896911 887942 879911 873622 869307 866694 865720 866639 869372 873320
59044 873320 877937 882877 887493 890913 892957 894312 895440 895900 895273 894185 893779 894425 895445 895967 895671 894903
59028 894903 894414 894891 896539 899195 902937 908284 915599 924556 934386 944400 954053 962767 969971 975242
59014 975242 978364 979435 978888 977038 973600 968102 960964 953740 948002 944185 941698 939815 938227 937022
59000 937022 936498 936974 938609 941452 945497 950473 955607 960040 963560 966683 970004 973815 978281 983544 989624
58985 989624 996648 1005190 1015815 1028219 1041482 1055413 1071037 1089493 1111021 1135365 1162479 1192260
58973 1192260 1223991 1256621 1289332 1321391 1351704 1379012 1402381 1421156 1434659 1442384 1444371 1441011
58961 1441011 1432578 1419213 1401286 1379545 1355066 1329140 1302963 1277099 1251428 1225830 1200689
$$ packed form
59059I49165q724q513q362q579q931r145q969q031o289m315k613r74R19K733L948
59044H73320M617M940M616L420K044J355J128M60o27j088m06O46J020N22k96p68
59028H94903m89M77J648K656L742N347P315Q957R830J0014R653Q714P204N271
59014I75242L122J071n47j850l438n498p138p224n738l817k487j883j588j205
59000I37022n24M76J635K843M045M976N134M433L520L123L321L811M466N263O080
58985I89624P024Q542J0625J2404J3263J3931J5624J8456K1528K4344K7114K9781
58973A192260L1731L2630L2711L2059L0313K7308K3369J8775J3503P725J987l360
58961A441011q433j3365j7927k1741k4479k5926k6177k5864k5671k5598k5141
$$ plain form
58950 1200689 1176532 1153500 1131559 1111012 1092380 1075815 1060942 1047324 1034938 1024280 1016066
58939 1016066 1010633 1007486 1005619 1004468 1004282 1005468 1007872 1011011 1014641 1018633 1022523 1025769 1028437 1031112
58925 1031112 1033922 1036078 1036748 1036226 1035868 1036857 1039273 1042502 1046309 1051160 1057578 1065630 1075222 1086551 1099779
58910 1099779 1114412 1129452 1144374 1159765 1176913 1196774 1219191 1242906 1266409 1288978 1310901
58899 1310901 1332704 1354456 1376002 1397455 1419033 1440628 1461996 1483232 1504677 1526557 1549149
58888 1549149 1573038 1598631 1625602 1653456 1682508 1713532 1746404 1779835 1812629 1844617 1876173
58877 1876173 1907376 1937897 1967141 1994210 2018080 2037984 2053256 2062809 2065345 2060329 2048325 2030238
58865 2030238 2006640 1977945 1944727 1907689 1867742 1826239 1784579 1743405 1702582 1662086 1622433
$$ packed form
58950A200689k4157k3032k1941k0547j8632j6565j4873j3618j2386j0658q214
58939A016066n433l147j867j151j86J186K404L139L630L992L890L246K668K675
58925A031112K810K156O70n22l58R89K416L229L807M851O418Q052R592J1329J3228
58910A099779J4633J5040J4922J5391J7148J9861K2417K3715K3503K2569K1923
58899A310901K1803K1752K1546K1453K1578K1595K1368K1236K1445K1880K2592
58888A549149K3889K5593K6971K7854K9052L1024L2872L3431L2794L1988L1556
58877A876173L1203L0521K9244K7069K3870J9904J5272R553K536n016j2004j8087
58865B030238k3598k8695l3218l7038l9947m1503m1660m1174m0823m0496l9653
$$ plain form
58854 1622433 1584154 1547400 1512214 1478692 1446706 1415974 1386513 1358489 1331551 1304944 1278384
58843 1278384 1252214 1226594 1201304 1176493 1152755 1130087 1107611 1084934 1063140 1043882 1027861
58832 1027861 1014676 1003672 994461 986913 981099 977112 974892 974520 976492 981009 986979 992646 997493 1002703
58818 1002703 1009426 1017427 1025832 1034326 1042954 1051493 1059676 1067535 1074965 1081454 1086630 1090565 1093168 1093992
58804 1093992 1093014 1090837 1087673 1082965 1076614 1069714 1063392 1057707 1052520 1048643 1047200 1048380 1051739 1057190
58790 1057190 1064874 1074548 1086015 1099761 1116369 1135644 1157053 1180617 1206667 1235130 1265733 1298384
58778 1298384 1332568 1366822 1399668 1430632 1459618 1485783 1507771 1524515 1534964 1537692 1531918 1518582
58766 1518582 1499405 1475252 1446410 1413981 1379787 1345025 1310086 1275521 1242114 1210145 1179589
$$ packed form
58854A622433l8279l6754l5186l3522l1986l0732k9461k8024k6938k6607k6560
58843A278384k6170k5620k5290k4811k3738k2668k2476k2677k1794j9258j6021
58832A027861j3185j1004r211p548n814l987k220l72J972M517N970N667M847N210
58818A002703O723Q001Q405Q494Q628Q539Q183P859P430O489N176L935K603Q24
58804A093992r78k177l164m708o351o900o322n685n187l877j443J180L359N451
58790A057190P684R674J1467J3746J6608J9275K1409K3564K6050K8463L0603L2651
58778A298384L4184L4254L2846L0964K8986K6165K1988J6744J0449K728n774j3336
58766A518582j9177k4153k8842l2429l4194l4762l4939l4565l3407l1969l0556
$$ plain form
58755 1179589 1150983 1125168 1102228 1081527 1062624 1045308 1029033 1013415 999098 987047 977109
58744 977109 968309 960429 954158 949756 946780 945174 945437 947511 950588 954123 958011 961722 964547 966989
58730 966989 970572 975766 981165 985270 987999 989887 990960 991276 991735 993349 996200 999932 1004901 1012082 1021955
58715 1021955 1034062 1047551 1061803 1076575 1091709 1106586 1119870 1130066 1136287 1138105 1134801 1125462
58703 1125462 1109985 1089441 1065173 1037974 1008264 976554 943527 910062 877373 846725 818832
58692 818832 793784 771589 752409 736269 722927 712036 703107 695522 689078 684373 682022 681660 682328
58679 682328 683659 685917 689030 692477 696109 700093 703864 706115 706222 704890 703023 700694 697649 694163
58665 694163 690879 688401 687379 688379 691129 694317 696591 697408 696619 693776 688379 680500 670741 659751
$$ packed form
58755A179589k8606k5815k2940k0701j8903j7316j6275j5618j4317j2051r938
58744I77109q800p880o271m402k976j606K63K074L077L535L888L711K825K442
58730I66989L583N194N399M105K729J888J073L16M59J614K851L732M969P181R873
58715A021955J2107J3489J4252J4772J5134J4877J3284J0196O221J818l304r339
58703A125462j5477k0544k4268k7199k9710l1710l3027l3465l2689l0648k7893
58692H18832k5048k2195j9180j6140j3342j0891q929p585o444m705k351l62O68
58679F82328J331K258L113L447L632L984L771K251J07j332j867k329l045l486
58665F94163l284k478j022J000K750L188K274Q17p89k843n397p879r759j0990
$$ plain form
58651 659751 648118 636456 625300 614987 605732 597608 590355 583541 577111 571546 567319 564369 562195
58638 562195 560329 558681 557529 557145 557378 557829 558494 559766 561526 562918 563557 564388 566466 569303 571353 571888
58622 571888 571417 570424 568845 566895 565304 564440 564074 564309 565828 568753 572064 574731 576923 579636 583492
58607 583492 588338 593711 599329 605194 611299 617252 622484 627102 632142 638421 645442 652069 657888 663163
58593 663163 667868 671792 675421 679707 684986 691153 698790 708969 721773 736111 751208 767267 784416
58580 784416 802009 819356 836192 852085 866265 878439 889058 898494 906691 913821 920470 927048
58568 927048 933873 941875 952113 964499 978135 993115 1010591 1030618 1051329 1070989 1089573 1107487
58556 1107487 1123889 1137345 1147213 1153345 1155217 1152570 1146384 1138176 1128607 1117621 1105620 1093634 1082390
$$ packed form
58651F59751j1633j1662j1156j0313r255q124p253o814o430n565m227k950k174
58638E62195j866j648j152l84K33M51O65J272J760J392O39Q31K078K837K050N35
58622E71888m71r93j579j950j591q64l66K35J519K925L311K667K192K713L856
58607E83492M846N373N618N865O105N953N232M618N040O279P021O627N819N275
58593F63163M705L924L629M286N279O167P637J0179J2804J4338J5097J6059J7149
58580G84416J7593J7347J6836J5893J4180J2174J0619R436Q197P130O649O578
58568I27048O825Q002J0238J2386J3636J4980J7476K0027K0711J9660J8584J7914
58556A107487J6402J3456R868O132J872k647o186q208r569j0986j2001j1986j1244
$$ plain form
58543 1082390 1071695 1060586 1047791 1032445 1014711 995362 974576 951644 926145 898790 870881
58532 870881 843625 818175 795498 775582 757435 740392 724859 711370 699612 688889 678993 670069
58520 670069 662078 654821 648131 641858 636121 631556 628567 626385 623826 621103 619710 620161 621143 621448 621614
58505 621614 622875 625519 629064 633197 637675 641987 645818 649224 651962 653561 654549 656582 660647 666131
58491 666131 672336 679806 689187 699851 710771 722010 734252 747494 761208 775231 789570 803929
58479 803929 818283 833331 849431 865573 880159 892322 901777 908105 911007 910675 907192 900288 890404
58466 890404 879190 868033 856829 845128 833753 824213 817171 812522 810416 811140 814461 820058 828103
58453 828103 838536 850169 861409 871412 879782 885692 888213 886989 881864 872487 859175 843525 827226
$$ packed form
58543A082390j0695j1109j2795j5346j7734j9349k0786k2932k5499k7355k7909
58532H70881k7256k5450k2677j9916j8147j7043j5533j3489j1758j0723r896q924
58520F70069p991p257o690o273n737m565k989k182k559k723j393M51R82L05J66
58505F21614J261K644L545M133M478M312L831L406K738J599R88K033M065N484
58491F66131O205P470R381J0664J0920J1239J2242J3242J3714J4023J4339J4359
58479H03929J4354J5048J6100J6142J4586J2163R455O328K902l32l483o904r884
58466H90404j1214j1157j1204j1701j1375r540p042m649k106P24L321N597Q045
58453H28103J0433J1633J1240J0003Q370N910K521j224n125r377j3312j5650j6299
$$ plain form
58440 827226 810806 794363 778813 765373 754363 745481 738697 733954 730600 728091 726783 727141 728818
58427 728818 731372 735128 740316 746056 751307 756212 761381 766470 770556 773270 774473 773438 769616 763662
58413 763662 756624 748663 739706 730644 722559 715320 708275 701841 697062 693989 691790 690133 689214 688837 688758
58398 688758 689585 692034 695574 698965 701924 705069 708571 712045 715451 718913 721978 724256 726485 729752
58384 729752 733917 737904 741215 744022 746217 747696 749317 752233 756397 760876 765485 770986 777793 785505
58370 785505 793604 801699 809358 816606 824295 833157 842918 853067 863852 875586 887698 899504 911204
58357 911204 923055 934286 943922 951928 958455 962880 964873 965535 966193 966919 967492 968682 971061 973655 975518
58342 975518 977656 981652 987353 993838 1001661 1011968 1024146 1036514 1048847 1062120 1076308 1090521
$$ packed form
58440H27226j6420j6443j5550j3440j1010q882o784m743l354k509j308L58J677
58427G28818K554L756N188N740N251M905N169N089M086K714J203j035l822n954
58413G63662p038p961q957r062q085p239p045o434m779l073k199j657r19l77p9
58398F88758Q27K449L540L391K959L145L502L474L406L462L065K278K229L267
58384G29752M165L987L311K807K195J479J621K916M164M479M609N501O807P712
58370G85505Q099Q095P659P248P689Q862R761J0149J0785J1734J2112J1806J1700
58357I11204J1851J1231R636Q006O527M425J993O62O58P26N73J190K379K594J863
58342I75518K138L996N701O485P823J0307J2178J2368J2333J3273J4188J4213
$$ plain form
58330 1090521 1104833 1119914 1135225 1149517 1162587 1174568 1184230 1190266 1193770 1197082 1200579 1202927
58318 1202927 1204170 1206040 1209349 1213452 1218300 1224777 1232967 1242165 1252566 1264917 1278757 1293083 1308413
58305 1308413 1325918 1344781 1362809 1379450 1395886 1412420 1428231 1443521 1459286 1475015 1489157
58294 1489157 1501918 1515153 1529518 1544158 1559088 1575352 1592931 1611061 1630475 1652622 1676765
58283 1676765 1700668 1724145 1749123 1776264 1804372 1833130 1863393 1894680 1925464 1956165 1988859
58272 1988859 2023840 2059411 2095252 2132965 2173210 2215450 2260497 2309969 2363106 2417545 2473395
58261 2473395 2532962 2596300 2660777 2725383 2791525 2859128 2925938 2991486 3057848 3125734 3193658
58250 3193658 3261750 3332500 3406922 3483878 3564012 3650362 3744174 3843951 3949333 4061879 4181484
$$ packed form
58330A090521J4312J5081J5311J4292J3070J1981R662O036L504L312L497K348
58318A202927J243J870L309M103M848O477Q190R198J0401J2351J3840J4326J5330
58305A308413J7505J8863J8028J6641J6436J6534J5811J5290J5765J5729J4142
58294A489157J2761J3235J4365J4640J4930J6264J7579J8130J9414K2147K4143
58283A676765K3903K3477K4978K7141K8108K8758L0263L1287L0784L0701L2694
58272A988859L4981L5571L5841L7713M0245M2240M5047M9472N3137N4439N5850
58261B473395N9567O3338O4477O4606O6142O7603O6810O5548O6362O7886O7924
58250C193658O8092P0750P4422P6956Q0134Q6350R3812R9777J05382J12546J19605
$$ plain form
58239 4181484 4306313 4436968 4576468 4725674 4883269 5050406 5230255 5422585 5624297
58230 5624297 5835905 6061787 6303552 6559403 6830797 7123116 7438628 7775719 8136372
58221 8136372 8527184 8951496 9408263 9900644 10437814 11026169 11667184 12366639 13137648
58212 13137648 13992256 14939589 15995583 17185585 18535549 20073152 21843116 23910985
58204 23910985 26346918 29215483 32582357 36513791 41061596 46263465 52167328 58845183
58196 58845183 66385931 74907094 84596271 95730051 108648837 123741249 141448004
58189 141448004 162183111 186117383 212960799 241910252 271707073 300612710 326312083
58182 326312083 346022406 357016656 357419846 346894451 326875793 300216823 270343706
$$ packed form
58239D181484J24829J30655J39500J49206J57595J67137J79849J92330K01712
58230E624297K11608K25882K41765K55851K71394K92319L15512L37091L60653
58221H136372L90812M24312M56767M92381N37170N88355O41015O99455P71009
58212A3137648Q54608R47333J055994J190002J349964J537603J769964K067869
58204B3910985K435933K868565L366874L931434M547805N201869N903863O677855
58196E8845183P540748Q521163R689177J1133780J2918786J5092412J7706755
58189A41448004K0735107K3934272K6843416K8949453K9796821K8905637K5699373
58182C26312083J9710323J0994250M03190j0525395k0018658k6658970k9873117
$$ plain form
58175 270343706 240278874 211996025 186350692 163429482 142970397 124649413 108231219
58168 108231219 93617763 80795394 69728037 60295119 52312622 45581293 39909612
58161 39909612 35121964 31071096 27640816 24731199 22249280 20117283 18277863 16684150
58153 16684150 15292476 14068569 12990656 12039753 11193297 10432068 9745451 9124954 8559039
58144 8559039 8038599 7561124 7124919 6724443 6354924 6016175 5708037 5426590 5167945
58135 5167945 4931178 4714713 4514191 4326446 4151278 3987126 3829628 3676757 3530940
58126 3530940 3393851 3263517 3138664 3021252 2912249 2809340 2711301 2620278 2537136 2458688
58116 2458688 2382272 2309188 2240929 2175881 2112588 2052698 1997758 1946259 1896491 1849259 1805218
$$ packed form
58175B70343706l0064832k8282849k5645333k2921210k0459085j8320984j6418194
58168A08231219j4613456j2822369j1067357r432918p982497o731329n671681
58161C9909612m787648m050868l430280k909617k481919k131997j839420j593713
58153A6684150j391674j223907j077913r50903q46456p61229o86617o20497n65915
58144H559039n20440m77475m36205m00476l69519l38749l08138k81447k58645
58135E167945k36767k16465k00522j87745j75168j64152j57498j52871j45817
58126C530940j37089j30334j24853j17412j09003j02909r8039r1023q3142p8448
58116B458688p6416p3084o8259o5048o3293n9890n4940n1499m9768m7232m4041
$$ plain form
58105 1805218 1762622 1720261 1679710 1642197 1606012 1569485 1533720 1499976 1467043 1433668 1401053
58094 1401053 1370560 1341477 1313309 1287794 1266220 1247104 1228817 1212154 1198083 1185365 1172769
58083 1172769 1161305 1151761 1142175 1130362 1117033 1104057 1091479 1078579 1065954 1054029 1041257 1026270
58071 1026270 1010309 995308 981100 966719 952845 940581 929270 917812 906748 896831 886911 875598
58059 875598 863764 853088 843254 832823 821722 810588 798739 785174 770741 757021 743854 730132
58047 730132 716331 704007 693336 683240 673518 664804 656873 648942 641339 634967 629432 623466 617011
58034 617011 611116 605938 600505 594403 588243 582480 577081 572141 567606 562614 556367 549419 542924 536951
58020 536951 530737 524249 518173 512579 506904 501138 495871 491228 486815 482645 479160 476430 474180 472419
$$ packed form
58105A805218m2596m2361m0551l7513l6185l6527l5765l3744l2933l3375l2615
58094A401053l0493k9083k8168k5515k1574j9116j8287j6663j4071j2718j2596
58083A172769j1464r544r586j1813j3329j2976j2578j2900j2625j1925j2772j4987
58071A026270j5961j5001j4208j4381j3874j2264j1311j1458j1064r917r920j1313
58059H75598j1834j0676r834j0431j1101j1134j1849j3565j4433j3720j3167j3722
58047G30132j3801j2324j0671j0096r722q714p931p931p603o372n535n966o455
58034F17011n895n178n433o102o160n763n399m940m535m992o247o948o495n973
58020E36951o214o488o076n594n675n766n267m643m413m170l485k730k250j761
$$ plain form
58006 472419 471245 470322 469351 468802 469393 471150 473647 476773 480503 484373 487999 491731 496038 500626 504826
57991 504826 508401 511355 513630 515666 518591 523072 528601 534643 541591 549711 558079 565819 573678 583136
57977 583136 594520 607221 621235 637188 655178 674765 695830 718215 740802 762054 781299
57966 781299 798374 812169 820622 822159 816327 803317 783976 760208 734249 707332 679680 651659
57954 651659 624170 598041 573801 552030 533198 517192 503538 491943 482156 473696 466367 460686
57942 460686 457159 455565 455631 457851 462619 468930 474976 479940 484330 488784 493498 498739 504807 511234 516739
57927 516739 520272 521621 521000 518579 514580 509483 504025 499036 494958 491321 487136 482204 477673 474947
57913 474947 474493 476056 479472 484660 491272 498915 507301 515725 522909 527863 530392 530331 527070 520441 511363
$$ packed form
58006D72419j174r23r71n49N91J757K497L126L730L870L626L732M307M588M200
57991E04826L575K954K275K036K925M481N529O042O948Q120Q368P740P859R458
57977E83136J1384J2701J4014J5953J7990J9587K1065K2385K2587K1252J9245
57966G81299J7075J3795Q453J537n832j3010j9341k3768k5959k6917k7652k8021
57954F51659k7489k6129k4240k1771j8832j6006j3654j1595r787q460p329n681
57942D60686l527j594O6K220M768O311O046M964M390M454M714N241O068O427N505
57927E16739L533J349o21k421l999n097n458m989m078l637m185m932m531k726
57913D74947m54J563L416N188O612P643Q386Q424P184M954K529o1l261o629r078
$$ plain form
57898 511363 500871 489149 476267 463133 450742 439124 427976 417773 409308 402607 397280 393396
57886 393396 390985 389185 386969 384424 382301 380662 378957 377027 374937 372225 368508 364565 361628 359715
57872 359715 357859 355812 354349 353921 354202 355092 357021 360078 363784 367989 373131 379418 386490 394006 401865
57857 401865 409828 417687 425752 434378 443026 450622 456865 462286 466972 470165 471376 471103 470153 468827 466977
57842 466977 464343 460678 456049 451067 446458 442460 438979 436087 433813 431731 429420 427079 425122 423483
57828 423483 422000 421012 420714 420356 419162 417819 417883 419664 421738 422666 422292 421313 420472 420346 421114 422349 423621
57811 423621 425253 427810 431036 434113 436764 439184 441037 441608 440979 440060 439408 438980 439051 440308 442906 446446
57795 446446 450991 457093 464628 472680 480781 489206 497751 505276 510854 514434 516000 514999 511066 504560
$$ packed form
57898E11363j0492j1722j2882j3134j2391j1618j1148j0203q465o701n327l884
57886C93396k411j800k216k545k123j639j705j930k090k712l717l943k937j913
57872C59715j856k047j463m28K81Q90J929L057L706M205N142O287P072P516P859
57857D01865P963P859Q065Q626Q648P596O243N421M686L193J211k73r50j326j850
57842D66977k634l665m629m982m609l998l481k892k274k082k311k341j957j639
57828D23483j483r88k98l58j194j343O4J781K074R28l74r79q41j26P68J235J272
57811D23621J632K557L226L077K651K420J853N71o29r19o52m28P1J257K598L540
57795D46446M545O102P535Q052Q101Q425Q545P525N578L580J566j001l933o506
$$ plain form
57781 504560 496018 485943 475375 465777 457837 451095 445005 439553 434527 429230 423475 417997 413314 408856
57767 408856 403798 398143 392450 387040 381893 376816 371371 365195 358694 352837 348052 343926 340153 337019
57753 337019 334700 332877 331318 330109 329135 328240 328105 329932 333805 338351 342427 346116 349583 352224 353794
57738 353794 355316 357811 360896 363643 366093 368949 372362 376069 380225 385039 389955 394184 397840 401667
57724 401667 405902 410151 414134 417773 420770 422884 424464 425904 426752 426200 424360 422291 420663 419134 417129
57709 417129 414558 411581 408229 404568 400907 397567 394592 391811 389098 386511 384245 382435 381057 380135
57695 380135 379894 380407 381181 381550 381492 381531 381779 381687 380958 380059 379558 379579 380262 382106 385344 389607 394784 401668
57677 401668 411071 422687 435585 449651 465923 485705 509860 538843 572892 612167 656941 707435
$$ packed form
57781E04560q542j0075j0568r598p940o742o090n452n026n297n755n478m683m458
57767D08856n058n655n693n410n147n077n445o176o501n857m785m126l773l134
57753C37019k319j823j559j209r74q95j35J827L873M546M076L689L467K641J570
57738C53794J522K495L085K747K450K856L413L707M156M814M916M229L656L827
57724D01667M235M249L983L639K997K114J580J440Q48n52j840k069j628j529k005
57709D17129k571k977l352l661l661l340k975k781k713k587k266j810j378r22
57695C80135k41N13P74L69n8L9K48r2p29q99n01K1O83J844L238M263N177O884
57677D01668R403J1616J2898J4066J6272J9782K4155K8983L4049L9275M4774N0494
$$ plain form
57665 707435 763054 821801 880383 934428 978449 1006557 1014322 1000452 966978 918473 861192 801674
57653 801674 744780 692858 646950 608191 577406 553940 535957 521845 510761 502057 495044 489317
57641 489317 484604 480259 475467 469921 463726 456705 448463 439219 429953 421524 414059 407320 401190 395572
57627 395572 390143 384512 378547 372500 366832 361887 357529 353235 348661 344029 339828 336311 333406 330940
57613 330940 328775 326931 325688 325266 325265 324875 323919 323284 323887 325560 327336 328522 329122 329529 330268 331816 334222
57596 334222 337010 339750 342400 344879 346804 348180 349928 353066 357596 362720 367845 372825 377501 381728
57582 381728 385665 389324 391931 392477 390927 388225 384975 380690 374568 366620 357795 349183 341186 333351
57568 333351 325128 316857 309671 304158 299493 294357 288378 282155 276189 270468 264979 259957 255586 251925
$$ packed form
57665G07435N5619N8747N8582N4045M4021K8108P765j3870l3474m8505n7281n9518
57653H01674n6894n1922m5908l8759l0785k3466j7983j4112j1084q704p013n727
57641D89317m713m345m792n546o195p021q242r244r266q429p465o739o130n618
57627C95572n429n631n965o047n668m945m358m294m574m632m201l517k905k466
57613C30940k165j844j243m22jl90r56o35O03J673J776J186O00M07P39J548K406
57596C34222K788K740K650K479J925J376J748L138M530N124N125M980M676M227
57582C81728L937L659K607N46j550k702l250m285o122p948q825q612p997p835
57568C33351q223q271p186n513m665n136n979o223n966n721n489n022m371l661
$$ plain form
57554 251925 249090 247066 245435 243799 242410 241971 242846 244840 247593 250697 253677 256395 259348 262914 266454
57539 266454 268823 269732 269923 269997 269820 269201 268464 268003 267740 267259 266154 264149 261351 258530 256743 256491 257433
57522 257433 258920 260490 261930 263270 264725 266300 267514 267994 268223 269187 271271 274006 276856 279702 282539
57507 282539 285345 288365 291996 296208 300497 304494 308139 311266 313609 315314 316915 318680 320475 322358
57493 322358 324704 327593 330681 333774 336929 339782 341484 341643 340713 339077 336357 332118 326711 320935 315246
57478 315246 309795 304808 300426 296428 292630 289294 286686 284446 281896 278855 275701 272672 269560 266134
57464 266134 262573 259384 256997 255437 254294 253111 251924 251257 251450 252165 252785 253209 253965 255470 257365 258797
57448 258797 259343 259496 260038 261107 262316 263798 266462 270741 275621 279596 282397 285056 288463 292701 297760
$$ packed form
57554B51925k835k024j631j636j389m39Q75J994K753L104K980K718K953L566L540
57539B66454K369R09J91P4j77o19p37m61k63m81j105k005k798k821j787k52R42
57522B57433J487J570J440J340J455J575J214M80K29R64K084K735K850K846K837
57507B82539K806L020L631M212M289L997L645L127K343J705J601J765J795J883
57493C22358K346K889L088L093L155K853J702J59r30j636k720m239n407n776n689
57478C15246n451m987m382l998l798l336k608k240k550l041l154l029l112l426
57464B66134l561l189k387j560j143j183j187o67J93P15O20M24P56J505J895J432
57448B58797N46J53N42J069J209J482K664M279M880L975K801K659L407M238N059
$$ plain form
57433 297760 303911 310979 317995 324120 329494 334759 340143 345304 349649 352447 353098 351770 349448 346885
57419 346885 343757 339312 333653 327898 323111 319457 316358 313197 309847 306774 304706 304057 304682 306094 307794
57404 307794 309400 310701 311710 312478 312756 312045 310083 307162 303990 301387 300035 300146 301306 302939 304902
57389 304902 307371 310195 312825 314975 316916 318988 321216 323557 326095 328797 331393 333733 335944 338155
57375 338155 340387 342791 345550 348422 350834 352639 354356 356426 358634 360483 361687 362071 361492 360247 359180
57360 359180 358987 359656 360811 362237 363800 365296 366762 368592 371014 373689 376107 378096 379768 381366 383386
57345 383386 386371 390216 394082 397288 399876 402094 403967 405790 408317 411814 415399 418047 419844 421541
57331 421541 423288 424645 425701 427256 429832 433102 436397 439303 441746 443955 446340 449076 451883 454557
$$ packed form
57433B97760O151P068P016O125N374N265N384N161M345K798O51j328k322k563
57419C46885l128m445n659n755m787l654l099l161l350l073k068o49O25J412J700
57404C07794J606J301J009P68K78p11j962k921l172k603j352J11J160J633J963
57389C04902K469K824K630K150J941K072K228K341K538K702K596K340K211K211
57375C38155K232K404K759K872K412J805J717K070K208J849J204L84n79j245j067
57360C59180j93O69J155J426J563J496J466J830K422K675K418J989J672J598K020
57345C83386K985L845L866L206K588K218J873J823K527L497L585K648J797J697
57331D21541J747J357J056J555K576L270L295K906K443K209K385K736K807K674
$$ plain form
57317 454557 457509 461301 465822 470421 474824 479365 484374 489806 495495 501351 507272 513206 519257 525473
57303 525473 531668 537720 543824 550085 556130 561584 566691 572004 577710 583810 590694 598790 607802 617015
57289 617015 626296 636051 646214 656115 665505 674974 685042 695510 706009 716629 727617 738937
57277 738937 750528 762649 775530 788908 802255 815385 828635 842516 857266 872703 888555
57266 888555 904918 922095 939867 957348 974076 990813 1008590 1027284 1046005 1064766 1084679
57255 1084679 1106337 1129045 1152058 1175660 1200425 1226226 1252687 1279991 1308464 1337768 1367247
57244 1367247 1396793 1426743 1457234 1488336 1520531 1554175 1588606 1622684 1656445 1691465 1729203
57233 1729203 1769527 1811274 1853765 1897236 1942025 1987999 2034900 2082820 2132042 2182619 2234439
$$ packed form
57317D54557K952L792M521M599M403M541N009N432N689N856N921N934O051O216
57303E25473O195O052O104O261O045N454N107N313N706O100O884Q096R012R213
57289F17015R281R755J0163R901R390R469J0068J0468J0499J0620J0988J1320
57277G38937J1591J2121J2881J3378J3347J3130J3250J3881J4750J5437J5852
57266H88555J6363J7177J7772J7481J6728J6737J7777J8694J8721J8761J9913
57255A084679K1658K2708K3013K3602K4765K5801K6461K7304K8473K9304K9479
57244A367247K9546K9950L0491L1102L2195L3644L4431L4078L3761L5020L7738
57233A729203M0324M1747M2491M3471M4789M5974M6901M7920M9222N0577N1820
$$ plain form
57222 2234439 2287648 2342788 2400351 2460348 2522380 2586064 2651321 2718420 2787869 2860134 2935329
57211 2935329 3013301 3094140 3178353 3266320 3357834 3452571 3550700 3652323 3756243 3859931 3961168
57200 3961168 4059467 4155707 4250718 4344506 4436582 4526591 4614620 4701094 4786353 4870201 4952045
57189 4952045 5031621 5109483 5186594 5263522 5340170 5416234 5491681 5566758 5641647 5716209 5790131
57178 5790131 5863355 5936255 6009248 6082244 6154601 6225559 6294622 6361597 6426510 6489464 6550389
57167 6550389 6608947 6664829 6718086 6768958 6817473 6863528 6907356 6949607 6990942 7031752 7072177
57156 7072177 7112128 7151358 7189884 7228273 7267161 7306520 7345860 7385069 7424397 7463467 7500867
57145 7500867 7535103 7565559 7592217 7614735 7632039 7642670 7645474 7640401 7628822 7612817 7594098 7574015
$$ packed form
57222B234439N3209N5140N7563N9997O2032O3684O5257O7099O9449P2265P5195
57211B935329P7972Q0839Q4213Q7967R1514R4737R8129J01623J03920J03688J01237
57200C961168R8299R6240R5011R3788R2076R0009Q8029Q6474Q5259Q3848Q1844
57189D952045P9576P7862P7111P6928P6648P6064P5447P5077P4889P4562P3922
57178E790131P3224P2900P2993P2996P2357P0958O9063O6975O4913O2954O0925
57167F550389N8558N5882N3257N0872M8515M6055M3828M2251M1335M0810M0425
57156G072177L9951L9230L8526L8389L8888L9359L9340L9209L9328L9070L7400
57145G500867L4236L0456K6658K2518J7304J0631K804n073j1579j6005j8719k0083
$$ plain form
57133 7574015 7554501 7538189 7527215 7522400 7523809 7531349 7544321 7560971 7579184 7597366 7614488 7630056
57121 7630056 7644874 7661511 7683348 7713292 7753565 7805812 7870454 7946415 8032559 8129496 8239645
57110 8239645 8366326 8513886 8688213 8895608 9141018 9428699 9765514 10163683 10641230
57101 10641230 11221436 11932255 12804690 13869941 15156981 16691609 18496631 20593639
57093 20593639 23007120 25769174 28921692 32515968 36612233 41277975 46578507 52554444
57085 52554444 59187749 66365859 73860165 81336992 88406166 94687080 99860799 103697053
57077 103697053 106071701 106984062 106553058 104968002 102411951 99010972 94841198 89971662
57069 89971662 84498686 78553380 72293369 65890843 59517632 53328381 47449012 41973794
$$ packed form
57133G574015j9514j6312j0974m815J409P540J2972J6650J8213J8182J7122J5568
57121G630056J4818J6637K1837K9944M0273N2247O4642P5961Q6144R6937J10149
57110H239645J26681J47560J74327K07395K45410K87681L36815L98169M77547
57101A0641230N80206P10819Q72435J065251J287040J534628J805022K097008
57093B0593639K413481K762054L152518L594276M096265M665742N300532N975937
57085E2554444O633305P178110P494306P476827P069174O280914N173719L836254
57077A03697053K374648R12361m31004j585056k556051l400979m169774m869536
57069H9971662n472976n945306o260011o402526o373211o189251n879369n475218
$$ plain form
57061 41973794 36966014 32458326 28455159 24939123 21878118 19230309 16948694 14986627
57053 14986627 13301542 11854876 10610847 9537127 8606294 7795793 7087095 6465452 5919399
57044 5919399 5439127 5015380 4640135 4307273 4011495 3747246 3509681 3295946 3104248
57035 3104248 2931977 2775870 2633816 2505318 2390212 2287879 2197676 2119099 2051447 1994193
57025 1994193 1947842 1913567 1891698 1881091 1879888 1886099 1897270 1910111 1920274 1921611 1906038 1866182
57013 1866182 1799846 1711998 1612066 1509356 1410423 1318853 1235877 1161240 1094428 1035338 983697
57002 983697 938318 897527 860164 825770 794066 764778 737846 713303 690917 670299 651337
56991 651337 634241 619201 606260 595542 587386 582278 580714 582946 588627 596795 606337 616299 625469
$$ packed form
57061D1973794n007780m507688m003167l516036l061005k647809k281615j962067
57053A4986627j685085j446666j244029j073720r30833q10501p08698o21643n46053
57044E919399m80272m23747l75245l32862k95778k64249k37565k13735j91698
57035C104248j72271j56107j42054j28498j15106j02333r0203p8577o7652n7254
57025A994193m6351l4275k1869j0607j203O211J1171J2841J0163J337j5573l9856
57013A866182o6336q7848r9932j02710r8933r1570q2976p4637o6812n9090n1641
57002I83697m5379m0791l7363l4394l1704k9288k6932k4543k2386k0618j8962
56991F51337j7096j5040j2941j0718q156n108j564K232N681Q168R542R962R170
$$ plain form
56978 625469 631839 632967 627195 614608 596914 576445 555184 534483 515380 498793 485198 474352
56966 474352 465729 459240 455230 453876 455034 458751 465392 475046 487226 501410 517484 535232 553586
56953 553586 570600 583857 590667 588491 576173 555132 528973 501647 475829 452751 433018 417216
56941 417216 405775 398546 394800 393816 395414 399907 407771 419653 436381 458361 484795 513897 543849
56928 543849 572989 598914 618139 627312 624704 610493 586274 554840 519883 484913 452131 422413
56916 422413 395987 372694 351971 333347 316998 303323 292083 282535 274401 268048 263528 259993
56904 259993 256390 252378 248338 244793 242134 240616 240270 240888 242334 244796 248597 253828 260250 267517 275473
56889 275473 284369 294847 307496 322313 338651 355711 372777 388738 401706 409712 411961 409144
$$ packed form
56978F25469O370J128n772j2587j7694k0469k1261k0701j9103j6587j3595j0846
56966D74352q623o489m010j354J158L717O641R654J2180J4184J6074J7748J8354
56953E53586J7014J3257O810k176j2318k1041k6159k7326k5818k3078j9733j5802
56941D17216j1441p229l746r84J598M493P864J1882J6728K1980K6434K9102K9952
56928E43849K9140K5925J9225R173k608j4211k4219l1434l4957l4970l2782k9718
56916D22413k6426k3293k0723j8624j6349j3675j1240r548q134o353m520l535
56904B59993l603m012m040l545k659j518l46O18J446K462L801N231O422P267P956
56889B75473Q896J0478J2649J4817J6338J7060J7066J5961J2968Q006K249k817
$$ plain form
56877 409144 402460 392752 380908 368598 357877 349910 344598 341594 341193 344032 350451 360578 374594
56864 374594 392394 413451 437692 466245 500418 539824 582073 624116 663029 695470 717577
56853 717577 726314 720863 702687 674888 641660 607332 574997 546103 521554 502646 490600 485776
56841 485776 487986 497176 513373 536447 566537 604347 650457 704529 765420 831320 898952 963030
56829 963030 1017246 1055736 1073477 1066693 1034758 981962 916287 845883 776800 713268 658371 613655
56817 613655 578854 552758 534265 522740 518020 520413 530331 547819 572725 605151 644920 690439
56805 690439 738560 785547 827456 859549 876506 874308 852117 812560 760786 703238 646116 593786
56793 593786 548241 509961 478893 454732 437040 425588 420192 420040 423819 430932 442076 458102
$$ packed form
56877D09144o684r708j1844j2310j0721p967n312l004m01K839O419J0127J4016
56864C74594J7800K1057K4241K8553L4173L9406M2249M2043L8913L2441K2107
56853G17577Q737n451j8176k7799l3228l4328l2335k8894k4549j8908j2046m824
56841D85776K210R190J6197K3074L0090L7810M6110N4072O0891O5900O7632O4078
56829I63030N4216L8490J7741o784l1935n2796o5675p0404o9083o3532n4897m4716
56817F13655l4801k6096j8493j1525m720K393R918J7488K4906L2426L9769M5519
56805F90439M8121M6987M1909L2093J6957k198k2191l9557n1774n7548n7122n2330
56793E93786m5545l8280l1068k4161j7692j1452n396j52L779P113J1144J6026
$$ plain form
56781 458102 478693 502492 527954 553308 575970 592736 600764 598249 584622 560900 529830 495048
56769 495048 459657 425569 393948 365699 341260 320282 301994 285943 272203 260778 251007 241849
56757 241849 232834 224469 217549 212290 208312 205207 202697 200461 198253 196212 194645 193552 192718 192114 191681
56742 191681 190793 188655 185403 182152 179751 177986 176315 174776 173749 173334 173377 173738 174081 173822 172782 171669
56726 171669 171430 172257 173585 174856 175906 176811 177733 178811 179913 180671 181045 181623 182944 184690 185955 186230
56710 186230 185849 185583 186148 187940 190767 193784 196058 197280 197806 198106 198435 198950 199762 200813 201942 203115
56694 203115 204436 205895 207331 208665 209984 211375 212801 214204 215591 216980 218322 219531 220616 221788
56680 221788 223439 225961 229538 234128 239470 244988 249884 253678 256634 259329 261822 263597 264393 264618 264777
$$ packed form
56781D58102K0591K3799K5462K5354K2662J6766Q028k515j3627k3722l1070l4782
56769D95048l5391l4088l1621k8249k4439k0978j8288j6051j3740j1425r771r158
56757B41849r015q365o920n259l978l105k510k236k208k041j567j093q34o04m33
56742A91681q88k138l252l251k401j765j671j539j027m15M3L61L43k59j040j113
56726A71669k39Q27J328J271J050R05R22J078J102P58L74N78J321J746J265K75
56710A86230l81k66N65J792K827L017K274J222N26L00L29N15Q12J051J129J173
56694B03115J321J459J436J334J319J391J426J403J387J389J342J209J085J172
56680B21788J651K522L577M590N342N518M896L794K956K695K493J775P96K25J59
$$ plain form
56665 264777 264897 264815 264629 264464 264046 262977 261350 259757 258684 258139 257845 257559 257272 257235 257778 259005 260692
56648 260692 262570 264549 266608 268674 270724 272779 274649 275956 276647 277203 277951 278388 277597 275351 272415
56633 272415 269674 267256 264641 261416 257679 253820 250087 246472 242936 239655 236958 235052 233831 232902
56619 232902 231843 230506 229103 227886 226725 225214 223290 221501 220458 220219 220455 220934 221519 221901 221811 221431
56603 221431 221193 221216 221273 221259 221321 221600 222172 223083 224058 224415 223817 222906 222581 222757 222599 221882 221341 221573 222367 223278
56583 223278 224100 224609 224640 224729 225893 228416 231494 234353 236952 239334 241201 242700 244842 248378 252829 257156
56567 257156 260898 264202 267331 270720 274986 280381 286742 294317 303880 315557 328378 341521 354931
56554 354931 367856 377852 382607 382198 378422 372501 364719 355833 347212 339545 332583 326253 320974 316754
$$ packed form
56665B64777J20q2j86j65m18j069j627j593j073n45k94k86k87l7N43J227J687
56648B60692J878J979K059K066K050K055J870J307O91N56P48M37p91k246k936
56633B72415k741k418k615l225l737l859l733l615l536l281k697j906j221r29
56619B32902j059j337j403j217j161j511j924j789j043k39K36M79N85L82r0l80
56603B21431k38K3N7j4O2K79N72R11R75L57n98r11l25J76j58p17n41K32P94R11
56583B23278Q22N09L1Q9J164K523L078K859K599K382J867J499K142L536M451M327
56567B57156L742L304L129L389M266N395O361P575R563J1677J2821J3143J3410
56554C54931J2925R996M755m09l776n921p782q886q621p667o962o330n279m220
$$ plain form
56540 316754 313012 309433 306138 303033 299856 296952 295039 294079 293224 291978 290483 288590 285650 281608 277412
56525 277412 273961 271329 269316 267936 266952 265643 263561 261030 258521 256022 253353 250630 248070 245646
56511 245646 243199 240585 237664 234572 231982 230490 229614 228075 225333 222243 219905 218416 217130 215664
56497 215664 214200 213113 212648 212717 212841 212566 212107 212194 213096 214119 214294 213289 211542 209795 208660 208314 208435
56480 208435 208620 208820 209100 209173 208653 207715 206907 206318 205569 204708 204383 204857 205487 205582 205263 205103 205343 205876 206610
56461 206610 207451 208165 208638 209162 210200 211932 214089 216082 217323 217768 218166 219395 221461 223482 224771 225559
56445 225559 226528 227997 229737 231353 232620 233625 234585 235452 235861 235682 235323 235100 234642 233508 232034 230809
56429 230809 229522 227392 224796 223371 224050 225870 227204 227433 226923 226105 225372 225322 226287 227758 228929 229679
$$ packed form
56540C16754l742l579l295l105l177k904j913r60q55j246j495j893k940m042m196
56525B77412l451k632k013j380r84j309k082k531k509k499k669k723k560k424
56511B45646k447k614k921l092k590j492q76j539k742l090k338j489j286j466
56497B15664j464j087m65O9J24k75m59Q7R02J023J75j005j747j747j135l46J21
56480B08435J85K00K80P3n20r38q08n89p49q61l25M74O30R5l19j60K40N33P34
56461B06610Q41P14M73N24J038J732K157J993J241M45L98J229K066K021J289P88
56445B25559R69J469J740J616J267J005R60Q67M09j79l59k23m58j134j474j225
56429B30809j287k130k596j425O79J820J334K29n10q18p33n0R65J471J171P50
$$ plain form
56413 229679 230541 231852 233421 235044 236844 238897 240727 241449 240546 238561 236866 236516 237418 238778 240141
56398 240141 241614 243209 244511 245110 245008 244519 244041 243927 244280 244878 245490 246077 246440 246076 244919 243836 243712
56381 243712 244271 244577 244464 244588 245166 245726 246220 247324 249258 251181 252273 252736 253305 254388 256054 258274
56365 258274 260721 262803 264302 265633 267279 269357 271841 274612 277163 278834 279574 279989 280525 281159 281938
56350 281938 283132 284701 286250 287612 288826 289585 289575 289400 290104 291628 292810 293224 293865 295541 297775 300011
56334 300011 302786 306726 311213 315116 318327 321658 325591 329883 334131 338078 341610 344919 348419 352151
56320 352151 355636 358496 360688 362038 362294 361929 362032 362939 363833 364191 364725 366303 368825 371928 375928 381194
56304 381194 387197 393091 398767 404670 411077 418250 426707 436579 447083 457224 466608 475125 482526 488922
$$ packed form
56413B29679Q62J311J569J623J800K053J830P22r03j985j695l50R02J360J363
56398B40141J473J595J302N99j02m89m78j14L53N98O12N87L63l64j157j083j24
56381B43712N59L06j13J24N78N60M94J104J934J923J092M63N69J083J666K220
56365B58274K447K082J499J331J646K078K484K771K551J671P40M15N36O34P79
56350B81938J194J569J549J362J214P59j0j75P04J524J182M14O41J676K234K236
56334C00011K775L940M487L903L211L331L933M292M248L947L532L309L500L732
56320C52151L485K860K192J350K56l65J03R07Q94L58N34J578K522L103M000N266
56304C81194O003N894N676N903O407P173Q457R872J0504J0141R384Q517P401O396
$$ plain form
56290 488922 495119 501820 509083 517000 526120 536579 547647 558837 570642 583454 596651 609672
56278 609672 623085 637512 652243 666141 679392 693269 708653 725783 744934 766249 789277
56267 789277 813736 840327 869945 902553 937911 976956 1021351 1071920 1128517 1191146 1260286
56256 1260286 1336453 1420412 1513470 1616698 1730184 1853865 1988590 2135353 2293979 2463501
56246 2463501 2643222 2832143 3027806 3227009 3427365 3626899 3822296 4008777 4181538
56237 4181538 4336188 4468122 4573013 4648205 4692616 4705353 4685519 4633485 4551410 4442477
56227 4442477 4310540 4160320 3996757 3823831 3644656 3462393 3280090 3099818 2923047
56218 2923047 2751767 2588114 2432943 2285908 2146966 2016746 1895415 1782316 1676936
$$ packed form
56290D88922O197O701P263P917R120J0459J1068J1190J1805J2812J3197J3021
56278F09672J3413J4427J4731J3898J3251J3877J5384J7130J9151K1315K3028
56267G89277K4459K6591K9618L2608L5358L9045M4395N0569N6597O2629O9140
56256A260286P6167Q3959R3058J03228J13486J23681J34725J46763J58626J69522
56246B463501J79721J88921J95663J99203K00356J99534J95397J86481J72761
56237D181538J54650J31934J04891P5192M4411J2737j9834n2034q2075j08933
56227D442477j31937j50220j63563j72926j79175j82263j82303j80272j76771
56218B923047j71280j63653j55171j47035j38942j30220j21331j13099j05380
$$ plain form
56209 1676936 1579284 1489158 1405980 1329467 1259628 1195948 1137422 1083498 1034255 989633 949195
56198 949195 912620 879659 849700 822139 797158 775461 757370 742732 731193 721729 712498 702365
56186 702365 692326 684252 678482 673873 669960 667578 667226 668136 669276 670257 671070 671852 673166 675625 679067
56171 679067 682714 686048 688914 691063 692492 693878 695762 697680 699206 701373 705804 712662 720784 729633
56157 729633 739757 751472 764495 778995 795698 814910 836536 861030 889122 920739 955530
56146 955530 994406 1039231 1090943 1149263 1214223 1286673 1367237 1456029 1553271 1658623 1769762
56135 1769762 1882895 1994673 2102275 2201954 2289607 2363448 2424859 2476257 2519309 2555250 2585135
56124 2585135 2609031 2625968 2635060 2635779 2627165 2608223 2579290 2541801 2496406 2442292 2378237 2303186
$$ packed form
56209A676936r7652r0126q3178p6513o9839o3680n8526n3924m9243m4622m0438
56198I49195l6575l2961k9959k7561k4981k1697j8091j4638j1539r464r231j0133
56186G02365j0039q074n770m609l913k382l52R10J140R81Q13P82J314K459L442
56171F79067L647L334K866K149J429J386J884J918J526K167M431O858Q122Q849
56157G29633J0124J1715J3023J4500J6703J9212K1626K4494K8092L1617L4791
56146I55530L8876M4825N1712N8320O4960P2450Q0564Q8792R7242J05352J11139
56135A769762J13133J11778J07602R9679Q7653P3841O1411N1398M3052L5941K9885
56124B585135K3896J6937R092P19q614j8942k8933l7489m5395n4114o4055p5051
$$ plain form
56112 2303186 2216153 2117274 2009161 1895927 1780955 1666923 1557542 1457111 1368024 1290238
56102 1290238 1223266 1167021 1120652 1082440 1051215 1026400 1006646 990160 976472 966186 958969
56091 958969 953602 949919 948601 949016 949420 949526 950672 953230 956187 959670 965434 974077 983991 993869 1004176
56076 1004176 1015394 1026888 1038343 1050451 1063435 1076679 1090318 1105267 1121249 1136908 1152289
56065 1152289 1168993 1187415 1206114 1224396 1242972 1261430 1277764 1291397 1304205 1317571 1330825
56054 1330825 1343481 1356454 1369968 1382815 1394864 1407957 1423201 1439731 1457169 1476787 1499105
56043 1499105 1522849 1547443 1574081 1603249 1633668 1664657 1696868 1729812 1761620 1792355 1824556
56032 1824556 1859269 1894699 1930010 1967104 2007102 2048466 2090296 2134192 2181016 2229132 2277700
$$ packed form
56112B303186q7033r8879j08113j13234j14972j14032j09381j00431q9087p7786
56102A290238o6972n6245m6369l8212l1225k4815j9754j6486j3688j0286p217
56091I58969n367l683j318M15M04J06J146K558K957L483N764Q643R914R878J0307
56076A004176J1218J1494J1455J2108J2984J3244J3639J4949J5982J5659J5381
56065A152289J6704J8422J8699J8282J8576J8458J6334J3633J2808J3366J3254
56054A330825J2656J2973J3514J2847J2049J3093J5244J6530J7438J9618K2318
56043A499105K3744K4594K6638K9168L0419L0989L2211L2944L1808L0735L2201
56032A824556L4713L5430L5311L7094L9998M1364M1830M3896M6824M8116M8568
$$ plain form
56021 2277700 2328367 2381795 2436010 2490293 2547247 2608822 2673689 2740660 2811054 2885365 2961365
56010 2961365 3038068 3117982 3202982 3291746 3383767 3481705 3586829 3696231 3807790 3923964
56000 3923964 4047558 4177851 4314269 4459601 4615907 4781283 4954286 5137403 5332602
55991 5332602 5537979 5752676 5980485 6224549 6483301 6755972 7047182 7361529 7698742
55982 7698742 8058924 8447333 8869027 9324354 9814983 10348634 10932523 11568662 12261794
55973 12261794 13025394 13873609 14814907 15861374 17037175 18370937 19889834 21632595
55965 21632595 23661526 26051487 28873414 32195721 36088616 40612295 45810670 51732253
55957 51732253 58450885 66059532 74669605 84448668 95655415 108624218 123739287 141445235
$$ packed form
56021B277700N0667N3428N4215N4283N6954O1575O4867O6971P0394P4311P6000
56010B961365P6703P9914Q5000Q8764R2021R7938J05124J09402J11559J16174
56000C923964J23594J30293J36418J45332J56306J65376J73003J83117J95199
55991E332602K05377K14697K27809K44064K58752K72671K91210L14347L37213
55982G698742L60182L88409M21694M55327M90629N33651N83889O36139O93132
55973A2261794P63600Q48215R41298J046467J175801J333762J518897J742761
55965B1632595K028931K389961K821927L322307L892895M523679N198375N921583
55957E1732253O718632P608647Q610073R779063J1206747J2968803J5115069J7705948
$$ plain form
55949 141445235 162215208 186367321 213805450 243892763 275492663 306968379 336030229
55942 336030229 359679061 374610851 378111461 369036279 348347365 318903180 284568617
55935 284568617 249062622 215102868 184184152 156872745 133223609 113048056 96033513
55928 96033513 81813500 70013012 60260236 52194648 45496415 39908783 35226590 31276356
55920 31276356 27917276 25046254 22583927 20458212 18607272 16987404 15565556 14309003
55912 14309003 13189975 12192786 11306430 10514585 9800210 9154187 8571367 8042731 7558789
55903 7558789 7116213 6713721 6345072 6002772 5685092 5392960 5123199 4870957 4635754
55894 4635754 4419099 4218704 4030614 3854615 3692237 3541717 3399956 3267222 3145068
$$ packed form
55949A41445235K0769973K4152113K7438129L0087313L1599900L1475716K9061850
55942C36030229K3648832J4931790L500610r075182k0688914k9444185l4334563
55935B84568617l5505995l3959754l0918716k7311407k3649136k0175553j7014543
55928I6033513j4220013j1800488r752776q065588o698233n587632m682193l950234
55920C1276356l359080k871022k462327k125715j850940j619868j421848j256553
55912A4309003j119028r97189q86356p91845p14375o46023n82820n28636m83942
55903G558789m42576m02492l68649l42300l17680k92132k69761k52242k35203
55894D635754k16655k00395j88090j75999j62378j50520j41761j32734j22154
$$ plain form
55885 3145068 3031628 2923671 2821484 2727365 2641032 2560655 2486585 2420033 2359614 2302918 2249741
55874 2249741 2200172 2151358 2099908 2045894 1990991 1934542 1875164 1814541 1755777 1699290 1643869
55863 1643869 1590466 1541223 1495830 1452308 1410576 1371978 1336103 1301187 1267069 1234906 1204593
55852 1204593 1175154 1146916 1120804 1096235 1072011 1048435 1026227 1004404 981669 958901 937860
55841 937860 918369 899102 880121 862251 844915 827141 809865 794787 781605 768634 755503
55830 755503 743037 731237 719589 708755 699863 692570 685666 678852 672217 664916 656248 647151 638764
55817 638764 630536 621589 612810 605569 599492 593642 588754 585965 584351 582219 580071 579851 581851 584691
55803 584691 587813 591687 596000 599857 603460 607505 611312 613471 613823 612759 609174 601416 589939 576960
$$ packed form
55885C145068j13440j07957j02187r4119q6333q0377p4070o6552o0419n6696n3177
55874B249741m9569m8814n1450n4014n4903n6449n9378o0623n8764n6487n5421
55863A643869n3403m9243m5393m3522m1732l8598l5875l4916l4118l2163l0313
55852A204593k9439k8238k6112k4569k4224k3576k2208k1823k2735k2768k1041
55841I37860j9491j9267j8981j7870j7336j7774j7276j5078j3182j2971j3131
55830G55503j2466j1800j1648j0834q892p293o904o814o635p301q668r097q387
55817F38764q228q947q779p241o077n850m888k789j614k132k148k20K000K840
55803E84691L122L874M313L857L603M045L807K159L52j064l585p758j1477j2979
$$ plain form
55789 576960 563693 549932 535976 522849 510821 499651 490110 483346 478912 475262 471909 469263 466643
55776 466643 462514 456603 449960 443159 436247 430180 426240 424039 422045 419977 418744 418163 416906 414840
55762 414840 413234 412242 410196 406103 401135 396926 393802 391355 389545 388592 388612 389758 391996 394765 397579
55747 397579 400722 404359 407397 408381 407171 404473 400130 393430 384811 375752 367004 358313 349728 341670
55733 341670 333741 324966 315365 306062 297828 290669 284627 279702 275120 270060 264985 260984 257958 254808
55719 254808 251176 247606 244237 240771 237586 235383 233877 232255 230655 229710 228968 227455 225549 224534 224475
55704 224475 224390 224344 225343 227103 228022 227629 227055 226692 225408 222667 219515 216786 214100 211351 209475 208916 208838
55687 208838 208687 209035 210173 211307 211947 212729 214049 215287 216166 217526 219877 222465 224588 226550 228394
$$ packed form
55789E76960j3267j3761j3956j3127j2028j1170r541o764m434l650l353k646k620
55776D66643m129n911o643o801o912o067l940k201j994k068j233n81j257k066
55762D14840j606r92k046m093m968m209l124k447j810r53K0J146K238K769K814
55747C97579L143L637L038R84j210k698m343o700q619r059q748q691q585q058
55733C41670p929q775r601r303q234p159o042m925m582n060n075m001l026l150
55719B54808l632l570l369l466l185k203j506j622j600r45p42j513j906j015n9
55704B24475q5m6R99J760R19l93n74l63j284k741l152k729k686k749j876n59p8
55687B08838j51L48J138J134O40P82J320J238Q79J360K351K588K123J962J844
$$ plain form
55672 228394 229025 227741 225545 223802 222478 220756 218600 216683 215373 214708 214889 216056 217957 220344 223178
55657 223178 226167 228787 231118 233841 237135 240397 243319 246198 248809 250057 249269 246854 243254 238447
55643 238447 232998 228249 224616 220839 215919 210776 206984 204779 203420 202778 203368 205331 208373 212363 217202
55628 217202 222493 228067 234392 241752 249530 256938 263932 270684 276710 281323 284462 286305 286489 284582
55614 284582 281032 276825 272458 267948 263663 260374 258396 257251 256227 254972 253605 252518 252024 252019 252022 251554
55598 251554 250231 247603 243361 237722 231140 223657 215142 206140 197733 190421 183883 178052 173541 170638
55584 170638 168668 166859 165235 164195 163770 163751 164026 164392 164503 164426 164819 166279 168938 172779 177704 183082
55568 183082 188032 192464 197139 202382 207520 211917 215644 218582 219750 218393 215145 211299 207302 202633
$$ packed form
55672B28394O31j284k196j743j324j722k156j917j310o65J81J167J901K387K834
55657B23178K989K620K331K723L294L262K922K879K611J248p88k415l600m807
55643B38447n449m749l633l777m920n143l792k205j359o42N90J963L042L990M839
55628B17202N291N574O325P360P778P408O994O752O026M613L139J843J84j907
55614B84582l550m207m367m510m285l289j978j145j024j255j367j087m94nLm68
55598B51554j323k628m242n639o582p483q515r002q407p312o538n831m511k903
55584A70638j970j809j624j040m25j9K75L66J11p7L93J460K659L841M925N378
55568A83082M950M432M675N243N138M397L727K938J168j357l248l846l997m669
$$ plain form
55554 202633 196867 190305 183724 177885 173046 168750 164428 160287 157123 155211 154010 153068 152372 151700 150593
55539 150593 149339 148917 149422 149546 148341 146581 145515 145041 144093 142229 139914 137623 135507 133644 131957
55524 131957 130179 128365 127015 126256 125478 124334 123414 123274 123376 122714 120969 118412 115328 112353 110705 111032
55508 111032 112449 113614 114373 115441 116870 117930 118370 118768 119615 120822 122142 123368 124224 124707 125430 126970
55492 126970 129043 130980 132818 135213 138421 142155 146368 151358 157071 163019 168984 175135 181375 187181
55478 187181 192102 195843 197873 197766 196051 194012 192241 189902 185797 179798 172942 166376 160523 155127
55464 155127 149812 144525 139453 134621 129825 125097 120907 117596 114825 111953 108850 106013 104004 103087
55450 103087 103222 103979 104550 104286 103309 102254 101427 100570 99533 98737 98722 99364 99881 99654 98919 98492 98830 99582
$$ packed form
55554B02633n766o562o581n839m839m296m322m141l164j912j201r42o96o72j107
55539A50593j254m22N05J24j205j760j066m74r48j864k315k291k116j863j687
55524A31957j778j814j350p59p78j144r20j40J02o62j745k557l084k975j648L27
55508A11032J417J165P59J068J429J060M40L98Q47J207J320J226Q56M83P23J540
55492A26970K073J937J838K395L208L734M213M990N713N948N965O151O240N806
55478A87181M921L741K030j07j715k039j771k339m105n999o856o566n853n396
55464A55127n315n287n072m832m796m728m190l311k771k872l103k837k009r17
55450A03087J35P57N71k64r77j055q27q57j037p96j5O42N17k27p35m27L38P52
$$ plain form
55432 99582 100162 100478 100756 100915 100610 99955 99693 100479 102223 104183 105457 105489 104564 103787 104092 105226 106121 106157
55414 106157 105494 104328 102713 101229 100908 102085 103942 105445 106040 105329 103068 99991 97735 97263 97975 98795
55398 98795 99342 99541 99088 98136 97716 98543 100027 101315 102561 104188 105601 105900 105449 105396 105843 105767 104797 103842
55380 103842 103767 104432 105355 106343 107085 106910 105510 103488 101810 100995 100970 101333 101572 101328 100621 99693 98629 97347
55362 97347 95868 94326 92795 91346 90111 89109 88233 87655 87850 88847 89839 90000 89428 88793 88437 88386 88852
55345 88852 89986 91311 92098 92200 91890 91070 89447 87500 86457 87052 88842 90883 92573 93651 93976 93677
55329 93677 93210 92959 92895 92754 92476 92377 92917 94198 95652 96441 96315 95875 95817 96205 96620 96718 96371 95608 94718 94147
55309 94147 94038 94192 94516 95029 95274 94535 93088 92431 93619 95933 97873 98814 98962 98369 97120 95999 95775
$$ packed form
55432I9582N80L16K78J59l05o55k62P86J744J960J274L2r25p77L05J134Q95L6
55414A06157o63j166j615j484l21J177J857J503N95p11k261l077k256m72P12Q20
55398I8795N47J99m53r52m20Q27J484J288J246J627J413K99m51n3M47p6r70r55
55380A03842p5O65R23R88P42j75j400k022j678q15k5L63K39k44p07r28j064j282
55362I7347j479j542j531j449j235j002q76n78J95R97R92J61n72o35l56n1M66
55345H8852J134J325P87J02l10q20j623j947j043N95J790K041J690J078L25k99
55329I3677m67k51o4j41k78r9N40J281J454P89j26m40n8L88M15R8l47p63q90n71
55309I4147j09J54L24N13K45p39j447o57J188K314J940R41J48n93j249j121k24
$$ plain form
55292 95775 95934 95220 93419 91651 90863 90960 91529 92531 93970 95533 96835 97634 97822 97665 97868 98782 99687
55275 99687 99576 98535 97585 97222 96944 96310 95670 95595 96217 97310 98488 99222 99206 98773 98511 98493 98438 98460 98920 99596
55255 99596 99812 99486 99233 99292 99112 98306 97275 96574 96266 96230 96518 97043 97345 97040 96252 95415 94876 94737 94745 94376
55235 94376 93377 92202 91497 91312 91220 90997 90622 89882 88781 88210 89206 91405 93095 93106 91986 91059 90989 91454
55217 91454 91587 90505 88083 85493 84367 85121 86613 87644 88180 88887 90110 91663 93135 94105 94512 94964
55201 94964 96070 97360 97569 96262 94480 93401 93108 93082 93201 93577 93967 94077 94175 94819 96071 97356 97925
55184 97925 97300 95574 93547 92226 91890 91910 91745 91691 92378 93892 95756 97504 98860 99598 99627 99218 98889 99015
55166 99015 99566 100132 100280 100054 100037 100619 101340 101364 100590 99803 99699 100168 100644 100753 100517 100250 100316 100739 101132 101285
$$ packed form
55292I5775J59p14j801j768p88R7N69J002J439J563J302P99J88j57K03R14R05
55275I9687j11j041r50l63k78o34o40p5O22J093J178P34j6m33k62j8n5K2M60O76
55255I9596K16l26k53N9j80q06j031p01l08l6K88N25L02l05p88q37n39j39Ql69
55235I4376r99j175p05j85r2k23l75p40j101n71R96K199J690J1j120r27p0M65
55217I1454J33j082k422k590j126P54J492J031N36P07J223J553J472R70M07M52
55201I4964J106J290K09j307j782j079k93k6J19L76L90J10R8O44J252J285N69
55184I7925o25j726k027j321l36K0j65n4O87J514J864J748J356P38K9m09l29J26
55166I9015N51N66J48k26j7N82P21K4p74p87j04M69M76J09k36k67O6M23L93J53
$$ plain form
55146 101285 101614 102573 103877 104827 105220 105247 104702 103149 100884 98916 97847 97467 97515 98047 98917 99680 100214 100724
55128 100724 101024 100643 99802 99402 99729 100053 99830 99388 99035 98433 97471 96848 97064 97488 97217 96367 95781 95810 96074
55109 96074 96158 96047 96008 96393 97361 98641 99896 101302 103187 105077 105967 105798 105780 106771 108203 109152 109657 110242
55091 110242 110904 111362 111791 112441 112991 113032 112868 113098 113733 114404 115143 116295 117845 119452 120952 122233 122800
55074 122800 122094 120240 118139 116792 116656 117424 118224 118385 118167 118366 119149 119829 119950 119854 119916 119973 119890 119910 119934 119279
55054 119279 117792 116463 116195 116589 116709 116390 116041 115674 115025 114185 113318 112186 110700 109472 109041 108950 108442
55037 108442 107648 107261 107401 107687 108072 108702 109251 109231 108788 108441 108299 108250 108486 109036 109239 108696 108266 109010 110436
55018 110436 111016 110267 109114 108191 107157 105885 105115 105436 106513 107689 108594 108877 108160 106704 105480 105153
$$ packed form
55146A01285L29R59J304R50L93K7n45j553k265j968j069l80M8N32Q70P63N34N10
55128A00724L00l81q41m00L27L24k23m42l53o02r62o23K16M24k71q50n86K9K64
55109I6074Q4j11l9L85R68J280J255J406J885J890Q90j69j8R91J432R49N05N85
55091A10242O62M58M29O50N50M1j64K30O35O71P39J152J550J607J500J281N67
55074A22800p06j854k101j347j36P68Q00J61k18J99P83O80J21r6O2N7q3K0K4o55
55054A19279j487j329k68L94J20l19l49l67o49q40q67j132j486j228m31r1n08
55037A08442p94l87J40K86L85O30N49k0m43l47j42m9K36N50K03n43m30P44J426
55018A10436N80p49j153r23j034j272p70L21J077J176R05K83p17j456j224l27
$$ plain form
55002 105153 105500 106051 106738 107640 108595 109360 109872 110222 110641 111446 112599 113500 113670 113425 113329 113312 113100 113204 114407
54983 114407 116332 117615 117704 117464 117719 118197 118345 118263 118218 117970 117249 116396 115924 115824 115830 116061 116914 118471 120319
54964 120319 121789 122261 121582 120351 119549 119709 120622 121782 122752 123170 122909 122267 121565 120614 119174 117862 117820
54947 117820 119247 121014 122016 122304 122530 122912 123192 123138 122649 121742 120786 120411 120849 121730 122772 124295 126703
54930 126703 129841 133199 136449 139489 142265 144888 147748 151278 155772 161474 168415 176037 183357 189758
54916 189758 195196 199544 202251 202950 201862 199210 194733 188382 181142 174472 168956 164014 158968 154005
54902 154005 149959 147354 145860 144621 143048 141196 139371 137638 136013 134846 134510 134737 134828 134665 134968 136390
54886 136390 138809 141780 145179 149074 153333 157809 162634 167973 173667 179429 185214 191103 196934 202282
$$ packed form
55002A05153L47N51O87R02R55P65N12L50M19Q05J153R01J70k45r6j7k12J04J203
54983A14407J925J283Q9k40K55M78J48q2m5k48p21q53m72j00OK31Q53J557J848
54964A20319J470M72o79j231q02J60R13J160R70M18k61o42p02r51j440j312m2
54947A17820J427J767J002K88K26L82K80n4m89r07r56l75M38Q81J042J523K408
54930A26703L138L358L250L040K776K623K860L530M494N702O941P622P320O401
54916A89758N438M348K707O99j088k652m477o351p240o670n516m942n046m963
54902A54005m046k605j494j239j573j852j825j733j625j167l36K27R1j63L03J422
54886A36390K419K971L399L895M259M476M825N339N694N762N785N889N831N348
$$ plain form
54872 202282 206680 209750 211322 211519 210489 207950 203392 196975 189853 183223 177281 171410 165165 158722
54858 158722 152566 147184 143000 140201 138519 137389 136384 135435 134709 134412 134570 134777 134248 132437 129654 126910
54842 126910 125018 123886 122749 121017 118849 116852 115369 114216 113151 112319 112082 112563 113610 115032 116613
54827 116613 117987 118837 119197 119321 119267 118912 118274 117511 116608 115443 114178 113233 112803 112780 113148 114083 115492 116831
54809 116831 117600 117796 117708 117550 117423 117376 117304 117015 116595 116511 117126 118304 119702 121320 123435 126000 128334 129615
54791 129615 129609 128824 127900 127037 126166 125478 125361 125783 126221 126415 126824 127988 129810 131813 133807 135882 137992
54774 137992 140073 142393 145348 149007 153217 157978 163321 169033 174899 181034 187541 194115 200377 206225
54760 206225 211314 214664 215576 214635 212903 210388 206282 200550 194160 187693 180868 173702 167073 161659 157181
$$ packed form
54872B02282M398L070J572J97j030k539m558o417p122o630n942n871o245o443
54858A58722o156n382m184k799j682j130j005r49p26k97J58K07n29j811k783k744
54842A26910j892j132j137j732k168j997j483j153j065q32k37M81J047J422J581
54827A16613J374Q50L60J24n4l55o38p63r03j165j265r45m30k3L68R35J409J339
54809A16831P69J96q8j58j27m7p2k89m20q4O15J178J398J618K115K565K334J281
54791A29615op85r24q63q71o88j17M22M38J94M09J164J822K003J994K075K110
54774A37992K081K320K955L659M210M761N343N712N866O135O507O574O262N848
54760B06225N089L350R12r41j732k515m106n732o390o467o825p166o629n414m478
$$ plain form
54745 157181 153192 149884 147570 146016 144776 143703 142730 141640 140353 139053 137814 136651 136028 136653 138570
54730 138570 141112 143935 147253 150890 154101 156786 159967 164511 170156 176249 182539 188576 193376 196524
54716 196524 198814 200795 201460 199440 194952 189430 183677 177577 171312 165649 160903 156654 152628 149015
54702 149015 145767 142347 138452 134502 131298 129530 129468 130576 131503 131056 129312 127405 126264 125960 126042 125992
54686 125992 125378 124112 122618 121370 120402 119595 119175 119391 119874 119902 119207 118012 116501 114885 113814 113897 114740
54669 114740 115206 114809 114190 114005 113974 113437 112351 111245 110459 109825 109080 108382 108380 109714 112292 115177 117386 118721
54651 118721 119583 120176 120308 119910 119261 118604 117889 117052 116247 115726 115669 116217 117349 118686 119665 120082 120215 120312 120140
54632 120140 119257 117648 115884 114627 114088 114077 114522 115641 117443 119304 120410 120541 120100 119486 118870 118535 118821
$$ packed form
54745A57181l989l308k314j554j240j073r73j090j287j300j239j163o23O25J917
54730A38570K542K823L318L637L211K685L181M544N645O093O290O037M800L148
54716A96524K290J981O65k020m488n522n753o100o265n663m746m249m026l613
54702A49015l248l420l895l950l204j768o2J108R27m47j744j907j141l04Q2n0
54686A25992o14j266j494j248r68q07m20K16M83K8o95j195j511j616j071Q3Q43
54669A14740M66l97o19j85l1n37j086j106p86o34p45o98kJ334K578K885K209J335
54651A18721Q62N93J32l98o49o57p15q37q05n21n7N48J132J337R79M17J33R7j72
54632A20140q83j609j764j257n39j1M45J119J802J861J106J31m41o14o16l35K86
$$ plain form
54615 118821 119609 120413 121128 122105 123253 123812 123426 122814 122802 123216 123313 122843 122129 121450 121001 121028 121358 121188 120013
54596 120013 118491 117661 117632 117791 118022 118759 119922 120739 120782 120451 120279 120354 120565 120825 120941 120772 120569 120710 121123
54577 121123 121491 121935 122833 123960 124527 124217 123561 123127 122882 122526 121896 120927 119797 119271 120277 122794 125587
54560 125587 127314 127557 126770 125665 124795 124216 123400 121942 120408 119938 120918 122648 124461 126376 128360 129757
54544 129757 130124 130075 130620 131942 133373 134339 134838 135219 135980 137557 139783 141652 142178 141510 140800 140848 141252 141005
54526 141005 139674 137738 135924 134530 133506 132986 133367 134744 136557 138072 139077 139829 140431 140681 140521 140221
54510 140221 140007 139771 139351 138834 138445 138283 138276 138300 138351 138634 139336 140123 140084 138564 136010 133641 132299 131937 132139
54491 132139 132620 133167 133536 133647 133655 133700 133855 134295 135224 136594 138163 139862 141751 143618 145052 146004 146865 147832
$$ packed form
54615A18821P88Q04P15R77J148N59l86o12j2M14R7m70p14o79m49K7L30j70j175
54596A20013j522q30k9J59K31P37J163Q17M3l31j72P5K11K60J16j69k03J41M13
54577A21123L68M44Q98J127N67l10o56m34k45l56o30r69j130n26J006K517K793
54560A25587J727K43p87j105q70n79q16j458j534m70R80J730J813J915J984J397
54544A29757L67m9N45J322J431R66M99L81P61J577K226J869N26o68p10M8M04k47
54526A41005j331j936j814j394j024n20L81J377J813J515J005P52O02K50j60l00
54510A40221k14k36m20n17l89j62pK4N1K83P02P87l9j520k554k369j342l62K02
54491A32139M81N47L69J11QM5J55M40R29J370J569J699J889J867J434R52Q61R67
$$ plain form
54473 147832 148624 148994 149171 149583 150402 151574 153035 154721 156562 158616 161035 163772 166493 168814 170443
54458 170443 171093 170599 169171 167328 165518 163971 162798 161902 160837 159178 157078 155095 153477 151987 150463
54443 150463 149132 148293 148053 148413 149219 149984 150240 150108 150083 150182 149857 148858 147671 146847 146451 146367 146642 147174 147568
54424 147568 147646 147742 148173 148752 149141 149266 149117 148554 147715 147196 147441 148192 148923 149502 150058 150553 150962 151569 152549
54405 152549 153436 153528 152757 151648 150460 148926 147026 145524 145384 146791 149039 151378 153690 156211 158835
54390 158835 161030 162461 163285 163676 163444 162490 161294 160444 159909 159337 158873 158995 159636 160202 160588 161427 163122
54373 163122 165299 167485 169627 171601 172935 173546 174178 175445 176887 177634 177727 178066 179136 180385 181029 181074
54357 181074 181377 182745 185034 187181 188187 187993 187122 185742 183609 180846 178072 175625 173307 171072 169275
$$ packed form
54473A47832P92L70J77M12Q19J172J461J686J841K054K419K737K721K321J629
54458A70443O50m94j428j843j810j547j173q96j065j659k100j983j618j490j524
54443A50463j331q39k40L60Q06P65K56j32k5R9l25r99j187q24l96q4K75N32L94
54424A47568P8R6M31N79L89J25j49n63q39n19K45P51P31N79N56M95M09O07R80
54405A52549Q87R2p71j109j188j534j900j502j40J407K248K339K312K521K624
54390A58835K195J431Q24L91k32r54j196q50n35n72m64J22O41N66L86Q39J695
54373A63122K177K186K142J974J334O11O32J267J442P47R3L39J070J249O44M5
54357A81074L03J368K289K147J006j94q71j380k133k763k774k447k318k235j797
$$ plain form
54342 169275 167940 166501 164694 163042 161966 161044 159681 157931 156071 154042 151995 150768 150947 151846 152301
54327 152301 152100 151766 151313 150325 149144 148875 149998 151805 153399 154520 155164 155113 154196 152555 150486 148408
54311 148408 146972 146632 146986 147227 147359 148247 150154 152038 152844 152877 153131 153676 153611 152566 151351 150811 150686 150158
54293 150158 149157 148481 148586 148931 148792 148321 148308 149178 150678 152469 154401 156169 157226 157370 157025 156727 156631
54276 156631 156684 156911 157260 157500 157508 157410 157253 156907 156445 156217 156315 156429 156532 157179 158722 160665 162313 163683 165275
54257 165275 167221 169145 170572 171082 170465 169173 168266 168380 169116 169895 170869 172264 173338 172934 170865 167964
54241 167964 165022 162540 161236 161645 163099 164039 163645 162452 161289 160368 159630 159162 158920 158639 158261 157968 157627
54224 157627 156850 155757 155078 155236 155895 156599 157263 157824 158045 157899 157627 157235 156577 156032 156309 157260 157759 157195
$$ packed form
54342A69275j335j439j807j652j076r22j363j750j860k029k047j227J79Q99M55
54327A52301k01l34m53r88j181k69J123J807J594J121O44n1r17j641k069k078
54311A48408j436l40L54K41J32Q88J907J884Q06L3K54N45o5j045j215n40j25n28
54293A50158j001o76J05L45j39m71j3Q70J500J791J932J768J057J44l45k98r6
54276A56631N3K27L49K40Qr8j57l46m62k28R8J14J03O47J543J943J648J370J592
54257A65275J946J924J427N10o17j292r07J14P36P79R74J395J074m04k069k901
54241A67964k942k482j304M09J454R40l94j193j163r21p38m68k42k81l78k93l41
54224A57627p77j093o79J58O59P04O64N61K21j46k72l92o58n45K77R51M99n64
$$ plain form
54206 157195 156241 155561 154636 152719 150252 148356 147357 146791 146593 147215 148612 150087 151319 152734 154570 156266
54190 156266 157154 157335 157451 157951 158849 159987 161241 162560 164066 166035 168645 171786 175157 178462 181483
54175 181483 184081 186237 187977 189200 189666 189245 188041 186155 183447 179814 175785 172479 170615 169672 168419
54160 168419 166297 163884 161897 160246 158458 156621 155344 154967 155308 156091 157093 157967 158459 158816 159410 159945
54144 159945 159724 158844 158378 158961 159863 160059 159699 159748 160497 161282 161671 162104 163100 164350 165007 164601 163347 161767
54126 161767 160335 159442 159404 160353 162145 164396 166559 168084 168739 168883 169267 170344 171784 172815 173017 172616
54110 172616 172029 171482 171139 171228 171746 172285 172477 172413 172292 171877 170765 169088 167486 166417 165968 166313 167727 169924
54092 169924 171858 172623 172343 171940 172193 173192 174499 175603 176280 176630 176728 176391 175600 175023 175598 177437 179604
$$ packed form
54206A57195r54o80r25j917k467j896r99n66j98O22J397J475J232J415J836J696
54190A56266Q88J81J16N00Q98J138J254J319J506J969K610L141L371L305L021
54175A81483K598K156J740J223M66m21j204j886k708l633m029l306j864r43j253
54160A68419k122k413j987j651j788j837j277l77L41P83J002Q74M92L57N94N35
54144A59945k21q80m66N83R02J96l60M9P49P85L89M33R96J250O57m06j254j580
54126A61767j432q93l8R49J792K251K163J525O55J44L84J077J440J031K02m01
54110A72616n87n47l43Q9N18N39J92o4j21m15j112j677j602j069m49L45J414K197
54092A69924J934P65k80m03K53R99J307J104O77L50R8l37p91n77N75J839K167
$$ plain form
54075 179604 181242 182535 184234 186654 189563 192811 196471 200316 203632 205822 207028 207968 209154 210352
54061 210352 210877 210366 209126 207672 206180 204613 203184 202220 201629 200926 199961 199225 199330 200485 202596 205493
54045 205493 208786 211859 214343 216448 218653 221290 224551 228609 233438 238699 244055 249486 255197 261428
54031 261428 268445 276345 284634 292352 298897 304495 309595 314137 317770 320467 322418 323554 323704 323167 322598
54016 322598 322283 321947 321316 320482 319531 318164 315932 312700 308712 304332 299775 295061 290134 285028 279905
54001 279905 274906 270104 265668 261991 259424 257941 257151 256652 256281 256095 256207 256675 257469 258512 259641 260496
53985 260496 260590 259706 258123 256197 253878 251010 247953 245281 242775 239457 234961 230242 226439 223641 221433
53970 221433 220010 219803 220261 220132 219054 217989 217814 218297 218794 219177 219571 219782 219680 219768 220712 222551 224881
$$ packed form
54075A79604J638J293J699K420K909L248L660L845L316K190J206R40J186J198
54061B10352N25n11j240j454j492j567j429r64n91p03r65p36J05J155K111K897
54045B05493L293L073K484K105K205K637L261M058M829N261N356N431N711O231
54031B61428P017P900Q289P718O545N598N100M542L633K697J951J136J50n37n69
54016C22598l15l36o31q34r51j367k232l232l988m380m557m714m927n106n123
54001B79905m999m802m436l677k567j483p90m99l71j86J12M68P94J043J129Q55
53985B60496R4q84j583j926k319k868l057k672k506l318m496m719l803k798k208
53970B21433j423k07M58j29j078j065j75M83M97L83L94K11j02Q8R44J839K330
$$ plain form
53953 224881 227593 230738 233858 236239 238025 240371 244093 248612 252673 255864 258891 262496 266602 270642
53939 270642 274375 278065 281978 285957 289557 292584 295429 298755 302731 306668 309572 311084 311699 312138 312772
53924 312772 313740 315306 317783 321259 325653 330961 337204 344157 351407 358701 366103 373786 381816 390086
53910 390086 398305 406114 413429 420574 427770 434540 439954 443544 445717 447138 447978 447960 446925 445130 443021
53895 443021 440824 438275 434720 429613 423017 415550 407855 400214 392613 384892 376798 368176 359305 350820
53881 350820 343191 336360 329990 323859 317904 312089 306454 301147 296268 291757 287538 283666 280165 276831
53867 276831 273373 269691 265945 262356 259018 255860 252754 249671 246742 244164 242116 240764 240116 239720 238752
53852 238752 236795 234444 232751 232087 231832 231189 229940 228382 226896 225690 224687 223601 222413 221693 221987
$$ packed form
53953B24881K712L145L120K381J786K346L722M519M061L191L027L605M106M040
53939B70642L733L690L913L979L600L027K845L326L976L937K904J512O15M39O34
53924C12772R68J566K477L476M394N308O243O953P250P294P402P683Q030Q270
53910C90086Q219P809P315P145P196O770N414L590K173J421Q40j8j035j795k109
53895D43021k197k549l555n107o596p467p695p641p601p721q094q622q871q485
53881C50820p629o831o370o131n955n815n635n307m879m511m219l872l501l334
53867B76831l458l682l746l589l338l158l106l083k929k578k048j352o48l96r68
53852B38752j957k351j693o64k55o43j249j558j486j206j003j086j188p20K94
$$ plain form
53837 221987 222837 223020 221979 220487 219650 219720 220231 220787 221233 221432 221399 221434 221697 221880 221691 221446 221743 222744 224174
53818 224174 225843 227701 229504 230958 232218 233836 236109 238727 241175 243288 245399 248057 251535 255539
53804 255539 259550 263555 268136 273622 279455 284806 289636 294717 300632 307110 313390 318956 323847 328382
53790 328382 332682 336499 339593 342211 344811 347317 349108 349949 350451 351171 351640 350816 348294 344573 340229
53775 340229 335326 329678 323341 316756 310592 305387 301217 297788 294846 292214 289383 285655 281011 276348
53761 276348 272422 268990 265481 262019 259062 256466 253700 250821 248399 246575 244939 243325 241934 240642
53747 240642 238971 236953 235336 234638 234543 234490 234351 234264 234207 234027 233550 232564 231057 229584 228984 229549 230762 231923
53729 231923 232734 233313 234016 235265 237112 239016 240523 242032 244247 246917 248931 249816 250335 251274 252379 253007
$$ packed form
53837B21987Q50J83j041j492q37P0N11N56M46J99l3L5K63J83j89k45K97J001J430
53818B24174J669J858J803J454J260J618K273K618K448K113K111K658L478M004
53804B55539M011M005M581N486N833N351M830N081N915O478O280N566M891M535
53790C28382M300L817L094K618K600K506J791Q41N02P20M69q24k522l721m344
53775C40229m903n648o337o585o164n205m170l429k942k632k831l728m644m663
53761B76348l926l432l509l462k957k596k766k879k422j824j636j614j391j292
53747B40642j671k018j617o98r5n3j39q7n7j80m77r86j507j473o00N65J213J161
53729B31923Q11N79P03J249J847J904J507J509K215K670K014Q85N19R39J105O28
$$ plain form
53713 253007 253264 253932 255571 258118 261025 263500 264952 265565 266119 267084 268283 269661 271790 275147 279347
53698 279347 283568 287403 290958 294517 298492 303258 308520 313234 316651 319082 321134 322672 323243 323151 323235
53683 323235 323692 323943 323717 323477 323603 323782 323515 322740 321697 320625 319860 319847 320698 321932 322915 323395 323424 323066
53665 323066 322466 322071 322362 323280 324140 324330 324012 323944 324583 325535 326100 326208 326500 327389 328358 328433 327201 325128 323046
53646 323046 321603 321134 321715 323099 324660 325664 325783 325447 325556 326634 328332 329943 331312 332897 334871
53631 334871 336663 337643 337945 338241 338903 339733 340427 341018 341868 343439 345970 349144 352185 354528 356370 358378
53615 358378 360948 363979 367279 370813 374479 377941 380909 383479 386094 389171 392792 396669 400374 403599
53601 403599 406286 408549 410556 412443 414249 415895 417256 418254 418837 419001 418994 419330 420273 421319 421548 420646 419250
$$ packed form
53713B53007K57O68J639K547K907K475J452O13N54R65J199J378K129L357M200
53698B79347M221L835L555L559L975M766N262M714L417K431K052J538N71r2Q4
53683C23235M57K51k26k40J26J79k67p75j043j072p65j3Q51J234R83M80K9l58
53665C23066o00l95K91R18Q60J90l18o8O39R52N65J08K92Q89R69P5j232k073k082
53646C23046j443m69N81J384J561J004J19l36J09J078J698J611J369J585J974
53631C34871J792R80L02K96O62Q30O94N91Q50J571K531L174L041K343J842K008
53615C58378K570L031L300L534L666L462K968K570K615L077L621L877L705L225
53601D03599K687K263K007J887J806J646J361R98N83J64pL36R43J046K29r02j396
$$ plain form
53584 419250 418127 417287 416084 413941 410851 407416 404562 402876 401959 400748 398734 396499 394722 393135 391080
53569 391080 388769 387180 386693 386574 386061 385346 385057 385229 385317 385035 384767 385065 386026 387193 387951 388023 387705 387640 388269
53550 388269 389435 390519 391000 390907 390774 391174 392292 393901 395710 397666 399934 402696 405971 409573 413235
53535 413235 416886 420824 425462 430874 436703 442595 448604 455120 462542 471056 480566 490797 501591 513144
53521 513144 525706 539017 552386 565543 579110 593935 610154 627174 644450 661896 679709
53510 679709 698141 717505 738147 760341 784260 809851 836566 863442 889831 915966 942448
53499 942448 969208 995334 1019904 1042669 1063930 1084148 1103775 1123120 1142197 1160960 1179739
53488 1179739 1199087 1219081 1239109 1258618 1277767 1297052 1316566 1335992 1355205 1374396 1393553
$$ packed form
53584D19250j123q40j203k143l090l435k854j686r17j211k014k235j777j587k055
53569C91080k311j589m87j19n13p15k89J72Q8k82k68K98R61J167P58P2l18o5O29
53550C88269J166J084M81r3j33M00J118J609J809J956K268K762L275L602L662
53535D13235L651L938M638N412N829N892O009O516P422Q514R510J0231J0794J1553
53521E13144J2562J3311J3369J3157J3567J4825J6219J7020J7276J7446J7813
53510F79709J8432J9364K0642K2194K3919K5591K6715K6876K6389K6135K6482
53499I42448K6760K6126K4570K2765K1261K0218J9627J9345J9077J8763J8779
53488A179739J9348J9994K0028J9509J9149J9285J9514J9426J9213J9191J9157
$$ plain form
53477 1393553 1412186 1429791 1446364 1462272 1477634 1491970 1504447 1514402 1521703 1526756 1530180 1532339
53465 1532339 1533059 1531753 1527890 1521365 1512489 1501725 1489432 1475769 1460757 1444549 1427709 1411076
53453 1411076 1395159 1379734 1364143 1347847 1330469 1311593 1291098 1269723 1248750 1228818 1209462
53442 1209462 1190084 1170983 1153013 1136522 1121199 1106900 1094108 1083487 1075314 1069405 1065256 1062204
53430 1062204 1059731 1057833 1056969 1057582 1059748 1063210 1067606 1072724 1078763 1086260 1095515 1106219 1118001 1131219
53416 1131219 1146713 1164660 1184265 1204874 1226871 1250956 1276857 1303451 1330113 1357336 1385880
53405 1385880 1415885 1447214 1480193 1515353 1552491 1590571 1628787 1667451 1707608 1750052 1794912
53394 1794912 1841956 1890899 1941506 1993694 2047561 2103043 2159540 2216121 2272163 2327618 2382713
$$ packed form
53477A393553J8633J7605J6573J5908J5362J4336J2477R955P301N053L424K159
53465A532339P20j306l863o525q876j0764j2293j3663j5012j6208j6840j6633
53453A411076j5917j5425j5591j6296j7378j8876k0495k1375k0973j9932j9356
53442A209462j9378j9101j7970j6491j5323j4299j2792j0621q173n909m149l052
53430A062204k473j898q64O13K166L462M396N118O039P497R255J0704J1782J3218
53416A131219J5494J7947J9605K0609K1997K4085K5901K6594K6662K7223K8544
53405A385880L0005L1329L2979L5160L7138L8080L8216L8664M0157M2444M4860
53394A794912M7044M8943N0607N2188N3867N5482N6497N6581N6042N5455N5095
$$ plain form
53383 2382713 2437583 2492056 2545408 2596421 2644183 2688911 2731482 2772044 2809640 2843418 2873509
53372 2873509 2900184 2922809 2940475 2953305 2962212 2967310 2967422 2961394 2949180 2931256 2907541 2877507
53360 2877507 2841143 2799368 2753499 2704603 2653384 2600449 2546553 2492522 2438889 2385661 2332536
53349 2332536 2279469 2227019 2176216 2127980 2082404 2038480 1994843 1951036 1907802 1865859 1824798
53338 1824798 1783794 1743129 1704174 1667755 1633417 1600663 1570107 1542660 1518015 1494835 1472365
53327 1472365 1451178 1432218 1415678 1401006 1387463 1374222 1360271 1344834 1328018 1310786 1294150
53316 1294150 1278537 1263966 1250574 1238615 1228049 1218530 1209997 1202974 1197965 1194673 1192265 1190402 1189624
53303 1189624 1190577 1193213 1197014 1201662 1207189 1213642 1221132 1230158 1241458 1255358 1271576 1289820 1310154
$$ packed form
53383B382713N4870N4473N3352N1013M7762M4728M2571M0562L7596L3778L0091
53372B873509K6675K2625J7666J2830Q907N098J12o028j2214j7924k3715l0034
53360B877507l6364m1775m5869m8896n1219n2935n3896n4031n3633n3228n3125
53349B332536n3067n2450n0803m8236m5576m3924m3637m3807m3234m1943m1061
53338A824798m1004m0665l8955l6419l4338l2754l0556k7447k4645k3180k2470
53327A472365k1187j8960j6540j4672j3543j3241j3951j5437j6816j7232j6636
53316A294150j5613j4571j3392j1959j0566r519q533p023n009l292k408j863p78
53303A189624R53K636L801M648N527O453P490R026J1300J3900J6218J8244K0334
$$ plain form
53290 1310154 1332473 1355960 1379613 1403230 1427415 1452524 1478131 1503687 1529131 1554304 1578156
53279 1578156 1599282 1617334 1633409 1648761 1663374 1675916 1684872 1689601 1690531 1688518 1683987 1676768 1666809
53266 1666809 1654741 1641309 1626353 1608940 1588541 1565560 1540577 1513813 1485667 1457115 1428922
53255 1428922 1400835 1372153 1342770 1313070 1283177 1253097 1223450 1195189 1168419 1142147 1115461
53244 1115461 1088449 1061740 1035630 1009987 984686 959777 935408 911741 888825 866473 844506
53233 844506 823155 802950 784132 766484 749885 734668 721210 709357 698578 688551 679370 671212
53221 671212 663912 656897 649397 640747 630564 618777 605590 591432 576765 561845 546803 531994
53209 531994 517940 504776 492062 479500 467573 457032 447906 439508 431330 423426 415947 408752 401608
$$ packed form
53290A310154K2319K3487K3653K3617K4185K5109K5607K5556K5444K5173K3852
53279A578156K1126J8052J6075J5352J4613J2542Q956M729R30k013m531p219r959
53266A666809j2068j3432j4956j7413k0399k2981k4983k6764k8146k8552k8193
53255A428922k8087k8682k9383k9700k9893l0080k9647k8261k6770k6272k6686
53244A115461k7012k6709k6110k5643k5301k4909k4369k3667k2916k2352k1967
53233H44506k1351k0205j8818j7648j6599j5217j3458j1853j0779j0027r181q158
53221F71212p300p015p500q650j0183j1787j3187j4158j4667j4920j5042j4809
53209E31994j4054j3164j2714j2562j1927j0541r126q398q178p904p479p195p144
$$ plain form
53196 401608 394292 386436 377700 368270 358783 349633 340729 332116 324413 318299 313786 310227 306914 303517
53182 303517 300119 296988 294265 291833 289561 287485 285531 283277 280420 277381 274936 273219 271568 269430
53168 269430 266933 264511 262438 260894 259979 259461 258921 258352 258228 258781 259588 259982 259509 257998 255706 253480
53152 253480 252117 251418 250511 249274 248593 248911 249483 249647 249885 250799 251794 251844 251087 250553 250572 250508 250025 249602 249692
53133 249692 250216 251082 252439 254121 255478 256138 256503 257235 258552 260243 262124 264244 266797 269879 273289
53118 273289 276707 280159 283986 288164 292148 295763 299687 304294 308499 310716 310830 310245 309925 309386 307867
53103 307867 305573 303263 301231 299146 296461 292706 287831 282511 277586 273046 268225 263139 258802 255777
53089 255777 253306 250514 247744 245848 244721 243473 241731 239872 238169 236575 235257 234498 234062 233406 232565
$$ packed form
53196D01608p316p856q736r430r487r150q904q613p703o114m513l559l313l397
53182C03517l398l131k723k432k272k076j954k254k857l039k445j717j651k138
53168B69430k497k422k073j544r15n18n40n69j24N53Q07L94m73j511k292k226
53152B53480j363o99r07j237o81L18N72J64K38R14R95N0p57n34J9o4m83m23R0
53133B49692N24Q66J357J682J357O60L65P32J317J691J881K120K553L082L410
53118B73289L418L452L827M178L984L615L924M607M205K217J14n85l20n39j519
53103C07867k294k310k032k085k685l755m875n320m925m540m821n086m337l025
53089B55777k471k792k770j896j127j248j742j859j703j594j318p59m36o56q41
$$ plain form
53074 232565 232060 231850 231223 229969 228883 228700 229163 229637 230088 230863 231889 232695 233014 232875 232278 231220 229873
53057 229873 228325 226366 224045 222213 221830 222732 223786 224366 224979 226109 227235 227642 227674 228301 229608 230538
53041 230538 230303 229320 228427 227765 226929 225839 224855 224168 223597 223059 222807 223066 223709 224491 225337 226218 226955 227390
53023 227390 227644 227955 228290 228412 228359 228569 229372 230618 231959 233288 234552 235363 235289 234557 233915 233627 233099 231873
53005 231873 230536 230082 230694 231782 233056 234797 236972 238897 240054 240665 241077 241178 240899 240792 241482 242820
52989 242820 244164 245268 246380 247622 248905 250350 252146 253961 255123 255511 255725 256161 256463 256177 255484 254899
52973 254899 254593 254372 254084 253728 253345 253106 253340 254187 255414 256783 258336 260012 261352 262062 262635 263746 265062
52956 265062 265389 264192 262381 261223 260954 260884 260465 259667 258518 256965 255236 253835 253015 252620 252489 252584 252632
$$ packed form
53074B32565n05k10o27j254j086j83M63M74M51P75J026Q06L19j39n97j058j347
53057B29873j548j959k321j832l83R02J054N80O13J130J126M07L2O27J307R30
53041B30538k35r83q93o62q36j090r84o87n71n38k52K59O43P82Q46Q81P37M35
53023B27390K54L11L35J22n3K10Q03J246J341J329J264Q11p4p32o42k88n28j226
53005B31873j337m54O12J088J274J741K175J925J157O11M12J01k79j07O90J338
52989B42820J344J104J112J242J283J445J796J815J162L88K14M36L02k86o93n85
52973B54899l06k21k88l56l83k39K34Q47J227J369J553J676J340P10N73J111J316
52956B65062L27j197j811j158k69p0m19p98j149j553j729j401q20l95j31R5M8
$$ plain form
52939 252632 252174 251285 250766 251196 252160 252828 253001 253042 253083 253054 253370 254683 256755 258338 258628 258205 258045 258208 258169
52920 258169 257979 258168 258636 258621 257967 257590 258215 259272 259699 259480 259640 260721 261952 262217 261385 260296 259672 259456
52902 259456 259148 258389 257099 255362 253450 251788 250721 250329 250536 251220 252079 252663 252788 252810 253196 253897 254433
52885 254433 254560 254535 254756 255438 256564 257835 258712 258936 259016 259816 261603 263943 266543 269609 273179 276679 279508
52868 279508 281589 282975 283388 282659 281289 280009 278995 277923 276621 275182 273647 271994 270344 268755 266999
52853 266999 264947 262991 261586 260511 259089 257070 254783 252514 250283 248274 246892 246210 245763 245027 243802
52838 243802 242090 239994 237847 236077 234843 234038 233750 234306 235777 237696 239382 240393 240722 240879 241662 243374
52822 243374 245177 245645 244129 241271 238137 235302 232857 230826 229241 228116 227598 227944 229159 230850 232546
$$ packed form
52939B52632m58q89n19M30R64O68J73M1M1k9L16J313K072J583K90m23j60J63l9
52920B58169j90J89M68j5o54l77O25J057M27k19J60J081J231K65q32j089o24k16
52902B59456l08p59j290j737j912j662j067l92K07O84Q59N84J25K2L86P01N36
52885B54433J27k5K21O82J126J271Q77K24Q0Q00J787K340K600L066L570L500K829
52868B79508K081J386M13p29j370j280j014j072j302j439j535j653j650j589j756
52853B66999k052j956j405j075j422k019k287k269k231k009j382o82m47p36j225
52838B43802j712k096k147j770j234q05k88N56J471J919J686J011L29J57P83J712
52822B43374J803M68j516k858l134k835k445k031j585j125n18L46J215J691J696
$$ plain form
52807 232546 233982 234986 235364 235038 234058 232466 230350 228074 226091 224494 223105 222015 221590 221775 221905 221455
52791 221455 220624 219908 219472 219258 219302 219517 219400 218457 216892 215535 215070 215498 216314 216961 217117 216722 215887 214826
52773 214826 213841 213256 213219 213680 214633 216142 217864 218871 218498 217298 216579 216963 217875 218491 218646 218678 218938 219754
52755 219754 221283 223096 224290 224350 223597 222649 221883 221570 221874 222389 222320 221650 221582 223208 226231 229556 232669
52738 232669 235635 238115 239415 239562 239510 240045 241053 242082 243122 244500 246250 247862 248604 248136 246909 245870
52722 245870 245546 245510 244946 243640 242223 241534 241937 243122 244335 244961 245059 245213 245779 246567 247354 248271 249389 250454
52704 250454 251370 252399 253366 253224 251219 248172 245782 244780 244546 244412 244445 244830 245300 245486 245300 244757 243887
52687 243887 242930 242220 241842 241830 242527 244066 245624 246072 245458 244966 245157 245202 244304 242941 242059 241756 241558 241370
$$ packed form
52807B32546J436J004L78l26r80j592k116k276j983j597j389j090m25J85J30m50
52791B21455q31p16m36k14M4K15j17r43j565j357m65M28Q16O47J56l95q35j061
52773B14826r85n85l7M61R53J509J722J007l73j200p19L84R12O16J55L2K60Q16
52755B19754J529J813J194O0p53r48p66l13L04N15o9o70o8J626L023L325L113
52738B32669K966K480J300J47n2N35J008J029J040J378J750J612P42m68j227j039
52722B45870l24l6n64j306j417o89M03J185J213O26R8J54N66P88P87R17J118J065
52704B50454R16J029R67j42k005l047k390j002k34j34L3L85M70J86j86n43q70
52687B43887r57p10l78j2O97J539J558M48o14m92J91M5q98j363q82l03j98j88
$$ plain form
52669 241370 241332 241148 240522 239993 240466 241946 243489 244417 244866 245060 244823 244170 243802 244524 246405 248845 251295
52652 251295 253690 256305 259456 263238 267359 271195 274087 275622 275688 274458 272464 270570 269483 269109 268566
52637 268566 267211 265639 265306 266908 269494 271633 273196 275423 279225 284127 289169 294252 300029 306739
52623 306739 313623 319405 322934 323503 321066 316366 310640 305068 300435 297049 294672 292578 290069 287103
52609 287103 284325 282473 281780 281859 281986 281586 280620 279512 278655 278098 277808 277913 278444 279068 279507 280067 281243 282826
52591 282826 283914 284012 283698 283918 284961 286351 287479 288043 288108 288084 288556 289776 291324 292489 292929 292752 292109
52574 292109 291082 290031 289589 290042 290891 291269 290777 289721 288628 287735 286955 286145 285225 284068 282475 280465
52558 280465 278572 277612 277909 278788 279084 278233 276729 275389 274418 273390 272056 270866 270593 271570 273350 275034
$$ packed form
52669B41370l8j84o26n29M73J480J543R28M49J94k37o53l68P22J881K440K450
52652B51295K395K615L151L782M121L836K892J535O6j230j994j894j087l74n43
52637B68566j355j572l33J602K586K139J563K227L802M902N042N083N777O710
52623C06739O884N782L529N69k437m700n726n572m633l386k377k094k509k966
52609B87103k778j852o93P9J27m00r66j108q57n57k90J05N31O24M39N60J176J583
52591B82826J088R8l14K20J043J390J128N64O5k4M72J220J548J165M40j77o43
52574B92109j027j051m42M53Q49L78m92j056j093q93p80q10r20j157j593k010
52558B80465j893r60K97Q79K96q51j504j340r71j028j334j190k73R77J780J684
$$ plain form
52542 275034 275861 275654 274869 274277 274492 275629 277258 278717 279619 280137 280725 281567 282455 283293 284361 285864 287429
52525 287429 288496 289135 290032 291567 293325 294728 295785 296938 298392 299939 301286 302254 302743 302803 302788 303217
52509 303217 304373 306126 308106 309963 311526 312781 313727 314240 314185 313610 312590 310832 307814 303590 299151
52494 299151 295606 293132 291098 289096 287382 286282 285636 285045 284377 283796 283428 283174 282787 282113 281314 280797 280816
52477 280816 281190 281590 282025 282803 284061 285682 287663 290243 293481 297008 300343 303252 305691 307657 309351
52462 309351 311277 313910 317295 321003 324398 326880 328078 327971 326703 324238 320423 315499 310285 305600
52448 305600 301644 298170 295063 292425 290202 288096 285918 283759 281790 280122 278939 278491 278759 279267 279397
52433 279397 278879 277900 276860 276178 276220 277151 278726 280372 281640 282606 283737 285371 287364 289281 290853 292235
$$ packed form
52542B75034Q27k07p85n92K15J137J629J459R02N18N88Q42Q88Q38J068J503J565
52525B87429J067O39Q97J535J758J403J057J153J454J547J347R68M89O0j5M29
52509C03217J156J753J980J857J563J255R46N13n5n75j020j758l018m224m439
52494B99151l545k474k034k002j714j100o46n91o68n81l68k54l87o74p99n17J9
52477B80816L74M00M35P78J258J621J981K580L238L527L335K909K439J966J694
52462C09351J926K633L385L708L395K482J198j07j268k465l815m924n214m685
52448C05600l956l474l107k638k223k106k178k159j969j668j183m48K68N08J30
52433B79397n18r79j040o82M2R31J575J646J268R66J131J634J993J917J572J382
$$ plain form
52417 292235 293842 295942 298326 300388 301667 302355 303181 304640 306468 308000 308999 309917 311342 313391 315723
52402 315723 318046 320466 323354 326917 330899 334653 337496 338977 338906 337354 334744 331784 329038 326516 323781
52387 323781 320521 317022 314049 312258 311634 311464 310995 310197 309701 310009 311039 312612 314978 318430 322591 326624
52371 326624 330165 333616 337452 341650 345946 350230 354416 358171 361087 362968 363855 363958 363713 363628 363826 363953
52355 363953 363744 363527 363879 364926 366233 367291 367908 368200 368528 369366 370928 372846 374436 375362 375898 376506 377469
52338 377469 379080 381923 386514 392608 399156 405251 410987 417176 424323 432250 440804 450479 461908 474875
52324 474875 488332 501475 514511 528259 543202 559092 575308 591405 607419 623743 640729
52313 640729 658425 676763 695831 715727 736172 756574 776631 796605 816883 837456 858010
$$ packed form
52417B92235J607K100K384K062J279O88Q26J459J828J532R99R18J425K049K332
52402C15723K323K420K888L563L982L754K843J481p1j552k610k960k746k522k735
52387C23781l260l499k973j791o24j70m69p98m96L08J030J573K366L452M161M033
52371C26624L541L451L836M198M296M284M186L755K916J881Q87J03k45q5J98J27
52355C63953k09k17L52J047J307J058O17K92L28Q38J562J918J590R26N36O08R63
52338C77469J611K843M591O094O548O095N736O189P147P927Q554R675J1429J2967
52324D74875J3457J3143J3036J3748J4943J5890J6216J6097J6014J6324J6986
52313F40729J7696J8338J9068J9896K0445K0402K0057J9974K0278K0573K0554
$$ plain form
52302 858010 878345 898414 918016 936687 954000 969905 984702 998728 1012030 1024270 1034786
52291 1034786 1042701 1047158 1047880 1045643 1041936 1037848 1033408 1028132 1021908 1015053 1007855 1000573 993648 987293
52277 987293 981015 974297 967757 962860 960240 959106 958657 959336 962040 966720 972540 979111 986777 995761 1005772
52262 1005772 1016514 1028044 1040516 1053968 1068411 1083812 1099889 1116276 1132893 1149949 1167517
52251 1167517 1185356 1203046 1219967 1235222 1247955 1257874 1265240 1270331 1273175 1273826 1272494 1269215 1263620
52238 1263620 1255299 1244352 1231507 1217675 1203387 1188586 1173006 1156738 1140346 1124371 1108909
52227 1108909 1093776 1078934 1064558 1050837 1037926 1025942 1014830 1004419 994839 986644 980139 974731
52215 974731 969396 963752 958366 954038 951215 950055 950486 951984 953725 955362 957422 960653 965100 970125
$$ packed form
52302H58010K0335K0069J9602J8671J7313J5905J4797J4026J3302J2240J0516
52291A034786P915M457P22k237l707m088m440n276o224o855p198p282o925o355
52277I87293o278o718o540m897k620j134m49O79K704M680N820O571P666Q984J0011
52262A005772J0742J1530J2472J3452J4443J5401J6077J6387J6617J7056J7568
52251A167517J7839J7690J6921J5255J2733R919P366N091K844O51j332l279n595
52238A263620q321j0947j2845j3832j4288j4801j5580j6268j6392j5975j5462
52227A108909j5133j4842j4376j3721j2911j1984j1112j0411r580q195o505n408
52215I74731n335n644n386m328k823j160M31J498J741J637K060L231M447N025
$$ plain form
52201 970125 975226 980537 986396 992650 998604 1003655 1007856 1011793 1016056 1020950 1026602 1033010 1039823 1046314
52187 1046314 1051741 1055669 1057938 1058534 1057587 1055269 1051516 1046130 1039357 1032097 1025257 1019070 1013278 1007635
52173 1007635 1001904 995698 988954 982483 977465 974269 972108 969950 967475 965152 963775 963946 965650 968202
52159 968202 970798 973143 975386 977619 979766 981822 983681 984779 984468 982857 980788 978851 976929 974949
52145 974949 973498 973235 974045 975312 976908 979390 983093 987399 991180 993939 996233 998874 1001931 1004863 1007614
52130 1007614 1011163 1016782 1025098 1036081 1049462 1064687 1080898 1097686 1115705 1135897 1158161 1181374
52118 1181374 1204616 1227693 1250589 1273238 1295917 1318990 1342021 1363887 1384139 1403480 1422578
52107 1422578 1441146 1458678 1475273 1491044 1505355 1517492 1527686 1536721 1544785 1551370 1556107 1559001
$$ packed form
52201I70125N101N311N859O254N954N051M201L937M263M894N652O408O813O491
52187A046314N427L928K269N96r47k318l753n386o773p260o840o187n792n643
52173A007635n731o206o744o471n018l196k161k158k475k323j377J71J704K552
52159I68202K596K345K243K233K147K056J859J098l11j611k069j937j922j980
52145I74949j451k63Q10J267J596K482L703M306L781K759K294K641L057K932K751
52130A007614L549N619Q316J0983J3381J5225J6211J6788J8019K0192K2264K3213
52118A181374K3242K3077K2896K2649K2679K3073K3031K1866K0252J9341J9098
52107A422578J8568J7532J6595J5771J4311J2137J0194R035Q064O585M737K894
$$ plain form
52095 1559001 1559983 1558813 1555342 1549434 1540760 1529179 1515198 1499626 1482936 1465335 1447194 1428821
52083 1428821 1410110 1391075 1372606 1356028 1341840 1329459 1318162 1307730 1298221 1289776 1282790 1277793
52071 1277793 1274987 1274307 1275853 1279734 1285523 1292539 1300820 1311152 1323909 1338491 1354223 1371179 1389622
52058 1389622 1409077 1428539 1447314 1465236 1482188 1497904 1512176 1524946 1536182 1545776 1553386 1558283
52046 1558283 1559597 1556957 1550777 1541740 1530230 1516463 1500895 1484164 1466684 1448535 1429713 1410357
52034 1410357 1390835 1371667 1353150 1334997 1316662 1298190 1280350 1263639 1247534 1231238 1214809
52023 1214809 1198968 1184001 1169530 1155371 1141872 1129185 1116910 1104861 1093593 1083628 1074520 1065355
52011 1065355 1055942 1046848 1038263 1029523 1019928 1009451 998319 986358 973231 958992 943917 927915
$$ packed form
52095A559001R82j170l471n908q674j1581j3981j5572j6690j7601j8141j8373
52083A428821j8711j9035j8469j6578j4188j2381j1297j0432r509q445o986m997
52071A277793k806o80J546L881N789P016Q281J0332J2757J4582J5732J6956J8443
52058A389622J9455J9462J8775J7922J6952J5716J4272J2770J1236R594P610M897
52046A558283J314k640o180r037j1510j3767j5568j6731j7480j8149j8822j9356
52034A410357j9522j9168j8517j8153j8335j8472j7840j6711j6105j6296j6429
52023A214809j5841j4967j4471j4159j3499j2687j2275j2049j1268r965r108r165
52011A065355r413r094q585q740r595j0477j1132j1961j3127j4239j5075j6002
$$ plain form
51999 927915 910688 892532 874572 857986 843196 829825 817146 804460 791336 777759 763926
51988 763926 749871 735436 720614 705571 690201 674092 657218 640319 624196 608851 593813
51977 593813 579150 565591 553639 543085 533548 525083 518020 512582 508892 507095 507181 508926 512280 517583
51963 517583 525043 534064 543407 552071 559837 567043 574151 581520 589296 597345 605497 614076 624070 636583
51949 636583 652148 670579 691332 713646 736283 757371 774663 786025 789913 785916 775201 760253
51937 760253 743747 727514 712494 699231 687875 677892 668485 659540 651634 644840 637998 629588 618979
51924 618979 606438 592366 577179 561691 546847 532927 519524 506354 493609 481513 470124
51913 470124 459722 450854 443732 437993 433310 429816 427716 426899 427264 428933 431724 434788 437236 438860
$$ packed form
51999I27915j7227j8156j7960j6586j4790j3371j2679j2686j3124j3577j3833
51988G63926j4055j4435j4822j5043j5370j6109j6874j6899j6123j5345j5038
51977E93813j4663j3559j1952j0554r537q465p063n438l690j797Q6J745L354N303
51963E17583P460R021R343Q664P766P206P108P369P776Q049Q152Q579R994J2513
51949F36583J5565J8431K0753K2314K2637K1088J7292J1362L888l997j0715j4948
51937G60253j6506j6233j5020j3263j1356r983r407q945p906o794o842q410j0609
51924F18979j2541j4072j5187j5488j4844j3920j3403j3170j2745j2096j1389
51913D70124j0402q868p122n739m683l494k100q17L65J669K791L064K448J624
$$ plain form
51899 438860 439821 439972 439009 437024 434220 430190 424205 416312 407547 398924 390777 383337 377327 373459 371580
51884 371580 370798 370361 370190 370652 372124 374815 378826 384259 391127 398994 406803 413482 418830 423500 427923
51869 427923 431675 434246 435978 437590 439012 439432 438602 437414 436871 437065 437582 438415 439811 441481 442651 442988
51853 442988 442896 442696 442071 440573 438242 435266 431284 425632 418314 410312 402747 396007 389796 383774 377858
51838 377858 372086 366528 361456 357376 354714 353478 353281 353655 354307 355154 356288 357962 360357 363190 365631
51823 365631 366855 366763 365949 364958 363821 362420 360935 359603 358216 356335 353973 351790 350516 350435 351388 352941
51807 352941 354460 355421 355902 356551 357819 359457 360975 362363 363994 366017 368219 370389 372368 373749 373983
51792 373983 373046 371624 370380 369227 367613 365388 363050 361148 359708 358344 356806 355258 354061 353369 352993
$$ packed form
51899D38860R61J51r63j985k804m030n985p893q765q623q147p440o010l868j879
51884C71580p82m37j71M62J472K691M011N433O868P867P809O679N348M670M423
51869D27923L752K571J732J612J422M20q30j188n43J94N17Q33J396J670J170L37
51853D42988r2k00o25j498k331k976l982n652p318q002p565o740o211o022n916
51838C77858n772n558n072m080k662j236j97L74O52Q47J134J674K395K833K441
51823C65631J224r2q14r91j137j401j485j332j387j881k362k183j274q1R53J553
51807C52941J519R61M81O49J268J638J518J388J631K023K202K170J979J381K34
51792C73983r37j422j244j153j614k225k338j902j440j364j538j548j197o92l76
$$ plain form
51777 352993 352671 352413 352511 353265 354837 357417 361290 366490 372481 378435 383901 389058 394285 399646 404876
51762 404876 409583 413273 415325 415349 413684 411334 409211 407485 405685 403253 399856 395333 389730 383530 377599
51747 377599 372615 368517 364613 360326 355788 351744 348944 347609 347425 347957 349049 350827 353385 356629 360495
51732 360495 365146 370721 376905 382964 388301 392791 396524 399499 401829 404015 406619 409700 412971 416476
51718 416476 420568 424929 428105 428615 426449 422969 419414 416026 412690 409727 407564 405944 404059 401427
51704 401427 398242 394897 391611 388569 386029 383974 381959 379590 377014 374602 372255 369443 366010 362543
51690 362543 359700 357476 355487 353777 352807 352563 352215 351039 349388 348225 347813 347369 346190 344663 343874 344413
51674 344413 345909 347660 349402 351402 354056 357566 361940 367148 373215 380257 388545 398556 410776 425149
$$ packed form
51777C52993l22k58R8P54J572K580L873N200N991N954N466N157N227N361N230
51762D04876M707L690K052K4j665k350k123j726j800k432l397m523n603o200n931
51747C77599m984m098l904m287m538m044k800j335j84N32J092J778K558L244L866
51732C60495M651N575O184O059N337M490L733K975K330K186K604L081L271L505
51718D16476M092M361L176N10k166l480l555l388l336k963k163j620j885k632
51704D01427l185l345l286l042k540k055k015k369k576k412k347k812l433l467
51690C62543k843k224j989j710r70k44l48j176j651j163m12m44j179j527p89N39
51674C44413J496J751J742K000K654L510M374N208O067P042Q288J0011J2220J4373
$$ plain form
51660 425149 440642 455472 467883 476738 481587 482502 479986 474844 467950 460152 452334 445265 439214 433982
51646 433982 429470 425906 423215 420422 416188 409943 402181 393711 385043 376518 368569 361473 355093 349101
51632 349101 343351 337934 333048 328961 325928 323884 322305 320588 318620 316858 315864 315784 316276 316840 317193 317296
51616 317296 317059 316172 314440 312223 310279 309054 308322 307631 306908 306432 306349 306451 306486 306491 306788 307721 309408 311700
51598 311700 314320 317085 320057 323539 327977 333762 340918 348880 356655 363331 368467 372003 373933 374181
51584 374181 372778 370063 366678 363385 360829 359350 358911 359217 360017 361439 364053 368447 374645 382060 390077
51569 390077 398598 407833 417693 427624 437026 445640 453579 461204 469028 477532 486998 497554 509342 522453
51555 522453 536726 551825 567429 583112 598073 611313 622135 630144 634796 635402 631781 624440 613849
$$ packed form
51660D25149J5493J4830J2411Q855M849R15k516n142o894p798p818p069o051n232
51646D33982m512l564k691k793m234o245p762q470q668q525p949p096o380n992
51632C49101n750n417m886m087l033k044j579j717j968j762r94q0M92N64L53J03
51616C17296k37q87j732k217j944j225p32o91p23m76q3J02L5NK97R33J687K292
51598C11700K620K765K972L482M438N785P156P962P775O676N136L536J930K48
51584C74181j403k715l385l293k556j479m39L06Q00J422K614M394O198P415Q017
51569C90077Q521R235R860R931R402Q614P939P625P824Q504R466J0556J1788J3111
51555E22453J4273J5099J5604J5683J4961J3240J0822Q009M652O06l621p341j0591
$$ plain form
51542 613849 600019 583215 564602 545493 526163 506132 485693 466441 449994 436628 425515
51531 425515 415848 407279 399545 392333 385679 380078 375893 372797 369975 366819 363297 359761 356636 354288
51517 354288 352857 352069 351406 350658 350188 350428 351217 351929 352193 352185 352198 352246 352230 352185 352208 352291 352362 352360 352261 352309 353193 355528
51495 355528 358901 361840 363122 362878 362055 361156 360005 358550 357215 356334 355735 355027 354014 352687 351113 349434
51479 349434 347730 345795 343313 340386 337633 335630 334396 333519 332609 331510 330244 328868 327333 325476 323283
51464 323283 321063 319151 317485 315822 314402 313982 315013 317080 319412 321729 324276 327232 330490 334030
51450 334030 338126 343005 348416 353699 358296 362188 365864 369886 374411 379042 383075 385914 387409 387981
51436 387981 388362 389030 389783 389888 388721 386280 383132 379903 376768 373384 369326 364611 359724 355136 350976
$$ packed form
51542F13849j3830j6804j8613j9109j9330k0031k0439j9252j6447j3366j1113
51531D25515r667q569p734p212o654n601m185l096k822l156l522l536l125k348
51517C54288j431p88o63p48m70K40P89P12K64qJ3M8j6m5K3Q3P1kr9M8Q84K335
51495C55528L373K939J282k44q23q99j151j455j335q81n99p08j013j327j574j679
51479C49434j704j935k482k927k753k003j234q77r10j099j266j376j535j857k193
51464C23283k220j912j666j663j420m20J031K067K332K317K547K956L258L540
51450C34030M096M879N411N283M597L892L676M022M525M631M033K839J495N72
51436C87981L81O68P53J05j167k441l148l229l135l384m058m715m887m588m160
$$ plain form
51421 350976 347243 344013 341216 338434 335370 332409 330344 329508 329547 330067 331113 332832 335041 337409 339807
51406 339807 342273 344768 347178 349408 351350 352905 354230 355768 357811 360086 362003 363297 364357 365930
51392 365930 368510 371947 375652 379274 383093 387598 392795 398274 403922 410192 417633 426590 437559 451235
51378 451235 467758 486168 505137 524180 543745 564177 584947 604907 622963 638302 650095
51367 650095 657162 658189 652618 641407 626582 609800 591484 571456 549944 527663 505378 483984
51355 483984 464696 448366 434572 422031 410076 399156 389708 381240 372961 364884 357673 351601 346181
51342 346181 340852 335600 330778 326564 322799 319243 315870 312905 310585 308874 307465 306059 304644 303431
51328 303431 302626 302305 302460 303027 303834 304646 305371 306227 307555 309328 310928 311611 311254 310514 310192 310574 311503 312819
$$ packed form
51421C50976l733l230k797k782l064k961k065q36L9N20J046J719K209K368K398
51406C39807K466K495K410K230J942J555J325J538K043K275J917J294J060J573
51392C65930K580L437L705L622L819M505N197N479N648O270P441Q957J0969J3676
51378D51235J6523J8410J8969J9043J9565K0432K0770J9960J8056J5339J1793
51367F50095P067J027n571j1211j4825j6782j8316k0028k1512k2281k2285k1394
51355D83984j9288j6330j3794j2541j1955j0920r448q468q279q077p211o072n420
51342C46181n329n252m822m214l765l556l373k965k320j711j409j406j415j213
51328C03431q05l21J55N67Q07Q12P25Q56J328J773J600O83l57p40l22L82R29J316
$$ plain form
51310 312819 314510 316529 318754 321095 323455 325575 327154 328144 328742 329033 328838 328019 326825 325810 325436 325710
51294 325710 326155 326172 325573 324748 324164 323734 322883 321349 319751 319175 320165 322201 324185 325449 326222 327130 328427
51277 328427 329932 331600 333759 336637 339960 343199 345971 348042 349257 349776 350107 350587 351112 351693 352882
51262 352882 355003 357296 358631 359001 359482 360570 361407 361003 359553 358079 357333 357489 358336 359181 358992 357238
51246 357238 354399 351202 347737 343847 339991 336906 334580 332336 329946 327956 326801 326257 325965 325893 325997
51231 325997 326028 326071 326792 328606 330855 332336 332583 332276 332481 333774 336039 338713 341137 342922 344158 345226
51215 345226 346417 347814 349497 351612 354126 356647 358664 359996 360924 361842 362835 363654 364127 364491 365264 366780
51199 366780 368909 371232 373388 375239 376807 378163 379369 380347 380789 380334 379038 377530 376376 375256 373118
$$ packed form
51310C12819J691K019K225K341K360K120J579R90N98K91j95q19j194j015l74K74
51294C25710M45J7n99q25n84m30q51j534j598n76R90K036J984J264P73R08J297
51277C28427J505J668K159K878L323L239K772K071J215N19L31M80N25N81J189
51262C52882K121K293J335L70M81J088Q37m04j450j474p46J56Q47Q45j89j754
51246C57238k839l197l465l890l856l085k326k244k390j990j155n44k92p2J04
51231C25997L1M3P21J814K249J481K47l07K05J293K265K674K424J785J236J068
51215C45226J191J397J683K115K514K521K017J332R28R18R93Q19M73L64P73J516
51199C66780K129K323K156J851J568J356J206R78M42m55j296j508j154j120k138
$$ plain form
51184 373118 369434 365035 361314 358742 356599 354134 351407 348864 346673 344887 343834 343761 344262 344553 344356
51169 344356 344090 344212 344736 345492 346508 347963 349940 352367 355059 357749 360176 362221 363930 365536 367473
51154 367473 370143 373415 376536 378807 380230 381153 381469 380707 378872 376684 374818 373332 372013 370835 369841
51139 369841 368930 368078 367472 367192 366987 366649 366314 366188 366253 366545 367393 368992 370940 372625 373936 375235 376775
51122 376775 378599 380877 383772 386917 389513 391117 391972 392453 392570 392305 392076 392468 393604 395053 396342 397340
51106 397340 398176 398967 399696 400335 401042 402176 403989 406272 408473 410232 411709 413248 414876 416303 417420
51091 417420 418562 420129 421979 423405 423818 423383 422726 422076 421006 419245 417388 416392 416582 417579 419167 421513
51075 421513 424385 426830 428201 429116 430811 433775 437571 441803 446477 451392 456009 460327 465259 471593
$$ packed form
51184C73118l684m399l721k572k143k465k727k543k191j786j053p3N01K91j97
51169C44356k66J22N24P56J016J455J977K427K692K690K427K045J709J606J937
51154C67473K670L272L121K271J423R23L16p62j835k188j866j486j319j178r94
51139C69841r11q52o06k80k05l38l35j26O5K92Q48J599J948J685J311J299J540
51122C76775J824K278K895L145K596J604Q55M81J17k65k29L92J136J449J289R98
51106C97340Q36P91P29O39P07J134J813K283K201J759J477J539J628J427J117
51091D17420J142J567J850J426M13m35o57o50j070j761j857r96J90R97J588K346
51075D21513K872K445J371R15J695K964L796M232M674M915M617M318M932O334
$$ plain form
51061 471593 479002 486620 494272 502496 511579 521288 531439 541930 551974 559988 564754 566366 565798 563959
51047 563959 561509 559131 557397 556485 556379 557177 558819 560707 562079 562597 562198 560584 557486 553391 549351
51032 549351 545994 543211 540893 539261 538232 537115 535362 533082 530487 527433 524150 521871 521831 523829 526551
51017 526551 529270 532400 536314 540468 544203 547771 551950 556841 561569 565136 567213 568113 568241 567706 566438
51002 566438 564603 562811 561684 561247 560951 560423 559991 560365 561995 564880 568810 573542 578842 584673 591356
50987 591356 599390 609018 620062 632229 645585 660641 677930 697379 718132 739154 760079 781332
50975 781332 803351 825870 848237 870326 892865 916833 942823 971235 1002841 1038725 1079515
50964 1079515 1124958 1174551 1228368 1286804 1349472 1414885 1481583 1549215 1618011 1687364 1755483
$$ packed form
51061D71593P409P618P652Q224R083R709J0151J0491J0044Q014M766J612n68j839
51047E63959k450k378j734r12j06P98J642J888J372N18l99j614l098m095m040
51032E49351l357k783k318j632j029j117j753k280k595l054l283k279m0J998K722
51017E26551K719L130L914M154L735L568M179M891M728L567K077R00J28n35j268
51002E66438j835j792j127m37k96n28m32L74J630K885L930M732N300N831O683
50987E91356Q034R628J1044J2167J3356J5056J7289J9449K0753K1022K0925K1253
50975G81332K2019K2519K2367K2089K2539K3968K5990K8412L1606L5884M0790
50964A079515M5443M9593N3817N8436O2668O5413O6698O7632O8796O9353O8119
$$ plain form
50953 1755483 1820493 1881324 1937368 1987815 2031787 2068838 2098940 2122140 2138597 2148807 2153420
50942 2153420 2152927 2147894 2139386 2128713 2116657 2103339 2088889 2073747 2058037 2041051 2021806 2000055
50930 2000055 1976401 1951554 1925751 1898838 1870487 1840126 1806901 1770010 1729132 1684540 1636825
50919 1636825 1586584 1534316 1480623 1426537 1373521 1322886 1275085 1229693 1186248 1145070 1107116
50908 1107116 1073062 1042650 1014965 989240 965309 943355 923472 905579 889637 875679 863498
50897 863498 852568 842554 833816 827034 822205 818341 814448 810618 807831 806721 806869 807354 807740 808403 810036
50882 810036 813001 817081 821803 826969 832827 839639 847232 855262 863879 873779 885467 898705 912886
50869 912886 927709 943319 959974 977848 997112 1017926 1040313 1064128 1089291 1116162 1145789
$$ packed form
50953A755483O5010O0831N6044N0447M3972L7051L0102K3200J6457J0210M613
50942B153420m93n033q508j0673j2056j3318j4450j5142j5710j6986j9245k1751
50930B000055k3654k4847k5803k6913k8351l0361l3225l6891m0878m4592m7715
50919A636825n0241n2268n3693n4086n3016n0635m7801m5392m3445m1178l7954
50908A107116l4054l0412k7685k5725k3931k1954j9883j7893j5942j3958j2181
50897H63498j0930j0014q738o782m829l864l893l830k787j110J48M85L86O63J633
50882H10036K965M080M722N166N858O812P593Q030Q617R900J1688J3238J4181
50869I12886J4823J5610J6655J7874J9264K0814K2387K3815K5163K6871K9627
$$ plain form
50858 1145789 1179614 1218620 1262750 1311538 1365392 1425869 1494455 1571431 1656249 1748690 1849245
50847 1849245 1958589 2077054 2204393 2339593 2481037 2627304 2777697 2931578 3087325
50838 3087325 3242429 3394408 3540938 3678970 3804563 3914084 4005275 4076987 4128407 4159064
50828 4159064 4169421 4161076 4136389 4098095 4049133 3992675 3932197 3871224 3812553 3757690 3707377
50817 3707377 3662520 3623935 3590990 3561067 3530683 3496750 3456599 3407676 3348098 3277311 3195669
50806 3195669 3103627 3001806 2891512 2774424 2651926 2525459 2397472 2271235 2149382 2033165
50796 2033165 1923306 1820984 1727596 1643900 1569839 1504976 1448713 1400242 1358658 1323235 1293428
50785 1293428 1268623 1248077 1231207 1217774 1207610 1200129 1194300 1189219 1184587 1180423 1176469 1172269 1167828
$$ packed form
50858A145789L3825L9006M4130M8788N3854O0477O8586P6976Q4818R2441J00555
50847A849245J09344J18465J27339J35200J41444J46267J50393J53881J55747
50838C087325J55104J51979J46530J38032J25593J09521R1191P1712N1420L0657
50828D159064J0357q345k4687l8294m8962n6458o0478o0973n8671n4863n0313
50817C707377m4857l8585l2945k9923l0384l3933m0151m8923n9578p0787q1642
50806C195669r2042j01821j10294j17088j22498j26467j27987j26237j21853j16217
50796B033165j09859j02322r3388q3696p4061o4863n6263m8471m1584l5423k9807
50785A293428k4805k0546j6870j3433j0164p481n829n081m632m164l954m200m441
$$ plain form
50772 1167828 1163669 1159971 1156047 1151074 1144982 1138170 1130578 1121594 1110909 1099023 1086887 1075364 1064942
50759 1064942 1055582 1046781 1038218 1030367 1024148 1019990 1017654 1017008 1018448 1022372 1028683 1037160 1047980 1061472
50745 1061472 1077509 1095485 1114978 1136322 1160476 1188323 1219990 1254986 1293170 1335477 1383406
50734 1383406 1437778 1498196 1563639 1633266 1706679 1783802 1864505 1948004 2032614 2116521 2198864
50723 2198864 2279648 2358569 2434430 2505826 2571729 2631017 2681961 2722677 2751804 2768445 2771884
50712 2771884 2761901 2739196 2705168 2661566 2610776 2556064 2500877 2447902 2399034 2355865 2319524
50701 2319524 2290110 2266863 2248916 2235352 2224558 2214111 2201566 2185050 2163133 2134606 2098620
50690 2098620 2054720 2002611 1942351 1875051 1803046 1729055 1655239 1583190 1514479 1450759 1393312
$$ packed form
50772A167828m159l698l924m973o092o812p592q984j0685j1886j2136j1523j0422
50759A064942r360q801q563p851o219m158k336o46J440L924O311Q477J0820J3492
50745A061472J6037J7976J9493K1344K4154K7847L1667L4996L8184M2307M7929
50734A383406N4372O0418O5443O9627P3413P7123Q0703Q3499Q4610Q3907Q2343
50723B198864Q0784P8921P5861P1396O5903N9288N0944M0716K9127J6641L439
50712B771884r983k2705l4028m3602n0790n4712n5187n2975m8868m3169l6341
50701B319524k9414k3247j7947j3564j0794j0447j2545j6516k1917k8527l5986
50690B098620m3900n2109o0260o7300p2005p3991p3816p2049o8711o3720n7447
$$ plain form
50679 1393312 1342684 1298769 1261112 1229168 1202497 1180949 1164746 1154249 1149366 1149154 1152249 1157867
50667 1157867 1166134 1177252 1190701 1205650 1221759 1238920 1256315 1272660 1287664 1302598 1318990
50656 1318990 1337171 1356490 1376457 1397067 1418296 1439964 1462081 1484806 1508083 1531732 1556019
50645 1556019 1581693 1609387 1639303 1671603 1706694 1744880 1785941 1829317 1874612 1921744 1970683
50634 1970683 2021087 2072063 2122171 2169840 2214005 2254330 2290907 2323925 2353707 2380682 2405013
50623 2405013 2426365 2444280 2458653 2469466 2476133 2477524 2472870 2462635 2448565 2433164 2418970 2407848
50611 2407848 2400531 2396998 2397235 2401301 2408397 2416394 2422860 2426489 2427043 2423999 2415746 2400212 2375774 2341442
50597 2341442 2296743 2241994 2178529 2108217 2032770 1953637 1872442 1791241 1712253 1637259 1567033
$$ packed form
50679A393312n0628m3915l7657l1944k6671k1548j6203j0497m883k12L095N618
50667A157867Q267J1118J3449J4949J6109J7161J7395J6345J5004J4934J6392
50656A318990J8181J9319J9967K0610K1229K1668K2117K2725K3277K3649K4287
50645A556019K5674K7694K9916L2300L5091L8186M1061M3376M5295M7132M8939
50634A970683N0404N0976N0108M7669M4165M0325L6577L3018K9782K6975K4331
50623B405013K1352J7915J4373J0813O667J391m654j0235j4070j5401j4194j1122
50611B407848p317l533K37M066P096P997O466L629N54l044q253j5534k4438l4332
50597B341442m4699n4749o3465p0312p5447p9133q1195q1201p8988p4994p0226
$$ plain form
50586 1567033 1501231 1439162 1381000 1328049 1281588 1241549 1206637 1175553 1147758 1123227 1102067
50575 1102067 1084531 1070943 1061285 1055027 1051578 1050809 1052991 1058369 1066836 1077858 1090599 1104329 1118907
50562 1118907 1134766 1152286 1171280 1191151 1211423 1231983 1252874 1274098 1295680 1317895 1341315
50551 1341315 1366499 1393407 1421202 1448821 1475829 1502575 1529486 1556524 1583419 1610183 1637121
50540 1637121 1664591 1693164 1723977 1758601 1798362 1843926 1895526 1953343 2017421 2087318 2162094
50529 2162094 2240827 2323081 2408736 2497437 2588601 2682212 2779331 2881218 2987755 3097050 3206720
50518 3206720 3315143 3421125 3522835 3617727 3703443 3778197 3840231 3887587 3918787 3933410 3931644
50507 3931644 3913569 3879339 3830009 3767831 3695672 3616269 3532047 3445431 3359305 3277232 3203070
$$ packed form
50586A567033o5802o2069n8162n2951m6461m0039l4912l1084k7795k4531k1160
50575A102067j7536j3588r658o258l449p69K182N378Q467J1022J2741J3730J4578
50562A118907J5859J7520J8994J9871K0272K0560K0891K1224K1582K2215K3420
50551A341315K5184K6908K7795K7619K7008K6746K6911K7038K6895K6764K6938
50540A637121K7470K8573L0813L4624L9761M5564N1600N7817O4078O9897P4776
50529B162094P8733Q2254Q5655Q8701R1164R3611R7119J01887J06537J09295J09670
50518C206720J08423J05982J01710R4892Q5716P4754O2034M7356L1200J4623j766
50507C931644j8075l4230m9330o2178p2159p9403q4222q6616q6126q2073p4162
$$ plain form
50496 3203070 3139976 3089588 3052202 3027669 3015857 3016168 3026958 3045743 3069883 3096760 3123289 3145635
50484 3145635 3159692 3161773 3148760 3117986 3067568 2997220 2908629 2804919 2689785 2567064 2440575
50473 2440575 2313759 2189289 2069196 1955411 1849852 1753875 1667809 1591213 1523398 1463609
50463 1463609 1411045 1365124 1325761 1293089 1266862 1246366 1230934 1220265 1214153 1212195 1214042 1219737
50451 1219737 1229426 1242752 1258796 1276722 1296228 1317245 1339516 1362828 1387653 1415152 1446289
50440 1446289 1480941 1517875 1555349 1591516 1624455 1652253 1673327 1686733 1692270 1690617 1683411 1672865
50428 1672865 1660969 1648981 1637623 1627493 1619084 1612646 1608367 1606659 1608047 1612784 1620753 1631733 1645601
50415 1645601 1662408 1682498 1706484 1734830 1767469 1804102 1844732 1889525 1938150 1989702 2043332
$$ packed form
50496C203070o3094n0388l7386k4533j1812L11J0790J8785K4140K6877K6529K2346
50484C145635J4057K081j3013l0774n0418p0348q8591j03710j15134j22721j26489
50473B440575j26816j24470j20093j13785j05559r5977q6066p6596o7815n9789
50463A463609n2564m5921l9363l2672k6227k0496j5432j0669o112j958J847N695
50451A219737R689J3326J6044J7926J9506K1017K2271K3312K4825K7499L1137
50440A446289L4652L6934L7474L6167L2939K7798K1074J3406N537j653p206j0546
50428A672865j1896j1988j1358j0130q409o438m279j708J388M737P969J0980J3868
50415A645601J6807K0090K3986K8346L2639L6633M0630M4793M8625N1552N3630
$$ plain form
50404 2043332 2098453 2154135 2208843 2261103 2310079 2355107 2395045 2428565 2454861 2473620 2484404
50393 2484404 2486431 2478887 2461167 2433061 2395079 2348386 2293977 2232188 2163703 2090965 2017854 1947767
50381 1947767 1882568 1823403 1771721 1728917 1695446 1670894 1654746 1646719 1646390 1652808 1664446 1679391
50369 1679391 1695692 1711571 1725211 1734487 1737400 1732969 1721327 1702833 1677528 1645737 1608652 1567783
50357 1567783 1524009 1477583 1428861 1378565 1327495 1276438 1226362 1178341 1133283 1091928 1054876
50346 1054876 1022324 993973 969545 949222 933096 920440 910158 901916 896220 893252 892256 892383 893575
50333 893575 896206 900205 905014 910187 915599 921196 926968 933193 940349 948634 957770 967428 977692 988976
50319 988976 1001512 1015085 1029229 1043641 1058361 1073620 1089566 1106069 1122755 1139289 1155664
$$ packed form
50404B043332N5121N5682N4708N2260M8976M5028L9938L3520K6296J8759J0784
50393B484404K027p544j7720k8106l7982m6693n4409o1789o8485p2738p3111p0087
50381A947767o5199n9165n1682m2804l3471k4552j6148q027l29O418J1638J4945
50369A679391J6301J5879J3640R276K913m431j1642j8494k5305l1791l7085m0869
50357A567783m3774m6426m8722n0296n1070n1057n0076m8021m5058m1355l7052
50346A054876l2552k8351k4428k0323j6126j2656j0282q242n696k968r96J27J192
50333H93575K631L999M809N173N412N597N772O225P156Q285R136R658J0264J1284
50319I88976J2536J3573J4144J4412J4720J5259J5946J6503J6686J6534J6375
$$ plain form
50308 1155664 1172120 1188717 1205277 1222014 1240043 1260791 1284950 1312582 1344358 1381872 1426134
50297 1426134 1476084 1529161 1582877 1634957 1681852 1718014 1737278 1735207 1710750 1666717 1609138
50286 1609138 1545403 1481856 1422405 1368882 1322123 1282446 1249530 1222546 1200743 1183940 1172454
50275 1172454 1166510 1165724 1169251 1176534 1187757 1203352 1223158 1246334 1271939 1299265 1327619 1356218
50263 1356218 1384408 1411639 1437103 1459778 1479047 1495071 1508397 1519425 1528408 1535636 1541316 1545243
50251 1545243 1546698 1544592 1537765 1525469 1507701 1484960 1457751 1426726 1393320 1359796 1328319 1300078
50239 1300078 1275315 1253743 1234627 1216806 1199111 1180851 1161839 1142185 1122176 1102238 1082812
50228 1082812 1064379 1047575 1032953 1020474 1009482 999284 989519 979904 970090 960002 949904 939841
$$ packed form
50308A155664J6456J6597J6560J6737J8029K0748K4159K7632L1776L7514M4262
50297A426134M9950N3077N3716N2080M6895L6162J9264k071k4457m4033n7579
50286A609138o3735o3547n9451n3523m6759l9677l2916k6984k1803j6803j1486
50275A172454n944p86L527P283J1223J5595J9806K3176K5605K7326K8354K8599
50263A356218K8190K7231K5464K2675J9269J6024J3326J1028Q983P228N680L927
50251A545243J455k106o827j2296j7768k2741k7209l1025l3406l3524l1477k8241
50239A300078k4763k1572j9116j7821j7695j8260j9012j9654k0009j9938j9426
50228A082812j8433j6804j4622j2479j0992j0198r765r615r814j0088j0098j0063
$$ plain form
50216 939841 929399 918346 907109 896203 885546 874922 864874 856529 850521 846508 843680 841334
50204 841334 839044 836733 834702 833221 832071 830716 828914 826771 824220 820766 815968 809999 803652 797865
50190 797865 793212 789710 787118 785327 784237 783285 781609 778973 776141 773930 772214 770351 768212 766200
50176 766200 764421 762513 760272 757881 755552 753503 752266 752362 753581 755181 756982 759710 764075 770105 777673
50161 777673 787132 799033 813578 830691 850362 872728 898151 927386 961204 999600 1041830 1087549
50149 1087549 1137367 1191761 1249780 1309265 1368032 1424389 1476953 1524797 1567822 1606436 1640829
50138 1640829 1670912 1696760 1718404 1735009 1744790 1746034 1737919 1720291 1693208 1657103 1613179 1563203
50126 1563203 1508899 1451689 1392867 1333827 1276144 1221558 1171674 1127374 1088477 1054236 1024237
$$ packed form
50216I39841j0442j1053j1237j0906j0657j0624j0048q345o008m013k828k346
50204H41334k290k311k031j481j150j355j802k143k551l454m798n969o347n787
50190G97865m653l502k592j791j090r52j676k636k832k211j716j863k139k012
50176G66200j779j908k241k391k329k049j237R6J219J600J801K728M365O030P568
50161G77673R459J1901J4545J7113J9671K2366K5423K9235L3818L8396M2230M5719
50149A087549M9818N4394N8019N9485N8767N6357N2564M7844M3025L8614L4393
50138A640829L0083K5848K1644J6605R781J244q115j7628k7083l6105m3924m9976
50126A563203n4304n7210n8822n9040n7683n4586m9884m4300l8897l4241k9999
$$ plain form
50115 1024237 998628 977396 959758 944594 931372 920306 911611 905034 900324 897752 897685 899746 902754
50102 902754 905547 907618 909030 910019 910713 910849 909607 906033 899864 891787 882885 874044 866021 859624 855442
50087 855442 853398 852790 852795 852964 853429 854701 857093 860282 863581 866688 869892 873479 877358 881434 885995 891333
50071 891333 897224 903184 909076 915129 921415 927641 933403 938388 942361 945174 946818 947397 947123 946377 945493
50056 945493 944313 942266 939224 935948 933376 931720 930639 930008 929969 930504 931652 934087 938734 945680 954087
50041 954087 963378 973993 986764 1002108 1020144 1041003 1064633 1090737 1119367 1151178 1186592 1224957
50029 1224957 1264966 1305675 1346636 1387271 1426635 1463711 1497402 1526390 1549622 1567174 1580223
50018 1580223 1589921 1596567 1599862 1599503 1595130 1585854 1570176 1546508 1513909 1472667 1424472 1371905 1317507
$$ packed form
50115A024237k5609k1232j7638j5164j3222j1066q695o577m710k572o7K061L008
50102I02754K793K071J412R89O94J36j242l574o169q077q902q841q023o397m182
50087H55442k044o08NJ69M65J272K392L189L299L107L204L587L879M076M561N338
50071H91333N891N960N892O053O286O226N762M985L973K813J644N79k74p46q84
50056I45493j180k047l042l276k572j656j081o31l9N35J148K435M647O946Q407
50041I54087R291J0615J2771J5344J8036K0859K3630K6104K8630L1811L5414L8365
50029A224957M0009M0709M0961M0635L9364L7076L3691K8988K3232J7552J3049
50018A580223R698O646L295l59m373r276j5678k3668l2599m1242m8195n2567n4398
$$ plain form
50005 1317507 1263086 1209712 1158142 1109194 1063813 1022894 987054 956546 931339 911130 895201
49994 895201 882509 872212 864086 858207 854254 851421 848994 846642 844023 840447 835237 828194 819492 809256
49980 809256 797533 784558 770821 756902 743438 731077 720102 710134 700590 691511 683634 677453
49968 677453 672548 668108 663937 660497 657972 655671 652624 648577 644184 640313 637453 635751 635245 635789 636913
49953 636913 638132 639446 641309 644037 647419 650992 654453 657661 660452 662736 664693 666596 668379 669594
49939 669594 669817 669027 667609 666144 665095 664438 663568 661842 659294 656596 654196 651767 648650 644596 639833
49924 639833 634613 629146 623942 619818 617303 616145 615541 614820 613863 613044 612888 613695 615336 617372 619434 621487
49908 621487 623753 626483 629917 634325 639855 646182 652482 657915 662171 665501 668330 670959 673543 676035
$$ packed form
50005A317507n4421n3374n1570m8948m5381m0919l5840l0508k5207k0209j5929
49994H95201j2692j0297q126n879l953k833k427k352k619l576n210p043q702j0236
49980H09256j1723j2975j3737j3919j3464j2361j0975r968r544r079p877o181
49968F77453m905m440m171l440k525k301l047m047m393l871k860j702n06N44J124
49953F36913J219J314J863K728L382L573L461L208K791K284J957J903J783J215
49939F69594K23p90j418j465j049o57q70j726k548k698k400k429l117m054m763
49924F39833n220n467n204m124k515j158o04p21r57q19j56Q07J641K036K062K053
49908F21487K266K730L434M408N530O327O300N433M256L330K829K629K584K492
$$ plain form
49894 676035 678101 679383 679989 680464 681040 681159 680081 677816 674979 671751 667581 662173 656302 651165 647108
49879 647108 643529 639991 636899 634850 633641 632320 630141 627218 624235 621768 620075 619289 619459 620326 621349
49864 621349 622214 623191 624834 627427 630957 635437 640924 647247 654131 661640 670067 679179 687976 695532 701851
49849 701851 707533 712792 717208 720402 722561 724201 725597 726566 726738 726009 724662 722885 720213 715836 709789
$$ packed form
49894F76035K066J282O06M75N76J19j078k265k837l228m170n408n871n137m057
49879F47108l579l538l092k049j209j321k179k923k983k467j693p86J70Q67J023
49864F21349Q65R77J643K593L530M480N487O323O884P509Q427R112Q797P556O319
49849G01851N682N259M416L194K159J640J396R69J72p29j347j777k672m377o047
$$ [...]
##END NTUPLES=NMR SPECTRUM
##END=
