##TITLE=AC1700_ROEFFECT0027_8638217_qd6DWnF9ei
##JCAMPDX= 6.0         $$ Bruker NMR JCAMP-DX V2.0
##DATA TYPE= NMR SPECTRUM
##DATA CLASS= NTUPLES
##ORIGIN= BRUKER
##OWNER= Administrator
$$ 1.72 TOPSPIN		Version 2.1
$$ 2014-05-23 00:48:58.004 -0700  Administrator@X
$$ Compression mode = diff/dup
##.OBSERVE FREQUENCY= 400.02188249412
##.OBSERVE NUCLEUS= ^1H
##.ACQUISITION MODE= SIMULTANEOUS (DQD)
##.ACQUISITION SCHEME= undefined
##.AVERAGES= 8
##.DIGITISER RES= 22
##SPECTROMETER/DATA SYSTEM= spect
##.PULSE SEQUENCE= zg30
##.SOLVENT NAME= COFFEE_meoh
##.SHIFT REFERENCE= INTERNAL, COFFEE_meoh, 1, 14.98509
##AUDIT TRAIL= $$ (NUMBER, WHEN, WHO, WHERE, PROCESS, VERSION, WHAT)
$$ ##TITLE= Audit trail, TOPSPIN		Version 2.1
$$ ##JCAMPDX= 5.01
$$ ##ORIGIN= Bruker BioSpin GmbH
$$ ##OWNER= Administrator
$$ $$ E:\/data/COFFEE/nmr/AC1700_ROEFFECT0027_8638217_qd6DWnF9ei/10/pdata/1/auditp.txt
$$ ##AUDIT TRAIL=  $$ (NUMBER, WHEN, WHO, WHERE, PROCESS, VERSION, WHAT)
(   1,<2014-05-23 00:48:51.457 -0700>,<Administrator>,<X>,<go>,<TOPSPIN 2.1>,
      <created by zg
	started at 2014-05-23 00:47:45.504 -0700,
	POWCHK enabled, PULCHK disabled,
       configuration hash MD5:
       C8 4E 4E 5D D3 5C D8 9E 9F 52 82 E0 59 8A DE 15
       data hash MD5: 64K
       D6 4B D2 31 62 79 1F C8 BC B1 81 5C 12 A6 46 23>)
(   2,<2014-05-23 00:48:54.379 -0700>,<Administrator>,<X>,<proc1d>,<TOPSPIN 2.1>,
      <Start of raw data processing
       efp LB = 0 FT_mod = 6 PKNL = 1 PHC0 = 0 PHC1 = 0 SI = 32K 
       data hash MD5: 32K
       30 A3 76 48 08 DE 8D 4B 00 93 E1 5E A0 1D 62 60>)
(   3,<2014-05-23 00:48:54.691 -0700>,<Administrator>,<X>,<proc1d>,<TOPSPIN 2.1>,
      <pk PHC0 = 94.80652 PHC1 = 0 
       data hash MD5: 32K
       92 41 83 C1 84 59 CE 7A 91 91 29 05 24 F9 42 D8>)
(   4,<2014-05-23 00:48:54.816 -0700>,<Administrator>,<X>,<proc1d>,<TOPSPIN 2.1>,
      <abs ABSG = 1 
       data hash MD5: 32K
       77 17 AF 0F 58 6E 2D 31 67 62 F1 9D E7 AB 23 16>)
(   5,<2014-05-23 00:48:54.879 -0700>,<Administrator>,<X>,<proc1d>,<TOPSPIN 2.1>,
      <abs ABSG = 2 
       data hash MD5: 32K
       4B C0 0A 49 51 87 BD 67 1B 88 7D BE 35 23 E3 D5>)
(   6,<2014-05-23 00:48:54.941 -0700>,<Administrator>,<X>,<proc1d>,<TOPSPIN 2.1>,
      <abs ABSG = 3 
       data hash MD5: 32K
       F7 EB 09 44 DB 29 F5 B9 1B 10 27 9B 28 59 BE BD>)
(   7,<2014-05-23 00:48:55.004 -0700>,<Administrator>,<X>,<proc1d>,<TOPSPIN 2.1>,
      <abs ABSG = 4 
       data hash MD5: 32K
       2D A0 EF 4E 41 7F 23 16 D9 6E 30 B9 C0 11 14 90>)
(   8,<2014-05-23 00:48:55.051 -0700>,<Administrator>,<X>,<proc1d>,<TOPSPIN 2.1>,
      <abs ABSG = 5 
       data hash MD5: 32K
       BA 64 17 16 CD 02 E4 98 42 2F CC 35 CC 7A 2A 08>)
$$ ##END=
$$ 
$$ $$ hash MD5
$$ $$ 56 74 45 1A A0 93 B4 AC 5A 5B BA 5A C1 EE 85 89
##$RELAX= 
##$RELAX= 
##$RELAX= 
##$RELAX= 
##$RELAX= 
##$RELAX= 
##$RELAX= 
$$ Bruker specific parameters
$$ --------------------------
##$DU= <E:\>
##$EXPNO= 10
$$ [...]
150 150 150 150 150 150 150 150
##$TP07= 0
##$TPNAME0= <>
##$TPNAME1= <>
##$TPNAME2= <>
##$TPNAME3= <>
##$TPNAME4= <>
##$TPNAME5= <>
##$TPNAME6= <>
##$TPNAME7= <>
##$TPOAL= (0..7)
0.5 0.5 0.5 0.5 0.5 0.5 0.5 0.5
##$TPOFFS= (0..7)
0 0 0 0 0 0 0 0
##$TUNHIN= 0
##$TUNHOUT= 0
##$TUNXOUT= 0
##$USERA1= <user>
##$USERA2= <user>
##$USERA3= <user>
##$USERA4= <user>
##$USERA5= <user>
##$V9= 5
##$VALIST= <valist>
##$VCLIST= <CCCCCCCCCCCCCCC>
##$VD= 0
##$VDLIST= <DDDDDDDDDDDDDDD>
##$VPLIST= <PPPPPPPPPPPPPPP>
##$VTLIST= <TTTTTTTTTTTTTTT>
##$WBST= 2048
##$WBSW= 25
##$XGAIN= (0..3)
0 0 0 0
##$XL= 0
##$YL= 0
##$YMAX_a= 642094
##$YMIN_a= -543410
##$ZGOPTNS= <>
##$ZL1= 120
##$ZL2= 120
##$ZL3= 120
##$ZL4= 120
##$ABSF1= 14.98509
##$ABSF2= -5.573092
##$ABSG= 5
##$ABSL= 3
##$ALPHA= 0
##$AQORDER= 0
##$ASSFAC= 0
##$ASSFACI= 0
##$ASSFACX= 0
##$ASSWID= 0
##$AUNMP= <proc_prof1d_extract_pilot.lims>
##$AXLEFT= 0
##$AXNAME= <>
##$AXNUC= <1H>
##$AXRIGHT= 0
##$AXTYPE= 0
##$AXUNIT= <>
##$AZFE= 0.1
##$AZFW= 0.1
##$BCFW= 0
##$BC_mod= 0
##$BYTORDP= 0
##$COROFFS= 0
##$CY= 15
##$DATMOD= 1
##$DC= 0
##$DFILT= <>
##$DTYPP= 0
##$F1P= 0
##$F2P= 0
##$FCOR= 0.5
##$FTSIZE= 32768
##$FT_mod= 6
##$GAMMA= 0
##$GB= 0
##$INTBC= 1
##$INTSCL= 1
##$ISEN= 128
##$LB= 0
##$LEV0= 0
##$LPBIN= 0
##$MAXI= 10000
##$MC2= 0
##$MEAN= 0
##$ME_mod= 0
##$MI= 0
##$NCOEF= 0
##$NC_proc= -8
##$NLEV= 6
##$NOISF1= 0
##$NOISF2= 0
##$NSP= 0
##$NTH_PI= 0
##$NZP= 0
##$OFFSET= 14.98509
##$PC= 1
##$PHC0= 94.80652
##$PHC1= 0
##$PH_mod= 1
##$PKNL= yes
##$PPARMOD= 0
##$PPDIAG= 0
##$PPIPTYP= 0
##$PPMPNUM= 2147483647
##$PPRESOL= 1
##$PSCAL= 4
##$PSIGN= 0
##$PYNMP= <proc.py>
##$REVERSE= no
##$SF= 400.02
##$SI= 32768
##$SIGF1= 0
##$SIGF2= 0
##$SINO= 400
##$SIOLD= 32768
##$SPECTYP= <>
##$SREGLST= <1H.CDCl3>
##$SSB= 0
##$STSI= 32768
##$STSR= 0
##$SW_p= 8223.68421052631
##$SYMM= 0
##$S_DEV= 0
##$TDeff= 65536
##$TDoff= 0
##$TI= <>
##$TILT= no
##$TM1= 0
##$TM2= 0
##$TOPLEV= 0
##$USERP1= <user>
##$USERP2= <user>
##$USERP3= <user>
##$USERP4= <user>
##$USERP5= <user>
##$WDW= 1
##$XDIM= 32768
##$YMAX_p= 463465603
##$YMIN_p= -780258
##$CURPLOT= <Network HP LaserJet P1505>
##$CURPRIN= <$Network HP LaserJet P1505>
##$DFORMAT= <normdp>
##$LAYOUT= <+/1D_H.xwp>
##$LFORMAT= <normlp>
##$PFORMAT= <normpl>
##$SURQMSG= 1
$$ End of Bruker specific parameters
$$ ---------------------------------
##NTUPLES= NMR SPECTRUM
##VAR_NAME=  FREQUENCY,     SPECTRUM/REAL,   SPECTRUM/IMAG
##SYMBOL=    X,             R,               I
##VAR_TYPE=  INDEPENDENT,   DEPENDENT,       DEPENDENT
##VAR_FORM=  AFFN,          ASDF,            ASDF
##VAR_DIM=   32768,         32768,           32768
##UNITS=     HZ,            ARBITRARY UNITS, ARBITRARY UNITS
##FACTOR=    0.250966925370066, 1,           1
##FIRST=     8223.43324360094, 162385,       -204485
##LAST=      0,             155152,          -40362
##MIN=       0,             -780258,         0
##MAX=       8223.43324360094, 463465603,    0
$$ Real data points
##PAGE= N=1
##DATA TABLE= (X++(R..R)), XYDATA
$$ [...]
19530h2685A41582o8701b41974l7611G8978R678c02041b3378B60961g8505j3293
$$ -82685 141582 72881 -241974 -279585 78978 88656 -302041 -23378 260961 -78505 -91798
19519i1798o0783o8730A4747g6143G5197h9069A7283M5926R0627i7019A3970A277
$$ -91798 -152581 -221311 14747 -76143 75197 -89069 17283 63209 153836 -97019 13970 1277
19506A03831d68918A53915b97992B1794a84471j2136N8627H6040N3166d3229B35053
$$ 103831 -468918 153915 -297992 21794 -184471 -196607 -137980 86040 139206 -43229 235053
19494G5361c91590h020j11062a4714C9349b09547B9546b78613q3811H3072b75453
$$ 75361 -391590 -8020 -119082 -14714 39349 -209547 29546 -278613 -362424 83072 -275453
19482a12473A49147a43043n7971A3130c86237A00370d8183C2410J2331a76272
$$ -112473 149147 -143043 -201014 13130 -386237 100370 -48183 32410 44741 -176272
19471a25512n0239A42161O028b71245A57061a8048j79795i318E6798K6109a7872
$$ -125512 -175751 142161 148189 -271245 157061 -18048 -197843 -9318 56798 82907 -17872
19459a15568A63664c8682j74980a03112l1897b1219B80933e2268j45322f4693
$$ -115568 163664 -38682 -213662 -103112 -135009 -21219 280933 -52268 -197590 -64693
19448A9299O2998b3052A21078B1190b44542c5785H2172K2925a53682k62857B6513
$$ 19299 82297 -23052 121078 21190 -244542 -35785 82172 105097 -153682 -416539 26513
19436A62896a41160A87871h8408j29015a05101k41420a13315K2494j6877j11492
$$ 162896 -141160 187871 -88408 -217423 -105101 -346521 -113315 -90821 -107698 -219190
19426b19190j24668a49184k32069D2974j2231i2069D023J03719f1596C4447O1974
$$ -219190 -343858 -149184 -381253 42974 30743 -92069 4023 107742 -61596 34447 96421
19415I6421M9945e3628p3019A51325g2327A96018K0416C2247q682b56813k6632
$$ 96421 146366 -53628 -126647 151325 -72327 196018 216434 32247 23565 -256813 -283445
19404b83445c2622k75667J27511o4410I3253b67003E1516J07680a42717p2247
$$ -283445 -32622 -308289 -180778 -245188 93253 -267003 51516 159196 -142717 -214964
19394b14964R7338A16567b45370b6316k23146H0775i2689k14708a22801k27822
$$ -214964 -117626 116567 -245370 -26316 -249462 80775 -92689 -307397 -122801 -350623
19384c50623g331j30796E9275J85798I5000b45268N1986r4880g1147j63694G7417
$$ -350623 -7331 -138127 59275 245073 95000 -245268 -193282 -288162 -71147 -234841 77417
19372b69048d9898r0576f7955E0235j2914b99405B53392a00989c2822B8576a474
$$ -269048 -49898 -140474 -67955 50235 37321 -299405 253392 -100989 -32822 28576 -1474
19360c03405h9958k56409J66084p6286j1039J05585P9384K8513j77838h0376a9565
$$ -303405 -89958 -346367 -180283 -256569 -267608 -162023 -82639 -54126 -231964 -80376 -19565
19348B6351P1724K2450b07890A19846P7298a59360B7222K4172f6746l8243B51369
$$ 26351 98075 120525 -207890 119846 197144 -159360 27222 51394 -66746 -104989 251369
19336A58275a07177C78883D1806a78853f5348A12074E1993b45307A56606J10797
$$ 158275 -107177 378883 41806 -178853 -65348 112074 51993 -245307 156606 267403
19326B67403m5401i2188l59272A5346a14064j25359A04315A1557d13209J74857
$$ 267403 222002 -92188 -451460 15346 -114064 -239423 104315 11557 -413209 -238352
19316b38352C1403l849J72565a965j76880A18453E1811e6422b7991B30617r1643
$$ -238352 31403 27554 200119 -1965 -178845 118453 51811 -56422 -27991 230617 138974
19305A38974b80711B23701l9751a42801k5429L4243N7201l84707E07299b60990
$$ 138974 -280711 223701 183950 -142801 -168230 -133987 -76786 -461493 507299 -260990
19294c22613f7589k46403A35127c1092p9342D001c1647A39377j6633b93212i5784
$$ -322613 -67589 -313992 135127 -31092 -110434 4001 -31647 139377 122744 -293212 -95784
19282a31088K7756E2666N3769b27270A04433k6322f3032A69543g5411k48314A81871
$$ -131088 -103332 52666 106435 -227270 104433 78111 -63032 169543 -75411 -323725 181871
19270A9032L090P022o206r298J1382K52735e2810I272b10383m1498n4326a12375
$$ 19032 22122 29144 22938 13640 25022 277757 -52810 9272 -210383 -251881 -306207 -112375
19257A27825c44121J22224a07742l913A18475A4180K41554F6772b47702D3923
$$ 127825 -344121 -221897 -107742 -111655 118475 14180 255734 66772 -247702 43923
19246c5377A48843a29289j12505c3870m2958j51480A62618R4421d3564j72370
$$ -35377 148843 -129289 -241794 -33870 -76828 -228308 162618 257039 -43564 -215934
19236b15934i5486i20E396a41483j27736N89E4644J73873d51979b5043r5242B25942
$$ -215934 -95486 -920 5396 -141483 -269219 -268630 54644 228517 -451979 -25043 -120285 225942
19223b69304f9604b2111l84755a13480A50555a52635j28448A1494b38756G056
$$ -269304 -69604 -22111 -406866 -113480 150555 -152635 -281083 11494 -238756 7056
19212B89933d1931A57131a15054m354k6935G4485K19668f6011k20024J37032M3131
$$ 289933 -41931 157131 -115054 -119408 -146343 74485 294153 -66011 -286035 -149003 -105872
19201a05872M0986m9917j37537e8840o1654j56763g8714N962j06090f4925j51735
$$ -105872 -64886 -114803 -252340 -58840 -120494 -277257 -78714 -72752 -178842 -64925 -216660
19190b16660K9905F7180A6544J39636a86229b0576k08925Q2135A58210D8399J86020
$$ -216660 -186755 67180 16544 156180 -186229 -20576 -229501 -147366 158210 48399 234419
19179B34419a6362q8279c7945B1473O316b07278A7058K18306a18944k6526B8012
$$ 234419 -16362 -104641 -37945 21473 27789 -207278 17058 235364 -118944 -145470 28012
19167e3049p6967q1473c3524A53129e2876C85498a02044A02600c68150A53288
$$ -53049 -130016 -211489 -33524 153129 -52876 385498 -102044 102600 -368150 153288
19156D4663a16778d0217l3460Q961k34463A58996a25272L067k07244A52489b63279
$$ 44663 -116778 -40217 -73677 -64716 -299179 158996 -125272 -122205 -329449 152489 -263279
19144g2853b9733k238k1078l10044B52477b88174a03902A91169O4213c32285J53382
$$ -72853 -29733 -31971 -53049 -363093 252477 -288174 -103902 191169 255382 -332285 -178903
19133a78903B81224g2477l27796a32579k8367a4967j89861M3742j34089h5588
$$ -178903 281224 -72477 -400273 -132579 -160946 -14967 -204828 -161086 -295175 -85588
19122b66699J00206n9940k5984d5515o4710A50338i3016j2390d1933H5607a16208
$$ -266699 -166493 -226433 -252417 -45515 -110225 150338 -93016 -105406 -41933 85607 -116208
19110B52918i379k20271B12009n1608c4126j99544i2096c0193A07379g6896K1793
$$ 252918 -9379 -229650 212009 160401 -34126 -233670 -92096 -30193 107379 -76896 -55103
19099e5103G8209j3072b1767A30296e7523k06368c9255E8696a00231A83595b71350
$$ -55103 78209 65137 -21767 130296 -57523 -263891 -39255 58696 -100231 183595 -271350
19087d6957j09447C9754c96741f3916j802A96483B9690a24356L7010c8411j26047
$$ -46957 -156404 39754 -396741 -63916 -65718 196483 29690 -124356 -87346 -38411 -164458
19076a64458q9096D33230G8417b29073J13494E1851c7360r1857B45684r2980p2244
$$ -164458 -253554 433230 78417 -229073 -115579 51851 -37360 -129217 245684 152704 80460
19065H0460J53087L0085c80640h0820B21372a02293N0654A05938b05319A13174
$$ 80460 233547 263632 -380640 -80820 221372 -102293 -51639 105938 -205319 113174
19054a63426f2621a3069H2744a30134A74210J6102K31076F8323J48934b10219
$$ -163426 -62621 -13069 82744 -130134 174210 190312 421388 68323 217257 -210219
19043c48336B14491D4090b68895J16165j91018F018c37725B70232b71290k64591
$$ -348336 214491 44090 -268895 -152730 -343748 6018 -337725 270232 -271290 -535881
19033e35881c9406I7738e6788G0717a07210A42825l5844a55907B81966b6906I9864
$$ -535881 -39406 97738 -56788 70717 -107210 142825 106981 -155907 281966 -26906 99864
19021b19811B0475a73860Q0598q9126B01031D5831a93841L5098j33869c4024F5462
$$ -219811 20475 -173860 -93262 -182388 201031 45831 -193841 -158743 -292612 -34024 65462
19009B06498d6114j89633B09216c8029k00530B78543p8129D7992a24649F8597
$$ 206498 -46114 -235747 209216 -38029 -238559 278543 200414 47992 -124649 68597
18998a63274C5683J494J06390c1577F1704J48931a52797g2526n4304e0753A17613
$$ -163274 35683 37177 143567 -31577 61704 210635 -152797 -72526 -126830 -50753 117613
18986d09529A4406K07136h202A48861a09087j85173b6476k81551a3927k59950
$$ -409529 14406 221542 -8202 148861 -109087 -294260 -26476 -308027 -13927 -273877
18976b73877j25655b5515B42592b51640O6061g8343E9481b86050J06241l3062
$$ -273877 -399532 -25515 242592 -251640 -185579 -78343 59481 -286050 -179809 -212871
18966b12871H069R5010b55782C99337C4099a85570a9073k36469f9514D0965a40828
$$ -212871 8069 103079 -255782 399337 34099 -185570 -19073 -255542 -69514 40965 -140828
18954B0761c84030g0709k37581H248J17600D0774a11110k23011A63520E5239J78328
$$ 20761 -384030 -70709 -308290 8248 125848 40774 -111110 -334121 163520 55239 233567
18943B33567i1746A00196R2168a27415m6805O0677c2150o7779a5107I4193K35835
$$ 233567 -91746 100196 192364 -127415 -174220 -113543 -32150 -99929 -15107 94193 330028
18932C30028j09865I6833f8368k9761j86405A5583K01613c95997a40431c1638
$$ 330028 220163 96833 -68368 -98129 -284534 15583 217196 -395997 -140431 -31638
18921A1675c0672E36d61877a59274E6074b57950B64433d7186k0641A88792a60392
$$ 11675 -30672 536 -461877 -159274 56074 -257950 264433 -47186 -67827 188792 -160392
18909A77266l8110e7327j43937O9091I5634O5325b9626j93458D2117a43908B13946
$$ 177266 139156 -57327 -201264 -132173 95634 160959 -29626 -223084 42117 -143908 213946
18897a47388f6958D4002J37257q811A5912a54303N4054K0293A6297J85264l8391
$$ -147388 -66958 44002 181259 172448 15912 -154303 -100249 -79956 16297 201561 163170
18886A63170i2268k09995d1373B6515J6911L42146F4685a47417A68654f8446G0147
$$ 163170 -92268 -302263 -41373 26515 43426 385572 64685 -147417 168654 -68446 70147
18874B23906e3458K3311j74729R9454F8144i7941a0097r5297j28548g3067A17962
$$ 223906 -53458 -30147 -204876 -105422 68144 -97941 -10097 -105394 -233942 -73067 117962
18862b20677A8003M2205a58657E3718M1821L07013i8574B64257j9723c9765r7141
$$ -220677 18003 60208 -158657 53718 95539 402552 -98574 264257 244534 -39765 -136906
18851a36906E2242c0956A63001J07825J43960a67946I0995c09140J41032I9130
$$ -136906 52242 -30956 163001 270826 414786 -167946 90995 -309140 -168108 99130
18840a44335k40805A63304b14754a1735A85224F748b19733j33355O788a53318
$$ -144335 -385140 163304 -214754 -11735 185224 6748 -219733 -353088 -346300 -153318
18829d3761B41085F6123R1290a70410A26607Q5128O9022o4417h1423k9263n5402
$$ -43761 241085 66123 157413 -170410 126607 211735 280757 216340 -81423 -110686 -166088
18818a66088C10834A39566d6685J9788l1760H1575Q9403q2741h6841B14264O7656
$$ -166088 310834 139566 -46685 -26897 -58657 81575 170978 88237 -86841 214264 281920
18807B81920D9460e7728A97887a53474D79080a05478k57147f5902j22993a2145
$$ 281920 49460 -57728 197887 -153474 479080 -105478 -362625 -65902 -188895 -12145
18796A18926a9207j21675k51293a05691j32201J14563A18412b64913G2310b14655
$$ 118926 -19207 -140882 -392175 -105691 -237892 -123329 118412 -264913 72310 -214655
18785c79020A3296c56418A63725g9167K3294A04260a79478j0297b9707j25133
$$ -379020 13296 -356418 163725 -79167 -55873 104260 -179478 -189775 -29707 -154840
18775a54840h807p8780A17550M3514c2759q2036A10694J21680a97903n329A6489
$$ -154840 -8807 -87587 117550 161064 -32759 -114795 110694 232374 -197903 -203232 16489
18763a54892q2224f4752F3892b03384A02693a37942L2128J1524p534M1780p3519
$$ -154892 -237116 -64752 63892 -203384 102693 -137942 -105814 -94290 -101824 -60044 -133563
18752a33563A18238a2935p4351B0029N4393l3942g844r116j36993I2379a13912
$$ -133563 118238 -12935 -87286 20029 74422 40480 -7844 -16960 -153953 92379 -113912
18740e0407J5247B2462a86664A64290h9743j66035A23442d1087j87661h8998q1687
$$ -50407 -35160 22462 -186664 164290 -89743 -255778 123442 -41087 -228748 -88998 -170685
18729a70685b1817g591q9585A47196F1277d2852D9671e9605j52521c9078j23955
$$ -170685 -21817 -7591 -97176 147196 61277 -42852 49671 -59605 -212126 -39078 -163033
18718a63033b9660k16456O3195B16865a58903E4488B418a898k64270D3626b56210
$$ -163033 -29660 -246116 -182921 216865 -158903 54488 2418 -1898 -266168 43626 -256210
18706g6854k42399a7123k77357L9425A81160b56197b6443A19039l8213J55173
$$ -76854 -319253 -17123 -294480 -255055 181160 -256197 -26443 119039 80826 235999
18696B35999L2281e9892o6011j23998k2021E0963J22908D2815a08992pB00782
$$ 235999 268280 -59892 -125903 -249901 -271922 50963 173871 42815 -108992 -108999 200782
18684b13767c2370j22078n8654M3560D78257c13440B70955b41474c9949k42571
$$ -213767 -32370 -154448 -213102 -169542 478257 -313440 270955 -241474 -39949 -282520
18674b82520Q7711P7269j37850J26813j56574J3964N5036l8390A77629k4295R2462
$$ -282520 -194809 -117540 -255390 -128577 -285151 -271187 -216151 -254541 177629 153334 245796
18663B45796A8114b42174a03766B5557J50590a02735H0460K51683c39737F0215
$$ 245796 18114 -242174 -103766 25557 176147 -102735 80460 332143 -339737 60215
18652B02730q9312M6560C6338O671g9231I5081C0347a19109c058q7218E0103N9342
$$ 202730 113418 159978 36338 43009 -79231 95081 30347 -119109 -3058 -90276 50103 109445
18640A09445g9229C1290J13537o8835b3389j793E0276j2561c57081a35965E5871
$$ 109445 -79229 31290 144827 75992 -23389 -25182 50276 37715 -357081 -135965 55871
18628f5143B51054A23086D7885b12009D34414E2598L8933M6106b42490A96354
$$ -65143 251054 123086 47885 -212009 434414 52598 91531 137637 -242490 196354
18617f7402l77096b236j70979o0514A2065a35445G4226d21691A97924b43674J11499
$$ -67402 -444498 -2236 -173215 -233729 12065 -135445 74226 -421691 197924 -243674 -132175
18606a32175J8572J6479j4881p8525L8052E1951a00645j75809G3820d8560j46705
$$ -132175 -113603 -97124 -112005 -190530 -152478 51951 -100645 -276454 73820 -48560 -195265
18595a95265O3758l6402M6897B93518j44247f2132B20835a61014O3476I8500R3830
$$ -195265 -131507 -167909 -121012 293518 149271 -62132 220835 -161014 -97538 98500 192330
18584A92330a53324A15284a43824B09462a45671p6984a5172j05048g569j72556
$$ 192330 -153324 115284 -143824 209462 -145671 -222655 -15172 -120220 -7569 -180125
18574a80125k45073i9652K0156j06190A72989J33519l6409e6615D1777a91038
$$ -180125 -425198 -99652 -79496 -185686 172989 306508 270099 -56615 41777 -191038
18563c62435O4377P3528A89150a7540j37810A6604b01496B05423D191g5705k14724
$$ -362435 -298058 -224530 189150 -17540 -155350 16604 -201496 205423 4191 -75705 -290429
18552b90429P3125C73658A58026d04433A99009i7638J7093A97560E367a47368
$$ -290429 -217304 373658 158026 -404433 199009 -97638 -80545 197560 5367 -147368
18541b87662G5783Q5584c32799J55561g342n3275A05393b24762P1571I0803J09018
$$ -287662 75783 161367 -332799 -177238 -7342 -60617 105393 -224762 -153191 90803 199821
18530A99821M4761f1819J149m2139E3677K1274J88444d13q4995b8554A04889b10684
$$ 199821 244582 -61819 -60670 -102809 53677 74951 263395 -413 -85408 -28554 104889 -210684
18517E9929a37650j01430F1696a42759B41456a19080e2281k3586B1343b67124
$$ 59929 -137650 -239080 61696 -142759 241456 -119080 -52281 -75867 21343 -267124
18506a25561j83213A72351i6921n4043o98b6236A11558a35765b0631A40417a74538
$$ -125561 -308774 172351 -96921 -150964 -151662 -26236 111558 -135765 -20631 140417 -174538
18494C42985g6537A19858k6074a75320G0669a99167j69675i7969n6576C30434
$$ 342985 -76537 119858 93784 -175320 70669 -199167 -368842 -97969 -154545 330434
18483I173a47898I9544K080J29857b94442d9282o3138A12309a04445B98151b31104
$$ 9173 -147898 99544 101624 231481 -294442 -49282 -112420 112309 -104445 298151 -231104
18471a79255n9706b7534C83589C6616a11614B91494b36542O4401c2239A15660
$$ -179255 -238961 -27534 383589 36616 -111614 291494 -236542 -172141 -32239 115660
18460h7677b8046k79362j31355M8809I977a4277A01871c01211k0256d8721k07585
$$ -87677 -28046 -307408 -438763 -389954 9977 -14277 101871 -301211 -321467 -48721 -256306
18449b56306F7696a12044B1937c18414A26705J22838b00308A14769f8359k48610
$$ -256306 67696 -112044 21937 -318414 126705 249543 -200308 114769 -68359 -316969
18439c16969a53533g683j2249m449H2749f0644r6061I471e1450k36322j33649
$$ -316969 -153533 -7683 -19932 -24381 82749 -60644 -156705 9471 -51450 -287772 -421421
18428d21421e821p234A25413a95469h3686A04021m3157A8601c4412o3771c143
$$ -421421 -5821 -13055 125413 -195469 -83686 104021 60864 18601 -34412 -98183 -3143
18416b724j79402n1971g5371j6187j60873P8140L8058A475b73638p158J20567
$$ -2724 -182126 -234097 -75371 -91558 -252431 -174291 -136233 1475 -273638 -280796 -160229
18405a60229N1123D578e497q6530D0325J41971f9026k02290A00701J14752a06246
$$ -160229 -109106 4578 -5497 -92027 40325 182296 -69026 -271316 100701 215453 -106246
18393i1024A97061E995J20406c53733A32425m2080R2954c9716o6527j26638D2990
$$ -91024 197061 5995 126401 -353733 132425 90345 183299 -39716 -106243 -232881 42990
18381a0672E1739f7855K4820B3017J51169p0150b46687D2616J5440c2198n8400
$$ -10672 51739 -67855 -43035 23017 174186 104036 -246687 42616 58056 -32198 -90598
18370i0598E7395a23045B47543A22471j8329a76363B2522J74716H4696J94519
$$ -90598 57395 -123045 247543 122471 104142 -176363 22522 197238 84696 279215
18360B79215A13642H194P298a41551l6453j1291M9785N3912R149F5502b08646
$$ 279215 113642 8194 15492 -141551 -178004 -189295 -139510 -85598 -76449 65502 -208646
18348E2774J7613b60333e4506A52890A0188e82042A55750c29398L6946E464d0460
$$ 52774 70387 -260333 -54506 152890 10188 -582042 155750 -329398 -292452 5464 -40460
18336A82926a02983N383d6803j70155E3878J75221a95050M9846k56575A98357
$$ 182926 -102983 -97600 -46803 -216958 53878 229099 -195050 -145204 -401779 198357
18325B16720E277a18001l0525d0333j88577B93303b00902d2349k04214A50857
$$ 216720 5277 -118001 -148526 -40333 -228910 293303 -200902 -42349 -246563 150857
18314A78225a00845J4640j14048R9907A25001a61901A87997i5103D4153a59414
$$ 178225 -100845 -86205 -200253 -100346 125001 -161901 187997 -95103 44153 -159414
18303a87246Q4185L7272A18646c47049e6217a3862A53262m3868c18114A95271
$$ -187246 -103061 -65789 118646 -347049 -56217 -13862 153262 109394 -318114 195271
18292F9397c2337k34243F004g9617A94617Q2089H0659a17046A79479F2589P5664
$$ 69397 -32337 -266580 6004 -79617 194617 276706 80659 -117046 179479 62589 138253
18281A38253a51321N2939B17926g9592B78608a35597B5953a9578l42410a3826
$$ 138253 -151321 -98382 217926 -79592 278608 -135597 25953 -19578 -361988 -13826
18270C9948h4354B00861P9607G741i5424j89509D7492b80913f6677k7124j17303
$$ 39948 -84354 200861 280468 7741 -95424 -284933 47492 -280913 -66677 -93801 -211104
18259b11104B39397J83731a26452j33151A0887L39946g4977B76627b51423C7797
$$ -211104 239397 423128 -126452 -259603 10887 350833 -74977 276627 -251423 37797
18248b13601c1162o7045H5811f271H5591c31438i0283C5821d8705l02964A04091
$$ -213601 -31162 -98207 85811 -6271 85591 -331438 -90283 35821 -48705 -351669 104091
18236F5350f8748E2423c29856I9333b59057a14409B35296i3283D4348c36581a43821
$$ 65350 -68748 52423 -329856 99333 -259057 -114409 235296 -93283 44348 -336581 -143821
18224D5691L5797a85192A31584j1021n4480a14542G4289a29001A44858b88903
$$ 45691 81488 -185192 131584 120563 66083 -114542 74289 -129001 144858 -288903
18213A52703k8382A271a70916B07443C4111M2291c4760A04894c17136H9727a17436
$$ 152703 124321 1271 -170916 207443 34111 76402 -34760 104894 -317136 89727 -117436
18201E3381a21075m8885b2941H5256b24474h4236j6844B91389A13262M6309b80806
$$ 53381 -121075 -169960 -22941 85256 -224474 -84236 -101080 291389 113262 159571 -280806
18189g8386D21295C489f1012K9132E9664a0854F3960a71478l1479P6398L3426
$$ -78386 421295 3489 -61012 -31880 59664 -10854 63960 -171478 -202957 -126559 -93133
18178i3133G5171c5246E7373N6792b26544j62790A24633a65253A27672b81875
$$ -93133 75171 -35246 57373 114165 -226544 -389334 124633 -165253 127672 -281875
18167C13090j11252h4656c9264a8119l73883C87300j88825n2647j9254a90370
$$ 313090 201838 -84656 -39264 -18119 -392002 387300 198475 145828 126574 -190370
18156b69607q2780D3210g4810A65479a35200m723b1412l8780B582b18513G4056
$$ -269607 -352387 43210 -74810 165479 -135200 -139923 -21412 -60192 2582 -218513 74056
18144d51607a69726k0097R2299L6023E1729e5111l1207j27997j05422K4502R3079
$$ -451607 -169726 -189823 -97524 -61501 51729 -55111 -86318 -214315 -319737 -295235 -202156
18133b02156O2475D0560h2444I8173K4426b26733c480A02791i0745B95760c98016
$$ -202156 -139681 40560 -82444 98173 122599 -226733 -3480 102791 -90745 295760 -398016
18121B18628a23203B4108g4368B20389e5241e178q5881c5073C80022j61408a12541
$$ 218628 -123203 24108 -74368 220389 -55241 -5178 -91059 -35073 380022 218614 -112541
18109a65076K5428j00953c3671A53916e6711K3618F9836B0118I918a43078N4169
$$ -165076 -139648 -240601 -33671 153916 -56711 -33093 69836 20118 9918 -143078 -88909
18098h8909r7579i0530c3917k58978H9129J74338a7762D3064d12335J9075I0811
$$ -88909 -186488 -90530 -33917 -292895 89129 263467 -17762 43064 -412335 -393260 90811
18086c51762F0516E164J98279b55117G9618a97961n5043H8066l7946b01362C42428
$$ -351762 60516 5164 203443 -255117 79618 -197961 -253004 88066 50120 -201362 342428
18074A50588B1728L573a07956A2948Q9288a18506j64464a04454l67198C6596f7183
$$ 150588 21728 25301 -107956 12948 102236 -118506 -282970 -104454 -471652 36596 -67183
18062A81962d576n4161R466j35390j31006a53839e5143p283E29096A68447a46439
$$ 181962 -4576 -58737 -49271 -184661 -315667 -153839 -55143 -62426 529096 168447 -146439
18050I8973a43050f326I8763b84072R9107D50139b58319h9201k43701Q4758E3989
$$ 98973 -143050 -6326 98763 -284072 -184965 450139 -258319 -89201 -332902 -248144 53989
18038a45085B23862a7661j35833j4138j23900A70074c55318I2759c0516A45550
$$ -145085 223862 -17661 -153494 -167632 -291532 170074 -355318 92759 -30516 145550
18027A51689k9611e5024j07787A41497a42494I999c5047B79713K3093A7502b98853
$$ 151689 122078 -55024 -162811 141497 -142494 9999 -35047 279713 302806 17502 -298853
18015e2788k4804a1864k4546q4827e1541o9797B26033q6310C3631a67711B10230
$$ -52788 -77592 -11864 -36410 -121237 -51541 -121338 226033 139723 33631 -167711 210230
18003a31097M5259j17257m1230C09570b03086A958a82746F0512c65033J56499
$$ -131097 -85838 -203095 -244325 309570 -203086 1958 -182746 60512 -365033 -208534
17993b08534A72105g8946A54380p4040a44289M0478H9619j7983c04724i7902b129
$$ -208534 172105 -78946 154380 80340 -144289 -103811 89619 71636 -304724 -97902 -2129
17981d147j46512A39957J95975A13625k4771K9782K5450c84778i8177k18308c447
$$ -4147 -150659 139957 335932 113625 88854 118636 144086 -384778 -98177 -316485 -3447
17969b40852B04932c052k11196I33b65787J273E2282b08340A88984k2386a23083
$$ -240852 204932 -3052 -214248 933 -265787 -264514 52282 -208340 188984 166598 -123083
17957A69430D7129b761F3617B8285a77908C63113F0097b72661A01402b76827H9940
$$ 169430 47129 -2761 63617 28285 -177908 363113 60097 -272661 101402 -276827 89940
17945h448r55B99633a88209J5754A40364f3671B8460J99096G3932d4131Q632j53004
$$ -8448 -9403 299633 -188209 -172455 140364 -63671 28460 227556 73932 -44131 -35499 -188503
17933a88503A09605Q5096e8607A06307Q7176a18753M7058l65205B88129j23444
$$ -188503 109605 194701 -58607 106307 193483 -118753 -71695 -436900 288129 164685
17923A64685a53294A64993a94155A10658J56436b34642A48558b60645A22668N804
$$ 164685 -153294 164993 -194155 110658 267094 -234642 148558 -260645 122668 128472
17913A28472K00837H4028J09005O8435a16030M0673C89176d4736a2276p2155n2809
$$ 128472 329309 84028 193033 261468 -116030 -75357 389176 -44736 -12276 -84431 -137240
17902a37240G6210L748f5309f044B9451i401G2248b3752B79384C3800J49670f2798
$$ -137240 76210 79958 -65309 -6044 29451 -9401 72248 -23752 279384 33800 183470 -62798
17889A85745a10170J8440b5608C64415I7065l264a04126M9046j2835k91286A8838
$$ 185745 -110170 -91730 -25608 364415 97065 93801 -104126 -55080 -67915 -359201 18838
17877f4253A41416b7451H547b73829A78843J34779A00147c27568A7313P3055M1828
$$ -64253 141416 -27451 8547 -273829 178843 313622 100147 -327568 17313 90368 132196
17866A32196i4792F9765a1312j85984a7585G437d1857j10346A89340d0479A1677
$$ 132196 -94792 69765 -11312 -197296 -17585 7437 -41857 -152203 189340 -40479 11677
17854A27801J96764j61523k9474a80757m70782a21507A52839K28730b34856a06172
$$ 127801 324565 163042 133568 -180757 -651539 -121507 152839 381569 -234856 -106172
17843a46766A27560K5595a22393A04851a73922j72569J69715E0634k138J98430
$$ -146766 127560 153155 -122393 104851 -173922 -346491 -176776 50634 48496 246926
17833B46926A3167b5262d539o1835I1023Q2399d43322g4994l851A15893b71200
$$ 246926 13167 -25262 -4539 -66374 91023 173422 -443322 -74994 -78845 115893 -271200
17821A80464a01703b4765D1539A7415K46612b60726j51866h9149r4160A04591
$$ 180464 -101703 -24765 41539 17415 264027 -260726 -412592 -89149 -183309 104591
17810A25359k6324b9107A90267a50092j19835f1652P185C285K24185H9330b52733
$$ 125359 99035 -29107 190267 -150092 -269927 -61652 -54467 3285 227470 89330 -252733
17798e8178A24944G041O1807f8522o7101A93815F1388i7427A14036b72033A151
$$ -58178 124944 7041 68848 -68522 -135623 193815 61388 -97427 114036 -272033 1151
17786g6539C43614F0724J15010a14599C3097e5193r7959L1104A47656K34787H4235
$$ -76539 343614 60724 175734 -114599 33097 -55193 -153152 -122048 147656 382443 84235
17774A44387g0697A77701a38419d4790B22331N03l9564b75551A28920m1281K42872
$$ 144387 -70697 177701 -138419 -44790 222331 222834 183270 -275551 128920 87639 330511
17763C30511B9552c2727A37236g2867m4356K0466A18453b41596B28217a56147
$$ 330511 29552 -32727 137236 -72867 -117223 -96757 118453 -241596 228217 -156147
17752d2049A9280Q8048d3762A90355d0597n5366J5856j81403a27384A1459J43656
$$ -42049 19280 107328 -43762 190355 -40597 -95963 -80107 -261510 -127384 11459 155115
17741A55115e7125D53162E3324a22647j09723B63137r9800a07560j5462I7515
$$ 155115 -57125 453162 53324 -122647 -232370 263137 163337 -107560 -123022 97515
17730f3609A5462L0263K67930i3705C89032g8804B3154c18653h8062A71801b0752
$$ -63609 15462 45725 313655 -93705 389032 -78804 23154 -318653 -88062 171801 -20752
17718I8992k8398L495K27300A2687L6186b43625g6672B0578J58972B316P359M1515
$$ 98992 70594 74089 301389 12687 48873 -243625 -76672 20578 179550 2316 9675 51190
17706E1190M02256g5884D16434A87724g032F7557J74555a54942A44097b50716
$$ 51190 453446 -75884 416434 187724 -7032 67557 242112 -154942 144097 -250716
17695A78598k1935b13987B9886J89190l3316a10563C27236J53776b2519A49703
$$ 178598 156663 -213987 29886 219076 185760 -110563 327236 481012 -22519 149703
17684C6226j4975O0480i0502A79770n6614B3743d716j638A69521p9439i0056A1639
$$ 36226 21251 81731 -90502 179770 123156 23743 -4716 -6354 169521 90082 -90056 11639
17671G8654a84458A62068a22484C40108b80477A36675b79100g4515A98567a23276
$$ 78654 -184458 162068 -122484 340108 -280477 136675 -279100 -74515 198567 -123276
17660f4155F0413J03181g1955k6495D39499g1703b5605o6208k20158B72104b17864
$$ -64155 60413 163594 -71955 -98450 439499 -71703 -25605 -91813 -311971 272104 -217864
17648a035B43728L3497a74501C9611M1108K05661r7205i1494A74452l3280a62341
$$ -1035 243728 277225 -174501 39611 80719 286380 189175 -91494 174452 141172 -162341
17636C5593d1808j53732A032d9616B9072i8847F5297L98057j26194b882o2927
$$ 35593 -41808 -195540 1032 -49616 29072 -98847 65297 463354 337160 -2882 -65809
17625f5809A0392L15766A49151j2813E824h5728q248m5963B55884r7191g4353
$$ -65809 10392 326158 149151 136338 5824 -85728 -93976 -139939 255884 158693 -74353
17613b06386A17693f920o5197A3727L426M9408h9657j78437f7404A57060p5357
$$ -206386 117693 -6920 -72117 13727 17153 66561 -89657 -268094 -67404 157060 81703
17602H1703Q0316a06932l5833H365N6153h298H391J12224b8207A08508J93014
$$ 81703 162019 -106932 -142765 8365 64518 -8298 8391 120615 -28207 108508 301522
17591C01522e1343A83064F5238h4430j58185B94878o9055b9558A41730E8526b20614
$$ 301522 -51343 183064 65238 -84430 -242615 294878 225823 -29558 141730 58526 -220614
17579A7830J28404R5300a39510B04448n5758Q932d81778B61997b677j00203G5373
$$ 17830 146234 241534 -139510 204448 148690 157622 -481778 261997 -2677 -102880 75373
17567F8028b7917k46198C35297a20316A91593J7551L4818F6986L53621b22842
$$ 68028 -27917 -274115 335297 -120316 191593 209144 243962 66986 420607 -222842
17556B37647A12213L8485m3869k5865a57604q6366a12312B57455F288J08998E3718
$$ 237647 112213 150698 106829 80964 -157604 -243970 -112312 257455 6288 115286 53718
17544A63570a01858A22123J20816M0622a05662C42023G4327p972P8219e0673A089
$$ 163570 -101858 122123 242939 283561 -105662 342023 74327 66355 144574 -50673 1089
17532a24720c580r4709E7586O6735C6424N6304e0071K4233C04512j28168J11670
$$ -124720 -3580 -98289 57586 124321 36424 92728 -50071 -25838 304512 176344 288014
17521B88014g6508C59010l7203p1512a05741A51022B1430M4209J48125o4133Q021
$$ 288014 -76508 359010 321807 250295 -105741 151022 21430 65639 213764 149631 157652
17510A57652B4676J30512F9139K13749j26264l1889J22555A9439J82869a29027
$$ 157652 24676 155188 69139 282888 156624 124735 247290 19439 202308 -129027
17499a84062A91736e091A73366D158L69458A73874P4193n1804q2696K78640j63973
$$ -184062 191736 -5091 173366 4158 373616 173874 248067 196263 113567 392207 228234
17488B28234G6690g5552C36657J03457j26949a5146A58218J19910d3445l8178
$$ 228234 76690 -75552 336657 440114 313165 -15146 158218 278128 -43445 -81623
17478h1623D75432A83012K60058A89873D0938N9814L86446r5051j90587J89596
$$ -81623 475432 183012 443070 189873 40938 100752 487198 392147 201560 391156
17468C91156j84417a0570A73485e3246C67294J5037a08949B43552a94l8941C66198
$$ 391156 206739 -10570 173485 -53246 367294 382331 -108949 243552 -194 -39135 366198
17456E055f4378D46666A68182A3893J63959b43032I0407K34669A43845J51465
$$ 5055 -64378 446666 168182 13893 177852 -243032 90407 325076 143845 295310
17446B95310j0909L0615L8851j47006K00017j60235K40519K02238l43311K22659
$$ 295310 284401 315016 353867 206861 406878 246643 487162 689400 346089 568748
17436E68748A39684e40A10714M57151k33138A50763k318n8065J71676C6012L0748
$$ 568748 139684 -540 110714 567865 334727 150763 148445 90380 262056 36012 66760
17425F6760J87407b2016C01748K6088A49021a06150D21999a9532E44811j04062
$$ 66760 254167 -22016 301748 327836 149021 -106150 421999 -19532 544811 440749
17415D40749r1832J64617J32008j25026A98042J93403b03771C07035j0118j32164
$$ 440749 348917 513534 645542 520516 198042 391445 -203771 307035 296917 164753
17405A64753L19084j32413q2723j25989M5056d2213A951K46943J87317a02719
$$ 164753 483837 351424 268701 142712 187768 -42213 1951 248894 436211 -102719
17394C77001a99037a5934C03546a13578B31037R1934j56029J91188j37638l323
$$ 377001 -199037 -15934 303546 -113578 231037 322971 166942 358130 220492 217169
17384B17169H6294B1524M03126A18233d8867C9097a18134H9515e3462A45978N2529
$$ 217169 86294 21524 424650 118233 -48867 39097 -118134 89515 -53462 145978 198507
17373A98507a6550j921B50732K4390j29904Q8754P476b72640G6344J61672g3431
$$ 198507 -16550 -18471 250732 275122 145218 233972 241448 -272640 76344 238016 -73431
17361C74622j34678l7067c6657B59216K84547d0792B842a78413B21065K9597o9146
$$ 374622 239944 202877 -36657 259216 543763 -40792 2842 -178413 221065 250662 181516
17350A81516g805D5292L3979J55143c8648H4433K10175J1741A35023K5581J82920
$$ 181516 -7805 45292 79271 234414 -38648 84433 294608 306349 135023 160604 343524
17339C43524I6012j3278R5279M4214Q5823j3996m4135J58857p8269q3179j11087
$$ 343524 96012 82734 178013 222227 308050 294054 249919 408776 330507 247328 136241
17328A36241K16289o5488K13971j2236C407Q1947b5212A55594c852B06755o5415
$$ 136241 352530 287042 501013 488777 3407 85354 -25212 155594 -3852 206755 141340
17317A41340B7979b3602B32440b9343l7506A35676M8973N8428n3571o4969A2973
$$ 141340 27979 -23602 232440 -29343 -66849 135676 184649 243077 189506 124537 12973
17305A83678i6872C22185J79371j5356j95420K9624F9627L275J01556j4309b9282
$$ 183678 -96872 322185 501556 486200 290780 320404 69627 72902 174458 160149 -29282
17293B1247K0602O19420A5185L12409j10895n0566K97922b0597E43816B10802
$$ 21247 41849 661269 15185 327594 216699 166133 464055 -20597 543816 210802
17282D08412A72502K21648A24244C8402J33912N717c6890D55283A76198J89168
$$ 408412 172502 394150 124244 38402 172314 178031 -36890 455283 176198 365366
17272C65366B8554M64554k1549B01860J7741K96470j26792C5040J34076K82648
$$ 365366 28554 493108 471559 201860 219601 516071 389279 35040 169116 451764
17262D51764A7275J5885J61648L06188B47522M4873n9068K60771P6880B01068
$$ 451764 17275 33160 194808 500996 247522 292395 233327 494098 570978 201068
17251D20936q7425a72673C90211M099D6785K04098a14985D48511c04635c6734
$$ 420936 333511 -172673 390211 394310 46785 250883 -114985 448511 -304635 -36734
17240D38360j25652j14423E3080a0867B62090o084E9802L10641A83045J82265
$$ 438360 312708 198285 53080 -10867 262090 256006 59802 370443 183045 365310
17230C65310E6204a42122C64287j04236N30737A37139R7771j2124J64815m9025
$$ 365310 56204 -142122 364287 260051 790788 137139 234910 222786 387601 338576
17220C38576A26726N16175B65961b0817B57634K26140o4932r3205K8106j7695
$$ 338576 126726 642901 265961 -20817 257634 483774 418842 325637 353743 336048
17210C36048k2956A46513J33670j10873J42766r9070K66793j05659J03955N0425
$$ 336048 313092 146513 280183 169310 312076 213006 479799 374140 478095 528520
17200E28520j85367R5585j41323A29408M6852Q3767D5654K91561o7886N8159n7798
$$ 528520 343153 438738 297415 129408 176260 260027 45654 337215 269329 327488 269690
17189B69690O0996j4581J52223j45837L33089k85249j30355H7071M2243L90455
$$ 269690 330686 316105 468328 322491 655580 370331 239976 87071 129314 519769
17179E19769k53027p3042L45401j57477j00350J04247L425P8248j59231B0935
$$ 519769 266742 193700 539101 381624 281274 385521 388946 467194 307963 20935
17168E58209r4851J25520j79867a15053C31404P2950A16524K38516o17L45949
$$ 558209 463358 588878 409011 -115053 331404 404354 116524 355040 354423 700372
17158G00372j97441L8772p8473A80221k4810J02434O4718J67440o9932j67290
$$ 700372 502931 541703 463230 180221 155411 257845 322563 490003 420071 252781
17148B52781j18730K33750J71233Q9248A98089M37448r9429k8063j5424k02571
$$ 252781 134051 367801 539034 628282 198089 635537 536108 508045 492621 290050
17138B90050n2052N7945n1472J99305B08071r7937K78288Q7457j9126J30792o7508
$$ 290050 237998 295943 244471 443776 208071 110134 388422 475879 456753 587545 520037
17127E20037J33199k75346R7259A97847L34515j5035A49984K47781K65492a4521
$$ 520037 653236 377890 475149 197847 532362 517327 149984 397765 663257 -14521
17116C28313K29085j33781J97151j73221J39628q1432j1302m0288j00011J81415
$$ 328313 557398 423617 620768 447547 587175 505743 494441 454153 354142 535557
17106E35557K2294r1165K93127C13095L35304q7631P6139L00522A40535J69424
$$ 535557 557851 466686 759813 313095 648399 560768 636907 937429 140535 309959
17096C09959M2202J39943J86998k25416J23038A86034K10387Q7322J70064Q8172
$$ 309959 352161 492104 679102 453686 576724 186034 396421 483743 653807 741979
17086G41979k21785Q0277J41129j50331J79359L5076J71395m59819J02511k62313
$$ 741979 520194 600471 741600 591269 770628 805704 977099 517280 619791 357478
17076C57478J9975K51832K77508j78848J49807k85147J05967Q6241k5957B11359
$$ 357478 377453 629285 906793 727945 877752 592605 698572 784813 758856 211359
17065F33600O5093n1310j57519M3408L7046j4211J52716l00664L83138k99213
$$ 633600 698693 647383 489864 533272 570318 556107 708823 408159 791297 492084
17055D92084M98315k09563j21883J24439r5311k88564P0473J76372L6937k66417
$$ 492084 990399 780836 658953 783392 688081 399517 469990 646362 683299 416882
17045D16882L22511J00202J0763j87416J42837K0376j61518Q9542k4721n3216
$$ 416882 739393 839595 850358 662942 805779 826155 664637 754179 729458 676242
17035F76242j64794M05546p9784l9444P9849j60750K04942k60762J07946K42526
$$ 676242 511448 916994 837210 797766 877615 716865 921807 661045 768991 1011517
17025A011517k77124J07855n2961O5257J89094D68857J43487J66161l2692M29984
$$ 1011517 734393 842248 789287 854544 1043638 468857 612344 778505 745813 1175797
17015A175797k37964k16845L78864k49116q9119K04921O3297p3766j18131K25505
$$ 1175797 937833 720988 1099852 850736 761617 966538 1029835 956069 837938 1063443
17005A063443k22883p8539K12948l33731M46992J62585p0638m04114p9454K80297
$$ 1063443 840560 762021 974969 641238 1088230 1250815 1180177 776063 696609 976906
16995I76906r8042K08374m1690L5327n7862m9690R8961m6433J70865k35183J21429
$$ 976906 878864 1087238 1045548 1080875 1023013 973323 1072284 1025851 1196716 961533 1082962
16984A082962k3542l29721K20575K12141j63886K78530j21331r9151K12997n27946
$$ 1082962 1059420 729699 950274 1162415 998529 1277059 1155728 1056577 1269574 741628
16974G41628M20170N0432j66528L71420n09044N38482j70093k83048J17835J33027
$$ 741628 1161798 1212230 1045702 1417122 908078 1446560 1276467 993419 1111254 1244281
16964A244281r6359L3889K2537j4805K46706l01413J46975J72165J4522q4577
$$ 1244281 1147922 1181811 1204348 1189543 1436249 1134836 1281811 1453976 1468498 1383921
16954A383921r5057k80904K72399l28510M63416J22160j38891o4631J53122j20134
$$ 1383921 1288864 1007960 1280359 951849 1415265 1537425 1398534 1333903 1487025 1366891
16944A366891J03455k59798L32744R0719k6375K13457K09802m50981m87718L29886
$$ 1366891 1470346 1210548 1543292 1634011 1607636 1821093 2030895 1579914 1092196 1422082
16934A422082L6332L07777J91216n68454K79361J90820l85962L12387j24448L19095
$$ 1422082 1458414 1766191 1957407 1388953 1668314 1859134 1473172 1785559 1661111 1980206
16924A980206q7301n2500j43547J12804p3659J97273j26627P9276J92721P7334
$$ 1980206 1892905 1840405 1696858 1809662 1736003 1933276 1806649 1885925 2078646 2155980
16914B155980L195k49005k1844m3030L12166l68870K12979K63582k69377r394
$$ 2155980 2159175 1910170 1888326 1845296 2157462 1788592 2001571 2265153 1995776 1986382
16904A986382R8556K21607M4173k71653J35470L35570m90244O4621N8925K25078
$$ 1986382 2084938 2306545 2350718 2079065 2214535 2550105 2059861 2124482 2183407 2408485
16894B408485L04870k64628M3924j32949N1887K6552M17869l52360L23708j35625
$$ 2408485 2713355 2448727 2492651 2359702 2411589 2438141 2856010 2503650 2827358 2691733
16884B691733j12831K12265j00462O7499J32888m1215r6553O2671J87126j23958
$$ 2691733 2578902 2791167 2690705 2758204 2891092 2849877 2753324 2815995 3003121 2879163
16874B879163j60455N17081m50625M6133J95124p5046N0188P9074M15319K7642
$$ 2879163 2718708 3235789 2785164 2831297 3026421 2951375 3001563 3080637 3495956 3523598
16864C523598n12959K89852j22009M7919J47967J76654J40669k49295J7559N8549
$$ 3523598 3010639 3300491 3178482 3226401 3374368 3551022 3691691 3442396 3459955 3518504
16854C518504J31225J08967j41362K34751K97222j14261k09555L92809j96722
$$ 3518504 3649729 3758696 3617334 3852085 4149307 4035046 3825491 4218300 4021578
16845D021578J90899r7499L65185k45558K3862L17970k1738n1931M10227N8710
$$ 4021578 4212477 4114978 4480163 4234605 4258467 4576437 4554699 4502768 4912995 4971705
16835D971705j38982J43975q197n4867M89023l15243N81563j11387K42543j40077
$$ 4971705 4832723 4976698 4968501 4913634 5402657 5087414 5668977 5557590 5800133 5660056
16825E660056K59094p9635j63878J79335M05842J67844j82793K32154O1229J89902
$$ 5660056 5919150 5839515 5675637 5854972 6260814 6428658 6245865 6478019 6539248 6729150
16815F729150N68883l09713p6434J65349L72056O6963m9754K50072K34917K66882
$$ 6729150 7298033 6988320 6911886 7077235 7449291 7516254 7466500 7716572 7951489 8218371
16805H218371n6486L85260o9922L13556N8140J88088M10470j12719J87930J62155
$$ 8218371 8161885 8547145 8477223 8790779 8848919 9037007 9447477 9334758 9522688 9684843
16795I684843M97553L53138o6204L6448L29027Q1746L33934N57619j40610M85361
$$ 9684843 10182396 10535534 10469330 10505778 10834805 10916551 11250485 11808104 11667494 12152855
16785A2152855L11605M73773K06865L76833j80983Q18824M00830J68682N59585
$$ 12152855 12464460 12938233 13145098 13521931 13340948 14159772 14560602 14729284 15288869
16776A5288869O41062J81947O07730M03837M67996N38624L43245R33849K36869
$$ 15288869 15929931 16111878 16719608 17123445 17591441 18130065 18473310 19407159 19644028
16767A9644028R93256M58666Q30985P71445M51471J007998R48588J109985P92464
$$ 19644028 20637284 21095950 21926935 22698380 23149851 24157849 25106437 26216422 27008886
16758B7008886Q03797J123784P38623J176875J619592J203285J241589J644005
$$ 27008886 27812683 28936467 29675090 30851965 32471557 33674842 34916431 36560436
16750C6560436J438384J740133J545964K093877J984271K278858K317662K298534
$$ 36560436 37998820 39738953 41284917 43378794 45363065 47641923 49959585 52258119
16742E2258119K435061K701799L078391L135321L360620L655033L692701M449292
$$ 52258119 54693180 57394979 60473370 63608691 66969311 70624344 74317045 78766337
16734G8766337M205296M443136N078784N222647O023624O053810N885105O524601
$$ 78766337 82971633 87414769 92493553 97716200 103739824 109793634 115678739 122203340
16726A22203340P011837P257981O891658P134563P326865P124712O512287N605848
$$ 122203340 129215177 136473158 143364816 150499379 157826244 164950956 171463243 177069091
16718A77069091N156895M183904L217329J479931N66668j100715k459594l890796
$$ 177069091 182225986 186409890 189627219 191107150 191673818 190573103 188113509 184222713
16710A84222713m835585n398520o773411p227093p592487q269499p328823p859704
$$ 184222713 179387128 173988608 167215197 159988104 152395617 144126118 136797295 128937591
16702A28937591p440626p224264p044499o484734o395031n592421n651364m723978
$$ 128937591 121496965 114272701 107228202 100743468 94348437 88756016 83104652 78380674
16694G8380674m809384n005488l813126l427762l450953l329157l281750k465896
$$ 78380674 73571290 68565802 64752676 61324914 57873961 54544804 51263054 48797158
16686D8797158k781255k807628j753056k177230k150723j590876k093735j188517
$$ 48797158 46015903 43208275 41455219 39277989 37127266 35536390 33442655 32254138
16678C2254138j520754j780617j125077j152682j170991j244524q54465q37028
$$ 32254138 30733384 28952767 27827690 26675008 25504017 24259493 23405028 22568000
16670B2568000r39102r50972q22002j126938o39266l73092q15755o89311p00754
$$ 22568000 21628898 20677926 19855924 18728986 18089720 17716628 16900873 16211562 15510808
16661A5510808J9542p33726r02339j18122n90662l76402m40199p43065l53416
$$ 15510808 15530350 14796624 13894285 13776163 13185501 12809099 12368900 11625835 11272419
16652A1272419o029l55375n801q04382k57348j06158m89099j47028m48997q2573
$$ 11272419 11266390 10911015 10905214 10100832 9843484 9737326 9248227 9101199 8652202 8569629
16642H569629j85672q7334m86109K7717l89772n9410j26225m05722j39277l98472
$$ 8569629 8383957 8296623 7810514 7838231 7448459 7389049 7262824 6857102 6717825 6319353
16632F319353n46193N43748n83049L06712m08624m4082o1730k45584j36268L00496
$$ 6319353 5773160 6316908 5733859 6040571 5631947 5587865 5526135 5280551 5144283 5444779
16622E444779m72660j32127j04808L45749n12831n253l12296J99891m25107k7370
$$ 5444779 4972119 4839992 4735184 5080933 4568102 4562849 4250553 4450444 4025337 3997967
16612C997967J73369k15124M1665J36163l90066L5814m52359m7470N09052l28092
$$ 3997967 4171336 3956212 3997877 4134040 3743974 3779788 3327429 3279959 3789011 3460919
16602C460919j43978J4282J06109n1863k83992j10138k97043K13957M059Q9974
$$ 3460919 3316941 3331223 3437332 3385469 3101477 2991339 2694296 2908253 2912312 3002286
16592C002286j15761k36324J35308j33382K55982o87390L88029l79163J00939
$$ 3002286 2886525 2650201 2785509 2652127 2908109 2220719 2608748 2229585 2330524
16583B330524J23120k73036K8100r8809J84087k32296K46817Q8945j78891k36913
$$ 2330524 2453644 2180608 2208708 2109899 2293986 2061690 2308507 2397452 2218561 1981648
16573A981648M1333K31752j93439m254J02934k76228j7985k80409L11955j43155
$$ 1981648 2022981 2254733 2061294 2057040 2159974 1883746 1865761 1585352 1897307 1754152
16563A754152K0130O701j87501J84570L7621k37613O5106K9866N2984l15040N1367
$$ 1754152 1774282 1780983 1593482 1778052 1815673 1578060 1643166 1673032 1726016 1410976 1462343
16552A462343n2478M1706Q9874l53887P7473L80170m54833O8414L00630l07852
$$ 1462343 1409865 1451571 1541445 1187558 1265031 1645201 1190368 1258782 1559412 1251560
16542A251560J94205j15558k71961K19160N6507j94613K13156l53360j29759K81304
$$ 1251560 1445765 1330207 1058246 1277406 1333913 1139300 1352456 999096 869337 1150641
16532A150641M7504k30333J83351n1670m04496N93213K37405m67512N1649k2218
$$ 1150641 1198145 967812 1151163 1099493 694997 1288210 1525615 1058103 1109752 1087534
16522A087534N4982J23812E74902P15460k61466j08675K21609j86988k77895K72211
$$ 1087534 1142516 1266328 574902 1290362 1028896 920221 1141830 954842 676947 949158
16512I49158n7142L87552l89589j90928K21545K02744j45733k13834L23068j01767
$$ 949158 892016 1279568 889979 699051 920596 1123340 977607 763773 1086841 985074
16502I85074J8313j17833k34401Q8574L0083J82414k82763J42649J68053k91239
$$ 985074 1003387 885554 651153 739727 769810 952224 669461 812110 980163 688924
16492F88924K94576k33971M6709j42038J36598k60504J15105M3015J7603J37458
$$ 688924 983500 749529 796238 654200 790798 530294 645399 688414 706017 843475
16482H43475k80319J41759L38573k75581m4007L0722J72268l94425j7840n5927
$$ 843475 563156 704915 1043488 767907 723900 754622 926890 532465 514625 458698
16472D58698J4965E8490M60277Q2336l562K59683C96309P4816N8125p531J63962
$$ 458698 473663 58490 518767 601103 597541 857224 396309 471125 529250 521719 685681
16461F85681j72849J5840l2776q9815L48656k078q0055k05095J16630m2520C4908
$$ 685681 512832 528672 495896 406081 754737 752659 672604 467509 584139 541619 34908
16449C04353L28346A38164L24056j98949J98760J60858P6636j38968J35406r761
$$ 304353 632699 138164 462220 263271 462031 622889 699525 560557 695963 686202
16439F86202B45256L04053k29617L84189j97652j40473L9785L7557c7842E56388
$$ 686202 245256 549309 319692 703881 506229 365756 405541 443098 -37842 556388
16428C73188L0571n8551B7918M66028M58680C08105O6364J7317l3350K46758B43985
$$ 373188 403759 345208 27918 493946 952626 308105 374469 391786 358436 605194 243985
16416E62917B13443J5101K68396B40423K86631B44003K37993P0480k40970M0234
$$ 562917 213443 228544 496940 240423 527054 244003 481996 552476 311506 351740
16406C51740j36752K90137j70199J24302D7923K92785A06885e9803C89630n9614
$$ 351740 214988 505125 334926 459228 47923 340708 106885 -59803 389630 330016
16396C30016o3067P0426J82359o6803j16314M6675A24453J13024C5654N40891
$$ 330016 266949 337375 519734 452931 336617 383292 124453 237477 35654 576545
16386E76545B10585J45233A31468K009L05949A68767J339q565L19626B31340M4419
$$ 576545 210585 355818 131468 133477 439426 168767 170106 161541 481167 231340 275759
16375B75759e685B41289a94316A8197J21594J11910m036o1806K97357A40291J08904
$$ 275759 -5685 241289 -194316 18197 139791 251701 247665 185859 483216 140291 249195
16364B49195J24067m473j79140B1594N13523B15124H0N6986M58540A12582R6630
$$ 249195 373262 368789 189649 21594 535117 215124 80 57066 515606 112582 209212
16353B09212r4822g7355C61419A32500J17486J37810n5097A37151L2309l5912
$$ 209212 114390 -77355 361419 132500 249986 387796 332699 137151 169460 133548
16343A33548M5119J05007j12205p1074K83588j55475N2749d3727D34362K680k07052
$$ 133548 178667 283674 171469 100395 383983 228508 281257 -43727 434362 437042 229990
16332B29990a8321C44684C926K33380K40387j11437b859F3651K15104A615K83750
$$ 229990 -18321 344684 3926 237306 477693 366256 -2859 63651 278755 1615 285365
16321B85365E2772J95650j16141b30657A29244L95096j33603j11295h2536a4023
$$ 285365 52772 248422 132281 -230657 129244 524340 390737 279442 -82536 -14023
16310A28062J89905i3775j36755G0485K3749f0713E1419B1406b9233j610D1389
$$ 128062 317967 -93775 -230530 70485 94234 -60713 51419 21406 -29233 -30843 41389
16298A19495L02072H6133L07064b1778j69902B24868G287a41112I5301J77899
$$ 119495 421567 86133 393197 -21778 -191680 224868 7287 -141112 95301 273200
16288B73200R1466c08650i1030A49991O91a4839A62873b37589B75072c5435I6866
$$ 273200 364666 -308650 -91030 149991 150682 -14839 162873 -237589 275072 -35435 96866
16276f3165C1743Q4990l9342K76043L3800A88410M4313E4006Q2954c9858k18589
$$ -63165 31743 116733 77391 353434 387234 188410 232723 54006 136960 -39858 -258447
16265b58447B6690N1481P9084d8628j4759E6734M1728B2731J9348b32542B45097
$$ -258447 26690 78171 157255 -48628 -63387 56734 98462 22731 42079 -232542 245097
16253B31513f1252A13990K3665a72509H6641Q5299l4108C2136O1907K89784b70219
$$ 231513 -61252 113990 137655 -172509 86641 171940 137832 32136 94043 383827 -270219
16241a8606C15022A37695B469e2235A11671a3240k12952A51218M9959i9545A36634
$$ -18606 315022 137695 2469 -52235 111671 -13240 -226192 151218 201177 -99545 136634
16229E3735b06880A88812A1728K02125D865K52075a42213H6705p4b20112Q8834
$$ 53735 -206880 188812 11728 213853 4865 256940 -142213 86705 86631 -220112 -131278
16218a31278B43331N0573A1322K82248I0852h1117m7218A88297F8325a37334A3917
$$ -131278 243331 293904 11322 293570 90852 -81117 -128335 188297 68325 -137334 13917
16206B10479a53168C8643R1557b6723C5303J84024r8073m7494J21002q4868b83054
$$ 210479 -153168 38643 130200 -26723 35303 219327 121254 73760 194762 109894 -283054
16194F8854a09340K8246A90941b13311j7645B97550c31180J25560b8559H4941
$$ 68854 -109340 -81094 190941 -213311 -230956 297550 -331180 -205620 -28559 84941
16183i5847C96621p0158A05542c0588A04895c21346J23680C29295b41877B4374
$$ -95847 396621 326463 105542 -30588 104895 -321346 -197666 329295 -241877 24374
16172A16534J29990r0331k0511f5154l73640B81343C5941a05473B0318d62040
$$ 116534 246524 156193 135682 -65154 -438794 281343 35941 -105473 20318 -462040
16161C512J89527d4095G5673b24842A7184L9308R6517l0253a48843g3795B27357
$$ 3512 193039 -44095 75673 -224842 17184 56492 153009 122756 -148843 -73795 227357
16149a41789A19074N4006a21021B27076L0184d8301j29040A61228a87169A07875
$$ -141789 119074 173080 -121021 227076 257260 -48301 -177341 161228 -187169 107875
16138B0852L21293b4301F7546f8757m5211o5046f5148q8096C29334d5475a5640
$$ 20852 342145 -24301 67546 -68757 -113968 -179014 -65148 -153244 329334 -45475 -15640
16126i7724H8450a64030J1796B88994j13116b13613j17582b5039C28423j39277
$$ -97724 88450 -164030 -152234 288994 175878 -213613 -331195 -25039 328423 189146
16116A89146i0936B52922b26343j42046f7745b3133q391C02721a27715a6510G7071
$$ 189146 -90936 252922 -226343 -368389 -67745 -23133 -31524 302721 -127715 -16510 77071
16104e278j2575F6225P4024o8266J82274A25281L7561b64002D1216c26665A90398
$$ -5278 -17853 66225 140249 71983 254257 125281 162842 -264002 41216 -326665 190398
16092g4803b442j06258q3405B28650H9914J18512K799L8540J0830d3221a7283
$$ -74803 -2442 -108700 -192105 228650 89914 208426 211225 249765 260595 -43221 -17283
16080B47787d6297P175J1220E7341J20728a1321D5184c8430l01875e4442r8261
$$ 247787 -46297 -39122 -27902 57341 178069 -11321 45184 -38430 -340305 -54442 -152703
16069a52703L2140G5073l1826a07806E9879h7151J9863j90583j44471B02327r7536
$$ -152703 -120563 75073 43247 -107806 59879 -87151 -67288 -257871 -402342 202327 104791
16058A04791l8891O2411b33921B16089f6343j46182c8619a3477A28062a06245
$$ 104791 65900 128311 -233921 216089 -66343 -212525 -38619 -13477 128062 -106245
16047a51230D29141b53567A76436K6729D5834a06963k19978a54858E1961i2165
$$ -151230 429141 -253567 176436 203165 45834 -106963 -326941 -154858 51961 -92165
16036c02465N6855I0260b2388B2355b66843m8266J52244m2000e2806J095j9397
$$ -302465 -245610 90260 -22388 22355 -266843 -315109 -162865 -204865 -52806 -51711 -71108
16025g1108l8534e3105A23356a03546B00723d45530D220J40697a00310m8082j92416
$$ -71108 -109642 -53105 123356 -103546 200723 -445530 4220 144917 -100310 -148392 -340808
16014c40808I0557d678k6261B1047J3630R5596J33754a63102O8862I6066e09233
$$ -340808 90557 -4678 -30939 21047 34677 130273 264027 -163102 -94240 96066 -509233
16002g4363A81535a16836A05259I964K70978b00792L5046j60773C8124e2931C76172
$$ -74363 181535 -116836 105259 9964 280942 -200792 -165746 -326519 38124 -52931 376172
15990A06404O5246D1505a92143b3558q5p0757C4214P6296R5339K35143j2491j80378
$$ 106404 171650 41505 -192143 -23558 -23643 -94400 34214 110510 205849 440992 428501 248123
15978B48123c56617A63748b1023j39215f7271L1732E4025a99931L6075K307A46557
$$ 248123 -356617 163748 -21023 -160238 -67271 -35539 54025 -199931 -163856 -161549 146557
15966b43451g9323j98871B648L5503j5952J13764J23460J56440c57846a55196
$$ -243451 -79323 -278194 2648 38151 22199 135963 259423 415863 -357846 -155196
15955a2216j34281A16019f3568G552e7082j02652C20703b62069C3637b6033j16000
$$ -12216 -146497 116019 -63568 7552 -57082 -159734 320703 -262069 33637 -26033 -142033
15944a42033A27914b0760o416k50700C0387J26972N5830e3551B8234b28463B96647
$$ -142033 127914 -20760 -27176 -277876 30387 157359 213189 -53551 28234 -228463 296647
15932c54171a1652j32792A50361b0832j54621c1308B65015a94858k04520a73551
$$ -354171 -11652 -144444 150361 -20832 -175453 -31308 265015 -194858 -399378 -173551
15921d0504A62090a6884k52226F4806i6953j81913A03280c7038k0564q47j92178
$$ -40504 162090 -16884 -269110 64806 -96953 -278866 103280 -37038 -57602 -58449 -250627
15910b50627A00835c5346j7028r2846K2465k79250a14336e3815A26828c61435
$$ -250627 100835 -35346 -52374 -145220 -122755 -402005 -114336 -53815 126828 -361435
15899a38622A01774K8838m5266c11461E5675k2643K22590a10164A021a36510l9345
$$ -138622 101774 130612 85346 -311461 55675 33032 255622 -110164 1021 -136510 -175855
15888a75855G3315M7539M50748b02262e7150A08801a26983O0997C42861p8933
$$ -175855 73315 120854 571602 -202262 -57150 108801 -126983 -65986 342861 263928
15878B63928a7151k57110C4418J11196f6936b5297k46242D513K5693Q7076D7809
$$ 263928 -17151 -274261 34418 145614 -66936 -25297 -271539 4513 30206 117282 47809
15866i8603M4255J6413D0049d59174a02759A56529k3838a72419l4214C02626d5961
$$ -98603 -54348 -37935 40049 -459174 -102759 156529 132691 -172419 -206633 302626 -45961
15854a94603L5238l9782P2705a9491A32975C072a47676K5716k2850j15344j03159
$$ -194603 -159365 -199147 -126442 -19491 132975 3072 -147676 -121960 -144810 -260154 -363313
15843c63313b8254k23781A07088a17270e4637C9466g9474O898B12009d9436l68169
$$ -363313 -28254 -252035 107088 -117270 -54637 39466 -79474 -72576 212009 -49436 -417605
15832d17605C13428F2243c1542A3686J72237b32756A00973M4925a35231o9008
$$ -417605 313428 62243 -31542 13686 185923 -232756 100973 145898 -135231 -204239
15822b04239f9679l35071j10217K44337a540l93802f6959m1116r1732A31686m607
$$ -204239 -69679 -404750 -514967 -270630 -1540 -395342 -66959 -108075 -199807 131686 127079
15811A27079O7103b38421j72653J7552a5818C78739A73755L2069a687C9367f2594
$$ 127079 194182 -238421 -411074 -393522 -15818 378739 173755 205824 -1687 39367 -62594
15799h9005q753l96219a54387E8806R6701c085l3478C75017a70485A08025a78573
$$ -89005 -97758 -493977 -154387 58806 155507 -3085 -36563 375017 -170485 108025 -178573
15787a50094O255E2543b46614d5061H8253d51119I2469a46019k8296F802b55842
$$ -150094 -143839 52543 -246614 -45061 88253 -451119 92469 -146019 -174315 6802 -255842
15775B41133c52802B33849a97504A58252a14587A91519a40353E2164d3269A35994
$$ 241133 -352802 233849 -197504 158252 -114587 191519 -140353 52164 -43269 135994
15764a49316a050B16309P5956j34348a74464Q0682j2148B39093r0455J08372G6809
$$ -149316 -1050 216309 292265 157917 -174464 -93782 -105930 239093 148638 257010 76809
15752a3131k2443A89628F802K0805b54655O3290b8091j80628j5682B8035M5842
$$ -13131 -35574 189628 6802 27607 -254655 -191365 -28091 -208719 -224401 28035 73877
15741G3877a46769E3722B6691b46202l675d1294j05587d8776B31922e160r481
$$ 73877 -146769 53722 26691 -246202 -249877 -41294 -146881 -48776 231922 -5160 -14641
15730a4641C25338C4773c7277j69463A61237G292e6018l79775c8577B7c4697D1676
$$ -14641 325338 34773 -37277 -206740 161237 7292 -56018 -435793 -38577 27 -34697 41676
15717B82854j08183e381o6862l3931G4573a57637O3934B29829b2001a0714A02774
$$ 282854 174671 -5381 -72243 -106174 74573 -157637 -93703 229829 -22001 -10714 102774
15705b18370a0801l7960A63651e5152B95103b5472h12C1204b7139F4921a60921
$$ -218370 -10801 -48761 163651 -55152 295103 -25472 -812 31204 -27139 64921 -160921
15693a5244B95258J51831A80077J46943F725K88100l6829e9579D5572d2562F8656
$$ -15244 295258 447089 180077 327020 6725 294825 257996 -59579 45572 -42562 68656
15681a16841A69605F9165N3173K79915b64837A94557f952B04674c8028B82156
$$ -116841 169605 69165 122338 402253 -264837 194557 -6952 204674 -38028 282156
15670A84871b07791C06517L644e2584C8353J03944C0063c7759A4183K0262M3717
$$ 184871 -207791 306517 310161 -52584 38353 142297 30063 -37759 14183 34445 78162
15659G8162K5774b04174P513j86672A87737I3799A8822c5570j69709R8046j90051
$$ 78162 103936 -204174 -196661 -383333 187737 93799 18822 -35570 -205279 -107233 -297284
15648b97284g3319a1736j35249H9771b7775C16275j22751r4616a43010B563d0003
$$ -297284 -73319 -11736 -146985 89771 -27775 316275 193524 98908 -143010 2563 -40003
15636A21373N2345k7392d3923j17433c4428k63663C9897b2726I1314M508a641
$$ 121373 173718 146326 -43923 -161356 -34428 -298091 39897 -22726 91314 95822 -1641
15624a56928G4099K1490J06975o5359D1700O9200f02421c0614g073k63786D60884
$$ -156928 74099 95589 202564 137205 41700 110900 -602421 -30614 -7073 -270859 460884
15612I0111A6791i2858K3031k5271A12934D7109f2667H7027p948M5738M5483b0889
$$ 90111 16791 -92858 -69827 -95098 112934 47109 -62667 87027 79079 124817 170300 -20889
15599E05503a30121q9669O5627A86358a0361p4934I2110J58498i5099C2246e4754
$$ 505503 -130121 -219790 -154163 186358 -10361 -85295 92110 250608 -95099 32246 -54754
15587a57764p0554a9220l30179D1949a25924D9019i1264j86140A84051a67608
$$ -157764 -228318 -19220 -349399 41949 -125924 49019 -91264 -277404 184051 -167608
15576a4266j5372m45292A94395b66782E8378K38057j02796g5435C0935a15717
$$ -14266 -29638 -474930 194395 -266782 58378 296435 193639 -75435 30935 -115717
15565h7236A754L7209O9931M7267F3383N2489c61046J09600A59075q269f9749
$$ -87236 1754 38963 108894 156161 63383 115872 -361046 -251446 159075 150806 -69749
15553b12415N7546a0707F4516d2820B80680a63396k032I5802K6401l2084a46269
$$ -212415 -154869 -10707 64516 -42820 280680 -163396 -165428 95802 122203 90119 -146269
15541a62583f6792r4075j646A36331e2313m822A58922D1871i6241B87092a76126
$$ -162583 -66792 -160867 -162513 136331 -52313 -57135 158922 41871 -96241 287092 -176126
15529B19175E2753O901B3654a14602k9054e301B63020j03585B8846a97966f0950
$$ 219175 52753 59654 23654 -114602 -143656 -5301 263020 159435 28846 -197966 -60950
15517B28036a54771A48449d07999b2369B84445A0808D360P9641a29623e1325A0226
$$ 228036 -154771 148449 -407999 -22369 284445 10808 4360 84001 -129623 -51325 10226
15505i0677B56441a36455B36516A9200N0793i3963H6043Q07J15044F1430a91101
$$ -90677 256441 -136455 236516 19200 69993 -93963 86043 86850 201894 61430 -191101
15493a31274F2931K02123B1283a54140O4245n4559d6346J026A96245j0791f8519
$$ -131274 62931 265054 21283 -154140 -89895 -144454 -46346 -45320 196245 185454 -68519
15481H1605K9168m0395j9023m128a08851j85029c8381a2240D01000j07324M2707
$$ 81605 110773 70378 51355 47227 -108851 -293880 -38381 -12240 401000 293676 336383
15470C36383A7043c02041l229C16731a90071D18060a12254D4343b57016P9421
$$ 336383 17043 -302041 -305270 316731 -190071 418060 -112254 44343 -257016 -177595
15460a77595j66362c2608c706m54915A24915f8158H991J24796J09432j08781d7055
$$ -177595 -343957 -32608 -3706 -458621 124915 -68158 8991 133787 243219 134438 -47055
15448A65485d213q2233C7543J26891D0170J0578c6013G714Q2708J77966P3415
$$ 165485 -4213 -86446 37543 164434 40170 50748 -36013 7714 90422 268388 341803
15437C41803j06437d02804I6986f2193C64372d06271A17978b56386c3617B23345
$$ 341803 235366 -402804 96986 -62193 364372 -406271 117978 -256386 -33617 223345
15426G6249a58610K3841E9386a69583g3600E9550j5816N0146c9746A45759C1742
$$ 76249 -158610 -134769 59386 -169583 -73600 59550 43734 93880 -39746 145759 31742
15414C07789c11049A87626j4024a64424A10514p21K04713A36696J89907C0335
$$ 307789 -311049 187626 173602 -164424 110514 109793 314506 136696 326603 30335
15403D8011f1493D4773J42984c4759I9171N2262J01774q1751b0244K71A05205
$$ 48011 -61493 44773 187757 -34759 99171 151433 253207 171456 -20244 -19973 105205
15391C77969j46399b71938C03022k4787b22796C16020b998A6516b01008A11644
$$ 377969 231570 -271938 303022 278235 -222796 316020 -2998 16516 -201008 111644
15380d7397J1562l02898B35315G5482a33433A21109a62609D3233b2267A4884L29433
$$ -47397 -35835 -338733 235315 75482 -133433 121109 -162609 43233 -22267 14884 344317
15369C44317J43588a04512M4655A4406a69126c7009l82779B19472j3765c15604
$$ 344317 487905 -104512 -59857 14406 -169126 -37009 -419788 219472 205707 -315604
15358C10438J14689i650k6955H0702a24909d7035A35714n5780a58672N9662M7958
$$ 310438 425127 -9650 -36605 80702 -124909 -47035 135714 79934 -158672 -99010 -51052
15347e1052b0602B55625H7437L0408a0618G2041c53936a5950G3545i4283J7774
$$ -51052 -20602 255625 87437 117845 -10618 72041 -353936 -15950 73545 -94283 -76509
15336g6509l51545C3404O2482a31322E037a37664C43910p7694b05983A08024J27938
$$ -76509 -428054 33404 95886 -131322 5037 -137664 343910 266216 -205983 108024 235962
15325B35962r5735F2335c3988C92909A67194a97177B80038a90658D07965a29424
$$ 235962 140227 62335 -33988 392909 167194 -197177 280038 -190658 407965 -129424
15314c2938j61850d5602k69366K8125K3448c9274j51977c4816j2311A52896a88941
$$ -32938 -194788 -45602 -314968 -286843 -263395 -39274 -191251 -34816 -47127 152896 -188941
15302b567m8703F43869H6097b4987q931C64703L1553g963B6440a71681D7795K21309
$$ -2567 -51270 643869 86097 -24987 -33918 364703 396256 -7963 26440 -171681 47795 269104
15290B69104d9781A50233r45P9663a53855B30506L6311M6531j13168o5992J69607
$$ 269104 -49781 150233 149288 228951 -153855 230506 266817 313348 200180 134188 303795
15279C03795A51151Q158k3769n4638M71099B15330a20610B5479Q1270D7593h4717
$$ 303795 151151 159309 135540 80902 552001 215330 -120610 25479 106749 47593 -84717
15267C04118b4915C06071I389K33366a3598B7046i0471A94023H9913A1104c5887
$$ 304118 -24915 306071 9389 242755 -13598 27046 -90471 194023 89913 11104 -35887
15255C5670P8802a53001B44762r5544J27005f5076B30199L97275L26259P09005
$$ 35670 114472 -153001 244762 149218 276223 -65076 230199 627474 953733 1662738
15245A662738m36251k95353N54922F18084k00386j19405q4085r32A06282K05787
$$ 1662738 1226487 931134 1486056 618084 417698 298293 214208 213276 106282 312069
15235C12069J20667c7583A16526g514G03743A84797e1906A55049M34843E0001
$$ 312069 432736 -37583 116526 -7514 703743 184797 -51906 155049 589892 50001
15224H0586K38670M6170j38922a67597A82428J36133e9381J664C10842e4074D25276
$$ 80586 319256 365426 226504 -167597 182428 318561 -59381 -57717 310842 -54074 425276
15212B75612D5734L9975b13743A83611k2040J95898f9778A21220M4647i551B43887
$$ 275612 45734 85709 -213743 183611 161571 357469 -69778 121220 165867 -9551 243887
15200I6229K80433A3330L3687A7129J93820g0724D34538a31685f1489D84392n9936
$$ 96229 376662 13330 47017 17129 210949 -70724 434538 -131685 -61489 484392 424456
15189D24456A56308D8297M00059j16524C5384j0081L61553j19297B9485a14277
$$ 424456 156308 48297 448356 331832 35384 25303 386856 267559 29485 -114277
15178a23841h150B17196P0114J57947a80877A5950K44890f6694A71994j953b65972
$$ -123841 -8150 217196 287310 445257 -180877 15950 260840 -66694 171994 170041 -265972
15166C45793a65365A19844D1063L08608j69262m0839a7605E82301B04125J3908
$$ 345793 -165365 119844 41063 349671 180409 139570 -17605 582301 204125 218033
15156B18033J62950f4360b034B11596J31634F3246L2331Q479J66580G073K60108
$$ 218033 380983 -64360 -2034 211596 343230 63246 95577 104056 270636 7073 267181
15145B67181a54969F2574P7334J37249K4456L88775A25545D3295K51329D7020
$$ 267181 -154969 62574 139908 277157 301613 690388 125545 43295 294624 47020
15134A42238g2531C358J04519K4008n945l099O5741K39683J80817A88513J8276
$$ 142238 -72531 3358 107877 131885 125940 122841 188582 428265 609082 188513 206789
15123B06789p1057N0854a92707B11930l40I1144J36167F3151L46627j97228L04325
$$ 206789 135732 186586 -192707 211930 211590 91144 227311 63151 409778 212550 516875
15112E16875A04735K9522a86820B97829G5342J27963l8742b4160B50126I3476
$$ 516875 104735 134257 -186820 297829 75342 203305 164563 -24160 250126 93476
15101D4967J2935L76J13695J04794i9401D23485H0375K64851J6905l8799j08729
$$ 44967 57902 58278 171973 276767 -99401 423485 80375 345226 362131 323332 214603
15090B14603F1764C0780O991d8081B54265J25656j06625L45039A19890K0721m9354
$$ 214603 61764 30780 37771 -48081 254265 379921 273296 618335 119890 140611 91257
15079I1257K8652J13431J60409A24225E8812K35457J25218A83990N1322R2380
$$ 91257 119909 233340 393749 124225 58812 294269 419487 183990 235312 327692
15069C27692J03842h99C57600j74457i828B35677J88961b4958B82105j40914b8895
$$ 327692 431534 -899 357600 183143 -9828 235677 424638 -24958 282105 141191 -28895
15057A45168D5493J17377G6385K55537q338J0442K39477B26854r086l4407B395
$$ 145168 45493 162870 76385 331922 323584 334026 573503 226854 217768 183361 2395
15045A99972H9083R8655L63484A5305J67775F1052B7876M8649J76805K21818C3878
$$ 199972 89083 187738 551222 15305 183080 61052 27876 76525 253330 475148 33878
15033B72701K9979J40538A05057M6294i3782D60803I2987N29165l10969N7595
$$ 272701 302680 443218 105057 151351 -93782 460803 92987 622152 311183 368778
15023C68778P7087A41643K59048r6306j08153n2990K9320J59489j41801M439K75632
$$ 368778 445865 141643 400691 304385 196232 143242 172562 332051 190250 194689 470321
15012D70321J5590j48680F3707M30582j90407c5216A81484D8100K01700A03964
$$ 470321 485911 337231 63707 494289 303882 -35216 181484 48100 249800 103964
15001B33297O9989N0854r7354F3782h6491C42717A18833J81922l0899R2048l6569
$$ 233297 303286 354140 256786 63782 -86491 342717 118833 300755 269856 361904 325335
14990C25335j26216J42384j48611K02824j50153K84952n6953k658k01344f938
$$ 325335 199119 341503 192892 395716 245563 530515 473562 470904 269560 -6938
14979D99013A81294J27494M3642N6366J07078L6496A70511J56682n0957M50598
$$ 499013 181294 308788 352430 408796 515874 552370 170511 327193 276236 726834
14969G26834k98776j61434N6254J90850D7057J36197N02618k00151B09652L74738
$$ 726834 428058 266624 322878 513728 47057 183254 685872 485721 209652 584390
14959E84390B23141K66207A02178J95287j38142J06477K68922k31234J53800M215
$$ 584390 223141 489348 102178 297465 159323 265800 534722 303488 457288 461503
14949D61503j54574j2768j5884J0851J00990j48987K18451k01245K70060B32044
$$ 461503 306929 294161 278277 289128 390118 241131 459582 258337 528397 232044
14938C67453M4476j03237n1825J03482J8413j71234J90908l941K7012N9445k0437
$$ 367453 411929 308692 256867 360349 378762 207528 398436 394495 421507 480952 460515
14927D60515j3304H5624M69650B39277L08391j9232r5804K24436C06680J24458
$$ 460515 447211 85624 555274 239277 547668 528436 432632 657068 306680 431138
14917D31138K0866M608B12575M2234K21489r9618J07075J9570r3058K24207K7341
$$ 431138 452004 456612 212575 254809 476298 376680 483755 503325 410267 634474 661815
14906F61815k40409j68184L0924J52495K85539k99081J07303J32619k60048J36830
$$ 661815 421406 253222 284146 436641 722180 423099 530402 663021 402973 539803
14896E39803J14651A49476N27274j20410j76947L68399C3542M64515M1589j10286
$$ 539803 654454 149476 676750 556340 379393 747792 33542 498057 539646 429360
14886D29360J61694j49759K6283J19393J68735p2510k53368J99518J9376l00369
$$ 429360 591054 441295 467578 586971 755706 683196 429828 629346 648722 348353
14876C48353J8084J79499p4820j38048L00555J81034C27384L3222R0121B10538
$$ 348353 366437 545936 471116 333068 633623 814657 327384 360606 450727 210538
14865B76707L60017j0769k87564k4593J99190l394k39434K13955R1810k80624
$$ 276707 636724 625955 338391 313798 512988 509594 270160 484115 575925 295301
14855B95301J15450J59217k37633K70885J73789k98896K675J55523K32075l29042
$$ 295301 410751 569968 332335 603220 777009 478113 480788 636311 868386 539344
14845E39344o7806J13727J51768j04929j08148j13000O13653m80972J52558n5229
$$ 539344 471538 585265 737033 632104 523956 410956 1024609 543637 696195 640966
14835F40966k22617K65444k87530N48834C16007J26945N0489J59060p8722j17552
$$ 640966 418349 683793 396263 945097 316007 442952 493441 652501 573779 456227
14825D56227L64721k48830N122J56991k748C62056K48648K52436k06379j81618
$$ 456227 820948 572118 577240 734231 731483 362056 610704 863140 656761 475143
14815D75143J00963K73731j42044j31448J19514J39651D02929J19042J17456K65252
$$ 475143 576106 849837 707793 576345 695859 835510 402929 521971 639427 904679
14805I04679o2320K50774D59921L96297k99280M2322K14323k24494j1552l5117
$$ 904679 842359 1093133 459921 856218 556938 599260 813583 589089 577537 542420
14795E42420M68198l11411j20408K75276l93388L69931k24581J2500K35665j37965
$$ 542420 1010618 699207 578799 854075 460687 830618 606037 618537 854202 716237
14785G16237J72388k78107K21564l56144M28270j37159L95513m37775P14J38236
$$ 716237 888625 610518 832082 475938 904208 767049 1162562 724787 725501 863737
14775H63737K11034j41653P3674m49372J75652j27086J00681J86027j12370m8274
$$ 863737 1074771 933118 1006792 557420 733072 605986 706667 892694 780324 732050
14765G32050K72779m49086M1662J74630j45469K27674L18432j56751m81074J52380
$$ 732050 1004829 555743 597405 772035 626566 854240 1172672 1015921 534847 687227
14755F87227J41432J43276j07406K0493r6869K81242j53018r3458p2134K74934
$$ 687227 828659 971935 864529 885022 788153 1069395 916377 822919 750785 1025719
14745A025719j10902K32108m50673M12309j20132P2847l9457k41892j67978M77065
$$ 1025719 914817 1146925 696252 1108561 988429 1061276 1021819 779927 611949 1089014
14735A089014k20314J39229R7225K7228j41146p7419K06931o9397k22237L07356
$$ 1089014 868700 1007929 1105154 1132382 991236 913817 1120748 1051351 829114 1136470
14725A136470l82072J83086r1771r169K4920J92513o3030j49853r3100M49716
$$ 1136470 754398 937484 845713 836544 861464 1053977 990947 841094 747994 1197710
14715A197710k78845o2871M46214j00390m5316k70484J64089N34983k42831m65096
$$ 1197710 918865 855994 1302208 1201818 1156502 886018 1050107 1585090 1342259 877163
14705H77163n146K18679k2378R6445M5603r9827q7263K31366J5354l32405M00101
$$ 877163 872017 1090696 1068318 1164763 1210366 1110539 1023276 1254642 1269996 937591 1337692
14694A337692k99318L74073j53429Q9802j52175K66576n05523M02226l40886J21882
$$ 1337692 1038374 1412447 1259018 1348820 1196645 1463221 957698 1359924 1019038 1140920
14684A140920O38659o07935J53286j51371K75790M8009L8525k12628j0938M1661
$$ 1140920 1779579 1171644 1324930 1173559 1449349 1497358 1535883 1323255 1312317 1353978
14674A353978m01855j1494O61394m69288M11943k070J24801l57042L55826j82892
$$ 1353978 952123 940629 1602023 1132735 1544678 1542608 1667409 1310367 1666193 1483301
14664A483301Q2570n7952k9343o2976m1647J84057Q7566m00758M02786o9245J86713
$$ 1483301 1565871 1507919 1478576 1415600 1373953 1558010 1645576 1244818 1647604 1578359 1765072
14653A765072j41079J45765j13790l7725o059j25216M9657J57964m09060K85591
$$ 1765072 1623993 1769758 1655968 1618243 1612184 1486968 1536625 1694589 1285529 1571120
14643A571120J9873k35698R7624L26381r2752J91303k974k46898j22024J56314
$$ 1571120 1590993 1355295 1452919 1779300 1686548 1877851 1874877 1627979 1505955 1662269
14633A662269K11951j81391K0485L63540Q8851l95352P0740J8725P2113k6197
$$ 1662269 1874220 1692829 1713314 2076854 2165705 1770353 1841093 1859818 1931931 1905734
14623A905734l43657P12498m68794K81666j8500j33321J47747k17123k5363P7327
$$ 1905734 1562077 2274575 1805781 2087447 2068947 1935626 2083373 1866250 1840887 1918214
14613A918214O8996k76258J29116J03082k88247K94637N19639j76696m31015L72050
$$ 1918214 1987210 1710952 1840068 1943150 1654903 1949540 2469179 2292483 1861468 2233518
14603B233518j94491N7202L89323m74370J64655j02504L79444J27500k44247P5902
$$ 2233518 2039027 2096229 2485552 2011182 2175837 2073333 2452777 2580277 2336030 2411932
14593B411932J69028j3032j14270k59633M16021j94815M9412P0913l3353L56574
$$ 2411932 2580960 2567928 2453658 2194025 2610046 2415231 2464643 2535556 2502203 2858777
14583B858777j34193j74173q6758L31152j18802J20184l07201K64787j944o9514
$$ 2858777 2724584 2550411 2463653 2794805 2676003 2796187 2488986 2753773 2751829 2682315
14573B682315K40746j74403M08375r4166K7857k45716R1643R7542p5873N57075
$$ 2682315 2923061 2748658 3157033 3062867 3090724 2845008 2936651 3034193 2958320 3515395
14563C515395r1198K22905m87274M81124o9693j27282J90394K26578J43406L93613
$$ 3515395 3424197 3647102 3159828 3640952 3571259 3443977 3634371 3860949 4004355 4397968
14553D397968j37445Q04211L61109O57548J881883L392213O917881J6580041J2186212
$$ 4397968 4260523 5064734 5425843 6083391 7965274 11357487 18275368 34855409 47041621
14544D7041621B0806823A0065326k846679l435717m93013o57452K91851k84454
$$ 47041621 20806823 10065326 7218647 3782930 3289917 2632465 2924316 2639862
14536B639862j14852L14206K1087J94072J76004m02706N93927l5558l096k05812
$$ 2639862 2525010 2839216 2860303 3054375 3230379 2827673 3421600 3386042 3382946 3177134
14526C177134M3071K8261N1583L09060l46741K03719j49137L91328m31542M3018
$$ 3177134 3220205 3248466 3300049 3609109 3262368 3466087 3316950 3708278 3276736 3319754
14516C319754L16285m12839N96834j33293K07091l17465M91645k25413J28154
$$ 3319754 3636039 3223200 3820034 3686741 3893832 3576367 4068012 3842599 3970753
14507C970753k36981J95865L27778m62451L94676j43696o5733K0116N44559q3916
$$ 3970753 3733772 3929637 4257415 3794964 4189640 4045944 3980211 4000327 4544886 4460970
14497D460970j86587J23711r648k09388M14749p7723L69836K556k89299J17300
$$ 4460970 4274383 4398094 4388446 4179058 4593807 4516084 4885920 4888476 4599177 4716477
14487D716477J34304j04101J53021J31079P3913J5427j71215R5557O1161N5777
$$ 4716477 4850781 4746680 4899701 5030780 5104693 5120120 4948905 5044462 5105623 5161400
14477E161400K77311p0302K59135m3926p9679p2512L60367o4980L8491K0758J80544
$$ 5161400 5438711 5368409 5627544 5583618 5503939 5431427 5791794 5726814 5765305 5786063 5966607
14466E966607j62247L85231P1390J20509k11902J471O0461L58296q1413k49641
$$ 5966607 5804360 6189591 6260981 6381490 6169588 6171059 6231520 6589816 6508403 6258762
14456F258762K02476M67727p5259q4824J6709J74798J48964J35672K86427p57648
$$ 6258762 6461238 6928965 6853706 6768882 6785591 6960389 7109353 7245025 7531452 6773804
14446F773804M64411L19904k10288L97162O4497L6573k23352N50854J74880j40492
$$ 6773804 7238215 7558119 7347831 7744993 7809490 7846063 7622711 8173565 8348445 8207953
14436H207953N8519O18180o67510J86893J38233M25968n64515N69787J7161K80095
$$ 8207953 8266472 8884652 8217142 8404035 8542268 8968236 8403721 8973508 8990669 9270764
14426I270764k31827K40458K93471L7724J2703K80347L31770l11596L61845K68454
$$ 9270764 9038937 9279395 9572866 9610590 9623293 9903640 10235410 9923814 10285659 10554113
14416A0554113k75906N77573j21446J32094K83337J39369J84438J68668J51173
$$ 10554113 10278207 10855780 10734334 10866428 11149765 11289134 11473572 11642240 11793413
14407A1793413j7158M89971q0231L42566J9297L37861K75552K7781L97049R5552
$$ 11793413 11776255 12266226 12185995 12528561 12547858 12885719 13161271 13189052 13586101 13681653
14397A3681653q3787K27963J89642J95359L17592L30631K89334L76613P6954j18936
$$ 13681653 13597866 13825829 14015471 14210830 14528422 14859053 15148387 15525000 15601954 15483018
14387A5483018O48770K39700J37294L91874Q5947L36674L01883J63992K82546
$$ 15483018 16131788 16371488 16508782 16900656 16986603 17323277 17625160 17789152 18071698
14378A8071698N38696K77825P18539k10194N45606L32260J05531P61544J57634
$$ 18071698 18610394 18888219 19606758 19396564 19942170 20274430 20379961 21141505 21299139
14369B1299139N54759O70162M38716J20045P11371N2617Q11345N64981K67389
$$ 21299139 21853898 22524060 22962776 23082821 23794192 23846809 24658154 25223135 25490524
14360B5490524O23125L02019L87164Q43568K72906N47528P34161Q07609L73556
$$ 25490524 26113649 26415668 26802832 27646400 27919306 28466834 29200995 30008604 30382160
14351C0382160Q89753O57341O79422Q98156O42523R42961O95867O01545M94488
$$ 30382160 31271913 31929254 32608676 33506832 34149355 35092316 35788183 36389728 36884216
14342C6884216J462176Q93292Q79722R12946J180693J186808R16235J115852J547592
$$ 36884216 38346392 39239684 40119406 41032352 42213045 43399853 44316088 45431940 46979532
14333D6979532J115834J190379J482996R19124J683810J716313J467797J597119
$$ 46979532 48095366 49285745 50768741 51687865 53371675 55087988 56555785 58152904
14325E8152904J732554J921074J948256J521935K325526J860100K912074K203815
$$ 58152904 59885458 61806532 63754788 65276723 67602249 69462349 72374423 74578238
14317G4578238K583949K881516K506912L039489L142938L530163L007004L574472
$$ 74578238 77162187 80043703 82550615 85590104 88733042 92263205 95270209 98844681
14309I8844681L699337M255401M043182M656580M534908N195755N251497N343359
$$ 98844681 102544018 106799419 110842601 115499181 120034089 125229844 130481341 135824700
14301A35824700N758072N972747O764236O476318O852742Q159914P848266Q763545
$$ 135824700 141582772 147555519 154319755 160796073 167648815 175808729 183656995 192420540
14293A92420540Q697708R445871R861311J0668965J1375441J1353398J1829424
$$ 192420540 201118248 210564119 220425430 231094395 242469836 253823234 265652658
14286B65652658J2721405J3065255J3287831J3442955J4270507J5058734J4507266
$$ 265652658 278374063 291439318 304727149 318170104 332440611 347499345 362006611
14279C62006611J4976407J4539966J4593051J4040610J2968700J1773475R712188
$$ 362006611 376983018 391522984 406116035 420156645 433125345 444898820 454611008
14272D54611008N241126J482246J276299Q54924k306593k554846o002321j0166273
$$ 454611008 459852134 461334380 462610679 463465603 461159010 458604164 452601843 442435570
14264D42435570j2866732j4812479j5827491j6546410j6634014j7012623j6538324
$$ 442435570 429568838 414756359 398928868 382382458 365748444 348735821 332197497
14257C32197497j6333442j5956407j5251593j4819687j2799298j3501365j2450516
$$ 332197497 315864055 299907648 284656055 269836368 257037070 243535705 231085189
14250B31085189j2052086j1303937j1052677r467863r847294q438716q203823
$$ 231085189 219033103 207729166 196676489 187208626 177361332 168922616 160718793
14243A60718793p373774p708246o958052o183780o489491n266620n382695n346783
$$ 160718793 153345019 145636773 138678721 132494941 126005450 120738830 115356135 110009352
14235A10009352m592636m520191m427926m008069l268483l113399l577071l502680
$$ 110009352 105416716 100896525 96468599 92460530 89192047 86078648 82501577 78998897
14227G8998897l037108k955656k768310k391288k406709k501605k170229j865666
$$ 78998897 75961789 73006133 70237823 67846535 65439826 62938221 60767992 58902326
14219E8902326k221544j641723j959255j656446j618356j487568j203758j495144
$$ 58902326 56680782 55039059 53079804 51423358 49805002 48317434 47113676 45618532
14211D5618532j638576j262423j395411j064191q18660j282428j192941q39606
$$ 45618532 43979956 42717533 41322122 40257931 39439271 38156843 36963902 36124296
14203C6124296j207930j039664r39157l67048r63783j136097j092187n83018o29887
$$ 36124296 34916366 33876702 32937545 32570497 31606714 30470617 29378430 28795412 28165525
14194B8165525n13621o61621l16166j006557p59179n59719p67845k39388o20489
$$ 28165525 27651904 26990283 26674117 25667560 24908381 24348662 23580817 23341429 22720940
14185B2720940o23725l36688m95711o11436j67452n24419p92220j75180m41342
$$ 22720940 22097215 21760527 21264816 20653380 20485928 19961509 19169289 18994109 18552767
14176A8552767k18488k60995n22970l89276k52612o30921n3179n99408N4857o75330
$$ 18552767 18334279 18073284 17550314 17161038 16908426 16277505 16224326 15624918 15679775 15004445
14166A5004445J42632m05947m11522k16379n7197n17658N2026j35367n83157Q773
$$ 15004445 15147077 14741130 14329608 14113229 14056032 13538374 13590400 13455033 12871876 12880649
14156A2880649k19523n09097o1294k4338l76383J1385k37769l25864j37973l47849
$$ 12880649 12661126 12152029 12090735 12066397 11690014 11701399 11463630 11137766 10999793 10651944
14146A0651944N2673m49785J97917J89826m75007k58583l55013n5014J37690k23747
$$ 10651944 10704617 10254832 10452749 10642575 10167568 9908985 9553972 9498958 9636648 9412901
14136I412901l42403J37752j8890m95586j59490j28986J0791K24636n59027K90375
$$ 9412901 9070498 9208250 9189360 8693774 8534284 8405298 8416089 8640725 8081698 8372073
14126H372073o01965P3295k40449L73507m30117J40079l29386j43035K09744k02475
$$ 8372073 7770108 7843403 7602954 7976461 7546344 7686423 7357037 7214002 7423746 7221271
14116G221271l25129m590L1621l80906k26281M33850k7396k60839p4698j58523
$$ 7221271 6896142 6891552 6923173 6542267 6315986 6749836 6722440 6461601 6386903 6228380
14106F228380j83806K93920m95455O8295l81992M07088L194m958l59551J2549
$$ 6228380 6044574 6338494 5843039 5911334 5529342 5936430 5939624 5934666 5575115 5587664
14096E587664j43474l1651k26094J77202k90247j52591M51188l93575j63563j0717
$$ 5587664 5444190 5412539 5186445 5363647 5073400 4920809 5371997 4978422 4814859 4804142
14086D804142J46145Q567k5643k4398n21175N41838k98639l7078L42021o28198
$$ 4804142 4950287 4958854 4933211 4908813 4387638 4929476 4630837 4593759 4935780 4307582
14076D307582K92471j93264j03436k27722L48633m47267K32989k21632j61975
$$ 4307582 4600053 4406789 4303353 4075631 4424264 3976997 4209986 3988354 3826379
14067C826379M9338J00686j71814j44597J13850Q081J47795k65814M9295p0663
$$ 3826379 3875717 3976403 3804589 3659992 3773842 3781923 3929718 3663904 3713199 3642536
14057C642536Q7010n2863p7347K4501j92746J8428N6126J5777r2657j38679j14986
$$ 3642536 3729546 3676683 3599336 3623837 3431091 3449519 3505645 3521422 3428765 3290086 3175100
14046C175100N2727O3463k78537L84880j6987k96879m5835N0006J59994l29166
$$ 3175100 3227827 3291290 3012753 3397633 3380646 3083767 3037932 3087938 3247932 2918766
14036B918766O8516o8828n8633n2812J45105K34952j1510m80219K02833J00114
$$ 2918766 2987282 2918454 2859821 2807009 2952114 3187066 3175556 2695337 2898170 2998284
14026B998284l35958O1512k7263Q933J15104j33245l0338k72432L21552j74246
$$ 2998284 2662326 2723838 2696575 2705508 2820612 2687367 2657029 2384597 2706149 2531903
14016B531903l66016K14765j68373M80107k36506p2679M730j26216K93154o3432
$$ 2531903 2165887 2380652 2212279 2692386 2455880 2383201 2387931 2261715 2554869 2491437
14006B491437j09356K06690k12929j72752L03475j59053L7414j05541J54931j35167
$$ 2491437 2382081 2588771 2375842 2203090 2506565 2347512 2384926 2279385 2434316 2299149
13996B299149j54557K82238j05332l8141K36143j32660M97538N42452K708704
$$ 2299149 2144592 2426830 2321498 2283357 2519500 2386840 2884378 3426830 6135534
13987F135534N342179J5444221K1254554k1931286A2651544n361701k144687j069273
$$ 6135534 11477713 26921934 48176488 26245202 12651544 7289843 5145156 4075883
13979D075883m61217m54268j32758l8954n72956K07177J56868m35102j47215K6841
$$ 4075883 3614666 3160398 3027640 2988686 2415730 2622907 2779775 2344673 2197458 2224299
13969B224299J48677M550j79189K19158k96799k04236K32583j60597L86620l11720
$$ 2224299 2372976 2377526 2198337 2417495 2120696 1916460 2149043 1988446 2375066 2063346
13959B063346j17443K21617k30059J86039k10868j63263K30932L8743j81807p7522
$$ 2063346 1945903 2167520 1937461 2123500 1912632 1749369 1980301 2019044 1837237 1759715
13949A759715l43720K09646L51169j69171m6047j37360j11871k06370L17703L56236
$$ 1759715 1415995 1625641 1976810 1807639 1761592 1624232 1512361 1305991 1623694 1979930
13939A979930m68500j30777K86382L02904q8404j37441n3651o4849j31550j13407
$$ 1979930 1511430 1380653 1667035 1969939 1881535 1744094 1690443 1625594 1494044 1380637
13929A380637K82918l44071L23341j47404j80062J74482k51775M55334k75860
$$ 1380637 1663555 1319484 1642825 1495421 1315359 1489841 1238066 1693400 1417540
13920A417540K00331P6122m91432N15621p6459J5455r8722k43619q0224O0868
$$ 1417540 1617871 1693993 1202561 1718182 1641723 1657178 1558456 1314837 1234613 1295481
13910A295481J84904M2448j79414k10749K50554k9226j1878O2184k34467J98917
$$ 1295481 1480385 1522833 1343419 1132670 1383224 1353998 1342120 1404304 1169837 1368754
13900A368754j28923r9201k61703K40659J20959l55774o0695O39101m44636K04068
$$ 1368754 1239831 1140630 878927 1119586 1240545 884771 824076 1463177 1018541 1222609
13890A222609o0200j78969M62237j71225j41819K37166k51533N7932k13861l2232
$$ 1222609 1162409 983440 1445677 1274452 1132633 1369799 1118266 1176198 962337 930105
13880I30105L23145m8139r2211j49098M2963J0247M1984J00610k4868j23872K09232
$$ 930105 1253250 1205111 1112900 963802 1006765 1017012 1058996 1159606 1134738 1010866 1220098
13869A220098j01735j08054k02494R0538J79791k53207J90560J27907k41431k2413
$$ 1220098 1118363 1010309 807815 898353 1078144 824937 1015497 1143404 901973 879560
13859H79560j57108J97668L78910j35722l68168J94420j97827j551Q9837r6292
$$ 879560 722452 920120 1299030 1163308 795140 989560 791733 790182 880019 783727
13849G83727J78919M06253n90028o8476L55335r1463J63328l46150L94192K7951
$$ 783727 962646 1368899 778871 710395 1065730 974267 1137595 791445 1185637 1213588
13839A213588j19501j96711J27239j30392K73194l30364o1637L56651n0904k30662
$$ 1213588 1094087 897376 1024615 894223 1167417 837053 775416 1132067 1081163 850501
13829H50501O8047k7312o2988o7108j36434L67173l06644K07276L1441o153k53354
$$ 850501 918548 891236 828248 761140 624706 991879 685235 892511 923952 917799 664445
13818F64445m7809L68184D91499N21039N9168l12064k02373K55549k19632L24669
$$ 664445 616636 984820 491499 1012538 1071706 759642 557269 812818 593186 917855
13808I17855q580M8286j40813k00843M77213j85586N5044D23191O9899M29979
$$ 917855 909275 957561 816748 615905 1093118 907532 962576 423191 493090 923069
13798I23069m41379O50894k38500k96067j02450m1264N69027l88532K65799m9044
$$ 923069 481690 1132584 894084 598017 495567 454303 1023330 634798 900597 851553
13788H51553l36641J87447O5775O9938J05754D19842L17028C06414N62961k76453
$$ 851553 514912 702359 768134 838072 943826 419842 736870 306414 869375 592922
13778E92922Q2000J4183M1055k55227J65690j9599k33664M06120k97400M90106
$$ 592922 674922 689105 730160 474933 640623 621024 387360 793480 496080 986186
13768I86186k38524n8930L31584j88699j96225j86573K29253k78969K95582j79214
$$ 986186 747662 688732 1020316 831617 635392 448819 678072 399103 694685 515471
13758E15471L08840C91406R4833L2393j93497L24740n7617J41635j63276K3793
$$ 515471 824311 391406 486239 518632 325135 649875 592258 733893 570617 594410
13748E94410R8982j00179J7253m6077Q0117o2903j02750r2552L26420j34578L9755
$$ 594410 693392 593213 610466 564389 644506 581603 478853 386301 712721 578143 617898
13737F17898q7108j53233P9392M58692m09516J05250k254J55244C21535L08890
$$ 617898 530790 377557 456949 915641 506125 611375 609121 764365 321535 630425
13727F30425j88102Q3449o2051J0313N9900Q7283j85905L38683B68803L85693
$$ 630425 442323 525772 463721 474034 533934 621217 435312 773995 268803 654496
13717F54496r8846j48603J84299L885L8603l13480J40286J45947j01824K80734
$$ 654496 555650 407047 591346 595231 633834 320354 460640 606587 504763 785497
13707G85497C46420L34412k52233j54748J0263J96916M9831A45597L72136J29108
$$ 785497 346420 680832 428599 273851 284114 481030 530861 145597 517733 646841
13697F46841r6231J80273B38251K03584K40667j63661l8458O7040k68039J2627
$$ 646841 550610 730883 238251 441835 682502 518841 480383 547423 279384 292011
13687B92011N80298C58131M60998j0700j60141k52597n6430j9074A52604L44205
$$ 292011 872309 358131 819129 808429 648288 395691 339261 320187 152604 496809
13677D96809l6752j22263J9383R1473K14369C12684J91762J03139B94098l8601
$$ 496809 460057 337794 357177 448650 663019 312684 504446 607585 294098 255497
13667B55497J89920K44692C31885n9547K7497J04052K51934k58297J84755j12560
$$ 255497 445417 690109 331885 272338 299835 403887 655821 397524 582279 469719
13657D69719k01684L13389r1253q7562A56145J92531N1338j89681o3003l1601
$$ 469719 268035 581424 490171 402609 156145 348676 400014 210333 147330 115729
13647A15729j233L2461L86979k04175j44455M035K87441j58314J82417J77926
$$ 115729 114496 146957 533936 329761 185306 189341 476782 318468 500885 678811
13637F78811B27311K54122M9601p9079k0566J90984B38195K98392n6162A36082
$$ 678811 227311 481433 531034 451955 431389 622373 238195 536587 480425 136082
13626D6928K56652O4487j17297d2677B69146J82955L58766l94850E4818L89916
$$ 46928 303580 368067 250770 -42677 269146 452101 810867 416017 54818 444734
13616D44734m2532M9818m5721j04786G9721N11587k66527j58549P2414J37618
$$ 444734 402202 452020 406299 301513 79721 591308 324781 166232 238646 376264
13606C76264L2461A61585J29859j1973j12142R3594K71519l2391A50262K2397
$$ 376264 408725 161585 291444 279471 167329 260923 532442 500051 150262 172659
13596A72659J26416J52124O93j44061Q2200N2136q6125J22490H4152J30371G0141
$$ 172659 299075 451199 451892 307831 390031 442167 356042 478532 84152 214523 70141
13584A15947K31594r6529K10554D5423M46761k7183A93876J47036j21468E7497
$$ 115947 347541 251012 461566 45423 492184 465001 193876 340912 219444 57497
13573D21772J6985J04543j02082H0109K46800K5653H9702b6620B93587J2108a43669
$$ 421772 438757 543300 441218 80109 326909 352562 89702 -26620 293587 305695 -143669
13561A73863F2819K24537A5611M4257M51754k4455P465B15425K18701p7764H7424
$$ 173863 62819 287356 15611 59868 511622 487167 494632 215425 434126 356362 87424
13549B17876H6461k7421J91897K9660F7673M0315J45293m852J30245i8007B15008
$$ 217876 86461 59040 250937 280597 67673 107988 253281 248429 378674 -98007 215008
13537F002K31572q3230E474M15259A97692N5113j3276l5292B8783M80295K8635
$$ 6002 237574 154344 5474 420733 197692 252805 239529 204237 28783 509078 537713
13526E37713j83738p0649K62990k70896d1485A88884G666J68661j0260L91174
$$ 537713 353975 283326 546316 275420 -41485 188884 7666 176327 166067 557241
13516E57241G7556J23240J8185B9331J73349J41454o195R9570H9893P8093E5706
$$ 557241 77556 200796 218981 29331 202680 344134 337939 437509 89893 167986 55706
13504D86271j75528K62451B22810j02239K93986A08370N1030K41609j55024A0299
$$ 486271 310743 573194 222810 120571 414557 108370 159400 401009 245985 10299
13493H32756A81788J13543L63732A73921J27869i1444E9613J91704l2817J09855
$$ 832756 181788 295331 659063 173921 301790 -91444 59613 251317 218500 328355
13483C28355A48446L44737j80444K06978k29265I3345R2264n7787a7766C62035
$$ 328355 148446 493183 312739 519717 290452 93345 185609 127822 -17766 362035
13472D43897B05404k769J05803m7055h7453A89546J72903K88515q7593k16402
$$ 443897 205404 202635 308438 261383 -87453 189546 362449 650964 563371 346969
13462C46969B4178J66685p4911a29775B65661A04326J87096J27241j50667C1334
$$ 346969 24178 190863 115952 -129775 265661 104326 291422 418663 267996 31334
13451C05493F6582R2455K01728D6860M81320a42246I6899L04867A48597J9608
$$ 305493 66582 159037 360765 46860 528180 -142246 96899 401766 148597 168205
13441A68205l8205K0086P900M21374B77799f8994A49035K78746o049J15892k07668
$$ 168205 130000 150086 157986 579360 277799 -68994 149035 427781 421732 537624 329956
13430C29956O3879j10926f3180B81721k2366a03376A19817M90795h3329j75601
$$ 329956 393835 282909 -63180 281721 259355 -103376 119817 610612 -83329 -258930
13420b58930B76816C8957J82112Q4449A48698L52814A41183c0630A58957m3397
$$ -258930 276816 38957 221069 305518 148698 501512 141183 -30630 158957 115560
13410A15560k2263b91458R743A27548J34677q8443a83601b9441A31429J56983
$$ 115560 93297 -291458 -281715 127548 262225 173782 -183601 -29441 131429 288412
13400B88412b19104B01313I1760K08591j29329o7268J64266A04218M2801J07240
$$ 288412 -219104 201313 91760 300351 171022 103754 268020 104218 147019 254259
13390B54259h77D11996A73115m624J46981J04538a29181C20425j27109m6077J38989
$$ 254259 -877 411996 173115 168491 315472 420010 -129181 320425 193316 147239 286228
13379B86228j36197R4976K72910A75061M8006J51848q5381m3995L41936k76753
$$ 286228 150031 245007 517917 175061 223067 374915 289534 245539 587475 310722
13369C10722q3345D642Q0532J39424n9563e3756A14859a48095A73243K87655p8246
$$ 310722 227377 4642 85174 224598 165035 -53756 114859 -148095 173243 460898 382652
13358C82652C0942L65827G1436n849J65636G4570a10332A82458J69857r3714J01593
$$ 382652 30942 396769 71436 65587 231223 74570 -110332 182458 352315 258601 360194
13347C60194A16952b2570C54749H0504J63138j07010F7518J74142j5366A00244
$$ 360194 116952 -22570 354749 80504 243642 136632 67518 241660 226294 100244
13336B56408j18352m7011L1343K97355A63766B5095J53816L06913A47199N21903
$$ 256408 138056 91045 122388 419743 163766 25095 178911 485824 147199 669102
13326F69102j96231A53165a23676A91698R0932C6360K15313a35620B73596L3103
$$ 669102 472871 153165 -123676 191698 282630 36360 251673 -135620 273596 306699
13316C06699N8911J49510C4518K83464O4869o1601A46222K11425a55914H7563
$$ 306699 365610 515120 34518 317982 382851 321250 146222 357647 -155914 87563
13305I795K12737k5066a5689I8912O8328C2030L19079j2024J1329j47634R7622
$$ 9795 222532 197466 -15689 98912 167240 32030 351109 339085 350414 202780 300402
13294C00402K48602d712B33575P919B029J25451n9307f4839a4968A75879d6719
$$ 300402 549004 -4712 233575 241494 2029 127480 68173 -64839 -14968 175879 -46719
13282C59969B3213L07311Q2466a32483A63160K65784A29547k9898J3251b2242
$$ 359969 23213 330524 412990 -132483 163160 428944 129547 99649 112900 -22242
13271a8774D9914D229J04924K68069G65d7779B33730k8105q3386J04089J7593
$$ -18774 49914 4229 109153 377222 765 -47779 233730 205625 122239 226328 243921
13260B43921a37228A35333m9023J23655c6585B73632h8979J3888A16134L08067
$$ 243921 -137228 135333 86310 209965 -36585 273632 -88979 -75091 116134 424201
13250D24201A68607L05745B12118h142j59384d0198D7130j3609J36812d5924J0962
$$ 424201 168607 474352 212118 -8142 -167526 -40198 47130 33521 170333 -45924 -34962
13239c4962B23114J60791p2690a79741D9935K80479a06150F9982K23294q0520
$$ -34962 223114 383905 311215 -179741 49935 330414 -106150 69982 293276 212756
13229B12756B9651J51932B8383a0465k91884f3519C00286j26643f2670j18905
$$ 212756 29651 181583 28383 -10465 -302349 -63519 300286 173643 -62670 -181575
13219a81575A26604J27384R52o2420e7170A52135K4100D1665d2851B41250f765
$$ -181575 126604 253988 254940 192520 -57170 152135 176235 41665 -42851 241250 -6765
13207A71880b09191C37573A47009J0093b12161C89255I1991L1949n6175M199J70783
$$ 171880 -209191 337573 147009 157102 -212161 389255 91991 123940 67765 71964 242747
13196B42747g9240C20972j53813K03174A69007J79438A59565M5316a17506G6966
$$ 242747 -79240 320972 167159 370333 169007 348445 159565 204881 -117506 76966
13185B39255J4731c99110c766m1104A99034J38190j30989e2401B60529a2466A17698
$$ 239255 253986 -399110 -3766 -44870 199034 337224 206235 -52401 260529 -12466 117698
13173A81986E6175M4663J42336R823I6868a43956D28968A14313b69282a00725
$$ 181986 56175 100838 243174 252997 96868 -143956 428968 114313 -269282 -100725
13162A52188e1184G7153M7378B4956K1527j919b54175D5145O2014a2590B49211
$$ 152188 -51184 77153 124531 24956 46483 44564 -254175 45145 107159 -12590 249211
13150g1131m0359H8256a2274B28308a8385B65808G1039B9948n684K05350A09207
$$ -71131 -111490 88256 -12274 228308 -18385 265808 71039 29948 24264 229614 109207
13138D66377B31140a21487E7878O2035b27058b8010A29104a16245b0197A28381
$$ 466377 231140 -121487 57878 119913 -227058 -28010 129104 -116245 -20197 128381
13127B58844g1436H8936J70135D8352M4786e6508j08755A92801d4407J4821j02939
$$ 258844 -71436 88936 259071 48352 93138 -56508 -165263 192801 -44407 -29586 -132525
13116a32525l9650I848N4533A7597K91944r5588M0495J23070A83514a36220j47125
$$ -132525 -172175 9848 64381 17597 309541 213953 254448 377518 183514 -136220 -283345
13105b83345A84557r576C5135J04292g9114B43807C2301J24182L28862A38358
$$ -283345 184557 174981 35135 139427 -79114 243807 32301 156483 485345 138358
13094d68488f675A6570a62530I778L72424A33917j6433J85031B1738K38382A7684
$$ -468488 -6675 16570 -162530 9778 382202 133917 117484 302515 21738 260120 17684
13082d9974k27641B28526b494A46990J38559e5031Q432B02041c03685A11370k2989
$$ -49974 -277615 228526 -2494 146990 285549 -55031 -46599 202041 -303685 111370 88381
13071H8381k3500A6311J96790I5279k1N8690J61935c4511g129o7929A19436E0005
$$ 88381 64881 16311 213101 95279 95258 153948 315883 -34511 -7129 -75058 119436 50005
13058a06986M398A5363J33255f1781B77721A26616b8308j28697A21204L76828
$$ -106986 -102588 15363 148618 -61781 277721 126616 -28308 -157005 121204 498032
13048D98032C2091K64130H8596i9406d4015H6270a39494A92865J15937k8046J28317
$$ 498032 32091 296221 88596 -99406 -44015 86270 -139494 192865 308802 280756 409073
13037D09073A19008n50D6737a13803c8051o5166A13445a01663M3269A08522J00752
$$ 409073 119008 118458 46737 -113803 -38051 -103217 113445 -101663 -58394 108522 209274
13026B09274D9074J31417j3573E7246a59516H4507J21143J7091J71477B4054K78884
$$ 209274 49074 180491 166918 57246 -159516 84507 205650 222741 394218 24054 302938
13015C02938c7222B08242a99903C77654j37797r663j08431j0729e7113C89178
$$ 302938 -37222 208242 -199903 377654 239857 230194 121763 111034 -57113 389178
13004C51010B2068L02889j5518B8914K33390a22733C38911A17698C6851P1019
$$ 351010 22068 324957 309439 28914 262304 -122733 338911 117698 36851 107870
12994A07870b43662B49502c97528F6589B4191b7997B74894M1965A20872b81569
$$ 107870 -243662 249502 -397528 66589 24191 -27997 274894 316859 120872 -281569
12983C41186b74194f4607K5689m4326A65974i5226q4410e5089A77282J40146b34099
$$ 341186 -274194 -64607 -38918 -83244 165974 -95226 -179636 -55089 177282 317428 -234099
12971A93647a31663L6147E5830M1610a73945D9136e4551K2120k52652a35388e9298
$$ 193647 -131663 -95516 55830 97440 -173945 49136 -54551 -32431 -285083 -135388 -59298
12959c34241f298a377j64472f9574D24406A59023J42843a78829d0528A52084b4997
$$ -334241 -6298 -1377 -165849 -69574 424406 159023 301866 -178829 -40528 152084 -24997
12947A61036a14389K4665A67894K36880I547d6713B71506p8204p5358J51175E1523
$$ 161036 -114389 -89724 167894 404774 9547 -46713 271506 193302 117944 269119 51523
12935b56021i6941B6083a28614A89969a40727P280j78486j24072J29605d1761
$$ -256021 -96941 26083 -128614 189969 -140727 -133447 -311933 -436005 -306400 -41761
12924B66965a56862F0011K28798A7213K4158M7731K92900C9451J47520F2957a05059
$$ 266965 -156862 60011 288809 17213 41371 89102 382002 39451 186971 62957 -105059
12912A33367a28809A46332b59495d333j5400j29120k42765A00180P0215B8878
$$ 133367 -128809 146332 -259495 -4333 -19733 -148853 -391618 100180 170395 28878
12901E4273b26829h9906l300A64420P4495a08279A6467a5977C35870H7126B4576
$$ 54273 -226829 -89906 -93206 164420 238915 -108279 16467 -15977 335870 87126 24576
12889B9515h4903j32312F0278P4929h5200l21998E1835R5261b18648A8756J22686
$$ 29515 -84903 -217215 60278 135207 -85200 -407198 51835 147096 -218648 18756 141442
12878A41442a55804A85123B6784f4469G5483e5120b6345A84662a54803j7081A35720
$$ 141442 -155804 185123 26784 -64469 75483 -55120 -26345 184662 -154803 -171884 135720
12866A21383D9796A3195a93410j76752b8044C16882f0258E7283J13947J08562
$$ 121383 49796 13195 -193410 -370162 -28044 316882 -60258 57283 171230 279792
12856B79792A26656J73998a41490M616a9364A39899a99938R3622a814j64999B93119
$$ 279792 126656 300654 -141490 -136874 -19364 139899 -199938 -106316 -1814 -166813 293119
12844a63188a1897B00858A665L76336a39668A13249K910a18399a7855B70100i0820
$$ -163188 -11897 200858 1665 378001 -139668 113249 116159 -118399 -17855 270100 -90820
12832G2417M12305b10770k0202R369C5258Q6379m7079a07131A58194L3017b1284
$$ 72417 484722 -210770 -230972 -221603 35258 121637 74558 -107131 158194 191211 -21284
12820g2031B06476r7887a3558L622D89370B8176N0562b26297A10587e5206I7505
$$ -72031 206476 108589 -13558 -9936 489370 28176 78738 -226297 110587 -55206 97505
12808b27512A24821k2212c12379A6432c1810A5971a39459C82097a63117k5173
$$ -227512 124821 102609 -312379 16432 -31810 15971 -139459 382097 -163117 -188290
12798a88290f3576b2251C94889A22325c48270A4050f4652r0628K3832A01810b70809
$$ -188290 -63576 -22251 394889 122325 -348270 14050 -64652 -155280 -131448 101810 -270809
12786H9966a23361A91941A1749e5689A26798i1644K9604j46288L2700e3275l4457
$$ 89966 -123361 191941 11749 -55689 126798 -91644 -62040 -208328 -175628 -53275 -87732
12775h7732k06953a03493k37027J34609D750a2987E20967B33316B7948K49833
$$ -87732 -294685 -103493 -340520 -205911 4750 -12987 520967 233316 27948 277781
12765B77781d20461A01697g2313k28643J07982R389A70190k1399c1983j11607
$$ 277781 -420461 101697 -72313 -300956 -192974 -183585 170190 148791 -31983 -143590
12755a43590A42341b32609C971K71906A8389h2057A39330F9449J43535C3776M2265
$$ -143590 142341 -232609 3971 275877 18389 -82057 139330 69449 212984 33776 76041
12744G6041A2117M8980M43221r2389i655D3814N2357R4555K3370q396a1926A22290
$$ 76041 12117 61097 504318 411929 -9655 43814 96171 190726 214096 205700 -11926 122290
12731A95438b53763G2243C1803J44655A3600g4057E4838b27086H2512D0882N3293
$$ 195438 -253763 72243 31803 176458 13600 -74057 54838 -227086 82512 40882 94175
12720I4175c9262A82396Q869a8982A1077a3917k35978A04283R8522j00770m1046
$$ 94175 -39262 182396 191265 -18982 11077 -13917 -249895 104283 202805 102035 60989
12709F0989a29896F31764B89370O4168d283B69581m4173G6159k6874K71361a77399
$$ 60989 -129896 631764 289370 353538 -4283 269581 225408 76159 49285 320646 -177399
12697C02616f0852B15153c22676a39130M5826L3790A01869e5958B89466j71a3110
$$ 302616 -60852 215153 -322676 -139130 -93304 -59514 101869 -55958 289466 289295 -13110
12685a09522C6319a53646A37683f9153A43150K36529I5673a16106A11372h9739
$$ -109522 36319 -153646 137683 -69153 143150 379679 95673 -116106 111372 -89739
12674F0806g1968B7921Q9183C0354K9396J8519M810M11269a73343D2300h0538
$$ 60806 -71968 27921 117104 30354 59750 78269 83079 494348 -173343 42300 -80538
12662A22317D3548J69844A9436R4775Q4432c69702a05601C85969i1900A43970
$$ 122317 43548 213392 19436 114211 198643 -369702 -105601 385969 -91900 143970
12651A83492J4070K41573F5734c83911a2399j7105n1704B51447H5545N4625J70290
$$ 183492 197562 439135 65734 -383911 -12399 -29504 -81208 251447 85545 140170 310460
12640C10460I564b41799G3129d4588i431C92241A21616b2382m6116C22518F8420
$$ 310460 9564 -241799 73129 -44588 -9431 392241 121616 -22382 -68498 322518 68420
12628g1553A10198K31832e9555A83365A3490a76174A43443E9842R387O6056L0693
$$ -71553 110198 342030 -59555 183365 13490 -176174 143443 59842 69229 135285 165978
12617A65978Q565N2888E9079b12129M2840K9686C14522D4987Q7540g8671I5744
$$ 165978 174543 227431 59079 -212129 -169289 -139603 314522 44987 132527 -78671 95744
12605a64481C47708c8048B96492a80574B63173A09136E0340O1518a74479C4676
$$ -164481 347708 -38048 296492 -180574 263173 109136 50340 111858 -174479 34676
12594g0371k7721A44122a75737D5611K52493b64200E4801J03889b38078B31841
$$ -70371 -98092 144122 -175737 45611 298104 -264200 54801 158690 -238078 231841
12583a51735E9944F883e6786H3134b04203C29507g8174b0865A32713e3382A26154
$$ -151735 59944 6883 -56786 83134 -204203 329507 -78174 -20865 132713 -53382 126154
12571a11478o3231c7279q4885F4879K97487a12825B14864J02533j55455q0654
$$ -111478 -174709 -37279 -122164 64879 362366 -112825 214864 317397 161942 81288
12561H1288l3440K7299N1481E1060a16518o2297A63821a77265B87181A28652b21285
$$ 81288 47848 75147 126628 51060 -116518 -178815 163821 -177265 287181 128652 -221285
12549B31707a5784C55630A40387B4896e6364k5003J7201A27817B7532J99619A11781
$$ 231707 -15784 355630 140387 24896 -56364 -81367 -64166 127817 27532 227151 111781
12537A51175M8521p5736Q6936k5494a37880I8035d2259j15934A66053p98a52361
$$ 151175 199696 123960 210896 185402 -137880 98035 -42259 -158193 166053 165255 -152361
12525B20358G5974a48338A01124a49349F583J35533i9912j22431c4495R183B07270
$$ 220358 75974 -148338 101124 -149349 6583 142116 -99912 -222343 -34495 -25312 207270
12513e7917p4966k2314e2530A32528J75894j49161g2953G7128K30935b37917A14695
$$ -57917 -132883 -155197 -52530 132528 308422 159261 -72953 77128 308063 -237917 114695
12501A000J03698B4232K25894a53778e7391l05470d6690F8729J93520L0702n5245
$$ 1000 104698 24232 250126 -153778 -57391 -362861 -46690 68729 262249 292951 237706
12490B37706J990C0677K0764b39560C172J359L19376a40094A829K4467J18023
$$ 237706 239696 30677 51441 -239560 3172 4531 323907 -140094 1829 26296 144319
12479A44319J13255A8565b3543C8319a67227O0378B79722a36245e1836p0560F8637
$$ 144319 257574 18565 -23543 38319 -167227 -106849 279722 -136245 -51836 -122396 68637
12467A63730J4935h818D7460K44786a47775p7114Q3633j13741A13745d4885J0280
$$ 163730 178665 -8818 47460 292246 -147775 -224889 -141256 -254997 113745 -44885 -34605
12456c4605A94824j9959J00162a38852A91437J22439m6232b57607A86944b20825
$$ -34605 194824 174865 275027 -138852 191437 313876 267644 -257607 186944 -220825
12445C48003a29478B2603g4498f155q0019A69424n9778R2857o7603a20775j8591
$$ 348003 -129478 22603 -74498 -6155 -86174 169424 109646 202503 134900 -120775 -139366
12434a39366A97916b66461B58346b52028k25947B2535c68210G3335Q1816n5898
$$ -139366 197916 -266461 258346 -252028 -477975 22535 -368210 73335 155151 99253
12424I9253b40026B04870a01977n7645a9100D9468g0204I253a47403B22284I9396
$$ 99253 -240026 204870 -101977 -159622 -19100 49468 -70204 9253 -147403 222284 99396
12412B43000N0658p5671a09413A16278l8970g8261j22436M6089j14459g5755B29907
$$ 243000 293658 217987 -109413 116278 77308 -78261 -200697 -154608 -269067 -75755 229907
12400c5544A65166a09922q5063A21724J29513f1667k22641B5306b7041C6236a0717
$$ -35544 165166 -109922 -194985 121724 251237 -61667 -284308 25306 -27041 36236 -10717
12388A4361O5804j766J90647B722b4070A41716f567E4545J53845J16526b39198
$$ 14361 80165 78399 269046 2722 -24070 141716 -6567 54545 208390 324916 -239198
12376a1872B81486G6648L964a64112e1579j2283a5891B02830a00342J4402F0092
$$ -11872 281486 76648 80612 -164112 -51579 -63862 -15891 202830 -100342 -85940 60092
12364A54811d4174k44594a29671o8425K1216j1456o6534A53302J24776h2683B19536
$$ 154811 -44174 -288768 -129671 -198096 -176880 -188336 -254870 153302 278078 -82683 219536
12352B00787H2963l4029a02604A17843d22m9106C69787G760J7769b29397a5474
$$ 200787 82963 48934 -102604 117843 -422 -49528 369787 7760 25529 -229397 -15474
12340a39340A9927K24887o2417b48178A30139a25023A26118M46030A04858a18550
$$ -139340 19927 244814 182397 -248178 130139 -125023 126118 572148 104858 -118550
12329f7603H4005J6503a2628F8755c37091E5759f04805b12969A05344e210B87172
$$ -67603 84005 100508 -12628 68755 -337091 55759 -604805 -212969 105344 -5210 287172
12317h4242c0545H1915J44108b35899m6634B35216A07883k7094b05817C80092
$$ -84242 -30545 81915 226023 -235899 -282533 235216 107883 80789 -205817 380092
12306B36603Q4608G0119a49917k9087o8975E5660K32534a13117j08493d9119j13319
$$ 236603 321211 70119 -149917 -179004 -247979 55660 288194 -113117 -221610 -49119 -162438
12295a62438B88092A19227n095L9140b73388J30348A4767a60453a5281B36528
$$ -162438 288092 119227 114132 153272 -273388 -143040 14767 -160453 -15281 236528
12284G4331g4856A18959j5678b54485b6343e465k0130r2456K3689C55948A68942
$$ 74331 -74856 118959 103281 -254485 -26343 -5465 -25595 -118051 -94362 355948 168942
12272B47858j08237o3011a02599B06019r123n9357J39736A06687b57874a5345
$$ 247858 139621 76610 -102599 206019 196896 137539 277275 106687 -257874 -15345
12261C38385A13101B3437b2245A21539C171N3033J63375b2576B56078A19128l7389
$$ 338385 113101 23437 -22245 121539 3171 56204 219579 -22576 256078 119128 81739
12250H1739K56645F7481K74440C5392J07969g7961J9440L940k50600J37454A5413
$$ 81739 338384 67481 341921 35392 143361 -77961 -58521 -54581 -305181 -167727 15413
12238A95920a21314J7106B19355J82297E9132a75628D8901K4847K36425g5571
$$ 195920 -121314 -104208 219355 401652 59132 -175628 48901 73748 310173 -75571
12227C2894J79043J60781o6231b0751D1729K16741J49923j14707q1173P3613m2329
$$ 32894 211937 372718 306487 -20751 41729 258470 408393 293686 212513 286126 243797
12216B43797m7929K41930I8788L93849A04814C6420a44341L8441A27833n8698
$$ 243797 195868 437798 98788 492637 104814 36420 -144341 -105900 127833 69135
12206F9135m497K55161E9253P7197Q4063E9792c5051C40498P0339A19270K17373
$$ 69135 64638 319799 59253 136450 220513 59792 -35051 340498 410837 119270 336643
12195C36643L4361m5126q4459J76732B9702J79101p1345N6619j8871C3894d46074
$$ 336643 371004 325878 241419 418151 29702 208803 137458 194077 175206 33894 -446074
12183D01826j03771d2782f624H2114l3278J33000H5115a7987E8534K24562H7659
$$ 401826 298055 -42782 -6624 82114 48836 181836 85115 -17987 58534 283096 87659
12171A37449J09287G8090M5405J65208j03053e8794l7232B01590H4680A733L17228
$$ 137449 246736 78090 123495 288703 185650 -58794 -96026 201590 84680 1733 318961
12160C18961c3149B69405D6755f1020A80944D8348J76537A07486d9037I6949K69105
$$ 318961 -33149 269405 46755 -61020 180944 48348 224885 107486 -49037 96949 366054
12149C66054a90093c8164A6175g1082o0903D19112c38468B03708p6811J4876n123
$$ 366054 -190093 -38164 16175 -71082 -131985 419112 -338468 203708 126897 141773 136650
12138A36650C5775K12435J04023A67789m8849a1992A53350K19224A47259C8195
$$ 136650 35775 248210 352233 167789 118940 -11992 153350 372574 147259 38195
12127B16598o949a27248f0655G0040i9264B33574b91407J33863k0399K5391j1047
$$ 216598 209649 -127248 -60655 70040 -99264 233574 -291407 -157544 -177943 -152552 -163599
12116a63599A07399A5423K55828b99960A95906b02993B06142a98550d4332F56
$$ -163599 107399 15423 271251 -299960 195906 -202993 206142 -198550 -44332 656
12105A05990a06133A60945D1916j0873J48515a47966d0798I2051a48352C97116
$$ 105990 -106133 160945 41916 31043 179558 -147966 -40798 92051 -148352 397116
12094f9872H8696J78506h6898j72391P1881G1388G381c76619J67306i9113B24561
$$ -69872 88696 267202 -86898 -259289 -187408 71388 7381 -376619 -209313 -99113 224561
12082e9181j85217F2111i1248l26344I4053C7829c0875B66569F3395h6138H6739
$$ -59181 -244398 62111 -91248 -417592 94053 37829 -30875 266569 63395 -86138 86739
12070A37534k0306J4709J129936J265381r93820F26169B31040b9481n2760a222
$$ 137534 117228 131937 1261873 2527254 1533434 626169 231040 -29481 -82241 -1222
12059A5797M09880A32006a59427e8204j26665j3733a3956j41731k9809J7395C6395
$$ 15797 425677 132006 -159427 -58204 -184869 -198602 -13956 -155687 -185496 -168101 36395
12047D62493b01726L4770E5979k5185a76365e9360m6715D1562R5067b22493A58804
$$ 462493 -201726 -166956 55979 30794 -176365 -59360 -106075 41562 136629 -222493 158804
12035E6295c31312e1838j036i954k32026a11567j07857L8323B19274o5084c01886
$$ 56295 -331312 -51838 -52874 -9954 -241980 -111567 -219424 -181101 219274 154190 -301886
12023a98990h9873j28241B66380n0130A8968J04980n9514K38548A30488b7457
$$ -198990 -89873 -218114 266380 216250 18968 123948 64434 302982 130488 -27457
12012a52744B12116p7565E6556J85846g4922b2562k04101R2278b4766a0484k47672
$$ -152744 212116 134551 56556 242402 -74922 -22562 -226663 -134385 -24766 -10484 -258156
12001b58156A04653b6489j07397A36283B7848J5774J14442d86065a78070r9289
$$ -258156 104653 -26489 -133886 136283 27848 43622 158064 -486065 -178070 -277359
11991b77359k03856C70458g4166G8815b46865H1015a17266H9474c859k94410a39725
$$ -277359 -481215 370458 -74166 78815 -246865 81015 -117266 89474 -3859 -298269 -139725
11979i4126o1928B49543b5680o4921c9388p3098G4561b5844D1986K52265c4734
$$ -94126 -156054 249543 -25680 -90601 -39388 -112486 74561 -25844 41986 294251 -34734
11967B2940j0062N7327a83313o1192a9495j37641j37194G7837M8201a04162A60685
$$ 22940 12878 70205 -183313 -244505 -19495 -157136 -294330 77837 126038 -104162 160685
11955a24700C285J24284b51871A1181P7787K3794k3514L6668b85799a6142j4419
$$ -124700 3285 127569 -251871 11181 88968 112762 89248 125916 -285799 -16142 -30561
11944c0561A04232a06504B27441a87965b9161q787j0027j45177C20532f1317j06044
$$ -30561 104232 -106504 227441 -187965 -29161 -37948 -47975 -193152 320532 -61317 -167361
11933a67361G0557a03595b849j06545A31527d284A36152o7439d635A84688J5037
$$ -167361 70557 -103595 -2849 -109394 131527 -4284 136152 68713 -4635 184688 199725
11922A99725b93269J28139k6471O573K5730B5073a1819j62107B9466b071l05003
$$ 199725 -293269 -165130 -191601 -185028 -159298 25073 -11819 -173926 29466 -2071 -307074
11911c07074a07811p2153B23462a42414o1396A2391Q185b53870B8620b74624g5525
$$ -307074 -107811 -179964 223462 -142414 -203810 12391 20576 -253870 28620 -274624 -75525
11899f8640a8377r0057C4695h9171C19322b2277j40738A56360A8395b67498J09161
$$ -68640 -18377 -108434 34695 -89171 319322 -22277 -163015 156360 18395 -267498 -158337
11888a58337a2254m38854a61034A17100B2229i4783C59011q7445A32048J62852
$$ -158337 -12254 -451108 -161034 117100 22229 -94783 359011 271566 132048 294900
11878B94900a03156j69906E2202b6052j28687k2239j5618C67268b46108a00644
$$ 294900 -103156 -273062 52202 -26052 -154739 -176978 -192596 367268 -246108 -100644
11867a20775d6353B93092j09929a32394F0169K7147d9004j2325A36062K3374c5762
$$ -120775 -46353 293092 183163 -132394 60169 87316 -49004 -61329 136062 159436 -35762
11855a62115E9897b06268A004b33613C69563g3710G5007b56430b7918i283r3044
$$ -162115 59897 -206268 1004 -233613 369563 -73710 75007 -256430 -27918 -9283 -102327
11844a02327p6451r8667a00968A01351e8940A09256b37692E5105K03870q799d22722
$$ -102327 -178778 -277445 -100968 101351 -58940 109256 -237692 55105 258975 250176 -422722
11832A13707h607j21232B6666R6134a86917K2310F3809b17319j9945A31536j4020
$$ 113707 -8607 -129839 26666 122800 -186917 -164607 63809 -217319 -237264 131536 117516
11821A17516N0070E4090J49795E2378O185M5570b03057h8494m5730B12235G9172
$$ 117516 167586 54090 203885 52378 58563 104133 -203057 -88494 -134224 212235 79172
11809f9540l69232a14086q5648b7294j66129Q7819D00421B6913J69750a10157
$$ -69540 -438772 -114086 -199734 -27294 -193423 -105604 400421 26913 196663 -110157
11798A72536K2557b78350Q5943B74363I9311d8570j69397A56228b8465A15184
$$ 172536 195093 -278350 -192407 274363 99311 -48570 -217967 156228 -28465 115184
11787b11130a7075C06985f3287B0284J05482M2958l7220f3351A79393c11861h2255
$$ -211130 -17075 306985 -63287 20284 125766 168724 131504 -63351 179393 -311861 -82255
11775b28343L1812L3616K3716e0985B85673b84837h2856I8770a37569l60659B36434
$$ -228343 -196531 -162915 -139199 -50985 285673 -284837 -82856 98770 -137569 -498228 236434
11763A70021m9215n9017a44061E4155b26436Q9908k62425A23057b43564K5777
$$ 170021 120806 61789 -144061 54155 -226436 -136528 -398953 123057 -243564 -217787
11753b17787Q8151j87213h5495A71467G9545b58846G8662K27897D4547a58784
$$ -217787 -129636 -316849 -85495 171467 79545 -258846 78662 306559 44547 -158784
11742C7298M1611a41624c6665B34803a31767A63085p7094k554J13339a49083N3202
$$ 37298 78909 -141624 -36665 234803 -131767 163085 85991 83437 196776 -149083 -95881
11731i5881c5249l06367h2642A84974a96232C9147b96703r9701J72865D2068f0379
$$ -95881 -35249 -341616 -82642 184974 -196232 39147 -296703 -396404 -223539 42068 -60379
11719d2515j4875B00943a79733r5390A56444c10897C31774b77852B08483a6279
$$ -42515 -57390 200943 -179733 -275123 156444 -310897 331774 -277852 208483 -16279
11708a2933j49636j73264J55241A58451p7474L0955J25101D3816J16759L3789
$$ -12933 -162569 -335833 -180592 158451 80977 111932 237033 43816 160575 194364
11698A94364G2034J27633o3960K25533j68822f8504G5040c9133A05554A5430L2385
$$ 194364 72034 199667 135707 361240 192418 -68504 75040 -39133 105554 15430 47815
11687D7815P082d7067A5242J75020a59445C06404N1739A34936D0228J45545G1175
$$ 47815 54897 -47067 15242 190262 -159445 306404 358143 134936 40228 185773 71175
11675B32999A4622a01708N0401M175m152B26792a85829B2678L4916b671j71661
$$ 232999 14622 -101708 -51307 -47132 -51284 226792 -185829 22678 57594 -2671 -174332
11664a74332A3206c02856B58817b20412A60475a41740k7717e970E35358a65032
$$ -174332 13206 -302856 258817 -220412 160475 -141740 -169457 -5970 535358 -165032
11653B90381b22886i3755K0013I6964a00099M6245I8670B468K1990J44649J511
$$ 290381 -222886 -93755 -73742 96964 -100099 -53854 98670 2468 24458 169107 170618
11642A70618l9724i6429A8332a21385B79969l9249d5047D57962D1480N0002J0630
$$ 170618 130894 -96429 18332 -121385 279969 240720 -45047 457962 41480 91482 102112
11631A02112b2329r067B43388p2422b58594A11781c42403A28790K14235j55386
$$ 102112 -22329 -31396 243388 170966 -258594 111781 -342403 128790 343025 187639
11621A87639J22246r0979b05877Q2651j2167n7553F3660a41172j28580h4936A05269
$$ 187639 309885 218906 -205877 -123226 -135393 -192946 63660 -141172 -269752 -84936 105269
11609a2351F7583N2988O9492b8534k12897C16862j20908I6483J41551k3888l6412
$$ -12351 67583 120571 190063 -28534 -241431 316862 195954 96483 238034 214146 177734
11598A77734m2738D3242m219a87031e6328o1207b8511j08111B12582a46392b6638
$$ 177734 134996 43242 39023 -187031 -56328 -117535 -28511 -136622 212582 -146392 -26638
11586c7604A56006a1164H529R060M56928b36414A50633a074A48678F864b47432
$$ -37604 156006 -11164 8529 17589 474517 -236414 150633 -1074 148678 6864 -247432
11574B18811d6530A60776a41958I7315b23302A74747h1447k50753R8107J8663
$$ 218811 -46530 160776 -141958 97315 -223302 174747 -81447 -332200 -234093 -215430
11564b15430D25985a55282G4287J39816b30977E5222j7742a30791k0474A97961
$$ -215430 425985 -155282 74287 214103 -230977 55222 37480 -130791 -151265 197961
11553a60864B56991I7055a61194A41032f7714b9373B88035r0295e2259C11885
$$ -160864 256991 97055 -161194 141032 -67714 -29373 288035 197740 -52259 311885
11542B62551B773L35077j49844j398M9348l2119B3550N0208J7296M11258A16729
$$ 262551 2773 337850 188006 186608 235956 203837 23550 73758 91054 502312 116729
11530B71868I3384b73065B13714c6478E774b54866d3448J4583B6970J24598b9862
$$ 271868 93384 -273065 213714 -36478 5774 -254866 -43448 -28865 26970 151568 -29862
11518a33170A00546a6466D54347k7089A2421K89466j28564L09501A85649a01347
$$ -133170 100546 -16466 454347 427258 12421 301887 173323 482824 185649 -101347
11507B80896J74119g5214B48060L2285j13010n9368B3750K53795b31331C35741
$$ 280896 455015 -75214 248060 280345 167335 107967 23750 277545 -231331 335741
11496C97706a71219C19794b2051D70510A53235F578K86107a1023B08891j01529
$$ 397706 -171219 319794 -22051 470510 153235 6578 292685 -11023 208891 107362
11486A07362L0838a05575j1924H6256L09391a02037j07292B09728j9726H4691
$$ 107362 138200 -105575 -117499 86256 395647 -102037 -209329 209728 190002 84691
11475B00810J19998A10007J28572p4586n3204j5131a56739B41206J40227B9138
$$ 200810 320808 110007 238579 163993 110789 95658 -156739 241206 381433 29138
11464A77362Q7576L0043K465A4758L77116E9066g781n7700C0241L34956g4828
$$ 177362 264938 294981 297446 14758 391874 59066 -7781 -65481 30241 365197 -74828
11452A23481a4663A24839i2808A66192l6997l0288D0707L12644a63785I8721G853
$$ 123481 -14663 124839 -92808 166192 129195 98907 40707 353351 -163785 98721 7853
11440a23716d6310A03691e2647A5298P7662l8001a06510A06325d5954j32806E77
$$ -123716 -46310 103691 -52647 15298 92960 54959 -106510 106325 -45954 -178760 577
11428B98016a09013a438j24425E4859J4743P8390a24966q568G0648L7770a66594
$$ 298016 -109013 -1438 -125863 54859 69602 147992 -124966 -133534 70648 108418 -166594
11416A13264n1351N04931g4372A22293L9099L02589c6222A79179a62710A03349
$$ 113264 61913 566844 -74372 122293 161392 463981 -36222 179179 -162710 103349
11405a04496C0210P9325b3176B25560a5628p6460C7606m268K21751a03965A44063
$$ -104496 30210 109535 -23176 225560 -15628 -92088 37606 33338 255089 -103965 144063
11393A2831h156q4876A93428b96696m3979H575b97644h5692j29903B73101a02027
$$ 12831 -8156 -93032 193428 -296696 -340675 8575 -297644 -85692 -215595 273101 -102027
11381A80179b01441a3153E3426j5996a08131B70393n8700M2478A5005b31785j87490
$$ 180179 -201441 -13153 53426 37430 -108131 270393 211693 254171 15005 -231785 -419275
11370d19275h1043q720A60414N4191O8736c1496o220F2767f6552j27569A26011
$$ -419275 -81043 -89763 160414 214605 283341 -31496 -37716 62767 -66552 -194121 126011
11358A47311d7235l40453A01107c41072J63253c4872H1276c22259C38101i1188
$$ 147311 -47235 -387688 101107 -341072 -177819 -34872 81276 -322259 338101 -91188
11347A33082D9199c26199I3051C9506K25581c2656A28421c95762i3205D8090a61489
$$ 133082 49199 -326199 93051 39506 265087 -32656 128421 -395762 -93205 48090 -161489
11335a02878C7243J575A6528a0625E72485I8652e8257E1332d9212C0633a49303
$$ -102878 37243 38818 16528 -10625 572485 98652 -58257 51332 -49212 30633 -149303
11323G927K1299M7919p460c6650B98857m3537J3121q6932q2643a0522A09585P3450
$$ 7927 29226 77145 69685 -36650 298857 255320 268441 181509 98866 -10522 109585 183035
11311A83035D6206b50441P1494C39758E4609n152N2889b18001Q6945O1220k16082
$$ 183035 46206 -250441 -178947 339758 54609 49457 102346 -218001 -131056 -69836 -285918
11300b85918i3658A96579c4853k9034J1933m9636C3699i5918B95857e0054j0163
$$ -285918 -93658 196579 -34853 -63887 -51954 -101590 33699 -95918 295857 -50054 -60217
11289f0217B72654E788R9792b17414d9279B76099a05862A3109K07002B8676L7752
$$ -60217 272654 5788 105580 -217414 -49279 276099 -105862 13109 220111 28676 66428
11278F6428a31830F2483a05302I736J36796a39015K0746a5223D852O3484a39803
$$ 66428 -131830 62483 -105302 9736 146532 -139015 -118269 -15223 4852 68336 -139803
11266e0318g501q7789E8706a40416A38932e6857j7746B3966P0540a77580A12482
$$ -50318 -7501 -95290 58706 -140416 138932 -56857 -74603 23966 94506 -177580 112482
11254b94371g8059B20444G2353a3612q236D1324a36853m9968M3417H2707J16804
$$ -294371 -78059 220444 72353 -13612 -21848 41324 -136853 -186821 -143404 82707 199511
11243A99511c23128A0686c13499B88582e11950A65266L1985b02646B91399o2825
$$ 199511 -323128 10686 -313499 288582 -511950 165266 197251 -202646 291399 228574
11233B28574b09367E6620b34818A13675m1710r209b08926A06393b25770E6330
$$ 228574 -209367 56620 -234818 113675 71965 62756 -208926 106393 -225770 56330
11222a07297B61417e8397p1574A54043a68004c6971H6861B4666L8426J89288i1607
$$ -107297 261417 -58397 -129971 154043 -168004 -36971 86861 24666 63092 252380 -91607
11210c0770j29559e0020A08440a17096A45060b9754j9224H2153O7442a4244n5616
$$ -30770 -160329 -50020 108440 -117096 145060 -29754 -48978 82153 149595 -14244 -69860
11199f9860j08606A03138c06171h3865D2529I749B530c27412a32203j96060A60826
$$ -69860 -178466 103138 -306171 -83865 42529 9749 2530 -327412 -132203 -328263 160826
11187D5634b5254k565B2764K00411a18585M241E4192b15137G2682J02060a01929
$$ 45634 -25254 -27819 22764 223175 -118585 -114344 54192 -215137 72682 174742 -101929
11175A7117b00273I5627i8612d5329l34F2450b47171A01221J68425m0274b08517
$$ 17117 -200273 95627 -98612 -45329 -45663 62450 -247171 101221 269646 229372 -208517
11163a06660c9744p2979k68985g6217m9781l5490d4902r2496p2835O7597l6779
$$ -106660 -39744 -112723 -381708 -76217 -125998 -161488 -44902 -137398 -210233 -142636 -179415
11152a79415g7766A48957a73694A01474i1905c2046p0158A73029b54478B8983
$$ -179415 -77766 148957 -173694 101474 -91905 -32046 -102204 173029 -254478 28983
11141a29485j55341A06417a00040C16924d6093o5171J1593j10268Q7640b3458
$$ -129485 -284826 106417 -100040 316924 -46093 -111264 -99671 -209939 -122299 -23458
11130B07718a63209B11096b1264D7739c6510H9258a36110A69676e5828B25148
$$ 207718 -163209 211096 -21264 47739 -36510 89258 -136110 169676 -55828 225148
11119C6334c86911G6496a766B76010p6317J26744j58257B6976K53096p669J14517
$$ 36334 -386911 76496 -1766 276010 199693 326437 168180 26976 280072 272403 386920
11108C86920A39628J14187D6859L18454E1588J00883L47358I8366J52813g330
$$ 386920 139628 253815 46859 365313 51588 152471 499829 98366 251179 -7330
11097C9508L53863A79377K80134B1687c2040B11074O4397K52540A78062L10893
$$ 39508 393371 179377 459511 21687 -32040 211074 275471 528011 178062 488955
11087D88955H7350N58442A79436J01027A07854O8552N0697D9394L24481F4425
$$ 488955 87350 645792 179436 280463 107854 176406 227103 49394 373875 64425
11076D65496o8530j57936M2389E5158e024B36731J09469Q8082A71743J47181Q4842
$$ 465496 396966 239030 281419 55158 -5024 236731 346200 434282 171743 318924 403766
11065D03766r2617L6588j28171J4905J74250J35332J87627C30383M77233l60830
$$ 403766 311149 347737 219566 234471 408721 544053 731680 330383 807616 446786
11055D46786J38876K91722K37886m38306j19045R5149M0075l43804N35752o4574
$$ 446786 585662 877384 1115270 676964 557919 653068 693143 349339 885091 820517
11045H20517k31692K9930r0907J79283k43453L51287Q189M6502j58725O3253j32682
$$ 820517 588825 618755 527848 707131 463678 814965 823154 869656 710931 774184 641502
11034F41502J89272N7816j36903P6668p8028k97121K04892M40122m34917K87590
$$ 641502 830774 888590 751687 828355 750327 453206 658098 1098220 663303 950893
11024I50893m15124j46749M8562K36674N9298l0281j4701k07469K6083N4746M79976
$$ 950893 535769 389020 437582 674256 733554 703273 688572 481103 507186 561932 1041908
11013A041908k63610Q6814k08529K79447D49433J69882j32402N13299l34911j76961
$$ 1041908 778298 865112 656583 936030 449433 619315 486913 1000212 665301 488340
11003D88340N0287K51915r008k00450K89939Q3025m12936J14905J06110k93195
$$ 488340 538627 790542 781534 581084 871023 954048 541112 656017 762127 468932
10993D68932J40863K77747n6032j37909K1565L02843J38106J4435r9081J0981
$$ 468932 609795 887542 831510 693601 715166 1018009 1156115 1170550 1071469 1082450
10983A082450k927k47599M22014m66142R38575l63116J97072L27824K13016K6857
$$ 1082450 1079523 831924 1253938 787796 1726371 1363255 1560327 1888151 2101167 2128024
10973B128024O49792J71518K69757m23555L17563r1439n02550j41867J6225n27988
$$ 2128024 2777816 2949334 3219091 2795536 3113099 3021660 2519110 2377243 2393468 1865480
10963A865480l87857n0615J79377K44360J30457J4820k44653p20l1926q9481m68874
$$ 1865480 1477623 1427008 1606385 1850745 1981202 1996022 1751369 1750649 1718723 1629242 1160368
10952A160368L27868m92482j90642l38596R3033q9306M0944B18909L19772B32439
$$ 1160368 1488236 995754 805112 466516 559549 470243 511187 218909 538681 232439
10941C31280p8622A20244E1159J61579a2502B3517K75745j48766J68691a2079
$$ 331280 252658 120244 51159 212738 -12502 23517 299262 150496 319187 -12079
10930i7782A7824R2480N30626b3245A0464L10852f1905B41856p1763b24550a09215
$$ -97782 17824 110304 640930 -23245 10464 321316 -61905 241856 170093 -224550 -109215
10918a65461a0525A03556A8919a58945I4549N6985a23193I8156d0499A32455a39562
$$ -165461 -10525 103556 18919 -158945 94549 151534 -123193 98156 -40499 132455 -139562
10906d2743n1859I3977J90538J1058B2341J34753E2329c23562I9367L5152a10181
$$ -42743 -94602 93977 284515 295573 22341 157094 52329 -323562 99367 134519 -110181
10894A22759d0891j95962A56790B9009j9K19531C8288b51101J09630I9976c85757
$$ 122759 -40891 -236853 156790 29009 28990 248521 38288 -251101 -141471 99976 -385757
10882f5029g001B8618a89605A82982i4316B04825g5134o3323A43587L03848b22755
$$ -65029 -7001 28618 -189605 182982 -94316 204825 -75134 -138457 143587 447435 -222755
10870G709a7408A4389J46085k652a86517Q1146l87321H0070A2967c53405k8878
$$ 7709 -17408 14389 160474 157822 -186517 -105371 -492692 80070 12967 -353405 -382283
10859c82283F8410P2771f9201k458D6624J0699M64b47057A83529f3970A69253
$$ -382283 68410 141181 -69201 -71659 46624 57323 57787 -247057 183529 -63970 169253
10847A07796K92613h2978j7469A40425h3425A06440A0860J47261b31245h3300
$$ 107796 400409 -82978 -100447 140425 -83425 106440 10860 158121 -231245 -83300
10836c32719J11636f8044l02163a14631o582o8126N0632e5423J6303B29149b31076
$$ -332719 -221083 -68044 -370207 -114631 -121213 -189339 -138707 -55423 -39120 229149 -231076
10824B0635J376J89174j0097a669o9121B13807d5875j57072j36725A22307j5529
$$ 20635 22011 211185 201088 -1669 -70790 213807 -45875 -202947 -339672 122307 106778
10813A06778c9450j2877j75289H2816C9775J29108b06646a8334l49398h6329K8841
$$ 106778 -39450 -52327 -227616 82816 39775 168883 -206646 -18334 -367732 -86329 -57488
10802e7488j51619k19446h3541k1774q1216h372p0356A28732J938l3008R2067
$$ -57488 -209107 -428553 -83541 -105315 -186531 -8372 -78728 128732 130670 97662 189729
10791A89729a62975j8075i0069a4064p8440M1099j4169b4163A86379F4449i5773
$$ 189729 -162975 -181050 -90069 -14064 -92504 -51405 -65574 -24163 186379 64449 -95773
10779a08507a4135G5467a41286C41797a77958A12450i8945o04C16809c6811A24802
$$ -108507 -14135 75467 -141286 341797 -177958 112450 -98945 -99549 316809 -36811 124802
10767A73424d8912k01261g0923b5193j08874j22861G0894i9178A83107a33918
$$ 173424 -48912 -250173 -70923 -25193 -134067 -256928 70894 -99178 183107 -133918
10756B21648c05216A22132C7504J4305d13317D1079a12105A88934p1982b35329
$$ 221648 -305216 122132 37504 51809 -413317 41079 -112105 188934 116952 -235329
10745a31396I9024A8174J49006p7372a58266n1953O5325m4822j32777a54612K9134
$$ -131396 99024 18174 167180 89808 -158266 -210219 -144894 -189716 -322493 -154612 -125478
10734a25478q7705H4013e5035A40708i9497J8649j39327B28419c13645a3683k30139
$$ -125478 -213183 84013 -55035 140708 -99497 -80848 -220175 228419 -313645 -13683 -243822
10723b43822E3552b59047l9659a19697j54905G3640b42853c4107j6936A99958
$$ -243822 53552 -259047 -298706 -119697 -274602 73640 -242853 -34107 -51043 199958
10712i549I3363K9121A6590b30694A71656a85072c8870P340j13704A13630b79565
$$ -9549 93363 122484 16590 -230694 171656 -185072 -38870 -31530 -145234 113630 -279565
10700a43270A06377L7618d1284j76302g1040k75919J46344c5472A23840b86253
$$ -143270 106377 143995 -41284 -217586 -71040 -346959 -200615 -35472 123840 -286253
10689d5250A52555a76798A6045a44627A00470a51988G3800i9951A03750a6256
$$ -45250 152555 -176798 16045 -144627 100470 -151988 73800 -99951 103750 -16256
10678B7630d6973k61588p1793A66216n2879k3892i9169c1926k70647i7371G3390
$$ 27630 -46973 -308561 -380354 166216 113337 89445 -99169 -31926 -302573 -97371 73390
10666a63028O4951j02859M670Q1609A50653b50751o6388O2370H0949a45914d5274
$$ -163028 -98077 -200936 -196266 -114657 150653 -250751 -317139 -254769 80949 -145914 -45274
10654a03256E6735b9961o989E7451g8854A93877b45081a009E1198h8290c4307
$$ -103256 56735 -29961 -36950 57451 -78854 193877 -245081 -1009 51198 -88290 -34307
10642B5572a20758e0643k78745A83546a70322E9117J04923C2092i2957k66926
$$ 25572 -120758 -50643 -329388 183546 -170322 59117 164040 32092 -92957 -359883
10632c59883b707G7192b0845F340b35393g6394A30236h5981E5064a96021A19010
$$ -359883 -2707 77192 -20845 6340 -235393 -76394 130236 -85981 55064 -196021 119010
10620E7730O7009A7085b65932L2243B824c5771k23273C3690a50905j16884J16832
$$ 57730 124739 17085 -265932 -233689 2824 -35771 -259044 33690 -150905 -267789 -150957
10609a50957f2079B23515a02284q8450J6019Q567A46278a62396D4212a12895D28911
$$ -150957 -62079 223515 -102284 -190734 -174715 -166148 146278 -162396 44212 -112895 428911
10597H1329e4602A92208I279b44151J04029A08701b68567C50713b9223B16356
$$ 81329 -54602 192208 9279 -244151 -140122 108701 -268567 350713 -29223 216356
10586b90938J2261A94686H3479J21323c38025E4510J15598A5340J56479G1229
$$ -290938 -278677 194686 83479 204802 -338025 54510 170108 15340 171819 71229
10575b06400N0287B07245n9182L9367E8405J08325B5818K16680Q224N0749a10208
$$ -206400 -156113 207245 148063 187430 58405 166730 25818 242498 250722 301471 -110208
10563a04850k24478l632g4844o3386m00505B2165h6693B81413f5162A35298a93663
$$ -104850 -329328 -332960 -74844 -138230 -538735 22165 -86693 281413 -65162 135298 -193663
10551b380p5604k51653A90204b86886j63990A0609c75477a40041C7854f5082A52144
$$ -2380 -77984 -329637 190204 -286886 -450876 10609 -375477 -140041 37854 -65082 152144
10539a35670j05039q504i6146E0929L8545D1062j815b04861A33250d33640K04126
$$ -135670 -240709 -249213 -96146 50929 89474 41062 39247 -204861 133250 -433640 -229514
10528b29514A0389K77463a00298l7437D01761a95657j19174A7006b97212i2618
$$ -229514 10389 287852 -100298 -137735 401761 -195657 -314831 17006 -297212 -92618
10517C23028c60503g6317H1216J60722c9339A3918c39931a56058A03144N9853
$$ 323028 -360503 -76317 81216 241938 -39339 13918 -339931 -156058 103144 162997
10507A62997C5255K6363Q347a57423O4887o4084b7995k54240B0723g4607A68514
$$ 162997 35255 61618 69965 -157423 -92536 -156620 -27995 -282235 20723 -74607 168514
10495b00645F3288j1119M2081J3126M1891i4170A80587m2101a97545A0583K29728
$$ -200645 63288 52169 94250 107376 149267 -94170 180587 138486 -197545 10583 240311
10484B40311G3654i6717A05041d3838C65609k1502N4845A77953J24787A7965a82616
$$ 240311 73654 -96717 105041 -43838 365609 344107 398952 177953 302740 17965 -182616
10472a08123L1253G3318h9474C01295A6183a28515M5862i220C55366G4240J0143
$$ -108123 -76870 73318 -89474 301295 16183 -128515 -82653 -9220 355366 74240 84383
10461H4383P2890o3470O5274n8159J4730J92677j52325a30025B34333c83201d6664
$$ 84383 157273 93803 159077 100918 115648 308325 156000 -130025 234333 -383201 -46664
10449a33726d2144j58956A06245a99408M926D3113a85005G5710J03446R722J5175
$$ -133726 -42144 -201100 106245 -199408 -194482 43113 -185005 75710 179156 188878 204053
10438B04053B4088b25924k8686C5690J97851f79C22115a43009A51584A3787b43238
$$ 204053 24088 -225924 -254610 35690 233541 -679 322115 -143009 151584 13787 -243238
10426I8456d27771C3114a99977m4492B18601A9670c29431a5067H1515J6425d6959
$$ 98456 -427771 33114 -199977 -244469 218601 19670 -329431 -15067 81515 97940 -46959
10414b48897G1593a5923B35752o1391o8418c42925f5908j01998d3106k69597F3929
$$ -248897 71593 -15923 235752 174361 105943 -342925 -65908 -167906 -43106 -312703 63929
10402b90707E699K05904h4663j22101H1690R2869k6129m1977C8538e9482G2940
$$ -290707 5699 211603 -84663 -206764 81690 174559 148430 106453 38538 -59482 72940
10390B13819k9248m5242D2021K47480J7975o5287r212a30105H55a08727B80163
$$ 213819 184571 139329 42021 289501 307476 242189 232977 -130105 855 -108727 280163
10378A96405K13803j36127J93395p8847j63761B225J26361J08982O3072K2826
$$ 196405 410208 274081 467476 388629 224868 2225 128586 237568 300640 323466
10368C23466r0569J90778E2904P34039C48414K9799A03000N00603j27644E5942
$$ 323466 232897 423675 52904 786943 348414 378213 103000 603603 475959 55942
10357B42643P8826E3759L01757l1360E7891N16488A72126L75645j96329J6535
$$ 242643 321469 53759 355516 324156 57891 574379 172126 547771 351442 367977
10347C67977r6030j2826J71159I6307M29713B4877L1596L08309R7204r4j12138
$$ 367977 271947 259121 430280 96307 526020 24877 56473 364782 461986 461892 349754
10336C49754A5037M592d8287E743J51348J29322B8950a30125A87787k999D2477
$$ 349754 15037 19629 -48287 5743 157091 286413 28950 -130125 187787 184788 42477
10324a72591A83830F411K04741o5718k0830j6474b54179P7516A68496E6765J6800
$$ -172591 183830 6411 211152 145434 124604 108130 -254179 -176663 168496 56765 73565
10313G3565a6405P812H3267h481m3214F3733d5655j7411A2535J738P0941h6346
$$ 73565 -16405 -8593 83267 -8481 -51695 63733 -45655 -63066 12535 14273 85214 -86346
10300C1659a2471C6993L8590J4023P3342A7291F557b53683O3489A46676J14286
$$ 31659 -12471 36993 75583 89606 162948 17291 6557 -253683 -190194 146676 260962
10289B60962a651q439C3281K82394b60802j994b2383m4799b7249P553E7630a26015
$$ 260962 -1651 -10090 33281 315675 -260802 -262796 -22383 -67182 -27249 -19696 57630 -126015
10276a35666A70072i8263a1057l46332A49649A6295L6279a36357h136G4616k4171
$$ -135666 170072 -98263 -11057 -357389 149649 16295 52574 -136357 -8136 74616 50445
10265E0445a42175J2842A1137J18084j6064L7789L8610J08610j0551Q5113A78862
$$ 50445 -142175 -129333 11137 129221 113157 150946 189556 298166 287615 372728 178862
10253B6424K9004A2659J59664a456j1102C9474o693L553b41270B82942a42096
$$ 26424 55428 12659 172323 -1456 -12558 39474 32781 36334 -241270 282942 -142096
10241B2075d7524B1635J956R4022d12006A21014L8725a19268o5142C1609g6695
$$ 22075 -47524 21635 23591 117613 -412006 121014 159739 -119268 -184410 31609 -76695
10229a36694D1150c15558J16305B53655a29647f0361A37271i1823F4415c7129
$$ -136694 41150 -315558 -199253 253655 -129647 -60361 137271 -91823 64415 -37129
10218B82676A23332b24312A46024n1243b6565B37717a9953l9355j67853G3306
$$ 282676 123332 -224312 146024 94781 -26565 237717 -19953 -59308 -227161 73306
10207a70154m7667A25936D5204m125o791a95702j09314n1875I2509a64383A38298
$$ -170154 -217821 125936 45204 41079 34288 -195702 -305016 -356891 92509 -164383 138298
10195b09790H4366c48159d0280A1066e3695l7419J9500b4165k9410k33724J7024
$$ -209790 84366 -348159 -40280 11066 -53695 -91114 -71614 -24165 -53575 -287299 -270275
10184b70275G5822J21512b26552M012Q0106p32e5749C3476O591b5773l13897J28230
$$ -270275 75822 197334 -226552 -222540 -142434 -143166 -55749 33476 40067 -25773 -339670 -211440
10172b11440D18466j89893d19079F2169N8995a19123B25336c40116a10749A72325
$$ -211440 418466 228573 -419079 62169 121164 -119123 225336 -340116 -110749 172325
10161b39929b7513B80907a57735n9111P2200l1578g3835a4102l49282H5601d8620
$$ -239929 -27513 280907 -157735 -216846 -144646 -176224 -73835 -14102 -363384 85601 -48620
10149A41328e2243j12024A00639i6226A23217N1846g7664H5779a19088e1441j6031
$$ 141328 -52243 -164267 100639 -96226 123217 175063 -77664 85779 -119088 -51441 -67472
10138f7472C3042J46222b29747A11680E4261f4359j60503e1659A08906f2980l61583
$$ -67472 33042 179264 -229747 111680 54261 -64359 -224862 -51659 108906 -62980 -424563
10127d24563b6427k2859A63566C7586r299c41454f1938j89149d4765j6873H411
$$ -424563 -26427 -49286 163566 37586 28287 -341454 -61938 -251087 -44765 -61638 8411
10115A92171b78532B08192j01342Q3685b77946J34674j04704c2321k84227A5536
$$ 192171 -278532 208192 106850 190535 -277946 -143272 -247976 -32321 -316548 15536
10104G0214J4886e5598a5758B33956A7186b00503O7159L1763c9999j24137k4075
$$ 70214 85100 -55598 -15758 233956 17186 -200503 -133344 -101581 -39999 -164136 -188211
10093a88211C3329P1807a97164O6108l8542F3067h1474k59223a18696o7686j02851
$$ -188211 33329 105136 -197164 -131056 -169598 63067 -81474 -340697 -118696 -186382 -289233
10082b89233M846I0262m82a43687n2750J3940M2516k4748L9912d1297j29481j06964
$$ -289233 -284387 90262 89780 -143687 -196437 -182497 -139981 -164729 -124817 -41297 -170778 -277742
10070b77742F3586a93695r7532B4340c08903C1187O3474h6485l8904A78268B4555
$$ -277742 63586 -193695 -291227 24340 -308903 31187 94661 -86485 -125389 178268 24555
10058b13497B56415b27828k77763B7497c00937J37703O0785J3724j09723B15222
$$ -213497 256415 -227828 -505591 27497 -300937 -163234 -102449 -88725 -198448 215222
10047e12542A28471i6603d5907D6021c49696G485g3737o8185I1539K8775d58229
$$ -512542 128471 -96603 -45907 46021 -349696 7485 -73737 -141922 91539 120314 -458229
10035E1538c0477B9187b72464m929B03473c85231a56873N9329c7455D9131B1014
$$ 51538 -30477 29187 -272464 -277393 203473 -385231 -156873 -97544 -37455 49131 21014
10023I6613b45689J21460m37933b76880Q3733j9708A93797N1145K9075c1487k6995
$$ 96613 -245689 -124229 -562162 -276880 -193147 -212855 193797 244942 274017 -31487 -58482
10012e8482j37930A14828D8984i3870F2682c33397p5877D1892d63597J40387H436
$$ -58482 -196412 114828 48984 -93870 62682 -333397 -409274 41892 -463597 -323210 8436
10000A42229A1819K99329d31192i5373j75342A87468h5819j734j19883i2376C23763
$$ 142229 11819 311148 -431192 -95373 -270715 187468 -85819 -87553 -207436 -92376 323763
9988h8552j1229A66049p0957B2711b2848A69151b02901A47691h1006A48960c1634
$$ -88552 -99781 166049 95092 22711 -22848 169151 -202901 147691 -81006 148960 -31634
9976A16175K68317b71879J10256N9563o7300E0890e7796j8397A94908B3004a69588
$$ 116175 384492 -271879 -161623 -102060 -169360 50890 -57796 -76193 194908 23004 -169588
9964h4410m6087B08513a1798q3880n16708K98448b0695l57268n3578K08273k04972
$$ -84410 -130497 208513 -11798 -95678 -612386 -313938 -20695 -377963 -431541 -223268 -428240
9953d28240H3181a49599K4338A22910f5321o4562A90280h5154k17278A06165f4606
$$ -428240 83181 -149599 -125261 122910 -65321 -129883 190280 -85154 -302432 106165 -64606
9941c54849B77535f5467k8607q3602B1788b73056k07158a47619l972f6811l08469
$$ -354849 277535 -65467 -94074 -177676 21788 -273056 -480214 -147619 -151591 -66811 -375280
9930c75280a23313d5600G0556c1446k3872j63806d6819r3735G3970R2743C1955
$$ -375280 -123313 -45600 70556 -31446 -55318 -219124 -46819 -140554 73970 166713 31955
9918b19820H3031b12713G1847a30376e0030C6965a49473B38471d9736j54303e5029
$$ -219820 83031 -212713 71847 -130376 -50030 36965 -149473 238471 -49736 -204039 -55029
9906f5719a0388H8682a55439d8546l12881F0026c43816J15734N9043M9669A44861
$$ -65719 -10388 88682 -155439 -48546 -361427 60026 -343816 -228082 -169039 -119370 144861
9894a46571I3479J12833E8038J05873b22654G5057d7870k2186D258c02873F2351
$$ -146571 93479 206312 58038 163911 -222654 75057 -47870 -70056 4258 -302873 62351
9882c26960N4999c609F5651b75535f2178J9582B72742A00925a10384l9260B89358
$$ -326960 -271961 -3609 65651 -275535 -62178 -42596 272742 100925 -110384 -149644 289358
9870a64162d2929j67829D57321E3958j7370J55393p5234M491D5606f6350I2871
$$ -164162 -42929 -210758 457321 53958 36588 191981 116747 121238 45606 -66350 92871
9858f0383k03293B47477I1368M7056O323c33873e1442p7924A69434b63333f0579
$$ -60383 -263676 247477 91368 138424 144747 -333873 -51442 -129366 169434 -263333 -60579
9846a89803A62150F7068c38003P368a12473j38125N7538Q6934A12199j7654f6825
$$ -189803 162150 67068 -338003 -330635 -112473 -250598 -193060 -106126 112199 94545 -66825
9834a04901b4177E3694J10597b02250B07828p0438a70879k26936E0930B4471a27213
$$ -104901 -24177 53694 164291 -202250 207828 137390 -170879 -397815 50930 24471 -127213
9822g85j82357P5669d9597A60345c94953a35392j9446K9889k3965a0432k34056
$$ -785 -183142 -107473 -49597 160345 -394953 -135392 -154838 -124949 -148914 -10432 -244488
9811b44488f9327k93758f6399k56K4653n2038k0299M2048I892b99566d5219J0770
$$ -244488 -69327 -363085 -66399 -66655 -42002 -94040 -114339 -72291 9892 -299566 -45219 -34449
9799c4449A34287a44210f5963B8542f4265j41091C7731Q5243a39944j11890i9541
$$ -34449 134287 -144210 -65963 28542 -64265 -205356 37731 122974 -139944 -251834 -99541
9787a43665C61871j70222f7143B5744J19981d11619C94807b75610a12261M7804
$$ -143665 361871 191649 -67143 25744 145725 -411619 394807 -275610 -112261 -64457
9777f4457k02217R6272e6808J3473a5098C2687d3027a9438j19155N0088A42404
$$ -64457 -266674 -170402 -56808 -43335 -15098 32687 -43027 -19438 -138593 -88505 142404
9765D6186O6771a06168b7473j4356j48480C7590a96684J2962I3989e9527j33283
$$ 46186 112957 -106168 -27473 -41829 -190309 37590 -196684 -183722 93989 -59527 -192810
9754a92810j9579C30170F7093g958E3732c72467i556j58077j99831J40867n2636
$$ -192810 -212389 330170 67093 -7958 53732 -372467 -9556 -167633 -367464 -226597 -279233
9743b79233O0050f3764A36580d37046K18029C0868b02948L9651B39157A3020a00232
$$ -279233 -219183 -63764 136580 -437046 -219017 30868 -202948 -163297 239157 13020 -100232
9731I5505K3872i1366L235p4810k1841k62340B94275h8373r6726B4499a50261
$$ 95505 119377 -91366 -88131 -162941 -184782 -447122 294275 -88373 -185099 24499 -150261
9719a75651r621E9268c60495c9562r1719p2086H2168J9338j6755b3349j97223
$$ -175651 -185272 59268 -360495 -39562 -131281 -203367 82168 101506 84751 -23349 -220572
9708b20572R8614b9882j3848A16524c3541j69383g6224J107c5533H579c16104
$$ -220572 -121958 -29882 -43730 116524 -33541 -202924 -76224 -75117 -35533 8579 -316104
9696G008c1645j63964F656J57545b78509B07825a66810B73350i1751H9722e5461
$$ 7008 -31645 -195609 6656 164201 -278509 207825 -166810 273350 -91751 89722 -55461
9684b33746Q0379e327k31427a17454j02007j73435a1277J360j24318F9509a10300
$$ -233746 -153367 -5327 -236754 -117454 -219461 -392896 -11277 -9917 -134235 69509 -110300
9672A99987A6188g5122k13983B04785a45985j8416a693j79264D819a1840q6943
$$ 199987 16188 -75122 -289105 204785 -145985 -164401 -1693 -180957 4819 -11840 -98783
9661i8783o390E5988h576l3638k31157A38778b73370I000L14709b35471m1890
$$ -98783 -105173 55988 -8576 -42214 -273371 138778 -273370 9000 323709 -235471 -277361
9650b77361e221k00630J3882r6299B70952c4868n5836r3669A39912C3735J11568
$$ -277361 -5221 -205851 -191969 -288268 270952 -34868 -90704 -184373 139912 33735 145303
9639A45303G2533B6995O681a4588l86625e7496B09971I498J55995g4211J3971
$$ 145303 72533 26995 33676 -14588 -401213 -57496 209971 9498 165493 -74211 -60240
9628f0240A62413g2097A84604G9764h7450r1726k48076A87946C1154b19131g3858
$$ -60240 162413 -72097 184604 79764 -87450 -179176 -427252 187946 31154 -219131 -73858
9616A8535a09808d3156j57969q0941O2236P499K1988e57q1902A00017D4708c953
$$ 18535 -109808 -43156 -201125 -282066 -219830 -212331 -190343 -557 -82459 100017 44708 -3953
9603B60518E7727a77990a683H8606J44409d8162l91307K02177B13842h7294j16384
$$ 260518 57727 -177990 -1683 88606 233015 -48162 -439469 -237292 213842 -87294 -203678
9592b03678a5898D9573c0201J4188J173A60499b11593A22729a34504A20646K5648
$$ -203678 -15898 49573 -30201 -16013 -14840 160499 -211593 122729 -134504 120646 146294
9581A46294b23730C27520a08725b6403k77650P4882M9456N5446G5769c7833j8149
$$ 146294 -223730 327520 -108725 -26403 -304053 -229171 -179715 -124269 75769 -37833 -55982
9570e5982M566l14983J23123j0720R3909j38407a18638A62291a11344j3565E4363
$$ -55982 -51416 -366399 -243276 -253996 -160087 -298494 -118638 162291 -111344 -124909 54363
9558I8073j6722a88080j97737d7556l3456D6256L72118a48289j35875g6008B41514
$$ 98073 81351 -188080 -385817 -47556 -81012 46256 418374 -148289 -284164 -76008 241514
9546C86749a31207c510A39522a75733O1416D4800J79881A10929K947d3928A33790
$$ 386749 -131207 -3510 139522 -175733 -114317 44800 224681 110929 113876 -43928 133790
9534A48932l4973K4218F1155a31584B23951b05742J00557l9244B56548D9511L9110
$$ 148932 113959 138177 61155 -131584 223951 -205742 -105185 -144429 256548 49511 88621
9523H8621a3120k021C60941A72061h334j18536m150A17998c86595B22685a21753
$$ 88621 -13120 -15141 360941 172061 -8334 -126870 -131020 117998 -386595 222685 -121753
9511h8220A4851c4332G9770a67869c9468j84079O9503D7144K08921a28389l57709
$$ -88220 14851 -34332 79770 -167869 -39468 -223547 -154044 47144 256065 -128389 -486098
9500d86098b1520D2375a43973k9873k10568J21365a6908h006B36448I1913i676
$$ -486098 -21520 42375 -143973 -173846 -384414 -263049 -16908 -8006 236448 91913 -9676
9488f0591j22961D6755M1204a40614B07218a29295B02171A8521c38731i6541o8209
$$ -60591 -183552 46755 87959 -140614 207218 -129295 202171 18521 -338731 -96541 -164750
9477a64750D5743c85981K5622A35991k8198a47327A20399M7491c23718a11999
$$ -164750 45743 -385981 -360359 135991 107793 -147327 120399 167890 -323718 -111999
9466a64173F2878c20010a00855M7852j33713p0251C394N61P2020b67763h8376
$$ -164173 62878 -320010 -100855 -53003 -186716 -256967 3394 3955 75975 -267763 -88376
9454C5411J59451i3752k43611D4063J22818e5258m0222j74126M3646l474c1598
$$ 35411 194862 -93752 -337363 44063 166881 -55258 -95480 -269606 -225960 -229434 -31598
9442b03782P2095q0840k0331d8178D7986c14655Q3366n1258J36898A73811h9269
$$ -203782 -131687 -212527 -232858 -48178 47986 -314655 -231289 -282547 -145649 173811 -89269
9430b38691n2240R0150A16673b70779H8415J00633j3072G1479b65293N9901i7831
$$ -238691 -290931 -200781 116673 -270779 88415 189048 175976 71479 -265293 -205392 -97831
9418A02132b91878A02582P2603J7257d24249J90420b0873H2096A4286a32304I008
$$ 102132 -291878 102582 175185 192442 -424249 -233829 -20873 82096 14286 -132304 9008
9406b34251g2702n6219L9210I4680a43475L6169A25784a46208c1012f720G7203
$$ -234251 -72702 -128921 -89711 94680 -143475 -107306 125784 -146208 -31012 -6720 77203
9394A611d780j04278k65771B3991L91215C8053M816a58175A6525J35734a18213
$$ 1611 -4780 -109058 -374829 23991 415206 38053 42869 -158175 16525 152259 -118213
9382c75218F3393A0182J84065e4939j96240m8629c8139B64558a91782B16100q2620
$$ -375218 63393 10182 194247 -54939 -251179 -299808 -38139 264558 -191782 216100 133480
9371A33480d3336C6519M26L6518b95965F1847b81230c9677F3009K03236C3924
$$ 133480 -43336 36519 36945 73463 -295965 61847 -281230 -39677 63009 266245 33924
9359C1217a41041A75960b49162n180c5652B12230a8167c498k59448J21623c2899
$$ 31217 -141041 175960 -249162 -254342 -35652 212230 -18167 -3498 -262946 -141323 -32899
9347a17879j44109J25694j66120E8699a57807o2751e4138A11633a66448Q908H3489
$$ -117879 -261988 -136294 -302414 58699 -157807 -220558 -54138 111633 -166448 -157540 83489
9335b73931a34807E5732K51600d831B02589b00482B5498b2045H9034L6368m6441
$$ -273931 -134807 55732 307332 -4831 202589 -200482 25498 -22045 89034 125402 78961
9324G8961f5075k4542j03317K7499e5163r8566j93641J1527a22070o5972C09156
$$ 78961 -65075 -89617 -192934 -165435 -55163 -153729 -347370 -335843 -122070 -188042 309156
9312b81207b6838D3713k179P6290c4305k14132a15042e6008j86314d7824A40899
$$ -281207 -26838 43713 41534 117824 -34305 -248437 -115042 -56008 -242322 -47824 140899
9300a94878N1282N8561L3556j97516c6848I3929h6901l5941k523j42534f9114
$$ -194878 -143596 -85035 -51479 -248995 -36848 93929 -86901 -122842 -125365 -267899 -69114
9288b4953A43196f454j47563k20224B120a82728B0631L1579a37777R512A19589
$$ -24953 143196 -6454 -154017 -374241 2120 -182728 20631 52210 -137777 -128265 119589
9276B0168b92865a7537k54981C4161a90639i4351A60145a49078E4317c01588g027
$$ 20168 -292865 -17537 -272518 34161 -190639 -94351 160145 -149078 54317 -301588 -7027
9264B8049K01722b40394J04721o7020f6336k72771j07776A6876c22290A746b41594
$$ 28049 229771 -240394 -135673 -202693 -66336 -339107 -446883 16876 -322290 1746 -241594
9252B03593M7935b72443h4435j47072K2413D2236a4711l35178M2466J05385B11339
$$ 203593 251528 -272443 -84435 -231507 -209094 42236 -14711 -349889 -307423 -202038 211339
9240g0961K7972j56865I6570a51996l89903B06464b16908j15065A11221P19a16874
$$ -70961 -42989 -199854 96570 -151996 -541899 206464 -216908 -331973 111221 111940 -116874
9228C1930P2016f256k14363B38155b0649A17751a21970a180A50348o3103d3828
$$ 31930 103946 -6256 -220619 238155 -20649 117751 -121970 -1180 150348 87245 -43828
9216D5005c29426n1367i9254A92096r5854a28797A5187R5184b29914A23149g3289
$$ 45005 -329426 -380793 -99254 192096 96242 -128797 15187 110371 -229914 123149 -73289
9204A42574A775c1688j10937e751D57389b04783j4938c5776k23906J15131n1431
$$ 142574 1775 -31688 -142625 -5751 457389 -204783 -219721 -35776 -259682 -144551 -195982
9193a95982A28084B0705b30234B27576F5696a07984k8807A4176b2594j03609j78233
$$ -195982 128084 20705 -230234 227576 65696 -107984 -136791 14176 -22594 -126203 -304436
9182c04436M1438O2582R0655D1264c6964k3645j43858e976G3421J07489i6070
$$ -304436 -262998 -200416 -109761 41264 -36964 -60609 -204467 -5976 73421 180910 -96070
9170F2624a95850p4132A14800i464A92067a32328f0512k21141D7359b49476R3495
$$ 62624 -195850 -269982 114800 -9464 192067 -132328 -60512 -281653 47359 -249476 -155981
9159a55981B94183a95153f3171j67897D4817A8076M11786F1883c20902B07549
$$ -155981 294183 -195153 -63171 -231068 44817 18076 429862 61883 -320902 207549
9148A95896c23833a10478B60995H9653b11924f2257A7248c61736a45390d0401
$$ 195896 -323833 -110478 260995 89653 -211924 -62257 17248 -361736 -145390 -40401
9137i4394i973A27781B5182a14031B3992c38361J670c7983l31927A26593a25972
$$ -94394 -9973 127781 25182 -114031 23992 -338361 -336691 -37983 -369910 126593 -125972
9125H2418a47748A08477A411b41982M9245B00021b13466A50693a42868A50329
$$ 82418 -147748 108477 1411 -241982 -192737 200021 -213466 150693 -142868 150329
9114E45379b09598A70565c43225g3069G8305a64871O6928A77861c6141k24323
$$ 545379 -209598 170565 -343225 -73069 78305 -164871 -97943 177861 -36141 -260464
9104b60464p3998A24152i5640J1275A72334f4101B67040d9209A04220D5098j5835
$$ -260464 -334462 124152 -95640 -84365 172334 -64101 267040 -49209 104220 45098 29263
9093B9263I125B514O9163A7191J53073B7826O3364R1165a40352o8181k70120e9819
$$ 29263 9125 2514 71677 17191 170264 27826 91190 182355 -140352 -208533 -478653 -59819
9080G998c7262a7j72433j6508R4122A73440f9679k6807Q016n3260k75890b8871
$$ 7998 -37262 -17 -172450 -188958 -94836 173440 -69679 -96486 -88470 -141730 -417620 -28871
9067B53408K6719a30898A64673B3190d3305A66349q2819a99725f0984m1538D3931
$$ 253408 280127 -130898 164673 23190 -43305 166349 83530 -199725 -60984 -102522 43931
9055A8562M0542c0750C0154q171J96507c35769F710d8121l57840A03080c54107
$$ 18562 59104 -30750 30154 21983 218490 -335769 6710 -48121 -405961 103080 -354107
9043a55346a9204j06416h208j0384F381c03327G0348a87960l9686F2548K7044
$$ -155346 -19204 -125620 -8208 -18592 6381 -303327 70348 -187960 -227646 62548 89592
9032H9592a08953D6601F129N41a96997h1112l7103j45458I6876a07956B55925
$$ 89592 -108953 46601 6129 6670 -196997 -81112 -118215 -263673 96876 -107956 255925
9020b89222E7420a68804j90535a2343A37424b95615c2038l4943A9335M26123B5406
$$ -289222 57420 -168804 -359339 -12343 137424 -295615 -32038 -66981 19335 445458 25406
9008b31656C0603c36108k2815J621f4307Q467j30106K5133D5831a98097b7685
$$ -231656 30603 -336108 -358923 -357302 -64307 -55840 -185946 -160813 45831 -198097 -27685
8996A95999a77806g3564G5053f0252I226J92397f3732l9290B06941E3179a5891
$$ 195999 -177806 -73564 75053 -60252 9226 201623 -63732 -103022 206941 53179 -15891
8984G8289e876m9870k74065b145A71944a40040d1878O008A80434a36777r3710
$$ 78289 -5876 -55746 -329811 -2145 171944 -140040 -41878 -35870 180434 -136777 -230487
8973b30487J5462A89095g2478k25098a26956A47509e5120j43354N6470Q984f301
$$ -230487 -215025 189095 -72478 -297576 -126956 147509 -55120 -198474 -142004 -133020 -6301
8961e1277k56379J31418g1838j61612J14874d9021j27052a1802A3898K00846b5189
$$ -51277 -307656 -176238 -71838 -233450 -118576 -49021 -176073 -11802 13898 214744 -25189
8949B34679b37360A84166c27705H1003a38437A97283F8298a76663N2493m9908
$$ 234679 -237360 184166 -327705 81003 -138437 197283 68298 -176663 -124170 -174078
8939a74078l2202D1692a95339A96670J17840R6651A91898b75514A91958Q8547
$$ -174078 -206280 41692 -195339 196670 314510 411161 191898 -275514 191958 280505
8929B80505E8357k1851f9960B20784m3314N66515J236641M836673L217872B671024
$$ 280505 58357 36506 -69960 220784 177470 743985 1980626 6817299 10035171 2671024
8918H96146l58786A86922e0435B25936p3766g6145j0447B21453Q0136j48898K21991
$$ 896146 537360 186922 -50435 225936 152170 -76145 -86592 221453 301589 152691 374682
8907C74682a63100F6125A3018N0611K3898c89396a05503G7532k2414g6957p2465
$$ 374682 -163100 66125 13018 63629 87527 -389396 -105503 77532 55118 -76957 -149422
8896a49422f1152K4878j41057k56590b12019k7600P9119N446l2759b6881B6522
$$ -149422 -61152 -36274 -177331 -433921 -212019 -239619 -160500 -155054 -187813 -26881 26522
8884i528k38513a15276b2786p920k31813g7295r4300J9802n4608B8971n770f3930
$$ -9528 -248041 -115276 -22786 -30706 -262519 -77295 -171595 -151793 -206401 28971 23201 -63930
8871f2421A58173b35577f4915C0582c4214j6660I1843d9804C49232G4909a03573
$$ -62421 158173 -235577 -64915 30582 -34214 -50874 91843 -49804 349232 74909 -103573
8859c84335A05288h3565q0538c803j75225B7125f900B48499A04414Q2623G6777
$$ -384335 105288 -83565 -164103 -3803 -179028 27125 -6900 248499 104414 187037 76777
$$ [...]
##END NTUPLES=NMR SPECTRUM
##END=
