##TITLE=AC1700_ROEFFECT0027_8638217_qd6DWnF9ei
##JCAMPDX= 6.0         $$ Bruker NMR JCAMP-DX V2.0
##DATA TYPE= NMR SPECTRUM
##DATA CLASS= NTUPLES
##ORIGIN= BRUKER
##OWNER= Administrator
$$ 1.72 TOPSPIN		Version 2.1
$$ 2014-05-23 01:01:56.660 -0700  Administrator@X
$$ Compression mode = diff/dup
##.OBSERVE FREQUENCY= 400.02188249412
##.OBSERVE NUCLEUS= ^1H
##.ACQUISITION MODE= SIMULTANEOUS (DQD)
##.ACQUISITION SCHEME= undefined
##.AVERAGES= 64
##.DIGITISER RES= 22
##SPECTROMETER/DATA SYSTEM= spect
##.PULSE SEQUENCE= noesygpps1d.comp
##.SOLVENT NAME= COFFEE_meoh
##.SHIFT REFERENCE= INTERNAL, COFFEE_meoh, 1, 14.96094
##AUDIT TRAIL= $$ (NUMBER, WHEN, WHO, WHERE, PROCESS, VERSION, WHAT)
$$ ##TITLE= Audit trail, TOPSPIN		Version 2.1
$$ ##JCAMPDX= 5.01
$$ ##ORIGIN= Bruker BioSpin GmbH
$$ ##OWNER= Administrator
$$ $$ E:\/data/COFFEE/nmr/AC1700_ROEFFECT0027_8638217_qd6DWnF9ei/12/pdata/1/auditp.txt
$$ ##AUDIT TRAIL=  $$ (NUMBER, WHEN, WHO, WHERE, PROCESS, VERSION, WHAT)
(   1,<2014-05-23 01:01:51.660 -0700>,<Administrator>,<X>,<go>,<TOPSPIN 2.1>,
      <created by zg
	started at 2014-05-23 00:50:22.066 -0700,
	POWCHK enabled, PULCHK disabled,
       configuration hash MD5:
       C8 4E 4E 5D D3 5C D8 9E 9F 52 82 E0 59 8A DE 15
       data hash MD5: 64K
       64 BB E0 B3 3A 9C 6E C4 32 12 0A 36 83 A8 08 F5>)
(   2,<2014-05-23 01:01:54.660 -0700>,<Administrator>,<X>,<proc1d>,<TOPSPIN 2.1>,
      <Start of raw data processing
       efp LB = 0.3 FT_mod = 6 PKNL = 1 PHC0 = 0 PHC1 = 0 SI = 128K 
       data hash MD5: 128K
       7B 9E 29 0F 3C 4B CF E5 DE D5 AF 8B 7F F3 ED CB>)
(   3,<2014-05-23 01:01:55.582 -0700>,<Administrator>,<X>,<proc1d>,<TOPSPIN 2.1>,
      <pk PHC0 = -83.01819 PHC1 = 0 
       data hash MD5: 128K
       08 90 DB 46 2B F1 E7 94 EF CF 08 E1 F1 5F C3 13>)
(   4,<2014-05-23 01:01:56.051 -0700>,<Administrator>,<X>,<proc1d>,<TOPSPIN 2.1>,
      <abs ABSG = 1 
       data hash MD5: 128K
       56 25 85 F9 26 6F 0C 4F B8 D3 27 BB C2 47 3E B2>)
(   5,<2014-05-23 01:01:56.160 -0700>,<Administrator>,<X>,<proc1d>,<TOPSPIN 2.1>,
      <abs ABSG = 2 
       data hash MD5: 128K
       14 5E FF 64 B3 FF 7C D1 C9 97 8B 37 45 7E F1 35>)
(   6,<2014-05-23 01:01:56.254 -0700>,<Administrator>,<X>,<proc1d>,<TOPSPIN 2.1>,
      <abs ABSG = 3 
       data hash MD5: 128K
       3C 93 03 66 7F DB 1E 7C 5B 89 7D E0 03 6D A8 E7>)
(   7,<2014-05-23 01:01:56.348 -0700>,<Administrator>,<X>,<proc1d>,<TOPSPIN 2.1>,
      <abs ABSG = 4 
       data hash MD5: 128K
       1F 95 FE 4D 67 F2 C3 B0 F7 74 58 7B D8 91 2C 28>)
(   8,<2014-05-23 01:01:56.441 -0700>,<Administrator>,<X>,<proc1d>,<TOPSPIN 2.1>,
      <abs ABSG = 5 
       data hash MD5: 128K
       F5 E9 85 22 CF 38 05 14 12 FF 23 62 7B 07 28 35>)
$$ ##END=
$$ 
$$ $$ hash MD5
$$ $$ FB 51 CC F1 D9 76 F8 4D 81 EE 19 8E EF 03 2C 0B
##$RELAX= 
##$RELAX= 
##$RELAX= 
##$RELAX= 
##$RELAX= 
##$RELAX= 
##$RELAX= 
##$RELAX= 
$$ Bruker specific parameters
$$ --------------------------
##$DU= <E:\>
##$EXPNO= 12
$$ [...]
##$TP07= 0
##$TPNAME0= <>
##$TPNAME1= <>
##$TPNAME2= <>
##$TPNAME3= <>
##$TPNAME4= <>
##$TPNAME5= <>
##$TPNAME6= <>
##$TPNAME7= <>
##$TPOAL= (0..7)
0.5 0.5 0.5 0.5 0.5 0.5 0.5 0.5
##$TPOFFS= (0..7)
0 0 0 0 0 0 0 0
##$TUNHIN= 0
##$TUNHOUT= 0
##$TUNXOUT= 0
##$USERA1= <user>
##$USERA2= <user>
##$USERA3= <user>
##$USERA4= <user>
##$USERA5= <user>
##$V9= 5
##$VALIST= <valist>
##$VCLIST= <CCCCCCCCCCCCCCC>
##$VD= 0
##$VDLIST= <DDDDDDDDDDDDDDD>
##$VPLIST= <PPPPPPPPPPPPPPP>
##$VTLIST= <TTTTTTTTTTTTTTT>
##$WBST= 2048
##$WBSW= 25
##$XGAIN= (0..3)
0 0 0 0
##$XL= 0
##$YL= 0
##$YMAX_a= 10324327
##$YMIN_a= -19388443
##$ZGOPTNS= <>
##$ZL1= 120
##$ZL2= 120
##$ZL3= 120
##$ZL4= 120
##$ABSF1= 14.96094
##$ABSF2= -5.597241
##$ABSG= 5
##$ABSL= 3
##$ALPHA= 0
##$AQORDER= 0
##$ASSFAC= 0
##$ASSFACI= 0
##$ASSFACX= 0
##$ASSWID= 0
##$AUNMP= <proc_prof1d_extract.lims>
##$AXLEFT= 0
##$AXNAME= <>
##$AXNUC= <1H>
##$AXRIGHT= 0
##$AXTYPE= 0
##$AXUNIT= <>
##$AZFE= 0.1
##$AZFW= 0.1
##$BCFW= 0
##$BC_mod= 0
##$BYTORDP= 0
##$COROFFS= 0
##$CY= 15
##$DATMOD= 1
##$DC= 0
##$DFILT= <>
##$DTYPP= 0
##$F1P= 0
##$F2P= 0
##$FCOR= 0.5
##$FTSIZE= 131072
##$FT_mod= 6
##$GAMMA= 0
##$GB= 0
##$INTBC= 1
##$INTSCL= 1
##$ISEN= 128
##$LB= 0.3
##$LEV0= 0
##$LPBIN= 0
##$MAXI= 10000
##$MC2= 0
##$MEAN= 0
##$ME_mod= 0
##$MI= 0
##$NCOEF= 0
##$NC_proc= -2
##$NLEV= 6
##$NOISF1= 0
##$NOISF2= 0
##$NSP= 0
##$NTH_PI= 0
##$NZP= 0
##$OFFSET= 14.96094
##$PC= 1
##$PHC0= -83.01819
##$PHC1= 0
##$PH_mod= 1
##$PKNL= yes
##$PPARMOD= 0
##$PPDIAG= 0
##$PPIPTYP= 0
##$PPMPNUM= 2147483647
##$PPRESOL= 1
##$PSCAL= 4
##$PSIGN= 0
##$PYNMP= <proc.py>
##$REVERSE= no
##$SF= 400.020009660752
##$SI= 131072
##$SIGF1= 0
##$SIGF2= 0
##$SINO= 400
##$SIOLD= 131072
##$SPECTYP= <>
##$SREGLST= <1H.CDCl3>
##$SSB= 0
##$STSI= 131072
##$STSR= 0
##$SW_p= 8223.68421052631
##$SYMM= 0
##$S_DEV= 0
##$TDeff= 65536
##$TDoff= 0
##$TI= <>
##$TILT= no
##$TM1= 0
##$TM2= 0
##$TOPLEV= 0
##$USERP1= <user>
##$USERP2= <user>
##$USERP3= <user>
##$USERP4= <user>
##$USERP5= <user>
##$WDW= 1
##$XDIM= 131072
##$YMAX_p= 414775578
##$YMIN_p= -11288
##$CURPLOT= <Network HP LaserJet P1505>
##$CURPRIN= <$Network HP LaserJet P1505>
##$DFORMAT= <normdp>
##$LAYOUT= <+/1D_H.xwp>
##$LFORMAT= <normlp>
##$PFORMAT= <normpl>
##$SURQMSG= 1
$$ End of Bruker specific parameters
$$ ---------------------------------
##NTUPLES= NMR SPECTRUM
##VAR_NAME=  FREQUENCY,     SPECTRUM/REAL,   SPECTRUM/IMAG
##SYMBOL=    X,             R,               I
##VAR_TYPE=  INDEPENDENT,   DEPENDENT,       DEPENDENT
##VAR_FORM=  AFFN,          ASDF,            ASDF
##VAR_DIM=   131072,        131072,          131072
##UNITS=     HZ,            ARBITRARY UNITS, ARBITRARY UNITS
##FACTOR=    0.0627417313425164, 1,          1
##FIRST=     8223.62146879497, -3184,        -79877
##LAST=      0,             -614,            -81077
##MIN=       0,             -11288,          0
##MAX=       8223.62146879497, 414775578,    0
$$ Real data points
##PAGE= N=1
##DATA TABLE= (X++(R..R)), XYDATA
$$ [...]
61154A056871j8650j7127j5152j3276j1064p942m826k967j548J262N014P172O725
61141I84492N151L386N13l652p185q550q426p813o371l933j724m72J072M068P506
61126I58062R732J0937J2496J4871J7557K0242K2839K5035K6880K9008L1500L3564
61114A212723L4957L6522L8512L9864L9951L9580L9195L7796L4817L1477K8859
61103A614253K6268K2967J9930J8024J5953J2040O856J925l094r606j7191k3855
61091A684470k8792l2890l6581l9164m0273m0421l9975l8974l7768l6584l4715
61080A278333l1570k8182k6202k5509k4344k1753j8517j5616j3132j0915q998
61069A053595p174n101l052j713j150p28RJ123K686M559N918O010N355N269O309
$$ plain form
61154 1056871 1038221 1021094 1005942 992666 981602 973660 968834 965867 964319 965581 970595 977767 984492
61141 984492 989643 993029 993542 989890 982705 974155 965729 957916 951545 947612 945888 945416 946488 950556 958062
61126 958062 967794 978731 991227 1006098 1023655 1043897 1066736 1091771 1118651 1147659 1179159 1212723
61114 1212723 1247680 1284202 1322714 1362578 1402529 1442109 1481304 1519100 1553917 1585394 1614253
61103 1614253 1640521 1663488 1683418 1701442 1717395 1729435 1736291 1738216 1735122 1725516 1708325 1684470
61091 1684470 1655678 1622788 1586207 1547043 1506770 1466349 1426374 1387400 1349632 1313048 1278333
61080 1278333 1246763 1218581 1192379 1166870 1142526 1120773 1102256 1086640 1073508 1062593 1053595
61069 1053595 1046421 1041320 1038268 1036555 1035405 1034677 1034686 1035809 1038495 1043054 1048972 1054982 1060337 1065606 1071915
61054A071915P899R469J1112J3032J5046J6839J8292J9551K0975K2864K5095K7315
61042A279404K9466L1582L3114L3412L3060L3518L5041L6179L5959L5303L5446
61031A651484L6143L6505L6499L6492L6172L5209L4192L3954L4578L5908L8144
61020B045280M1033M3420M4522M4844M5127M5472M6291M8802N3679O0439O8897
61009B587806P9565R1765J03382J13784J25008J38900J55612J76544K05826K46469
60999D024661K97862L59777M35585N28223O36941P62977R14560J099749J317822
60990A0378157J564105J832297K087020K228504K117386J679055R98928K97316
60982B3182768k09482m30320l98587j92109J07448L83210M69651K32198l19212
$$ plain form
61054 1071915 1079814 1089283 1100395 1113427 1128473 1145312 1163604 1183155 1204130 1226994 1252089 1279404
61042 1279404 1308870 1340452 1373566 1406978 1440038 1473556 1508597 1544776 1580735 1616038 1651484
61031 1651484 1687627 1724132 1760631 1797123 1833295 1868504 1902696 1936650 1971228 2007136 2045280
61020 2045280 2086313 2129733 2174255 2219099 2264226 2309698 2355989 2404791 2458470 2518909 2587806
61009 2587806 2667371 2759136 2862518 2976302 3101310 3240210 3395822 3572366 3778192 4024661
60999 4024661 4322523 4682300 5117885 5646108 6283049 7046026 7960586 9060335 10378157
60990 10378157 11942262 13774559 15861579 18090083 20207469 21886524 22885452 23182768
60982 23182768 22973286 22542966 22144379 21952270 22059718 22442928 22912579 23144777 22825565
60973B2825565j011111j616818j992603k123120k070630j908051j691430j460608
60965H951194j240499j041319q65454p14553n88835m84447l96692l24129k66580
60956C028686k21365j84762j55407j33253j16580j02780r1074q1860p4215o6391
60946A800999n8105n0390m3772l8367l5001l4306l5175l5792l5820l6066l6510
60935A361695l6245l4989l3281l1352k9034k6526k4165k1774j9190j7009j5759
60924A072371j4814j3170j0974r202q207p633p343p352p068n719l549j695p74
60911I74871l26M03J656L185M547N442O066O942Q168R143R336Q924Q362P789P236
60896A061744O955P061P255P219P021O834O699O756P266Q198R285J0528J2052
$$ plain form
60973 22825565 21814454 20197636 18205033 16081913 14011283 12103232 10411802 8951194
60965 8951194 7710695 6669376 5803922 5089369 4500534 4016087 3619395 3295266 3028686
60956 3028686 2807321 2622559 2467152 2333899 2217319 2114539 2023465 1941605 1867390 1800999
60946 1800999 1742894 1692504 1648732 1610365 1575364 1541058 1505883 1470091 1434271 1398205 1361695
60935 1361695 1325450 1290461 1257180 1225828 1196794 1170268 1146103 1124329 1105139 1088130 1072371
60924 1072371 1057557 1044387 1033413 1024211 1016004 1008371 1001028 993676 986608 980889 977340 975645 974871
60911 974871 974545 974948 976604 979789 984336 989778 995844 1002786 1010954 1020097 1029433 1038357 1046719 1054508 1061744
60896 1061744 1068699 1075760 1083015 1090234 1097255 1104089 1110788 1117544 1124810 1133008 1142293 1152821 1164873
60883A164873J3403J3868J3578J3417J3646J3651J3271J3284J3921J4152J3176
60872A314240J1668J0688J0092R023P314N528M001K642J375J85j046k336l575
60859A369799m801o068p020p321p590q815j0709j1845j1911j2451j4634j7477
60847A249157j9276j9731j9601j9165j8238j7148j6497j6339j6456j6977j7996
60836A051733j9046j9727k0293k0872k0722j9171j6801j4858j3893j3619j3594
60825H59137j3258j1918r625p521o526o218n817n544n942o472o122n075m470m563
60811G60066m355l219j851j298j673k213k183j491o96l99n51n98l56k62m84m75
60795G37962J32P90Q00K21n39j438k350k540j561k83j15j307k815l658l718l356
$$ plain form
60883 1164873 1178276 1192144 1205722 1219139 1232785 1246436 1259707 1272991 1286912 1301064 1314240
60872 1314240 1325908 1336596 1346688 1355711 1363025 1368553 1372554 1375196 1376571 1376756 1375710 1373374 1369799
60859 1369799 1364998 1358930 1351910 1344589 1336999 1328184 1317475 1305630 1293719 1281268 1266634 1249157
60847 1249157 1229881 1210150 1190549 1171384 1153146 1135998 1119501 1103162 1086706 1069729 1051733
60836 1051733 1032687 1012960 992667 971795 951073 931902 915101 900243 886350 872731 859137
60825 859137 845879 833961 824336 816815 810289 804071 798254 792710 786768 780296 774174 769099 764629 760066
60811 760066 755711 752492 750641 749343 747670 745457 743274 741783 741087 740688 740137 739539 739183 738921 738437 737962
60795 737962 738094 738884 739684 739905 739366 737928 735578 733038 731477 731194 731079 729772 726957 723299 719581 716225
60779G16225k961k846l057l288l342l467l884m330m488m434m296l938l395l091
60765F65408l062k668j621o77n26o67l61Rl73j167j218l61L38K21j81k15m8j83
60747F52648o00p92k84R47K325L023K810K357K283K162J096q85k642l213k760
60732F58475k170k115k564k985k954k676k720l219l669l649l283k789k171j642
60718F19869j729k474l096k951k349j906j694j626j978k806l341k861j778j068
60704E88212r86j137j364j692j698r47N1K59m83j202r91J41J562K551K618J841
60688E86735R26M90M76O37J204K382L559L844L315L039L769N176O311O389N285
60673F33537L762L063L694M789N140M640M094L929L803L388K773K080J296N45
$$ plain form
60779 716225 713264 710418 707361 704073 700731 697264 693380 689050 684562 680128 675832 671894 668499 665408
60765 665408 662346 659678 658057 657380 656854 656187 655826 655835 655462 654295 653077 652716 653054 653275 653094 652879 652831 652648
60747 652648 652048 651256 650972 651919 654244 657267 660077 662434 664717 666879 667975 667090 664448 661235 658475
60732 658475 656305 654190 651626 648641 645687 643011 640291 637072 633403 629754 626471 623682 621511 619869
60718 619869 618140 615666 612570 609619 607270 605364 603670 602044 600066 597260 593919 591058 589280 588212
60704 588212 587226 586089 584725 583033 581335 580388 580439 580698 580215 579013 578022 578163 579725 582276 584894 586735
60688 586735 587661 588151 588627 589264 590468 592850 596409 600253 603568 606607 610376 615552 621863 628252 633537
60673 633537 637299 640362 644056 648845 653985 658625 662719 666648 670451 673839 676612 678692 679988 680533
60659F80533L3k99o51r20p70j45O25J151J228R12O44R82J913K736K837K269J285
60642F94363m6j499k569l194l918m884n358m919m326m354m485l788k486j576j336
60627F45625j268j180j153q05K27J272J306N54K70Q72J472J408J092R93Q41K65
60611F51791n13r95q82o5J210K105J825O54k84m20k46l08m60l91k19k07l03k98
60593F51994p3L85R64J351J359J207J168J087P22L28L23N20M25K31O79J816K637
60576F67123K331J386J074J978L329L848L290K971M262O691Q343Q412Q336R662
60562G33036J1858J3387J4066J4831J5520J4677J1707P821M351J336j738m740
60550H36112p059q306q379p357n755m310l238k078n46R64J928K402K960M185O224
$$ plain form
60659 680533 680566 680267 679616 678696 677926 677781 678406 679557 680785 681697 682341 683323 685236 687972 690809 693078 694363
60642 694363 694317 692818 690249 687055 683137 678253 672895 667976 663650 659296 654811 651023 648537 646961 645625
60627 645625 644357 643177 642024 641219 641446 642718 644024 644578 644848 645720 647192 648600 649692 650685 651526 651791
60611 651791 651278 650283 649401 649336 650546 652651 654476 655130 654846 654426 654180 653872 653412 653021 652802 652595 652292 651994
60593 651994 651921 652306 653270 654621 655980 657187 658355 659442 660164 660492 660815 661335 661760 661991 662670 664486 667123
60576 667123 669454 670840 671914 673892 677221 681069 684359 687330 691592 698283 706626 715038 723374 733036
60562 733036 744894 758281 772347 787178 802698 817375 829082 836903 841254 842590 840852 836112
60550 836112 829053 820747 812368 805011 799256 794946 791708 789630 789084 790048 791976 794378 797338 801523 807747
60535H07747Q635J0756J2437J4076J5650J6239J5197J3214J1330R339O300K422
60523I43342q25k561l321l885m318m503m636m750m568m148l996m128l839k754
60509H91110j508q70q21q20n03K38J444K973M576O261Q249J0530J2966J5828J9633
60494I69286K4374K9491L4689M0047M5170M8940N0502M9961M7836M4293L9194
60483A423783L2321K3292J1799j611j5275k7265l6453m2775m6821m9287n0444
60472A221264n0094m8153m5181m1930l8582l4858l0795k6855k3330k0204j7471
60461H43811j5158j3072j1031r244q017p222o566o152o206o457o433o115n762
60448G36376n338m784m451m480m262l347k464k494k867k297q22L09O58R78J527
$$ plain form
60535 807747 816382 827138 839575 853651 869301 885540 900737 913951 925281 934620 940920 943342
60523 943342 942517 939956 936635 932750 928432 923929 919293 914543 909975 905827 901831 897703 893864 891110
60509 891110 889602 888732 887911 887091 886588 886826 888270 891243 895819 902080 910329 920859 933825 949653 969286
60494 969286 993660 1023151 1057840 1097887 1143057 1191997 1242499 1292460 1340296 1384589 1423783
60483 1423783 1456104 1479396 1491195 1489584 1474309 1447044 1410591 1367816 1320995 1271708 1221264
60472 1221264 1171170 1123017 1077836 1035906 997324 962466 931671 904816 881486 861282 843811
60461 843811 828653 815581 804550 795306 787289 780067 773501 767349 761143 754686 748253 742138 736376
60448 736376 731038 726254 721803 717323 713061 709714 707250 704756 701889 699592 698770 699079 699737 700715 702242
60433G02242J595J048P69J096J189O57L44P64J070N27j63j05K64M5m85l56M63
60416G10964J085J086Q86Q97J056J213J336J417J559K007K731L233L117K550J922
60401G37059J361Q98O97P60P63N47M52Q52J669K619L498M004L770K967K426K655
60385G66997L109K977K367K068K328K494K077J614J998L114L746L095J962J774
60371H01720K684L529L699L933M713N081M095K568K050K557K777K226J772J990
60357H45394K334K270K023J920J937K193K989M149N197O316Q193J0762J3047J4464
60343I23188J5363J6051J6202J5424J3583J0500O195J474k741o549j0441j3724
60331I84525j5015j4388j3446j2984j2185j0497q654p235n784m152l192l262l479
$$ plain form
60433 702242 703837 704885 705654 706750 707939 708596 708940 709704 710774 711301 711138 711033 711297 711342 710857 710501 710964
60416 710964 712049 713135 714021 714918 715974 717187 718523 719940 721499 723506 726237 729470 732587 735137 737059
60401 737059 738420 739318 740015 740775 741538 742085 742537 743389 745058 747677 751175 755179 758949 761916 764342 766997
60385 766997 770106 773083 775450 777518 779846 782340 784417 786031 788029 791143 794889 797984 799946 801720
60371 801720 804404 807933 811632 815565 820278 825359 829454 832022 834072 836629 839406 841632 843404 845394
60357 845394 847728 849998 852021 853941 855878 858071 861060 865209 870406 876722 884915 895677 908724 923188
60343 923188 938551 954602 970804 986228 999811 1010311 1016506 1017980 1015239 1008690 998249 984525
60331 984525 969510 955122 941676 928692 916507 906010 897356 890121 884337 880185 876993 873731 870252
60318H70252l352l688m843n517m552k686j254k71R20K195L234M559O663Q924J0693
60303H81277J2566J5293J8324K0977K4007K8247L2374L3958L2370K8836K3820
60292A152049J6403O522l950j2985k0011k5227k8500k9651k8992k6998k3957k0355
60280I54348j7000j4413j2453j0810r497q686q325q033p306n978m662m340n170
60267H37675o026n675m156k508j489j119j146j328j395j248j117j116q38J01J349
60252H09964K120K127J737J346J056Q57Q18J040J575K245K521J918O07p32j656
60237H27543k134k035j216k13J22o8M10J993L491L698L048K862L556M480N037
60222H50574N163M990M758M763M906M707M193M183N143O401P132P482Q021Q692
$$ plain form
60318 870252 866900 863212 858369 852852 848300 845614 844360 844089 845009 847204 850438 854997 861660 870584 881277
60303 881277 893843 909136 927460 948437 972444 1000691 1033065 1067023 1099393 1128229 1152049
60292 1152049 1168452 1174974 1171024 1158039 1138028 1112801 1084301 1054650 1025658 998660 974703 954348
60280 954348 937348 922935 910482 899672 890175 881489 873164 865131 857825 851847 847185 842845 837675
60267 837675 831649 825974 821818 819310 817821 816702 815556 814228 812833 811585 810468 809352 808514 808615 809964
60252 809964 812084 814211 815948 817294 818350 819207 820025 821065 822640 824885 827406 829324 829931 829199 827543
60237 827543 825409 823374 822158 821945 822067 821999 822409 824402 827893 831591 834639 837501 841057 845537 850574
60222 850574 855737 860727 865485 870248 875154 879861 884054 888237 893380 899781 906913 914395 922416 931108
60208I31108R165R692J0701J1844J2274J1619J0132Q288O755O252O654O762N686
60195A046932L989K744K041J283M17k06p66j739k889l562l875m614n931o980p050
60180A019794o386n715n448n524n685n840o212o871p169o165l907j691o42n63
60166I51976o35n94o10n94l14J69P65J600K490K726J952P83j4l90n96n04N6Q24
60148I59090J585K540L665M380M441M458M926N538O082P040Q535R670R901J0145
60134A041996J1410J3122J3975J3638J2577J0966R018P516O646N089J810j855
60122A145908l602l179k349k182k105j571r43m52K68J235J855J837J451Q07j44
60107A136834r57j149j222k167l943n527o485p357q411r104r035q398p358n848
$$ plain form
60208 931108 940273 949965 960666 972510 984784 996403 1006535 1014823 1021578 1027830 1034484 1041246 1046932
60195 1046932 1050921 1053665 1055706 1056989 1057406 1057200 1056434 1054695 1051806 1048244 1044369 1039755 1033824 1026844 1019794
60180 1019794 1013408 1007693 1002245 996721 991036 985196 978984 972113 964944 958779 954872 953181 952539 951976
60166 951976 951341 950747 950137 949543 949229 949398 950163 951763 954253 956979 958931 959714 959700 959310 958714 958210 958266 959090
60148 959090 960675 963215 966880 971260 975701 980159 985085 990623 996705 1003745 1012280 1021950 1031851 1041996
60134 1041996 1053406 1066528 1080503 1094141 1106718 1117684 1126702 1134218 1140864 1145953 1147763 1145908
60122 1145908 1142306 1139127 1136778 1134596 1132491 1130920 1129977 1129525 1129793 1131028 1132883 1134720 1136171 1136978 1136834
60107 1136834 1135877 1134728 1133506 1131339 1127396 1121869 1115384 1108027 1099616 1090512 1081477 1073079 1065721 1059873
60093A059873m141k805j974j329p92m51M6J147K558L540L959M202M260L842L251
60078A075186L180L708M303M638M509L298N89k792n443o966p964q782r355j0010
60064A048099j1111j1942j1299r290p363o442o171o044o037n917n129l763k671
60051I54920k307k221j921j364n10P99K367L765M963O137P007P195O993O993P109
60036I99925O876O415O053N349L658J458j22r27j758k909m025n214o871q563r494
60021I89851j0014j1162j2670j3083j2031j0804j0270r741q393o458m520k789
60009H77916j522j012q49k42O46Q35J74m64p10r92j080J1K142L726L917L681L967
59992H90144M251L830L302L617M608N406N663N576N449N662O369O797N786L427
$$ plain form
60093 1059873 1055732 1052927 1050953 1049624 1048832 1048381 1048427 1049574 1052132 1055672 1059631 1063833 1068093 1071935 1075186
60078 1075186 1078366 1082074 1086377 1091015 1095524 1098822 1099411 1096619 1091176 1084210 1076246 1067464 1058109 1048099
60064 1048099 1036988 1025046 1013747 1004457 997094 990652 984481 978437 972400 966483 961354 957591 954920
60051 954920 952613 950392 948471 947107 946597 947396 949763 953528 958491 964628 971635 978830 985823 992816 999925
60036 999925 1006801 1013216 1019269 1024618 1028276 1029734 1029612 1028685 1026927 1024018 1019993 1014779 1007908 999345 989851
60021 989851 979837 968675 956005 942922 930891 920087 909817 900076 891683 885225 880705 877916
60009 877916 876394 875382 874533 874291 874937 875772 875946 875482 874772 873780 872700 872711 874853 878579 882496 886177 890144
59992 890144 894395 898225 901527 905144 909752 915158 920821 926397 931846 937508 943877 950674 956460 959887
59978I59887J144k53j513l345n082n711n313m671m203l914l735l298k085k34J461
59963I19135K613L580M467M777M411M012L984M092M332N071N969N844M257K190
59949I78734O84k42r01j222j280j550k055k212j933j973k730l728m627n684o805
59934I42476p308p119o939o766n573l098o95M02M94L98K52J25O39K016L464M336
59918I17104M952N598N794N366N171N865O909P623Q244R115R868J0179J0369J0507
59904A022664R948Q507O944N536L442L96k300l490l684l756l459k465j614j587
59890A035082j432J1K085L327L700M196M818M688L856L376L675M225M784N688
59876A082079O874P702P873P625P003N724L797J631m49k344m009n454o696p438
$$ plain form
59978 959887 961031 960778 959265 955920 950838 945127 939814 935143 930940 927026 923291 919993 917908 917674 919135
59963 919135 921748 925328 929795 934572 938983 942995 946979 951071 955403 960474 966443 972287 976544 978734
59949 978734 979418 979176 978275 977053 975773 974223 972168 969956 968023 966050 963320 959592 954965 949281 942476
59934 942476 935168 928049 921110 914344 908771 905673 904978 905380 905874 906272 906524 906649 907288 909304 912768 917104
59918 917104 922056 927654 933448 938814 943985 949850 956759 964382 972626 981741 991609 1001788 1012157 1022664
59904 1022664 1032612 1041119 1048063 1053599 1057041 1057437 1055137 1051647 1047963 1044207 1040748 1038283 1036669 1035082
59890 1035082 1033650 1033661 1035746 1039073 1042773 1046969 1051787 1056475 1060331 1063707 1067382 1071607 1076391 1082079
59876 1082079 1088953 1096655 1104528 1112153 1119156 1124880 1128677 1130308 1129859 1127515 1123506 1118052 1111356 1103918
59862A103918p257o473o160o868p934q405q031o956n336l745l023l094k735j217
59848A026684O68J806K185K462L042M178O014P922Q788Q601Q590R076Q628O310
59834A104954L399J610Q76L37M13K111N022P534Q586P967N505J418l096o841r732
59819A130063j1909j2619j1393r544q839r136q857p407n598m016k546j470j458
59806A035271k273k693k028q20K1J6p63j668j852j366j440k895m803n720n635
59791A001352n577n764n495m591l684l114k625k142j865j697j361j017r92j085
59777I60343q86n29m08m92n57p00q86n31O59J979K692L108L766M256L947L389
59761I79150L727N003O151O493O262N915N753O037O759P425P741Q036Q550Q908
$$ plain form
59862 1103918 1096661 1090188 1084028 1077160 1069226 1060821 1052790 1045834 1040498 1036753 1033730 1030636 1027901 1026684
59848 1026684 1027352 1029158 1031343 1033805 1036847 1041025 1047039 1054961 1063749 1072350 1080940 1090016 1098644 1104954
59834 1104954 1108353 1109963 1110839 1111176 1111589 1113700 1118722 1126256 1134842 1142809 1148314 1149732 1146636 1139795 1130063
59819 1130063 1118154 1105535 1094142 1084598 1075759 1066623 1057766 1050359 1044761 1040745 1038199 1036729 1035271
59806 1035271 1032998 1030305 1028277 1027457 1027478 1027494 1026731 1025063 1023211 1021845 1020405 1017510 1012707 1006987 1001352
59791 1001352 995775 990011 984516 979925 976241 973127 970502 968360 966495 964798 963437 962420 961428 960343
59777 960343 959457 958928 958520 958028 957471 956771 955885 955354 956013 957992 960684 963792 967558 971814 975761 979150
59761 979150 982877 987880 994031 1000524 1006786 1012701 1018454 1024491 1031250 1038675 1046416 1054452 1063002 1071910
59747A071910Q897Q968R330R365Q722Q026P627O706M729K712J746J282K05j225
59733A149000j965j920j635j040l9M27n05j972k417j762j005l19P98J952K166
59718A139764J480P61K17m36q35m55J22K0l03K14J303J785J503J202R17J76n42
59701A146893l62K67K06l25q1J033J990K595L543M774N540N950O388N758K657
59686A186826j737m280l771k143j277r08k41M62Q17J056J008j30k196l807m343
59671A165336m751n747o739p192p543q049q117p512o913o586n809m245k661j626
59657A081846p53K38R17J217J862L142M421N377O422P457P492O151M329K770J198
59642A134086n24j720k091k411l277m182m470m184l515k428j334r31r68k99J252
$$ plain form
59747 1071910 1080807 1089775 1099105 1108470 1117192 1125218 1132845 1139551 1144280 1146992 1148738 1150020 1150225 1149000
59733 1149000 1147035 1145115 1143480 1142440 1142401 1142828 1142323 1140351 1137934 1136172 1135167 1134848 1135646 1137598 1139764
59718 1139764 1141244 1142005 1142222 1141786 1140951 1140496 1140618 1140638 1140335 1140549 1141852 1143637 1145140 1146342 1147259 1147435 1146893
59701 1146893 1146531 1146798 1147004 1146679 1146598 1147631 1149621 1152216 1155759 1160533 1166073 1172023 1178411 1184169 1186826
59686 1186826 1185089 1180809 1177038 1174895 1173618 1172710 1172469 1172931 1173748 1174804 1175812 1175682 1173486 1169679 1165336
59671 1165336 1160585 1154838 1148099 1140907 1133364 1125315 1117198 1109686 1102773 1096187 1090378 1086133 1083472 1081846
59657 1081846 1081093 1081331 1082248 1083465 1085327 1088469 1092890 1098267 1104689 1112146 1119638 1125789 1130118 1132888 1134086
59642 1134086 1133562 1131842 1129751 1127340 1124063 1119881 1115411 1111227 1107712 1105284 1103950 1103019 1102051 1101752 1103004
59627A103004K382K146J090l6j285k526k837j838n81j51l24m08m19o04o94n12
59611A096407m96q17p75J32J280J886K228L103M484N491N383M149K477J317J051
59596A127300R74J57j158j797j311n20l21p75j533k238k344j465j21O17L60m10
59580A115415j267k071k414j910j020n88p04r59j464k365k771j703R2R58P68Q29
59564A098826J446J551R36Q45J796K660K473J649Q84L50L57J227K204K126J421
59549A120751J653K872L429K765K219K522K762K543K899M209N384O157P896J1085
59535A179146J4297J6867J9991K3459K3928J8859J0392L066r27k180j437R28L766
59522A310155N781O931P660P529O129M372L151J684j138m603p163q776j0495j2419
$$ plain form
59627 1103004 1105386 1107532 1108622 1108586 1107301 1104775 1101938 1100100 1099519 1099368 1099044 1098636 1098217 1097613 1096919 1096407
59611 1096407 1095911 1095094 1094319 1094451 1095731 1097617 1099845 1102948 1107432 1112923 1118306 1122455 1124932 1126249 1127300
59596 1127300 1128274 1128431 1127273 1125476 1124165 1123645 1123324 1122549 1121016 1118778 1116434 1114969 1114848 1115465 1115825 1115415
59580 1115415 1114148 1112077 1109663 1107753 1106733 1106145 1105441 1104482 1103018 1100653 1097882 1096179 1096271 1097229 1097997 1098826
59564 1098826 1100272 1101823 1102759 1103604 1105400 1108060 1110533 1112182 1113066 1113416 1113773 1115000 1117204 1119330 1120751
59549 1120751 1122404 1125276 1128705 1131470 1133689 1136211 1138973 1141516 1144415 1148624 1154008 1160165 1168061 1179146
59535 1179146 1193443 1210310 1230301 1253760 1277688 1296547 1306939 1310005 1309078 1306898 1305461 1306389 1310155
59522 1310155 1315936 1322867 1330527 1338056 1344185 1348557 1351708 1353392 1352254 1347651 1340488 1331712 1321217 1308798
59508A308798j3752j4363j4681j4442j3167j1390j0001q769p025n222m385m283
59496A187318l702k327r94j48O52J745K829L489L587L265L090L716M912N579N295
59481A218306N080N971P692R461J1134J2753J3948J4630J5391J6386J6876J6533
59469A364161J5968J5030J2262P386K752O35K70n20j885k201r55P84K514M972
59455A421173Q570J2663J6447J9401K1041K1361K1294K1686K2092K1645K0553
59444A627926J9529J8126J4834Q756K85r408j8702k5759k9503l0188k8561k5141
59432A522194k0883j7387j5535j4699j4122j3911j3751j2129q278l664K0L169
59420A391024P025J1270J4733J7484K0259K2703K4127K5155K6627K7743K7574
$$ plain form
59508 1308798 1295046 1280683 1266002 1251560 1238393 1227003 1217002 1208233 1201208 1195986 1191601 1187318
59496 1187318 1183616 1181289 1180295 1180147 1180799 1182544 1185373 1188862 1192449 1195714 1198804 1202520 1207432 1213011 1218306
59481 1218306 1223386 1229357 1237049 1246510 1257644 1270397 1284345 1298975 1314366 1330752 1347628 1364161
59469 1364161 1380129 1395159 1407421 1414807 1417559 1418194 1418464 1417944 1416059 1413858 1412903 1413687 1416201 1421173
59455 1421173 1429743 1442406 1458853 1478254 1499295 1520656 1541950 1563636 1585728 1607373 1627926
59444 1627926 1647455 1665581 1680415 1689171 1689456 1680048 1661346 1635587 1606084 1575896 1547335 1522194
59432 1522194 1501311 1483924 1468389 1453690 1439568 1425657 1411906 1399777 1391499 1387835 1387855 1391024
59420 1391024 1398049 1409319 1424052 1441536 1461795 1484498 1508625 1533780 1560407 1588150 1615724
59409A615724K7383K8508K8294K1525O788j0956k5079l2514l3755l0279k3719
59398A571920j5958p993N72R536J5949J5440O253q385k2217l0422l2467l0903
59386A471325k8012k4348k0112j6285j3523j1114q209n290l314k157j078n7O01
59373A338427J306K555L808M307M478N156N915N692M722M345N019O014O906Q005
59359A406655R205R826R800R919J0695J1842J3041J4325J5723J7189J8873K0789
59347A567882K2472K3562K4333K5091K5502K5164K4221K2775K0440J7141J3403
59336A811986R098L154m406j1379j5837j8583k1567k4845k6954k7503k7420k7043
59324A618701k5893k4026k1988j9672j6747j3908j2087j0825q969o655m950l951
$$ plain form
59409 1615724 1643107 1671615 1699909 1721434 1728222 1717266 1692187 1659673 1625918 1595639 1571920
59398 1571920 1555962 1547969 1548541 1558077 1574026 1589466 1595719 1587334 1565117 1534695 1502228 1471325
59386 1471325 1443313 1418965 1398853 1382568 1369045 1357931 1349722 1344432 1341118 1338961 1337883 1337826 1338427
59373 1338427 1339733 1342288 1346096 1350403 1354881 1360037 1365952 1371644 1376366 1380711 1385730 1391744 1398650 1406655
59359 1406655 1415860 1425686 1435486 1445405 1456100 1467942 1480983 1495308 1511031 1528220 1547093 1567882
59347 1567882 1590354 1613916 1638249 1663340 1688842 1714006 1738227 1761002 1781442 1798583 1811986
59336 1811986 1821084 1824238 1819832 1808453 1792616 1774033 1752466 1727621 1700667 1673164 1645744 1618701
59324 1618701 1592808 1568782 1546794 1527122 1510375 1496467 1484380 1473555 1464586 1457931 1452981 1449030
59312A449030k952k102k080k411j894o42J52L05P28J466J489O53J67P88K002L151
59296A447850M118M788N152N972Q104J1186J4001J5706J5621J2577O192j668q330
59283A541269j2791j5249j5181j2130p761m598k722j21L768P344R810J2286J5351
59270A519275J7944J9470K0779K2178K2420K0676J7736J4424J0403N503O16l558
59258A687866p375j1115j4298j6645j8367j9069j7895j5283j2985j1739j0446
59247A532649q287o018m403k894r01J021K231L194M678O634Q602J0384J1801J2635
59233A571326J3145J3710J3734J2039Q551M539R65k216n002p047q625j0506j2553
59220A592060j3692j3581j2944j2173j1016r741q985q134n703j820J378K395J947
$$ plain form
59312 1449030 1446078 1443976 1441896 1439485 1437591 1436949 1437101 1437406 1438134 1439600 1441089 1441742 1441909 1442697 1444699 1447850
59296 1447850 1451968 1456756 1461908 1467880 1475984 1487170 1501171 1516877 1532498 1545075 1551267 1549599 1541269
59283 1541269 1528478 1513229 1498048 1485918 1478157 1473559 1470837 1470716 1474484 1481828 1491638 1503924 1519275
59270 1519275 1537219 1556689 1577468 1599646 1622066 1642742 1660478 1674902 1685305 1690808 1691424 1687866
59258 1687866 1680491 1669376 1655078 1638433 1620066 1600997 1583102 1567819 1554834 1543095 1532649
59247 1532649 1524362 1518344 1513941 1511047 1510146 1511167 1513398 1516592 1521270 1527904 1536506 1546890 1558691 1571326
59233 1571326 1584471 1598181 1611915 1623954 1632505 1637044 1638009 1635793 1630791 1623744 1615119 1604613 1592060
59220 1592060 1578368 1564787 1551843 1539670 1528654 1518913 1509928 1501794 1496091 1494271 1495649 1498044 1499991
59207A499991J373J093J229K127L444M067L603K657J385o46k772l357k251j338
59193A510605j792k510k228j390q07j36J043K052K348K602L373L963L769L639
59179A524531M469N541N579M711M112M347N152O291P659Q980J0154J1460J2898
59166A615884J3996J4653J5432J6484J7101J6731J5680J4176J1753Q093L731o29
59154A763085m771q530j1521j3675j5326j6483j6765j6188j5257j4137j2711j1380
59142A606341j0767j0656j0294r705r422r100p863o049m950m729m195k877j640
59129A514094r02j8J226K131K588L434M875O101O890P956R304J0034J0191J1047
59115A588951J2939J4550J4971J4728J4278J3291J2005J1382J1317J0541Q941
$$ plain form
59207 1499991 1501364 1502457 1503686 1505813 1509257 1513324 1516927 1519584 1520969 1520323 1517551 1514194 1511943 1510605
59193 1510605 1508813 1506303 1504075 1502685 1501878 1501742 1502785 1504837 1507185 1509787 1513160 1517123 1520892 1524531
59179 1524531 1529000 1534541 1540120 1544831 1548943 1553290 1558442 1564733 1572392 1581372 1591526 1602986 1615884
59166 1615884 1629880 1644533 1659965 1676449 1693550 1710281 1725961 1740137 1751890 1759983 1763714 1763085
59154 1763085 1758314 1749784 1738263 1724588 1709262 1692779 1676014 1659826 1644569 1630432 1617721 1606341
59142 1606341 1595574 1584918 1574624 1564919 1555497 1546397 1538534 1532485 1527535 1522806 1518611 1515734 1514094
59129 1514094 1513192 1513174 1514400 1516531 1519119 1522553 1527428 1533529 1540419 1548375 1557679 1567713 1577904 1588951
59115 1588951 1601890 1616440 1631411 1646139 1660417 1673708 1685713 1697095 1708412 1718953 1727894
59104A727894P941P984P771O768O174O396N908L906J902J209R36n0j090j246j048
59089A781355j139q80J55R85R69J030J587J117j417m434o021o760q242j0164j1069
59074A737072j0959j0951j1111j0576r314q078p003n692m223k935j718n60l2l55
59060A653565p11l71L52R57J476J672R14m48r73l13J04n14q72K66K117L403M214
59043A664838M999N207M418L375K556J210q65k186j703m94J57P25J952L127L696
59028A691012M832P441J0119J1260J1799J3617J6432J8507J9494K0281K0713J9704
59016A865211J7164J3998J0637P066L720R25j878m942p147p413o286m833l040
59003A883182o47J676L454N502Q355J0884J2110J2966J4514J5664J4770J2334
$$ plain form
59104 1727894 1735835 1743819 1751590 1758358 1764532 1770928 1776836 1780742 1782644 1783853 1784789 1784739 1783649 1782403 1781355
59089 1781355 1780216 1779336 1779491 1780476 1781445 1782475 1784062 1785179 1783762 1779328 1773307 1766547 1758305 1748141 1737072
59074 1737072 1726113 1715162 1704051 1693475 1684161 1676083 1669080 1663388 1659165 1656230 1654512 1653952 1653920 1653565
59060 1653565 1652854 1652483 1652835 1653792 1655268 1656940 1657854 1657406 1656433 1656120 1656224 1655710 1654838 1655104 1657221 1660624 1664838
59043 1664838 1669837 1675044 1679462 1682837 1685393 1686603 1685738 1683552 1681849 1681355 1681512 1682237 1684189 1687316 1691012
59028 1691012 1695844 1703285 1713404 1724664 1736463 1750080 1766512 1785019 1804513 1824794 1845507 1865211
59016 1865211 1882375 1896373 1907010 1914076 1917796 1918721 1916843 1911901 1904754 1897341 1891055 1886222 1883182
59003 1883182 1882535 1884211 1887665 1893167 1901522 1912406 1924516 1937482 1951996 1967660 1982430 1994764
58991A994764J0130Q596P062N581M548L300J042j565l433m839o503p843p894p114
58977A995832o469n592l569p16K058M742P544R788J1067J2339J4307J5995J6607
58964B073933J7282J9072K0723K0608J9420J8596J7461J4428R925N583J438l530
58952B234939q979j3678j7610k1273k3801k4126k3157k2427k1569j9425j6667
58941B022227j4719j3028j0077o300l414j584J27J406J514J533K780L870K573
58928A986908j18j173l67l49j964l110k729k418l245l901l197j848p44L43J521
58913A963609K168K331K933M164N303O306P729R105R383R116J0021J2298J4456
58900B058922J5971J7829K0262K2115K2906K3416K3798K3138K1434K0155K0295
$$ plain form
58991 1994764 2004894 2013490 2020552 2026133 2030681 2033981 2035023 2033458 2030025 2025186 2018683 2010840 2002946 1995832
58977 1995832 1989363 1983771 1980202 1979486 1981544 1986286 1993830 2003618 2014685 2027024 2041331 2057326 2073933
58964 2073933 2091215 2110287 2131010 2151618 2171038 2189634 2207095 2221523 2231448 2237031 2238469 2234939
58952 2234939 2225960 2212282 2194672 2173399 2149598 2125472 2102315 2079888 2058319 2038894 2022227
58941 2022227 2007508 1994480 1984403 1978103 1974689 1973105 1973232 1974638 1976152 1977685 1980465 1984335 1986908
58928 1986908 1986790 1985617 1985250 1984901 1982937 1979827 1977098 1974680 1971435 1967534 1964337 1962489 1961745 1962088 1963609
58913 1963609 1965777 1968108 1971041 1975205 1980508 1986814 1994543 2003648 2013031 2022147 2032168 2044466 2058922
58900 2058922 2074893 2092722 2112984 2135099 2158005 2181421 2205219 2228357 2249791 2269946 2290241
58889B290241K1462K3241K5843K9095L2228L4867L6851L7232L4936L0312K4608
58878B620916J8287J1392M843n68n843j2359j9241k4348k7396k9773l1597l1547
58866B472766k9534k7103k4973k2436j9351j6628j4667j3226j2710j3562j4557
58855B264019j3989j2349j1598j1912j1582r997q363p333o282n115m597m741m864
58842B151297n196o418p838q225q057q605r278q389o275m896m605m069l155l020
58828B063271l365k669j120l53j98J202L796N386N393N665O923P586O960O539
58814B105016P132P444O629N678N313M863M060L677L601K701J145N63J269J712
58800B160803J161M86m0j122k284k118j131j449l209m169l507k900l041k223L96
$$ plain form
58889 2290241 2311703 2334944 2360787 2389882 2422110 2456977 2493828 2531060 2565996 2596308 2620916
58878 2620916 2639203 2650595 2655438 2654870 2649027 2636668 2617427 2593079 2565683 2535910 2504313 2472766
58866 2472766 2443232 2416129 2391156 2368720 2349369 2332741 2318074 2304848 2292138 2278576 2264019
58855 2264019 2250030 2237681 2226083 2214171 2202589 2192592 2184229 2176896 2170614 2165499 2160902 2156161 2151297
58842 2151297 2146101 2139683 2131845 2123620 2115563 2106958 2097680 2089291 2083016 2078120 2073515 2069446 2066291 2063271
58828 2063271 2059906 2057237 2056117 2055764 2055566 2056768 2060564 2065950 2071343 2077008 2083931 2091517 2098477 2105016
58814 2105016 2112148 2119592 2126221 2131899 2137212 2142075 2146135 2149812 2153413 2156114 2157259 2157822 2159091 2160803
58800 2160803 2161964 2162450 2162410 2161288 2159004 2156886 2155755 2154306 2151097 2146928 2143421 2140521 2137480 2135257 2135653
58785B135653L133M595N559O881Q038Q715R434R749Q436O144N152N767N822M464
58771B227542L360L209K374K14j397j367j176j914k318j370j41M88J373K920L959
58756B235756M174N027O914P999P302O304O115N690M358L456L950M878N580O916
58742B314419Q960J0136J0006J0212J1316J1560J0173Q945Q971Q822P660P218
58730B428398Q744J0712J1509J1745J2155J1941J0968J0858J1992J2246J0639
58719B551907R324R982J1150J1260J1423J2733J3701J2884J1532J1110J0593Q670
58707B686269O264M411J985j916n666p694r301j2335j6053j8734k0467k1964k2569
58694B562230k1776k0805k0455j9359j6461j3202j1003q791n369k201j289k038
$$ plain form
58785 2135653 2138786 2143381 2148940 2155821 2163859 2172574 2182008 2191757 2200193 2206337 2211489 2217256 2223078 2227542
58771 2227542 2230902 2234111 2236485 2236699 2235302 2233935 2232759 2230845 2228527 2227157 2227016 2227504 2228877 2231797 2235756
58756 2235756 2239930 2244957 2251871 2259870 2267172 2273476 2279591 2285281 2289639 2293095 2297045 2301923 2307503 2314419
58742 2314419 2323379 2333515 2343521 2353733 2365049 2376609 2386782 2395727 2404698 2413520 2421180 2428398
58730 2428398 2437142 2447854 2459363 2471108 2483263 2495204 2506172 2517030 2529022 2541268 2551907
58719 2551907 2561231 2571213 2582363 2593623 2605046 2617779 2631480 2644364 2655896 2667006 2677599 2686269
58707 2686269 2692533 2696944 2698929 2697013 2691347 2683653 2674352 2662017 2645964 2627230 2606763 2584799 2562230
58694 2562230 2540454 2519649 2499194 2479835 2463374 2450172 2439169 2430378 2425009 2422808 2421519 2419481
58682B419481k617k828l373l807l355k398j388R3J792K314J633J902M208O789
58668B418446Q092R095J0946J2900J4409J6526J9342K0791J9913J8384J6949J3603
58656B599396P693K403L46j95j778l650m173m367n553o255m899l107k917l108
58642B569836j733J17O16R66L172O119P545Q043R468J1101J1022R770R118Q657
58628B653817O950M740L728L436K366R95P60J409K094L547O428R242J0586J1766
58614B721864J4395J7314J8691J9169J9975J9966J7647J4166J1225Q080L775J38
58602B886405q18m31j001j899j493p79j397k062q24R48P90l02N05L155N424P049
58586B893270R348J2000J3759J5250J7627J9736J9949J9365J9860K0537J9479
$$ plain form
58682 2419481 2416864 2414036 2410663 2406856 2403501 2401103 2399715 2399808 2401600 2403914 2405547 2407449 2411657 2418446
58668 2418446 2426538 2435633 2446579 2459479 2473888 2490414 2509756 2530547 2550460 2568844 2585793 2599396
58656 2599396 2607089 2609492 2609838 2609643 2607865 2604215 2600042 2595675 2590122 2583867 2578968 2575861 2572944 2569836
58642 2569836 2568103 2568220 2568836 2569802 2572974 2579093 2586638 2594681 2604149 2615250 2626272 2636042 2645160 2653817
58628 2653817 2660767 2665507 2669235 2672671 2675037 2676032 2676792 2678201 2680295 2683842 2690270 2699512 2710098 2721864
58614 2721864 2736259 2753573 2772264 2791433 2811408 2831374 2849021 2863187 2874412 2882492 2886267 2886405
58602 2886405 2885587 2885156 2884155 2882256 2880763 2879984 2878587 2876525 2875701 2876649 2877439 2877137 2877642 2880797 2886221 2893270
58586 2893270 2902618 2914618 2928377 2943627 2961254 2980990 3000939 3020304 3040164 3060701 3080180
58575C080180J7418J6167J5147J3069J1385J2245J4625J6159J7277J9801K3085
58564C256558K5431K7675L1505L5682L7877L8668L9826M0206L7416L1996K6016
58553C628856J9103J0117J109m780p962j0766j2642j1550q613o750n826l808j703
58540C584785k631o682j1112j4944j9138k2924k4341k3856k3424k2672j9859j5657
58528C377545j2077q809m519n02J133J612L522O139O985O713P785R599R557P953
58514C412636P226P391O659N359M953M502K622J219K583M554L736J668K318N047
58500C472473N911M633M361N438N332L987L586L671K246P74K338N617O681N930
58486C532978P076J0071J1524J1641J4074J8849K2085K2994K4725K7845K9372
$$ plain form
58575 3080180 3097598 3113765 3128912 3141981 3153366 3165611 3180236 3196395 3213672 3233473 3256558
58564 3256558 3281989 3309664 3341169 3376851 3414728 3453396 3493222 3533428 3570844 3602840 3628856
58553 3628856 3647959 3658076 3659185 3654405 3646443 3635677 3623035 3611485 3602872 3596122 3590296 3586488 3584785
58540 3584785 3582154 3575472 3564360 3549416 3530278 3507354 3483013 3459157 3435733 3413061 3393202 3377545
58528 3377545 3365468 3356659 3352140 3351638 3352771 3354383 3357905 3364044 3371029 3377742 3385527 3395126 3404683 3412636
58514 3412636 3419862 3427253 3433912 3439271 3444224 3448726 3451348 3452567 3455150 3459704 3463440 3465108 3467426 3472473
58500 3472473 3478384 3483017 3487378 3492816 3498148 3502135 3505721 3509392 3511638 3512412 3514750 3520367 3527048 3532978
58486 3532978 3540054 3550125 3561649 3573290 3587364 3606213 3628298 3651292 3676017 3703862 3733234
58475C733234K8757K8615K8854K6286K0741J5535J1236N076k639p695q644q540
58463C870816r008q213n643l364j583J674N891Q415R828J3354J8637K1911K2568
58450C945283K3552K4862K3000J7517J1927P487K167l659o826p311q284r667q111
58437D011937l859r58L5K740P600J0759J1279J2419J4816J5454J4593J6338K0921
58424D134074K3677K3335K3940K6810K7933K5361K1963J8830J3285N673Q22K20
58412D345923k95k800m215l206k975m708n243l741l586n260m575n28K360K181
58398D309332K829O309R173R556J0547J3503J5174J4381J4505J6505J6589J3697
58386D452100J1955J2855J2558R814Q878J1355J2961J1694J1437J4072J5835J4979
$$ plain form
58475 3733234 3761991 3790606 3819460 3845746 3866487 3882022 3893258 3898334 3895695 3888000 3879356 3870816
58463 3870816 3861808 3853595 3847952 3844588 3843005 3844679 3850570 3858985 3868813 3882167 3900804 3922715 3945283
58450 3945283 3968835 3993697 4016697 4034214 4046141 4053628 4055795 4052136 4045310 4037999 4029715 4020048 4011937
58437 4011937 4008078 4007120 4007155 4009895 4017495 4028254 4039533 4051952 4066768 4082222 4096815 4113153 4134074
58424 4134074 4157751 4181086 4205026 4231836 4259769 4285130 4307093 4325923 4339208 4344881 4345703 4345923
58412 4345923 4345628 4342828 4338613 4335407 4332432 4327724 4322481 4318740 4315154 4309894 4305319 4304791 4307151 4309332
58398 4309332 4312161 4318470 4327643 4337199 4347746 4361249 4376423 4390804 4405309 4421814 4438403 4452100
58386 4452100 4464055 4476910 4489468 4499282 4508160 4519515 4532476 4544170 4555607 4569679 4585514 4600493
58374D600493J5228J7990J9158J7341J7186K0620K2895K1433K0497K2865K4922
58363D820628K4404K4944K8427L0838L0170L0435L3393L4442L1210K8036K7278
58352E144205K4700J8283J3088J2294J1862R134Q176J1320J4092J3929J5222K0228
58340E316533K3788K2878K2535K6391L0109L0271L0836L4562L6939L5098L3869
58329E643809L6496L8149L5183L1932L1727L0261K4662K0013J9889J9610J5765
58318E947496J3193J5444J7821J6997J7825K3159K6993K5406K4302K8260L1975
58307F188871L1017L0706L5486L9851L8864L7510M0463M2858M0540L9017M2638
58296F607821M5397M2319L9404M2190M5202M3152M1668M6098N0538M9141M7551
$$ plain form
58374 4600493 4615721 4633711 4652869 4670210 4687396 4708016 4730911 4752344 4772841 4795706 4820628
58363 4820628 4845032 4869976 4898403 4929241 4959411 4989846 5023239 5057681 5088891 5116927 5144205
58352 5144205 5168905 5187188 5200276 5212570 5224432 5233566 5241742 5253062 5267154 5281083 5296305 5316533
58340 5316533 5340321 5363199 5385734 5412125 5442234 5472505 5503341 5537903 5574842 5609940 5643809
58329 5643809 5680305 5718454 5753637 5785569 5817296 5847557 5872219 5892232 5912121 5931731 5947496
58318 5947496 5960689 5976133 5993954 6010951 6028776 6051935 6078928 6104334 6128636 6156896 6188871
58307 6188871 6219888 6250594 6286080 6325931 6364795 6402305 6442768 6485626 6526166 6565183 6607821
58296 6607821 6653218 6695537 6734941 6777131 6822333 6865485 6907153 6953251 7003789 7052930 7100481
58285G100481N1729N6201N4924N3059N6322N9613N7934N7310O2852O7551O5315
58274G743291O3333O8729P4999P4868P4273P9918Q5556Q4768Q4634R2005R9189
58263H625563R8412R7314J04219J11544J10366J07895J13126J18704J15098J09397
58253I711638J11566J15457J12408J09993J17678J27483J28987J29707J40069
58244A0804986J52341J55735J57905J69503J82267J85223J87399K00823K16562
58235A2412744K22178K26861K43648K63094K71450K78084K97076L18944L29789
58226A4863868L40529L66497L96536M14464M32073M66919N07174N34481N61258
58217A8883799O07475O61461P03883P48594Q17116Q95492R61964J033648J137423
$$ plain form
58285 7100481 7152210 7208411 7263335 7316394 7372716 7432329 7490263 7547573 7610425 7677976 7743291
58274 7743291 7806624 7875353 7950352 8025220 8099493 8179411 8264967 8349735 8434369 8526374 8625563
58263 8625563 8723975 8821289 8925508 9037052 9147418 9255313 9368439 9487143 9602241 9711638
58253 9711638 9823204 9938661 10051069 10161062 10278740 10406223 10535210 10664917 10804986
58244 10804986 10957327 11113062 11270967 11440470 11622737 11807960 11995359 12196182 12412744
58235 12412744 12634922 12861783 13105431 13368525 13639975 13918059 14215135 14534079 14863868
58226 14863868 15204397 15570894 15967430 16381894 16813967 17280886 17788060 18322541 18883799
58217 18883799 19491274 20152735 20856618 21605212 22422328 23317820 24279784 25313432 26450855
58208B6450855J259706J377061J509898J689864J902951K126331K391244K743039
58200D1450949L173133L665667M276167N081748O093345P308907Q805071J0667343
58192I0522330J2886440J5457054J8512809K2189268K6404632L0928127L5431526
58185B52332186L8952017L9296119L3789589K1465663M601969j2301653k5277929
58178C52857961l2771341l5370617l4473345l1393814k7190006k2716557j8659227
58171A50283054j5542196j3612132j2657713j2095629j1397396j0417662r286793
58164F5273533q125546o977447n905213m983426m211725l539737k961020k501736
58156B6067683k142296j830847j557080j342813j176418j022017q79434p74488
$$ plain form
58208 26450855 27710561 29087622 30597520 32287384 34190335 36316666 38707910 41450949
58200 41450949 44624082 48289749 52565916 57647664 63741009 71049916 79854987 90522330
58192 90522330 103408770 118865824 137378633 159567901 185972533 216900660 252332186
58185 252332186 291284203 330580322 364369911 385835574 390437543 378135890 352857961
58178 352857961 320086620 284716003 250242658 218848844 191658838 168942281 150283054
58171 150283054 134740858 121128726 108471013 96375384 84977988 74560326 65273533
58164 65273533 57147987 50170540 44265327 39281901 35070176 31530439 28569419 26067683
58156 26067683 23925387 22094540 20537460 19194647 18018229 16996212 16116778 15342290
58148A5342290p01373o29751n58056n08143m76612m39603l97246l68472l49781
58139A0913253l21359k86248k63438k49608k25899j95262j76372j67539j52173
58130H875355j33312j27994j33178j30569j20108j16698j18739j11357r6541q9753
58120G697106r0213q3629p0960o6096o8064o3084n1788m7612n0412m7408l8487
58109G019353l5529l8273l5230k7099k5565l0116k9128k2790k2226k6919k5474
58098F701004j8196j6847k1974k2001j5250j2022j4184j2824p121n900r319p997
58086F537369j512N66k844k828J563J658l338m632j026q28n058n448r35J93l498
58071F509402m129k11P38k661l007J228L113J347K508P204Q255M827M439Q650
$$ plain form
58148 15342290 14640917 14011166 13453110 12944967 12468355 12028752 11631506 11263034 10913253
58139 10913253 10591894 10305646 10042208 9792600 9566701 9371439 9195067 9027528 8875355
58130 8875355 8742043 8614049 8480871 8350302 8230194 8113496 7994757 7883400 7786859 7697106
58120 7697106 7606893 7523264 7452304 7386208 7318144 7255060 7203272 7155660 7105248 7057840 7019353
58109 7019353 6983824 6945551 6910321 6883222 6857657 6827541 6798413 6775623 6753397 6726478 6701004
58098 6701004 6682808 6665961 6643987 6621986 6606736 6594714 6580530 6567706 6560585 6554685 6545366 6537369
58086 6537369 6535857 6536423 6533579 6530751 6532314 6533972 6530634 6526002 6524976 6524148 6519090 6513642 6512707 6512900 6509402
58071 6509402 6505273 6505062 6505800 6503139 6500132 6501360 6504473 6505820 6508328 6515532 6523787 6528614 6533053 6541703
58057F541703J0447Q012P525J0128R531N003L513O505P504N154N764J0422J2421
58044F643632J0111R751J2893J3435J0033R023J1971J2508Q806P182R868J0989
58032F770202Q279P323J0308J1716R105P450Q981R070O096N078P732Q934O846
58019F877120O622J0342J2932J1896J1564J3906J4549J1831J0551J2861J4369
58008G008543J3077J3263J6590J8266J6078J4717J6950J8742J7260J5814J6796
57997G186096J7355J5901J5573J7642J8682J7550J7907K0803K2104K0215J8910
57986G388738J9753J9349J6834J6145J7970J7567J3705J1651J3815J5560J3972
57975G565059J2753J4433J5535J3745J2543J4365J6126J5627J5622J7625J8434
$$ plain form
58057 6541703 6552150 6560162 6567687 6577815 6587346 6592349 6595862 6602367 6609871 6615025 6620789 6631211 6643632
58044 6643632 6653743 6663494 6676387 6689822 6699855 6708878 6720849 6733357 6742163 6749345 6759213 6770202
58032 6770202 6778481 6785804 6796112 6807828 6816933 6824383 6833364 6842434 6848530 6853608 6861340 6870274 6877120
58019 6877120 6883742 6894084 6907016 6918912 6930476 6944382 6958931 6970762 6981313 6994174 7008543
58008 7008543 7021620 7034883 7051473 7069739 7085817 7100534 7117484 7136226 7153486 7169300 7186096
57997 7186096 7203451 7219352 7234925 7252567 7271249 7288799 7306706 7327509 7349613 7369828 7388738
57986 7388738 7408491 7427840 7444674 7460819 7478789 7496356 7510061 7521712 7535527 7551087 7565059
57975 7565059 7577812 7592245 7607780 7621525 7634068 7648433 7664559 7680186 7695808 7713433 7731867
57964G731867J6631J5825J7782J8946J7432J6709J8706K0091J9046J8821K0886
57953G932742K1452J8694J6579J7604J8548J7342J7239K0032K2122K1552K2055
57942H145961K5612K7991K6417K4896K6899K9377K9166K8884L1108L2895L1709
57931H460915L0858L3357L5858L4461L1283K9755K8307K4471K0434J8940J7959
57920H766598J4799J1396J0409J0197Q561P371Q609R895Q755P431Q752J1110J2059
57907H895942J2942J5484J7742J7845J7848J9588K0804J9640J8701K0216K1535
57896I098287K0112J8601K0104K2525K2725K2315K4097K6489K6735K6217K7436
57885I355643K8981K8487K7493K8381K9531K8359K6173K5342K4717K2537K0755
$$ plain form
57964 7731867 7748498 7764323 7782105 7801051 7818483 7835192 7853898 7873989 7893035 7911856 7932742
57953 7932742 7954194 7972888 7989467 8007071 8025619 8042961 8060200 8080232 8102354 8123906 8145961
57942 8145961 8171573 8199564 8225981 8250877 8277776 8307153 8336319 8365203 8396311 8429206 8460915
57931 8460915 8491773 8525130 8560988 8595449 8626732 8656487 8684794 8709265 8729699 8748639 8766598
57920 8766598 8781397 8792793 8803202 8813399 8821960 8829331 8837940 8847835 8856590 8864021 8872773 8883883 8895942
57907 8895942 8908884 8924368 8942110 8959955 8977803 8997391 9018195 9037835 9056536 9076752 9098287
57896 9098287 9118399 9137000 9157104 9179629 9202354 9224669 9248766 9275255 9301990 9328207 9355643
57885 9355643 9384624 9413111 9440604 9468985 9498516 9526875 9553048 9578390 9603107 9625644 9646399
57874I646399K1572K2724K1151J8495J8020J8835J8202J6916J7396J8717J8573
57863I857000J7981J9254K1368K1960K1942K3544K5730K6118K5568K6491K8391
57852A0115347K9283K9734L1308L2828L2336L0981L0953L1408L0296K8429K7755
57841A0450658K7477K5837K3937K3799K4419K3618K2119K2011K2840K2925K2785
57830A0712425K3723K4793K4713K4846K6751K8834K9012K8644L0056L2262L2903
57819A1018962L2454L2697L3013L1999L0818L1156L1780L0832K9536K9890L0795
57808A1363932L0330K9659L0540L1207K8982K5223K3289K3297K3071K2573K3148
57797A1655251K4005K3722K3680K5791K8336K8384K6889K6967K8496K8849K7866
$$ plain form
57874 9646399 9667971 9690695 9711846 9730341 9748361 9767196 9785398 9802314 9819710 9838427 9857000
57863 9857000 9874981 9894235 9915603 9937563 9959505 9983049 10008779 10034897 10060465 10086956 10115347
57852 10115347 10144630 10174364 10205672 10238500 10270836 10301817 10332770 10364178 10394474 10422903 10450658
57841 10450658 10478135 10503972 10527909 10551708 10576127 10599745 10621864 10643875 10666715 10689640 10712425
57830 10712425 10736148 10760941 10785654 10810500 10837251 10866085 10895097 10923741 10953797 10986059 11018962
57819 11018962 11051416 11084113 11117126 11149125 11179943 11211099 11242879 11273711 11303247 11333137 11363932
57808 11363932 11394262 11423921 11454461 11485668 11514650 11539873 11563162 11586459 11609530 11632103 11655251
57797 11655251 11679256 11702978 11726658 11752449 11780785 11809169 11836058 11863025 11891521 11920370 11948236
57786A1948236K7694K8583K9044K9360L0993L3296L4540L5239L6800L8200L7780
57775A2309765L6992L8288M0599M1042L9897L9621M0094L9174L7079L5891L5402
57764A2733844L3725L1308L0202L0001K8664K6755K6603K7866K8028K6990K6945
57753A3050931K8085K8492K8105K8758L0405L1136L0828L1149L2142L2384L2160
57742A3384575L2936L4048L3631L2283L2127L2805L2276L1036L1463L3263L3821
57731A3744264L2964L3197L4997L5995L5259L4553L4859L5139L4999L5303L5826
57720A4127355L5495L4960L5783L7247L7251L6115L5969L6742L6471L5397L5782
57709A4524567L7529L7986L6471L5261L5549L6059L6159L6866L8194L8765L8592
$$ plain form
57786 11948236 11975930 12004513 12033557 12062917 12093910 12127206 12161746 12196985 12233785 12271985 12309765
57775 12309765 12346757 12385045 12425644 12466686 12506583 12546204 12586298 12625472 12662551 12698442 12733844
57764 12733844 12767569 12798877 12829079 12859080 12887744 12914499 12941102 12968968 12996996 13023986 13050931
57753 13050931 13079016 13107508 13135613 13164371 13194776 13225912 13256740 13287889 13320031 13352415 13384575
57742 13384575 13417511 13451559 13485190 13517473 13549600 13582405 13614681 13645717 13677180 13710443 13744264
57731 13744264 13777228 13810425 13845422 13881417 13916676 13951229 13986088 14021227 14056226 14091529 14127355
57720 14127355 14162850 14197810 14233593 14270840 14308091 14344206 14380175 14416917 14453388 14488785 14524567
57709 14524567 14562096 14600082 14636553 14671814 14707363 14743422 14779581 14816447 14854641 14893406 14931998
57698A4931998L9114M0322M0911M1252M2772M4519M4032M1730M0514M0794L9910
57687A5387868L7057L4760L4457L4584L4165L4682L6993L9619M1397M2986M4735
57676A5803303M5990M7324N0521N5489O0139O4164O9811P8042Q7000R5269J03552
57665A6560604J11609J15993J12195R7519P2053L9644Q138j4615k6243k9651k7818
57654A7019428k1802j3411n595Q63P667J5073K0890K4311K7312L1060L4049L5191
57642A7175036L5745L6795L7537L7514L7895L9208M0184M0131M0216M1213M2218
57631A7603692M2555M2869M3476M3688M3422M3463M3730M3325M2516M2368M2519
57620A8077623M1805M0917M1526M2958M2977M1798M1813M3245M3848M3321M3919
$$ plain form
57698 14931998 14971112 15011434 15052345 15093597 15136369 15180888 15224920 15266650 15307164 15347958 15387868
57687 15387868 15424925 15459685 15494142 15528726 15562891 15597573 15634566 15674185 15715582 15758568 15803303
57676 15803303 15849293 15896617 15947138 16002627 16062766 16126930 16196741 16274783 16361783 16457052 16560604
57665 16560604 16672213 16788206 16900401 16997920 17069973 17109617 17117755 17103140 17076897 17047246 17019428
57654 17019428 16997626 16984215 16978620 16979483 16987150 17002223 17023113 17047424 17074736 17105796 17139845 17175036
57642 17175036 17210781 17247576 17285113 17322627 17360522 17399730 17439914 17480045 17520261 17561474 17603692
57631 17603692 17646247 17689116 17732592 17776280 17819702 17863165 17906895 17950220 17992736 18035104 18077623
57620 18077623 18119428 18160345 18201871 18244829 18287806 18329604 18371417 18414662 18458510 18501831 18545750
57609A8545750M5942M6734M5379M4417M5365M6364M5982M5745M6869M7915M7702
57598A9054164M7487M8223M8552M7502M6360M6027M5316M3733M3099M4384M5652
57587A9560499M5250M4474M4969M5954M6110M5979M6383M6583M5980M5653M6416
57576B0064250M7243M7193M6958M7048M6627M5495M4994M5521M5484M4204M3392
57565B0568409M4181M5198M5294M5638M7194M8563M8380M7681M7822M8157M7743
57554B1084260M7401M8056M8893M9016M9164N0033N0666N0198M9475M9351M9160
57543B1625673M8362M7865M8241M8527M8166M8166M8968M9304M8618M8357M9372
57532B2159619N0233M9739M8885M8714M8444M7448M6851M7389M7856M7439M7417
$$ plain form
57609 18545750 18591692 18638426 18683805 18728222 18773587 18819951 18865933 18911678 18958547 19006462 19054164
57598 19054164 19101651 19149874 19198426 19245928 19292288 19338315 19383631 19427364 19470463 19514847 19560499
57587 19560499 19605749 19650223 19695192 19741146 19787256 19833235 19879618 19926201 19972181 20017834 20064250
57576 20064250 20111493 20158686 20205644 20252692 20299319 20344814 20389808 20435329 20480813 20525017 20568409
57565 20568409 20612590 20657788 20703082 20748720 20795914 20844477 20892857 20940538 20988360 21036517 21084260
57554 21084260 21131661 21179717 21228610 21277626 21326790 21376823 21427489 21477687 21527162 21576513 21625673
57543 21625673 21674035 21721900 21770141 21818668 21866834 21915000 21963968 22013272 22061890 22110247 22159619
57532 22159619 22209852 22259591 22308476 22357190 22405634 22453082 22499933 22547322 22595178 22642617 22690034
57521B2690034M8771N0208N0434N0221N0456N0336M9370M8960N0006N1104N1018
57510B3240918N0779N1344N1456M9975M8215M7751M7908M7521M7145M7432M7353
57499B3777797M6227M5450M6087M6720M5893M4613M4236M4023M3057M2442M3118
57488B4269663M3595M2429M0947M0931M1553M1290M0951M1932M3198M2980M1917
57477B4731386M1745M2229M2118M1789M2217M2619M1755M0379L9958M0159L9992
57466B5186346M0000M0923M1649M1105M0599M1693M3206M3098M1867M1307M1290
57455B5643083M0694M0144M0774M1556M0898L9841M0470M2159M2615M1852M1810
57444B6095896M2616M2542M1347M0596M0709M0534L9865L9721M0140M0155L9858
$$ plain form
57521 22690034 22738805 22789013 22839447 22889668 22940124 22990460 23039830 23088790 23138796 23189900 23240918
57510 23240918 23291697 23343041 23394497 23444472 23492687 23540438 23588346 23635867 23683012 23730444 23777797
57499 23777797 23824024 23869474 23915561 23962281 24008174 24052787 24097023 24141046 24184103 24226545 24269663
57488 24269663 24313258 24355687 24396634 24437565 24479118 24520408 24561359 24603291 24646489 24689469 24731386
57477 24731386 24773131 24815360 24857478 24899267 24941484 24984103 25025858 25066237 25106195 25146354 25186346
57466 25186346 25226346 25267269 25308918 25350023 25390622 25432315 25475521 25518619 25560486 25601793 25643083
57455 25643083 25683777 25723921 25764695 25806251 25847149 25886990 25927460 25969619 26012234 26054086 26095896
57444 26095896 26138512 26181054 26222401 26262997 26303706 26344240 26384105 26423826 26463966 26504121 26543979
57433B6543979M0152M0602L9937L8538L8107L8854L9259L8621L7847L7616L7647
57422B6971159L7763L8016L7939L7147L6290L6077L6008L5443L4957L5106L4953
57411B7370858L3599L1932L1023L0109K8224K6489K6377K6957K6293K4604K3421
57400B7679886K2735K1548K0347K0317K0856K0460J9366J8830J8619J7776J6975
57389B7897715J7371J8025J7324J6092J6264J7222J6765J5109J4553J5378J5454
57378B8077272J4092J2948J2765J2201J0506Q633P226N886M814M782N235M755
57366B8181115L624L490M400M632L677K884K847K612J817J329J324R37J23k74
57352B8214537m18j350k829l584l738m663o324p256p412q479j0939j3247j4443
$$ plain form
57433 26543979 26584131 26624733 26664670 26703208 26741315 26780169 26819428 26858049 26895896 26933512 26971159
57422 26971159 27008922 27046938 27084877 27122024 27158314 27194391 27230399 27265842 27300799 27335905 27370858
57411 27370858 27404457 27436389 27467412 27497521 27525745 27552234 27578611 27605568 27631861 27656465 27679886
57400 27679886 27702621 27724169 27744516 27764833 27785689 27806149 27825515 27844345 27862964 27880740 27897715
57389 27897715 27915086 27933111 27950435 27966527 27982791 28000013 28016778 28031887 28046440 28061818 28077272
57378 28077272 28091364 28104312 28117077 28129278 28139784 28148417 28155643 28161529 28166343 28171125 28176360 28181115
57366 28181115 28184739 28188229 28192629 28197261 28200938 28203822 28206669 28209281 28211098 28212427 28213751 28214688 28214811 28214537
57352 28214537 28214119 28212769 28209940 28206356 28202618 28197955 28191631 28184375 28176963 28168484 28157545 28144298 28129855
57339B8129855j5316j6466j7427j8276j9920k2136k3367k3052k2371k2230k2335
57328B7906959k2634k3736k5575k7312k8808l0500l1901l2148l1908l2690l4344
57317B7585403l5473l6095l7504l9461m0128l9121l8143l8238l8738l9282m0474
57306B7162746m2019m2618m2319m2632m3865m4612m4480m4926m6663m8465m9366
57295B6670781n0010n1009n1975n2841n4359n6620n8825o0884o3436o6128o7831
57284B6036863o8821p0594p3267p5435p6705p8049p9396p9413p8118p7217p7260
57273B5202588p7003p5996p5237p4664p2762o9508o6912o5665o3901o0464n6835
57262B4443641n4506n2860n1015m9505m8778m8097m7293m7516m9117n0796n1959
$$ plain form
57339 28129855 28114539 28098073 28080646 28062370 28042450 28020314 27996947 27973895 27951524 27929294 27906959
57328 27906959 27884325 27860589 27835014 27807702 27778894 27748394 27716493 27684345 27652437 27619747 27585403
57317 27585403 27549930 27513835 27476331 27436870 27396742 27357621 27319478 27281240 27242502 27203220 27162746
57306 27162746 27120727 27078109 27035790 26993158 26949293 26904681 26860201 26815275 26768612 26720147 26670781
57295 26670781 26620771 26569762 26517787 26464946 26410587 26353967 26295142 26234258 26170822 26104694 26036863
57284 26036863 25968042 25897448 25824181 25748746 25672041 25593992 25514596 25435183 25357065 25279848 25202588
57273 25202588 25125585 25049589 24974352 24899688 24826926 24757418 24690506 24624841 24560940 24500476 24443641
57262 24443641 24389135 24336275 24285260 24235755 24186977 24138880 24091587 24044071 23994954 23944158 23892199
57251B3892199n3735n6587n9156o0752o2784o6287p0245p3703p7452q2055q6319
57240B3143124q9335r2124r5668r9128j01619j03936j06874j09572j11080j12029
57230B2121759j13123j13564j12682j11664j12013j13446j14795j15774j16482
57221B1098216j16360j15003j13012j10969j08700j06375j04850j03982j02171
57212B0116794r8795r5602r4362r4572r4641r4142r3598r3308r3519r4657r6444
57201A9073154r7907r8869j00144j01694j02250j01461j00497r9681r7516r3201
57191A8079934q8246q4325q1350p8868p7439p7212p6993p6283p6508p8642q1269
57180A7202799q2649q3170q3996q4768q4547q3849q3868q4610q5380q6312q7972
$$ plain form
57251 23892199 23838464 23781877 23722721 23661969 23599185 23532898 23462653 23388950 23311498 23229443 23143124
57240 23143124 23053789 22961665 22865997 22766869 22665250 22561314 22454440 22344868 22233788 22121759
57230 22121759 22008636 21895072 21782390 21670726 21558713 21445267 21330472 21214698 21098216
57221 21098216 20981856 20866853 20753841 20642872 20534172 20427797 20322947 20218965 20116794
57212 20116794 20017999 19922397 19828035 19733463 19638822 19544680 19451082 19357774 19264255 19169598 19073154
57201 19073154 18975247 18876378 18776234 18674540 18572290 18470829 18370332 18270651 18173135 18079934
57191 18079934 17991688 17907363 17826013 17747145 17669706 17592494 17515501 17439218 17362710 17284068 17202799
57180 17202799 17120150 17036980 16952984 16868216 16783669 16699820 16615952 16531342 16445962 16359650 16271678
57169A6271678r0266r2922r6234j00258j04210j07680j11421j15945j20488j24336
57159A5207918j27977j32027j36177j40200j44698j49788j54277j57268j59392
57150A3906114j61368j62400j61095j57062j50716j42401j32600j22317j12526
57141A2603629j03457r4404q4259p3792o8642p7327j02309j33785j56703j64564
57131A1544387j63042j60348j59195j59294j61818j67473j73763j78059j80958
57122A0040437j83725j84848j82227j76368j68358j56776j39970j19712r9514
57113H628939q0671o2624m5727l0747j6847k593J2323K8776N0202Q0402J20682
57102H682115J71421K34854L13736M08949N21443O55660Q18543J016151J253192
$$ plain form
57169 16271678 16181412 16088490 15992256 15891998 15787788 15680108 15568687 15452742 15332254 15207918
57159 15207918 15079941 14947914 14811737 14671537 14526839 14377051 14222774 14065506 13906114
57150 13906114 13744746 13582346 13421251 13264189 13113473 12971072 12838472 12716155 12603629
57141 12603629 12500172 12405768 12321509 12247717 12179075 12101748 11999439 11865654 11708951 11544387
57131 11544387 11381345 11220997 11061802 10902508 10740690 10573217 10399454 10221395 10040437
57122 10040437 9856712 9671864 9489637 9313269 9144911 8988135 8848165 8728453 8628939
57113 8628939 8548268 8485644 8439917 8409170 8392323 8389730 8402053 8430829 8481031 8561433 8682115
57102 8682115 8853536 9088390 9402126 9811075 10332518 10988178 11806721 12822872 14076064
57093A4076064J533951J860492K230324K637204L072174L521315L964286M377335
57085C7273145M735930N013020N179022N207109N073886M750354M201122L410577
57077G4844165K418766J325278K47950p28743j574175k296850k919683l463803
57069F7852905l940055m343371m652595m839844m885559m789320m569739m256227
57061C1576195l880786l474017l062767k667337k300508j969851j679811j431002
57053A1110116j219827j041186q91068p65769o60628n71641m97026m35327l83334
57044D644310l37914k98506k65544k37580k12261j89179j69351j52617j37744
57035B643614j24371j12796j02550r3055q4848p8188p1542o3364n4377m6010l7768
$$ plain form
57093 14076064 15610015 17470507 19700831 22338035 25410209 28931524 32895810 37273145
57085 37273145 42009075 47022095 52201117 57408226 62482112 67232466 71433588 74844165
57077 74844165 77262931 78588209 78836159 78107416 76533241 74236391 71316708 67852905
57069 67852905 63912850 59569479 54916884 50077040 45191481 40402161 35832422 31576195
57061 31576195 27695409 24221392 21158625 18491288 16190780 14220929 12541118 11110116
57053 11110116 9890289 8849103 7958035 7192266 6531638 5959997 5462971 5027644 4644310
57044 4644310 4306396 4007890 3742346 3504766 3292505 3103326 2933975 2781358 2643614
57035 2643614 2519243 2406447 2303897 2210842 2125994 2047806 1976264 1912900 1858523 1812513 1774745
57024A774745k8210j7344n820O996K1972L8308N4121O6638O9727N4785J9013k8305
57012B026626p1842j01997j18091j22535j17486j06773r5294q4740p3449o1211
57002A073208n0676m3307l7525l1970k7388k4163k1068j7646j5123j3844j2327
56991G78171r911p903p112o449m917k882o15K381N859Q476R381Q371M558k754
56977G74654j1739j9043k3475k6402k8374k8084k5225k1588j8496j5480j2213
56966E44535r410p116m317r58J774L773O438J0308J4512J8885K4053K8615K8832
56953F59924K2368J0591l322j6555k6564l1446l1693k9766k7293k4133k0311j6601
56941D65199j2904q337l434M8K023M537Q713J3536J8070K2682K7453L1498L4169
$$ plain form
57024 1774745 1746535 1729191 1723371 1730367 1752339 1790647 1844768 1911406 1981133 2035918 2054931 2026626
57012 2026626 1954784 1852787 1734696 1612161 1494675 1387902 1292608 1207868 1134419 1073208
57002 1073208 1022532 979225 941700 909730 882342 858179 837111 819465 804342 790498 778171
56991 778171 768260 760357 753245 746796 741879 738997 738382 740763 746622 755098 764479 772850 777408 774654
56977 774654 762915 743872 720397 693995 665621 637537 612312 590724 572228 556748 544535
56966 544535 535125 528009 523692 522734 524508 528281 534719 545027 559539 578424 602477 631092 659924
56953 659924 682292 692883 689561 673006 646442 614996 583303 553537 526244 502111 481800 465199
56941 465199 452295 443958 440524 440572 442595 447132 455845 469381 487451 510133 537586 569084 603253
56928F03253L4669L0480J9177K470j4169k6687l4849l9344l9868l7115l3514l0406
56916D34097k6813k2245j8216j5758j3897j1809j0201r288p864n596l949l565
56904B84896l052j618n18o21p42J56J324K052K983M370N201N327O216Q407J0449
56889C24830J1621J3315J6451J9868K2550K4942K6443K4295J6918O468l611j1640
56877D92450j7011j8906j7609j5182j3051j0605p392m476k217R22N648J0227J3383
56864D16181J6637K1823K8362L4947M1806M9126N4878N6125N1116L8968J9736
56853H29705l276k3669l6837m3281m5542m4217l9095l1873k4764j7869j0288k530
56841E06464M412J1107J8611K6673L4852M4053N5026O6744P7854Q7725R3752Q9704
$$ plain form
56928 603253 637922 668402 687579 690049 675880 649193 614344 575000 535132 498017 464503 434097
56916 434097 407284 385039 366823 351065 337168 325359 315158 305870 298006 292410 288461 284896
56904 284896 281844 280226 279708 279087 278345 278501 279825 281877 284860 289230 294431 299758 305974 314381 324830
56889 324830 336451 349766 366217 386085 408635 433577 460020 484315 501233 507701 504090 492450
56877 492450 475439 456533 438924 423742 410691 400086 392694 388218 386001 386923 392571 402798 416181
56864 416181 432818 454641 483003 517950 559756 608882 663760 719885 771001 809969 829705
56853 829705 826429 802760 765923 722642 677100 632883 593788 561915 537151 519282 508994 506464
56841 506464 510876 521983 540594 567267 602119 646172 701198 767942 845796 933521 1027273 1116977
56829A116977P0158L6508l259l9957o7229q2396q6484q3253p6244o6856n5818
56818F62147m4885l5426k6785j7817q888p78P080J5586K4442L3199M2525N2812
56806G03212O2484O8643O7991N6773L2873P4l2086n5290o7960p2730p1366o4833
56794F27785n5794m7272l9763l2240k4911j8532j2339n332J477O582J0697J5635
56782D25993K1520K7379L3123L8263L9690L3718K0165K572j4987k9490l8773m2353
56770E16820m2093m0209l7168l2834k8311k4697k1427j7741j4506j2626j1164
56759B34044r096p330o784o183m251k369k380l289l034k082k205k995k765j859
56745A77422j840k320j726n07l90j070p72L70O27l3K6R67J291O80K38K2r36k205
$$ plain form
56829 1116977 1187135 1223643 1220384 1180427 1113198 1030802 944318 861065 784821 717965 662147
56818 662147 617262 581836 555051 537234 528346 527568 534648 550234 574676 607875 650400 703212
56806 703212 765696 834339 902330 959103 991976 992050 959964 904674 836714 763984 692618 627785
56794 627785 571991 524719 484956 452716 427805 409273 396934 391602 393079 399661 410358 425993
56782 425993 447513 474892 508015 546278 585968 619686 639851 642423 627436 597946 559173 516820
56770 516820 474727 434518 397350 364516 336205 311508 290081 272340 257834 245208 234044
56759 234044 224948 217618 210834 204651 200400 198031 195651 192362 189328 187246 185041 182046 179281 177422
56745 177422 175582 173262 171536 171029 170639 169569 168797 169167 169794 169761 169787 170754 172045 172725 172963 172985 172049 169844
56727A69844k197q53L61J025J918K817K649J693J329J692J880K098L168M250L656
56712A95330J775O39P58Q43N22P25J368J248M22L02J175J826J691J336Q32j93
56696B10599j007m55R03J416Q97M90L39l48j197r58K05Q88P70O45N12k58j174
56679B12267j233q09q30p53L15J255M09j273j431j15N08r6m48j67l65r07l17J323
56661B07333K256K087K178K824K849K235K314L098L167K493K579L529L760K990
56647B45692K660K954K397R21M04J398K046J283M33O93J367J608J712J787J196
56632B68551O9m78j85J07K17O61Q85k35k096k892k534k604l368l426k543k135
56616B47994k518k393j440q62r12n18K50L3j099j457o94k45m32j6R53P66p38j602
$$ plain form
56727 169844 167647 166794 167155 168180 170098 172915 175564 177257 178586 180278 182158 184256 187424 191674 195330
56712 195330 197105 197744 198502 199345 199867 200592 201960 203208 203630 203932 205107 206933 208624 209960 210792 210599
56696 210599 209592 209137 210040 211456 212353 212843 213182 212834 211637 210679 210884 211772 212542 213187 213699 213441 212267
56679 212267 211034 210225 209395 208642 208957 210212 210621 209348 207917 207802 208310 208214 207766 207599 207234 206327 206010 207333
56661 207333 209589 211676 213854 216678 219527 221762 224076 227174 230341 232834 235413 238942 242702 245692
56647 245692 248352 251306 253703 254624 255028 256426 258472 259755 260188 260881 262248 263856 265568 267355 268551
56632 268551 268620 268142 267957 268064 268281 268942 269827 269592 267496 264604 262070 259466 256098 252672 250129 247994
56616 247994 245476 243083 241643 240781 239869 239351 239601 239634 238535 237078 236384 236139 235707 235691 236644 237410 236672 235070
56598B35070j090o84r84n82R28J763J044L36Q40J598J686J716K017J675N32r1
56582B45774L02N42J31J42R52J404J082J126J950K472K281K309K709K509J910
56567B67595K360L765M323L699L638M806N976O916Q944J1799J3174J2374J1167
56554C60536J0006O960J830k154k742j697j530k075k238k430l134l428k838k511
56540C52555k954k898j869j455k499l434k977k128j946j738r59n26q38q12j98
56525C25324l23j341j445j77L86p81j789j272o68j179j396j29J091O27n10p07
56509C15711k87p3M04J299J291r7j177q05j92m16n25J93N71n9l45M76Q94j00j061
56490C15702p16p4j52j06O09Q29J68K14J481J995P77k05M32J130N95K85J286J828
$$ plain form
56598 235070 233980 233296 232312 231730 232658 234421 235465 235801 236641 238239 239925 241641 243658 245333 245865 245774
56582 245774 246076 246618 246749 246891 247843 249247 250329 251455 253405 255877 258158 260467 263176 265685 267595
56567 267595 269955 273720 278043 281742 285380 290186 296162 303078 312022 323821 336995 349369 360536
56554 360536 370542 377502 379332 377178 374436 372739 371209 369134 366896 364466 361332 357904 355066 352555
56540 352555 349601 346703 344834 343379 340880 337446 334469 332341 330395 328657 327698 327172 326334 325522 325324
56525 325324 325001 323660 322215 322038 322424 321643 319854 318582 317914 316735 315339 315210 316301 316928 316418 315711
56509 315711 315424 315351 315755 317054 318345 318248 317071 316266 316074 315658 315133 315326 315897 315838 315493 315969 316863 316763 315702
56490 315702 314986 314912 314760 314654 315263 316092 316260 316474 317955 319950 320727 320522 320954 322084 322679 322964 324250 326078
56472C26078N81n55K48J473J120K54P61J984K406K418K702K192L15j065m95N51
56456C40968M58K78J238J995J127r7j03K54p0P0J491K423J566P14J529K412J532
56439C57785J92J20K17p81j239L14J810R60o44l95P93O63o1N29J554J144K40P69
56421C63970J824J510P55J527K929K813J646J232J210L67k59Q16K320K295J615
56406C86570J984K398J241j29L28J405R63J93J458L670M047K968K807L371K723
56391D15997J267R21J289O82k19L87J687J664R35J480K749K823K122K176K251
56376D38211J063J86J632L717L529J970J929L033K809J625J706K491J764L97R98
56361D67060K849K972J520J235K199K046Q70J042K432K601J532J533K588K401
$$ plain form
56472 326078 326659 326104 326352 327825 328945 329199 329960 331944 334350 336768 339470 341662 341977 340912 340417 340968
56456 340968 341426 341704 342942 344937 346064 345967 345864 346118 346048 346118 347609 350032 351598 352312 353841 356253 357785
56439 357785 357977 358097 358314 357533 356294 356608 358418 359378 358734 358339 359132 359795 359734 360263 361817 362961 363201 363970
56421 363970 365794 367304 368059 369586 372515 375328 376974 378206 379416 379783 379524 380340 382660 384955 386570
56406 386570 388554 390952 392193 392064 392392 393797 394760 394953 396411 400081 404128 407096 409903 413274 415997
56391 415997 417264 418185 419474 420156 419937 420324 422011 423675 424610 426090 428839 431662 433784 435960 438211
56376 438211 439274 439460 441092 444809 448338 450308 452237 455270 458079 459704 461410 463901 465665 466062 467060
56361 467060 469909 472881 474401 475636 477835 479881 480751 481793 484225 486826 488358 489891 492479 494880
56347D94880R95P53J900K287J624J688K456K234J449K106L740M119L582M348N953
56332E34114N819M128L556M382M388L452L678M957M953L581L043L420K685J124
56318E87280J272L212M281L680L224L481L233K727L306M162L492K345K968M224
56304F32887L370J624K652O062P963P740Q550J0904J1535R301O813N335L367J052
56290G19155Q08K630L695L485M426O726P670O815O867Q539R415Q868R115J0575
56276H08789J1076J0492J1184J3108J3477J2147J2156J4106J5224J4899J5763
56265I52421J8253J9482J8796J9076K1249K2799K3147K5140K9664L3997L7017
56254A221041M0974M6548N1382N5105O0602O8692P6570Q3123R0623R9546J07003
$$ plain form
56347 494880 495875 496628 498528 500815 502439 504127 506583 508817 510266 512372 516112 520231 523813 528161 534114
56332 534114 539933 544061 547617 551999 556387 559839 563517 568474 573427 577008 580051 583471 586156 587280
56318 587280 588552 591764 596045 599725 602949 606430 609663 612390 615696 619858 623350 625695 628663 632887
56304 632887 636257 637881 640533 646595 654558 662298 670848 681752 693287 702588 709401 714736 718103 719155
56290 719155 719963 722593 726288 729773 734199 740925 748595 755410 762277 770816 780231 789099 798214 808789
56276 808789 819865 830357 841541 854649 868126 880273 892429 906535 921759 936658 952421
56265 952421 970674 990156 1008952 1028028 1049277 1072076 1095223 1120363 1150027 1184024 1221041
56254 1221041 1262015 1308563 1359945 1415050 1475652 1544344 1620914 1704037 1794660 1894206 2001209
56243B001209J12032J17213J23233J26934J26692J24607J21472J14632J02808
56234C070832Q8202P2017N2698L0383Q230j2295l2647n2443o8543q0293r0405
56223B985736r9368j04392j05304j05751j06945j05912j01607r7009r3340q8130
56213A977978q0936p5029p1369o6752n9975n3957m9811m4843l8516l4150l2547
56202A370093l0182k5923k3110k2624k0669j6046j2804j2757j2116q771o125o297
56190A172669o148l680j927k756l018o63J398J140J082K708L393K226K575N384
56176A174383O474M060K344L956N619N066N331P995R316P476O747R748J2389J1409
56162A272313J0101J1608J3172J2294J2035J4874J7597J7511J7559K0204K2460
$$ plain form
56243 2001209 2113241 2230454 2353687 2480621 2607313 2731920 2853392 2968024 3070832
56234 3070832 3159034 3231051 3283749 3314132 3322362 3310067 3277420 3224977 3156434 3076141 2985736
56223 2985736 2886368 2781976 2676672 2570921 2463976 2358064 2256457 2159448 2066108 1977978
56213 1977978 1897042 1822013 1750644 1683892 1623917 1569960 1520149 1475306 1436790 1402640 1370093
56202 1370093 1339911 1313988 1290878 1268254 1247585 1231539 1218735 1205978 1193862 1185091 1178966 1172669
56190 1172669 1166521 1162841 1160914 1158158 1155140 1154477 1155875 1157015 1158097 1160805 1164198 1166424 1168999 1174383
56176 1174383 1180857 1184917 1187261 1191217 1196836 1201902 1207233 1215228 1224544 1232020 1238767 1248515 1260904 1272313
56162 1272313 1282414 1294022 1307194 1319488 1331523 1346397 1363994 1381505 1399064 1419268 1441728
56151A441728K2169K2728K6415K9464K9103K9025L2530L6806L9428M3831N2560
56140A805787O1719O8024P4920Q5860R8093J08937J21408J37258J50946J56860
56130B869812J56206J50994J38301J17361R5574Q0499P1643O5919O4015O4724
56120C875048O0444M5970K5834O393j2311l0430m2302m4895m5428n2367o5127
56109C720829p9752r7282j18148j35443j42757j42670j39634j31366j15510r7668
56099B520599q3770p1125n5704m1390l2943k6682j7549q789n250l661R18N594
56087B180248O022N586Q713J1818J0567R184J2573J6342J4948J2556J5215J9294
56075B323066J8765J6905J9471K3178K2418K0688K3672K7727K7031K5431K9119
$$ plain form
56151 1441728 1463897 1486625 1513040 1542504 1571607 1600632 1633162 1669968 1709396 1753227 1805787
56140 1805787 1867506 1935530 2010450 2096310 2194403 2303340 2424748 2562006 2712952 2869812
56130 2869812 3026018 3177012 3315313 3432674 3528248 3608747 3680390 3746309 3810324 3875048
56120 3875048 3935492 3981462 4007296 4013689 4001378 3970948 3928646 3883751 3838323 3785956 3720829
56109 3720829 3641077 3543795 3425647 3290204 3147447 3004777 2865143 2733777 2618267 2520599
56099 2520599 2436829 2365704 2310000 2268610 2235667 2208985 2191436 2182647 2177397 2173736 2174654 2180248
56087 2180248 2186270 2191856 2200569 2212387 2222954 2232138 2244711 2261053 2276001 2288557 2303772 2323066
56075 2323066 2341831 2358736 2378207 2401385 2423803 2444491 2468163 2495890 2522921 2548352 2577471
56064B577471L4311L4367L2475L4785L7812L5374L1398L2746L5945L4168L0738
56053B951590L2337L5526L3661L0478L2920L7248L6354L3981L7258M2175M1323
56042C344851L8908M2815M8854M8695M6291N0102N6220N5967N3292N7328O4477
56031C907800O5521O3823O8393P5503P5664P2476P5780Q2440Q2923Q0509Q4618
56020D735450R1506R1493Q8731R3520J01798J02955J01097J07054J16516J18316
56010E748436J17164J24930J36629J39113J36545J42484J53708J57388J57157
56001G013554J65685J78514J82467J82856J94185K11282K18923K22368K37620
55992H807454K59153K69571K73741K89634L12909L25826L33892L56609L88950
$$ plain form
56064 2577471 2611782 2646149 2678624 2713409 2751221 2786595 2817993 2850739 2886684 2920852 2951590
56053 2951590 2983927 3019453 3053114 3083592 3116512 3153760 3190114 3224095 3261353 3303528 3344851
56042 3344851 3383759 3426574 3475428 3524123 3570414 3620516 3676736 3732703 3785995 3843323 3907800
56031 3907800 3973321 4037144 4105537 4181040 4256704 4329180 4404960 4487400 4570323 4650832 4735450
56020 4735450 4826956 4918449 5007180 5100700 5202498 5305453 5406550 5513604 5630120 5748436
56010 5748436 5865600 5990530 6127159 6266272 6402817 6545301 6699009 6856397 7013554
56001 7013554 7179239 7357753 7540220 7723076 7917261 8128543 8347466 8569834 8807454
55992 8807454 9066607 9336178 9609919 9899553 10212462 10538288 10872180 11228789 11617739
55983A1617739M10574M26275M56993M97851N27470N51962N95072O51626O97692
55974A6433254P39751Q04157Q85149R56393J026692J127789J254578J378133J510284
55965B6116180J689626J911850K145862K411110K761073L199517L701037M307128
55957D8243383N105972O126567P361005Q877637J0782749J3085120J5756636J8913865
55949A34252934K2739665K7217357L2141998L7254574M1766249M3512488L9328213
55942C78213478K7340915R221185j0249767k6163441l6121121m0409208m0517378
55935B61314663l7956190l3975456k9536039k5197924k1178246j7591145j4539027
55928H1340636j2018056r919631q166828o748837n623436m698434l922548l301966
$$ plain form
55983 11617739 12028313 12454588 12911581 13409432 13936902 14488864 15083936 15735562 16433254
55974 16433254 17173005 17977162 18862311 19818704 20845396 21973185 23227763 24605896 26116180
55965 26116180 27805806 29717656 31863518 34274628 37035701 40235218 43936255 48243383
55957 48243383 53349355 59475922 66836927 75714564 86497313 99582433 115339069 134252934
55949 134252934 156992599 184209956 216351954 253606528 295372777 338885265 378213478
55942 378213478 405554393 414775578 404525811 378362370 342241249 301832041 261314663
55935 261314663 223358473 189383017 159846978 134649054 113470808 95879663 81340636
55928 81340636 69322580 59402949 51236121 44487284 38863848 34165414 30242866 26940900
55920B6940900k817688k410063k053368j768459j552044j362617j184569j041419
55912A2750673r36463q39485p40816o63114o10778n58764m99743m54358m26868
55903G020284l95743l55822l26967l13422k95078k66377k45242k36321k22207
55894D363105j98278j81147j75397j65488j47416j36311j35786j30658j16665
55885B975959j07737j07450j02153q8658q0701q1513p7184o3735n4383n3495m9079
55874B109871l7912l3107l9550m5586m6005n0150o0330o4883n9981n6736n9616
55863A556015n8769n0591m5307m6855m5316l6605l0467l1519l0920k4192j9512
55852A135962k1029k1230j6867j5747k0789k3525k0171j8438k1906k3170j8919
$$ plain form
55920 26940900 24123212 21713149 19659781 17891322 16339278 14976661 13792092 12750673
55912 12750673 11814210 10974725 10233909 9570795 8960017 8401253 7901510 7447152 7020284
55903 7020284 6624541 6268719 5941752 5628330 5333252 5066875 4821633 4585312 4363105
55894 4363105 4164827 3983680 3808283 3642795 3495379 3359068 3223282 3092624 2975959
55885 2975959 2868222 2760772 2658619 2569961 2489260 2407747 2330563 2266828 2212445 2158950 2109871
55874 2109871 2071959 2038852 1999302 1953716 1907711 1857561 1797231 1732348 1672367 1615631 1556015
55863 1556015 1497246 1446655 1401348 1354493 1309177 1272572 1242105 1210586 1179666 1155474 1135962
55852 1135962 1114933 1093703 1076836 1061089 1040300 1016775 996604 978166 956260 933090 914171
55841I14171j6517j9324k0267j6241j4209j7043j7663j3239j0934j3665j4294
55830G40775r875p565j0424j1285o880m285o987q185m458k720o820j0128q384
55817F42779p306j0472j1939q098n069p041q483n108j727k235k281J340M127L200
55803E81687L243O961R449Q078Q007J1918J4189J1194P597O554L695l177q457
55790F60938r018j0229j5326j8721j6460j3689j4734j5130j0758n979n487o430
55778E18977n628o390j1032j4600j3076j0343j0291r649n341j430j785k933r53
55765D25526J341N29q55k31o16m153o699n139l442n268p217n718l942n423p199
55750C71494n818m031n075o319m928l875n975p799n946l630m628o282m931k945
$$ plain form
55841 914171 897654 878330 858063 841822 827613 810570 792907 779668 768734 755069 740775
55830 740775 730900 723335 712911 701626 694746 690461 683474 675289 670831 668111 661291 651163 642779
55817 642779 635473 625001 613062 604964 599895 592854 584371 579263 577536 575301 573020 574360 578487 581687
55803 581687 584930 591891 601340 609418 617425 629343 643532 654726 662323 668877 672572 669395 660938
55790 660938 651920 641691 626365 607644 591184 577495 562761 547631 536873 530894 525407 518977
55778 518977 513349 506959 495927 481327 468251 457908 447617 437968 432627 431197 429412 426479 425526
55765 425526 426867 427396 426541 426310 425694 421541 414842 409703 406261 400993 393776 388058 384116 378693 371494
55750 371494 365676 361645 356570 350251 345323 341448 335473 327674 321728 318098 313470 307188 302257 299312
55736B99312l827n442m481k861l483m270k446k43o33j811j306q99k299k875r29
55721B61507l5k728n124l493q64j240k542j408Q3j108k515p49J846J516k2P20
55705B43844K388K008J068K231L641K346J0m86n55k504m295l292j654k383l647
55690B38720k496o61j042k031r09O53P8o89J126L504L359K411L661N408M525K466
55674B58083K180K353M75j590r59M37p00k771k364o37o03r84J112L972L997K245
55658B64246K238L456L014J706K398M273M483L650M179M953L345O51j00M3k066
55643C00469n608p280p208p864q691p400n173n107o618o653n219m636m658l333
55629B15021j481j270j747n62J268J174m8L5N60p25k494k024o54j510l423k753
$$ plain form
55736 299312 295485 290043 285562 282701 279218 274948 272502 272259 271626 269815 268509 267610 265311 262436 261507
55721 261507 261472 258744 253620 250127 249263 248023 245481 244073 244156 243048 240533 239784 241630 243146 243124 243844
55705 243844 246232 248240 249308 251539 255180 257526 257536 257050 256495 253991 249696 246404 244750 242367 238720
55690 238720 236224 235563 234521 232490 231581 232234 232312 231623 232749 236253 239612 242023 245684 251092 255617 258083
55674 258083 260263 262616 263091 261501 260542 260979 260279 257508 255144 254507 253904 252920 254032 258004 262001 264246
55658 264246 266484 269940 272954 274660 277058 281331 285814 289464 293643 298596 301941 302592 302492 302535 300469
55643 300469 294861 287581 280373 272509 263818 256418 251245 246138 239520 232867 227648 223012 218354 215021
55629 215021 213540 212270 210523 209961 211229 212403 212355 212390 212950 212225 209731 207707 207053 205543 202120 199367
55613A99367qJ036j68r49r28j982l413k738p81o20j980j887m01m04k077k745k009
55596A77313k002k739k242r26j055k034j177J147J982J141J203K389K366J075
55582A76441Q29J690J541P55J830M313N103M001L980N620O233N200N192P193Q990
55567B38911R596J0691J2485J2495R796O653M602K453o98l792o065q048r670j0215
55553B69194j0316j1047j1251r051n691m270m887m897l742l445m230l944k305
55540A90118j607k446k634j151L61Q76J276J731J108l29p70l4J55o67j234j347
55524A83406k041k979k797k017k371l397l130j900j825k801k799j909k129l118
55510A48193k461l18L86j103k321k052j758j941j200K76L62r49j039P17J722O98
$$ plain form
55613 199367 199359 200395 200227 199278 198350 196368 192955 190217 189436 188816 186836 184949 184548 184144 182067 179322 177313
55596 177313 175311 172572 170330 169404 168349 166315 165138 166285 168267 169408 170611 173000 175366 176441
55582 176441 177270 178960 180501 181256 183086 187399 192502 196503 200483 206103 212336 217536 222728 229921 238911
55567 238911 248507 259198 271683 284178 293974 300627 305229 307682 306984 303192 297127 289079 279409 269194
55553 269194 258878 247831 236580 227529 221838 217568 212681 207784 204042 200597 196367 192423 190118
55540 190118 188511 186065 183431 182280 182641 183517 184793 186524 187632 187303 186533 186499 186654 185987 184753 183406
55524 183406 181365 178386 175589 173572 171201 167804 164674 162774 160949 158148 155349 153440 151311 148193
55510 148193 145732 145414 145800 144697 142376 140324 138566 136625 135425 135701 136063 135114 134075 134792 136514 137212
55494A37212m15k47o9o76p41K97R00L92J16N29J57j375k221j397j47N88J279J742
55476A35924R55m31m38P93J069N7k22O55P25m45p93K97P74k01p40J03N71l19r92
55457A37342m48p7p40j129m57L5l13l32L72L94o04r27J8N27k43q07l38j49r18
55438A31206j213k34O87O81P27J311J322M75J61Q02J019L82K11P90O20n56r98
55421A37393j51M22K22O74J914K087R45P51K268L299K652K046K513K374O60q28
55405A59241p46m13r21j199p25j026k513l006j516l62j385l019l254k643k171
55390A34342j046J106K518K038J086Q86M60p44j106J55J116M90p2P10J161j15
55374A42985j288m72Q88O68l47l96l2n63j272j010o32j219j731r86j00n02j288
$$ plain form
55494 137212 136797 136550 136481 135805 135064 135361 136261 136653 136769 137298 137455 136080 133859 132462 132315 132903 134182 135924
55476 135924 136879 136448 136010 136803 137872 137929 137707 138362 139087 138642 137849 138146 138920 138719 137979 138082 138653 138334 137342
55457 137342 136894 136817 136077 134948 134491 134526 134213 133881 134253 134647 134043 133116 133134 133661 133418 132611 132273 132124 131206
55438 131206 129993 129759 130446 131127 131854 133165 134487 134962 135123 135925 136944 137326 137537 138327 138947 138391 137393
55421 137393 137242 137664 137886 138560 140474 142561 143506 144257 146525 149824 152476 154522 157035 159409 160069 159241
55405 159241 158495 158082 157161 155962 155237 154211 151698 148692 147176 146814 145429 142410 139156 136513 134342
55390 134342 133296 134402 136920 138958 140044 140930 141390 140646 139540 139695 140811 141301 141229 141939 143100 142985
55374 142985 141697 141225 142113 142781 142434 142038 142006 141443 140171 139161 138529 137310 135579 134593 134493 133991 132703
55357A32703j018k99j92RJ050J653O74n76n24j6l90p84P0J194J095L90K97K05
55339A35541o84j155q5J010K55j312j531o95n85j187j165m59P6O21J575J878N47
55322A32645j163j328j46Q40J125R72J49j067j154L98J628R63j51K60J371J259
55306A36601K41j73k36j076k100j955j101q59r65m88%l90p02L24J715J795J153
55289A31784J425K256K170J457J417J580N34j155j624q12k93m91n31m07q34j304
55273A35172p03M97Q41K84q4j81o47j036m81L61K47k97K00J512K128J872J813
55256A41498J905J012p27j837j743j282r91o06j76j48l97m86n40q01q94o76q50
55239A32261j564j549r0J485J735J212R46M46q74j834j355o23j048j480j26K068
$$ plain form
55357 132703 131685 131386 131194 131203 132253 133906 134580 134004 133480 133464 133074 132290 132360 133554 134649 135039 135336 135541
55339 135541 134857 133702 133617 134627 134882 133570 132039 131344 130759 129572 128407 127948 128024 128645 130220 132098 132645
55322 132645 131482 130154 130008 130848 131973 132945 133094 132027 130873 131271 132899 133862 133711 133971 135342 136601
55306 136601 136842 136669 136433 135357 133257 131302 130201 129342 128377 127889 127889 127499 126797 127121 128836 130631 131784
55289 131784 133209 135465 137635 139092 140509 142089 142623 141468 139844 139032 138739 138248 137717 137310 136476 135172
55273 135172 134469 134966 135807 136091 136007 135826 135179 134143 133662 134023 134270 133973 134173 135685 137813 139685 141498
55256 141498 143403 144415 143688 141851 140108 138826 137835 137229 137053 136905 136508 136022 135482 134681 133787 133111 132261
55239 132261 130697 129148 129058 130543 132278 133490 134436 134882 134008 132174 130819 130196 129148 127668 127542 129610
55223A29610K778K013J591J792J402M66J38K73j55o90o0J186J376N81K35L59j29
55206A42766p36J15K025K789J674O5j062j851j917n63J262J723Q27J79Q6n90j747
55189A45045j854o72K75K32rq3n31j126q43J30M97J09R8O24O08k04r30j318j805
55170A38243j875o09J133J419K22n50r8M98O31Q91J184O08m54l93R05J685J151
55153A44591M48L47J59m43o52k46j24n00m54J63L08k71n34j08J08j66j8P76J184
55134A44568P91M06L14j46q44o21N65J210O45l2m7j37q12j245q09j58M7J15K92
55115A44102J95j93k77o9k47o97m65M64J004R06J157K022K441J955J515J707J765
55098A57285J022l8p63j046o61O61K090K191R33j60k35N6J34K29K24m79j472j484
$$ plain form
55223 129610 132388 134401 135992 137784 139186 139652 139790 140063 139908 139218 139158 140344 141720 142301 142536 142895 142766
55206 142766 142030 142145 144170 146959 148633 148698 147636 145785 143868 143305 144567 146290 147117 147296 147382 146792 145045
55189 145045 143191 142519 142794 143026 143017 142934 142403 141277 140434 140564 141061 141170 141268 141892 142500 142296 141366 140048 138243
55170 138243 136368 135759 136892 138311 138533 137983 137885 138383 139014 139905 141089 141697 141243 140850 141755 143440 144591
55153 144591 145039 145386 145545 145102 144450 144204 144080 143580 143126 143289 143597 143326 142792 142684 142792 142626 142608 143384 144568
55134 144568 145359 145765 146079 145933 145089 144468 145033 146243 146888 146856 146809 146672 145860 144615 143806 143648 143695 143810 144102
55115 144102 144297 144104 143827 143758 143511 142814 142349 142813 143817 144723 145880 147902 150343 152298 153813 155520 157285
55098 157285 158307 158269 157506 156460 155799 156460 158550 160741 161674 161514 161279 161335 161469 161698 161922 161443 159971 158487
55080A58487m71J13l30o45m3O04L95k54o33q36j063j055p44m18L3R02J610J276
55062A56928L13rL44K18n70r68o74m70l95M02J640J858Q58J75M98O73n2q08q87
55043A59074r32j421j673j190m77J02P98J379J148M06K44N67K46o12o81M2O8p87
55025A56301q98J53O67j42p48j81K25o52j665j449n18J25O15J078P80k03k88J157
55007A54357K539K536K024K074J981R40j24j72J62O2J87J143J865J341M69M54
54991A71838P46L46k07j7L22j36p94o19o6j66o27n68j95k02l42j39p7n92r12l39
54971A67254K84J3l87L23J654K102J316J07r51j534j066L00J116N08k71L18J643
54954A72729J957J095L14P9j49l53M6P66Q30J10m83l83Q3L47Q0o57j136m31J130
$$ plain form
55080 158487 158016 158129 157799 157154 157111 157715 158110 157856 157223 156387 155324 154269 153525 153107 153140 154042 155652 156928
55062 156928 157241 157232 157576 157794 157224 156256 155582 155112 154717 155119 156759 158617 159475 159650 160148 160821 160769 159961 159074
55043 159074 158142 156721 155048 153858 153381 153483 154281 155660 156808 157214 157458 158025 158271 157659 156978 157020 157088 156301
55025 156301 155403 155556 156223 156081 155333 155152 155377 154725 153060 151611 151093 151218 151833 152911 153691 153488 153200 154357
55007 154357 156896 159432 161456 163530 165511 166451 166327 166155 166317 166379 166566 167709 169574 170915 171384 171838
54991 171838 172584 172930 172723 172706 173028 172892 172098 171479 171413 171247 170620 170052 169857 169655 169313 169174 169097 168505 167593 167254
54971 167254 167538 167551 167164 167487 169141 171243 172559 172666 171715 170181 169115 169415 170531 171039 170768 171086 172729
54954 172729 174686 175781 176095 176174 176025 175672 175718 176484 177314 177424 176941 176558 176641 176988 177068 176411 175275 174844 175974
54935A75974J858R17l09j20J180K107K226K215K388K488K626L163L960M635N210
54920B10518N807O241O519P030P552P053N196L058J525N5k019m126n467o326p168
54905B35448p489o805n833n400n109m292l389l133l210k961k563k261j473P4J257
54890A82861J017J03m1P15J543K238K922L111K461J833K173L008L394L598M452
54875B15388N760O712P223P510P043N372L232J493l14k957n727p206p228o676
54861B29625n962n155m861n413n734m593k522j019l95P8M26oj062j856k104k180
54845A87267k147j956k068k709l009k194r68m58m93k85k9k79m53L14J433J586
54829A73552Q16K66K89L76M67P51O79k24j046o97J02j17j019j015oN14P2j31N90
$$ plain form
54935 175974 177832 178749 178440 178320 179500 181607 183833 186048 188436 190924 193550 196713 200673 205308 210518
54920 210518 216325 222566 229085 236115 243667 250720 255916 258974 260499 260554 258535 254409 248942 242616 235448
54905 235448 227959 221154 215321 209921 204812 200520 197131 193998 190788 187827 185264 183003 181530 181604 182861
54890 182861 183878 183981 183940 184655 186198 188436 191358 194469 196930 198763 200936 203944 207338 210936 215388
54875 215388 221148 227860 235083 242593 249636 255008 258240 259733 259419 256462 250735 243529 236301 229625
54861 229625 223663 218508 213647 208234 202500 197907 195385 194366 193971 194049 194475 194469 193407 191551 189447 187267
54845 187267 185120 183164 181096 178387 175378 173184 172216 171758 171265 170980 170951 170672 170219 170533 171966 173552
54829 173552 174368 174634 174923 175299 175766 176517 177196 176972 175926 175229 175331 175214 174195 173180 173174 173688 173760 173629 174219
54810A74219J407J534J195P05L3m28rJ017J574J271P19L17q1l59j49L43N66N64
54792A84438O84O94K10l51m14k97m56l23O11J289M81q98q15Q01J998J809J324
54775A90785J582K266K812L200L328L032K879L624M817N433N773P064R161J0392
54761B56148R923Q547O951M924K628Q48m67k339m904o964p851q224q491q066o814
54746B35849n739n435n201m383l438k949k711k444k327k240j529k09O67M67j24
54731A98254k11J75O30J143J751K213K568L304M538N634O053N956N767N637N538
54716B48950N252M279K309j63k364m130n642o623o767o561o691o844o267n157
54702B03581m279l483k059m39J6q88j781j666j006n89m63l86k90n2L27L02n77
$$ plain form
54810 174219 175626 177160 178355 179060 179093 178665 178656 179673 181247 182518 183237 183554 183473 183114 182965 183308 183874 184438
54792 184438 185122 185816 186026 185675 185261 184964 184508 184185 184796 186085 186566 185668 184853 185654 187652 189461 190785
54775 190785 192367 194633 197445 200645 203973 207005 209884 213508 218325 223758 229531 236595 245756 256148
54761 256148 266071 274618 281569 286493 289121 289969 289502 287163 282259 275295 267444 259220 250729 242663 235849
54746 235849 230110 224675 219474 215091 211653 208704 205993 203549 201222 198982 197453 197244 197911 198378 198254
54731 198254 198043 198218 198848 199991 201742 203955 206523 209827 214365 219999 226052 232008 237775 243412 248950
54716 248950 254202 258481 260790 260627 258263 254133 248491 241868 235101 228540 221849 215005 208738 203581
54702 203581 199302 195819 193760 193321 193337 192449 190668 189002 187996 187407 186944 186558 186268 186216 186543 186845 186268
54685A86268j708k107j785j382q50J62J024P68j81n47l12n18j130r84j1M50j24
54668A77033p04o38n16o64n23m5k2m94m65J64K06o91j246o97O8L24P06J525J720
54649A75041P58OP35K011K091R25j56m91m84m48k80P7N76J166J472R19l19j250
54631A82349j320j028r00p35l15K1J8o9p6j63k24O9L78m5j010j355o58K26N56
54612A75719M64J21m70o50L57J763J758L38k67J103K675K374P01m93p31q01r37
54595A83024p38l08j64l44o04j002j527j684j163l67L10R71J512J370N26j72l09
54578A79331m53q18n84O04J600J297K25m07l39k1M41R69J017L70k31j43K32L17
54560A83407L86Q06J153R47N93N96O53L60J22L82O87M41j34n96j067j567j403
$$ plain form
54685 186268 184560 182453 180668 179286 178436 178598 179622 180390 180209 179662 179350 178832 177702 176718 176707 177157 177033
54668 177033 176329 175691 175175 174511 173988 173943 173921 173427 172962 173126 173332 172641 171395 170698 170766 171090 171796 173321 175041
54649 175041 175799 175805 176540 178551 180642 181567 181411 180920 180436 179988 179708 179785 180361 181527 182999 183918 183599 182349
54631 182349 181029 180001 179101 178366 178051 178072 178090 178021 177945 177782 177558 177627 178005 177960 176950 175595 174937 175163 175719
54612 175719 176183 176304 175834 175184 175541 177304 179062 179400 179133 180236 182911 185285 185986 185493 184762 183961 183024
54595 183024 182286 181978 181814 181470 180866 179864 178337 176653 175490 175123 175433 176404 177916 179286 179812 179640 179331
54578 179331 178878 178060 177476 178080 179680 180977 181202 180795 180456 180435 180876 181845 182862 183232 183001 182858 183090 183407
54560 183407 183793 184599 185752 186699 187292 187888 188541 188901 189023 189405 190092 190533 190399 189803 188736 187169 185766
54543A85766k49R25J067N52M99J105J702J886J713J257Q12J003J853K314J561
54528B03766K12n28m03K3L73N46L08l11o91m30m5j97p02r46p96n11k53j93n16
54509A98706r28q50m69o20j277j235QJ220J164K94k71m64q53j286j176n34J62
54492A91591P33J068Q36J38j83L14R30R87Q65J116J367J092O40N70O68N15M00
54475B03647P14J132J236J214J216Q21n0n74k50K09J17l3L32O49K25m17m10k0
54457B09758J8r9K73R44J201R88P19N11M12P18J276J249M63m2L72Q05M28k0L26
54438B20300P54K42n83m40L94O57K45J39N59Q33P47O34L94k43p76n10K72P82R31
54419B25331J030R69P65J109K162K675J697K58k09j60q57j857j671m41K01k77
$$ plain form
54543 185766 185517 186442 187509 188061 188560 189665 191367 193253 194966 196223 197035 198038 199891 202205 203766
54528 203766 203978 203450 203047 203070 203443 203989 204297 203986 203295 202865 202820 202623 201921 200975 200179 199668 199415 199222 198706
54509 198706 197778 196928 196459 195839 194562 193327 193335 194555 195719 196013 195742 195278 194425 193139 191963 191429 191591
54492 191591 192324 193392 194228 194366 194183 194497 195427 196414 197279 198395 199762 200854 201494 202064 202732 203247 203647
54475 203647 204361 205493 206729 207943 209159 209980 209930 209356 209106 209315 209432 209399 209731 210380 210605 210188 209778 209758
54457 209758 209776 209677 209950 210894 212095 213083 213802 214313 214725 215443 216719 217968 218431 218389 218761 219566 219994 219974 220300
54438 220300 221054 221296 220713 220273 220667 221324 221569 221708 222267 223100 223847 224481 224875 224632 223856 223346 223618 224400 225331
54419 225331 226361 227330 228095 229204 231366 234041 235738 235996 235787 235627 234770 232913 231242 230801 231002 230725
54403B30725p53m64K02R54J914K608K251J185N72O36N54P5j70O8M30R01J672K228
54385B45588J911J227J161J376O56j031k370k581k016r92L73J330J073J75JO96
54369B46577J244J339J546J779J386P22Q16J382J091n1n39R3N79K54P5O04Q07
54352B59704k8q38l43J117K318K660K184J068q8m09J39O25O11P41J460K139K099
54335B75159J519Q08o7j093j881k285k643l065l257l263l478l779l495k500j392
54320B45288n42J03K81l01r15l53J158J920J016n93j647j948j810j351r51j225
54304B38130j930j978j010N0M79O47R10Q54K96p5J80M80K95N6K82O59O59L43n0
54285B39277n97j144j045q8R80J385J177P80K73l85j021j519j872j838j166k93
$$ plain form
54403 230725 229972 229508 229710 230664 232578 235186 237437 238622 239194 239830 240384 240459 240289 240357 240787 241688 243360 245588
54385 245588 247499 248726 249887 251263 251919 250888 248518 245937 243921 242929 243302 244632 245705 245880 245881 246577
54369 246577 247821 249160 250706 252485 253871 254593 255409 256791 257882 257831 257292 257385 257964 258218 258293 258897 259704
54352 259704 259676 258838 258495 259612 261930 264590 266774 267842 267754 267345 267484 268109 268720 269461 270921 273060 275159
54335 275159 276678 277486 277419 276326 274445 272160 269517 266452 263195 259932 256454 252675 249180 246680 245288
54320 245288 244746 244849 245130 244829 243914 243561 244719 246639 247655 247062 245415 243467 241657 240306 239355 238130
54304 238130 236200 234222 233212 233262 233741 234388 235298 236152 236448 236373 236553 237033 237328 237384 237666 238325 238984 239327 239277
54285 239277 238680 237536 236491 236403 237383 238768 239945 240725 240998 240613 239592 238073 236201 234363 233197 232904
54269B32904n4m97p86m53J05M37N22L44q7k37L88J173R88j8m75J60R39J093R78
54250B37424R17M97l50q43o63n46q93r40j02Q56R16J88n97j111j304j050n73n09
54232B31317r59j208q72n09n47n09J03R61J489J614J503J280J335K051K878K733
54216B42660J529L81j06n93j612k662l164l215k866j903q05n90j163j184k44M19
54200B24882J54J30J190K048J246l82j001m81j30k97r6P65J461J447J100R01Q31
54183B33768P00L95j10n94o08j56J26k01p61j042j046r37o06j33L5k09l97l71
54165B27853n51r27p46K15J064J071O77N08M22J82J08K76Q4n60p25l2M02l11j247
54146B27763j077j73J36k70l88J42O22N37J08k29j92K85P83O57L6j16M97R35N63
$$ plain form
54269 232904 232850 232353 231567 231114 231219 231656 232178 232522 232435 232198 232586 233759 234747 234729 234254 234414 235353 236446 237424
54250 237424 238341 238838 238488 237645 236982 236436 235543 234603 234501 235357 236273 236461 235864 234753 233449 232399 231826 231317
54232 231317 230358 229150 228278 227769 227222 226713 226816 227777 229266 230880 232383 233663 234998 237049 239927 242660
54216 242660 244189 244570 244464 243871 242259 239597 236433 233218 230352 228449 227644 227054 225891 224707 224463 224882
54200 224882 225036 225166 226356 228404 229650 229268 228267 227786 227656 227359 227263 228028 229489 230936 232036 232937 233768
54183 233768 234468 234863 234753 234159 233551 233395 233521 233320 232559 231517 230471 229534 228928 228795 228830 228621 228224 227853
54165 227853 227302 226375 225629 225844 226908 227979 228656 229164 229586 229768 229876 230152 230236 229676 228951 228919 229321 229010 227763
54146 227763 226686 226513 226649 226379 225991 226133 226755 227292 227400 227171 226979 227264 228047 228704 228740 228624 229121 230056 230619
54127B30619P2J31J69l51o60jQ28P35K47N20J290J526J493K226L291L079J369
54110B46583j49k51M57R00R36Q59O26J16m95r79j155q04j9M85J58n20o72l00j19
54091B45657l39m59j70L05O72O64k8j226j990j612n48L70J147K184L137L330K901
54074B53995K494K106J369P00Q88J669J939J408R23J031J391J686K017K219J792
54059B77627Q82M02Q69J840K740L559M465N404O338P388Q549R707J1051J2960
54045C53781J5344J7380J7848J5651J0460L434l082p199q796q869q105o673m908
54032C86266l216j598N9J450K296K879L442L476K555J445J272J890K165J705J177
54017D07263R14M12o28j718k402k795l105l307l454l745m137m408m628n017n478
$$ plain form
54127 230619 230691 230822 230991 230640 229980 229979 230807 231542 231789 232309 233599 235125 236618 238844 242135 245214 246583
54110 246583 246434 246183 246640 247540 248476 249335 249961 250077 249582 248603 247448 246644 246625 247110 247268 246748 246076 245776 245657
54091 245657 245318 244859 244689 244994 245666 246330 246302 245076 243086 241474 240926 241296 242443 244627 247764 251094 253995
54074 253995 256489 258595 259964 260664 261552 263221 265160 266568 267491 268522 269913 271599 273616 275835 277627
54059 277627 278509 278911 279780 281620 284360 287919 292384 297788 304126 311514 320063 329770 340821 353781
54045 353781 369125 386505 404353 420004 430464 433898 430816 423617 414821 405952 397847 391174 386266
54032 386266 383050 381452 381511 382961 385257 388136 391578 395054 397609 399054 400326 402216 404381 406086 407263
54017 407263 408177 408589 407961 406243 403841 401046 397941 394634 391180 387435 383298 378890 374262 369245 363767
54002C63767n774n999o264o151n232l906l026k762k662k563k603k462j617l94
53988C12352J44m55j506k125k072j578j032q54j067j059l16O25O84k68j172j140
53972B99161l89K99N31M30K69J94J40oj28PK96L13j7k92l60n34p40k47J245K968
53952C03140M099M648M815M395L573L380M327N508N977O181O878P668P940Q334
53938C80863R727J1450J2178J2001J1838J1274Q985N134J477j024k948m662n534
53925D50759n261m437l373j690M79K185K944L284L631L802L813M183N134O357
53911D71810P617Q751R238Q874Q542R000R246P664M634K239J375R33M7p55j073
53896E48142j421j870j586l58R64K115L767N688O511O318P445J1093J4708J4378
$$ plain form
54002 363767 357993 351994 345730 339579 334347 330441 327415 324653 321991 319428 316825 314363 312746 312352
53988 312352 312496 312041 310535 308410 306338 304760 303728 302874 301807 300748 300432 301057 301741 301473 300301 299161
53972 299161 298772 299071 299602 300032 300301 300495 300635 300629 300501 300508 300804 301117 301100 300808 300448 299914 299174 298927 300172 303140
53952 303140 307239 311887 316702 321097 324670 328050 332377 337885 343862 350043 356921 364589 372529 380863
53938 380863 390590 402040 414218 426219 438057 449331 458316 463450 464927 463903 460955 456293 450759
53925 450759 445498 441061 437688 435998 436477 438662 441606 444890 448521 452323 456136 460319 465453 471810
53911 471810 479427 488178 497416 506290 514832 523832 533078 540742 545376 547615 548990 549923 549970 549215 548142
53896 548142 546721 544851 543265 542907 543871 545986 549753 555441 561952 568270 575715 586808 601516 615894
53882F15894Q856p1r911j8566k4144k5818k4813k3213k1822k0034j7518j4853
53870D23987j2681j1092r826q628p390o312n670n316m885m576m923n569n280l654
53856C28185j865j114j174j217j137j258j408j241r65r54j098j115j093j150j036
53841C10360p01o41j096j488j261p47n53o22n44l34k30j55%m9n08r58q53k37M40
53822B99823Q74R43O18K53M80J360K102K039J470J135J313J814K410K859K922
53807C22415K672K480K521K777L471M774N990O039N093M695N679O920O830N383
53793C87739L865L246L514M115M339L644K233J009N79O55O90N76M21K12N0R3J2
53776D16992q07k221l308l657l827m137m086l516l296m050n091n526n577n915
$$ plain form
53882 615894 624750 624679 614768 596202 572058 546240 521427 498214 476392 456358 438840 423987
53870 423987 411306 400214 390388 381760 374370 368058 362388 357072 352187 347611 342688 337119 331839 328185
53856 328185 326320 325206 324032 322815 321678 320420 319012 317771 316806 315852 314754 313639 312546 311396 310360
53841 310360 309659 309018 307922 306434 305173 304426 303873 303251 302707 302373 302143 301988 301988 301939 301431 300473 299620 299383 299823
53822 299823 300697 301640 302258 302511 302991 304351 306453 308492 309962 311097 312410 314224 316634 319493 322415
53807 322415 325087 327567 330088 332865 336336 341110 347100 353139 358232 362927 368606 375526 382356 387739
53793 387739 391604 394850 398364 402479 406818 410462 412695 413704 414283 414938 415628 416204 416625 416837 416887 416980 416992
53776 416992 416185 413964 410656 406999 403172 399035 394949 391433 388137 384087 378996 373470 367893 361978
53762C61978o320o061n142m285l910l828l689l295k682k283k422k590j943p49
53748C12779l25j051j624j022p5j03r06j296q85k33K79O54P97P23Q73J442J837
53731C11864J540R16M36j51r92j227j62J266J508O04J09R17K278L055K963K411
53715C27335J878J713K026K560K886K653J657P7j169j039L66J780K413K787L484
53700C51407M026L820L298L261L752M368M982N288M560K819J479J656K573K719
53686D00008J946J172P45L99L04O81Q00j91j704k337j825j072n26Q3N08P8r59
53669C98110j510j225q07o09k50K25J07o74j206r73n70n89o85l16L62P83O82K09
53651C91064k34j84L25N28j70j181j396p42j88k33l78j93K8k9j04J74Q59J828
$$ plain form
53762 361978 355658 349597 344455 340170 336260 332432 328743 325448 322766 320483 318061 315471 313528 312779
53748 312779 312454 311403 309779 308757 308682 308579 307673 306377 305492 305259 305538 306192 306989 307712 308585 310027 311864
53731 311864 313404 314320 314756 314605 313613 312386 312224 313490 314998 315602 315711 316628 318906 321961 324924 327335
53715 327335 329213 330926 332952 335512 338398 341051 342708 342785 341616 340577 340943 342723 345136 347923 351407
53700 351407 355433 359253 362551 365812 369564 373932 378914 384202 388762 391581 393060 394716 397289 400008
53686 400008 401954 403126 403871 404270 404574 405255 406055 405864 404160 401823 399998 398926 398400 398483 398991 399069 398110
53669 398110 396600 395375 394568 393959 393709 393934 394041 393367 392161 391188 390618 390029 389344 389028 389390 390173 390855 391064
53651 391064 390830 390646 390971 391499 391329 390148 388752 388010 387822 387589 387211 387018 387046 387017 386913 387087 387946 389774
53633C89774K827L335K972K136J661J815K199K522K793K870K584K272K419K860
53619D25039L023K865K816K911K901L077L927N064N460M931M306M069L859L516
53605D77764L536M127M768N042N094M981M425L566K985K705K083J111P37J363
53591E24287K004J657O73Nj89l55n35m93m35p54j218j128k78Q95J934K721L218
53574E32009L407L457L588L710L516K922K212J548O21j013l241n252o292o464
53560E34728o435o383n757m289k664j691j270p54k9M72O68R59J506K021K307K451
53544E15840K480K400K575L407M581N255N140M848M930N166N098M851N033O039
53530E77643P613R034R614R273Q680Q674R590J1168J2932J4379J5101J5108J4939
$$ plain form
53633 389774 392601 395936 398908 401044 402705 404520 406719 409241 412034 414904 417488 419760 422179 425039
53619 425039 428062 430927 433743 436654 439555 442632 446559 451623 457083 462014 466320 470389 474248 477764
53605 477764 481300 485427 490195 495237 500331 505312 509737 513303 516288 518993 521076 522187 522924 524287
53591 524287 526291 527948 528621 528626 528437 528082 527547 527054 526619 525865 524647 523519 523241 524136 526070 528791 532009
53574 532009 535416 538873 542461 546171 549687 552609 554821 556369 556990 555977 552736 547484 541192 534728
53560 534728 528293 521910 516153 511864 509200 507509 506239 505485 505456 505928 506596 507555 509061 511082 513389 515840
53544 515840 518320 520720 523295 526702 531283 536538 541678 546526 551456 556622 561720 566571 571604 577643
53530 577643 585256 594290 603904 613177 621857 630531 640121 651289 664221 678600 693701 708809 723748
53517G23748J5119J5700J6467J7349J8332J9283K0285K1710K3591K5284K6183
53506I43051K6409K6356K6068K5621K5596K6343K7161K7011K5879K4689K4079
53495A228263K3904K3732K3142K1824K0011J8605J8254J8636J9130J9656K0208
53484A455365K0267J9591J8920J8848J8720J7802J6878J7145J8053J7918J6452
53473A655959J4862J3546J1540Q531N574L246P27k544n778q154r962j1684j3066
53460A662797j3945j4856j6010j6635j6259j5792j6401j7989j9620k0860k1873
53449A472557k2664k3004k2836k2282k1590k1245k1533k1758k0665j8064j5211
53438A241705j3163j1575r724p873o704o029n034l492j975q95P0J568L782O069
$$ plain form
53517 723748 738867 754567 771034 788383 806715 825998 846283 867993 891584 916868 943051
53506 943051 969460 995816 1021884 1047505 1073101 1099444 1126605 1153616 1179495 1204184 1228263
53495 1228263 1252167 1275899 1299041 1320865 1340876 1359481 1377735 1396371 1415501 1435157 1455365
53484 1455365 1475632 1495223 1514143 1532991 1551711 1569513 1586391 1603536 1621589 1639507 1655959
53473 1655959 1670821 1684367 1695907 1704438 1710012 1713258 1713985 1711441 1705663 1697509 1687547 1675863 1662797
53460 1662797 1648852 1633996 1617986 1601351 1585092 1569300 1552899 1534910 1515290 1494430 1472557
53449 1472557 1449893 1426889 1404053 1381771 1360181 1338936 1317403 1295645 1274980 1256916 1241705
53438 1241705 1228542 1216967 1207243 1199370 1192666 1186637 1181603 1178111 1176136 1175241 1175311 1176879 1180661 1186730
53424A186730P420P551P455Q378J0356J2411J4057J5714J7612J9294K0532K1829
53412A349339K3525K5229K6570K7805K9265L0833L2340L3815L5102L5958L6839
53401A686620L8734M1765M4791M6834M8201M9684N1458N3283N5009N6388N7045
53390B229812N7163N7551N8499N9282N9219N8531N7569N6054N3663N0805M8103
53379B846251M5602M2988M0115L6879L3220K9512K6254K3080J8924J3592Q241
53368C164658L700p64o368j3358k1307k9851l8377m5774n1359n5447n8361n9777
53356B787615n9828n9768o0502o1250o0786n9250n7518n5459n2324m8488m5466
53345B166976m4196m4361m5334m6695m7793m7766m6304m3892m1231l8770l6647
$$ plain form
53424 1186730 1194150 1201701 1209156 1217534 1227890 1240301 1254358 1270072 1287684 1306978 1327510 1349339
53412 1349339 1372864 1398093 1424663 1452468 1481733 1512566 1544906 1578721 1613823 1649781 1686620
53401 1686620 1725354 1767119 1811910 1858744 1906945 1956629 2008087 2061370 2116379 2172767 2229812
53390 2229812 2286975 2344526 2403025 2462307 2521526 2580057 2637626 2693680 2747343 2798148 2846251
53379 2846251 2891853 2934841 2974956 3011835 3045055 3074567 3100821 3123901 3142825 3156417 3164658
53368 3164658 3168358 3167594 3161226 3147868 3126561 3096710 3058333 3012559 2961200 2905753 2847392 2787615
53356 2787615 2727787 2668019 2607517 2546267 2485481 2426231 2368713 2313254 2260930 2212442 2166976
53345 2166976 2122780 2078419 2033085 1986390 1938597 1890831 1844527 1800635 1759404 1720634 1683987
53334A683987l4622l2255k9539k6955k4632k2043j8992j6297j4827j4415j4420
53323A434990j4707j5345j5880j5769j5152j4335j3106j1336r741r027q719p855
53311A284018o456n273m417l279j615L20K494M918O866P454P043P117Q594J1100
53297A318884J3888J6600J8963K0650K1778K2964K4586K6355K7768K8546K8718
53286A569700K8560K8386K8046K6990K5137K3297K2080K0947J9043J6520J4116
53275A822822J1767Q696M776P80k736n901q838j1317j3336j5301j7497j9932k2683
53262A731300k5695k8302k9673k9930l0101l0861l1961l2924l3657l4116l4024
53251A390056l3238l1959l0412k8678k7006k5896k5642k6040k6584k6858k6841
$$ plain form
53334 1683987 1649365 1617110 1587571 1560616 1535984 1513941 1494949 1478652 1463825 1449410 1434990
53323 1434990 1420283 1404938 1389058 1373289 1358137 1343802 1330696 1319360 1309619 1300592 1291873 1284018
53311 1284018 1277562 1272289 1267872 1264593 1262978 1263298 1265792 1270710 1277576 1285030 1292073 1299190 1307784 1318884
53297 1318884 1332772 1349372 1368335 1388985 1410763 1433727 1458313 1484668 1512436 1540982 1569700
53286 1569700 1598260 1626646 1654692 1681682 1706819 1730116 1752196 1773143 1792186 1808706 1822822
53275 1822822 1834589 1843285 1848061 1848841 1846105 1840204 1831366 1820049 1806713 1791412 1773915 1753983 1731300
53262 1731300 1705605 1677303 1647630 1617700 1587599 1556738 1524777 1491853 1458196 1424080 1390056
53251 1390056 1356818 1324859 1294447 1265769 1238763 1212867 1187225 1161185 1134601 1107743 1080902
53240A080902k6916k7375k7770k7219k5630k4065k3329k2753k1149j8524j6000
53229H20172j4267j2975j1625j0220r009q229q183q976j0154j1060j1498j1657
53217F92319j1684j1773j2349j3462j4314j4150j3368j2980j3163j3181j2603
53206E49292j1672j0554r151p784p175p495q042q085p535o719o016n779n955n918
53192D41412n143m068l625m042m736n219n444n303m657l884l622l843l846l250
53178C80730k349j499p72k78j16M3O24J343J424O91j83n69m61j08K04O4o79j449
53160C76660j548j223j310j854k038j555j097j222j611j832j987k213k234j941
53146C52995j720j827j899j572j093r41j138j260r17r5P55J026O78M45Q62J364
$$ plain form
53240 1080902 1053986 1026611 998841 971622 945992 921927 898598 875845 854696 836172 820172
53229 820172 805905 792930 781305 771085 762076 753847 745664 736688 726534 715474 703976 692319
53217 692319 680635 668862 656513 643051 628737 614587 601219 588239 575076 561895 549292
53206 549292 537620 527066 517915 510131 502956 495461 487419 479334 471799 465080 459064 453285 447330 441412
53192 441412 436269 432201 428576 424534 419798 414579 409135 403832 399175 395291 391669 387826 383980 380730
53178 380730 378381 376882 376110 375832 375716 375759 376383 377726 379150 379841 379658 379089 378628 378520 378724 378788 378109 376660
53160 376660 375112 373889 372579 370725 368687 367132 366035 364813 363202 361370 359383 357170 354936 352995
53146 352995 351275 349448 347549 345977 344884 343943 342805 341545 340628 340533 341288 342314 342992 343437 344299 345663
53130C45663J053P7n87o14n71o89m66K71R34J181J374J667J536P92K07N04J332
53113C53664J890K024K082K078J649O83m44j165j185q17q10j532k428k771k677
53098C50241k697k640j845n62J23p1k09K45N89K22k28j1M74L83k16o47p58q64
53080C41529r26o66k37q1k22k68M4O34J245J475J035K52p2L46Q48P60K50j83n15
53061C45248r49j306j311j140j050p65J25J382K249K319J836J334J270J768K362
53046C53372K263J292K12k00j53m49j375k461l154l285l003k621k370k119j509
53031C34440n98J8Jk49k74k44m76o90m17J20K35j69m65k72M7J5k39k41J39N40
53011C31221O52O79J007J462J327L79m39p8J103J672J116M98Q08J545J629J005
$$ plain form
53130 345663 346716 346793 346206 345592 345021 344332 343866 344137 345071 346252 347626 349293 350829 351621 351828 352332 353664
53113 353664 355554 357578 359660 361738 363387 364070 363626 362461 361276 360459 359649 358117 355689 352918 350241
53098 350241 347544 344904 343059 342497 342620 342549 342340 342585 343174 343396 343168 343157 343631 344014 343798 343151 342393 341529
53080 341529 340603 339937 339700 339619 339397 339129 339173 339807 341052 342527 343562 343814 343742 344088 344936 345696 345946 345763 345248
53061 345248 344299 342993 341682 340542 339492 338727 338852 340234 342483 344802 346638 347972 349242 351010 353372
53046 353372 355635 356927 357139 356939 356786 356337 354962 352501 349347 346062 343059 340438 338068 335949 334440
53031 334440 333842 333860 333861 333612 333338 333094 332618 331928 331511 331631 331866 331697 331232 330960 331007 331022 330783 330542 330681 331221
53011 331221 331873 332552 333559 335021 336348 336727 336288 336210 337313 338985 340101 340599 341407 342952 344581 345586
52995C45586M11J05k51o34o27l15k61n01l60M30J141J054N60O31J459K221K204
52978C52853J630J255J387J648J605J306J102J156J295J274J042P87P80J090J405
52963C71615J294P82M02N17Q98J137J204J198R54L88j14k24l22r34j710j774j088
52946C74223n99q90j459j630j450j329j385j471j475j278q94p78j437k551l078
52931C52519k575j731j345j329j201r21p26o04m99o35j093j396j044k44M12P40
52915C38328J004J296J311P61k32j155j433r02n6M36M45L72M32L92O5m02q12j078
52897C38772r89l57N22R92Q41M93K44r0o26j030r46l80M39J109J028Kj132j275
52879C37617n47o9j96r8O49J233R89M90M28M53R0j24M79J384J609J228J089J433
$$ plain form
52995 345586 345997 346102 345851 345217 344590 344275 344014 343513 343153 343583 344724 345778 346338 346969 348428 350649 352853
52978 352853 354483 355738 357125 358773 360378 361684 362786 363942 365237 366511 367553 368340 369120 370210 371615
52963 371615 372909 373691 374093 374610 375508 376645 377849 379047 380001 380389 380275 380051 379729 378795 377085 375311 374223
52946 374223 373624 372734 371275 369645 368195 366866 365481 364010 362535 361257 360363 359585 358148 355597 352519
52931 352519 349944 348213 346868 345539 344338 343417 342691 342087 341588 340953 339860 338464 337420 337176 337588 338328
52915 338328 339332 340628 341939 342700 342468 341313 339880 338978 338922 339358 339803 340175 340607 340999 341064 340662 339850 338772
52897 338772 337783 337426 337948 338940 339781 340274 340518 340428 339802 338772 337826 337446 337885 338994 340022 340024 338892 337617
52879 337617 337070 337001 336805 336707 337356 338589 339578 340068 340496 340949 341039 340915 341394 342778 344387 345615 346704 348137
52861C48137J818K114K506K718K326J646J351J253N08r11j995k141j952k224k904
52846C52250l423l610l732l933m007l643k757j618o89k43j92l09n07p61r47q97
52830C20982n08K17J040J483J240O29K23J22%j58r6J7l24r49j018k95L69K99m7
52811C23226R1P31J435J917J954J374P38J156K745M057L752K139L52j137k355
52796C42175k980k750k228k133k358k511k766l259l221j929q2R10P19J79j32k95
52780C17339k88Q5O18R35J110J273J032K05m01L5R63J296J158J520K345K529J677
52763C33431N24l88j190j708j395n17j02l76m03L24J062J029M75Q8J12M28Q10
52746C32204Q23J94n79p39l64q2J81J015K099K338J690J441K147K637J832M07
$$ plain form
52861 348137 349955 352069 354575 357293 359619 361265 362616 363869 364377 363466 361471 359330 357378 355154 352250
52846 352250 348827 345217 341485 337552 333545 329902 327145 325527 324838 324595 324403 324094 323587 322826 321879 320982
52830 320982 320474 320691 321731 323214 324454 325083 325306 325428 325428 325270 325174 325191 324867 323918 322900 322605 322974 323273 323226
52811 323226 323317 324048 325483 327400 329354 330728 331466 332622 335367 339424 343176 345315 345667 344530 342175
52796 342175 339195 336445 334217 332084 329726 327215 324449 321190 317969 316040 315958 316868 317587 317766 317634 317339
52780 317339 317051 317136 317754 318689 319799 321072 322104 322309 321908 321943 322906 324202 325360 326880 329225 331754 333431
52763 333431 333955 333567 332377 330669 329274 328757 328655 328279 327876 328200 329262 330291 330766 330854 330966 331394 332204
52746 332204 333027 333221 332642 331903 331539 331457 331638 332653 334752 337090 338780 340221 342368 345005 346837 347244
52730C47244k95j5N42Q77R35P81P35J229J958J893P16n11p86m72m43p03q47j137
52712C51701k002k862k616j249Q5N54M65M55O53Q33Q48O55K72j29l13k81k30k40
52694C46599j88j0J76K83M34Q28J418J846J790J379J056R97R25O35L72L95M79
52677C59414K43k11m49k49K88R46J307Q84j87r79r41p54j185j642r94M54J208
52660C57153Q04L62O29Q66L58j89K33J273J712J207O61J018K211L232K963J220
52644C75713r02k063k108j912j855j389k93O29P09M42O65J319J811K077K528L257
52628C78628L952M379M501M379M302M638N098M559K262j145m165n873o355o121
52614C93039n546m831m016l054k019j130m82q2j07o32j087o71M56J124O55k55
$$ plain form
52730 347244 346949 346934 347476 348353 349288 350069 350804 352033 353991 355884 356600 356089 355303 354831 354388 353685 352838 351701
52712 351701 349699 346837 344221 342972 343057 343611 344076 344531 345184 346017 346865 347520 347792 347663 347350 347069 346839 346599
52694 346599 346411 346401 346577 346860 347294 348122 349540 351386 353176 354555 355611 356608 357533 358168 358540 358935 359414
52677 359414 359657 359446 358997 358748 359036 359982 361289 362173 361986 361007 360066 359312 358127 356485 355491 355945 357153
52660 357153 357957 358319 358948 359814 360172 359983 360216 361489 363201 364408 365069 366087 368298 371530 374493 375713
52644 375713 374811 372748 370640 368728 366873 365484 365191 365820 366529 366971 367636 368955 370766 372843 375371 378628
52628 378628 382580 386959 391460 395839 400141 404779 409877 414436 416698 415553 411388 405515 399160 393039
52614 393039 387493 382662 378646 375592 373573 372443 371961 371879 371772 371140 370053 369382 369838 370962 371617 371362
52598C71362o26m46k91k57p4J76K02J17K72O20P68N75L13L74R79J901K331J521
52580C79817j33j160o27Q28J893K018J482O80k4k21O7K17j12l86q4L53K20k52
52562C84576k99O0P7m82j063j257j240j155q01k01J74p1q62j852k568k501j530
52545C69005k97L35K50M0R2K65M86R49J590J921J720J364J160Q00n1r60j052j41
52527C77476Q92J081M83M9M14J182J544J310R24O86N49O28J205K047K397K084
52511C94951J979K822M123M879M927M788M462L379J555j60j225k055l169m286
52497D16970m750m524m177m084m077l851l339k614j673n68L84P64M55j86o39o07
52481C83484r6P15J515K054K390K800L198K944J699K22k76M79J664K545L164L706
$$ plain form
52598 371362 370736 370290 369999 369742 369668 369844 370046 370163 370435 371055 371823 372398 372711 373085 374064 375965 378296 379817
52580 379817 379684 378524 377897 378725 380618 382636 384118 384798 384774 384553 384620 384837 384725 384339 384255 384608 384828 384576
52562 384576 384277 384337 384414 383932 382869 381612 380372 379217 378416 378215 378389 378318 377456 375604 373036 370535 369005
52545 369005 368708 369043 369293 369333 369425 369690 370176 371125 372715 374636 376356 377720 378880 379680 379629 378669 377617 377476
52527 377476 378368 379449 379932 379981 380395 381577 383121 384431 385355 386041 386590 387218 388423 390470 392867 394951
52511 394951 396930 399752 403875 408754 413681 418469 422931 426310 427865 427705 426480 424425 421256 416970
52497 416970 412220 407696 403519 399435 395358 391507 388168 385554 383881 383313 383697 384461 384916 384730 384091 383484
52481 383484 383388 384103 385618 387672 390062 392862 396060 399004 400703 400925 400649 401128 402792 405337 408501 412207
52465D12207L970L837L685L877M265M587M855M904M082J993p48l073m567n507
52451D38367o055o023n390m477l534k578j731j284j348j649j803j613j103m45
52437C99334N5J03l43q99r90l74M86P45J04q20j248j191j177j289j036k12P21
52420C91969J290J544J753K017K305K539K480K018J571J740K513L314L852M365
52406D25270M991N683O835R115J2340J5397J7546J8869J9043J6752J1274L899
52394E67014l150q709j2775j5256j5708j4250j1862r593p879o539n143l477j893
52381D50780r82p63o48k99Q3M92J304K425L143L323L877N347O911P530P262O613
52365D96398N409L435J408J80n55j588k746l289l299l501l820l437k090l33J309
$$ plain form
52465 412207 416177 420014 423699 427576 431841 436428 441283 446187 450269 452262 451514 448441 443874 438367
52451 438367 432312 426289 420899 416422 412888 410310 408579 407295 405947 404298 402495 400882 399779 399334
52437 399334 399389 399492 399149 398250 397260 396886 397372 398117 398221 397401 396153 394962 393785 392496 391460 391248 391969
52420 391969 393259 394803 396556 398573 400878 403417 405897 407915 409486 411226 413739 417053 420905 425270
52406 425270 430261 435944 442779 451894 464234 479631 497177 516046 535089 551841 563115 567014
52394 567014 563864 555155 542380 527124 511416 497166 485304 475711 467832 461293 456150 452673 450780
52381 450780 449798 449035 448387 448088 448171 448663 449967 452392 455535 458858 462735 468082 474993 482523 489785 496398
52365 496398 501807 505242 506650 506830 506275 504687 501941 498652 495353 491852 488032 484595 482505 482172 483481
52350D83481K529K804J963J001J126K096K665K562K726L539M163M005L566L492
52336E21718L725M063M653N518O332O981P632Q176Q388Q788J0247J2603J4589
52323F23413J5556J6160J6953J7343J6642J5193J3750J2432J1127J0277J0433
52312G79279J1337J2233J2869J3613J4793J6418J8332K0204K1422K1494K0607
52301I62601J9587J9226J9640K0257K0386J9879J9018J7780J5546J1964P716L864
52289A157464Q06j600l245l922m077m453n066n304n100m985m973m468l520l165
52275A104392l942m949m946l723j916r1J426K420L122M184N835P414Q163Q172
52261A125561Q119Q460R235J0305J1419J2346J3161J4145J5215J5957J6354J6893
$$ plain form
52350 483481 486010 488814 490777 491778 492904 495000 497665 500227 502953 506492 510655 514660 518226 521718
52336 521718 525443 529506 534159 539677 546009 552990 560622 568798 577186 585974 596221 608824 623413
52323 623413 638969 655129 672082 689425 706067 721260 735010 747442 758569 768846 779279
52312 779279 790616 802849 815718 829331 844124 860542 878874 899078 920500 941994 962601
52301 962601 982188 1001414 1021054 1041311 1061697 1081576 1100594 1118374 1133920 1145884 1153600 1157464
52289 1157464 1158270 1156670 1153425 1149503 1145426 1140973 1135907 1130603 1125503 1120518 1115545 1111077 1107557 1104392
52275 1104392 1100450 1095501 1090555 1086832 1084916 1084825 1086251 1088671 1091793 1095977 1101812 1109226 1117389 1125561
52261 1125561 1133680 1142140 1151375 1161680 1173099 1185445 1198606 1212751 1227966 1243923 1260277 1277170
52249A277170J7638J7745J6319J3401R758O184L253J316J64q88k262l709m866
52236A351223n800o603p008o881o689o987p652q152q356q585q975r208q930q173
52222A243224p358o944p029p210o951o059m721l173j641m68J92O77J480K596L646
52207A200261M504N314N933O088N996O105O141N328L791K836L393M929O349P301
52193A274269Q029Q606R031R581J0438J1126J0932R666P716N566L546J740j23
52180A370123k313m556o321p803r810j2297j3858j3327j1335r426q138o874n309
52167A258756l959l250k798j903l19J641L488M902N863O497O793O622N982M937
52153A293252L316R62j541k988k787j680q16m93k20L93J294K292L150L548L358
$$ plain form
52249 1277170 1294808 1312553 1328872 1342273 1352031 1358215 1361468 1362784 1362948 1362060 1359798 1356089 1351223
52236 1351223 1345423 1338820 1331812 1324931 1318242 1311255 1303603 1295451 1287095 1278510 1269535 1260327 1251397 1243224
52222 1243224 1235866 1228922 1221893 1214683 1207732 1201673 1196952 1193779 1192138 1191670 1191862 1192539 1194019 1196615 1200261
52207 1200261 1204765 1210079 1216012 1222100 1228096 1234201 1240342 1245670 1249461 1252297 1255690 1260619 1266968 1274269
52193 1274269 1282298 1290904 1299935 1309516 1319954 1331080 1342012 1351678 1359394 1364960 1368506 1370246 1370123
52180 1370123 1367810 1363254 1356933 1349130 1339320 1327023 1313165 1299838 1288503 1279077 1270939 1264065 1258756
52167 1258756 1254797 1251547 1248749 1246846 1246527 1248168 1251656 1256558 1262421 1268918 1275711 1282333 1288315 1293252
52153 1293252 1296568 1297530 1295989 1293001 1290214 1288534 1287718 1287225 1287005 1287398 1288692 1290984 1294134 1297682 1301040
52138A301040K861K319J497M1j793l097l142j930n4J797L293M572N993P760R872
52123A331029J2346J5133J7844J9926K1230K2079K2820K3543K4236K4711K4452
52112A559349K3093K1093J9325J7926J6304J4341J2791J2170J2098J2190J2774
52101A733454J4164J5859J7144J7906J8248J7882J6564J4687J2712J0359P004
52090A895983K558k590q122j3576j7967k0404k0992k0556j9621j8171j6232j4083
52078A726227j1961j0006q446p428o810o321n781m946l501j512N36K411M420O662
52064A673544Q543R517R875J0304J1031J1841J2533J2876J2677J2336J2807J4289
52052A812173J5541J5150J3104J0455P974N780L804J688j265n193r061j1754j3414
$$ plain form
52138 1301040 1303901 1306220 1307717 1307758 1305965 1302868 1299726 1297796 1297742 1299539 1302832 1307404 1313397 1321157 1331029
52123 1331029 1343375 1358508 1376352 1396278 1417508 1439587 1462407 1485950 1510186 1534897 1559349
52112 1559349 1582442 1603535 1622860 1640786 1657090 1671431 1684222 1696392 1708490 1720680 1733454
52101 1733454 1747618 1763477 1780621 1798527 1816775 1834657 1851221 1865908 1878620 1888979 1895983
52090 1895983 1898541 1895951 1887829 1874253 1856286 1835882 1814890 1794334 1774713 1756542 1740310 1726227
52078 1726227 1714266 1704260 1695814 1688386 1681576 1675255 1669474 1664528 1661027 1659515 1660051 1662462 1666882 1673544
52064 1673544 1682087 1691604 1701479 1711783 1722814 1734655 1747188 1760064 1772741 1785077 1797884 1812173
52052 1812173 1827714 1842864 1855968 1866423 1874397 1880177 1883981 1885669 1884404 1879211 1870150 1858396 1844982
52039A844982j4797j5841j5953j5371j4983j4898j4402j3373j2608j2561j2785
52028A687410j2850j2850j2775j2346j1820j2010j3088j4021j3773j2489j1169
52017A548219j0618j0911j1411j1155r746p970o940o615n971m728l918m350n494
52004A448392o583q044j0869j4950j9011k2015k3883k4833k4784k3703k2042k0371
51992A227304j8730j6782j4575j2814j2167j2510j3198j3944j4941j6064j6585
51981A064994j6067j5100j4673j5107j6038j7140j8293j9227j9609j9406j8670
51970H75664j7116j4416j0889p297m012q08K492N667Q386J0492J1893J2535J2398
51957H84989J1274Q757M872M91l368o484r191j1513j3033j3420j2539j0301p081
$$ plain form
52039 1844982 1830185 1814344 1798391 1783020 1768037 1753139 1738737 1725364 1712756 1700195 1687410
52028 1687410 1674560 1661710 1648935 1636589 1624769 1612759 1599671 1585650 1571877 1559388 1548219
52017 1548219 1537601 1526690 1515279 1504124 1494378 1486408 1479468 1472853 1466882 1462154 1458236 1453886 1448392
52004 1448392 1441809 1433765 1422896 1407946 1388935 1366920 1343037 1318204 1293420 1269717 1247675 1227304
51992 1227304 1208574 1191792 1177217 1164403 1152236 1139726 1126528 1112584 1097643 1081579 1064994
51981 1064994 1048927 1033827 1019154 1004047 988009 970869 952576 933349 913740 894334 875664
51970 875664 858548 844132 833243 825946 821934 821126 823618 829285 837671 848163 860056 872591 884989
51957 884989 896263 905020 909892 910383 907015 900531 891340 879827 866794 853374 840835 830534 823453
51944H23453l949j666K83K845N830Q229R879J1546J3291J4076J3383J2066J0939
51931I20205R608P389M444J189k590p088j1481j4604j6359j7563j8611j9104j8788
51918H16647j8085j7470j6862j5865j4330j2446j0397q150n604k917m88J469L246
51905F98748N268P584R999J2485J5017J7141J8354J8875J9382J9847J9290J6975
51893H78965J3334R360N602K032j564n517j0132j5127j9487k2241k3205k2733
51881G89287k1058j8239j4507j0316o100k130J565N169Q740J1834J3880J4862
51869G72987J5051J4055J0850N265j192o502r825j1678j2861j3732j4197j3879
51857G34342j2445j0108p527n003k232P87L110L867L427K777K076O72j523l669
$$ plain form
51944 823453 819504 817838 818121 820966 826796 835025 844904 856450 869741 883817 897200 909266 920205
51931 920205 929813 937202 941646 942835 940245 933157 921676 907072 890713 873150 854539 835435 816647
51918 816647 798562 781092 764230 748365 734035 721589 711192 703042 697438 694521 694033 695502 698748
51905 698748 704016 711600 721599 734084 749101 766242 784596 803471 822853 842700 861990 878965
51893 878965 892299 901659 907261 909293 907729 902212 892080 876953 857466 835225 812020 789287
51881 789287 768229 749990 735483 725167 719067 716937 718502 723671 732411 744245 758125 772987
51869 772987 788038 802093 812943 818208 817016 810514 800689 789011 776150 762418 748221 734342
51857 734342 721897 711789 704262 699259 697027 697814 700924 704791 708218 710995 713071 713743 712220 708551
51843G08551n179o396p685q619q588p783o914o284n656m924m238l449k011K83
51829F31108K807M685N628N837N347L922J663p73k765m265n475o326o522n930
51815F28941m622k723n48J322K481L098L507L568K897J647M52m22j357k591l701
51800F31949m159m035l828l746l486k621j082O56J809J883J085Rj004j919k520
51785F08991k297j067O03J747J694L96j579l295m020l735k947j988q52L21J149
51770E93121J645K549M578P532J0502J2792J4281J4999J4772J3445J1189Q391
51758G09796N287J870j881n742r249j1875j3205j3157j2241j1381j1064j0761
51746F16397r649p802o074m726l031o03J768L234M208N670P726R752J1507J3100
$$ plain form
51843 708551 703372 696976 689291 680672 672084 664301 657387 651103 645447 640523 636285 632836 630825 631108
51829 631108 633915 638600 644228 650065 655412 659334 660997 660224 657459 653194 647719 641393 634871 628941
51815 628941 624319 621596 621048 622370 624851 627949 631456 635024 637921 639568 640020 639598 638241 635650 631949
51800 631949 627790 623755 619927 616181 612695 610074 608992 609648 611457 613340 614425 614434 613430 611511 608991
51785 608991 606694 605627 606230 607977 609671 610067 608488 605193 601173 597438 594491 592503 591651 591972 593121
51770 593121 594766 597315 601893 609425 619927 632719 647000 661999 676771 690216 701405 709796
51758 709796 715083 716953 715072 709330 700081 688206 675001 661844 649603 638222 627158 616397
51746 616397 606748 598946 592872 588146 585115 584512 586280 589514 593722 599392 607118 616870 628377 641477
51732F41477J4167J4219J3603J2957J1804Q948M520L09k293l556m144l782k103
51719G06126M3J107K45k302n679q544r470q117n756l953l004k273j674j840k910
51704F51999l991m052k890r22J575M621P864J0119R988P231L326J77j600k704
51690F80741l555l478j704J300L926M514K396j682n878q519r273q913q033o592
51676F35250m656k749j196J55J290J790J531R92N94L86O04J696L546N508P547
51661F52288J0276J3340J4943J3767J0423O208J492l559p714r599r320p821n164
51648F79560q55M423Q929J1670J2718J1764P901J294o102j2109j5836j7480j7483
51635F68394j6409j4830j2912j0545q113o392n494m571k953q91J137L126N046
$$ plain form
51732 641477 655644 669863 683466 696423 708227 717175 721695 722004 719711 716155 712011 708229 706126
51719 706126 706169 707276 707521 705219 699540 690996 681526 673409 667653 663700 660696 658423 656749 654909 651999
51704 651999 648008 643956 641066 640144 641719 646340 654204 664323 674311 681542 684868 685045 683445 680741
51690 680741 677186 673708 672004 673304 677230 681744 684140 682458 676580 668061 658788 649875 641842 635250
51676 635250 630594 627845 626649 626804 628094 629884 631415 632407 633001 633387 633991 635687 639233 644741 652288
51661 652288 662564 675904 690847 704614 715037 721245 722737 719178 711464 701865 692545 684724 679560
51648 679560 678705 683128 692057 703727 716445 728209 736110 737404 731302 719193 703357 685877 668394
51635 668394 651985 637155 624243 613698 605585 599193 593699 589128 586175 585284 586421 589547 594593
51622E94593O198N823M092J949J30j322k695m065n161n597n295m686m298m159
51608E75507l810k960j859r51m11j29Q7M09R63J773K759L804M861O089P873J0391
51592F04396J3152J5309J6621J7525J7928J6524J2114N417j148n446p048o774
51580F98570n609m080k211K01L045N776Q140J0802J4624J9391K3787K6665K7973
51567H27074K8513K9424L1798L5924M0618M3867M4550M3358M1997M1908M3829
51556A252860M7777N2953N7836O0743O0246N5103M4415K8401Q901j1294k9846
51545A628095m5621n8360o7869p3792p6125p5578p3090o9033o3426n6865n0519
51534I17817m4818l8966l2312k5643k0259j6329j3243j1027j0172j0095r315p477
$$ plain form
51622 594593 600791 606614 610706 612655 612785 611463 608768 604703 599542 593945 588650 583964 579666 575507
51608 575507 571697 568737 566878 565927 565516 565387 565474 565883 566846 568619 571378 575182 580043 586132 594005 604396
51592 604396 617548 632857 649478 667003 684931 701455 713569 718986 717838 712392 705344 698570
51580 698570 692961 688881 686670 686871 689916 695692 703832 714634 729258 748649 772436 799101 827074
51567 827074 855587 885011 916809 952733 993351 1037218 1081768 1125126 1167123 1209031 1252860
51556 1252860 1300637 1353590 1411426 1472169 1532415 1587518 1631933 1660334 1669235 1657941 1628095
51545 1628095 1582474 1524114 1456245 1382453 1306328 1230750 1157660 1088627 1025201 968336 917817
51534 917817 872999 834033 801721 776078 755819 739490 726247 715220 705048 694953 685638 678161
51522F78161n943n741o109n854n182n061n441n247m019k528j709j700k041k334
51508F19252k536k879l630m698n612o035n982n352l661q44K015L569L784L910
51494E91301M764N730N837N182M666M732M928M642L682K229O60n11j025j331k253
51479F33233l956n640o513o693o792o936o765o146n429m994n027n617o528o956
51465E49241o198m677l628l574l714l172k203j623j529j278n18L59Q29R19J182
51450E20416K100L518M719N253N561O412P810R060R964J1216J3486J6720K0484
51437F36719K4058K5887K4095J8448J1157M948Q89j277j761q87J2p07l399p168
51423G31014j1150j4747j6950j6828j4814j2435j0611r090p536o102m838l452
$$ plain form
51522 678161 672218 666477 660368 654514 649332 644271 638830 633583 629564 627036 625327 623627 621586 619252
51508 619252 616716 613837 610207 605509 599897 593862 587880 582528 578867 578023 580038 583607 587391 591301
51494 591301 596065 601795 607632 612814 617480 622212 627140 631782 635464 637693 638353 637842 636817 635486 633233
51479 633233 629277 623637 617124 610431 603639 596703 589938 583792 578363 573369 568342 562725 556197 549241
51465 549241 543043 538366 534738 531164 527450 524278 522075 520452 518923 517645 517127 517486 518315 519234 520416
51450 520416 522516 526034 530753 536006 541567 547979 555789 564849 574813 586029 599515 616235 636719
51437 636719 660777 686664 710759 729207 740364 745312 746201 744924 743163 742276 742288 741581 738182 731014
51423 731014 719864 705117 688167 671339 656525 644090 633479 624389 616853 610751 605913 602461
51411F02461j933o11M95J618K514K705K457K544L032L258L085L113L544L987M541
51396F36810N811P579Q764R158R892J1576J3296J4287J5332J7432K0110K2274
51384G92321K4062K6650L0806L6571M3913N2560O1519O9594P6263Q1495Q5275
51373A381029Q7872Q9737R0015Q5790P4170N5109L1463O502j7639l9529n8001
51362A786518p2575q3485r0910r4752r5212r3003q8777q2785p5188o6388n7077
51351H86366m8237m0754l4704k9314k4133j9716j6631j4332j1955r683q273p554
51339F21080o676n690n473o002o086n226m403m363m314l233j525l55l1j9r5m16
51323E67173p85q51r82j953l715n182n429m542l215k086j526j519j509q07O11
$$ plain form
51411 602461 600528 599917 600412 602030 604544 607249 609706 612250 615282 618540 621625 624738 628282 632269 636810
51396 636810 642621 650200 658964 668122 678014 689590 702886 717173 732505 749937 770047 792321
51384 792321 816383 843033 873839 910410 954323 1006883 1068402 1137996 1214259 1295754 1381029
51373 1381029 1468901 1558638 1648653 1734443 1808613 1863722 1895185 1901687 1884048 1844519 1786518
51362 1786518 1713943 1630458 1539548 1444796 1349584 1256581 1167804 1085019 1009831 943443 886366
51351 886366 838129 797375 762671 733357 709224 689508 672877 658545 646590 636907 628634 621080
51339 621080 614404 608714 603241 597239 591153 585927 581524 577161 572847 569614 568089 567734 567703 567684 567589 567173
51323 567173 566388 565537 564555 562602 558887 553705 548276 543734 540519 538433 536907 535388 533879 533072 533683
51308E33683K056K967L430L714L739L298K505J719J181R00O55M7j124k387k850
51293E53533k240j276p11m10J67R66J534J887K430L082L255K825K350K145J948
51278E71485J755K142L214L995L551K253J118L30p30k239l527l971l514k363p90
51263E72709P38J815K609L517M249L913K203m7j830k898l480l594l165k555k455
51248E71729l116l978m126l210j918j312j583j801j154o1M81K60j37m77j009j479
51232E47109j022M60J750J779J054Q83J601K311K178J296K48n81j117j347j271
51217E55331j001p88q27j018j042q01n92o29o23k22L92Q17J189J903K678K745
51201E57512K141J962K931M370N127M941M393L933L594L301K956K328J352M02
$$ plain form
51308 533683 535739 538706 542136 545850 549589 552887 555392 557111 558292 559192 559847 559894 558770 556383 553533
51293 553533 551293 550017 549306 548896 549063 550029 551563 553450 555880 558962 562217 565042 567392 569537 571485
51278 571485 573240 575382 578596 582591 586142 588395 589513 589843 589113 586874 583347 579376 575862 573499 572709
51263 572709 573447 575262 577871 581388 585637 589550 591753 591706 589876 586978 583498 579904 576739 574184 571729
51248 571729 568613 564635 560509 557299 555381 554069 552486 550685 549531 549470 549951 550211 550074 549597 548588 547109
51232 547109 546087 546547 548297 550076 551130 552013 553614 555925 558103 559399 559647 559066 557949 556602 555331
51217 555331 554330 553542 552715 551697 550655 549854 549262 548633 548010 547788 548180 548997 550186 552089 554767 557512
51201 557512 559653 561615 564546 568916 574043 578984 583377 587310 590904 594205 597161 599489 600841 601243
51187F01243l3J30N59Q48P46K91j65l53o26j621l210m309m088k978k116k147k862
51170E79309l609l684k706j053K95O48J82n10r96r24M9J797L570M657M983M780
51154E86788M129L177K339J841J441R37M96J75m08j368k107k130j798j749j985
51139E89778k181k397k708k571j463J04J075J240J337J757K047J779J211Q24P64
51124E90596R45J299J743K092K159J822J111M45M14J003J369P96k94q15k97P73
51108F05161J669J987J730J349J536K462L350L371K736K377K689L212L461L424
51094F40514L170K684K138J836J697J235J32j342k528k761j889o36j39o58j136
51079F42317o05M54Q53M35P3J34M7n24j083j132p33nJ153K528L531M083M847O218
$$ plain form
51187 601243 601210 601340 601899 602747 603493 603784 603619 603266 602640 601019 597809 593500 589412 586434 584318 582171 579309
51170 579309 575700 572016 569310 568257 568552 569200 569382 568872 567876 566952 567001 568798 572368 577025 582008 586788
51154 586788 590917 594094 596433 598274 599715 600652 601148 601323 600915 599547 597440 595310 593512 591763 589778
51139 589778 587597 585200 582492 579921 578458 578562 579637 580877 582214 583971 586018 587797 589008 589832 590596
51124 590596 591541 592840 594583 596675 598834 600656 601767 602212 602626 603629 604998 605794 605500 604685 604388 605161
51108 605161 606830 608817 610547 611896 613432 615894 619244 622615 625351 627728 630417 633629 637090 640514
51094 640514 643684 646368 648506 650342 652039 653274 653406 652064 649536 646775 644886 644250 644111 643453 642317
51079 642317 641712 642166 643019 643454 643527 643661 643708 643184 642101 640969 640236 640231 641384 643912 647443 651526 656373 662591
51061F62591P736Q973J0369J2640J5773J9136K2026K3597K2745J9000J3500Q518
51049H46604N956O474R745J4766J9848K3049K3314K1214J8344J5835J3427R914
51037A028490M467k391q959j3412j4847j3753j1645j0225j0630j3176j7450k2284
51025H94185k5885k6696k4459k0340j5808j1645p989m836k156J60K099L590M821
51012G65041O173P603Q587Q956R262R916J0561J0739J0677J0875J1435J2391J4022
50999H96238J6145J7721J8079J7964J8360J8822J8146J6360J4672J3560J2315
50988A078382J0538Q737P166N402L494K344K335K724K963L646N344P468R219J0871
50974A160633J3059J5300J6333J5816J4828J4721J6037J8517K1615K4974K8702
$$ plain form
51061 662591 670327 679300 689669 702309 718082 737218 759244 782841 805586 824586 838086 846604
51049 846604 852560 859034 868779 883545 903393 926442 949756 970970 989314 1005149 1018576 1028490
51037 1028490 1032957 1030566 1021607 1008195 993348 979595 967950 957725 947095 933919 916469 894185
51025 894185 868300 841604 817145 796805 780997 769352 761363 756527 754371 754531 756630 760220 765041
51012 765041 771214 778817 787404 796360 805622 815538 826099 836838 847515 858390 869825 882216 896238
50999 896238 912383 930104 948183 966147 984507 1003329 1021475 1037835 1052507 1066067 1078382
50988 1078382 1088920 1097657 1104823 1110225 1113719 1116063 1118398 1121122 1124085 1127731 1133075 1140543 1149762 1160633
50974 1160633 1173692 1188992 1205325 1221141 1235969 1250690 1266727 1285244 1306859 1331833 1360535
50963A360535L3149L8162M2954M6992N0720N4836N9081O2318O3747O3532O2151
50952A938177N9646N5819N0894M5546M0231L4763K8811K2677J7247J3096J0029
50941B316936P768O638P100Q717J0014R369N849l28p644j3855j7565j9289k0592
50928B293118k2296k4170k6091k8524l1708l5238l8785m2542m6629n0650n4159
50917A892326n6925n8506n8270n6266n3506n0860m8113m4609m0356l5965l1837
50906A357113k7988k4493k1554j9179j7126j5267j3782j2883j2378j1606j0013
50895A170844p888o149n185m340l048j878j617j690p27J349L022L288K898K992
50881A151871L562L988M259M800N687O750Q028R430J0405J0579J0381J0452J0826
$$ plain form
50963 1360535 1393684 1431846 1474800 1521792 1572512 1627348 1686429 1748747 1812494 1876026 1938177
50952 1938177 1997823 2053642 2104536 2150082 2190313 2225076 2253887 2276564 2293811 2306907 2316936
50941 2316936 2324704 2331342 2338442 2347159 2357173 2366542 2372391 2372063 2364419 2350564 2332999 2313710 2293118
50928 2293118 2270822 2246652 2220561 2192037 2160329 2125091 2086306 2043764 1997135 1946485 1892326
50917 1892326 1835401 1776895 1718625 1662359 1608853 1557993 1509880 1465271 1424915 1388950 1357113
50906 1357113 1329125 1304632 1283078 1263899 1246773 1231506 1217724 1204841 1192463 1180857 1170844
50895 1170844 1162956 1156807 1151622 1147282 1144234 1142356 1140739 1139049 1138322 1139671 1142693 1145981 1148879 1151871
50881 1151871 1155433 1159421 1163680 1168480 1174167 1180917 1188945 1198375 1208780 1219359 1229740 1240192 1251018
50868A251018J1283J2055J3446J5020J5995J6365J7004J8600K1021K3769K6607
50857A442183K9672L3206L7289M1718M6277N1178N7090O4479P3125Q2298R1261
50846B049776R9607J07444J15272J23249J30560J36039J39517J41885J43651J44038
50836C331038J41835J36434J27679J15390R9731Q1608O2221M2486K3282N752r188
50825D158268k1312l0701l7149m0323m0064l6330k9400k0525j1752m499J073M794
50813C892080N299J005q178k0850l5503n1104o6694q1472r5255j08118j19524
50802C311686j28445j34280j37092j36910j33468j26765j17489j06730r5554q4697
50792B110256p4363o4321n4451m5000l6129k7634j9510j2328o582k029J740M411
$$ plain form
50868 1251018 1262301 1274356 1287802 1302822 1318817 1335182 1352186 1370786 1391807 1415576 1442183
50857 1442183 1471855 1505061 1542350 1584068 1630345 1681523 1738613 1803092 1876217 1958515 2049776
50846 2049776 2149383 2256827 2372099 2495348 2625908 2761947 2901464 3043349 3187000 3331038
50836 3331038 3472873 3609307 3736986 3852376 3952107 4033715 4095936 4138422 4161704 4167456 4158268
50825 4158268 4136956 4106255 4069106 4028783 3988719 3952389 3922989 3902464 3890712 3886213 3887286 3892080
50813 3892080 3897379 3898384 3890206 3869356 3833853 3782749 3716055 3634583 3539328 3431210 3311686
50802 3311686 3183241 3048961 2911869 2774959 2641491 2514726 2397237 2290507 2194953 2110256
50792 2110256 2035893 1971572 1917121 1872121 1835992 1808358 1788848 1776520 1769938 1767909 1769649 1774060
50780A774060N441N133M482L948L060J333j098l797o434q702j0278j1149j1726
50767A744273j2507j3781j5592j7788k0088k2296k4323k5914k6630k6331k5418
50756A513605k4236k2583k0130j7159j4381j2150j0209q151n819l318q04J780
50744A376445M752Q245J1723J4510J6871J9866K3909K8214L2159L6372M1687M7717
50732A662470N3327N8178O2893O7936P3083P7764Q1269Q2826Q2243Q0302P7894
50721B460185P4994P1132O6463O1480N5858M8530L8920K7348J4310K50j3880k6627
50709B878963l6807m3824m7283m6985m3389l7473l0126k2088j4255p280j049M700
50697B553104R308J1460J0497O627rr441k0954l3030m4512n4968o3785o9919p2968
$$ plain form
50780 1774060 1779501 1784634 1789116 1793064 1796124 1797457 1796359 1792562 1786128 1777426 1767148 1755999 1744273
50767 1744273 1731766 1717985 1702393 1684605 1664517 1642221 1617898 1591984 1565354 1539023 1513605
50756 1513605 1489369 1466786 1446656 1429497 1415116 1402966 1392757 1384606 1378787 1375469 1374665 1376445
50744 1376445 1381197 1389442 1401165 1415675 1432546 1452412 1476321 1504535 1536694 1573066 1614753 1662470
50732 1662470 1715797 1773975 1836868 1904804 1977887 2055651 2136920 2219746 2301989 2382291 2460185
50721 2460185 2535179 2606311 2672774 2734254 2790112 2838642 2877562 2904910 2919220 2919470 2905590 2878963
50709 2878963 2842156 2798332 2751049 2704064 2660675 2623202 2593076 2570988 2556733 2549453 2548404 2553104
50697 2553104 2562412 2573872 2584369 2590996 2590987 2581546 2560592 2527562 2483050 2428082 2364297 2294378 2221410
50684B221410p3635p2582o9588o4351n7433m9744m1673l3272k4858j6734q729
50673A708811o04P314J4451K0754K6670L2389L7526M1407M3434M3285M1103L7493
50661B054033L3070K8157K3022J8254J4577J2298J1164J0715J0619J0600J0240
50650B236749R185P600O273N931O522P427Q368R741J1944J4821J8105K1946K6521
50637B391133L1395L5753L9190M1954M4381M6445M7754M7923M7085M6055M5589
50626B864657M5515M5277M5294M6409M7025M2003K6431Q13k8374n3373o9739p6905
50614B935033p6280o9946o0263m9354l8447k7948j8129r634l369Q2Q97k89l181
50601B579172p973j4756k3189l2927m3636n4190o2730o8214p1331p3122p3363
$$ plain form
50684 2221410 2147775 2075193 2005605 1941254 1883821 1834077 1792404 1759132 1734274 1717540 1708811
50673 1708811 1708207 1715521 1729972 1750726 1777396 1809785 1847311 1888718 1932152 1975437 2016540 2054033
50661 2054033 2087103 2115260 2138282 2156536 2171113 2183411 2194575 2205290 2215909 2226509 2236749
50650 2236749 2245934 2253534 2259807 2265738 2272260 2279687 2288055 2297796 2309740 2324561 2342666 2364612 2391133
50637 2391133 2422528 2458281 2497471 2539425 2583806 2630251 2678005 2725928 2773013 2819068 2864657
50626 2864657 2910172 2955449 3000743 3047152 3094177 3136180 3162611 3163424 3135050 3081677 3011938 2935033
50614 2935033 2858753 2788807 2728544 2679190 2640743 2612795 2594666 2585032 2581663 2581745 2582642 2582353 2579172
50601 2579172 2571199 2556443 2533254 2500327 2456691 2402501 2339771 2271557 2200226 2127104 2053741
50590B053741p1326o7480o3166n8825n3770m7702m1355l5544l0447k5900k1605
50579A536621j7097j2272p889m769k750j196j63M1N7R03K367L303L454L667M263
50564A508540M700M948N762P294Q900J0613J3295J6935K0320K2985K5976K9922
50552A680190L3862L6826L9196M1472M2940M2717M1125L8887L5931L2025K7861
50541B093032K4481K2355K1709K2871K5493K8430L1361L5482M1509M8125N3552
50530B448400N7867O2360O7489P2878P8714Q5538R2993J00108J06514J12252J16663
50519C401776J18772J18475J16178J11567J03982R3798Q2041O8769N3041L4620
50509D303019J4555o003k6447m6124o4117p9936r3502j04323j11454j14349j13085
$$ plain form
50590 2053741 1982415 1914935 1851769 1792944 1739174 1691472 1650117 1614573 1584126 1558226 1536621
50579 1536621 1519524 1507252 1499363 1494594 1491844 1490648 1490485 1490526 1490583 1491486 1493853 1497156 1500610 1504277 1508540
50564 1508540 1513240 1518188 1523950 1531244 1540144 1550757 1564052 1580987 1601307 1624292 1650268 1680190
50552 1680190 1714052 1750878 1790074 1831546 1874486 1917203 1958328 1997215 2033146 2065171 2093032
50541 2093032 2117513 2139868 2161577 2184448 2209941 2238371 2269732 2305214 2346723 2394848 2448400
50530 2448400 2506267 2568627 2636116 2708994 2787708 2873246 2966239 3066347 3172861 3285113 3401776
50519 3401776 3520548 3639023 3755201 3866768 3970750 4064548 4146589 4215358 4268399 4303019
50509 4303019 4317574 4311571 4285124 4239000 4174883 4094947 4001445 3897122 3785668 3671319 3558234
50498C558234j07716r8287q5459p0283n3307l4731j5420L061J9548L3485M4013
50487C193138M9779M9905M4308L2953J5750o293l0636n4495p6172r4808j09601
50476C013828j19832j25433j27107j25884j22591j17514j10573j02058r3034q4559
50466A885243p6700o8817o0756n3090m6286m0261l4912l0365k6497k2717j8552
50455A406290j4096r815o156l358j261O49K718M731O427Q082J0009J1842J3065
50442A429127J4069J5780J8202K0211K0842J9995J7702J3831Q937M532J802N44
50430A585574r9l93k0J149K872M921P110R122J0727J2102J3665J5636J7928K0309
50416A700603K2692K5387K9061L4060L9722M4813M8780N2135N5388N8164N9770
$$ plain form
50498 3558234 3450518 3352231 3266772 3196489 3143182 3108451 3093031 3096092 3115640 3149125 3193138
50487 3193138 3242917 3292822 3337130 3370083 3385833 3379540 3348904 3294409 3218237 3123429 3013828
50476 3013828 2893996 2768563 2641456 2515572 2392981 2275467 2164894 2062836 1969802 1885243
50466 1885243 1808543 1739726 1678970 1625880 1579594 1539333 1504421 1474056 1447559 1424842 1406290
50455 1406290 1392194 1382379 1376223 1372865 1371604 1372253 1374971 1379702 1386129 1394211 1404220 1416062 1429127
50442 1429127 1443196 1458976 1477178 1497389 1518231 1538226 1555928 1569759 1578696 1583228 1585030 1585574
50430 1585574 1585475 1585082 1585062 1586211 1589083 1594004 1601114 1610236 1620963 1633065 1646730 1662366 1680294 1700603
50416 1700603 1723295 1748682 1777743 1811803 1851525 1896338 1945118 1997253 2052641 2110805 2170575
50405B170575O0222O0151N9809N8661N6005N1746M6476M0894L5197K8941K1528
50394B690205J2837L312o578j6771k7505l8862n0326o0743o8766p3670p5682p5409
50382B212042p3041o8400o1527n2867m2838l1755k0273r458j22P681J4194J9173
50370A892809K1845K1593J8468J2914N237m411j5438k6564l6427m4342n0208n3826
50358A741650n4960n4043n2139m9891m7061m3537m0181l8089l7342l7064l6377
50347A250966l4822l2217k8855k5547k2819k0166j6822j3072j0052q282p141n836
50335A025335m208k426n95J182K780M322O070P990R892J1874J4175J6641J8914
50322A111946K1087K3508K5958K7678K8170K7131K3714J6982P543k143r688j4426
$$ plain form
50405 2170575 2230797 2290948 2350757 2409418 2465423 2517169 2563645 2604539 2639736 2668677 2690205
50394 2690205 2703042 2706354 2699776 2683005 2655500 2616638 2566312 2505569 2436803 2363133 2287451 2212042
50382 2212042 2139001 2070601 2009074 1956207 1913369 1881614 1861341 1851883 1851761 1859442 1873636 1892809
50370 1892809 1914654 1936247 1954715 1967629 1972866 1968455 1953017 1926453 1890026 1845684 1795476 1741650
50358 1741650 1686690 1632647 1580508 1530617 1483556 1440019 1399838 1361749 1324407 1287343 1250966
50347 1250966 1216144 1183927 1155072 1129525 1106706 1086540 1069718 1056646 1046594 1038312 1031171 1025335
50335 1025335 1021127 1018701 1018106 1019288 1022068 1026390 1032460 1040450 1050342 1062216 1076391 1093032 1111946
50322 1111946 1133033 1156541 1182499 1210177 1238347 1265478 1289192 1306174 1313717 1311574 1301886 1287460
50310A287460j6820j7111j5320j2061q440n266k735p56Q39K195L225L628L377
50297A222215K938K830L235M127N409O713P540P887Q272Q869R188Q995Q930R372
50283A316520R071N865r62r517j6697k0479k0880j9201j6635j3636j0244o727
50271A196478l575r29J627M469P302R383J0314J0434J0489J0852J1139J0621R150
50258A287754P446O294N676N060M316L728L192K109L17j493k634l263l891m484
50244A310127m511l708k395j043K70K006M753Q556J2728J6597K0313K4505K9151
50231A417349L3414L6635L8914M0498M1227M0948L9886L8156L5455L1804K8206
50220A822492K5864K4975K4643K3805K1754J8065J2535N193l879j4593k6309l7522
$$ plain form
50310 1287460 1270640 1253529 1238209 1226148 1217708 1212442 1209707 1208951 1209790 1211985 1215210 1218838 1222215
50297 1222215 1225153 1227983 1231218 1235345 1240754 1247467 1255007 1262894 1271166 1280035 1289223 1298218 1307148 1316520
50283 1316520 1325591 1331456 1330494 1320977 1304280 1283801 1262921 1243720 1227085 1213449 1203205 1196478
50271 1196478 1192903 1191974 1193601 1198070 1205372 1214755 1225069 1235503 1245992 1256844 1267983 1278604 1287754
50258 1287754 1295200 1301494 1307170 1312230 1316546 1320274 1323466 1325575 1325892 1324399 1321765 1318502 1314611 1310127
50244 1310127 1305616 1301908 1299513 1298470 1298740 1300746 1305499 1314055 1326783 1343380 1363693 1388198 1417349
50231 1417349 1450763 1487398 1526312 1566810 1608037 1648985 1688871 1727027 1762482 1794286 1822492
50220 1822492 1848356 1873331 1897974 1921779 1943533 1961598 1974133 1979326 1975447 1960854 1934545 1897023
50208A897023m6555n2566n5617n6046n4147n0254m4732l7931l0428k3197j7238
50197A428312j3296j2131j4479k0051k6901l2589l5955l7304l7032l5008l1411
50186A132155k7277k3696k0850j8249j5557j2872j0421q367o784n690n111n071
50174I72210n348n284m285k541q98J16P24J256J562J380R58Q41J214J822K360
50159I66087K706K872L077L668M661N554N900N972O476P729R479J1307J2714J2960
50145A061162J1601R224O953N096L062P47r86j804k758m629o197n487k381J412
50131A075015M805Q242J1953J4919J6359J6971J7739J8482J8736J9240K1279K4931
50119A268671K9171L3488L8325M3946M9945N5955O1902O7386P1634P4326P5835
$$ plain form
50208 1897023 1850468 1797902 1742285 1686239 1632092 1581838 1537106 1499175 1468747 1445550 1428312
50197 1428312 1415016 1402885 1388406 1368355 1341454 1308865 1272910 1235606 1198574 1163566 1132155
50186 1132155 1104878 1081182 1060332 1042083 1026526 1013654 1003233 994866 988082 982392 977281 972210
50174 972210 966862 961578 957293 954752 953854 953970 954694 955950 957512 958892 959850 960691 961905 963727 966087
50159 966087 968793 971665 974742 978410 983071 988625 994525 1000497 1006973 1014702 1024181 1035488 1048202 1061162
50145 1061162 1072763 1081987 1088940 1094036 1097098 1097845 1096859 1095055 1092297 1087668 1081471 1075984 1073603 1075015
50131 1075015 1079820 1088062 1100015 1114934 1131293 1148264 1166003 1184485 1203221 1222461 1243740 1268671
50119 1268671 1297842 1331330 1369655 1413601 1463546 1519501 1581403 1648789 1720423 1794749 1870584
50108A870584P6411P5823P3994P1514O9235O7807O7590O8338O8722O6768O1073
50097B637859N1262L7306J9234k107k4601m5759o3846p8062q8122r4161r6745
50086B252258r6527r3995q9573q3732p6865o9345o1748n4601m7830m1013l4358
50075A502671k8907k5463k3740k2741k1632j9959j7595j4815j2118r676p288n006
50063A293731l402k882l206l931m876n903o652p024p456q344r454j0283j0644
50050A209674j0586j0102r294q415p455n994m022k348j601j176J55K704N600P908
50036A165048R451J0507J1317J2103J3092J4328J5610J6658J7227J7157J6575
50025A319073J5908J5458J4942J3773J1709R119O643M801L819L632L956M383M257
$$ plain form
50108 1870584 1946995 2022818 2096812 2168326 2237561 2305368 2372958 2441296 2510018 2576786 2637859
50097 2637859 2689121 2726427 2745661 2743554 2718953 2673194 2609348 2531286 2443164 2349003 2252258
50086 2252258 2155731 2061736 1972163 1888431 1811566 1742221 1680473 1625872 1578042 1537029 1502671
50075 1502671 1473764 1448301 1424561 1401820 1380188 1360229 1342634 1327819 1315701 1306025 1298737 1293731
50063 1293731 1290329 1287447 1284241 1280310 1275434 1269531 1262879 1255855 1248399 1240055 1230601 1220318 1209674
50050 1209674 1199088 1188986 1179692 1171277 1163822 1157828 1153806 1151458 1149857 1148681 1148836 1151540 1157140 1165048
50036 1165048 1174499 1185006 1196323 1208426 1221518 1235846 1251456 1268114 1285341 1302498 1319073
50025 1319073 1334981 1350439 1365381 1379154 1390863 1399982 1406625 1411426 1415245 1418877 1422833 1427216 1431473
50012A431473K617j262o888j2441j5953j6599j4828j1664q172n182k849n21K739
49999A340470P407J3434K0604K8593L6801M4438N0766N5161N7137N6598N4075
49988A765484N0422M6329M2092L7645L2739K7368K2156J7990J5095J2730R865
49977B079915N787j38q682k0119l3539m7140n9091o7969p2928p3967p1990o8191
$$ plain form
50012 1431473 1434090 1432828 1425940 1413499 1397546 1380947 1366119 1354455 1346283 1341101 1338252 1337731 1340470
49999 1340470 1347877 1361311 1381915 1410508 1447309 1491747 1542513 1597674 1654811 1711409 1765484
49988 1765484 1815906 1862235 1904327 1941972 1974711 2002079 2024235 2042225 2057320 2070050 2079915
49977 2079915 2085702 2085564 2076882 2056763 2023224 1976084 1916993 1849024 1776096 1702129 1630139 1561948
$$ [...]
##END NTUPLES=NMR SPECTRUM
##END=
