##TITLE=AC1701_ROEFFECT0027_8638393_UgW6nmZcNz
##JCAMPDX= 6.0         $$ Bruker NMR JCAMP-DX V2.0
##DATA TYPE= NMR SPECTRUM
##DATA CLASS= NTUPLES
##ORIGIN= BRUKER
##OWNER= Administrator
$$ 1.72 TOPSPIN		Version 2.1
$$ 2014-05-22 21:10:19.342 -0700  Administrator@X
$$ Compression mode = diff/dup
##.OBSERVE FREQUENCY= 400.02188249412
##.OBSERVE NUCLEUS= ^1H
##.ACQUISITION MODE= SIMULTANEOUS (DQD)
##.ACQUISITION SCHEME= undefined
##.AVERAGES= 8
##.DIGITISER RES= 22
##SPECTROMETER/DATA SYSTEM= spect
##.PULSE SEQUENCE= zg30
##.SOLVENT NAME= COFFEE_meoh
##.SHIFT REFERENCE= INTERNAL, COFFEE_meoh, 1, 14.98509
##AUDIT TRAIL= $$ (NUMBER, WHEN, WHO, WHERE, PROCESS, VERSION, WHAT)
$$ ##TITLE= Audit trail, TOPSPIN		Version 2.1
$$ ##JCAMPDX= 5.01
$$ ##ORIGIN= Bruker BioSpin GmbH
$$ ##OWNER= Administrator
$$ $$ E:\/data/COFFEE/nmr/AC1701_ROEFFECT0027_8638393_UgW6nmZcNz/10/pdata/1/auditp.txt
$$ ##AUDIT TRAIL=  $$ (NUMBER, WHEN, WHO, WHERE, PROCESS, VERSION, WHAT)
(   1,<2014-05-22 21:10:12.780 -0700>,<Administrator>,<X>,<go>,<TOPSPIN 2.1>,
      <created by zg
	started at 2014-05-22 21:09:03.405 -0700,
	POWCHK enabled, PULCHK disabled,
       configuration hash MD5:
       C8 4E 4E 5D D3 5C D8 9E 9F 52 82 E0 59 8A DE 15
       data hash MD5: 64K
       FB 1F 11 2D C2 33 70 0D 7F F0 78 D0 48 DC C6 8F>)
(   2,<2014-05-22 21:10:15.608 -0700>,<Administrator>,<X>,<proc1d>,<TOPSPIN 2.1>,
      <Start of raw data processing
       efp LB = 0 FT_mod = 6 PKNL = 1 PHC0 = 0 PHC1 = 0 SI = 32K 
       data hash MD5: 32K
       93 3F C7 49 DA 03 29 A4 9A DE 3D CE 3C 3D A4 3B>)
(   3,<2014-05-22 21:10:15.921 -0700>,<Administrator>,<X>,<proc1d>,<TOPSPIN 2.1>,
      <pk PHC0 = 92.58179 PHC1 = 0 
       data hash MD5: 32K
       97 90 5F 8E AE 78 7B 24 AC AB 8E 64 8C A7 2B 54>)
(   4,<2014-05-22 21:10:16.030 -0700>,<Administrator>,<X>,<proc1d>,<TOPSPIN 2.1>,
      <abs ABSG = 1 
       data hash MD5: 32K
       57 18 63 BE DE C4 7F 6F 5A CA B9 0F B3 D0 66 79>)
(   5,<2014-05-22 21:10:16.092 -0700>,<Administrator>,<X>,<proc1d>,<TOPSPIN 2.1>,
      <abs ABSG = 2 
       data hash MD5: 32K
       58 51 59 C2 87 5E 63 19 58 E1 CC 99 CB A5 AA F1>)
(   6,<2014-05-22 21:10:16.155 -0700>,<Administrator>,<X>,<proc1d>,<TOPSPIN 2.1>,
      <abs ABSG = 3 
       data hash MD5: 32K
       79 18 1C ED A6 90 E5 FB 8C DD 97 B5 36 2D 75 13>)
(   7,<2014-05-22 21:10:16.217 -0700>,<Administrator>,<X>,<proc1d>,<TOPSPIN 2.1>,
      <abs ABSG = 4 
       data hash MD5: 32K
       02 19 E0 B3 FB 9D A3 05 36 09 DC 62 FF 5F 7E B8>)
(   8,<2014-05-22 21:10:16.280 -0700>,<Administrator>,<X>,<proc1d>,<TOPSPIN 2.1>,
      <abs ABSG = 5 
       data hash MD5: 32K
       BD AE 6F 6E 47 F3 02 5A 42 99 03 FA EC 14 99 9E>)
$$ ##END=
$$ 
$$ $$ hash MD5
$$ $$ 89 48 17 E4 3B 9F EB E6 CD D3 0E 67 AD 96 38 44
##$RELAX= 
##$RELAX= 
##$RELAX= 
##$RELAX= 
##$RELAX= 
##$RELAX= 
##$RELAX= 
$$ Bruker specific parameters
$$ --------------------------
##$DU= <E:\>
##$EXPNO= 10
$$ [...]
##$TP= (0..7)
150 150 150 150 150 150 150 150
##$TP07= 0
##$TPNAME0= <>
##$TPNAME1= <>
##$TPNAME2= <>
##$TPNAME3= <>
##$TPNAME4= <>
##$TPNAME5= <>
##$TPNAME6= <>
##$TPNAME7= <>
##$TPOAL= (0..7)
0.5 0.5 0.5 0.5 0.5 0.5 0.5 0.5
##$TPOFFS= (0..7)
0 0 0 0 0 0 0 0
##$TUNHIN= 0
##$TUNHOUT= 0
##$TUNXOUT= 0
##$USERA1= <user>
##$USERA2= <user>
##$USERA3= <user>
##$USERA4= <user>
##$USERA5= <user>
##$V9= 5
##$VALIST= <valist>
##$VCLIST= <CCCCCCCCCCCCCCC>
##$VD= 0
##$VDLIST= <DDDDDDDDDDDDDDD>
##$VPLIST= <PPPPPPPPPPPPPPP>
##$VTLIST= <TTTTTTTTTTTTTTT>
##$WBST= 2048
##$WBSW= 25
##$XGAIN= (0..3)
0 0 0 0
##$XL= 0
##$YL= 0
##$YMAX_a= 650621
##$YMIN_a= -552963
##$ZGOPTNS= <>
##$ZL1= 120
##$ZL2= 120
##$ZL3= 120
##$ZL4= 120
##$ABSF1= 14.98509
##$ABSF2= -5.573092
##$ABSG= 5
##$ABSL= 3
##$ALPHA= 0
##$AQORDER= 0
##$ASSFAC= 0
##$ASSFACI= 0
##$ASSFACX= 0
##$ASSWID= 0
##$AUNMP= <proc_prof1d_extract_pilot.lims>
##$AXLEFT= 0
##$AXNAME= <>
##$AXNUC= <1H>
##$AXRIGHT= 0
##$AXTYPE= 0
##$AXUNIT= <>
##$AZFE= 0.1
##$AZFW= 0.1
##$BCFW= 0
##$BC_mod= 0
##$BYTORDP= 0
##$COROFFS= 0
##$CY= 15
##$DATMOD= 1
##$DC= 0
##$DFILT= <>
##$DTYPP= 0
##$F1P= 0
##$F2P= 0
##$FCOR= 0.5
##$FTSIZE= 32768
##$FT_mod= 6
##$GAMMA= 0
##$GB= 0
##$INTBC= 1
##$INTSCL= 1
##$ISEN= 128
##$LB= 0
##$LEV0= 0
##$LPBIN= 0
##$MAXI= 10000
##$MC2= 0
##$MEAN= 0
##$ME_mod= 0
##$MI= 0
##$NCOEF= 0
##$NC_proc= -8
##$NLEV= 6
##$NOISF1= 0
##$NOISF2= 0
##$NSP= 0
##$NTH_PI= 0
##$NZP= 0
##$OFFSET= 14.98509
##$PC= 1
##$PHC0= 92.58179
##$PHC1= 0
##$PH_mod= 1
##$PKNL= yes
##$PPARMOD= 0
##$PPDIAG= 0
##$PPIPTYP= 0
##$PPMPNUM= 2147483647
##$PPRESOL= 1
##$PSCAL= 4
##$PSIGN= 0
##$PYNMP= <proc.py>
##$REVERSE= no
##$SF= 400.02
##$SI= 32768
##$SIGF1= 0
##$SIGF2= 0
##$SINO= 400
##$SIOLD= 32768
##$SPECTYP= <>
##$SREGLST= <1H.CDCl3>
##$SSB= 0
##$STSI= 32768
##$STSR= 0
##$SW_p= 8223.68421052631
##$SYMM= 0
##$S_DEV= 0
##$TDeff= 65536
##$TDoff= 0
##$TI= <>
##$TILT= no
##$TM1= 0
##$TM2= 0
##$TOPLEV= 0
##$USERP1= <user>
##$USERP2= <user>
##$USERP3= <user>
##$USERP4= <user>
##$USERP5= <user>
##$WDW= 1
##$XDIM= 32768
##$YMAX_p= 467510414
##$YMIN_p= -661371
##$CURPLOT= <Network HP LaserJet P1505>
##$CURPRIN= <$Network HP LaserJet P1505>
##$DFORMAT= <normdp>
##$LAYOUT= <+/1D_H.xwp>
##$LFORMAT= <normlp>
##$PFORMAT= <normpl>
##$SURQMSG= 1
$$ End of Bruker specific parameters
$$ ---------------------------------
##NTUPLES= NMR SPECTRUM
##VAR_NAME=  FREQUENCY,     SPECTRUM/REAL,   SPECTRUM/IMAG
##SYMBOL=    X,             R,               I
##VAR_TYPE=  INDEPENDENT,   DEPENDENT,       DEPENDENT
##VAR_FORM=  AFFN,          ASDF,            ASDF
##VAR_DIM=   32768,         32768,           32768
##UNITS=     HZ,            ARBITRARY UNITS, ARBITRARY UNITS
##FACTOR=    0.250966925370066, 1,           1
##FIRST=     8223.43324360094, 41377,        5750
##LAST=      0,             68412,           28183
##MIN=       0,             -661371,         0
##MAX=       8223.43324360094, 467510414,    0
$$ Real data points
##PAGE= N=1
##DATA TABLE= (X++(R..R)), XYDATA
$$ [...]
19535b37339A32676A3006a03667I9426b03769A5764f6045A68962b13413Q9447
19525a23966C45810b94827f447j37426G4140N151e9219j43301G4719b15451f0607
19513b64692A20372e2176m3093G8845g1221j66298b8708k41962A16334c47663
19502c8181C46225I504d07780C54171H3917m1526c36477f2940A22306n587b82628
19490A0986J46483M175a5100o4793k0547M448A38127B0251J74674a20844A54701
19478C26145D9478J8982J66230a94365A19301a28521A25917A191K53726a6432
19467a36132k1465K3009k52313O2316C1687h1251F7300b80553B10051a62742R541
19456a53201k6240C63637c77940g7312j93798q4481C899a89295l9227A57793b79488
$$ y = [-237339, 132676, 13006, -103667, 99426, -203769, 15764, -66045, 168962, -213413, -123966, 345810, -294827, -6447, -143873, 74140, 79291, -59219, -202520, 74719, -215451, -60607, -264692, 120372, -52176, -95269, 78845, -71221, -237519, -28708, -270670, 116334, -347663, -38181, 346225, 9504, -407780, 354171, 83917, 42391, -336477, -62940, 122306, 116719, -282628, 10986, 157469, 161644, -15100, -79893, -100440, -95992, 138127, 20251, 194925, -120844, 154701, 326145, 49478, 68460, 234690, -194365, 119301, -128521, 125917, 1191, 254917, -16432, -136132, -157597, -134588, -386901, -324585, 31687, -81251, 67300, -280553, 210051, -162742, -153201, -179441, 363637, -377940, -77312, -271110, -355591, 3899, -189295, -228522, 157793, -279488]
19444c23292D03910d2691C47689f6674D346a80838Q1615l18372I991J87254a61985
19432c03313A60031o7784c4501E3807c43864B7977J72730b90013Q0192B2157a04306
19420C58779a68880A62171e8454k46771E1317a14281A22416n1163j7756a77634
19409a34902r0059A59251c9293l51740A10358c65686A6570a60407j03614A333
19398a56425e9442b8704j34675l8729G086b31043a5502H2687b68441i0925A50849
19386A72965a6972n7906P82K1981E00803b11882B6762i7031o6218F1075b54722
19374d1243o2957j63934C9596i2564A85368H5533d08097c673k82049L4765J02743
19363a48214N7579A15917a07066j26714g3654F5849a67016A6044K4265J6238K000
$$ y = [-323292, 403910, -42691, 347689, -66674, 4346, -180838, -99223, -417595, 9991, 197245, -161985, -303313, 160031, 92247, -34501, 53807, -343864, 27977, 200707, -290013, -209821, 22157, -104306, 358779, -168880, 162171, -58454, -305225, 51317, -114281, 122416, 71253, 53497, -177634, -134902, -224961, 159251, -39293, -391033, 110358, -365686, 16570, -160407, -264021, 1333, -156425, -59442, -28704, -163379, -202108, 7086, -231043, -15502, 82687, -268441, -90925, 150849, 172965, -16972, -74878, -74096, -52115, 500803, -211882, 26762, -97031, -163249, 61075, -254722, -41243, -104200, -268134, 39596, -92564, 185368, 85533, -408097, -3673, -285722, -250957, -148214, -90635, 115917, -107066, -233780, -73654, 65849, -167016, 16044, 40309, 56547, 58547]
19352E8547L1911h7477B00362a02090H6046a61493B0425b85276A78049C3097K5856
19341E8953b0255p8470j8244j3854b4092B6269J59021q3887D3991L16857A27423
19329a12711H08b9559I2478b37660I6613b4014I9309a34329q6081a07893j41254
19318b49147c0673j9284A98426A5102a74811A17172c7947i339A45641B0036a46862
19306b58182D3483a29309q568A39912d3357k3728p8627L8242r2161D2398N147
19295D7545d10026J78197A9648a60548O1071G7173c8372p9274J9088A55164b130
19283C070c89913C17847b29609I2804c33978A21424a89216c9245E9307d8371B94060
19271d9819j04908A64880b21851A15583a11963d7922K3661j9996l0854j40869
$$ y = [58547, 90458, -87477, 200362, -102090, 86046, -161493, 20425, -285276, 178049, 33097, 58953, -20255, -98725, -116969, -130823, -24092, 26269, 185290, 101403, 43991, 360848, 127423, -112711, 808, -29559, 92478, -237660, 96613, -24014, 99309, -134329, -220410, -107893, -249147, -30673, -49957, 198426, 15102, -174811, 117172, -37947, -9339, 145641, 20036, -146862, -258182, 43483, -129309, -137877, 139912, -43357, -67085, -145712, -107470, -199631, 42398, 47545, -410026, -231829, 19648, -160548, -99477, 77173, -38372, -117646, -98558, 155164, -2130, 3070, -389913, 317847, -229609, 92804, -333978, 121424, -189216, -39245, 59307, -48371, 294060, -49819, -154727, 164880, -221851, 115583, -111963, -47922, -24261, -44257, -75111, -215980]
19261b15980d1158l87781B0771N4885a4046j92790M3223K3503j67056J41680A0360
19249b78429C0442K39794j28871a17791E8733J20765f08674N0444O4331g3153
19238b29481e0390j55306L5386k8996q7641Q7604i4528J2031H395a26150I0267
19226A61854c53159C14811b27739i9987C4648B888J3705f1528B11217i9876L9609
19215f0267A37692c30805a53395d3299j45763A77279h1007B8218a32874M5005
19205h7869A0063Q6510c58501a73229M0296p3862L4771f6458l89442a76442M6217
19194a30225j09732B29727K3341c43196J57613B7451e808q9033A15882l4331a22919
19182b50293e6414j14300r2440P242i1958j31097K8629A77051L7954g0834k12695
$$ y = [-215980, -41158, -428939, 20771, 75656, -14046, -206836, -163613, -140110, -307166, -165486, 10360, -278429, 30442, 270236, 141365, -117791, 58733, 179498, -608674, -558230, -493899, -73153, -229481, -50390, -205696, -170310, -199306, -286947, -199343, -94528, -82497, 8395, -126150, 90267, 161854, -353159, 314811, -227739, -99987, 34648, 2888, 16593, -61528, 211217, -99876, -60267, 137692, -330805, -153395, -43299, -189062, 177279, -81007, 28218, -132874, -87869, 10063, 96573, -358501, -173229, -132933, -206795, -172024, -66458, -455900, -176442, -130225, -239957, 229727, 253068, -343196, -185583, 27451, -5808, -94841, 115882, 81551, -122919, -250293, -56414, -170714, -263154, -255912, -91958, -223055, -194426, 177051, 215005, -70834, -283529]
19171b83529A08309E1063e11613A36504g2342k23921a32729H9089L66023c38612
19160C4209d7068A21263e4187j89776J08021d0852A17007L1359d0702j13759m6501
19149b00962F6532a68806J8941C8991K5290J59652a20765q5793r7259d401j44592
19138a48993j62265C9624L3714N3198a03390j13909k5521h3564j3766o462I4689
19126B2823g0395N409k723J9338j14311G2014d5181n3871C07349j03861b70860
19114a23107c3157k924j83597Q1078l8340C03628B3583a51276E7106K33933A6944
19102F7390a17429K1231a2459j99140f5654C0088K1280J56218i5409C6378H395
19090A1690a37258o0379H6828a5918I8162a26837I8316B7320b68174C9705a90604
$$ y = [-283529, 108309, 51063, -511613, 136504, -72342, -296263, -132729, 89089, 455112, -338612, 34209, -47068, 121263, -54187, -243963, -135942, -40852, 117007, 148366, -40702, -154461, -200962, 66532, -168806, -149865, 38991, 64281, 223933, -120765, -206558, -303817, -4401, -148993, -311258, 39624, 73338, 126536, -103390, -217299, -242820, -83564, -97330, -103792, 94689, 22823, -70395, -64986, -67709, -48371, -162682, 72014, -45181, -99052, 307349, 203488, -270860, -123107, -33157, -36081, -219678, -138600, -176940, 303628, 23583, -151276, 57106, 291039, 16944, 67390, -117429, -96198, -12459, -211599, -65654, 30088, 51368, 207586, -95409, 36378, 8395, 11690, -137258, -197637, 86828, -15918, 98162, -126837, 98316, 27320, -268174, 39705, -190604]
19078c19839Q4190A4016L62272a86017r2328Q3185B2333e1748b2588B18869b46874
19066c9693a364j48260e286F4300O6372K4747b1101l8812N245j39337M8276B45179
19053a46977j48163J32831J7147n865N2642o0556A92916B4438L0465i9380p4349
19042a73729B39584b92687C22384c33874h8105A46192a66977A56517e9790o3964
19032a23754H9231g4681B94140i8359B89952e256D6698d3137j642A90140f4428
19020D29389A16742j1172Q7938L3336A9642b92042M9707M3237m0113J2185C4171
19008A05642b14066J5937J3185F860b89628B78126H9189c91435c5103j94298L362
18997b26039A47644c67676j5261A41540d58909b6475E208K75895A14460h4484
$$ y = [-319839, -235649, 14016, 376288, -186017, -278345, -195160, 22333, -51748, -22588, 218869, -246874, -39693, -1364, -149624, -5286, 64300, 130672, 155419, -21101, -59913, -54668, -194005, -145729, 245179, -146977, -295140, -162309, -145162, -151027, -98385, -158941, 192916, 24438, 54903, -99380, -173729, 239584, -292687, 322384, -333874, -88105, 146192, -166977, 156517, -59790, -123754, 89231, -74681, 294140, -98359, 289952, -5256, 46698, -43137, -44779, 190140, -64428, 429389, 116742, 105570, 193508, 226844, 19642, -292042, -242335, -199098, -239211, -227026, 34171, 105642, -214066, -198129, -184944, 6860, -289628, 278126, 89189, -391435, -35103, -229401, -226039, 147644, -367676, -382937, 141540, -458909, -26475, 5208, 281103, 114460, -84484]
18986A3843b36454k85622B33537H9564B5771a09697j3969N4671k8659b1173k187
18975b3360k73527e7285k31411C1041K738K01784j04275n7142a26242e586k2778
18964b8364l34905a53097o3121i0451d561E9967j972j791g8956B59600c13548
18952A12835b9860G4833b25371R8162q3123C26778P5029F2624J48996i8212p2006
18941a70218k474D13742c46090d7025R234p5118A65225l2036b91043b0084C08681
18929C7811b77633B06349a90104B63065p2224H7335K8919P6435a7183m5213m3705
18918a06101N2597o9646B68570a3354p5998j85774G0242C4151a86226d2346R187
18907c3159k48495N0499O3214k11175J38343d7112j67903f2651r3118A33296a93889
$$ y = [13843, -236454, -522076, 233537, 89564, 25771, -109697, -123666, -68995, -97654, -21173, -23360, -296887, -57285, -288696, 31041, 33779, 235563, 131288, 74146, -126242, -5586, -28364, -363269, -153097, -216218, -90451, -4561, 59967, 57995, 56204, -78956, 259600, -313548, 112835, -29860, 74833, -225371, -127209, -210332, 326778, 401807, 62624, 211620, -98212, -170218, -172692, 413742, -346090, -47025, -37791, -112909, 165225, 133189, -291043, -20084, 308681, 37811, -277633, 206349, -190104, 263065, 190841, 87335, 116254, 192689, -17183, -62396, -106101, -53504, -123150, 268570, -13354, -89352, -275126, 70242, 34151, -186226, -42346, -33159, -281654, -231155, -167941, -379116, -240773, -47112, -215015, -62651, -155769, 133296, -193889]
18895a79890A14002j6580b88443R8723B40888a4438k94241J30351B35228N8905
18885B94133L3899E2161D24K25244n0243c03813o1807B5678a83823A24613d7196
18873B1686J04299j3501a41859l3716Q159e3447l4451j277I0455a73510A09893
18861a18594j92809A20423a60862A58372b01451o2316A72753D6030L44355A27181
18850C82595b3110n317j7803k4784A95252j5836C0713a69046g5868b2918j12445
18839a35363E2700J0908N6001B2733b32989p4033D5051a28977c5583l07743d7358
18827A2014a24824n3824b8002C6192b34997l4338B30996e6028C3446O4162c33493
18815A22672R5012b65334C00374i6965B46406P012e6582I6629O2428K10141e0368
$$ y = [-179890, 114002, 97422, -288443, -189720, 240888, -14438, -308679, -178328, 235228, 294133, 328032, 52161, 424, 225668, 175425, -303813, -365620, 25678, -183823, 124613, -47196, 21686, 125985, 112484, -141859, -175575, -167416, -53447, -87898, -89175, 90455, -173510, 109893, -118594, -311403, 120423, -160862, 158372, -201451, -263767, 172753, 46030, 390385, 127181, 382595, -23110, -28427, -46230, -71014, 195252, 179416, 30713, -169046, -75868, -22918, -135363, 52700, 63608, 119609, 22733, -232989, -307022, 45051, -128977, -35583, -343326, -47358, 12014, -124824, -178648, -28002, 36192, -234997, -269335, 230996, -56028, 33446, 97608, -333493, 122672, 217684, -265334, 300374, -96965, 246406, 253418, -56582, 96629, 159057, 369198, -50368]
18803B25927C5247a40382m2305A3803d7722j0884k01398o2788a01554A7982b745
18791a1261D1839O2028e8274j53956e5699r6565B25430c94947J61647N5804j61630
18780c39126f9142k35335B62734A21721b9056A967a0877B5683J56663b07336F955
18768c06123O6075B59266g0399I6064C6161a28309n1074J8253H0773b15683j50984
18757c66667a05622F8776A308d4012k44831h4578a5836H1036a18049k92015A16396
18745C25441d0293k04113D8833d0477k41721e9359j88202J14205r5197j46841
18735c75394a86571K7669E5652h0198A84978l6125F7412J15558b6630A08381a32023
18723B15268a56674a666B50183n2521G0520K84628I9795d54271A96299h1001n12407
$$ y = [225927, 35247, -140382, -182687, 13803, -47722, -58606, -260004, -322792, -101554, 17982, -2745, -11261, 41839, 103867, -58274, -212230, -55699, -152264, 225430, -394947, -233300, -177496, -339126, -69142, -304477, 262734, 121721, -29056, 1967, -10877, 25683, 182346, -207336, 6955, -306123, -240048, 259266, -70399, 96064, 36161, -128309, -179383, -161130, 80773, -215683, -366667, -105622, 68776, 1308, -44012, -288843, -84578, -15836, 81036, -118049, -410064, 116396, 325441, -40293, -244406, 48833, -40477, -282198, -59359, -247561, -133356, -228553, -375394, -186571, -158902, 55652, -80198, 184978, 148853, 67412, 182970, -26630, 108381, -132023, 215268, -156674, -1666, 250183, 197662, 70520, 355148, 99795, -454271, 196299, -81001, -593408]
18712e93408B66195f0717k78538m6787a91524H1027a48040j24493j66421c3959
18701d5308l46825B3929f2505B12128k0001F0385M9474b44295J13950d4471k76100
18690c20571A16913a05053L3007J9697o0203B32472c7446A2009a45441F2466j9780
18679D2686b6487k69726a34818H743K1803L69c16176c9192k49046A59067F506
18667a79391O7404A22839K4399b23696e5028j16068c9716k28152b9764E9759a93367
18655b41959J01286b4954o4208a4409r7530K6290l48842a21989p4962C0119J46833
18644A76952a5153B59160d4898A99499d4784j25628c32k70010e07j04552j01256
18633b06315A67181b20875A865M4276K07309b2492j66922B56500c6835A27438
$$ y = [-593408, 266195, -60717, -339255, -386042, -191524, 81027, -148040, -272533, -438954, -33959, -45308, -392133, 23929, -62505, 212128, 192127, 60385, 109859, -244295, -130345, -44471, -320571, 116913, -105053, -72046, -52349, -112552, 232472, -37446, 12009, -145441, 62466, 42686, -26487, -296213, -134818, 8743, 30546, 30915, -316176, -39192, -288238, 159067, 6506, -179391, -111987, 122839, 147238, -223696, -55028, -171096, -39716, -267868, -29764, 59759, -193367, -241959, -140673, -24954, -89162, -14409, -111939, -85649, -434491, -121989, -196951, 30119, 176952, -15153, 259160, -44898, 199499, -44784, -170412, -332, -270342, -507, -105059, -206315, 167181, -220875, 1865, 46141, 253450, -22492, -189414, 256500, -36835, 127438]
18622b08989k014d4568j55767k0031b3203r942D0077Q837K0162b17447g8007A35608
18609b54951a24126K3590l52542a44704j50862h9579k2434b6541k42004B87420
18598c02473N006J27919j69110A42118c86331J67231a724E5607b9439n8266A935
18586c26735d8286m2784M2174a0960j22766j12124f4128A28690H776a37520f2995
18574b5330j28220j8722B2223K29932b0022D6940h8662G1111b08936C7123b50323
18562h8788A09469A5102b80516A0514h556p5020p3919a6509n09701b00354D7433
18550I591b55031p5459A27352J10070b56188B20332l475A5552j718N8106a38149
18538G8629a37281I2286b45168B51480d9395j71115g4748B4339J17734c21444
$$ y = [-208989, -211003, -44568, -200335, -220366, -23203, -33145, 40077, 48914, 69076, -217447, -78007, 135608, -254951, -124126, -100536, -453078, -144704, -295566, -89579, -112013, -26541, -268545, 287420, -302473, -297467, -169548, -338658, 142118, -386331, -219100, -1724, 55607, -29439, -87705, 1935, -326735, -48286, -91070, -48896, -10960, -133726, -245850, -64128, 128690, 8776, -137520, -62995, -25330, -153550, -172272, 22223, 252155, -20022, 46940, -88662, 71111, -208936, 37123, -250323, -88788, 109469, 15102, -280516, 10514, -8556, -83576, -157495, -16509, -526210, -200354, 47433, 9591, -255031, -330490, 127352, 237422, -256188, 220332, 216857, 15552, 13834, 71940, -138149, 78629, -137281, 92286, -245168, 251480, -49395, -220510, -74748, 24339, 142073, -321444]
18527E5427a17206M6755n3960k8534M7215A69033b26560A16293m3569a23916b4920
18515b83712J00629g0764A80112N1818c6475l1476L3487r3573A51283b58500c1693
18503H7274p872a31641k36057h6577J7769j65809b0915j6669k79046a9333j80003
18492a99336f5993j87844l05307H4735a10367J0591o5022B07692F0000i1706o2940
18481a54646L1334q9432C79358b60842l4104E3954a26448j76908i4628A02516
18470d42934F4005b24981B55636a40954K1766l7248e1874j75101C43039d8881
18459a03019d0042C54b62283e7083q2889B48987c65829D2208b60093P4774A59720
18447f5981K2570l40708a02030K3661B1032Q7852a42097N0076n6221C6038J46144
$$ y = [55427, -117206, -70451, -124411, -152945, -105730, 169033, -226560, 116293, 72724, -123916, -24920, -283712, -183083, -70764, 180112, 231930, -36475, -67951, -34464, -128037, 151283, -258500, -31693, 87274, 79402, -131641, -367698, -86577, -68808, -234617, -20915, -37584, -316630, -19333, -199336, -65993, -253837, -559144, 84735, -110367, -99776, -164798, 207692, 60000, -91706, -154646, -123312, -212744, 379358, -260842, -294946, 53954, -126448, -303356, -94628, 102516, -442934, 64005, -224981, 255636, -140954, -119188, -156436, -51874, -226975, 343039, -48881, -103019, -40042, 354, -262283, -57083, -139972, 248987, -365829, 42208, -260093, -185319, 159720, -65981, -43411, -384119, -102030, -78369, 21032, 108884, -142097, -92021, -148242, 36038, 182182]
18436A82182j0278a26628I0103b43675F1656h8070E4611i6960B92024d44560A8639
18424G7617c53143J13916F3969a3799l20492R5230B20529e8413D48800a71280
18413c34038B07957M303a87168f7521j4667k91676A61621L6201N2632H08a41817
18401C852i9512A07793L1598a11298P505K2329p9176C3618d0268j13832A16086
18389B8972L3755L1281g3751F3914a64991C07043a48556d3943k3818k85013J67026
18378a85748d3906f177A22840B298a51244C70470H3705d85745K38231J23467A17237
18366e7523K2381B8681R0946i3466B9553R3634a34398m5698o3817f4334C13629
18354C5133d96419C5582a22033F9660J49693a51642A58461d5369D3334b38882
$$ y = [182182, 171904, -126628, 90103, -243675, 61656, -88070, 54611, -96960, 292024, -444560, 18639, 77617, -353143, -239227, 63969, -13799, -334291, -239061, 220529, -58413, 448800, -171280, -334038, 207957, 212260, -187168, -67521, -82188, -373864, 161621, 197822, 250454, 808, -141817, 3852, -99512, 107793, 139391, -111298, -103793, -81464, -160640, 33618, -40268, -154100, 116086, 28972, 62727, 94008, -73751, 63914, -164991, 307043, -148556, -43943, -67761, -352774, -185748, -43906, -6177, 122840, 2298, -151244, 370470, 83705, -485745, -247514, -124047, 117237, -57523, -35142, 28681, 119627, -93466, 29553, 123187, -134398, -180096, -243913, -64334, 313629, 35133, -496419, 35582, -122033, 69660, 219353, -151642, 158461, -45369, 43334, -238882]
18343d9398B73277e0312o5657a62n4221j05822j17733F0902b3470A36928b29209
18331B30151C8819b78670B3791J36122C0571J19824l6713a78395b1093k26430
18321b47523F6741N0761j9084J6062b13002c9077H2789c68446A22863c3630o8315
18310a01945a3473j29504b8135k4250r6084I2793c1247m06428D5141N5259M4007
18299A44407c6902k67081G0729b6005j67412H6237c64476J08887O8912j10282
18289b96959g1228A26613a41110k18388g1291L2104J948H607a46107A9798a70749
18277a33807m2447H9495b94320F5145a98031d4284k79404a29527G8031J67113
18267B45144a75046n5981G9026a26816k73418B85357b50450Q3943B51495b02783
$$ y = [-49398, 273277, -50312, -115969, -162, -54383, -160205, -277938, 60902, -23470, 136928, -229209, 230151, 38819, -278670, 23791, 159913, 30571, 150395, 113682, -178395, -21093, -247523, 66741, 117502, 98418, 114480, -213002, -39077, 82789, -368446, 122863, -33630, -101945, -13473, -142977, -28135, -52385, -148469, 92793, -31247, -437675, 45141, 100400, 144407, -36902, -303983, 70729, -26005, -193417, 86237, -364476, -255589, -186677, -296959, -71228, 126613, -141110, -359498, -71291, -39187, -37239, 8607, -146107, 19798, -170749, -133807, -176254, 89495, -294320, 65145, -198031, -44284, -323688, -129527, 78031, 245144, -175046, -231027, 79026, -126816, -400234, 285357, -250450, -166507, 251495, -202783]
18256A57133a26214k0754n1344d7329j69443b8579A27704b3560l17965a46923
18245d6480A73579E1048d87387b02474A2420a09905C6022d44631K20615G8210
18234a27788f0697j72147K8129G3130a15168A04297I597M0354K3673h9470K0021
18223f9449k59531J08761A42272a98379q9592C3899J83854f0791P894n1144I7110
18211b39454i2534H2286i008D328b16114C4207a27186A81173H8004b51233B49169
18199b33053c0956m05825B230c04057A49397A4166J10927a48386F0J21521a01453
18187I7300L0438i6958m9356B45665a87969B91933b45376A01135a9119l40776
18177c59895n5619a39501o9526R6502F115f7663H5146b17846g0532o1259C1331
$$ y = [157133, -126214, -146968, -198312, -47329, -216772, -28579, 127704, -23560, -341525, -146923, -46480, 173579, 51048, -487387, -202474, 12420, -109905, 36022, -444631, -224016, 78210, -127788, -60697, -232844, -204715, 73130, -115168, 104297, 9597, 49951, 73624, -89470, -69449, -328980, -220219, 142272, -198379, -287971, 33899, 217753, -60791, -52897, -104041, 97110, -239454, -92534, 82286, -9008, 4328, -216114, 34207, -127186, 181173, 88004, -251233, 249169, -233053, -30956, -436781, 2230, -304057, 149397, 14166, 125093, -148386, 60, 121581, -101453, 97300, 127738, -96958, -146314, 245665, -187969, 291933, -245376, 101135, -19119, -359895, -415514, -139501, -209027, -112525, 6115, -67663, 85146, -217846, -70532, -131791, 31331]
18165h775k24612m7107J36314C4375K80109b9911j2042A07436d24256a80170h0157
18153c6981j41670F7007J36129b5867l6535B52647g882E4405c1116D5980b58181
18141F2304M0465a62363M342B39019e3973J6357k5801j09841F8505K08976I8628
18129C5964a16187c1462r9867j4445o4484i5460M89I1958a11186n186B83827a06447
18116c1000j14784A05964i5090J0094j20830A9164c10871i6804c6422k94621g1724
18104a54445l73111f6385b8768B7063f7874a9895p5823j85025R8831g8114b4940
18092A85419b77492D7055a21964K0457j89586c518G6792K38478B4907n127a02532
18080a9168l0812F9180J25823a68444B69647I8277D5832d20675a23780r3056f6568
$$ y = [-8775, -233387, -280494, -144180, 34375, 314484, -29911, -41953, 107436, -424256, -180170, -80157, -36981, -178651, 67007, 203136, -25867, -62402, 252647, -7882, 54405, -31116, 45980, -258181, 62304, 102769, -162363, -158021, 239019, -53973, -37616, -63417, -173258, 68505, 277481, 98628, 35964, -116187, -31462, -131329, -145774, -210258, -95460, -94971, 91958, -111186, -116372, 283827, -106447, -31000, -145784, 105964, -95090, -84996, -205826, 19164, -310871, -96804, -36422, -331043, -71724, -154445, -527556, -66385, -28768, 27063, -67874, -19895, -95718, -280743, -181912, -78114, -24940, 185419, -277492, 47055, -121964, -101507, -291093, -3518, 76792, 315270, 24907, 19780, -102532, -19168, -49980, 69180, 195003, -168444, 269647, 98277, 45832, -420675, -123780, -216836, -66568]
18068c0492r4429n3640A2894b21294A76642d15097B67590i8726C3458N7009O9237
18057A59704c3289A6393e7348C7955J6170N3657a0220k5945C36038g0665j22994
18046a93659E1744J78644e495I6645J42693H7360f8365e118A33536a05205A14264
18034A82452a95722N4386j02851D1228J31013k3408p4400b91517j7979R1021o6772
18023b85247C12511a00481b5377C2164e4136B11204l9422b7206A15287M00097
18013E15384g6985A01503J54125A02592i6943A38190a24965A3929O8289b24247
18002b54165d6532G4750O0838i6012G5119J19617a20261L4281p0482D6626a09046
17990C69425D4576J11557b01850A93039o2052g7192A3882f527k72262A6173R6231
$$ y = [-30492, -124921, -178561, 12894, -221294, 176642, -415097, 267590, -98726, 33458, 90467, 159704, -33289, 16393, -57348, 37955, 54125, 107782, -10220, -36165, 336038, -70665, -193659, 51744, 230388, -5495, 96645, 239338, 87360, -68365, -5118, 133536, -105205, 114264, 182452, -195722, -141336, -244187, 41228, 172241, 148833, 74433, -291517, -309496, -218475, -285247, 312511, -100481, -25377, 32164, -54136, 211204, 171782, -27206, 115287, 515384, -76985, 101503, 255628, 102592, -96943, 138190, -124965, 13929, 82218, -224247, -254165, -46532, 74750, 135588, -96012, 75119, 194736, -120261, -85980, -156462, 46626, -109046, 369425, 44576, 156133, -201850, 193039, 130987, -77192, 13882, -6527, -278789, 16173, 112404]
17979A12404b2274l80976C7236Q5514J91363b50107J14941C95298j63893C607
17968B56331a60674D0663n805L0997e45901c4040B26120b1570l61011J70862M4579
17957a67140k564B66173f5211K7159l5673A00976d0552B12754n3529G3400c4117
17945d41399b06123b6827i687A88135r355a25642C2768d86445b40697J1533C0324
17933f7533A10115D5793a82497f9477n6958B99074G1871a37878C56296b05970
17922a14653g60l36901g385q2359o2265m4564l3940f4595j47675A30998F3578
17910a2304j1809m7490G438a62125M2191E6771d3431A4283K05702e260j17525
17899a22785j27633B76143b25121e7876H0068a75620e5506J932j94763B83155
$$ y = [112404, -22274, -403250, 37236, 122750, 314113, -250107, -135166, 395298, 231405, 3607, 256331, -160674, 40663, 34858, 65855, -545901, -34040, 226120, -21570, -382581, -211719, -167140, -169704, 266173, -65211, -38052, -73725, 100976, -40552, 212754, 159225, 73400, -34117, -441399, -206123, -26827, -9687, 188135, 178780, -125642, 32768, -486445, -240697, -229164, 30324, -67533, 110115, 45793, -182497, -69477, -126435, 299074, 71871, -137878, 356296, -205970, -114653, -760, -337661, -7385, -89744, -152009, -196573, -230513, -64595, -212270, 130998, 63578, -12304, -24113, -71603, 7438, -162125, -119934, 56771, -43431, 14283, 219985, -5260, -122785, -250418, 276143, -225121, -57876, 80068, -175620, -55506, -53574, -248337, 283155]
17888A55226b03446C45204B3013O9671C1584J56168a32198l5086H8607a54282
17877b7570B62692i8164A74134p7449i3967A34127d58074B1095d32715G1251d8445
17865B84276C9897i761j10376E2570a37165k88703a61508h0039A77830E1756c09829
17853a93055C8119b83894A8329b56173A51921a41511M200j91382a104k59981b6002
17841D2422c4739J0359n470C2194d8057j00524D6809b22023H4897i374j75384
17830a84758e7249I8396J67813j09268o6472M90O8829H242K8845L3499Q5637Q5444
17818B41667I8826b28706j12490C52257e0266D5269a22975j47240a15215q4513
17808a99728k98701a49491A27802b44651D05492D717J36329m5269a22853A79731
$$ y = [155226, -203446, 345204, 23013, 92684, 31584, 187752, -132198, -167284, 88607, -154282, -27570, 262692, -98164, 174134, 96685, -93967, 134127, -458074, 21095, -432715, 71251, -48445, 284276, 39897, -9761, -120137, 52570, -137165, -425868, -161508, -80039, 177830, 51756, -309829, -193055, 38119, -283894, 18329, -256173, 151921, -141511, -137311, -328693, -1104, -261085, -26002, 42422, -34739, -24380, -29850, 32194, -48057, -148581, 46809, -222023, 84897, -9374, -184758, -57249, 98396, 266209, 156941, 90469, 90959, 159788, 8242, 37087, 70586, 156223, 241667, 98826, -228706, -341196, 352257, -50266, 45269, -122975, -270215, -115215, -199728, -498429, -149491, 127802, -244651, 405492, 4717, 141046, 95777, -122853, 179731]
17797b1853O761D15333A4410b47714O3034C9513a12191b650B73020a7533j59584
17786a77117B09420g0483B07532d68546f953j2324A28300a45810b8655m37274
17776d65929C13753B2218q811b60366Q3702o9867H3732J07035K70046I863b06233
17764A20255A5523J58713h0069A93191a50997C87100a30877E142R2827a15752
17753D03623e8447K466C30188b1936F6430a36193d7556K326B4763b76266j6023
17742b92289A41463D9310i5530L1692K0027G3191d1533C5562b50612E4289Q7231
17731A41520J47044A074a2689k82543q866A2929J39683m1407c62283i3728B11622
17719C55096d3739r3301L6138A7187b55668H5898b45566a17670A24396m1688a14848
$$ y = [-21853, -15092, 415333, 14410, -247714, -184680, 39513, -112191, -2650, 273020, -17533, -177117, 209420, -70483, 207532, -468546, -6953, -19277, 128300, -145810, -28655, -465929, 313753, 22218, 13407, -260366, -176664, -246531, 83732, 190767, 460813, 9863, -206233, 120255, 15523, 174236, -80069, 193191, -150997, 387100, -130877, 5142, 97969, -115752, 403623, -58447, -55981, 330188, -21936, 66430, -136193, -47556, -45230, 24763, -276266, -292289, 141463, 49310, -95530, -63838, -43811, 73191, -41533, 35562, -250612, 54289, 141520, 288564, 1074, -12689, -295232, -304098, 12929, 152612, 111205, -362283, -93728, 211622, 355096, -43739, -137040, -100902, 17187, -255668, 85898, -245566, -117670, 124396, 82708, -114848]
17707A71955d27886D94357A35335h9347B92941J13895b05251e4600B80745i5500
17696a41977A64551F6180b63385B0665K63439h4878B43153c03617G8933h2455
17685A67786a42018H8644K31154c7904r9278J5185a2275C22585b72779B98277
17674a88100o8466E5431a14401A0995M8942J12049b04143C2718b22912A14953
17663g4575B88539H0870c648F87a63216f2993k10244A4140L04392j38485p4236
17652A05811P4790q2005A7025b35972G5260K86345A21422a1130D2913M8808J56033
17641B47754d7725F7883e2367I2492B8628a5119l3740k21344R7756C13271A42959
17629B08536C0753J54101b28113A0950e9913j54415O4209B51821f7449I4985K13055
$$ y = [171955, -427886, 494357, 135335, -89347, 292941, 406836, -205251, -54600, 280745, -95500, -141977, 164551, 66180, -263385, 20665, 284104, -84878, 243153, -303617, 78933, -82455, 167786, -142018, 88644, 319798, -37904, -137182, -121997, -12275, 322585, -272779, 298277, -188100, -256566, 55431, -114401, 10995, 59937, 171986, -204143, 32718, -222912, 114953, -74575, 288539, 80870, -3648, 687, -163216, -62993, -273237, 14140, 318532, 180047, 105811, 180601, 98596, 17025, -235972, 75260, 361605, 121422, -11130, 42913, 91721, 247754, -47725, 67883, -52367, 92492, 28628, -15119, -48859, -270203, -172447, 313271, 142959, 208536, 30753, 184854, -228113, 10950, -59913, -214328, -150119, 251821, -67449, 94985, 308040]
17618C08040a8520A77267o7982b24227I4559e4322j06141c1733j48107f0325B00570
17606a44590B85738I8922a85446A02284D7766J39250E853O9668J07635b89051
17595A41893F7951K35438a47805d7542A07395b52661A35404a29905C24793B2312
17584a1076j32676A09198a14891K1630B3906b52701n6636D6498P4374K08352A26013
17572h6247k2131K2102B2745J3928b1845B76958H8234J04368J57766j38320J05405
17561C17453a9048p9325A76652l6561N8731A2277J14854f7188C3174i6464A80776
17549E2337a36920A43296J08097a05099A09115L01296a22428N5595b0998H5045
17538e5450j10162H2323Q9017B0088G520M8545K14433J03436A04818m9298b97011
$$ y = [308040, -18520, 177267, 109285, -224227, 94559, -54322, -160463, -31733, -179840, -60325, 200570, -144590, 285738, 98922, -185446, 102284, 47766, 187016, 5853, 75521, 183156, -289051, 141893, 67951, 303389, -147805, -47542, 107395, -252661, 135404, -129905, 324793, 22312, -11076, -143752, 109198, -114891, -93261, 23906, -252701, -309337, 46498, 120872, 329224, 126013, -86247, -108378, -86276, 22745, 36673, -21845, 276958, 88234, 192602, 350368, 212048, 317453, -19048, -98373, 176652, 140091, 198822, 12277, 127131, -67188, 33174, -96464, 180776, 52337, -136920, 143296, 251393, -105099, 109115, 410411, -122428, -66833, -20998, 85045, -55450, -165612, 82323, 171340, 20088, 7520, 56065, 270498, 373934, 104818, 55520, -297011]
17526I0415c99309c2818C03682b64638H5689j4895R6614J50257A43593e6176D36448
17514B24363A5373K22709A883K35036j9469H2529K72004G1917i930A93648d3052
17502B73501b34829A83860n9738A6932b3222n1665A26269B8466K54648l417C5024
17490b6354E8613J86172A5703B027a15689B39632M4180o1977r1092C9074d8054
17478D29356G4763K267K12527A39178J49388K52419D0932K76751M9047A79633
17467B21381G3066N4361Q2535F6966j995M7118O4709K97561l4412a47362D4336
17455A211c23884C15767j48865j6413J957J09856J59644C9497K07296n4662j4429
17444A77702A1851K69498j39885L1406K70797B09864a3271B51742K02570l8451
$$ y = [90415, -399309, -32818, 303682, -264638, 85689, 70794, 167408, 317665, 143593, -56176, 436448, 224363, 15373, 238082, 1883, 236919, 217450, 82529, 354533, 71917, -9930, 193648, -43052, 273501, -234829, 183860, 124122, 16932, -23222, -74887, 126269, 28466, 283114, 279697, 35024, -26354, 58613, 244785, 15703, 2027, -115689, 239632, 283812, 221835, 130743, 39074, -48054, 429356, 74763, 77030, 289557, 139178, 288566, 540985, 40932, 317683, 366730, 179633, 221381, 73066, 127427, 209962, 66966, 64971, 112089, 176798, 474359, 439947, -147362, 44336, 1211, -323884, 315767, 166902, 150489, 152446, 262302, 421946, 39497, 246793, 192131, 177702, 11851, 281349, 141464, 172870, 443667, 209864, -13271, 251742, 454312, 415861]
17434D15861j66050A17247b1734A43974g0259B33669a0784C5666J04000J82323
17424C21989P9743A35555L021J53205O5446h236C05448J03593A53286R2854c5723
17412A65965K36044r871G8587A6560g8464F6683c56535C92499O045l4917g9189
17400A067a41947B14627I760K67731h3603I6676d3730B56263c2057E5544J79124
17389B34668a7046A59279e222E5644J08527P208n1199O7124D3604J58986O5989
17378B68579A12489J87801A6802L1991J23650k035J8778p9025J72038A30709E074
17366A01989J28592J60453r5020e2697j15922A04822o598C5008L30342a63501
17355A49616l6690h3041L9452B39570C7155M05070k14822J4731F8999J12906J35657
$$ y = [415861, 249811, 117247, -21734, 143974, -70259, 233669, -10784, 35666, 139666, 321989, 401732, 135555, 138576, 291781, 357227, -8236, 305448, 409041, 153286, 246140, -35723, 165965, 402009, 392138, 78587, 16560, -78464, 66683, -356535, 392499, 398544, 363627, -79189, 1067, -141947, 214627, 9760, 277491, -83603, 96676, -43730, 256263, -32057, 55544, 234668, -17046, 159279, -5222, 55644, 164171, 171379, 120180, 187304, 43604, 202590, 268579, 112489, 300290, 16802, 48793, 172443, 170408, 189186, 110161, 282199, 130709, 5074, 101989, 230581, 391034, 296014, -52697, -168619, 104822, 98224, 35008, 365350, -163501, 149616, 112926, -83041, -43589, 239570, 37155, 442225, 227403, 242134, 68999, 181905, 317562]
17344C17562a00290A32359C8538J43344L5839q4896n743J92902F0709K30137O7709
17333C58555A70624M9941A04133a39432K1688B75655J00327j10429b3736l6080
17323e9816A36819o6641O3476C7497K58617P8667o6475P7651j60681M8605m5471
17312B28410A12500P1528K82659A34226L20531A65587F0467J08427m3226b1372
17301A07620l2611P4125J45908j34888J05662n9502n1337d4963B82841b16376
17290B00949J15514l2298q5231G229i5266C90970j85542E5730j8948L92098j47937
17279B80943A30151M14518k65588a86904C32990e9735B50035m7474L47273d8124
17268D06706B4315J46035J95691d2172B70242b52669C83168A58951E2863J41035
$$ y = [317562, -100290, 132359, 38538, 181882, 217721, 132825, 127082, 319984, 60709, 290846, 358555, 170624, 220565, 104133, -139432, -117744, 275655, 375982, 265553, -23736, -59816, 136819, 70178, 133654, 37497, 296114, 374781, 308306, 385957, 225276, 273881, 228410, 112500, 184028, 466687, 134226, 454757, 165587, 60467, 168894, 125668, -21372, 107620, 75009, 149134, 295042, 160154, 265816, 206314, 154977, -44963, 282841, -216376, 200949, 316463, 284165, 198934, 7229, -95266, 390970, 205428, 55730, 36782, 428880, 280943, 130151, 544669, 279081, -186904, 332990, -59735, 250035, 202561, 549834, -48124, 406706, 24315, 170350, 366041, -42172, 270242, -252669, 383168, 158951, 52863, 193898]
17258A93898k6774M3609q9876J36905P3410o5884J02691A35836k9163J6910M62180
17247E85763a16112B54565C6805M3581K99081K2591D6739K26960b14685A64519
17236C02079n4493G7633K18775C6484K00287a28345C35406a48592B59183J13328
17226C72511A00711P9297h0047D54981C9159L88989M0360J04985k83554o8484
17216B21455b45384A98687c15171C38048R651G87K2937a92490j09880D01201j72352
17205B28849L6795J2262j21398E8068M96218A45504L27675B7750P6473J35219
17195B39442E1654J8853P2870l2723M44909D4141J57725J64666A43093c2200A82891
17183d1187C74883j75109K01379j1462A41126K21042j11101r1175o7276J27780
$$ y = [193898, 167124, 210733, 120857, 257762, 331172, 265288, 367979, 135836, 106673, 123583, 585763, -116112, 254565, 36805, 80386, 379467, 402058, 46739, 273699, -214685, 164519, 302079, 247586, 77633, 296408, 36484, 236771, -128345, 335406, -148592, 259183, 372511, 100711, 180008, -80047, 454981, 39159, 428148, 468508, 573493, 289939, 221455, -245384, 198687, -315171, 338048, 347699, 787, 23724, -192490, -302370, 401201, 228849, 265644, 277906, 156508, 58068, 554286, 145504, 473179, 27750, 104223, 239442, 51654, 70507, 143377, 110654, 555563, 44141, 201866, 366532, 143093, -32200, 182891, -41187, 374883, 199774, 401153, 389691, 141126, 362168, 251067, 159892, 92616, 220396]
17173B20396P7513Q6680c7577D01699j78896A08161M07456B33008J18957J63469
17163E15434A99394K23964J97943k24241A95645N53226k50421m0942J1502k11064
17153B57946E2141K02551M7688J71992o8259A69484k530M57781k47502q2516A11196
17141I0267L25283G2789M86923G2683J61626K41064A48583K17011j39974M82569
17131G08189C18627J94906k35640K1401K61094j32528L0095j97169l058o1949
17121A95779L47067k62121R9599J80728L3957B52042j13105N09734A40426L31303
17111D71729n5992j49122J93131B02689K04375J20251q0286M5224j81174J77293
17101D88372j36655L00234C16287l6123o3829L53817k60535o5369K16481j2104
$$ y = [220396, 297909, 384589, -37577, 401699, 222803, 108161, 515617, 233008, 351965, 515434, 199394, 423358, 621301, 397060, 195645, 748871, 498450, 457508, 469010, 257946, 52141, 254692, 302380, 474372, 406113, 169484, 166954, 624735, 377233, 294717, 111196, 90267, 415550, 72789, 559712, 72683, 234309, 475373, 148583, 365594, 225620, 708189, 318627, 513533, 277893, 299294, 560388, 427860, 457955, 260786, 257728, 195779, 542846, 280725, 380324, 561052, 595009, 252042, 138937, 648671, 140426, 471729, 415737, 266615, 459746, 202689, 407064, 527315, 447029, 492253, 311079, 488372, 351717, 651951, 316287, 280164, 216335, 570152, 309617, 244248, 460729, 448625]
17091D48625j59948j0229J43858j06916D4998L08779J39324J03441k90088A2477
17080B05847J59446J16312N13J93530k94493J54130M63875l76719M8321k04458
17070D66304l0891N3688j17208L3518Q7517p48n5259L79919j6090j18714N5751
17059G37787m2295k10178L0153j47549m8629J03264K26633C19109K82110B31232
17048B16637O08232k75021M3657j17471j10903J59567j8911K74839K6155j98845
17038F07936J28719B13940N33905k11781n7153J58998j3192J51064B73916Q2160
17028C56076K32980q3769q1508J12288J93575j70852n3822J22936K35669j35043
17018G28530j65081k5938K46668j97517M4856p206N7237k02973J40148J14612
$$ y = [448625, 288677, 278448, 422306, 315390, 44998, 353777, 493101, 596542, 306454, 12477, 205847, 365293, 481605, 482118, 675648, 381155, 535285, 999160, 622441, 670762, 466304, 435413, 489101, 371893, 405411, 492928, 492180, 436921, 816840, 800750, 682036, 737787, 695492, 485314, 515467, 367918, 319289, 422553, 649186, 319109, 601219, 231232, 216637, 824869, 549848, 593505, 476034, 365131, 524698, 505787, 780626, 806781, 607936, 736655, 213940, 747845, 536064, 478911, 637909, 624717, 775781, 273916, 356076, 589056, 505287, 423779, 536067, 729642, 558790, 504968, 627904, 863573, 728530, 563449, 537511, 784179, 586662, 631518, 624312, 681549, 478576, 618724, 733336]
17008G33336J35679k58010K16832M6162K49392m59500J95326l15296J29228N4384
16998G27533J3600k40022L27432J72513m57094J04864K5292L40984m22540Q8457
16988F81019q7280o7654M60451j86105j08997K85774j34227R3383j93943j90423
16978E51998N12271l45646q622P5684K37421j21981K3016j34228L50147k20244
16968I19816p3905J49786l45965J91771n5907k00243K59534J19788L7977k97388
16958G05264L36118q2059O6098l3952o8333P8272l94736J37737K13307L08982
16948A266698m96116L66135K1512J69023n5312m30608L60488R5016l61244K21767
16938A157359o6745N8960K38122j10993J9250m1841J78121m2022L4519N0146p0731
$$ y = [733336, 869015, 611005, 827837, 873999, 1123391, 663891, 859217, 543921, 673149, 727533, 741133, 501111, 828543, 1001056, 543962, 648826, 674118, 1015102, 592562, 681019, 593739, 526085, 986536, 800431, 691434, 977208, 842981, 936364, 742421, 551998, 1064269, 718623, 710001, 785685, 1023106, 901125, 924141, 789913, 1140060, 919816, 845911, 995697, 649732, 841503, 785596, 585353, 844887, 964675, 1002652, 705264, 1041382, 959323, 1025421, 991469, 923136, 1001408, 606672, 744409, 957716, 1266698, 770582, 1136717, 1158229, 1327252, 1271940, 841332, 1201820, 1296836, 935592, 1157359, 1090614, 1149574, 1387696, 1276703, 1295953, 1254112, 1432233, 1390211, 1424730, 1474876, 1404145]
16927A404145p3801R3675J67462k24872j89111R2565k0888J53561o3286j54364
16917A185086M19787k65329K64434o5236m0179J46026r2911M9087l9915j06224
16907A454626j5394L07676m2702l1327j38240P9512n9986M04276m28161M07019
16897A937299j62880k33208K56952K4551M43007m35631M03024l11242J71853J86722
16887B280447k10913k09502j785q263N1904J72620K17944j4018M250l16929J39835
16876B105590j75639J30885K98128N503k27727M44328l04571L26926M5532o0595
16866B588360l38249N23532j926o7278K99278j29061l99460K53525P5763J76142
16856B980626J55040k31920l5576M73820l06803P4040l35023N87945l8377m383
$$ y = [1404145, 1330344, 1424019, 1591481, 1366609, 1177498, 1270063, 1249175, 1402736, 1339450, 1185086, 1604873, 1339544, 1603978, 1538742, 1498563, 1644589, 1551678, 1600765, 1560850, 1454626, 1439232, 1746908, 1704206, 1672879, 1534639, 1614151, 1554165, 1958441, 1530280, 1937299, 1774419, 1541211, 1798163, 1822714, 2265721, 1830090, 2233114, 1921872, 2093725, 2280447, 2069534, 1860032, 1858247, 1849984, 1901888, 2074508, 2292452, 2278434, 2282684, 1965755, 2105590, 1929951, 2060836, 2358964, 2364467, 2136740, 2581068, 2276497, 2603423, 2648955, 2588360, 2250111, 2773643, 2771717, 2704439, 3003717, 2874656, 2475196, 2728721, 2804484, 2980626, 3135666, 2903746, 2868170, 3341990, 3035187, 3109227, 2774204, 3362149, 3323772, 3319389]
16846C319389l6569K73345k64349K91564k6370K93616p663j54623L63047k37699
16836C813688Q5540K08011j13010j623M91319n3878L33217l62252k47220K49310
16826D403102L53358j49535j8554O12111j92990J99284j90549M15154J28923j13999
16816E446305K35121M2485K40876K41636j68314L71879l51026P24850l33386J98597
16806F649023R0511Q0170K24243K23261r4319J92565L75874J83181N9626J54715
16796H138850K27472L13049N8743O34505m0218J81672K73662R6215L18380J87929
16786A0390259L91141K83171R52399o5789L22539N67047R6208J01048N57102M53436
16776A4048561N51881J59933Q03248J46247P49413R47799o6592O06631Q45322
$$ y = [3319389, 3282820, 3556165, 3291816, 3583380, 3557010, 3850626, 3842963, 3688340, 4051387, 3813688, 3899228, 4107239, 3994229, 3992606, 4483925, 4430047, 4763264, 4401012, 4153792, 4403102, 4756460, 4606925, 4588371, 5200482, 5007492, 5206776, 5016227, 5431381, 5560304, 5446305, 5681426, 5723911, 5964787, 6206423, 6038109, 6409988, 6058962, 6783812, 6450426, 6649023, 6739534, 6819704, 7043947, 7267208, 7172889, 7365454, 7741328, 7924509, 7984135, 8138850, 8366322, 8679371, 8738114, 9372619, 9332401, 9514073, 9787735, 9883950, 10202330, 10390259, 10781400, 11064571, 12016970, 11951181, 12273720, 12840767, 12936975, 13038023, 13595125, 14048561, 14600442, 14760375, 15563623, 15709870, 16459283, 17407082, 17340490, 17947121, 18792443]
16767A8792443O37343O19172O87270J244750N31437P56367J101567R17676J040589
16758B6328614J141814J006956J087622J173556J830407J178613J855039J423217
16750C7025838J387743K206781J829624K231015K515467K530392K270761K586533
16742E4584154L391781K664477L470998M140310M099005M114119M167709M858509
16734H5491062N385603N776019O037640N784095O753053O664159P314638P747167
16726A36953436P857077P734978P761468P775888P688767O650946O391648N489589
16718A94303797M207836L046821J569886j39432o68824k967215l737296m964731
16710A90650842n881708p115322p492868p715758q060747q445400q099893q006814
$$ y = [18792443, 19429786, 20048958, 20736228, 21980978, 22512415, 23268782, 24370349, 25288025, 26328614, 27470428, 28477384, 29565006, 30738562, 32568969, 33747582, 35602621, 37025838, 38413581, 40620362, 42449986, 44681001, 47196468, 49726860, 51997621, 54584154, 57975935, 60640412, 64111410, 68251720, 72350725, 76464844, 80632553, 85491062, 90876665, 96652684, 102690324, 108474419, 115227472, 121891631, 129206269, 136953436, 144810513, 152545491, 160306959, 168082847, 175771614, 182422560, 188814208, 194303797, 198511633, 201558454, 203128340, 202988908, 202320084, 199352869, 195615573, 190650842, 184769134, 177653812, 170160944, 162445186, 154384439, 145939039, 137839146, 129832332]
16702A29832332p720723p410112o939124o516577o234641n750361n889909m904085
16694G8466800m857190m369046l912822l893222l316945l303161l176450k405546
16686D9232418k814200k085374k659202j957867j926447j724591j641279j792577
16678C2630881j434970j590716j453043j104448r72344j237558p86195j380105
16670B2671502q28063j156686m28089q56822o11508m50727j030756m88585q18599
16661A6001667m90628m27882n02560m20028m96216p61702k68271k59628o28832
16652A1745920j23649k26390p29117k21009m40435k38506J46074l76753k47621
16643I288514n73277L3095k00232p6095m64933m6564m50590m7667K10994o71830
$$ y = [129832332, 122111609, 114701497, 107762373, 101245796, 95011155, 89260794, 83370885, 78466800, 73609610, 69240564, 65327742, 61434520, 58117575, 54814414, 51637964, 49232418, 46418218, 44332844, 41673642, 39715775, 37789328, 36064737, 34423458, 32630881, 31195911, 29605195, 28152152, 27047704, 26075360, 24837802, 24051607, 22671502, 21843439, 20686753, 20258664, 19401842, 18790334, 18339607, 17308851, 16820266, 16001667, 15511039, 15083157, 14580597, 14160569, 13664353, 12902651, 12634380, 12374752, 11745920, 11622271, 11395881, 10666764, 10445755, 10005320, 9766814, 9912888, 9536135, 9288514, 8715237, 8748332, 8548100, 8472005, 8007072, 7960508, 7509918, 7462251, 7673245, 7001415]
16633G001415j52381J78937m60216k67323m33908K54398j57744l39209K6598l7788
16623E612779n46613K72282k60781j20k96639m02422K61669J5858k39505J31791
16613D548299m94330j06613J47196N0564J48161n75461J06767j29696j30852J94659
16603C758694n31426r3691M77326m70235R5947J61164n56768N2582K36541j54964
16593B975170j73346L0875K98516J08637l89313M9681M4726o04006K94233k00935
16583B434238K57796k38206l05757N79550l19719p1047R6245k60042j75954K32949
16573B230053k52485K05883l36379j8971K53464K6386Q4778J12361p67262K39638
16563A777466J58677j63781k23433k24406J77680r5071L07702J0594Q2636j44269
$$ y = [7001415, 6849034, 7027971, 6567755, 6300432, 5866524, 6120922, 5963178, 5623969, 5650567, 5612779, 5066166, 5338448, 5077667, 5077547, 4780908, 4378486, 4640155, 4656013, 4416508, 4548299, 4053969, 3947356, 4094552, 4145116, 4293277, 3717816, 3824583, 3694887, 3564035, 3758694, 3227268, 3133577, 3610903, 3140668, 3236615, 3397779, 2841011, 2893593, 3130134, 2975170, 2801824, 2832699, 3131215, 3239852, 2850539, 2900220, 2944946, 2340940, 2635173, 2434238, 2692034, 2453828, 2148071, 2727621, 2407902, 2336855, 2433100, 2173058, 1997104, 2230053, 1977568, 2183451, 1847072, 1828101, 2081565, 2107951, 2192729, 2305090, 1537828, 1777466, 1936143, 1772362, 1548929, 1324523, 1502203, 1407132, 1714834, 1725428, 1808064, 1663795]
16553A663795k63811K56360j66301J87917l33811j43756N0957m5048L80141j40927
16543A445516N4561l85064N9821L6549K88484k15365j21363l53969M44846J98574
16533A452590l71578M5420k3663L03034k43149N6214L7210J33495m62566N7280
16523I84287l7739j07708L95811m24249J31065p9869p733M23970l61680J31821
16513A047976K14815m08734p4738N71606l92223m742J8215n792J17059q0453D62805
16501H23130k29184L77487k88512J11278J71610l42716J17829K72805j06999k73389
16491F33339J24047j37294p323r0500K6403R9557J24272j48420K2956J76833k60372
16480E63498J13691A99992K57871K50734k58899L39471l34738J94388k97714Q0606
$$ y = [1663795, 1399984, 1656344, 1490043, 1677960, 1344149, 1200393, 1251350, 1206302, 1586443, 1445516, 1500077, 1115013, 1174834, 1211383, 1499867, 1284502, 1163139, 809170, 1254016, 1452590, 1081012, 1126432, 1102769, 1405803, 1162654, 1218868, 1256078, 1389573, 927007, 984287, 946548, 838840, 1234651, 810402, 941467, 861598, 853865, 1277835, 916155, 1047976, 1262791, 854057, 779319, 1350925, 958702, 953960, 972175, 966383, 1083442, 1002989, 462805, 823130, 593946, 971433, 682921, 794199, 965809, 623093, 740922, 1013727, 906728, 633339, 757386, 620092, 612769, 522269, 548672, 648229, 772501, 624081, 647037, 823870, 563498, 677189, 199992, 457863, 708597, 449698, 789169, 454431, 648819, 351105, 431711]
16470D31711K33284l2918K4350J77013C54962J57562k04855L78045j17524n1066
16460E17124k6928C5800M68835K4947l8426M17385k9419C45845M2067K17861J16255
16449G22028K0317k92482k5263o248K50624k74781A56257O07453n5911C22722
16438C37524q8164M66622j53363k09979j6234q26J6661q4545J52273j26404K49785
16427E43350B53910L18064B34974q325J84109P8077G5878K68647J96881k08490
16417C32916k4996M65403C47049K7042q2980J15437m9107j11404J48032j43535
16407B50534L13842o4297A60513K36238C7987M09138N5790j01879A78922K95589
16397D74511j12009K76409j65239I5308L10351j82544L00711k06999A25551L2154
$$ y = [431711, 664995, 632077, 656427, 833440, 354962, 512524, 307669, 685714, 568190, 517124, 490196, 35800, 504635, 529582, 491156, 908541, 879122, 345845, 387912, 605773, 722028, 742345, 449863, 424600, 418352, 668976, 394195, 156257, 763710, 707799, 322722, 337524, 249360, 715982, 562619, 352640, 336406, 335580, 352241, 267696, 419969, 293565, 543350, 253910, 571974, 234974, 226649, 410758, 488835, 75878, 344525, 541406, 332916, 307920, 773323, 347049, 374091, 291111, 406548, 357441, 246037, 394069, 250534, 564376, 500079, 160513, 396751, 37987, 447125, 502915, 401036, 178922, 474511, 362502, 638911, 473672, 95308, 405659, 223115, 523826, 316827, 125551, 157705]
16387A57705J58406j12663J18692m6072o6015O10784k55368B75616J35566K7946
16377D39128A25828n5000K13608J07817r0926I1817K14311j04262m7819J6346
16367A70393M42164G9203J36649q8380N7793O4656J5562j29393J33031I529M01687
16356D11216j86032B5915Q139L44330A87445R1243J79632B25973K44899A35030
16345B57561E8261g9137A66402L0169J27742P9716b2168q0871b2492C07289n8849
16334B48440J88690j20209q0993O906j18148g9347A86883L28259b2946G8779a00000
16322b11012A41999J05898b7683A11793l2562K20347b73146A64451A5760L6647
16312E2407f0897C06269j00827c4644C32102E856c38120C46651E7397J54145D7771
$$ y = [157705, 316111, 203448, 322140, 276068, 210053, 820837, 565469, 275616, 411182, 439128, 125828, 70828, 284436, 392253, 301327, 91817, 306128, 201866, 154047, 170393, 612557, 79203, 215852, 127472, 185265, 249921, 265483, 136090, 269121, 9529, 411216, 225184, 25915, 34054, 378384, 187445, 278688, 458320, 225973, 470872, 135030, 257561, 58261, -79137, 166402, 196571, 324313, 404029, -22168, -103039, -22492, 307289, 248440, 437130, 316921, 235928, 242834, 124686, -79347, 186883, 515142, -22946, 78779, -100000, -211012, 141999, 247897, -27683, 111793, 79231, 299578, -273146, 164451, 15760, 52407, -60897, 306269, 205442, -34644, 332102, 5856, -338120, 346651, 57397, 211542, 47771]
16300h1187r1082C15168B4987K5493c45334a19871B6234J44935h921C0541K17129
16289B47670j16523J16505c3176j31895A87473c17282B07635P2932m9853e1421
16278f326A36756g7408m8757A03375m1914r705f571B83465A4473L13586a76161
16266B03528J08167a75515B38698d3798O807B82179A23585J26493J55591A18839
16255B30874r4713f3871E0381N2568b0703C30705f6391K6065E1830J8626P4006
16244A44462F7220a94780A26458B0299k497R8059K87411A45711D2823L3374a46529
16232B07682b2940A42409b73022H1023e0763a4857A37604b6958C5313j014i6271
16220a58736F2899J96828a27410B3135J88690C7460a11538l1925M7169E2769K29968
$$ y = [-81187, -172269, 315168, 24987, 50480, -345334, -119871, 26234, 171169, -8921, 30541, 247670, 131147, 247652, -33176, -165071, 187473, -317282, 207635, 280567, 230714, -51421, -6326, 136756, -77408, -126165, 103375, 61461, 51756, -6571, 283465, 14473, 328059, -176161, 203528, 311695, -175515, 238698, -43798, -36991, 282179, 123585, 250078, 405669, 118839, 230874, 136161, -63871, 50381, 102949, -20703, 330705, -66391, -40326, 51830, 70456, 144462, 67220, -194780, 126458, 20299, 17802, 115861, 403272, 145711, 42823, 76197, -146529, 207682, -22940, 142409, -273022, 81023, -50763, -14857, 137604, -26958, 35313, 34299, -96271, -158736, 62899, 259727, -127410, 23135, 211825, 37460, -111538, -143463, -96294, 52769, 282737]
16209B82737a14348j01967B4458a98205a4083p0299f609j4519B08140l1514m1744
16198A34882K33081A47773a23107M7252J8085m0169K4263A28939l4437c146j4650
16187a7796A73780N3824b1190k01932B38953b57423B80152P1265b48745J20810
16177a27935m9666j16873B26100c33245A31772D8678K75231C0639J27651g6316
16166e8476K406A44492M1804K5501b37252A05087a36991e4917C97192F8462N4611
16155A23073A4540a73223f9699A5532N4227a03555B1415h4423j01972A40018b3960
16143g328C4395K54531a5522E5101f7937D16166b8159A61943g8765l319J9730
16132f2354N462k07672f7356J4182A58972A0411K06072a386I9375b48138p1857
$$ y = [282737, -114348, -216315, 24458, -198205, -14083, -84382, -6609, -21128, 208140, 176626, 134882, 367963, 147773, -123107, -75855, -57770, -97939, -73676, 128939, 94502, -3146, -17796, 173780, 227604, -21190, -223122, 238953, -257423, 280152, 351417, -248745, -127935, -177601, -294474, 226100, -333245, 131772, 48678, 323909, 30639, 158290, -76316, -58476, -56070, 144492, 186296, 211797, -237252, 105087, -136991, -54917, 397192, 68462, 123073, 14540, -173223, -69699, 15532, 69759, -103555, 21415, -84423, -186395, 140018, -23960, -7328, 34395, 288926, -15522, 55101, -67937, 416166, -28159, 161943, -78765, -82084, -62354, -56892, -264564, -67356, -53174, 158972, 10411, 216483, -1386, 99375, -248138, -319995]
16121c19995a30695j83614d8999A86599c931k38517G4917f7623n3538B07004J0499
16110B17503b38478B68645E643J08178E1967J29280b70640J25968j03349B33687
16099d4531p974I9205b20969B11479g463q3869b4870n4367C139J1264b73769j0778
16087b84547C3360a9578j65667A28784N5676a7259D93102E1425J14058a24527
16076a65794B51735F2057b7586l13401E5291A6229J37915J21220B9593b06445
16065a39015A18272f7793j98626A27928D3712J37187N5847c09687a04395E0372
16054B5214J27089a13409j82830D1702J56591b84776E1728a97137l37268A90529
16043C13411b52698Q1966A51881a63099q5720c8346r506j35684A32943a34734
$$ y = [-319995, -130695, -314309, -48999, 186599, -3931, -242448, 74917, -67623, -121161, 207004, 217503, -238478, 268645, 5643, 113821, 51967, 181247, -270640, -144672, -248021, 233687, -44531, -52505, 99205, -220969, 211479, -7463, -91332, -24870, -79237, 3139, 14403, -273769, -284547, 33360, -19578, -185245, 128784, 184460, -17259, 493102, 51425, 165483, -124527, -165794, 251735, 62057, -27586, -340987, 55291, 16229, 154144, 275364, 29593, -206445, -139015, 118272, -67793, -266419, 127928, 43712, 180899, 236746, -309687, -104395, 50372, 25214, 152303, -113409, -296239, 41702, 198293, -284776, 51728, -197137, -534405, 190529, 313411, -252698, -170732, 151881, -163099, -248819, -38346, -47852, -183536, 132943, -134734]
16032E712a60713j2410c940m58956C7288a42630F4482a00538A1712K5825j6994
16021B0543a4955N186p9864A10326n2836K44691a79375p0007B54038j15043R1890
16010B30885b73230F5861K6749h8101k73274a15736A3179J13989j3638K59053
16000C72583A46029D0734a32361B87257B7001J27189b47318e9543j71591C1825
15989a07834j19203R4704J6846A54994J71097I4138M02269G7619J04051c8959
15978A29358J83370g8678E9036c88889a29723D4446h4149F3256c32523N3329A5824
15966f5332j90499J18191C06300e7010f652l8976A80077a87764I4397a07334c9211
15954b420l04449G9667K5330a21090i81j33598K9293Q677E0985L54335E7141K28870
$$ y = [5712, -160713, -173123, -3940, -462896, 37288, -142630, 64482, -100538, 11712, 37537, 20543, -14955, -9769, -89633, 110326, 57490, 302181, -179375, -249382, 254038, 138995, 230885, -273230, 65861, 92610, -88101, -361375, -115736, 13179, 127168, 113530, 372583, 146029, 40734, -132361, 287257, 27001, 154190, -247318, -59543, -231134, 31825, -107834, -227037, -132333, -115487, 154994, 326091, 94138, 496407, 77619, 181670, -38959, 129358, 312728, -78678, 59036, -388889, -129723, 44446, -84149, 63256, -332523, -279194, 15824, -65332, -255831, -137640, 306300, -57010, -6652, -45628, 180077, -187764, 94397, -107334, -39211, -2420, -306869, 79667, 104997, -121090, -981, -134579, -105286, -96609, 50985, 405320, 57141, 286011]
15942B86011P1466a27612k26947a14836K8842m6263j27113K843c940D2837q253
15931C4584a26116B93299b21438L8671K7597j16716J18101C41883a80950e3214
15920A97866d0250P553A38802c1168m0187j34625j13334A08164N1688p7735H757
15908d24561a94247F7540e5133G3083C340M98155i3192A53604c554B5516i4198
15896c03701J24356j50767a00845p9977c2474j25200M3486A3769a12402I2520
15885i4799k8781C46608O5014b80940H5850a40193j33626a35531A59193E3336
15874c77765A13794J3813J5967i5603j68022g6007b3162m36I5877c68797A12237
15862a04439k5377d0804G8474c0854H935c12739B86235a84741e9523A26462M6847
$$ y = [286011, 357477, -127612, -354559, -114836, -85994, -132257, -259370, -256527, -3940, 42837, 34584, -126116, 293299, -221438, -182767, -155170, -271886, -153785, 341883, -180950, -53214, 197866, -40250, -32697, 138802, -31168, -71355, -205980, -319314, 108164, 159852, 82117, 8757, -424561, -194247, 67540, -55133, 73083, 3340, 501495, -93192, 153604, -3554, 25516, -94198, -303701, -179345, -330112, -100845, -180822, -32474, -157674, -114188, 13769, -112402, 92520, -94799, -123580, 346608, 411622, -280940, 85850, -140193, -273819, -135531, 159193, 53336, -377765, 113794, 127607, 143574, -95603, -263625, -76007, -23162, -23598, 95877, -368797, 112237, -104439, -129816, -40804, 78474, -30854, 8935, -312739, 286235, -184741, -59523, 126462, 173309]
15851A73309f5552r4354B80417A21394L3621c83274D2862a65634B48863b55353
15840b68780B227d51948G9802e2343o5975F4014b6439G6397b11286I3594m666
15829H8928b21307K63J07053e5933C6353a66699B62603b43467e5298B9523K03887
15818B33410a75286C7506a0715j20954c1471k12651A12488C6978i34j59879o4637
15807b25450a09390A33956b43438B23674c69879A7117J2356K0214J19226c82395
15796B03433b48848B23763c1806A38824a69634C8244A7004J48006a29237o5518
15786a94755O3502N3323A00810c43250A9873b97017B74979a92804l5180e0403
15775h7076B44430r7603a45790k5055N0659j33951a15002d6365B40410a90486
$$ y = [173309, -65552, -159906, 280417, 121394, 155015, -383274, 42862, -165634, 248863, -255353, -268780, 2227, -451948, 79802, -52343, -118318, 64014, -26439, 76397, -211286, 93594, 88928, -221307, -221044, -113991, -55933, 36353, -166699, 262603, -243467, -55298, 29523, 233410, -175286, 37506, -10715, -131669, -31471, -244122, 112488, 36978, -934, -160813, -225450, -109390, 133956, -243438, 223674, -369879, 17117, 29473, 49687, 168913, -382395, 203433, -248848, 223763, -31806, 138824, -169634, 38244, 17004, 165010, -129237, -194755, -131253, -77930, 100810, -343250, 19873, -297017, 274979, -192804, -227984, -50403, -87076, 244430, 146827, -145790, -170845, -120186, -254137, -115002, -46365, 240410, -190486]
15764E5289Q1036J30396h5786Q319B77151a84701B39424F8592d3978j8303C2822
15752A47474C8011K50625j27288b3960l55685B66710D6366J89685J4097K8092
15742B78240a21256M6067m5620M7840J7681l81093g1153k02051b7975m5718G9333
15730a60361L6797F6726R3492k6480d10059J77759O6715G8275c57171I0307h2102
15718A58485o0413m1591j1769G732b31390f5175j72134A96190a63862K5068A3309
15706a13660A82336a74648K5628f1185D3166e1626o0849r8787P0125B80900E3617
15694b48023A81604g5188H8581J64852a81046B25414a93717D4672J24108M5632
15684B14412p5510a49055j7283h1861j40915r9427A90785a82517f661q1077J9790
$$ y = [55289, 136325, 266721, -85786, -77467, 277151, -184701, 239424, 68592, -43978, -62281, 32822, 147474, 38011, 288636, 161348, -23960, -379645, 266710, 46366, 236051, 250148, 278240, -121256, -75189, -120809, -72969, -55288, -436381, -71153, -273204, -27975, -73693, 79333, -160361, -123564, 66726, 160218, 133738, -410059, -232300, -165585, 78275, -357171, 90307, -82102, 158485, 98072, 56481, 44712, 7732, -231390, -65175, -237309, 196190, -163862, -138794, 13309, -113660, 182336, -174648, -149020, -61185, 43166, -51626, -112475, -211262, -141137, 280900, 53617, -248023, 181604, -75188, 88581, 253433, -181046, 225414, -193717, 44672, 168780, 214412, 138902, -149055, -166338, -81861, -222776, -322203, 190785, -182517, -6661, -87738, -67948]
15673f7948A48892L02988i864l90819A15471A7348f3640H9816B4974a7311E2346
15661A55536c0013B45043e5686j94719d6104E1385C714L2475A7708M0965J27567
15650A86240a81703O7383l04007J08811B10242j00908h8832j05322A20595a11602
15639e4848q0389I7888b47008j37855F2884b6187j876m4731A2971L2805a60933
15627g2320B41929A9230h1542n9253A81095m6272J98159b43064B95339j14319
15617A81020c2799j5210B07204e2019C89084b83371K1237J10045A85091J5926
15607B01017H5828a26010r3643b477A8483a15391k75809C13153a23610l4473A06673
15595G0925O7771d0873A946a7393j54165C27308G8603a94777G1563B2850J9525
$$ y = [-67948, 148892, 451880, -9864, -400683, 115471, 17348, -63640, 89816, 24974, -17311, 52346, 155536, -30013, 245043, -55686, -250405, -46104, 51385, 3714, 36189, 17708, 58673, 186240, -181703, -114320, -418327, -309516, 210242, 109334, -88832, -194154, 120595, -111602, -54848, -135237, 97888, -247008, -384863, 62884, -26187, -28063, -72794, 12971, 45776, -160933, -72320, 241929, 19230, -81542, -140795, 181095, 134823, 332982, -243064, 295339, 181020, -32799, -48009, 207204, -52019, 389084, -283371, -262134, -152089, 185091, 201017, 85828, -126010, -219653, -2477, 18483, -115391, -391200, 313153, -123610, -158083, 106673, 70925, 138696, -40873, 1946, -17393, -171558, 327308, 78603, -194777, 71563, 22850, 42375]
15584D2375b49633E2039e61163g0804I6437b23061f5366B55204a14996j45207
15574b60203p3570J22148A06276l0582k7855b51682A93127g6136j32276b1802
15563A77523e8902j10495j19779K4168C8467b03861B06425b85966P1062b1070
15552C32311A62547b03544C08515I2965i2219j63157R2951c0415j11581C2662
15541A98410i3352j24273B21129c542r9623b7599A59644a25240C03538A11211
15530E3705d59347B20074H7885K42707h854n3408a8219B08261q7217J05727c81916
15518h2553p0763A13009d24103a45881B80501o2511c1276j01017p099N8983j2002
15507i2411n2310J4795N9787A22517a07835B56367a27869p973N8412A07870B0647
$$ y = [42375, -249633, 52039, -561163, -70804, 96437, -223061, -65366, 255204, -114996, -260203, -333773, -211625, 106276, 75694, 47839, -251682, 193127, -76136, -208412, -21802, 177523, -58902, -169397, -289176, -265008, 38467, -203861, 206425, -285966, -214904, -21070, 332311, 162547, -203544, 308515, 92965, -92219, -255376, -162425, -30415, -141996, 32662, 198410, -93352, -217625, 221129, -3542, -103165, -27599, 159644, -125240, 303538, 111211, 53705, -459347, 220074, 87885, 330592, -8854, -62262, -18219, 208261, 121044, 226771, -381916, -82553, -153316, 113009, -424103, -145881, 280501, 217990, -31276, -132293, -139392, -80409, -92411, -144721, -129926, -70139, 122517, -107835, 256367, -127869, -135842, -77430, 107870, 20647]
15495E6902H722a40485K0540J1630C1639P6788j6818h2084m0292J2564K7106F09354
15482A25525a65562A5942b27448A73405q5848a69982D1100l942i7893D3409P3876
15471A17285a92136l8179A41338M6600A1147f5350E0990K44676a28905A7257N7590
15460G4847K20397D2863L89919A12585k7819g4566A16568a66178k1516b148o5625
15449f7773A0694J77157a73281A30042K01156n1660d08842B9014J18371B8726
15438a38556C26049I596J88199d1385j11593K9364A25214L1141Q8126n0135a5385
15426D92983h3882L7466j75914A43355o1937b34374c7410I4210b14615k15987
15416d30602A01424J5095g5493B28283i670j71356I750b73045I7105N4426O7880
$$ y = [56902, 8722, -140485, -119945, -108315, 31639, 108427, 91609, -82084, -122376, -109812, -82706, 609354, 125525, -165562, 15942, -227448, 173405, 87557, -169982, 41100, 37158, -97893, 43409, 117285, -192136, -230315, 141338, 187938, 11147, -65350, 50990, 295666, -128905, 17257, 74847, 295244, 42863, 432782, 112585, 84766, -74566, 116568, -166178, -187694, -2148, -67773, 10694, 187851, -173281, 130042, 331198, 279538, -408842, 29014, 147385, 28726, -138556, 326049, 9596, 197795, -41385, -152978, -123614, 125214, 156355, 244481, 194346, -15385, 492983, -83882, -46416, -222330, 143355, 81418, -234374, -37410, 94210, -214615, -430602, 101424, 116519, -75493, 228283, -9670, -181026, 9750, -273045, 97105, 151531, 219411]
15405B19411b4593k77564h4494c0695j20442e0675A20783m9543J12204d5693B11132
15393i6654A68959a66052j87202a53593D1893P3296B5773c9209j35301a1265l37559
15382c48824g7150c136A57173a17073e103j2915C19835B8291J42293b73716D9181
15370B93756f7902B11378c111D4232N1792c0754F8166F235J45073b6006j60823
15359a86829J6609I9454b56365R3255A98485c4531g829q4324b4889j46790I5224
15347G8326J36451d04846G7168a67018L588N1377H142J34008n2277a72273C9600
15335A8724d0530A21453m1642a91625M1781A67955e4087A22889g8393B91231b13876
15323a6545O135B42997j08686B1386J66233a34220j70417B00167J7643L31487
$$ y = [219411, -24593, -302157, -84494, -30695, -151137, -50675, 120783, 71240, 183444, -45693, 211132, -96654, 168959, -166052, -353254, -153593, 41893, 115189, 25773, -39209, -174510, -11265, -348824, -77150, -3136, 157173, -117073, -5103, -18018, 319835, 28291, 170584, -273716, 49181, 293756, -67902, 211378, -3111, 44232, 96024, -30754, 68166, 6235, 151308, -26006, -186829, -170220, 99454, -256365, -163110, 198485, -34531, -7829, -92153, -24889, -171679, 95224, 78326, 214777, -404846, 77168, -167018, -163430, -112053, 8142, 142150, 89873, -172273, 39600, 18724, -40530, 121453, 79811, -191625, -149844, 167955, -54087, 122889, -78393, 291231, -213876, -16545, -10410, 242997, 134311, 21386, 187619, -134220, -304637, 200167, 217810, 549297]
15313E49297A30086l4325J07872B0604g2980j20991D06495H3894m1709a26635
15302f0417C27832R2118A49119R2071G0511J24516b7112E5213J02282c5328B59580
15290d9450n6158r3008A44535k3580K5035E3552L64197j42036e1621B8506P6209
15279A04715Q0341k1410L8159L3884a40351r4268B72332j13148E9930a19563A46786
15267H0079b77424g0079l9697A842g9982j32473B2270J70620r5549B3104a26780
15255A85994a1277k05499D89406j66875J75357A16481K95264j96067M19680M35140
15245A070498O56187p69822O91137m18048D46998E8942c374F6438K02607j23425
15235A45620b57949Q897f7136H3113o429l0222a1703B9634d9805H3667a7619B8421
$$ y = [549297, 130086, 95761, 203633, 20604, -72980, -193971, 406495, 83894, 42185, -126635, -60417, 327832, 419950, 149119, 241190, 70511, 195027, -27112, 55213, 157495, -35328, 259580, -49450, -105608, -198616, 144535, 120955, 145990, 53552, 417749, 275713, -51621, 28506, 104715, 185056, 163646, 201805, 235689, -140351, -234619, 272332, 159184, 59930, -119563, 146786, 80079, -277424, -70079, -109776, 1842, -79982, -212455, 22270, 192890, 97341, 23104, -126780, 185994, -11277, -216776, 489406, 322531, 497888, 116481, 411745, 215678, 635358, 1070498, 1726685, 956863, 1648000, 1229952, 446998, 58942, -3374, 66438, 269045, 145620, -257949, -249052, -67136, 83113, 76684, 46462, -11703, 29634, -49805, 83667, -17619, 28421]
15222a29326j34905J22786A94490d0968m3853e931j64599B12218a29850B73597
15211f5932l8707k28834h1117B7589b39561A42856E7829i0331A15964J22900L3891
15200B72755a99726A36542F2660O1913C0126K00010A05280P6495a60161B18170
15189c68638a6620E2277a968A04389K01603J29365G5276J42529h2357c339a094
15177f8125o3490D18161a4596j01834B37064Q0087g2407G5140Q3432a90563B61769
15165c9570B00501p1171J22327J17987j06321a73040A28003a0860B15355b05166
15154B31899L8077c4000J239F5672M36515c025I1364c46026B71277j1146H0917
15142B27405A0831h2600C49733g2269A09127l9544J71386G7229a5645D9992e6046
$$ y = [-129326, -264231, -141445, 194490, -40968, -84821, -5931, -170530, 212218, -129850, 273597, -65932, -104639, -333473, -81117, 27589, -239561, 142856, 57829, -90331, 115964, 238864, 272755, -199726, 136542, 62660, 124573, 30126, 230136, 105280, 181775, -160161, 218170, -368638, -16620, 52277, -1968, 104389, 305992, 435357, 75276, 217805, -82357, -3339, -1094, -68125, -131615, 418161, -14596, -116430, 237064, 317151, -72407, 75140, 158572, -190563, 261769, -39570, 200501, 129330, 251657, 369644, 263323, -173040, 128003, -10860, 215355, -205166, 231899, 269976, -34000, -32761, 65672, 502187, -3025, 91364, -346026, 271277, 260131, 80917, 227405, 10831, -82600, 349733, -72269, 109127, 69583, 240969, 77229, -15645, 49992, -56046]
15130A02139J46416G2340a09039A68897G3443M768e0045B5161J59867J48260A52498
15118A58122N6368m0749J58177a09923B42433g2508p3387G7266J43232K31105
15108D51603j20203j60396R4961k1400c25387a6420H5067K37031g1812A82092
15097a32828e1080A35488D4372d8889D5048K34454k2752A8658f893B90807m1634
15086B49173j24531J86195K8843j2049J26465J21836B70948j08358b8154A4637
15075A09919Q4726q5845J13882f7365B21515L8174B6510L90589A44252j3603K6453
15064A57102P344k0984J1731i4911C27697C0096K42670g7159D24065I2059J07618
15053A99677G1924P0769j7728R6190L6106n8039K46557b95701F0887M27408B7049
$$ y = [102139, 248555, 72340, -109039, 168897, 73443, 78211, -50045, 25161, 185028, 333288, 152498, 158122, 214490, 173741, 331918, -109923, 242433, -72508, -145895, 77266, 220498, 451603, 331400, 171004, 265965, 244565, -325387, -16420, 85067, 322098, -71812, 182092, -132828, -51080, 135488, 44372, -48889, 45048, 279502, 256750, 18658, -6893, 290807, 249173, 124642, 310837, 339680, 327631, 454096, 575932, 270948, 162590, -28154, 14637, 109919, 194645, 108800, 222682, -67365, 221515, 259689, 26510, 417099, 144252, 130649, 157102, 164446, 143462, 155193, -94911, 327697, 30096, 272766, -77159, 424065, 92059, 199677, 71924, 142693, 124965, 221155, 257261, 199222, 445779, -295701, 60887, 488295, 27049]
15041D05865G9719k5383N8602E6330J85500r7037B9907K24363d4883D30929j17615
15030C13314a01314D63607j13580E3185N2257O1197K11525D3285a36344A79896
15019d3242E1180B3719K74905A09960a3861A90754J45859j28144p4741k3351O0980
15008A71357J13370b16912D14500A63593k0214n4634K73764O3576a75256d0670
14997A05228G458c9097A78409J1689J8206J09121N7830G3060o854N22577G1983
14985F5842J67696j09809m5234K74899I8745K63919A06302J19612K22402A08909
14974D88895k41827B5279L23862a9345D5901J04601A1426M67743A48007K64796
14964D12803J8032a1192B53907p9110K9547J64600p5151k6902j11086E0170L98330
$$ y = [405865, 79719, 54336, 112938, 56330, 241830, 144793, 29907, 254270, -44883, 430929, 313314, -101314, 463607, 350027, 53185, 105442, 166639, 378164, 43285, -136344, 179896, -43242, 51180, 23719, 298624, 109960, -13861, 190754, 336613, 208469, 133728, 110377, 171357, 284727, -216912, 414500, 163593, 143379, 88745, 362509, 426085, -175256, -40670, 105228, 7458, -39097, 178409, 190098, 208304, 317425, 375255, 73060, 66206, 588783, 71983, 65842, 233538, 123729, 78495, 353394, 98745, 362664, 106302, 225914, 448316, 108909, 488895, 247068, 25279, 349141, -19345, 45901, 150502, 11426, 479169, 148007, 412803, 430835, -11192, 253907, 174797, 204344, 368944, 293793, 266891, 155805, 50170, 448500]
14953D48500j8852I4459L84292o1749c4863C23394a999B61573P4305e7645B83997
14941A40679M77383A64804J90937J08272J5662j12583A30905E6346J07884K60522
14931D24752G6831K02773K6249h6127H13K32124j09709M02598B05759M57292j91858
14920D71193A24547J78830j49030M1331J60012r7773L5471G0008J41341J01826
14910C13175J23580o7366m6107P1038A79282N1978K9777J43605L6071j08023J36885
14899D69575n1519o8352K41984j20524p2882p6557K5421F0546R2809M46402A58910
14887C9346L91141J86481B83194J25783K4863j47828P0218M02123A85809J51355
14877C37164q782I4046C3598N27101J06784o9650F6942K00754K59919j36782j18211
$$ y = [448500, 429648, 94459, 478751, 417002, -34863, 323394, -1999, 261573, 335878, -57645, 283997, 140679, 618062, 164804, 355741, 464013, 479675, 367092, 130905, 56346, 164230, 424752, 76831, 279604, 305853, -86127, 813, 232937, 123228, 525826, 205759, 663051, 471193, 124547, 303377, 154347, 195678, 355690, 257917, 293388, 70008, 211349, 313175, 436755, 369389, 323282, 394320, 179282, 231260, 261037, 404642, 440713, 332690, 469575, 418056, 349704, 591688, 471164, 398282, 321725, 347146, 60546, 153355, 599757, 158910, 39346, 430487, 616968, 283194, 408977, 433840, 286012, 356230, 758353, 185809, 337164, 328382, 94046, 33598, 560699, 667483, 597833, 66942, 267696, 527615, 390833, 272622]
14866B72622j5692o3131m4104J95869L92850B35045J49303j59070P5189J72989
14856D73456J24214A21604N8479a1668B39937L31348k39463m7187K42865M8315
14846E75815k64717A12055N10587j56729J31655A85531l7137K90743A86158K61979
14836D48137k00573M31286l29900L38000j87074j31302O821J79664M3288o1082
14826E37265P8669j66687Q178j21294K82906k81220q552J9830L07218k36116Q6613
14815E06810P9704n0748k34k46736M63341j20742B83715L40917C00797J0512O9811
14804C81120J66975k14692J65809q6395J93979B37917K91881J46402k08147P3992
14794E42045M5666j31874M70879B94341J08132J81993L28839l23943J1945M8808
$$ y = [272622, 256930, 193799, 149695, 345564, 738414, 235045, 384348, 225278, 300467, 473456, 597670, 121604, 180083, -11668, 239937, 571285, 331822, 284635, 527500, 575815, 311098, 112055, 622642, 465913, 597568, 185531, 148394, 439137, 186158, 448137, 247564, 678850, 348950, 686950, 499876, 368574, 375395, 555059, 598347, 537265, 615934, 449247, 457425, 336131, 619037, 337817, 329265, 349095, 656313, 420197, 506810, 586514, 535766, 535532, 288796, 752137, 631395, 283715, 624632, 300797, 311309, 381120, 548095, 333403, 499212, 412817, 606796, 237917, 529798, 676200, 468053, 542045, 587711, 455837, 926716, 294341, 402473, 584466, 913305, 589362, 601307, 650115]
14784F50115r5435j64105K52269K28618C51892J82904j75261L84238B97128O89506
14774I86634m49316j96007L63465L35455B15021O24385C88826Q2396k258R3317
14764E62281K61917l16075J59694p2765j41319K33809J37362r6792j08158K48052
14754H68006j46534j06269m2066J16190J10466j85183K33884j04673k15612k39737
14744B88472M05942O3306K53196J43640k88350j45922J99925k63738J81727j02739
14734G35459J71612l24121M56804j01363K4447D21365J90609N9460J77117j89604
14724F58947K39963P607k80227J99717R5018k48824o9213M14149o5519j19135
14714H32483K09193k14489j8487J11876k12239J79813J07664l77383L82129l45935
$$ y = [650115, 554680, 390575, 642844, 871462, 351892, 534796, 359535, 743773, 297128, 986634, 537318, 341311, 704776, 1040231, 215021, 839406, 388826, 471222, 468964, 562281, 824198, 508123, 667817, 595052, 453733, 687542, 824904, 728112, 619954, 868006, 721472, 615203, 573137, 689327, 799793, 614610, 848494, 743821, 528209, 288472, 694414, 757720, 1010916, 1154556, 866206, 720284, 920209, 656471, 838198, 735459, 907071, 582950, 1039754, 938391, 962838, 421365, 611974, 671434, 848551, 658947, 898910, 906517, 626290, 826007, 921025, 672201, 602988, 1017137, 951618, 832483, 1041676, 827187, 808700, 920576, 708337, 888150, 995814, 618431, 1000560, 654625]
14704F54625L09353q8264N3139J23271k22496P1403j74929J88766J12657l37990
14694F89535K38734j14434j23544N31324m4464M3806D36038O16321M5852j13491
14684I84720k53951L27134j27182K33913k51247q9802j73099J16255L47534O2145
14674A176420j06776p0328q6964M2440k05880L14864o4686k68413L43295k9569
14664A044403K8877j27704J74246r4903n47k34729K68257r4897L42008k16778
14654A088233j39989N05084j55767k47401J69587m1118j8775K07703k39990L40178
14644A467745n35424K35731K70921l8202p1821q8433K12570l26682J2770P5658
14634A214833j03343j50880L76097j76000K82005k62224K10423M0926p5200N5791
$$ y = [654625, 963978, 875714, 928853, 1052124, 829628, 901031, 726102, 914868, 1027525, 689535, 928269, 813835, 690291, 1221615, 1177151, 1220957, 436038, 1052359, 1098211, 984720, 730769, 1057903, 930721, 1164634, 913387, 823585, 650486, 766741, 1114275, 1176420, 1069644, 999316, 912352, 954792, 748912, 1063776, 999090, 730677, 1073972, 1044403, 1073280, 945576, 1119822, 1024919, 1024372, 789643, 1057900, 963003, 1305011, 1088233, 948244, 1453328, 1297561, 1050160, 1219747, 1178629, 1159854, 1367557, 1127567, 1467745, 932321, 1168052, 1438973, 1400771, 1328950, 1240517, 1453087, 1126405, 1139175, 1214833, 1111490, 960610, 1336707, 1160707, 1442712, 1180488, 1390911, 1431837, 1356637, 1412428]
14624A412428k75917L28288l40864N09080m89822O2713K1044K54647Q4979p6086
14614A490490j11052Q3537J35255P250j7700j04369R8450j63595O5605j43387
14604A340484M8257K13476k10682J21605J87313J66351R8834m66820j87976L63193
14594A674035N1436J66677m8880j87677K12612p2105K15091m10676K65725K66331
14584B132569j6170o9204j29341q756K1285R3276p7125K04096k94715L02778J93054
14573B351747l65660L67850k58345K44645j51421K78410K62214p5957n9983r928
14563B583572m4474J23847P9364q6121M69735k46972R5848R9880L72079Q5684
14553C532442L44883L66460M50416J242630J247254L870526Q165520K0210800
$$ y = [1412428, 1136511, 1464799, 1123935, 1633015, 1143193, 1205906, 1226950, 1481597, 1566576, 1490490, 1379438, 1462975, 1598230, 1605480, 1587780, 1483411, 1581861, 1418266, 1483871, 1340484, 1388741, 1602217, 1391535, 1513140, 1700453, 1866804, 1965638, 1498818, 1310842, 1674035, 1725471, 1892148, 1843268, 1655591, 1868203, 1796098, 2011189, 1600513, 1866238, 2132569, 2116399, 2047195, 1917854, 1909098, 1930383, 2023659, 1946534, 2150630, 1855915, 2158693, 2351747, 1986087, 2353937, 2095592, 2340237, 2188816, 2467226, 2729440, 2653483, 2593500, 2583572, 2539098, 2662945, 2742309, 2656188, 3125923, 2878951, 2974799, 3074679, 3446758, 3532442, 3877325, 4243785, 4694201, 5936831, 7184085, 11054611, 19220131, 39430931]
14545C9430931P729631B3422376I524834k895595j520637k254404o97814m35166
14537A721218M37003j61045j46494M40945l91071j0418M1350K37518l64642J47086
14527A951450K88718k27877J65879O8298P7906k066K85916j84688K3794J9062
14517B466392P15082o80306K6016l1306l5868N94281k7867l15756K11971k13040
14507B709599J26134J07087K9962o89J45712L8487m5992J5176M7785R6371o8378
14496C201254l3770J62327j3101n6407j55158N14440M4260r440j44753L51426
14486C861078r8485J256J6809N9203k19621M11627k32033L55861p7514j5063M04080
14475D467198l95539o1090J50495J10482k47352K10905J6816q3691P14653o00119
$$ y = [39430931, 47160562, 23422376, 9524834, 6629239, 5108602, 2854198, 2156384, 1721218, 2158221, 1997176, 1850682, 2291627, 1900556, 1890138, 1931488, 2169006, 1804364, 1951450, 2240168, 2012291, 2178170, 2246468, 2324374, 2322308, 2608224, 2423536, 2447330, 2466392, 3181474, 2501168, 2527184, 2495878, 2460010, 3054291, 3026424, 2710668, 2922639, 2709599, 2835733, 2942820, 2972782, 2972093, 3117805, 3156292, 3110300, 3125476, 3173261, 3269632, 3201254, 3167484, 3329811, 3316710, 3260303, 3105145, 3619585, 3663845, 3654405, 3509652, 3861078, 3762593, 3763849, 3780658, 3839861, 3620240, 4031867, 3799834, 4155695, 4078181, 4063118, 4467198, 4071659, 4010569, 4161064, 4271546, 4024194, 4235099, 4251915, 4168224, 4882877, 4282758]
14465D282758M71936n6735j50701M63483m32050O35336l69203J57918K52782n7616
14455E197908k23626N10208l13356K86406P8016k30720K50421j23082L29580l3410
14445E728345J49993j8523L8189K51562K10721j03812N2736k74007M69998R5378
14435F600580J36928o3020j0147L02668l43674L37540K48244L7021o6151L07422
14425G487411J36734R2921O933k73813P6393M55560j72205O08344p9426L48352
14415H687204j10244J33302L20801K15815p5690J98074O1684q7513Q2356J76935
14405I602724O97439J55060j16044M23034m10588O36805q4522q5802K78368O85691
14395A1782165o7213L09125k3868K77335M00055K19548J25335J61836K003K09948
$$ y = [4282758, 4754694, 4697959, 4547258, 5010741, 4578691, 5214027, 4844824, 5002742, 5255524, 5197908, 4974282, 5484490, 5171134, 5457540, 5535556, 5304836, 5555257, 5432175, 5761755, 5728345, 5878338, 5859815, 5898004, 6149566, 6360287, 6256475, 6309211, 6035204, 6505202, 6600580, 6737508, 6674488, 6664341, 6967009, 6623335, 6960875, 7209119, 7246140, 7179989, 7487411, 7624145, 7717066, 7723999, 7450186, 7526579, 7982139, 7809934, 8418278, 8338852, 8687204, 8576960, 8710262, 9031063, 9246878, 9171188, 9369262, 9430946, 9343433, 9425789, 9602724, 10300163, 10455223, 10339179, 10762213, 10351625, 10988430, 10903908, 10818106, 11096474, 11782165, 11714952, 12024077, 12000209, 12277544, 12677599, 12897147, 13022482, 13184318, 13186321, 13396269]
14385A3396269N53919J852N80257L61916O9260M54410K35533m7586K11412N09544
14375A6326786K05496K58921R8666P71495O49957J9616M28131M775P13522M8706
14365A9526071R80591L40723M64664J82440N65485K28330J081201j61579M98557
14356B3706483O09281P43919L09084J049418L99434O19687R70690N04736O46782
14347B9559514Q91928J168962L53382Q49097R70275P00081P45013J470502Q70114
14338C7578868R57305J059026J268494J173218J466061J049196J437941J282502
14330D7272611J839474J440300J255380J956860K111642J353915K121392K247048
14322F1598622K095538J942305K543358K544205K682549K528009K915396L019557
$$ y = [13396269, 13950188, 13952040, 14532297, 14894213, 14963473, 15417883, 15653416, 15605830, 15817242, 16326786, 16532282, 16791203, 16889869, 17661364, 18311321, 18330937, 18759068, 18763843, 19477365, 19526071, 20506662, 20847385, 21312049, 21494489, 22059974, 22288304, 23369505, 23207926, 23706483, 24315764, 25059683, 25368767, 26418185, 26817619, 27437306, 28407996, 28912732, 29559514, 30451442, 31620404, 31973786, 32822883, 33793158, 34493239, 35238252, 36708754, 37578868, 38536173, 39595199, 40863693, 42036911, 43502972, 44552168, 45990109, 47272611, 49112085, 50552385, 51807765, 53764625, 55876267, 57230182, 59351574, 61598622, 63694160, 65636465, 68179823, 70724028, 73406577, 75934586, 78849982, 81869539]
14314H1869539L251121L390047L446922L936652M098799M360093M447304N022859
14306A13823336M886199N558423N317322N776016O342738O602874O685466P619144
14298A62611518Q169426P615485Q909238R195067R521682J0330993J0572414J1442270
14290B38368093J2094533J2033040J3041954J3399544J3801688J4141441J4641626
14283C31521919J4440420J4898405J4747014J4214991J4072396J3364326J2836664
14276D30096135J1431845J0027792Q355926N874261J509727K14728p23674l836572
14268D62950168j676907m221826o895286r086087j1728869j2825980j3997397
14261D02517816j4763063j5348302j5911118j5856932j5597097j5459004j4947219
$$ y = [81869539, 85120660, 88510707, 91957629, 95894281, 99993080, 104353173, 108800477, 113823336, 118709535, 124267958, 129585280, 135361296, 141704034, 148306908, 154992374, 162611518, 170780944, 178396429, 187305667, 196500734, 206022416, 216353409, 226925823, 238368093, 250462626, 262495666, 275537620, 288937164, 302738852, 316880293, 331521919, 345962339, 360860744, 375607758, 389822749, 403895145, 417259471, 430096135, 441527980, 451555772, 459911698, 465785959, 467295686, 467510414, 466786740, 462950168, 461273261, 457051435, 450156149, 441070062, 429341193, 416515213, 402517816, 387754753, 372406451, 356495333, 340638401, 325041304, 309582300, 294635081]
14254B94635081j4606874j3908831j2205416j2092958j2109948j1487570j0959354
14247B07264130j0059438r730201q690782q728789p992296p252184p227793o710093
14239A40872554o572851n557410n168594n515432n206865m363726m817135l770696
14231I9899845l630498l934131m035846l423474l011505l190443l039037k593797
14223G3041114k737162k046302k394746k351587j911450k279836j543530k497520
14215E5278981j384002j514714j414733j840650j633628j102803j372850j068726
14207D3946875j006336j189528j153279j794246p78106j435175p13843l06424
14199C5569938p69040j338921p24352p33491r42314p84866p42708m89737j088595
$$ y = [294635081, 280028207, 266119376, 253913960, 241821002, 229711054, 218223484, 207264130, 197204692, 187474491, 178783709, 170054920, 162062624, 154810440, 147582647, 140872554, 134299703, 128742293, 123573699, 118058267, 112851402, 108487676, 103670541, 99899845, 96269347, 92335216, 88299370, 84875896, 81864391, 78673948, 75634911, 73041114, 70303952, 68257650, 65862904, 63511317, 61599867, 59320031, 57776501, 55278981, 53894979, 52380265, 50965532, 49124882, 47491254, 46388451, 45015601, 43946875, 42940539, 41751011, 40597732, 38803486, 38025380, 36590205, 35876362, 35569938, 34800898, 33461977, 32737625, 32004134, 31061820, 30276954, 29534246, 29044509, 27955914]
14190B7955914m97400q06391o28112k69209m51230q99385o51481m97944l48675
14181B2906087k91890p49241m11501o50480j67327n54178k45944l58425p82126
14172A8694975j27773k59502p65925l9611r8427m95989l73798n55643k005k15495
14162A5760807o98565o223J3381q46365j20258n1307n47093K64344o57541l14210
14152A2796970j37137l31478q525L8002j59483l13994k53045m6181j92643l65604
14142A1026882q3566n3883k00222j76541k3306p1724n21847p3827J20687l89943
14132I552710j29295J34913p14717K4062J29589k77412j28833J82480q7094m04377
14122H282026j59141L2875k38055j11394L06122l37305L295p8387k91103P2357
$$ y = [27955914, 27458514, 26652123, 26024011, 25754802, 25303572, 24404187, 23752706, 23254762, 22906087, 22614197, 21864956, 21453455, 20802975, 20635648, 20081470, 19835526, 19477101, 18694975, 18567202, 18307700, 17541775, 17502164, 17403737, 16907748, 16533950, 15978307, 15976302, 15760807, 15062242, 15056019, 15069400, 14223035, 14102777, 14051470, 13504377, 13768721, 13111180, 12796970, 12659833, 12328355, 12319830, 12357832, 12198349, 11884355, 11631310, 11585129, 11392486, 11026882, 10943316, 10889433, 10689211, 10512670, 10489364, 10417640, 9895793, 9821966, 9942653, 9552710, 9423415, 9558328, 8843611, 8867673, 8997262, 8719850, 8591017, 8773497, 8686403, 8282026, 8122885, 8155760, 7917705, 7806311, 8112433, 7775128, 7778423, 7700036, 7408933, 7481290]
14112G481290q3663k83819m6698r5600m69448N09016k31307j95867p7991l34108
14102F171805O77630j98306K196m54415j43250o1236n4179J23127K3269j79779
14092E906862k4017m20779L90099p2574k06202k18608R9042l26897J04982l8897
14082E193011L38399l93353r221j1442q2248j55193m06976P61381p15723L48138
14072D866773n2998j39617j83512k6257p3569K41973n7808j52055l6697N00666
14062D886899m97556j59212J81291l68522L20031j40982k13936j36982o1863J14076
14052C923244j08673M8077J86917n53616M34519o34302J25269L27785k18772L7603
14042C568051m57399J68247j691M9296J84907m6280J8462m27294K90563O1056
$$ y = [7481290, 7397627, 7113808, 7067110, 6971510, 6502062, 7011078, 6779771, 6583904, 6505913, 6171805, 6849435, 6651129, 6653325, 6198910, 6055660, 5994424, 5940245, 6063372, 6086641, 5906862, 5882845, 5462066, 5852165, 5779591, 5573389, 5354781, 5453823, 5126926, 5231908, 5193011, 5531410, 5138057, 5128836, 5117394, 5035146, 4879953, 4472977, 5234358, 4518635, 4866773, 4813775, 4674158, 4490646, 4464389, 4390820, 4632793, 4574985, 4422930, 4386233, 4886899, 4389343, 4230131, 4411422, 4042900, 4362931, 4221949, 4008013, 3871031, 3809168, 3923244, 3814571, 3862648, 4049565, 3495949, 3930468, 3296166, 3421435, 3749220, 3530448, 3568051, 3110652, 3278899, 3277208, 3326504, 3511411, 3465131, 3483593, 3056299, 3346862, 3407918]
14032C407918o9975K7065J20837j32606l14729L8223L165J37123j68131N9521
14022C108411k88822Q6374o664N2312j39385q1963L39650m46338q9999J84078
14012B717654p4158j01153L7930J36875k77317Q2040l43466M10691l22193K61489
14002B528392l56325O19673m57507J53073l10341J26390L6865K02118k71321Q803
13992B279820k20418P08442k33224R99286K518628N776709J8597730J8592942
13984D9019915j8975470A4753949o534986k326578j106141o73415n61315j32838
13976C418676l16521J0767l95644K22280k74271m120j90104M1783K79961q0360
13966B712447n53767N7301k310O6895j58876K4165j83335K71498J19038k49182
$$ y = [3407918, 3337943, 3365008, 3485845, 3353239, 3038510, 3076733, 3079898, 3217021, 3048890, 3108411, 2819589, 2905963, 2899299, 2951611, 2812226, 2730263, 3069913, 2623575, 2533576, 2717654, 2643496, 2542343, 2580273, 2717148, 2439831, 2521871, 2178405, 2589096, 2266903, 2528392, 2172067, 2791740, 2334233, 2487306, 2176965, 2303355, 2340220, 2542338, 2271017, 2279820, 2059402, 2767844, 2534620, 3533906, 6052534, 11829243, 30426973, 49019915, 30044445, 14753949, 8218963, 5892385, 4786244, 4112829, 3551514, 3418676, 3102155, 3112922, 2717278, 2939558, 2665287, 2661167, 2471063, 2512846, 2792807, 2712447, 2158680, 2215981, 2213671, 2280566, 2121690, 2145855, 1962520, 2234018, 2353056, 2103874]
13956B103874K25252M6344j87764J07752j52485j0156j50751K73142k81630J08456
13946B082034l2227J99353o57674J54410L83975m02993j15251J02612k20509M80632
13936A974362k15137J96180m63388J36800J80552k79225J68172n7225q7623R390
13926A562858R6755L26517O4520m00687K64648J51185n12729j73029N8413r5670
13916A342781J77614m27350Q40218l73437r9425L20754N1427p7848j93670n4040
13906A507024K9441q3222j1797j86909k4123J66211L02956k64665j89446J63114
13896A408584p5699J05313j53898J83617j32017j22663J49591j77511Q0574m2582
13886A223309K17161k42301K68162p1529m02433j18453N89633l4944j58809N1723
$$ y = [2103874, 2329126, 2375470, 2187706, 2295458, 2142973, 2132817, 1982066, 2255208, 1973578, 2082034, 2049807, 2249160, 1591486, 1745896, 2129871, 1726878, 1611627, 1714239, 1493730, 1974362, 1759225, 1955405, 1492017, 1628817, 1809369, 1530144, 1698316, 1641091, 1553468, 1562858, 1659613, 1986130, 2050650, 1649963, 1914611, 2065796, 1553067, 1380038, 1438451, 1342781, 1520395, 1093045, 1933263, 1559826, 1460401, 1781155, 1832582, 1754734, 1561064, 1507024, 1536465, 1453243, 1441446, 1254537, 1230414, 1396625, 1699581, 1434916, 1245470, 1408584, 1332885, 1438198, 1284300, 1467917, 1335900, 1213237, 1362828, 1185317, 1265891, 1223309, 1440470, 1198169, 1466331, 1394802, 992369, 873916, 1463549, 1428605, 1269796, 1321519]
13876A321519k65041J58657j16222L67491k27941J54414M7814K57549n67185L2969
13866A164024K24305Q8369l94120k5267k6698L59310r4870k19602L15296k22977
13856A167770j11001l96j8768K42244l2136j10035M9080k25826J62170K44780
13846A367882n7247l7693K5l15455Q3773j57113j30334L87319J59258m09337J60849
13835A051927j29454R8578l02928K00079j10036j60423J85116J20468j20512Q1202
13825I14017N7553j47267M17618k75561J38822L866k73669m3216L06698j49837
13815I49024j24531k308N5509R6783J9573M666j58932J67200l68920l12978L67570
13804F92656J22786J20824p1895j0523l9295K55393j70379j50210L18525k56717
$$ y = [1321519, 1056478, 1215135, 1098913, 1466404, 1238463, 1392877, 1440691, 1698240, 1131055, 1164024, 1388329, 1476698, 1082578, 1057311, 1030613, 1389923, 1295053, 1075451, 1390747, 1167770, 1056769, 1056373, 1037605, 1279849, 1247713, 1137678, 1186758, 960932, 1123102, 1367882, 1310635, 1272942, 1272967, 957512, 1041285, 884172, 753838, 1141157, 1300415, 891078, 1051927, 922473, 1021051, 718123, 918202, 808166, 647743, 832859, 953327, 832815, 914017, 971570, 824303, 1241921, 966360, 1105182, 1109048, 835379, 792163, 1098861, 949024, 824493, 822185, 877694, 974477, 994050, 998716, 839784, 1006984, 638064, 325086, 692656, 815442, 936266, 864371, 853848, 814553, 1069946, 899567, 749357, 1067882, 811165]
13794H11165j50421N3526N63776l81762j13900k05068M09065j92052j85815q2573
13784E25941L28463m4454k22782J28930m7310m9404L15009l36021K81321l9349
13774H40344J04324k02181R26J18222k35121K59191j78244J19807p7533k15098
13764E34637K7876r4357J13947P4905j02472J71077k38246q8708R0065J15498
13754F04222K45812p5885B35802M14265M53051n41813J45804k8009C28012N03338
13744H31350J5029J12439k88219j26639M26769k34226j58622K29214k1055l9113
13734G46927L2697B88535L34251q3662K49106N2008p2657M9428j21155A87421
13723D50060L03381j20855r8626j9242j681q2097J73938A79662N74999j20647
$$ y = [811165, 660744, 714270, 1278046, 896284, 782384, 577316, 986381, 794329, 608514, 525941, 854404, 809950, 587168, 716098, 668788, 619384, 934393, 598372, 879693, 840344, 944668, 742487, 743413, 861635, 626514, 885705, 707461, 827268, 749735, 534637, 562513, 468156, 582103, 657008, 554536, 725613, 487367, 398659, 488724, 604222, 850034, 774149, 235802, 650067, 1103118, 561305, 707109, 679100, 328012, 831350, 846379, 958818, 670599, 543960, 970729, 736503, 577881, 807095, 786040, 746927, 779624, 288535, 622786, 539124, 788230, 840238, 767581, 817009, 695854, 187421, 450060, 753441, 632586, 533960, 514718, 513037, 430940, 604878, 179662, 754661, 634014]
13713F34014J01983o8756j38635j36279k165J28876K31679j75967K45942C82383
13702E84299n0745l0659K84043k14954P9154j68829q224K85803k18232J3974O4396
13691F20026K61111j32050C63526K58584A95898J91456j61442K94337B16580L90249
13681F06829j78885N8161j19683N8451n518N35591C04121L67597j80589q6254
13671D04875Q9886A98083N05198k95180j14947J09267n6913M40200l57841j02858
13661C25009K19082j49867k2535L74397B99118n8718J80501K29159B42581J58944
13651D01525M4860K75645B81716A30233M56878o5051l8414J15768J26288l16019
13641D09683j07796K26689k03763o1712P6559N4069A73192J92769Q7675q3832
$$ y = [634014, 735997, 667241, 528606, 392327, 390162, 519038, 750717, 574750, 820692, 382383, 584299, 533554, 502895, 786938, 571984, 651138, 482309, 474085, 759888, 541656, 555630, 620026, 881137, 749087, 363526, 622110, 195898, 387354, 225912, 520249, 216580, 606829, 427944, 486105, 366422, 424873, 419355, 954946, 304121, 671718, 491129, 404875, 494761, 198083, 703281, 408101, 293154, 402421, 345508, 785708, 427867, 325009, 544091, 394224, 371689, 746086, 299118, 240400, 420901, 650060, 242581, 401525, 446385, 722030, 281716, 130233, 587111, 522060, 483646, 599414, 725702, 409683, 301887, 528576, 324813, 263101, 339660, 393729, 173192, 365961, 453636, 369804]
13631C69804J61820B54780K07350d0745F90385k29885j31027n8257M84187k79089
13621D76314j17572j16637O2706M04518l26349J53620A39096K7878J91389K550
13611C60913l7454p9106J0630L22774j71446j31248j8334K75483k31096K21202
13601E22318k15820K56436r4808B21633K67936B32453J68774K21021j16986D0256
13590E49682B56138K2134J61167j94655J76020j77085o5279J20994l5955N243
13580B68722L82785n7443q2480J15891d5436C32622r3280J01589P3233k0146A58080
13568B78752j26658Kj1064C7435J01384L16564F0990Q6883N16055k75875n624
13557C82429K4439A77213K40564I5683L23650J04633B8301K68582b1820A99401
$$ y = [369804, 531624, 254780, 462130, -40745, 690385, 460500, 329473, 271216, 755403, 476314, 358742, 242105, 304811, 709329, 382980, 536600, 139096, 166974, 358363, 360913, 323459, 244353, 254983, 577757, 406311, 275063, 256729, 532212, 301116, 522318, 306498, 562934, 468126, 221633, 489569, 232453, 401227, 622248, 505262, 40256, 549682, 256138, 278272, 439439, 244784, 420804, 243719, 178440, 299434, 263479, 268722, 651507, 594064, 511584, 627475, -45436, 332622, 239342, 340931, 414164, 394018, 158080, 278752, 152094, 152096, 141032, 37435, 138819, 455383, 60990, 147873, 663928, 388053, 382429, 406868, 177213, 417777, 95683, 419333, 523966, 28301, 296883, -21820, 199401]
13546A13638N56505A02343K53409Q6222B20681B3381J76941O4670K36034F8763
13535C05273o8548g4543B06762J83557j08352R9908j43552J69043K88779k92468
13525D03677j72119J24323O8349j89374N329L21447k45982A07309J14946K55685
13515D77940F112K1250a91547B47971A05359M6339J87791c549D16098k02710l5680
13504A77708J35365j06393p6913J89599q4352J9881l8066H1040L52531F0565K85844
13493C46409e1180B06225h9772B19880J3411q8256J91764o7786m6704P8804L5190
13482C36303P7704A45089L11790J44545B29720r0455K23321k300N1275L4333A02246
13470B92147L32381f6298B89305C4841K80658m4219m8067J72285H7068M5962M81686
$$ y = [113638, 670143, 102343, 355752, 441974, 220681, 23381, 200322, 264992, 501026, 68763, 305273, 236725, -74543, 206762, 390319, 281967, 381875, 238323, 407366, 696145, 403677, 231558, 355881, 424230, 234856, 240185, 561632, 315650, 107309, 222255, 477940, 6112, 27362, -191547, 247971, 105359, 151698, 339489, -3549, 416098, 213388, 177708, 313073, 206680, 129767, 319366, 235014, 254895, 216829, 81040, 433571, 60565, 346409, -51180, 206225, -89772, 219880, 233291, 145035, 336799, 269013, 222309, 301113, 336303, 414007, 145089, 456879, 601424, 229720, 139265, 362586, 360286, 411561, 445894, 102246, 292147, 624528, -66298, 289305, 34841, 315499, 271280, 223213, 395498, 87068, 133030, 614716]
13459F14716j45942A62045J03859K95464j65098j21840n6413K58061r7859I1622
13448B26584L2505a19833J3111C82507A43752c1056A45457J53667J922A387L9111
13437D0498M27497k27026c9006D05693A64655Q1086N5221j02436N976n6311R125
13426A57316J12116K2660k8349o0127J01470A17607B3564J54150Q116h0509C74203
13414C64026D2496B0899M9241K8471L21231n7882A04755J67792G0592J37058G7312
13402B79971A16257J21446E0424g3589D12163E6120L1075N81702B52773F1123
13391E81178k59236A11231M94627B98153J1694C4388L26357j40174o0260n1756
13381A08555J63903H8948L88939J8025C9110J42126l5555K58372j00295j26757
$$ y = [614716, 468774, 162045, 265904, 561368, 396270, 274430, 218017, 476078, 378219, 91622, 226584, 259089, -119833, -106722, 382507, 143752, -31056, 145457, 299124, 301046, 1387, 40498, 467995, 240969, -39006, 405693, 164655, 245741, 300962, 198526, 204502, 148191, 157316, 269432, 292092, 263743, 203616, 305086, 117607, 23564, 177714, 185830, -80509, 374203, 364026, 42496, 20899, 70140, 98611, 419842, 361960, 104755, 272547, 70592, 207650, 77312, 279971, 116257, 237703, 50424, -73589, 412163, 56120, 87195, 668897, 252773, 61123, 581178, 321942, 111231, 605858, 298153, 309847, 34388, 360745, 220571, 160311, 108555, 272458, 88948, 477887, 495912, 39110, 181236, 145681, 404053, 303758, 177001]
13371A77001J89613A43543J75252q9505r492H8097N1080P5580K06235m76J22916
13360E43432A24549b05096I3306J91047J00903q1463J4261a1848F2589L70533
13350D33122B03521N3949I3049K99962G1961J19475F1644K3690O103J46118K69826
13339E07381m2136A76895q670J40615j37930K6582K54484F8862J77570J30992
13329C77424e7152B96337J39326J31114j78824A52083J53427C6312J22179n4943
13319A03548J90689L8232G2352J17702a47944B66188A15340K07381r6113q6888
13309A39720b24406d5969j0246o4186C69740A79934K77312j30242b69063C04152
13298B88851F2793O30537j75901i0790D54957g688E56064B0308E626P7227J13915
$$ y = [177001, 366614, 143543, 318795, 229290, 219798, 88097, 139177, 214757, 420992, 420516, 543432, 124549, -205096, 93306, 284353, 385256, 303793, 318054, -11848, 62589, 433122, 203521, 257470, 93049, 393011, 71961, 191436, 61644, 85334, 91437, 237555, 507381, 465245, 176895, 168225, 308840, 170910, 197492, 451976, 68862, 246432, 377424, -57152, 296337, 435663, 566777, 387953, 152083, 305510, 36312, 158491, 103548, 294237, 332469, 72352, 190054, -147944, 266188, 115340, 322721, 226608, 139720, -224406, -45969, -56215, -120401, 369740, 179934, 457246, 327004, -269063, 304152, 288851, 62793, 693330, 517429, -90790, 454957, -7688, 556064, 20308, 5626, 82853, 196768]
13287A96768J77529l2883A53798J85271H6361a40870p512F2262J61068d5253A51451
13275A63788m5856A3559a19264A84613L45437e6192A97343m2696L83748B31947
13264C16120A13495f4887A39051l2859O612A0630c41677A85483J8410o4853O4794
13253B03834a6902j03470C24408a35111B79008p2767I7464C6475L32405p2384
13243B96496j00230o5749b8909B48894J53299A12384m0553d3770B29773P9993
13233C09766P9990j91616o9093o0886J26522e3248A38598j9925b81540A34929
13222D36793A90267H6866L80145D3665J36316k2175E91J26396K0972J0529h9816
13210G9595B4001a24949B80386A04814Q7115a3409m7516A49238L8197J33383K3600
$$ y = [196768, 374297, 341414, 153798, 339069, 86361, -140870, -148382, 62262, 223330, -45253, 151451, 163788, 117932, 13559, -119264, 184613, 530050, -56192, 197343, 154647, 538395, 231947, 316120, 113495, -64887, 139051, 106192, 112804, 10630, -341677, 185483, 203893, 139040, 203834, -16902, -120372, 324408, -135111, 279008, 206241, 97464, 36475, 368880, 296496, 196266, 130517, -28909, 248894, 402193, 112384, 71831, -43770, 229773, 309766, 389756, 198140, 129047, 68161, 194683, -53248, 138598, 118673, -281540, 134929, 436793, 190267, 86866, 467011, 43665, 179981, 157806, 591, 126987, 147959, 158488, -89816, 79595, 24001, -124949, 280386, 104814, 191929, -13409, -60925, 149238, 187435, 320818, 344418]
13199C44418A31626b32833R4747G1220b32313A48964Q7303b4132j86945C34568
13188C18879D5070J304O6348J7111i944B73345J26399a59372C29688a70866C00224
13176B28277G5452K94208A81785A5596L18105a95k6435B18683R3880A01609L11910
13165D13519B9507K10405n6842f6669B79388D7852a33499B2863J9023Q4289J00613
13154B26788I0707K25610g7032H3044K36665j8974G0813c797j78293B05612p0801
13143A34811m6007K59270I7137D6298J30966K8295G1648A5638b24332e3251A85514
13131g9781c9444A71768J26097R1795j06254m0292E1445L56801b307F2932J755
13120F4687q273b30956F9426K85668A37434K06219A51973b3370C09233a03498
$$ y = [344418, 131626, -232833, -138086, 71220, -232313, 148964, 236267, -24132, -211077, 334568, 318879, 45070, 46374, 112722, 129833, -9944, 273345, 399744, -159372, 329688, -170866, 300224, 228277, 75452, 369660, 181785, 15596, 333701, -195, -26630, 218683, 312563, 101609, 413519, 29507, 239912, 183070, -66669, 279388, 47852, -133499, 22863, 41886, 126175, 226788, 90707, 316317, -77032, 83044, 319709, 300735, 70813, -3797, -182090, 205612, 134811, 88804, 348074, 97137, 46298, 177264, 205559, 71648, 15638, -224332, -53251, 185514, -79781, -39444, 171768, 297865, 389660, 283406, 243114, 51445, 408246, -2307, 62932, 64687, 56414, -230956, 69426, 355094, 137434, 343653, 151973, -23370, 309233, -103498]
13109B52456b4227C6830K80415F4209O7503a58429A0623K24941a88212b630A4474
13097A35643a92108A99631H9929i7840G0173b75448A02083b57836A38105L7366
13087A75471h3554D1153a19050A38061a99293P2437M8913J5765A32258P8753r6220
13076A14791J17658p9920p1475c5026A4412K85153J73832j19141j58356a54932
13065h9942B45277N8585i849k35706B94450K5520I9076J55253J09133J8898a28565
13053B36363j4827K15311j92643d3003o2806D77774A13206M3193g437L677G1967
13041A18305R7777R7756F3015K16302j0951A073f7473B58506o6868I2619N0575
13030A43194E3122K80012I8319D7385J16377F7285b8384C5039L04117H0410N2891
$$ y = [252456, -24227, 36830, 317245, 64209, 131712, -158429, 10623, 235564, -188212, -2630, 14474, 135643, -192108, 199631, 89929, -97840, 70173, -275448, 102083, -257836, 138105, 175471, -83554, 41153, -119050, 138061, -199293, -126856, -77943, -62178, 132258, 211011, 114791, 232449, 152529, 81054, -35026, 14412, 299565, 473397, 354256, 195900, -154932, -89942, 245277, 303862, -9849, -245555, 294450, 319970, 99076, 254329, 363462, 382360, -128565, 236363, 221536, 436847, 244204, -43003, -105809, 477774, 113206, 156399, -7437, -3760, 71967, 118305, 216082, 313838, 63015, 279317, 268366, 1073, -67473, 258506, 191638, 92619, 143194, 53122, 333134, 98319, 47385, 163762, 67285, -28384, 35039, 339156, 80410, 133301]
13019A33301J68682a51082B05470L08854d9163A43669k0019J19168B8384j1591
13009A6793L76752B9348K37K96169A47211J59006b0642k6685B94052A19688J25273
12998B44961B6978f0631A08663a35859K3308I9692j7245n501J59161b34675C03925
12986a28271B13772J33645G9728L99652B11885Q5617B2749b94719b48j93817F6810
12974C46994b25415C29019A47070F5007E050K14016b0966j01765B10298j4188
12964A96110F8383J97954b45732C29574c0423C9485b28161C59728D3398J98669
12954B42067c9877C65635b8867r1957B06386c0455o2871q0364A96911c23096a1362
12942A48773R1427a07299G0979m533K53558b18887B3260K25284b41302R3874m4303
$$ y = [133301, 301983, -151082, 205470, 514324, -49163, 143669, 123650, 242818, 28384, 16793, 393545, 29348, 29585, 325754, 147211, 306217, -20642, -47327, 294052, 119688, 244961, 26978, -60631, 108663, -135859, -112551, 99692, 82447, 76946, 236107, -234675, 303925, -128271, 213772, 347417, 79728, 479380, 211885, 297502, 22749, -294719, -248, -194065, 66810, 346994, -225415, 329019, 147070, 65007, 5050, 219066, -20966, -122731, 210298, 196110, 68383, 266337, -245732, 329574, -30423, 39485, -228161, 359728, 43398, 242067, -39877, 365635, -28867, -120824, 206386, -30455, -93326, -173690, 196911, -323096, -11362, 148773, 240200, -107299, 70979, 66446, 320004, -218887, 23260, 248544, -241302, -147428, -191731]
12931a91731I5929J28788r3573k0562K6796a3518A85198b9121j64232a2753B94547
12919c2845C6023J32520D0192O4876P8320r1306Q0740a27862c1867A87192J2298
12908A99490g1835D3789d923C81081C0490J75536K72371d4534n9062j8909A68787
12896C3386c6697A99960I9937a94962j3027I4682M3380a19726A06290k7836a31799
12884B6251b05464D11851D8410e2145H0757c7286l55095J20894F3485b11366C6541
12872D2369a4030j09748a9881j38653K4306A15777b92121B48719A18303n8216
12862F0087k1526K27044a4833e230G3667c6859B3343J71554I4522J1162K9275
12851A34959M7549b46046a06152h853A48759a27959C9973b02488f6040I8014K3554
$$ y = [-191731, 95929, 224717, 131144, 110582, 137378, -13518, 185198, -29121, -193353, -12753, 294547, -32845, 36023, 168543, 40192, 105068, 183388, 92082, 172822, -127862, -31867, 187192, 199490, -71835, 43789, -4923, 381081, 30490, 206026, 478397, -44534, -103596, -122505, 168787, 33386, -36697, 199960, 99937, -194962, -207989, 94682, 138062, -119726, 106290, 78454, -131799, 26251, -205464, 411851, 48410, -52145, 80757, -37286, -392381, -271487, 63485, -211366, 36541, 42369, -14030, -123778, -19881, -158534, -134228, 115777, -292121, 248719, 118303, 60087, 38561, 265605, -14833, -5230, 73667, -36859, 23343, 194897, 94522, 105684, 134959, 182508, -246046, -106152, -8853, 148759, -127959, 39973, -202488, -66040, 98014, 121568]
12840A21568L9398e2018j31412H388M5118J13146P5859b01836b4929C7085J30624
12829A67709b10468A07308D2184R1291M8858l5205e6932B21940g2484D0228O0864
12818A01092o248a06812D56421D5153N6076K76979j18044N87j07424h314k45172
12807b53486I8226a79767h1941A27664a20615B08616a48344A46614c1897j85382
12797b17279b6909B40061q3920A1362b53017h2470b8654D8905J67509f0118j77273
12786b37391B4805c28715e3213p2270o7444h0033a4597A24282c52324f993m360
12775a1353B64129a86117A42645R1943j03670g1078B1573a12876A51507d76448
12764A7492d1575F522P5384A2610L34908a34161H957e0958C14296I3694b16072
$$ y = [121568, 160966, -52018, -183430, 8388, 53506, 166652, 242511, -201836, -24929, 37085, 167709, -210468, 107308, 42184, 133475, 182333, 147128, -56932, 221940, -72484, 40228, 101092, 94844, -106812, 456421, 45153, 101229, 378208, 260164, 260751, 153327, -8314, -253486, 98226, -179767, -81941, 127664, -120615, 208616, -148344, 146614, -31897, -217279, -26909, 240061, 156141, 11362, -253017, -82470, -28654, 48905, 216414, -60118, -237391, 24805, -328715, -53213, -125483, -192927, -80033, -14597, 124282, -352324, -6993, -11353, 264129, -186117, 142645, 234588, 130918, -71078, 21573, -112876, 151507, -476448, 17492, -41575, 6522, 81906, 12610, 347518, -134161, 8957, -50958, 314296, 93694, -216072]
12752a64299j14458C57925d8973D0914a13875B44584a14600M6598c1181j22013
12742a53194A60434i2000F3982a02085B61534g0573B27041I6253J01916o9712
12732A28457B7789K60411j07264K30933K4193F5298k2860g3421C16718A1465b23365
12720a13373k31158A09787i8280E7617R5594i2302F4896C58J33665c97718a9214
12708C26729e132D20970k08010A991K83362K92557A11003K92290i1519B74618
12697B12686H3355d8535A9201Q3557b6208A14608d1107E3996J2892K12727M6406
12686C26021b07548B05816H3907J8987J34916K21049A91183b1551D15726I2404
12675A46646a08880C00278F497J06916O5394Q4517h2080I827M37533b9643B09406
$$ y = [-164299, -278757, 357925, -48973, 40914, -113875, 244584, -114600, -68002, -31181, -153194, 160434, -92000, 63982, -102085, 261534, -70573, 227041, 96253, 198169, 128457, 27789, 288200, 180936, 411869, 436062, 65298, 42438, -73421, 316718, 11465, -223365, -113373, -344531, 109787, -98280, 57617, 153211, -92302, 64896, 358, 134023, -397718, -19214, 326729, -5132, 420970, 212960, 1991, 285353, 577910, 111003, 403293, -91519, 274618, 212686, 83355, -48535, 19201, 102758, -26208, 114608, -41107, 53996, 66888, 279615, 326021, -207548, 205816, 83907, 102894, 237810, 458859, 191183, -21551, 415726, 92404, 146646, -108880, 300278, 6497, 113413, 178807, 263324, -82080, 9827, 447360, -29643, 209406]
12663a13246C3586b34334A06259b7548B38343b47964G57474B9347J15403f3010
12652A04243c29108B0288J16477j9932f8600K9927J0112A40915m8516J70063P3224
12641C35686B2773O9036K79014i5062C31945b2975G3569J31251C2917L32218j76405
12630A88730B4713N0031J92309L6669P998f0574A69302h102A54993F7177Q0324
12619A47501f775C23265E3911L13141j64721j034B0850c20402E5550N3072j9773
12608H8849a32841F2617K94953d1679B11026I4640J35812b77259I6709L28546
12598D25255A12526J21329K1615a39046A11910g1749c4965A7412J44641O548h231
12586B24427c48353d3781B47774o1014E1204a66094C08888a65993P5486d3614
$$ y = [-113246, 33586, -234334, 106259, -27548, 238343, -247964, 757474, 29347, 144750, -63010, 104243, -329108, 20288, 136765, 116833, -68600, -38673, -28561, 140915, 92399, 262462, 335686, 22773, 91809, 370823, -95062, 331945, -22975, 73569, 204820, 32917, 365135, 188730, 24713, 74744, 267053, 303722, 311720, -60574, 169302, -8102, 154993, 67177, 147501, -6775, 323265, 53911, 367052, 202331, 201297, 20850, -320402, 55550, 108622, 88849, -132841, 62617, 357570, -41679, 211026, 94640, 230452, -277259, 96709, 425255, 112526, 233855, 255470, -139046, 111910, -71749, -34965, 17412, 162053, 168601, -8231, 224427, -348353, -43781, 247774, 186760, 51204, -166094, 308888, -165993, -90507, -43614]
12575B44540b23736E9070k7520J74702J19160b00120B46809H1795b83552G6971
12564c768C53915a48137G1542a6125I7195C967L04991A17697m06J39784A06711
12552A25121b97599A27421E6505k695J73282e6122A68596d8032A00262b35683
12541G4106B4486d6238l70616h256j39057A6223a63937a9315j59506E03778k19170
12530B84608P4605i3345o5649d3148C79721H5603C0373P8606a02306j17572A303
12518a22398B57564g7326C81929a87324A44940b82980H040b01399C0546a4302
12507c04916A11938B3491L0367f6939A39632c3825j19105A01894P4396H018b15383
12495a82795A88836H0306Q3434M0505c51169H2231P7419C9592a69098B08295J42934
$$ y = [244540, -223736, 59070, 31550, 206252, 325412, -200120, 246809, 81795, -283552, 76971, -3768, 353915, -148137, 71542, -16125, 97195, 3967, 308958, 117697, 117291, 257075, 106711, 125121, -297599, 127421, 56505, 53810, 227092, -56122, 168596, -48032, 100262, -235683, 74106, 24486, -46238, -416854, -8256, -147313, 16223, -163937, -19315, -178821, 503778, 284608, 359213, -93345, -158994, -43148, 379721, 85603, 30373, 108979, -102306, -219878, 1303, -122398, 257564, -77326, 381929, -187324, 144940, -282980, 8040, -201399, 30546, -14302, -304916, 111938, 23491, 53858, -66939, 139632, -33825, -152930, 101894, 176290, 8018, -215383, -182795, 188836, 80306, 163740, 204245, -351169, 82231, 159650, 39592, -169098, 208295, 351229]
12484C51229B2768L39887c7863A88325f3568j74644H8797M2038J96973b9647j25303
12473a54950c9668D24983C3436J39244b79853C84227b9053k54426H9151K10379
12463B99530H5324B3599i3858c3592G0104b16366R9528E3700f3565n6924A38550
12451A32507g141g56l2747e547B30248J63715a62149C3688l220a85530l339A22110
12438a46690b7037C83946a4364B39325q0771D1446j276L50703D2406J9163a43191
12426B2737a22047J7049k01160B6397a37516F1865c8718l47759A8736K22020b39443
12414D9067K00135m5287o8863j0122E6118k5064i6882j43824c461r941p4481D05546
12401A02151a3915n2028k774a9095L485j60636O7386g941A54920a69903A2064
$$ y = [351229, 22768, 362655, -37863, 188325, -63568, -238212, 88797, 130835, 327808, -29647, -154950, -39668, 424983, 33436, 172680, -279853, 384227, -29053, -283479, 89151, 299530, 85324, 23599, -93858, -33592, 70104, -216366, -116838, 53700, -63565, -120489, 138550, 132507, -7141, -756, -33503, -5547, 230248, 393963, -162149, 33688, 30468, -185530, -188869, 122110, -146690, -27037, 383946, -14364, 239325, 158554, 41446, 40170, 390873, 42406, 61569, -143191, 22737, -122047, -104998, -306158, 26397, -137516, 61865, -38718, -386477, 18736, 240756, -239443, 49067, 249202, 203915, 135052, 124930, 56118, 31054, -96882, -240706, -3461, -13402, -87883, 405546, 102151, -13915, -65943, -68717, -19095, -15610, -176246, -108860, -7941, 154920, -169903, 12064]
12389d7712k66696J13122J7796B35603C7082K16179h5045D0125b16861D1332J65043
12378B06375H2255b96834A86316b03064D0305a06574j24513G5621b01897j5838
12368b17735j13076J40111A45479A7571J016L1601A0531J93988G9167J13534A0612
12356a08427B60045g145B13724J0205e5466B24182e6076k7579G2180f6210A44959
12344B73267i9841c8470l44665E9274K12962A09227G909a3821G6009h2686D9310
12332A78409b01610B4170L01243H201J84163p0277N1105a63641B34866K37444
12322D72310b88244C70564D3428h8879F3865J3790i571A76451k1889c24212A34020
12310D92865a92943D1845J69861d4148H2193a50357E1831f0819a9737B26536I6834
$$ y = [-47712, -314408, -201286, -183490, 235603, 37082, 253261, -85045, 40125, -216861, 41332, 206375, 82255, -296834, 186316, -203064, 40305, -106574, -231087, 75621, -201897, -217735, -330811, -190700, 145479, 17571, 18587, 50188, 10531, 204519, 79167, 192701, 10612, -108427, 260045, -7145, 213724, 223929, -55466, 224182, -56076, -83655, 72180, -66210, 144959, 273267, -99841, -38470, -383135, 59274, 272236, 109227, 7909, -13821, 76009, -82686, 49310, 178409, -201610, 24170, 325413, 8201, 192364, 122087, 173192, -163641, 234866, 472310, -288244, 370564, 43428, -88879, 63865, 77655, -9571, 176451, 154562, -324212, 134020, 492865, -192943, 41845, 211706, -44148, 82193, -150357, 51831, -60819, -19737, 226536, 96834]
12298E8248a33270A95546a09511H4435c9456C9167a04598B30235a9973j9506E3818
12286C47114G4615e4145A72931o0524R306e5981A84098p4070a02872B02080M6432
12275B48512c69D319L65202J14957k30261r4692J02035E457J43074K14866d12204
12263H1263K26648D4081K95535e5401E9695J58445H2012L8004b90777a13539p180
12252a20719c8696j203D91883e8701B27654a45217D03998a94761B75890L2099
12242C07989A45735J64274a72581B96078I7220b26250d4227r5339A64553a83119
12231C06126g5220A82709g0836A69451J49112d2574A70920J08748A13896K75405
12221C89301G7702J17600M4531q8867J14628a01152B64430a09298B54937m4557
$$ y = [58248, -133270, 195546, -109511, 84435, -39456, 39167, -104598, 230235, -19973, -39479, 53818, 347114, 74615, -54145, 172931, 112407, 121713, -55981, 184098, 110028, -102872, 202080, 248512, -369, 4319, 369521, 484478, 254217, 159525, 261560, 5457, 148531, 363397, -412204, 81263, 307911, 44081, 339616, -55401, 59695, 218140, 82012, 120016, -290777, -113539, -120719, -38696, -39899, 491883, -58701, 227654, -145217, 403998, -194761, 275890, 307989, 145735, 310009, -172581, 296078, 97220, -226250, -44227, -139566, 164553, -183119, 306126, -75220, 182709, -70836, 169451, 318563, -42574, 170920, 279668, 113896, 389301, 77702, 195302, 239833, 150966, 265594, -101152, 264430, -109298, 254937, 210380]
12211B10380K8609a17704A83981n7092J4347k7762O9694p7832J70828o1796K66488
12200D80856E5698N1050J45384o1753K99494B19930i963p415C44131f300C40787
12188B86200A24382K92725m4328j05640j12832b08799F9960J57333O2573n6910
12178B32956q0847e8494B06266P6895A32733a03701A93840I2179O0139J78312
12168C30630a85627D6883L874J24389J20384C3525K15276K6838a4911q7889c508
12156H2298K9191J56223J24846a01782A18004a8940F127J5083Q864f0487J2392
12145d8095j0644B33741P1357j7675H8168k1190J20017J62157l0195g652B53882
12133B08085c65097B85008b75344e0967a2313I1244a12399A13332e1126H1683
$$ y = [210380, 238989, -117704, 183981, 126889, 141236, 113474, 183168, 105336, 276164, 214368, 480856, 55698, 106748, 252132, 190379, 489873, 219930, -9963, -17378, 344131, -6300, 340787, 286200, 124382, 417107, 372779, 267139, 154307, -208799, 69960, 227293, 289866, 232956, 152109, -58494, 206266, 283161, 132733, -103701, 193840, 92179, 152318, 330630, -185627, 46883, 50757, 175146, 295530, 33525, 248801, 275639, -14911, -102800, -3508, 82298, 111489, 267712, 392558, -101782, 118004, -18940, 6127, 21210, 30074, -60487, -48095, -58739, 233741, 305098, 287423, 88168, 66978, 186995, 349152, 318957, -7652, 253882, 208085, -365097, 285008, -275344, -50967, -12313, 91244, -112399, 113332, -51126, 81683]
12122B15133k8547q5587R3134c00634h0904B90968b0775A31615K776c7707k2533
12111f0240B78986J64125I6297b46432H6626f5932k7327A8636e4871k38999H6917
12099A8021K5160j1148h7055A9742J73868C4710J41187G6966e2732P99B98934
12087a07196b0777H7513A3405J14656a75733D31962A44069d5477j59514A25773
12076a08292D37064M26522Q64526L16540G14385l56095j40888D5172K03313r3039
12066A55446J01145A09924b98371A2033i1487L2821B32830a55276K996B84696
12055e0150A85207b7620q6697k8509F8567K29175M9098a13684A4775a73646j27427
12044c01073a5538B87496f6778A51197L20927A84603q2081a45932F0736c23377
$$ y = [215133, 186586, 100999, 194133, -300634, -80904, 290968, -20775, 131615, 134391, -37707, -60240, 278986, 443111, 96297, -246432, 86626, -65932, -93259, 18636, -54871, -293870, 86917, 18021, 43181, 32033, -87055, 19742, 193610, 34710, 175897, 76966, -52732, -51933, 298934, -107196, -20777, 87513, 13405, 128061, -175733, 431962, 144069, -45477, -204991, 125773, -108292, 437064, 863586, 1728112, 2044652, 714385, 358290, 217402, 45172, 248485, 155446, 256591, 109924, -298371, 12033, -91487, -58666, 232830, -155276, -152280, 284696, -50150, 185207, -27620, -114317, -142826, 68567, 297742, 346840, -113684, 14775, -173646, -301073, -15538, 287496, -66778, 151197, 472124, 184603, 102522, -145932, 60736, -323377]
12033a30067j98036a4879j25874A25064J2304J7381e0169l06085h2371c4448j25088
12022a59536b3921j56827C1001K9394a05197C38374c10893F05P3417Q2056J07855
12011B63933j18147h3880H42e1137A55019K66334F7977K32676K332A03930K7699
12000A31629d43755a00904l11625J64850A56362G4401i4128j2163C1175a99367
11989F1300P4598e7374j60080j75952A32408h2663l60928C7188b09199N5885P565
11978a45749A306J22078R7578b6743A04108d8042j42061B9902A1976M5888J37685
11967A95549a79739q4762A50984a68918n8519Q4476F7040J80950g6452j17190
11957a93642A70023P9996o8279b37517O4835c2560A59624o6446Q4696d50834J22511
$$ y = [-130067, -328103, -14879, -140753, 125064, 137368, 154749, -50169, -356254, -82371, -34448, -159536, -23921, -180748, 31001, 60395, -105197, 338374, -310893, 605, 74022, 156078, 263933, 145786, -83880, 842, -51137, 155019, 421353, 67977, 300653, 302985, 103930, 131629, -443755, -100904, -412529, -247679, 156362, 74401, -94128, -106291, 31175, -199367, 61300, 135898, -57374, -217454, -393406, 132408, -82663, -443591, 37188, -209199, -153314, -145749, 1306, 123384, 220962, -26743, 104108, -48042, -190103, 29902, 11976, 57864, 195549, -179739, -264501, 150984, -168918, -227437, -142961, 67040, 247990, -76452, -193642, 170023, 250019, 181740, -237517, -172682, -32560, 159624, 93178, 177874, -450834, -328323]
11946c28323D825K16205d6740j8074j56761B24864a55919H7369i9309C19455A22027
11934a67610N9501A45405c261A45575a11844H5379n502M5597b27565k14976A23776
11922D1959a423p268j80354b8937I9950f2864a189n9648a7774A66777A07a18246
11909d4424j36881e507j52183j20064C6623J5313J15696o3049m1076a17674A0695
11897E0427g0991p4947O5740a0301H8037a42589C06871d912D7929M6337a82187
11885A12648a52162j64690c7468B90066b57216h1358J5062m1317p4451j78476
11875c60540e7921F5333h8233J0740A06378L2325o211k6375O9464A0155a19634
11863d5623j63555A67183m3776h9836A28073b53438M9077A81865L1017A04757
$$ y = [-328323, 4825, 221030, -46740, -64814, -221575, 224864, -155919, 87369, -99309, 319455, 122027, -167610, -108109, 145405, -3261, 145575, -111844, 85379, 79877, 125474, -227565, -442541, 123776, 41959, -1423, -8691, -189045, -28937, 99950, -62864, -1189, -60837, -17774, 166777, 107, -118246, -44424, -181305, -5507, -157690, -277754, 36623, 51936, 167632, 104583, 63507, -117674, 10695, 50427, -70991, -145938, -80198, -10301, 88037, -142589, 306871, -4912, 47929, 94266, -182187, 112648, -152162, -316852, -37468, 290066, -257216, -81358, -66296, -107613, -182064, -360540, -57921, 65333, -88233, -77493, 106378, 138703, 132492, 106117, 175581, 10155, -119634, -45623, -209178, 167183, 123407, -89836, 128073, -253438, -204361, 181865, 212882, 104757]
11852C06533G5889K7683i5284C43457F0818a79952b1880j24176m6986A32783b23921
11840c27437C3095c79799J16358K235F8596N9646k3196c99230B2284K3038a16617
11828i9521b6751k96119A19360N4466a30006D3615a42851e369m3511D536Q3616
11817H8152m945k0820a47140D6805K0793b98166g8293A85440g6981a6151j29230
11806a45381B87573P861d15658C56833l5595p0075d5717A05999J6850b22481G1958
11794A60590a25252l37759h740j09443J1196F3330c0372l9606a8703F8110L4261
11783A02371k7641j3779J9775b0455k8656r3764E9348K49942g3503A34899a29051
11771a75856f2386k10387B44825A6510J15692a91074A37440b07091A02758g6382
$$ y = [306533, 75889, 103572, -95284, 343457, 60818, -179952, -21880, -146056, -193042, 132783, -223921, -327437, 33095, -379799, -263441, -261206, 68596, 128242, 105046, -399230, 22284, 45322, -116617, -99521, -26751, -322870, 119360, 173826, -130006, 43615, -142851, -5369, -48880, 4536, 88152, 83207, 62387, -147140, 46805, 67598, -298166, -78293, 185440, -76981, -16151, -145381, 287573, 295434, -415658, 356833, 321238, 251163, -45717, 105999, 122849, -222481, 71958, 160590, -125252, -463011, -8740, -118183, -106987, 63330, -30372, -69978, -18703, 68110, 102371, 74730, 60951, 80726, -20455, -49111, -142875, 59348, 309290, -73503, 134899, -129051, -175856, -62386, -272773, 244825, 16510, 132202, -191074, 137440, -207091, 102758, -76382]
11760a82313C86261a90123A22456d21171D2813J1483b27987a05730A05405g3561
11749B12726c6512j0579D6377e07979A11312J21429a6055A18889b82181B91079
11738i3156A8940N0401O3000B6455a0227D03205c89984D5800O1703j9318A9703
11726B647J88080a68773Q1113C65583A77760G0099d8152A98125F5407k8305p416
11715B9686b25501A81927p1290m5188D618L03390o4972c78938a45530j28770B05772
11703D8534a02901A29327O3144a07603E7837A7602J09510P0288c5787B57849i9825
11691A22480A8847c4531B3695O637a62750H4101c59205C35281j52444P2063G8428
11679A36702M9346I0784b64963D005M5148J94731a2114F2008b69901A19259a7724
$$ y = [-182313, 386261, -190123, 122456, -421171, 42813, 54296, -227987, -105730, 105405, -73561, 212726, -36512, -47091, 46377, -507979, 111312, 232741, -16055, 118889, -282181, 291079, -93156, 18940, 69341, 132341, 26455, -10227, 403205, -389984, 45800, 107503, 88185, 19703, 2647, 190727, -168773, -87660, 365583, 177760, 70099, -48152, 198125, 65407, 37102, 29686, -225501, 181927, 110637, 65449, 4618, 308008, 243036, -378938, -145530, -274300, 205772, 48534, -102901, 129327, 192471, -107603, 57837, 17602, 127112, 197400, -35787, 257849, -99825, 122480, 18847, -34531, 23695, 30332, -162750, 84101, -359205, 335281, 182837, 254900, 78428, 136702, 186048, 90784, -264963, 4005, 49153, 243884, -12114, 62008, -269901, 119259, -17724]
11667A40738J6722b56492R0406A46636L6149a52687e1320A06566r545E914K9255
11656C5169e1467A56333L90963f4649m4095A63319k09J29430a38221k4699A77653
11644g0066A29077K39209g4181j49284C84607q8608a95409A0244J19510a03918
11633a35102C24987a60889g3409a6617l4055B29518d1764n6468j79636A19441
11622a02126B60009o6921F0048j9624b25030F5299J11495H6533a382k06364B46546
11610A86076G3201a75939P7933n38m2012m0456A47788g3531H8694c29141J42801
11599a86340A72050a76995A03025C7916J72703J44421b36606J01199j96560C19483
11588C21767j37239C3945I611K51174j05671O1970p4261P7130a83717B13023J03163
$$ y = [140738, 157460, -256492, -166086, 146636, 182785, -152687, -51320, 106566, 97021, 5914, 35169, -51467, 156333, 547296, -64649, -108744, 163319, 163110, 292540, -138221, -162920, 177653, -70066, 129077, 368286, -74181, -223465, 384607, 295999, -195409, 10244, 129754, -103918, -135102, 324987, -160889, -73409, -16617, -50672, 229518, -41764, -98232, -277868, 119441, -102126, 260009, 193088, 60048, 40424, -225030, 65299, 176794, 86533, -1382, -207746, 246546, 186076, 73201, -175939, -98006, -98544, -140556, -181012, 147788, -73531, 88694, -329141, -186340, 172050, -176995, 103025, 37916, 210619, 355040, -236606, -135407, -331967, 319483, 321767, 184528, 33945, 9611, 260785, 155114, 217084, 142823, 219953, -183717, 213023, 316186]
11577C16186j52141a09074A31787J3454g2892k233c0547D10303A87599a54237
11566B9023R5984K26814a94894I4878K70837G2788B3592b5739j80971l1711b4775
11554B71832G0032L28334j44176a4922C44339b16620B35312B0081J78188Q0162
11544B78431a36888E6231K20208b1518A88167n0229l6433K1196F0634j2569P8892
11533A26957e7305D7086e6123H6075b03182A89135A3506b6547D1791M0915J34072
11522B16778n3874P8567A7329h6583D0369K33516d240F8550c50817C29308Q0664
11511D09972C7499j4090N90538k16004j15896r4128O6595j4147p1173e2303A06327
11499E95834B43769F3156K10151L2759j51341a08136B15526e9632B01730D0630
$$ y = [316186, 164045, -109074, 131787, 145241, -72892, -75125, -30547, 410303, 187599, -154237, 29023, 125007, 351821, -194894, 94878, 365715, 72788, 23592, -25739, -206710, -238421, -24775, 271832, 70032, 398366, 254190, -14922, 344339, -216620, 235312, 20081, 198269, 278431, -136888, 56231, 276439, -21518, 188167, 137938, 101505, 122701, 60634, 48065, 126957, -57305, 47086, -56123, 86075, -203182, 189135, 13506, -26547, 41791, 82706, 216778, 162904, 241471, 17329, -86583, 40369, 273885, -4240, 68550, -350817, 329308, 409972, 37499, 23409, 613947, 397943, 282047, 187919, 254514, 240367, 169194, -52303, 106327, 595834, 243769, 63156, 273307, 306066, 154725, -108136, 215526, -59632, 201730, 40630]
11488A53011o7723M5553L09080B1132c9692E70667d4698A21006c4353D19155A22894
11476C29829J568n3748n144m8524j7211L4280C1040J85392h3510D18584E9819
11464g3160A4723g0996B62023A29588a55460M6943A64914d4290C79669j24993
11454B54676r1325C2657a86108A43414N5249a94151G4938K22853h575p5911A29565
11442B39963K75856b79736J15588N1310B37312j08659L5107M14198E0766R6075
11432A46841M0772b67393d8268B2202J83579K270J15346b89125C90905j34711
11422B56194A15011a24782B87691M1875f5281A11777a84389A70790f9499I5847
11411a27691a5243k49056A08578m5757b49490C4673b11619A29951b00555B43680
$$ y = [153011, 85288, 130841, 439921, 21132, -39692, 570667, -44698, 121006, -34353, 419155, 122894, 329829, 331397, 277649, 272505, 223981, 206770, 241050, 31040, 216432, -83510, 418584, 59819, -73160, 14723, -70996, 262023, 129588, -155460, -108517, 164914, -44290, 379669, 254676, 163351, 32657, -186108, 143414, 198663, -194151, 74938, 297791, -8575, -84486, 129565, 239963, 515819, -279736, -164148, -112838, 237312, 128653, 163760, 577958, 50766, 146841, 187613, -267393, -48268, 22202, 205781, 208051, 323397, -289125, 390905, 256194, 115011, -124782, 287691, 329566, -65281, 111777, -184389, 170790, -69499, 95847, -127691, -15243, -264299, 108578, 62821, -249490, 34673, -211619, 129951, -200555, 243680]
11400a03554A08550B9582a11780A42542D804J87875A9238J02440d7780A57656
11389c5444a2813F8161b02965h2648A58923O8428i7540p1648A06384L82796A6531
11377f044A41705Q861k1921a60510H4854J70473a803C01618E5181J86410J71626
11366D13217j09474H237K6980d9666A16694B3950c46510A74071a20857l4663H1631
11354b31086A61197G7569J90356G4092f4901G4642K43826D0285b85652A42980
11343b4446m49163C5845N6725B5932J54772c33741B3742O606c48696B53792H1312
11331d5312A90645d527B6863g1003a57A46148b07042l3090b1582B27963b5280
11319b97839J39299C42689D3622a09388J3872C4884J61715C8175c32203B15748
$$ y = [-103554, 108550, 29582, -111780, 142542, 4804, 192679, 19238, 121678, -47780, 157656, -35444, -12813, 68161, -202965, -82648, 158923, 227351, -97540, -169188, 106384, 489180, 16531, -6044, 141705, 150566, 128645, -160510, 84854, 255327, -1803, 301618, 55181, 241591, 413217, 303743, 8237, 35217, -49666, 116694, 23950, -346510, 174071, -120857, -155520, 81631, -231086, 161197, 77569, 267925, 74092, -64901, 74642, 318468, 40285, -285652, 142980, -24446, -473609, 35845, 92570, 25932, 180704, -333741, 23742, 30348, -348696, 253792, 81312, -45312, 190645, -4527, 26863, -71003, -157, 146148, -207042, -240132, -21582, 227963, -25280, -297839, -158540, 342689, 43622, -109388, -95516, 34884, 196599, 38175, -332203, 215748]
11308D7580a24767p6161G8287J45381D4856e32575a73625G9915c24363f8532j65264
11297b33796A87618N9684d354j1265D7275h0643A16996a7341k22756P6839m2436
11286b05694B3989I880g6641I2255g027k45889J11216F8907b61952h4483j62385
11275b46868A60288f5023k1483o0274n4764A16655K6575l8714c1212p787p7774
11264a16773A13530b37613c4640j13295b2546r5538A45604I322J34809d9697J013
11253d8684j70579j17083C5951b46766A78533q6298P0135b63912a01231p5465
11243a76696k0225j04117J46184A21198N2580e0505k86931a03991d1076E7489
11232I414J7188e8755j42834g0370C1668a16233e0566A76065G3827f0271k67441
$$ y = [47580, -124767, -200928, 78287, 223668, 44856, -532575, -173625, 79915, -324363, -68532, -233796, 187618, 247302, -4354, -15619, 47275, -80643, 116996, -17341, -240097, -163258, -205694, 23989, 9880, -76641, 92255, -7027, -252916, -141700, 68907, -261952, -84483, -246868, 160288, -65023, -86506, -146780, -201544, 116655, 143230, 104516, -31212, -38999, -116773, 113530, -237613, -34640, -147935, -22546, -118084, 145604, 9322, 144131, -49697, -48684, -219263, -336346, 35951, -246766, 178533, 92235, 162370, -263912, -101231, -176696, -196921, -301038, -154854, 121198, 173778, -50505, -337436, -103991, -41076, 57489, 9414, 26602, -58755, -201589, -70370, 31668, -116233, -50566, 176065, 73827, -60271, -327712]
11221c27712a36460L8430j4340A3253K9030d2134j23698L0619k6389A18256f2018
11209F6010j001J80572A18149a58716p007A09239J13509a91259m0145A0863a96693
11197a0354o9729B44198b17640k4541B57520A06412L9330C3545e6638l50185B4239
11185b77922f4921p7517B45936b71421h6935k32923B48178F4398L538c01453a10632
11173A33645D3445a6928A07031i6483L7584A9291e2470B60420a49236c6002i16
11161d4010G90a73672k0920n3438A7566c44823b5595C9969b6360A44540a03855
11149b34417J10231e5457i153k46935O6027L8213j63515J08555A74477E4953P1497
11138A26450d4547B99478c20476Q3886a9880F2633K7563C1940K42310K35652G5983
$$ y = [-327712, -136460, -98030, -112370, 13253, 42283, -42134, -165832, -135213, -161602, 118256, -62018, 66010, 65009, 245581, 118149, -158716, -165723, 109239, 222748, -191259, -231404, 10863, -196693, -10354, -80083, 244198, -217640, -242181, 257520, 106412, 145742, 33545, -56638, -406823, 24239, -277922, -64921, -142438, 245936, -271421, -86935, -319858, 248178, 64398, 67936, -301453, -110632, 133645, 43445, -16928, 107031, -96483, -58899, 19291, -52470, 260420, -149236, -36002, -916, -44010, 790, -173672, -194592, -248030, 17566, -344823, -25595, 39969, -26360, 144540, -103855, -234417, -124186, -55457, -9153, -256088, -190061, -151848, -315363, -206808, 174477, 54953, 126450, -44547, 299478, -320476, -236590, -19880, 62633, 90196, 31940, 274250, 509902, 75983]
11126f5403I4593a1825k19320B65163j09949a52070M6450l2645D64833A18145
11115B26939q2202n868a50928g1123B76575n8012J93531A93843g5841B87139e901
11103A10571a82308C75731J19465C8134J75354k0566B2066J25442G3431M1479
11093A14910l5011K36580J8830C5877J49628f6181C1515M24286j96148G6140N8716
11082A34856B7251K34871A961K98504P4993j59432K19665j5574J750j90313O3903
11071B95457J46764H4235K33533K01938Q6610k54862K59034k82311L65309H0287
11060E52598j10529j34644M26687l65596k2720M16361J60271m10083J02604J23546
11050G38495K91373m64490J0342K18760j20965j47883K23679M90963n69069J92034
$$ y = [-65403, 94593, -11825, -231145, 265163, 155214, -152070, -105620, -138265, 464833, 118145, 226939, 144737, 138869, -150928, -71123, 276575, 218563, 412094, 193843, -75841, 287139, -5901, 110571, -182308, 375731, 495196, 38134, 213488, 192922, 22066, 147508, 73431, 114910, 79899, 316479, 335309, 35877, 185505, -66181, 31515, 455801, 259653, 76140, 134856, 27251, 262122, 1961, 300465, 375458, 216026, 435691, 420117, 421867, 231554, 295457, 442221, 84235, 317768, 519706, 606316, 351454, 610488, 328177, 693486, 80287, 552598, 442069, 307425, 734112, 368516, 345796, 762157, 922428, 512345, 614949, 738495, 1029868, 565378, 575720, 794480, 673515, 525632, 749311, 1240274, 671205, 863239]
11040H63239l99635O72983j96950l47460K35697j0803J35448j12655m7135J39454
11030I32183l76413j9910M26280j56462J00970j26212J95284j4785k26513M2026
11020G76448n1940q8515J86735M6121q3287L0676j91290o0030J27881k27155J30318
11009E95962R4520j09618J20229L1071N895J06890j84821J04210L2220j15760
10999F80798K03641r3122J75774j67864J00961l52819J82556j26825q9534J76655
10989F90221K38218m41495K43190q1673J56231L2787M73360m06902N26683n0711
10979A379909K29323l6732k62562P47774j71823M56257K24804L33813j07205K92539
10969C086097j40990k7168o6615l03001n07875k4887O8363k04738m6947K57274
$$ y = [863239, 463604, 1136587, 939637, 592177, 827874, 817071, 952519, 839864, 792729, 932183, 555770, 535860, 962140, 805678, 906648, 780436, 975720, 960935, 734422, 776448, 724508, 635993, 822728, 868849, 785562, 816238, 624948, 564918, 692799, 465644, 595962, 690482, 580864, 701093, 732164, 738059, 844949, 660128, 764338, 796558, 680798, 884439, 791317, 967091, 799227, 900188, 547369, 729925, 603100, 513566, 690221, 928439, 486944, 730134, 648461, 804692, 837479, 1310839, 903937, 1430620, 1379909, 1609232, 1572500, 1309938, 2057712, 1885889, 2342146, 2566950, 2900763, 2793558, 3086097, 2945107, 2917939, 2851324, 2548323, 2040448, 2015561, 2083924, 1879186, 1832239, 2089513]
10959B089513k22853L2076J44176K1827p0224R565m28123p2886j01084m32146
10949I69841n3160k27890N6613l50360L51307l55144J50001a87005I3874J90470
10939B84344N31424B89483A5565K18949n9602N9021o3688o3543J7322K09508p4772
10928B58760B1385O413e6158J3028G1807M9966n0546L44282o4071i8158K8412
10917f9746j10924A69052c9147j96938I0730F299c5109j53781h5716A4208c27798
10905A86714E2679O4913c08802B04274b43348R5130j28178C2154b49742G7214
10894a77834B18121A0017c39121e7828C9958i1207r1421G6745J51667r2848O7465
10883B03029a80318C92647j65803g0953A85941m5984F1627B4715c26773h3258
$$ y = [2089513, 1866660, 1898736, 2042912, 2064739, 1994515, 2004080, 1575957, 1503071, 1401987, 969841, 916681, 688791, 745404, 395044, 746351, 391207, 541208, -187005, 93874, 284344, 815768, 289483, 15565, 234514, 174912, 233933, 170245, 106702, 124024, 333532, 258760, 21385, 27798, -56158, -43130, 71807, 121773, 71227, 415509, 351438, -98158, -69746, -180670, 169052, -39147, -236085, 90730, 6299, -35109, -188890, -85716, 14208, -327798, 186714, 52679, 117592, -308802, 204274, -243348, -148218, -276396, 32154, -249742, 77214, -177834, 218121, 10017, -339121, -57828, 39958, -91207, -182628, 76745, 228412, 135564, 203029, -180318, 392647, 226844, -70953, 185941, 139957, 61627, 24715, -326773, -83258]
10872a47010A91848m4387b14963C97400a81533F8300a58979k12616g2677H2411
10861A22229a41150J9653m9564A6690a5715A99272b79528C6938f1415l48392a68064
10849A53754c1001B92594a66316E4448c83746B8944c4299A37698n8111k287J1163
10838H8463c44494C2554J4186K04183f0533A34062h6060n9206e2163I7654l800
10827I3854a4958D3635d1695j00000j08016E2579a25396N3421K4321C20299k3366
10816B96933I1282N3380J69392F4362c44300i1337j58977p4689a37211M8345j95981
10805b84847d7197j10546j58167J09172B00173P6805a15961a4792m230l35471
10795c54493a29544r4953m1711A46947o1303b3363k31749E0724b45358D387a90455
$$ y = [-147010, 191848, 147461, -214963, 397400, -181533, 68300, -158979, -371595, -72677, 82411, 122229, -141150, -121497, -171061, 16690, -15715, 199272, -279528, 36938, -61415, -409807, -168064, 153754, -31001, 292594, -166316, 54448, -383746, 28944, -34299, 137698, 79587, 77300, 88463, -344494, 32554, 46740, 250923, -60533, 134062, -86060, -145266, -52163, 97654, 93854, -14958, 43635, -41695, -141695, -249711, 52579, -125396, -71975, -47654, 320299, 296933, 91282, 144662, 314054, 64362, -344300, -91337, -250314, -325003, -137211, -88866, -284847, -47197, -157743, -315910, -206738, 200173, 276978, -115961, -14792, -19022, -354493, -129544, -224497, -266208, 146947, 85644, -23363, -255112, 50724, -245358, 4387, -190455]
10783b30955C5978b87389c045n13979K19429a07509n5253m8418j3058B21975D9847
10771a72241I0237a75839A71159k2191N8165h6006r5495N5131N9447l8696l9185
10760a44804k95988B74019h470q5798J3207I9189Q0600G8819O0000A3783b99037
10748F9094K87124A32820a34941d5542r6896d3381j16644A40517K33599b95824
10737F8572a52791n3470d9088B52179A20771O5905g1718A39590j9455a69489q4613
10726b54102K9266K3926L9714E1310g8526j63125A29893f4766k24050a32195B20433
10714D36770f782A77186i8112a0070k14341H6348J79279j13410a27415F5232M9034
10703A14266K32001a26357o5068d747E7475B5439J37039a97675d659k09290A36184
$$ y = [-230955, 35978, -287389, -3045, -517024, -297595, -107509, -162762, -211180, -224238, 221975, 49847, -172241, 90237, -175839, 171159, 148968, 207133, -86006, -181501, -126370, -66923, -105619, -144804, -440792, 274019, -8470, -94268, -81061, 99189, 179789, 78819, 138819, 13783, -299037, 69094, 356218, 132820, -134941, -45542, -142438, -43381, -160025, 140517, 374116, -295824, 68572, -152791, -206261, -49088, 252179, 120771, 186676, -71718, 139590, 120135, -169489, -254102, -224836, -200910, -161196, 51310, -78526, -241651, 129893, -64766, -288816, -132195, 220433, 436770, -6782, 177186, -98112, -10070, -224411, 86348, 265627, 152217, -127415, 65232, 114266, 346267, -126357, -191425, -4747, 57475, 25439, 162478, -197675, -4659, -213949, 136184]
10691A93251c74588I3705a00323G3857k2183L16097A9289a21496F0221L87488
10681D47709j89286a03978r6390N2999m245n7368H4913b14623A51430b62747c0166
10669b4538r3129A17787K09645a47080D6396a84781C35001g951k76929A2895J46651
10658A59546a12373G1706i598k00940J60b36j65969r6524J27940q0271R2399a5959
10645a313A28997d85475a21594k3265a8229A45645a02048H4459f6320A2447b51156
10633b40424L1471G8655F717a794j10080L8455B30315J65098A22183e4413j38653
10622a93066K7514A20437b82279j53426c2855p0503H1210h4256I9851J68332E1431
10610d6245J1994C3132c2984i074A37258a6691I3546J38612d1651A65667e6638
$$ y = [193251, -374588, 93705, -100323, 73857, 51674, 367771, 19289, -121496, 60221, 447709, 258423, -103978, -200368, -147369, -151614, -208982, 84913, -214623, 151430, -262747, -30166, -24538, -117667, 117787, 327432, -147080, 46396, -184781, 335001, -7951, -284880, 12895, 159546, -112373, 71706, -9598, -210538, -210378, -236, -166205, -262729, -134789, -215060, -122661, -15959, -1313, 128997, -485475, -121594, -144859, -18229, 145645, -102048, 84459, -66320, 12447, -251156, -240424, -208953, 78655, 6717, -1794, -111874, -73419, 230315, 395413, 122183, -54413, -193066, -165552, 120437, -282279, -435705, -32855, -103358, 81210, -84256, 99851, 268183, 51431, -46245, -34251, 33132, -32984, -9074, 137258, -16691, 93546, 232158, -41651, 165667, -56638]
10598a07001n03465e9685J7160r5057j35327B36899d7979a001E2428f6381F3632
10586b2942k24275R9615m1223b0851F367f8663A77051a04318M9601B45358P5772
10575C21130a07888k06444a40625A2634e6268m9572L4049K4549C13452B1441O9976
10564I1417c47347B6776N7843L5732d77736J04394O2861B2663a81766a8491C1133
10552C90232h181B6901b04367l7944a12249k2183j75060A03887A6440N8055L4054
10541A08549K605c77085a4154q1586A99936g3985r4165b9279k1658r7743P3010
10530g5670H061K2163f8135G0970b0840A70829J16769a90109A65204a66467G1803
10518c06676O8429B62412b47568A0994J43532a08182K7768I682a65977e9708A21927
$$ y = [-107001, -610466, -59685, -42525, -137582, -272909, 236899, -47979, -1001, 52428, -66381, 63632, -22942, -247217, -147602, -188825, -20851, 6367, -68663, 177051, -104318, -54717, 245358, 321130, -107888, -314332, -140625, 12634, -56268, -105840, -71791, -47242, 313452, 21441, 91417, -347347, 26776, 84619, 120351, -477736, -373342, -310481, 22663, -181766, -18491, 31133, 390232, -8181, 26901, -204367, -242311, -112249, -134432, -309492, 103887, 16440, 74495, 108549, 111154, -377085, -14154, -95740, 199936, -73985, -168150, -29279, -50937, -148680, -75670, 8061, 30224, -68135, 70970, -20840, 170829, 287598, -190109, 165204, -166467, 71803, -306676, -238247, 262412, -247568, 10994, 154526, -108182, -80414, 9682, -165977, -59708, 121927]
10506a76704k0619E8728K3426h34F9224C1008J48467G973a91918k5363l2041i5878
10493b9064k63490D0530c5394A2568c32329A89820c595k54176m6675I0064J07887
10482A97951O713j3485K89458L0412k7663n1184j53196J37454j94308k3881A8194
10470A68180a39599D85990J31695B50973F5188b54659N2047f2636A3573a7059
10459c2353q9535l36586A03192a04173C938J78178o3824M8672d9685j57935C20923
10447B38157c9890C94548a6242j79458I0807l9529g7754c5467A3371b05301C9280
10435A63225C972a56344A34727L9578D0905a82025A38638f822q4929l693C7492
10423b21780a1899m6050k4086k41756B1226e0343B6185b01674B61509C8191J1321
$$ y = [-176704, -197323, 58728, 82154, -834, 69224, 31008, 179475, 7973, -191918, -217281, -249322, -95878, -29064, -292554, 40530, -35394, 12568, -332329, 189820, -3595, -257771, -304446, 90064, 197951, 204664, 191179, 480637, 511049, 483386, 432202, 279006, 416460, 222152, 198271, 18194, 168180, -139599, 485990, 617685, 250973, 65188, -254659, -202612, -62636, 13573, -17059, -32353, -121888, -458474, 103192, -104173, 3938, 182116, 118292, 166964, -49685, -207620, 320923, 238157, -39890, 394548, -16242, -195700, 90807, 51278, -77754, -35467, 13371, -205301, 39280, 163225, 3972, -156344, 134727, 174305, 40905, -182025, 138638, -6822, -91751, -95444, 37492, -221780, -11899, -57949, -82035, -323791, 21226, -50343, 26185, -201674, 261509, 38191, 49512]
10412D9512O5153C6493j7542J37111c60753d2508l2805j69355A56740J3980k0327
10401A50393n5415j1137L3254J19395B8459g429n9744c2705j16798I346J01246
10390A10592J09214g586B38776E2969j6545L7108J3475d480C98735j35944H3237
10378c8649C37074j1105D3549J08051g4087A83126n900J46531q3384n4258L72900
10367E59015j79864R3127j28568j6738L19483j52232L8362A29945J03922J53281
10357C87148A65133K5890B9540J18975J02683J64302m7705L34123B05858M12878
10347F18736k64325K7988j22159k2584J07037M1608j02872J53310A77940k3114
10337A54826J77260A12653J21574A544a08792m15D53632A66469o2879J26001A10470
$$ y = [49512, 114665, 36493, 18951, 156062, -360753, -42508, -75313, -244668, 156740, 170720, 150393, 94978, 83841, 117095, 236490, 28459, -7429, -67173, -32705, -149503, 9346, 110592, 219806, -7586, 238776, 52969, 36424, 73532, 87007, -4480, 398735, 262791, 83237, -38649, 337074, 325969, 43549, 151600, -74087, 183126, 177226, 323757, 240373, 186115, 559015, 379151, 472278, 343710, 326972, 646455, 494223, 532585, 129945, 233867, 387148, 165133, 191023, 29540, 148515, 251198, 415500, 367795, 701918, 205858, 618736, 354411, 382399, 260240, 237656, 344693, 386301, 283429, 436739, 177940, 154826, 332086, 112653, 234227, 1544, -108792, -109207, 453632, 166469, 103590, 229591, 110470]
10325i3770A82496P7213j15633J59899f792B63735a03415c322B61473F9945J29744
10314A99689A4064N3393L37406C6918M436M0783a96795Q9230A2589d7315j3091
10303f0406j72822Q4789n6001b0445A79418F1655a7531j29801a0170p850D2841
10291g4627j22710B39498H4649b05638A99009e9167H3212c57615G6071a40438
10280g945r146k4721G9740k9222K11280d6223B63885M9996F3601B2874R2120m3861
10268G1133c88602a91476A12657a72156E2845a29243A37844d02877a19849B42948
10257B46710o2736N68255k50844j33926A04956J63842g1730h152r0217k31646
10247c30015D9933A0262b26548n6037j43396B3252K23544a90640A12817d2238
$$ y = [-93770, 182496, 259709, 144076, 303975, -6792, 263735, -103415, -3322, 261473, 69945, 199689, 14064, 67457, 404863, 36918, 41354, 82137, -196795, -107565, 12589, -47315, -60406, -233228, -148439, -204440, -20445, 179418, 61655, -17531, -147332, -10170, -18020, 42841, -74627, -197337, 239498, 84649, -205638, 199009, -59167, 83212, -357615, 76071, -140438, -7945, -17091, -41812, 79740, 50518, 261798, -46223, 263885, 313881, 63601, 22874, 114994, 71133, -388602, -191476, 112657, -172156, 52845, -129243, 137844, -402877, -119849, 242948, 246710, 183974, 752229, 501385, 367459, 104956, 268798, -71730, -8152, -98369, -330015, 49933, 10262, -226548, -282585, -425981, 23252, 246796, -190640, 112817, -42238]
10236a44273A20780j805c25391a6886A86469c7520r6754j07402B91764j29961
10226A61803a07850E9014a33646B02911a03274j92746O8952B54471a2892r8514
10216a11406A9880a61758P5726c6633A15870b83579A53486C6517i8406k4366j4236
10205a37008A8815a69301B03937A3368C201O9974c99500a8572C655e8287A20627
10193c62194a49839d2555j56828F0109a9877r3866m1054K0147D9601a88108B31908
10181C4360a40625p1279c9767G1799h4388K2216o986j6163q4693e2970j00741
10170a53711g2661B73789f7645B84588a4396q6916A6236P1184a39773K3094M9282
10159f7397A3856a43134K3341j51629i7783B14699b62409R97C5315i7777p0669
$$ y = [-144273, 120780, 118975, -325391, -16886, 186469, -37520, -134274, -241676, 291764, 161803, -107850, 59014, -133646, 202911, -103274, -296020, -227068, 254471, -12892, -111406, 19880, -161758, -86032, -36633, 115870, -283579, 153486, 36517, -98406, -122772, -137008, 18815, -169301, 203937, 13368, 3201, 73175, -399500, -18572, 3655, -58287, 120627, -362194, -149839, -42555, -199383, 60109, -19877, -113743, -154797, -134650, 49601, -188108, 231908, 34360, -140625, -211904, -39767, 71799, -84388, -62172, -69158, -85321, -170014, -52970, -153711, -72661, 273789, -67645, 284588, -14396, -101312, 16236, 87420, -139773, -116679, -67397, 13856, -143134, -119793, -271422, -97783, 214699, -262409, -261412, 35315, -97777, -168446]
10148a68446N1546a7833j91147c1378m1810j83563J06879K7921q6548b9451A16560
10136c48366h461A8727L8647c10205J05742H6248c13009A36057a33098H583a20346
10124a707j11803p6409K6342n2764D915h6689A89616I0160k6896a20935j09916
10113b30851a13666p0836A79614I129K9603A3821M7176P2043h3942G1016b37061
10101B86284D0575j4331h3611A76355a40448M5563A38684K11658d8582l4982K127
10090h1437C98085A4408a33831F2982J54455C3580b5075j17907f019j02084L4772
10079g3331o1885I8901K8225a23943n588n1972m1554L5572o4181J03424n822O0515
10067i3549a5620j49228l9016A90650a21478c7399I1225a19831l9196A46735d4939
$$ y = [-168446, -116900, -17833, -208980, -31378, -73188, -256751, -149872, -121951, -208499, -29451, 116560, -348366, -8461, 18727, 57374, -310205, -204463, 86248, -313009, 136057, -133098, 8583, -120346, -1707, -113510, -189919, -163577, -216341, 4915, -86689, 189616, 90160, 63264, -120935, -230851, -113666, -184502, 179614, 9129, 38732, 13821, 60997, 133040, -83942, 71016, -237061, 286284, 40575, 26244, -83611, 176355, -140448, -94885, 138684, 350342, -48582, -83564, -81437, 398085, 14408, -133831, 62982, 217437, 33580, -25075, -142982, -6019, -108103, -73331, -135216, 98901, 127126, -123943, -129531, -181503, -223057, -187485, -251666, -148242, -154064, -93549, -15620, -164848, -203864, 190650, -121478, -37399, 91225, -119831, -159027, 146735, -44939]
10055B92697I5421a96420G7936a98400A26669i9873k36187a27038l4511g1142
10044D1630b71595c9706J9535k03438k5851D6113a09280A59751a39843A04490
10033b47586a00849a4792j04777A58946d5549B79752I4851a77975E8685R1681
10023A50366c22186B7027c37055B13673m4240a6465j5673q6467a7029A0301N024
10012A5325d09162G9189N8738f9650r9957q0721A2850K62928b92837p1619J63769
10001b00687K6222k00527M1377J2756i3051A5234g9457G5677b37071P7706m0158
9990a99523M6171f6643C6568L9859a0178l04659E7784k740J18426d3307j0558
9979e3865j58118A33254C772e5648p5750d9832K0258A51345p0760j9981M4522
$$ y = [292697, 95421, -196420, 77936, -198400, 126669, -99873, -336060, -127038, -161549, -71142, 41630, -271595, -39706, -20171, -223609, -249460, 46113, -109280, 159751, -139843, 104490, -247586, -100849, -14792, -119569, 158946, -45549, 279752, 94851, -177975, 58685, 150366, -322186, 27027, -337055, 213673, 169433, -16465, -32138, -118605, -17029, 10301, 15325, -409162, 79189, 137927, -69650, -169607, -250328, 12850, 275778, -292837, -364456, -200687, -174465, -374992, -333615, -320859, -93051, 15234, -79457, 75677, -237071, -159365, -199523, -153352, -66643, 36568, 76427, -10178, -314837, 57784, 55044, 173470, -43307, -53865, -211983, 133254, 3772, -55648, -131398, -49832, -29574, 151345, 80585, 60604, 105126]
9968A05126D8861a56974A23694b82815p2107B8769e8146K5576i767A42969i9079
9956h7363j17044i0k3958l12039A54036e79605a85749A15082K760B9830L4018
9945F3848c42673a5141A22177J3674c1723j03109f3761N028C1928a14889J1938
9934a02951B37584a19533e219k74128N8698E1305K8187a97859d1389j69903R8777
9923a12515k56619E3212b1278I3230a69411B0153a55253o6876A98351f3807j050
9912f4857q9515r0486B07002h7122B66600a48074j15803j30278J58462a13088
9901a64087a4805O160j16805e9756j58057B45665b92679R9240e3591o2038k40556
9890c56185G726J66806f0457k63120a31298M143c8580A57629a43219r8566H7262
$$ y = [105126, 48861, -156974, 123694, -282815, -354922, 28769, -58146, -32570, -9767, 142969, -99079, -87363, -204407, -90, -24048, -336087, 154036, -579605, -185749, 115082, 117842, 29830, 63848, -342673, -15141, 122177, 135851, -31723, -134832, -63761, -58733, 31928, -114889, -102951, 237584, -119533, -5219, -279347, -220649, 51305, 79492, -197859, -41389, -211292, -112515, -369134, 53212, -21278, 93230, -169411, 20153, -155253, -222129, 198351, -63807, -64857, -154372, -244858, 207002, -87122, 266600, -148074, -263877, -394155, -235693, -113088, -164087, -14805, -8645, -125450, -59756, -217813, 245665, -292679, -193439, -53591, -115629, -356185, 7726, 174532, -60457, -323577, -131298, -127155, -38580, 157629, -143219, -241785, 87262]
9878b86899J31008p1489R7041k47405F1395B1834i8429F2217a869G8179J87606
9867B65785e1414B6794a29598B88487a4188q437j16339m2498A25836d9698K1916
9856b7782A3903a48242n9613O4262k5314p9722q4856A74774b488k11090G4344
9844a1302F0192c43669a03129j05043B24210c43793H7962g5136c3919j04174M5180
9833i2913D8083a68177N8943k49931E2068f8652B86523a47847F8841c45814J10286
9822b35528c222j20851l3790D3281R6742c5098j54785c6529j67626R3727j62945
9811b73373J29971A60774f4093b4373B29492c298k7498l5870B9498J22293a56292
9799a60469j90079A92667b73366J33932j6408g6821L4150k59387e7953a3091A34413
$$ y = [-286899, -155891, -227380, -130339, -377744, 61395, 21834, -98429, 62217, -1869, 78179, 265785, -51414, 26794, -129598, 288487, -14188, -22625, -138964, -181462, 125836, -49698, -27782, 13903, -148242, -207855, -143593, -168907, -248629, -333485, 174774, -2488, -213578, 74344, -11302, 60192, -343669, -103129, -208172, 224210, -343793, 87962, -75136, -33919, -138093, -92913, 48083, -168177, -109234, -359165, 52068, -68652, 286523, -147847, 68841, -345814, -235528, -3222, -124073, -157863, 43281, 140023, -35098, -189883, -36529, -204155, -110428, -273373, -143402, 160774, -64093, -24373, 229492, -3298, -30796, -66666, 29498, 151791, -156292, -160469, -350548, 192667, -273366, -139434, -155842, -76821, -42671, -302058, -57953, -13091, 134413]
9787B38408b49308A64099D0673J53992b23762A32466M10385e36082a32265A27362
9776a43157d1405A20484K0430a47150L9810o0864B575a71548C5775a60307a8165
9764g990G2612a97180A1411i4599A95811e313k23643Q4759L0860b3432A89091
9752a60504A91809b53262A02578i656l3037A10965K25534b4473j50422g085G3010
9740f0352o074B24653F8851a59970N1192j58884b6013k49747f7020q8739A32688
9728C5460a48541n9883P3879D99681e3005l9624k67662Q3347C2006b6365A06753
9716a95052n5758Q9055K1733o1644b3162A82523e4528q4400H4589e7400j32767
9705a90167B7386J87805A1008K63403c39281E938J53587D3849d11662g0957F6275
$$ y = [238408, -249308, 164099, 40673, 194665, -223762, 132466, 542851, -536082, -132265, 127362, -143157, -41405, 120484, 140914, -147150, -107340, -168204, 2575, -171548, 35775, -160307, -18165, -7990, 72612, -197180, 11411, -94599, 195811, -5313, -228956, -144197, -113337, -23432, 189091, -160504, 191809, -253262, 102578, -9656, -42693, 110965, 336499, -24473, -174895, -7085, 73010, -60352, -66426, 224653, 68851, -159970, -108778, -267662, -26013, -275760, -67020, -155759, 132688, 35460, -148541, -208424, -134545, 499681, -53005, -92629, -360291, -276944, 32006, -26365, 106753, -195052, -250810, -161755, -140022, -201666, -23162, 182523, -54528, -138928, 84589, -57400, -190167, 27386, 215191, 11008, 274411, -339281, 5938, 159525, 43849, -411662, -70957, 66275]
9693a2934H90b63062J12264j60613a02635D0858e0061p9287F0299a81274M9623
9682a31651B50090q4504b89252D48830b89230f8494F4246B1958M9328g0203j7738
9671h7941D4042K0759b36395A73648J30813e1419m8527H0455J45620b03254R1554
9660a11700C09172A15347b64000J28985c626j23700A09886h6003r4805A50692
9649a70626e4517k7956k55444a29300k83929A05856Q4533d33951C5440b15809
9638c0296j8665j06675A1975a88231A7929a51372A53277c14900I1107e6842A63060
9626A35445k5455D9519J19576R6171b28371e5210j2632j26708k46791a69800L9732
9615a30068n4837o4028c9607j86932L8357k38338A63566l1883C5905A3260b00140
$$ y = [-12934, 890, -263062, -150798, -311411, -102635, 40858, -50061, -129348, 60299, -181274, -131651, 250090, 165586, -289252, 448830, -289230, -68494, 64246, 21958, 71286, -70203, -87941, 44042, 64801, -236395, 173648, 304461, -51419, -99946, 80455, 226075, -203254, -111700, 309172, 115347, -264000, -135015, -3626, -127326, 109886, -86003, -180808, 150692, -170626, -54517, -82473, -337917, -129300, -413229, 105856, 190389, -433951, 35440, -215809, -30296, -48961, -155636, 11975, -188231, 17929, -151372, 153277, -314900, 91107, -56842, 163060, 135445, 109990, 49519, 169095, 265266, -228371, -55210, -67842, -194550, -441341, -169800, -130068, -184905, -248933, -39607, -226539, -188182, -426520, 163566, 131683, 35905, 13260, -200140]
9603B09730a80392D41764a58626j75172h731A59523b0228k728j54718M2618k9958
9592a65014N9969J9157C8593c8662p5299J0445G8632a00541B47419a11856k69164
9581c81020n4174A57987a55164g6425l1895K3477k9574j3435k91230J26423A82656
9569a98766j4456K5403O6554k08385A13181B7088o900a3788n866l33209N1018
9558c01845J32897l6298I5389a7735r3236k23949B1920a50319G5219N5882D8330
9546C261a86235h9055j78319I0349a21535D0505a783q9294k30243a20412B48243
9534i6887c4991j41550J7093j06913R1581E7969i5244L3407A73076b05956L1002
9523a74954N7735l02186R5343a08691k4513C0692a97357g796r8205G4837b04239
$$ y = [209730, -180392, 441764, -158626, -333798, -8731, 159523, -20228, -22956, -177674, -135056, -165014, -105045, -85888, 38593, -38662, -113961, -103516, 78632, -100541, 247419, -111856, -381020, -435194, 157987, -155164, -76425, -108320, -84843, -114417, -127852, -419082, -292659, 182656, -198766, -213222, -187819, -121265, -329650, 113181, 27088, 20188, -13788, -19654, -352863, -301845, -168948, -205246, 95389, -17735, -110971, -334920, 21920, -150319, 75219, 131101, 48330, 3261, -186235, -89055, -267374, 90349, -121535, 40505, -1783, -91077, -321320, -120412, 248243, -96887, -34991, -176541, -159448, -266361, -174780, 57969, -95244, -61837, 173076, -205956, -174954, -117219, -419405, -324062, -108691, -133204, 30692, -197357, -7796, -106001, 74837, -204239]
9511A91989D4942b18739j21493P0241J30641I0809f0482F9682a35112k17049a08340
9499f8681j67531e0673l9546k07801j3306R7851b2401B38328a6930k48284I7685
9487G624d5814k66695N2837e0264o5477A52744c48062i3957B85121j37072N2162
9476B00211H8964a68439m547B23169a23255N0510O507J8027k9758J8888E0106
9464C22591A8510J25160K05814f4278C3586b4172q4324j40696i0216p0495f0346
9452I3585j6544a54559c8179l907n429j24306F5692b84012Q1982A6683b20332
9440E4013B086d01500E3531H810d3636A8707J5445d81140i5319A46474f092n9241
9428f5333j69387F7156K7497l429K2835D4391d5159D4231J57379h8816E1045a50139
$$ y = [191989, 44942, -218739, -340232, -269991, -139350, 90809, -60482, 69682, -135112, -352161, -108340, -68681, -236212, -50673, -90219, -298020, -311326, -213475, -22401, 238328, -16930, -265214, 97685, 7624, -45814, -312509, -259672, -50264, -115741, 152744, -348062, -93957, 285121, 148049, 200211, 88964, -168439, -172986, 223169, -123255, -72745, -66238, -48211, -77969, -59081, 50106, 322591, 18510, 143670, 349484, -64278, 33586, -24172, -108496, -249192, -90216, -160711, -60346, 93585, 77041, -154559, -38179, -42086, -47515, -171821, 65692, -284012, -202030, 16683, -220332, 54013, 2086, -401500, 53531, 8810, -43636, 18707, 34152, -481140, -95319, 146474, -6092, -65333, -234720, 67156, 94653, 91224, 114059, 44391, -45159, 44231, 201610, -88816, 51045, -150139]
9415B55745i165p1302A16766f1498j50523j58341a39590L7975A08879a89778A32291
9403E1307B0193d9104a4966B26020C7310b92188m4099a38635B74390e6719j7964
9392g4683k4640j65405Q0561c9939b033j66563k04638B6306a90846r351C54156
9380c9358m21667b11862m0866D7902a59550B3709M312a77315j47508f1997k62598
9369c24595A0100b30241q8658B06867n0453a37550k8598j57609N9510a04479j58290
9358b62769e451l43800h3145C499i5260B75059A14113a33893A2038a58114e7465
9346a30814A90941m0920b1015F339L36653D8521k1836O0523B4524c3445o2726
9335i6171d5669E4317a23625d595j69233G924N1784a40234N6085j81225B91762
$$ y = [255745, -9165, -80467, 116766, -61498, -212021, -370362, -139590, -101615, 108879, -189778, 132291, 51307, 20193, -49104, -14966, 226020, 37310, -292188, -336287, -138635, 274390, -56719, -74683, -99323, -264728, -184167, -39939, -2033, -168596, -373234, 26306, -190846, -200197, 354156, -39358, -461025, -211862, -252728, 47902, -159550, 23709, 28021, -177315, -324823, -61997, -324595, 10100, -230241, -318899, 206867, 156414, -137550, -166148, -323757, -264247, -104479, -262769, -5451, -349251, -83145, 3499, -95260, 275059, 114113, -133893, 12038, -158114, -57465, -130814, 190941, 150021, -21015, 6339, 342992, 48521, 26685, 87208, 24524, -33445, -96171, -45669, 54317, -123625, -4595, -173828, 7924, 59708, -140234, -84149, -265374, 291762]
9323d8046K0224l66288m801a38195A51881a37851l32006c3776j52475B56674A26307
9311a21107A68a0801k48590j6504f2453A55672b60188K4666A0682O9163a13963
9299G630P9834d04559B5024a79617g8419K4541l02138a75647N7565l4502N0967
9288a01617c6421j22367l53834E9882a74158j13554i3443B38465F280a53678I45
9276A05127h7220L0430H1948b00985N0522B56251a73831M1564O5286j69266m9450
9265b85697a41295G8312c56764a48151o1236h9378o6782k5050M0503o884f1451
9253a85373D5013J20163A6769J06609g3787j25686h5898g574n09B71871c45034
9241a77219I4639b46071A22075c09574A58174G1030k0694a25667A95007a85617
$$ y = [-48046, -27822, -394110, -398911, -138195, 151881, -137851, -469857, -33776, -186251, 256674, 126307, -121107, 168, -10801, -259391, -275895, -62453, 155672, -260188, -235522, 10682, 79845, -113963, 7630, 87464, -404559, 25024, -179617, -78419, -53878, -356016, -175647, -118082, -152584, -101617, -36421, -158788, -512622, 59882, -174158, -287712, -93443, 238465, 6280, -153678, 945, 105127, -87220, -56790, 81948, -200985, -150463, 256251, -173831, -132267, -66981, -236247, -285697, -141295, 78312, -356764, -148151, -209387, -89378, -156160, -181210, -140707, -147591, -61451, -185373, 45013, 165176, 16769, 123378, -73787, -199473, -85898, -7574, -8083, 271871, -345034, -177219, 94639, -246071, 122075, -309574, 158174, 71030, 50336, -125667, 195007, -185617]
9230f7827C87655A0480K29644a36527A16859l2141f542j33363j39245a8501j42578
9219a61079O9467B95404B087b11743B94998j18662L877a55920F200i2002p0717
9208a62719c3902l52472b7597k7422k34804a06110j89929a1867j43194A15184
9197a15871k9534A19605m6543a30641j07140E1157c13269B27011h3562l52598
9187d36160a28462E0531M953L7254a30200n9900C46311I9746a51165O770K7600
9176a16795a5120j13749F0821j9612J7227J0452d1713A41621a34686N8369F926
9164A25116N2847a34990D9349K37712E5640a62999j10701l9527a23250r0858k20973
9153d35081a54604B5060a11695l8876r5612E6739c70850A00303c04478A02128
$$ y = [-67827, 387655, 10480, 240124, -136527, 116859, 84718, -6542, -139905, -279150, -18501, -161079, -91612, 295404, 2087, -211743, 294998, 176336, 180213, -155920, 6200, -92002, -162719, -33902, -386374, -27597, -55019, -289823, -106110, -296039, -11867, -155061, 115184, -115871, -145405, 119605, 73062, -130641, -237781, 51157, -313269, 227011, -83562, -436160, -128462, 50531, 55484, 92738, -130200, -190100, 346311, 99746, -151165, -144395, -116795, -15120, -128869, 60821, 41209, 58436, 68888, -41713, 141621, -134686, -76317, 6926, 125116, 177963, -134990, 49349, 287061, 55640, -162999, -273700, -313227, -123250, -214108, -435081, -154604, 25060, -111695, -150571, -246183, 56739, -370850, 100303, -304478, 102128]
9142a14999A63695a85983k67362B22186f5419o4463e3790k44390B58704B99b31173
9130A34721c19619J06227E6212R5312F3015j6831J43950H3831b19383P2746k14404
9119c61041c8001m7582c2049G9758q918a97558A82622G8687a36095k22847H7440
9107a59807B08300b9986l7615p371j1529L2290B65929a10007d1057F6963b26369
9095a9278j25624o8968P5389B14203o9195c9793C19455E01d63926a31482j56338
9084b87820h9753J6527j84769d8607l78611C51667j63889L6172c45746a3483m001
9073a7484m5773A07502f5713j77733k8415N0407f6577q0161g2390n11506A30499
9061A1071a69662L9098B90394a83825j2343Q3273k36946J52976l1347B1148a17304
$$ y = [-114999, 163695, -185983, -453345, 222186, -65419, -129882, -53790, -298180, 258704, 299, -231173, 134721, -319619, -213392, 56212, 151524, 63015, 46184, 190134, 83831, -219383, -146637, -361041, -38001, -85583, -32049, 79758, 70840, -197558, 182622, 78687, -136095, -358942, 87440, -159807, 208300, -29986, -67601, -74972, -86501, -54211, 265929, -110007, -41057, 66963, -226369, -19278, -144902, -213870, -138481, 214203, 145008, -39793, 319455, 501, -463926, -131482, -287820, -89753, -73226, -257995, -48607, -427218, 351667, 187778, 223950, -345746, -13483, -17484, -63257, 107502, -65713, -243446, -271861, -221454, -66577, -146738, -72390, -583896, 130499, 11071, -169662, -130564, 290394, -183825, -196168, -112895, -349841, -196865, -228212, 21148, -117304]
9049A0762g4293a0368b202F1398b19206c0681I8862K06247a07215A76493a27677
9037a32102C1153g9493A16537a2337k33C9233b45618E1920a17555E804h0082a0470
9024b04954d988A22839J18126f7777A58311b3925B19324a15993r9619A26151J73188
9013B99339k4478H1960a5400j85290d6024A03675b33140A92875o4554a99866H6176
9001d21037J99527e6182K0685B83202G0790K00937b1684A94836i0812o7068j33635
8990b91515E37592A38882c23613K4225J27832C4555M9254a46275a4391j58310
8980a72701c9262A04849d12046a31423J7784o1271d9363c956j72361f4416k0457
8969h4873r8399K7192j03180A1386K86772a41449k30570J28120e1751j99045A07809
$$ y = [10762, -74293, -10368, -2202, 61398, -219206, -30681, 98862, 305109, -107215, 176493, -127677, -132102, 31153, -79493, 116537, -12337, -12570, 39233, -245618, 51920, -117555, 5804, -80082, -10470, -204954, -4988, 122839, 240965, -67777, 158311, -23925, 219324, -115993, -215612, 126151, 299339, 274861, 81960, -15400, -200690, -46024, 103675, -233140, 192875, 128321, -199866, 86176, -421037, -221510, -56182, -35497, 283202, 70790, 271727, -21684, 194836, -90812, -157880, -291515, 537592, 138882, -323613, -299388, -171556, 34555, 83809, -146275, -14391, -172701, -39262, 104849, -412046, -131423, -113639, -174910, -49363, -3956, -176317, -64416, -84873, -183272, -156080, -259260, 11386, 298158, -141449, -372019, -243899, -51751, -250796, 107809]
8957f26417I6123e146C2527a51275K3005o7553N1912A01581b01074E9914M1224
8946A01138L8837B4125K2847h5435p3557d969k56070b2253k44882o5075C6391
8934c33973A67015K7461r6914K98144b70394J24254D76b37453A85061J05699N11560
8923H02320J25022L127994O415284D894890A130240n41644k65439q5530B4082
8913a36906A1931a66705j00916B71342a09582A09140A8121K34389H6123e1233
8902a77233O5243R704m938j66014c2090j41791N6239k1897q7453j28013o9872
$$ y = [-626417, 96123, -5146, 32527, -151275, -128270, -195823, -143911, 101581, -201074, 59914, 101138, 139975, 24125, 46972, -85435, -158992, -4969, -261039, -22253, -267135, -332210, 36391, -333973, 167015, 194476, 97562, 395706, -270394, -146140, 476, -237453, 185061, 290760, 802320, 927342, 4055336, 10470620, 4894890, 1130240, 588596, 323157, 237627, 24082, -136906, 11931, -166705, -267621, 271342, -109582, 109140, 18121, 252510, 86123, -51233, -177233, -111990, -102286, -107224, -273238, -32090, -173881, -117642, -139539, -226992, -355005, -424877]
$$ [...]
##END NTUPLES=NMR SPECTRUM
##END=
