##TITLE=AC1701_ROEFFECT0027_8638393_UgW6nmZcNz
##JCAMPDX= 6.0         $$ Bruker NMR JCAMP-DX V2.0
##DATA TYPE= NMR SPECTRUM
##DATA CLASS= NTUPLES
##ORIGIN= BRUKER
##OWNER= Administrator
$$ 1.72 TOPSPIN		Version 2.1
$$ 2014-05-22 21:23:18.141 -0700  Administrator@X
$$ Compression mode = diff/dup
##.OBSERVE FREQUENCY= 400.02188249412
##.OBSERVE NUCLEUS= ^1H
##.ACQUISITION MODE= SIMULTANEOUS (DQD)
##.ACQUISITION SCHEME= undefined
##.AVERAGES= 64
##.DIGITISER RES= 22
##SPECTROMETER/DATA SYSTEM= spect
##.PULSE SEQUENCE= noesygpps1d.comp
##.SOLVENT NAME= COFFEE_meoh
##.SHIFT REFERENCE= INTERNAL, COFFEE_meoh, 1, 14.9613
##AUDIT TRAIL= $$ (NUMBER, WHEN, WHO, WHERE, PROCESS, VERSION, WHAT)
$$ ##TITLE= Audit trail, TOPSPIN		Version 2.1
$$ ##JCAMPDX= 5.01
$$ ##ORIGIN= Bruker BioSpin GmbH
$$ ##OWNER= Administrator
$$ $$ E:\/data/COFFEE/nmr/AC1701_ROEFFECT0027_8638393_UgW6nmZcNz/12/pdata/1/auditp.txt
$$ ##AUDIT TRAIL=  $$ (NUMBER, WHEN, WHO, WHERE, PROCESS, VERSION, WHAT)
(   1,<2014-05-22 21:23:13.266 -0700>,<Administrator>,<X>,<go>,<TOPSPIN 2.1>,
      <created by zg
	started at 2014-05-22 21:11:43.796 -0700,
	POWCHK enabled, PULCHK disabled,
       configuration hash MD5:
       C8 4E 4E 5D D3 5C D8 9E 9F 52 82 E0 59 8A DE 15
       data hash MD5: 64K
       54 BB C8 D6 ED F5 0B F0 CC 11 C1 AD B8 A2 8B 75>)
(   2,<2014-05-22 21:23:16.266 -0700>,<Administrator>,<X>,<proc1d>,<TOPSPIN 2.1>,
      <Start of raw data processing
       efp LB = 0.3 FT_mod = 6 PKNL = 1 PHC0 = 0 PHC1 = 0 SI = 128K 
       data hash MD5: 128K
       C3 66 E8 21 E5 10 2A 51 46 97 A0 D3 6C 8C 80 E2>)
(   3,<2014-05-22 21:23:17.157 -0700>,<Administrator>,<X>,<proc1d>,<TOPSPIN 2.1>,
      <pk PHC0 = -84.92432 PHC1 = 0 
       data hash MD5: 128K
       68 44 3E 01 3A 04 5B E3 74 D8 23 26 65 C2 8A 2D>)
(   4,<2014-05-22 21:23:17.516 -0700>,<Administrator>,<X>,<proc1d>,<TOPSPIN 2.1>,
      <abs ABSG = 1 
       data hash MD5: 128K
       A4 68 19 64 3E 76 CD DF DF 29 F4 3E BF 83 53 F5>)
(   5,<2014-05-22 21:23:17.625 -0700>,<Administrator>,<X>,<proc1d>,<TOPSPIN 2.1>,
      <abs ABSG = 2 
       data hash MD5: 128K
       EB 5A 73 50 D8 60 0C 79 FB C4 33 60 F2 7A 8D EF>)
(   6,<2014-05-22 21:23:17.735 -0700>,<Administrator>,<X>,<proc1d>,<TOPSPIN 2.1>,
      <abs ABSG = 3 
       data hash MD5: 128K
       2A 18 DA 91 5D FE 3C 66 22 9C AC 0D 7D 97 31 AA>)
(   7,<2014-05-22 21:23:17.829 -0700>,<Administrator>,<X>,<proc1d>,<TOPSPIN 2.1>,
      <abs ABSG = 4 
       data hash MD5: 128K
       42 8F DB A2 41 C2 D3 42 D9 62 CC 6B 57 24 0B 61>)
(   8,<2014-05-22 21:23:17.922 -0700>,<Administrator>,<X>,<proc1d>,<TOPSPIN 2.1>,
      <abs ABSG = 5 
       data hash MD5: 128K
       66 05 43 DA 92 A4 44 D3 D5 A3 B1 97 AF B5 CC 33>)
$$ ##END=
$$ 
$$ $$ hash MD5
$$ $$ 12 45 9F 5F 32 3B 8C 1E D6 E3 0B 9C 04 63 C8 1D
##$RELAX= 
##$RELAX= 
##$RELAX= 
##$RELAX= 
##$RELAX= 
##$RELAX= 
##$RELAX= 
##$RELAX= 
$$ Bruker specific parameters
$$ --------------------------
##$DU= <E:\>
##$EXPNO= 12
$$ [...]
150 150 150 150 150 150 150 150
##$TP07= 0
##$TPNAME0= <>
##$TPNAME1= <>
##$TPNAME2= <>
##$TPNAME3= <>
##$TPNAME4= <>
##$TPNAME5= <>
##$TPNAME6= <>
##$TPNAME7= <>
##$TPOAL= (0..7)
0.5 0.5 0.5 0.5 0.5 0.5 0.5 0.5
##$TPOFFS= (0..7)
0 0 0 0 0 0 0 0
##$TUNHIN= 0
##$TUNHOUT= 0
##$TUNXOUT= 0
##$USERA1= <user>
##$USERA2= <user>
##$USERA3= <user>
##$USERA4= <user>
##$USERA5= <user>
##$V9= 5
##$VALIST= <valist>
##$VCLIST= <CCCCCCCCCCCCCCC>
##$VD= 0
##$VDLIST= <DDDDDDDDDDDDDDD>
##$VPLIST= <PPPPPPPPPPPPPPP>
##$VTLIST= <TTTTTTTTTTTTTTT>
##$WBST= 2048
##$WBSW= 25
##$XGAIN= (0..3)
0 0 0 0
##$XL= 0
##$YL= 0
##$YMAX_a= 6513275
##$YMIN_a= -14225337
##$ZGOPTNS= <>
##$ZL1= 120
##$ZL2= 120
##$ZL3= 120
##$ZL4= 120
##$ABSF1= 14.9613
##$ABSF2= -5.596882
##$ABSG= 5
##$ABSL= 3
##$ALPHA= 0
##$AQORDER= 0
##$ASSFAC= 0
##$ASSFACI= 0
##$ASSFACX= 0
##$ASSWID= 0
##$AUNMP= <proc_prof1d_extract.lims>
##$AXLEFT= 0
##$AXNAME= <>
##$AXNUC= <1H>
##$AXRIGHT= 0
##$AXTYPE= 0
##$AXUNIT= <>
##$AZFE= 0.1
##$AZFW= 0.1
##$BCFW= 0
##$BC_mod= 0
##$BYTORDP= 0
##$COROFFS= 0
##$CY= 15
##$DATMOD= 1
##$DC= 0
##$DFILT= <>
##$DTYPP= 0
##$F1P= 0
##$F2P= 0
##$FCOR= 0.5
##$FTSIZE= 131072
##$FT_mod= 6
##$GAMMA= 0
##$GB= 0
##$INTBC= 1
##$INTSCL= 1
##$ISEN= 128
##$LB= 0.3
##$LEV0= 0
##$LPBIN= 0
##$MAXI= 10000
##$MC2= 0
##$MEAN= 0
##$ME_mod= 0
##$MI= 0
##$NCOEF= 0
##$NC_proc= -2
##$NLEV= 6
##$NOISF1= 0
##$NOISF2= 0
##$NSP= 0
##$NTH_PI= 0
##$NZP= 0
##$OFFSET= 14.9613
##$PC= 1
##$PHC0= -84.92432
##$PHC1= 0
##$PH_mod= 1
##$PKNL= yes
##$PPARMOD= 0
##$PPDIAG= 0
##$PPIPTYP= 0
##$PPMPNUM= 2147483647
##$PPRESOL= 1
##$PSCAL= 4
##$PSIGN= 0
##$PYNMP= <proc.py>
##$REVERSE= no
##$SF= 400.020009518603
##$SI= 131072
##$SIGF1= 0
##$SIGF2= 0
##$SINO= 400
##$SIOLD= 131072
##$SPECTYP= <>
##$SREGLST= <1H.CDCl3>
##$SSB= 0
##$STSI= 131072
##$STSR= 0
##$SW_p= 8223.68421052631
##$SYMM= 0
##$S_DEV= 0
##$TDeff= 65536
##$TDoff= 0
##$TI= <>
##$TILT= no
##$TM1= 0
##$TM2= 0
##$TOPLEV= 0
##$USERP1= <user>
##$USERP2= <user>
##$USERP3= <user>
##$USERP4= <user>
##$USERP5= <user>
##$WDW= 1
##$XDIM= 131072
##$YMAX_p= 411197996
##$YMIN_p= -12993
##$CURPLOT= <Network HP LaserJet P1505>
##$CURPRIN= <$Network HP LaserJet P1505>
##$DFORMAT= <normdp>
##$LAYOUT= <+/1D_H.xwp>
##$LFORMAT= <normlp>
##$PFORMAT= <normpl>
##$SURQMSG= 1
$$ End of Bruker specific parameters
$$ ---------------------------------
##NTUPLES= NMR SPECTRUM
##VAR_NAME=  FREQUENCY,     SPECTRUM/REAL,   SPECTRUM/IMAG
##SYMBOL=    X,             R,               I
##VAR_TYPE=  INDEPENDENT,   DEPENDENT,       DEPENDENT
##VAR_FORM=  AFFN,          ASDF,            ASDF
##VAR_DIM=   131072,        131072,          131072
##UNITS=     HZ,            ARBITRARY UNITS, ARBITRARY UNITS
##FACTOR=    0.0627417313425164, 1,          1
##FIRST=     8223.62146879497, 1795,         -67692
##LAST=      0,             4321,            -67944
##MIN=       0,             -12993,          0
##MAX=       8223.62146879497, 411197996,    0
$$ Real data points
##PAGE= N=1
##DATA TABLE= (X++(R..R)), XYDATA
$$ [...]
61526D57477J698K039K135J478l94k998m868n029m050l102k563k056j390q05n79
61511D36993p80j214j349p33L58J043Q84L36k5j85k97k67k2K08K79L28M30N08
61493D36495P54J385J861J217l79j323n26J057J682J014K15J65N82Q02P26Q00
61477D46527J429K514L449L680L344L040K988K852K439J943J374M37p10j331j205
61462D72770j041j320j464q93j58j52p17r68o49k73q3K13P48J227J433J476J524
61445D71673J669J901J905J301M29L86J634L056L291K600K411L193L880L532K546
61430E05407J772J246L96q56j790j635m00J068J832J679J131P21N46O17J072J733
61414E14539J918J274L75j16m16j118j979k185j656j218j342j629j715j898k409
$$ y = [457477, 459175, 461214, 463349, 464827, 464433, 461435, 456567, 451538, 447488, 444386, 441823, 439767, 438377, 437572, 436993, 436213, 434999, 433650, 432917, 433275, 434318, 435202, 435538, 435513, 435328, 435031, 434764, 434742, 434950, 435229, 435557, 435987, 436495, 437249, 438634, 440495, 441712, 441333, 440010, 439484, 440541, 442223, 443237, 443452, 443617, 444199, 445001, 445727, 446527, 447956, 450470, 453919, 457599, 460943, 463983, 466971, 469823, 472262, 474205, 475579, 476016, 475306, 473975, 472770, 471729, 470409, 468945, 468052, 467894, 467742, 467025, 466057, 465408, 465135, 465052, 465265, 466013, 467240, 468673, 470149, 471673, 473342, 475243, 477148, 478449, 478878, 479264, 480898, 483954, 487245, 489845, 492256, 495449, 499329, 502861, 505407, 507179, 508425, 508821, 507965, 506175, 504540, 504140, 505208, 507040, 508719, 509850, 510571, 511117, 511734, 512806, 514539, 516457, 517731, 518106, 517990, 517574, 516456, 514477, 512292, 510636, 509418, 508076, 506447, 504732, 502834, 500425]
61399E00425k736k259j150k06M0l09q19j105j029q18q77j301j614j183L7J271
61383D86367J569Q36J51P17K431L868L891K906K147K159K508K722K777K704K428
61368E20181K109K108K380K377J788R92N59N89P87R83J311J955K833L601M058
61353E48611M535N618P309Q856R675J0098J0631J1008J0642R802R290R030Q026
61340F63131O062M295L634L463K820K054K153K903K918J502n44k164l192l878
61326F85157m073l604k940k860l509m239m285l403j931n12L64P99J376K397L499
61311F62236M299N161O773R021J0910J1776J2057J2556J3369J3920J3818J3192
61299G89088J2323J1339J0217Q684O117K005l224q089j1080j1900j1579j1353
$$ y = [500425, 497689, 495430, 494280, 494074, 494114, 493805, 492986, 491881, 490852, 490034, 489157, 487856, 486242, 485059, 485096, 486367, 487936, 488772, 488923, 489640, 492071, 495939, 499830, 502736, 504883, 507042, 509550, 512272, 515049, 517753, 520181, 522290, 524398, 526778, 529155, 530943, 531935, 532494, 533083, 533870, 534853, 536164, 538119, 540952, 544553, 548611, 553146, 558764, 566073, 574929, 584604, 594702, 605333, 616341, 626983, 636785, 646075, 655105, 663131, 669193, 673488, 677122, 680585, 683405, 685459, 687612, 690515, 693433, 694935, 694391, 692227, 689035, 685157, 681084, 677480, 674540, 671680, 668171, 663932, 659647, 656244, 654313, 653801, 654165, 654964, 656340, 658737, 662236, 666535, 671696, 678469, 687490, 698400, 710176, 722233, 734789, 748158, 762078, 775896, 789088, 801411, 812750, 822967, 831651, 837768, 839773, 836549, 828460, 817380, 805480, 793901, 782548]
61287G82548j1499j1374j0505r327q618q466q249p550o555n370l671j336J020
61274F91048K649L535M185M868N559O295P069P530P326O676O090N729N457N318
61260G69334N467N878O630Q149J0430J2362J2733J1753J0600R605P966N338K475
61247H78720L5k114l972m941m951n021n926p051p413p049o550n920m801l400k248
61232H07398j356m71J61J23k44r2Q63K149L288M147M719N147N821O812P417O944
61216H52826N776M964M865M912M714M608M940N438N614N361M878M282L426K123
61202I18727N61m09J83K351N002P200R234J1857J4947J7627J9480K0832K1884
61189A049476K2409K2317K1800K0670J8322J4631J0404O639L708J471k15j412
$$ y = [782548, 771049, 759675, 749170, 739843, 731225, 722759, 714510, 706960, 700405, 695035, 691364, 690028, 691048, 693697, 697232, 701417, 706285, 711844, 718139, 725208, 732738, 740064, 746740, 752830, 758559, 764016, 769334, 774801, 780679, 787309, 795458, 805888, 818250, 830983, 842736, 853336, 862941, 870907, 876245, 878720, 878755, 876641, 872669, 867728, 862777, 857756, 851830, 844779, 837366, 830317, 823767, 817847, 813046, 809646, 807398, 806042, 805571, 805732, 805855, 805611, 805519, 806382, 808531, 811819, 815966, 820685, 825832, 831653, 838465, 845882, 852826, 858602, 863566, 868431, 873343, 878057, 882665, 887605, 893043, 898657, 904018, 908896, 913178, 916604, 918727, 919288, 918879, 919062, 921413, 926415, 933615, 942849, 954706, 969653, 987280, 1006760, 1027592, 1049476, 1071885, 1094202, 1116002, 1136672, 1154994, 1169625, 1180029, 1186668, 1190376, 1191847, 1191632, 1190220]
61177A190220k279l126m295n979p944r536j0289j0475j0819j1756j3254j5101
61165A085367j6925j8141j8451j8401j8801j9573j9762j8843j7412j6378j5907
61154H86773j5451j4415j2527r917p128m817l165j757j60J563K974L655L343J952
61140H30923k68k765n047o866q073q511q178p228n676l301j52L009N150N993O448
61125G95458P827J0592J4033J7158J9648K1722K3404K4513K5326K6584K8530L0441
61113A045236L1546L2010L2526L3250L3626L3154L1786K9693K7091K4361K1891
61102A376170J9697J7413J4583J0848O097P36m407q825j2846j7043k1349k5230
61090A355844k8461l1155l3125l3846l3273l2096l1036l0202k9321k8200k6758
$$ y = [1190220, 1187941, 1184815, 1180520, 1174541, 1166597, 1157061, 1146772, 1136297, 1125478, 1113722, 1100468, 1085367, 1068442, 1050301, 1031850, 1013449, 994648, 975075, 955313, 936470, 919058, 902680, 886773, 871322, 856907, 844380, 834463, 827335, 822518, 819353, 817596, 817436, 818999, 821973, 825628, 828971, 830923, 830655, 827890, 822843, 815977, 807904, 799393, 791215, 783987, 778311, 775010, 774858, 777867, 783017, 789010, 795458, 803285, 813877, 827910, 845068, 864716, 886438, 909842, 934355, 959681, 986265, 1014795, 1045236, 1076782, 1108792, 1141318, 1174568, 1208194, 1241348, 1273134, 1302827, 1329918, 1354279, 1376170, 1395867, 1413280, 1427863, 1438711, 1444808, 1445544, 1441137, 1432312, 1419466, 1402423, 1381074, 1355844, 1327383, 1296228, 1263103, 1229257, 1195984, 1163888, 1132852, 1102650, 1073329, 1045129, 1018371]
61079A018371k4899k2644k0248j7982j5864j3719j1475r327p552o136m703k992
61067H60830j323k30L94J243K603L897M661N362O677Q326R454R972J0752J2372
61053I34990J4359J5946J7074J8262J9813K1540K3203K4915K6926K9124L0925
61042A177077L1906L2395L3195L4651L6360L7795L8783L9251L9008L8110L7093
61031A575624L6514L6495L6907L7606L8262L8424L8103L7928L8403L9412M0744
61020A994422M2561M4968M7584N0136N2985N6516O0289O3392O5559O7609P0904
61009B616925P6544Q4730R4876J06603J20537J37505J57235J78992K03631K33804
60999D011382K71892L19027L76343M45561N27856O23955P35639Q64251J006197
$$ y = [1018371, 993472, 970828, 950580, 932598, 916734, 903015, 891540, 882213, 874661, 868525, 863822, 860830, 859507, 859277, 859671, 860914, 863517, 867414, 872075, 877437, 884114, 892440, 901894, 911866, 922618, 934990, 949349, 965295, 982369, 1000631, 1020444, 1041984, 1065187, 1090102, 1117028, 1146152, 1177077, 1208983, 1241378, 1274573, 1309224, 1345584, 1383379, 1422162, 1461413, 1500421, 1538531, 1575624, 1612138, 1648633, 1685540, 1723146, 1761408, 1799832, 1837935, 1875863, 1914266, 1953678, 1994422, 2036983, 2081951, 2129535, 2179671, 2232656, 2289172, 2349461, 2412853, 2478412, 2546021, 2616925, 2693469, 2778199, 2873075, 2979678, 3100215, 3237720, 3394955, 3573947, 3777578, 4011382, 4283274, 4602301, 4978644, 5424205, 5952061, 6576016, 7311655, 8175906, 9182103]
60990I182103J152802J297186J439144J580691J718452J840054J918955J904766
60982B2034153J729599J351914Q13734K48460j88160m09247m28880l21443j71170
60973B4658960o3287r2497l34532p84534j330342j806600k090313k155590k053335
60964A3947930j855583j619124j380674j162157r72594q11273o74848n61301m68022
60955D442354l90732l26473k75057k35836k05500j80703j60594j44873j31484
60946B391102j18398j06185r6498q9084q2255p5494o9617o4901o0925n7916n6529
60935A513300n6336n5909n4436n2176m9413m6034m2160l8216l4446l0913k7846
60924A025415k5305k2835k0074j7368j5162j3209j1150r398q596q454q032o973
$$ y = [9182103, 10334905, 11632091, 13071235, 14651926, 16370378, 18210432, 20129387, 22034153, 23763752, 25115666, 25929400, 26177860, 25989700, 25580453, 25151573, 24830130, 24658960, 24595673, 24503176, 24168644, 23384110, 22053768, 20247168, 18156855, 16001265, 13947930, 12092347, 10473223, 9092549, 7930392, 6957798, 6146525, 5471677, 4910376, 4442354, 4051622, 3725149, 3450092, 3214256, 3008756, 2828053, 2667459, 2522586, 2391102, 2272704, 2166519, 2070021, 1980937, 1898682, 1823188, 1753571, 1688670, 1627745, 1569829, 1513300, 1456964, 1401055, 1346619, 1294443, 1245030, 1198996, 1156836, 1118620, 1084174, 1053261, 1025415, 1000110, 977275, 957201, 939833, 924671, 911462, 900312, 890914, 882318, 873864, 865832, 858859]
60912H58859n679m474l245j947q35j84j05n27j077j261r99o69n88q22j623l231
60896H31593n085o060n922n682o082o698p047p507q369q938q589p902p764p984
60882G31964p852p394p097o947o729o773p407q116q210p902p791p756p315o646
60868F28029o239n909n138m020k990k003r17j94j95k40N62J916K880L387M085
60853F13014M964N381N273N144M989M359L429K833K563K122J667J848K460K519
60839F62565J737Q66L63k29j389l050n072p273q830q698o988n080m039l691l473
60824F07719l297l217k963k299j398o53m34j035k275l260l240k634k560l374m465
60809E70615n301n872o058n567m683m225m502n001n252n247m906l918k406j060
$$ y = [858859, 853180, 848706, 845461, 843514, 842679, 842495, 842390, 841863, 840786, 839525, 838526, 837857, 837269, 836447, 834824, 831593, 826508, 820448, 814526, 808844, 802762, 796064, 789017, 781510, 773141, 764203, 755614, 747712, 739948, 731964, 724112, 716718, 709621, 702674, 695945, 689172, 681765, 673649, 665439, 657537, 649746, 641990, 634675, 628029, 621790, 615881, 610743, 606723, 603733, 601730, 600813, 600619, 600424, 600184, 600746, 602662, 605542, 608929, 613014, 617978, 623359, 628632, 633776, 638765, 643124, 646553, 649386, 651949, 654071, 655738, 657586, 660046, 662565, 664302, 665168, 665531, 665302, 663913, 660863, 655791, 648518, 639688, 630990, 624002, 618922, 614883, 611192, 607719, 604422, 601205, 598242, 595943, 594545, 593892, 593458, 592423, 590148, 586888, 583648, 581014, 578454, 575080, 570615, 565314, 559442, 553384, 547817, 543134, 538909, 534407, 529406, 524154, 518907, 514001, 510083, 507677, 506617]
60795E06617l52j57l10q62j692k435k899l020k518j246J37O58K80r2J19N96R13
60778D93737J074J112R33O43M48K38j20j89M79J420J789J724K095K922L288K891
60762E14484K505K572K641K450K419K563K179J172N63R40J452J098J00p74j366
60747E34998j803j859j482j295j683k100j971j688j876k357k690l148m177n369
60733E01500n914n760n416m900l824k381j361j103j200j321j722k617l529l505
60719D56947k090j6J227R11K7J12J157J576N80n01n0J524K431K006J362J588K379
60702D71170K772K462J965J851K204K705L017L090L060K912K423J550O31Q0J02
60687E01994P63J941L033L228K412J452J227J629J913J716J367J381J948K767
$$ y = [506617, 506265, 506108, 505798, 504936, 503244, 500809, 497910, 494890, 492372, 491126, 491263, 491921, 492201, 492109, 492228, 492824, 493737, 494811, 495923, 496856, 497499, 497947, 498185, 498065, 497876, 498355, 499775, 501564, 503288, 505383, 508305, 511593, 514484, 516989, 519561, 522202, 524652, 527071, 529634, 531813, 532985, 533548, 534488, 535940, 537038, 537138, 536364, 534998, 533195, 531336, 529854, 528559, 526876, 524776, 522805, 521117, 519241, 516884, 514194, 511046, 506869, 501500, 495586, 489826, 484410, 479510, 475686, 473305, 471944, 470841, 469641, 468320, 466598, 463981, 460452, 456947, 454857, 454841, 456068, 456979, 457006, 457118, 458275, 459851, 460431, 459930, 459880, 461404, 463835, 465841, 467203, 468791, 471170, 473942, 476404, 478369, 480220, 482424, 485129, 488146, 491236, 494296, 497208, 499631, 501181, 501812, 501892, 501994, 502757, 504698, 507731, 510959, 513371, 514823, 516050, 517679, 519592, 521308, 522675, 524056, 526004, 528771]
60673E28771L188K750J783J121J001P52j29j106j380j078r92j408j922k287k707
60658E26357l208l366k916k185j657j374j034n05M5M41P11R25R45N51j61o91o55
60641E12223k47k4k94r36j656k174k302k150k123k294k057q92O70J532J360P72
60625D99408K19m23j021r05O7J028J258J129J289J569J444J040Q51P65K48o30
60609E07336j140q78k19K71L52M4n15j015j151r10n05n5L75N91M39P1j69j10J91
60590E03003O39J144J646K290L303M460M970M336L085K156J813J597J259J092
60576E36793J260J380J092O79P80J699L211M890O366P365P826Q090Q739J0066
60562F00236J1716J3035J3669J3684J3189J2191J0864R538Q213O498M258J952
$$ y = [528771, 531959, 534709, 536492, 537613, 538614, 539366, 539237, 538131, 536751, 535673, 534681, 533273, 531351, 529064, 526357, 523149, 519783, 516867, 514682, 513025, 511651, 510617, 510112, 510157, 510598, 511309, 512234, 513179, 513730, 513569, 512878, 512223, 511976, 511952, 511658, 510722, 509066, 506892, 504590, 502440, 500317, 498023, 495966, 495074, 495744, 497276, 498636, 499408, 499627, 499204, 498183, 497278, 497345, 498373, 499631, 500760, 502049, 503618, 505062, 506102, 506953, 507718, 507966, 507336, 506196, 505318, 505099, 505370, 505722, 505766, 505251, 504236, 503085, 502175, 501670, 501615, 501990, 502581, 503020, 503091, 502922, 502812, 503003, 503642, 504786, 506432, 508722, 512025, 516485, 521455, 525791, 528876, 531032, 532845, 534442, 535701, 536793, 538053, 539433, 540525, 541204, 541984, 543683, 546894, 551784, 558150, 565515, 573341, 581431, 590170, 600236, 611952, 624987, 638656, 652340, 665529, 677720, 688584, 698122, 706335, 712833, 717091, 719043]
60550G19043j22k412n284p930q986q164o511m968l449j657J24J520K749M299O171
60535F84423P992R603J1190J3010J5210J7683K0004K1690K2661K3119K2912K1470
60523H90967J8490J4259R229L819j263n169p770r813j1821j3376j3894j3564j2899
60510H47195j1864j0131p861n627l690j989o63J40R16K631N582Q922J1662J3891
60496H49114J6657K0660K5396K9867L3839L7990M2681M7150N0276N1692N1616
60485A256938M9960M6469M1570L6204L0717K4629J7670J0292K975m193j1074j7347
60473A484810k3204k9367l6081m2687m8543n3517n7245n8766n7627n4579n0621
60462I72573m6057m1168l6941l3993l1382k7695k3074j9099j6678j5132j3506
$$ y = [719043, 718921, 716509, 711225, 703295, 694309, 686145, 679634, 674666, 671217, 669560, 669684, 671204, 673953, 678252, 684423, 692415, 702018, 713208, 726218, 741428, 759111, 779115, 800805, 823466, 846585, 869497, 890967, 909457, 923716, 932945, 936764, 935501, 930332, 922562, 912749, 900928, 887552, 873658, 860094, 847195, 835331, 825200, 817339, 811712, 808022, 806033, 805370, 805510, 806426, 809057, 814639, 823561, 835223, 849114, 865771, 886431, 911827, 941694, 975533, 1013523, 1056204, 1103354, 1153630, 1205322, 1256938, 1306898, 1353367, 1394937, 1431141, 1461858, 1486487, 1504157, 1514449, 1517424, 1513231, 1502157, 1484810, 1461606, 1432239, 1396158, 1353471, 1304928, 1251411, 1194166, 1135400, 1077773, 1023194, 972573, 926516, 885348, 848407, 814414, 783032, 755337, 732263, 713164, 696486, 681354, 667848]
60451F67848j1878j0897j0568j0053q625o564m946m472m613m301l287k302j791
60438E83551j322n36Q8K8l83n48n79r37j451j472q62j55J00k36r58j599j690j331
60420E69708j104j125p41L57J390J529J102R47J100J075R84J320J843J814J263
60405E81462J088J739K679L211L136K545J791J614K480L688L964L132K297K173
60391F16999K183J657J037J216K144K997L368L655M248M879M990M409L530K891
60377F60203K735K966L353L642L573L120K693K786L324L751L876M155M849N408
60363G10434N135M164L300L047L243L465L438L223L232L877N000N926O330O615
60349G70429P191P926Q662R695J1205J2667J3517J3829J3764J2736J0010N827
$$ y = [667848, 655970, 645073, 634505, 624452, 615827, 609263, 604317, 599845, 595232, 590931, 587644, 585342, 583551, 582229, 581693, 581781, 581809, 581426, 580878, 580299, 579362, 577911, 576439, 575577, 575422, 575522, 575286, 574328, 572729, 571039, 569708, 568604, 567479, 566738, 567095, 568485, 570014, 571116, 572063, 573163, 574238, 575222, 576542, 578385, 580199, 581462, 582550, 584289, 586968, 590179, 593315, 595860, 597651, 599265, 601745, 605433, 609397, 612529, 614826, 616999, 619182, 620839, 621876, 623092, 625236, 628233, 631601, 635256, 639504, 644383, 649373, 653782, 657312, 660203, 662938, 665904, 669257, 672899, 676472, 679592, 682285, 685071, 688395, 692146, 696022, 700177, 705026, 710434, 715569, 719733, 723033, 726080, 729323, 732788, 736226, 739449, 742681, 746558, 751558, 757484, 763814, 770429, 777620, 785546, 794208, 803903, 815108, 827775, 841292, 855121, 868885, 881621, 891631, 897458]
60337H97458J195l203p192j0501j2830j4330j5272j5380j4309j2616j1344j0629
60325G71047r637p924o087m854m252l914l667l574l763m268m692m214k417k9J841
60310G09596L098M655P079R908J2407J4352J5953J7565J9586K2141K4672K6254
60298H87266K6426K5350K3258K0208J6229J1245M981k466j0092j6619k1583k5273
60286I38930k7705k8442k7328k4818k1492j7900j4765j2603j1147r769q483p799
60274G26679p681p440o758o015n523n148m902n057n470n561n228n030n174n008
60260F46684m009k613j601j141q59n48k96j78m6L59J153K011K352K089J881K133
60244F47371K271J678R77J252K173K181P35q61j300q28l79j43J97N41O44Q05J533
$$ y = [897458, 898653, 895450, 888258, 877757, 864927, 850597, 835325, 819945, 805636, 793020, 781676, 771047, 761410, 753486, 747399, 742545, 738293, 734379, 730712, 727138, 723375, 719107, 714415, 710201, 707784, 707755, 709596, 712694, 717349, 724428, 734336, 746743, 761095, 777048, 794613, 814199, 836340, 861012, 887266, 913692, 939042, 962300, 982508, 998737, 1009982, 1014963, 1012497, 1002405, 985786, 964203, 938930, 911225, 882783, 855455, 830637, 809145, 791245, 776480, 763877, 752730, 742961, 734478, 726679, 718998, 711558, 704800, 698785, 693262, 688114, 683212, 678155, 672685, 667124, 661896, 656866, 651692, 646684, 642675, 640062, 638461, 637320, 636461, 635913, 635617, 635439, 635393, 635752, 636905, 638916, 641268, 643357, 645238, 647371, 649642, 651320, 652297, 653549, 655722, 657903, 658638, 657777, 656477, 655649, 655270, 655127, 655324, 655865, 656509, 657314, 658847]
60227F58847K758L914M634M909M886M863N201N861O313O226N986O200P030Q224
60213G35852R501J0604J1283J1554J1715J1868J1770J1379J1153J1495J2145J2429
60201H72748J1955J0873R691Q871Q379P591O009M017K514J716R13n30k386m041
60187I38320n180n821o141o561p465q602r200q963q405q000p590p031o768p150
60173H35443p621p280o037m630l609k813j918r96m23m40q93j336j423j196r41
60158G93887q07o82m56j95OJ33K20L34N78R57J326J591J874K332L005L955N202
60141H13260O311O538N862N375O028P389Q433R091J0040J1168J1479J0615R471
60128I21060Q871Q542P809O604N298M078K912J875J210J224K098L441M308M199
$$ y = [658847, 661605, 665519, 670153, 675062, 679948, 684811, 690012, 695873, 702186, 708412, 714398, 720598, 727628, 735852, 745353, 755957, 767240, 778794, 790509, 802377, 814147, 825526, 836679, 848174, 860319, 872748, 884703, 895576, 905267, 914138, 922517, 930108, 936117, 940134, 942648, 944364, 945277, 944747, 942361, 938320, 933140, 927319, 921178, 914617, 907152, 898550, 889350, 880387, 871982, 863982, 856392, 849361, 842593, 835443, 827822, 820542, 814505, 809875, 806266, 803453, 801535, 800539, 800116, 799676, 798783, 797447, 796024, 794828, 793887, 793080, 792398, 791942, 791747, 791753, 791886, 792106, 792440, 793018, 793975, 795301, 796892, 798766, 801098, 804103, 808058, 813260, 819571, 826109, 831971, 837346, 843374, 850763, 859196, 868287, 878327, 889495, 900974, 911589, 921060, 929931, 938473, 946282, 952886, 958184, 962262, 965174, 967049, 968259, 969483, 971581, 975022, 979330, 983529]
60114I83529L847M219M965M832L536K098J183L03r93k241k976l582m555n683o594
60099I81888p470q524r397r693r600r390q806p515n758l971k188m11Q53J069M44
60084I01531k43m82l08Q8O33J325K044K408J901M56j265k591l727n321p281q797
60068H80371r526r980j0619j1323j1927j2379j2218j0807q539o801o304o199n402
60055G58347l983k683j755j012m37j16J66P13J617K832M100M803M525L964M354
60040G75435N823P175P619P658P775P455O183M491L041J506o79l119m932n924
60026H19507o461o669o544o530p137q245r334j0083j0380j0243j0157j0766j1743
60013G05215j1731j0113q065p014o759o129m900l948l767l839l456k373p44R85
$$ y = [983529, 987376, 991595, 996560, 1001392, 1004928, 1007026, 1008209, 1008512, 1007519, 1005278, 1002302, 998720, 994165, 988482, 981888, 974418, 965894, 956497, 946804, 937204, 927814, 919008, 911493, 905735, 901764, 899576, 899165, 900018, 901087, 901531, 901288, 900806, 900498, 900586, 901219, 902544, 904588, 906996, 908897, 909353, 908088, 905497, 901770, 896449, 889168, 880371, 870845, 860865, 850246, 838923, 826996, 814617, 802399, 791592, 783053, 776252, 769948, 763749, 758347, 754364, 751681, 749926, 748914, 748477, 748361, 748527, 749240, 750857, 753689, 757789, 762592, 767117, 771081, 775435, 781258, 788433, 796052, 803710, 811485, 818940, 825123, 829614, 832655, 834161, 833482, 830363, 825431, 819507, 813046, 806377, 799833, 793303, 786166, 777921, 768587, 758504, 748124, 737881, 727724, 716958, 705215, 693484, 683371, 675306, 668292, 661533, 655404, 650504, 646556, 642789, 638950, 635494, 633121, 632377, 633362]
59999F33362K177K515K297J995J816J996K855M137M876M514L674L326L658M293
59985F77491M961N403N227M515L944L710L003J261p85k148k953l862m781n181
59971F89805n199n337n407m797l557k307j215J08J756L324M481N187N490N504
59957F87836N372N006M273L567L435L435K360P8j982k873l316l956l883k305m50
59942F96597j3o10o63k45q67k670l927l651k866k707k783k195j012N4P67J523
59926F74732K788M606O382P244P093O968P732Q803R010Q307P646P396O979O055
59912G71741M971M029L276K952L306L921M096L855L757L778L351K419J568J097
59898H18117Q31P49R41J029N19k99o24k21N60J612L003M271M853N065N636O368
$$ y = [633362, 635539, 638054, 640351, 642346, 644162, 646158, 649013, 653150, 658026, 662540, 666214, 669540, 673198, 677491, 682452, 687855, 693082, 697597, 701541, 705251, 708254, 709515, 708730, 706582, 703629, 699767, 694986, 689805, 684606, 679269, 673862, 669065, 665508, 663201, 661986, 662094, 663850, 667174, 671655, 676842, 682332, 687836, 693208, 698214, 702487, 706054, 709489, 712924, 715284, 715362, 713380, 710507, 707191, 703235, 699352, 697047, 696597, 696584, 695974, 695311, 695066, 694199, 691529, 687602, 683951, 681085, 678378, 675595, 673400, 672388, 672442, 673209, 674732, 677520, 682126, 688508, 695752, 702845, 709813, 717545, 726348, 735358, 743665, 751311, 758707, 765686, 771741, 776712, 780741, 784017, 786969, 790275, 794196, 798292, 802147, 805904, 809682, 813033, 815452, 817020, 818117, 818948, 819697, 820638, 821667, 822186, 821887, 821263, 821042, 821602, 823214, 826217, 830488, 835341, 840406, 846042, 852410]
59882H52410O343N437M604M582N276O327P337P613O750N412M557M020K951J446
59868I25065M10j06j097k970m984o499p533q017p727p178p272p871p916p158o376
59853H42771n715m347k280q91r24j356j034k57K04M70J004J618K031K591L570
59838H37455M500N024N710P156Q763R305Q272O087L464J166j6J96J303K628L861
59823I04874M680M426K599n81m358p820j0008j0419r680r179r608j0343j0475
59810H34108r808q636p169n651m469l729l143k552k150j970j720j278r26r22j353
59795G78632k295l578m437m230l386k878k803k526k149k598l940m941m746l993
59781G30132l625l627l532l312l038k436j399l68L46R68J567J754J515J554K283
$$ y = [852410, 858753, 864190, 868794, 873376, 878652, 884979, 892316, 899929, 906679, 912091, 916648, 920668, 923619, 925065, 925475, 925369, 924272, 921302, 916318, 909819, 902286, 894269, 886542, 879364, 872092, 864221, 856305, 849147, 842771, 837056, 832709, 830429, 829538, 828614, 827258, 826224, 825967, 826171, 826641, 827645, 829263, 831294, 833885, 837455, 841955, 846979, 852689, 859845, 868608, 877913, 886185, 892272, 895736, 896902, 896886, 897082, 898385, 901013, 904874, 909554, 913980, 916579, 915998, 911640, 903820, 893812, 883393, 873713, 864534, 854926, 844583, 834108, 824300, 815664, 808495, 802844, 798375, 794646, 791503, 788951, 786801, 784831, 783111, 781833, 780907, 779985, 778632, 776337, 772759, 768322, 764092, 760706, 757828, 755025, 752499, 750350, 747752, 743812, 738871, 734125, 730132, 726507, 722880, 719348, 716036, 712998, 710562, 709163, 708795, 709141, 710109, 711676, 713430, 714945, 716499, 718782]
59766G18782L194L818M531N732O880P176O759O559P212Q612J0207J1380J1838
59753H12680J1902J2067J2330J2342J2217J2413J2794J2688J1956J1118J0209
59742I44716Q604O262M103K640J271n73k510m028n231o203o533o155n788n846
59728I24729n713m819l722l267l399l480l222k739k158j761j856k093j677o39
59714H84184p5o28j651k393k891l099k306m17J281J720J552J908K577K630K208
59699H84600K259K940L598M018M516M993N021M845N203O141O894O945O435N476
59685I53884L879J676o42k607m092n129n730n843n400m561l959m315n605p088
59671I04468q253r150r692r399q242o915n863m795l616k888k812k595j600k54
$$ y = [718782, 721976, 725794, 730325, 736057, 742937, 750113, 756872, 763431, 770643, 779255, 789462, 800842, 812680, 824582, 836649, 848979, 861321, 873538, 885951, 898745, 911433, 923389, 934507, 944716, 953320, 959582, 963685, 966325, 967596, 967023, 964513, 960485, 955254, 949051, 942518, 936363, 930575, 924729, 919016, 914197, 910475, 907208, 903809, 900329, 897107, 894368, 892210, 890449, 888593, 886500, 884823, 884184, 884109, 883481, 881830, 879437, 876546, 873447, 871141, 870724, 872005, 873725, 875277, 877185, 879762, 882392, 884600, 886859, 889799, 893397, 897415, 901931, 906924, 911945, 916790, 921993, 928134, 935028, 941973, 948408, 953884, 957763, 959439, 958797, 956190, 952098, 946969, 941239, 935396, 929996, 925435, 921476, 917161, 911556, 904468, 896215, 887065, 877373, 867974, 859732, 852817, 846954, 842159, 838543, 835655, 832843, 830248, 828648, 828394]
59657H28394Q79K066L572M744M994M979N649O641O806N939M877M003K829J025
59643H87397j007k724m026n183o551q214r640j0099r653r198r071q494o919n109
59629G91509m074l664l161k650k727l335l939m518n359o170o322n795n049m183
59615G30563l036j863j105o87l64m18j178k061j978o91J009K289K865K796K410
59600G28551K223K324K109J226L36J99M06Pr35j417j042m69l50o19r81j335j521
59583G28712j302p45k83k03m59r16j531k305l192l954m090l345k346k071k546
59568F99424k775k202j449j125r14m40q4j60o3P83J837K182J774J088K07p85j194
59551F96104n60M46R64J276K097L134L537L367L428L879M229M533N548P655J0415
$$ y = [828394, 829273, 831339, 834911, 839655, 844649, 849628, 855277, 861918, 868724, 874663, 879540, 883543, 886372, 887397, 886390, 883666, 879640, 874457, 867906, 859692, 850052, 839953, 830300, 821102, 812031, 803537, 796618, 791509, 787435, 783771, 780610, 777960, 775233, 771898, 767959, 763441, 758082, 751912, 745590, 739795, 734746, 730563, 727527, 725664, 724559, 723872, 723508, 723090, 721912, 719851, 717873, 717182, 718191, 720480, 723345, 726141, 728551, 730774, 733098, 735207, 736433, 736769, 736968, 737374, 737381, 736446, 735029, 733987, 733518, 733168, 732549, 731568, 730233, 728712, 727410, 726665, 726382, 726179, 725720, 724804, 723273, 720968, 717776, 713822, 709732, 706387, 704041, 701970, 699424, 696649, 694447, 692998, 691873, 690959, 690519, 690435, 690275, 690212, 690995, 692832, 695014, 696788, 697876, 698083, 697298, 696104, 695544, 695990, 696954, 698230, 700327, 703461, 706998, 710365, 713793, 717672, 721901, 726434, 731982, 739637, 750052]
59536G50052J3056J4813J5225J4909J5510J7824K0286K0213J6380R779K540l072
59524I07515n445m770l084k141j659o17N54M41j211l348n211o741p788q352r291
59509H48852j1298j3462j4239j3558j2474j1188r194p182o605p253p216n683l930
59496G25570k973k176r20O9J88K52J137K240K543K243K217K538K635K494K728
59481G40785L665N056O489P608Q096P958P620P532P746Q069Q333Q451Q393Q128
59467H43929P490O294M742L357K260J084j7r9J151K571L083L369M696O794Q350
59452H99054R184J0243J1577J2082J1416J0493R745Q493O543M913M161L237Q54
59439A001995k893o952j0504j3064j4201j3901j2692j0998q905o772n281m522
$$ y = [750052, 763108, 777921, 793146, 808055, 823565, 841389, 861675, 881888, 898268, 908047, 910587, 907515, 902070, 897300, 894216, 892075, 890416, 889799, 890353, 890794, 889583, 886235, 881024, 874283, 866495, 858143, 848852, 837554, 824092, 809853, 796295, 783821, 772633, 763439, 756257, 749652, 742399, 735183, 729500, 725570, 722597, 720421, 719501, 719570, 719758, 720010, 721147, 723387, 725930, 728173, 730390, 732928, 735563, 738057, 740785, 744450, 749506, 755995, 763603, 771699, 779657, 787277, 794809, 802555, 810624, 818957, 827408, 835801, 843929, 851419, 857713, 862455, 865812, 868072, 869156, 869139, 869040, 870191, 872762, 875845, 879214, 883910, 890704, 899054, 908238, 918481, 930058, 942140, 953556, 964049, 973794, 982287, 988830, 993743, 997904, 1001141, 1001995, 999102, 992150, 981646, 968582, 954381, 940480, 927788, 916790, 907885, 901113, 895832, 891310]
59427H91310l778k575j176K32J964M065N956P437R319J2375J6201J9705K2313
59414I83348K4176K5501K6139K5790K4371K2261K0138J8453J7046J5237J1945
59403A214405N900l100j2648j8653j9048j5819j2183q703l803K593Q148J0730
59391A147819R797N063l771j4949k4292k8533k8137k5837k3320k0447j6814j2821
59379I63758r266o708n152m019k704j287l89k78o00r75j176q54J69J333J878J958
59363I35688K369L216L866M156M671N659O736P791R244J1106J2829J4233J5721
59350A037285J7364J8781K0002K1483K3088K4008K3918K3280K2423K1243J9758
59339A272633J7964J5179J0769N488P94l122p258j1760j5590j8444k1260k4310
$$ y = [891310, 887532, 884957, 883781, 884013, 885977, 890042, 895998, 903435, 912754, 925129, 941330, 961035, 983348, 1007524, 1033025, 1059164, 1084954, 1109325, 1131586, 1151724, 1170177, 1187223, 1202460, 1214405, 1220305, 1217205, 1204557, 1185904, 1166856, 1151037, 1138854, 1130151, 1126348, 1128941, 1137089, 1147819, 1157616, 1162679, 1158908, 1143959, 1119667, 1091134, 1062997, 1037160, 1013840, 993393, 976579, 963758, 954492, 947784, 942632, 938613, 935909, 934622, 934233, 933955, 933355, 932380, 931204, 930350, 930519, 931852, 933730, 935688, 938057, 941273, 945139, 949295, 953966, 959625, 966361, 974152, 983396, 994502, 1007331, 1021564, 1037285, 1054649, 1073430, 1093432, 1114915, 1138003, 1162011, 1185929, 1209209, 1231632, 1252875, 1272633, 1290597, 1305776, 1316545, 1322033, 1322827, 1319705, 1312447, 1300687, 1285097, 1266653, 1245393, 1221083]
59327A221083k6394k6719k6139k5780k5621k5075k3854k1758j8776j5846j4249
59316I70872j3855j3263j2038j1200j1069j0427q684p140o963p392p182o484o063
59303H49112n773n099m275l669k960j891r05j05J407M123O983Q751R629J0498
59289H65826J1456J2227J3129J4481J5564J5196J2828Q542K774l153p295q727
59277I52848q205o441k950K373P826J1481J3388J4863J6294J7070J7103J6927
59265A052577J6491J5154J2845J0206P596M686J104l012o936r663j0662j0614
59253A079772j0815j1558j1893j1192j0002q854p383n325l356k117j194Q2J591
59240I97756K854L805M475M715M816N476O573O890N799M126K728J306n33k291
$$ y = [1221083, 1194689, 1167970, 1141831, 1116051, 1090430, 1065355, 1041501, 1019743, 1000967, 985121, 970872, 957017, 943754, 931716, 920516, 909447, 899020, 890336, 883196, 876233, 868841, 861659, 855175, 849112, 843339, 838240, 833965, 830296, 827336, 825445, 824540, 824435, 825842, 829965, 836948, 845699, 855328, 865826, 877282, 889509, 902638, 917119, 932683, 947879, 960707, 969249, 972023, 968870, 961575, 952848, 944643, 938202, 935252, 937625, 945451, 956932, 970320, 985183, 1001477, 1018547, 1035650, 1052577, 1069068, 1084222, 1097067, 1107273, 1114869, 1119555, 1120659, 1117647, 1110711, 1101048, 1090386, 1079772, 1068957, 1057399, 1045506, 1034314, 1024312, 1015458, 1008075, 1002750, 999394, 997277, 996083, 996165, 997756, 1000610, 1004415, 1008890, 1013605, 1018421, 1023897, 1030470, 1037360, 1043159, 1047285, 1050013, 1051319, 1050786, 1048495]
59226A048495l633n321q005j0981j3269j4977j6513j7394j7069j6116j5415j4718
59214H95084j3249j1153r343q263p621o935n745l902k163j596j980j807m84P77
59200H21620R80R21J656K743L195L104L127L348L748M792O365P212O616N634N524
59185H80585N988O079N770N383M658L601L067L274K956J413K7J54R57J082J046
59170I26040J990L206L205K401K426L406M067M046M052M011L132J558J35j245
59156I62430l355n949q022r488j1015j2506j3373j3857j4500j4713j3629j1960
59144H30063j1169j1173j0654r359q265p681p008o247n878n456m099k349j646
59131G39079j971j778m13J226K527L885N363O254O394O491O943P554Q426R805
$$ y = [1048495, 1044862, 1039541, 1031536, 1020555, 1007286, 992309, 975796, 958402, 941333, 925217, 909802, 895084, 881835, 870682, 861339, 853076, 845455, 838520, 832775, 828873, 826710, 825114, 823134, 821327, 820843, 821620, 822600, 823521, 825177, 827920, 831115, 834219, 837346, 840694, 844442, 849234, 855599, 862811, 869427, 875061, 880585, 886573, 892652, 898422, 903805, 908463, 912064, 915131, 918405, 921361, 922774, 922801, 922955, 923912, 924994, 926040, 928030, 931236, 934441, 936842, 939268, 942674, 946741, 950787, 954839, 958850, 961982, 963540, 963675, 962430, 959075, 953126, 945104, 935616, 924601, 912095, 898722, 884865, 870365, 855652, 842023, 830063, 818894, 807721, 797067, 787708, 779443, 771762, 764754, 758507, 752629, 747173, 743074, 740725, 739079, 737108, 735330, 734917, 736143, 738670, 742555, 747918, 754172, 760566, 767057, 774000, 781554, 789980, 799785]
59117G99785J1156J1736J1939J2666J3597J3682J3154J3254J4012J4112J3034
59106I42127J1622J0317Q648O683N345M829M215L062J962J249M81m45j075j432
59092I97588k085k944l262k888k311j584n72q5j088k921l989m289n359p600r593
59077I47018j0482j1035j1763j1851j0804r614r256r344r124q622q116p470o708
59064H22829o282o164n629m377l026k100j482j144j460k382l154l196k638j825
59050G77970r93m45k86j36J87J05p10j315p47K58K52o40j011m28K66P04J298J879
59032G76208J871J828K993N239P134Q261R582J1413J2826J3541J4516J6121J7323
59019H98856J7313J6484J5339J3735J1581Q991N611J228k973n313n909o375p210
$$ y = [799785, 810941, 822677, 834616, 847282, 860879, 874561, 887715, 900969, 914981, 929093, 942127, 953749, 964066, 972714, 979397, 984742, 989571, 993786, 996848, 998810, 1000059, 1000540, 1000095, 999020, 997588, 995503, 992559, 989297, 986409, 984098, 982514, 981942, 981857, 980769, 977848, 973859, 969570, 964211, 956611, 947018, 936536, 925501, 913738, 901887, 891083, 881469, 872213, 862869, 853745, 845123, 837007, 829537, 822829, 816547, 810383, 804754, 800377, 797351, 795251, 793769, 792625, 791165, 788783, 785629, 782433, 779795, 777970, 776977, 776532, 776246, 776110, 776297, 776402, 775692, 774377, 773630, 773888, 774140, 773500, 772489, 772061, 772327, 773031, 774329, 776208, 778079, 779907, 782900, 788139, 795273, 803534, 813116, 824529, 837355, 850896, 865412, 881533, 898856, 916169, 932653, 947992, 961727, 973308, 982299, 987910, 989138, 986165, 980852, 974943, 968568, 961358]
59006I61358p333o349n240m375k826k68K252M106N845P722R024R469R541R063
58992I91989P224M518K695K203J572Qj435j987k448l461m375m836n585o622o387
58977I73073m021q10J776L938O322Q545J0137J1549J3105J4213J4623J5097J5900
58964A083447J6022J4928J3640J3057J2574J1383R749P960N356J509k822o852
58952A179951j0670j4273j7083j9163k1308k3227k3343k1414j9448j8860j8501
58941I72661j6832j4330j2175j0173p660n192l611k488j062K59P96R83J428J573
58927I04177O11r80k150k772l254l509l355l268l663m150m259m122l768k737j077
58912H61724K71Q41J303K162L029L826N296P589R655J0917J2124J3772J5149J5844
$$ y = [961358, 954025, 947676, 942436, 938061, 935235, 934967, 937219, 941325, 947170, 954892, 963916, 973385, 982926, 991989, 999213, 1003731, 1006426, 1008629, 1010201, 1010209, 1008774, 1006787, 1004339, 1000878, 996503, 991667, 986082, 979460, 973073, 969052, 968242, 970018, 973956, 980278, 988823, 998960, 1010509, 1023614, 1037827, 1052450, 1067547, 1083447, 1099469, 1114397, 1128037, 1141094, 1153668, 1165051, 1174800, 1182760, 1188116, 1189625, 1186803, 1179951, 1169281, 1155008, 1137925, 1118762, 1097454, 1074227, 1050884, 1029470, 1010022, 991162, 972661, 955829, 941499, 929324, 919151, 911491, 906299, 902688, 900200, 899138, 899397, 900193, 901176, 902604, 904177, 904788, 903808, 901658, 898886, 895632, 892123, 888768, 885500, 881837, 877687, 873428, 869306, 865538, 862801, 861724, 861995, 862836, 864139, 866301, 869330, 873156, 878452, 886041, 895696, 906613, 918737, 932509, 947658, 963502]
58898I63502J6688J8289K0067K1553K3059K4253K3955K2326K1314K1824K2451
58887A199281K2234K2459K4049K5328K4487K2393K0784J9234J6170J1683P140
58876A415242L008r99m609p651j1000j5092j8546j9952k0019k0211k0397j9665
58864A260109j8365j7363j6286j4403j2421j1617j1937j2603j3601j4930j5500
58853A101083j4606j3456j3354j3457j2342j0661j0036j0239r863r079r404j1066
58841I63520j2890j4356j5708j6308j5077j2606j0852j0652j1082j1138j0530
58830H22321q978o454l983k781k619k293j437n66K15J242K314L022L659M620N407
58815H13689N415N070N016M872M129L415L411L333K118M10l58k56m95j372k174
$$ y = [963502, 980190, 998479, 1018546, 1040099, 1063158, 1087411, 1111366, 1133692, 1155006, 1176830, 1199281, 1221515, 1243974, 1268023, 1293351, 1317838, 1340231, 1361015, 1380249, 1396419, 1408102, 1415242, 1418250, 1417251, 1412642, 1404991, 1393991, 1378899, 1360353, 1340401, 1320382, 1300171, 1279774, 1260109, 1241744, 1224381, 1208095, 1193692, 1181271, 1169654, 1157717, 1145114, 1131513, 1116583, 1101083, 1086477, 1073021, 1059667, 1046210, 1033868, 1023207, 1013171, 1002932, 993069, 983990, 974586, 963520, 950630, 936274, 920566, 904258, 889181, 876575, 865723, 855071, 843989, 832851, 822321, 813343, 806889, 802906, 800125, 797506, 795213, 793776, 793210, 793425, 794667, 796981, 800003, 803662, 808282, 813689, 819104, 824174, 829190, 834062, 838191, 841606, 845017, 848350, 850468, 850878, 850520, 850264, 849769, 848397, 846223]
58800H46223k692l255l691l710l884m767n657n643n206n291n463m686l269k303
58786G86706j687m45J431L079M270N343O064O092O023O499O860O193N068M582
58772H46078M324K965M42k116m107n675o742p278p901q797q880p424n613m803
58758G84473m375l071j346l72K71J651L138L236K170J318P93j09o83M57K780M417
58742G94748N022N811O983P559P629Q304R442R595Q489P431P169P203P321P852
58728I00558Q378Q094P397P400P962Q041P705P879Q372Q124P328P223P883Q223
58714A010567Q059Q163Q395P794O448N222L777R06l139o757r401j1894j4392j6118
58700I97630j7174j8680k0862k2789k3965k4535k4151k2464k0401j9045j7658
$$ y = [846223, 843531, 840276, 836585, 832875, 828991, 824224, 818567, 812924, 807718, 802427, 796964, 792278, 789009, 786706, 785019, 784574, 786005, 789084, 793354, 798697, 804761, 810853, 816876, 823375, 830235, 836428, 841496, 846078, 850402, 853367, 853809, 851693, 847586, 841911, 835169, 827891, 819990, 811193, 802313, 794889, 789276, 784473, 780098, 777027, 775681, 775309, 775580, 777231, 780369, 783605, 785775, 787093, 787886, 787777, 787094, 787551, 790331, 794748, 799770, 805581, 812564, 820123, 827752, 836056, 845498, 855093, 863582, 871013, 878182, 885385, 892706, 900558, 908936, 917030, 924427, 931827, 939789, 947830, 955535, 963414, 971786, 979910, 987238, 994461, 1002344, 1010567, 1018626, 1026789, 1035184, 1042978, 1049426, 1054648, 1058425, 1059331, 1056192, 1049435, 1040034, 1028140, 1013748, 997630, 980456, 961776, 940914, 918125, 894160, 869625, 845474, 823010, 802609, 783564, 765906]
58689G65906j4907j1559r604r071q218o672n820o069o266o034o173o560o023m611
58675F58319l671l341k304l04J354K164L097M515N686O650Q393J0742J2234J2467
58661G16001J2537J2811J2261J0315P427L705r82n469q092r055r909j0799j0574
58648G20177r442q933r055q263o420n107m640l586j641k52K01J029K457K976K320
58633F71821K293L653M714M242L224K632J747pj652k310k455k531k036q01M85
58618F83019J669L353N333O528O826P170P685P740P753Q625R395Q102N079K725
58604G71002J819R00l99o05M22O73o94k152k788l569m642m346k133K37J624K974
58588G58323M828O081O447P448R633J1470J2159J2963J4410J4974J3949J3020
$$ y = [765906, 750999, 739440, 729836, 720765, 712547, 705875, 700055, 693986, 687720, 681686, 675513, 668953, 662930, 658319, 654648, 651307, 649003, 648699, 650053, 652217, 655314, 659829, 665515, 672165, 680558, 691300, 703534, 716001, 728538, 741349, 753610, 763925, 771352, 775057, 774075, 768606, 760514, 751459, 741550, 730751, 720177, 710735, 701802, 692747, 684484, 678064, 672957, 668317, 664731, 663090, 662838, 663039, 664068, 666525, 669501, 671821, 674114, 677767, 682481, 686723, 689947, 692579, 694326, 694319, 692667, 690357, 687902, 685371, 683335, 682534, 683019, 684688, 688041, 693374, 699902, 706728, 713898, 721583, 729323, 737076, 745701, 755096, 763198, 768277, 771002, 772821, 773721, 773322, 772717, 773139, 773812, 773118, 770966, 768178, 764609, 759967, 755621, 753488, 753725, 755349, 758323, 763151, 769232, 775679, 783127, 792760, 804230, 816389, 829352, 843762, 858736, 872685, 885705]
58576H85705J3415J3899J3231J2275J2156J2481J2804J3794J5653J7458J9109
58565A041980K1808K5626K8889L0881L2722L4784L5773L5231L4199L2506K8383
58554A382782K1752J4880Q660J595o241j1791j3361j3212j3816j4555j4112j3232
58542A329349j2959j2851j2910j4662j8395k2028k4543k7575l1659l4065l2772
58531A084930k9703k7453k5469k2134j8100j4819j1973q979p007o996p526o923
58519H97848n680m783l719k143j467k570l912l891l187k917k581j604q82r60q72
58504H56680l21o32k075k787j973j329j654j217O47J579K01j161k75J476K053
58489H49212K266L557N077N791O913R441J1867J3005J4457J7536K0419K1257K1347
$$ y = [885705, 899120, 913019, 926250, 938525, 950681, 963162, 975966, 989760, 1005413, 1022871, 1041980, 1063788, 1089414, 1118303, 1149184, 1181906, 1216690, 1252463, 1287694, 1321893, 1354399, 1382782, 1404534, 1419414, 1428074, 1429669, 1423428, 1411637, 1398276, 1385064, 1371248, 1356693, 1342581, 1329349, 1316390, 1303539, 1290629, 1275967, 1257572, 1235544, 1211001, 1183426, 1151767, 1117702, 1084930, 1055227, 1027774, 1002305, 980171, 962071, 947252, 935279, 926300, 919293, 912297, 904771, 897848, 892168, 887385, 883666, 881523, 880056, 877486, 873574, 869683, 866496, 863579, 860998, 859394, 858512, 857552, 856680, 856359, 855727, 853652, 850865, 848892, 847563, 845909, 844692, 845339, 846918, 847119, 845958, 845683, 847159, 849212, 851478, 855035, 860112, 865903, 872816, 882257, 894124, 907129, 921586, 939122, 959541, 980798, 1002145]
58476A002145K2347K2966K1514J9094J7120J4212Q748K155l369q123j2883j6208
58464A089718j6819j6212j5834j4165r761m629j251J251M742Q376J0622J2449
58452A048487J5040J6802J6093J4380J3229J0819N188j540o202r451j3596j7775
58440A091474j9475j8926j7996j6476j3261r537p053m938j660J713L641N245P863
58427A000614R842R546R041J0790J3048J2837J1161J0787J0941Q831M727R99k370
58414A110794o870j1508j3981j4594j5166j5506j4655j3791j4167j4173j2222
58403I64161j0249j0325j0315p415l455j870j711J88L175M211L583L932N034M704
58389I43648L539L684M214K711K26l56M90K74l09J294M189N212M420M463N464
$$ y = [1002145, 1024492, 1047458, 1068972, 1088066, 1105186, 1119398, 1128146, 1130301, 1126932, 1118809, 1105926, 1089718, 1072899, 1056687, 1040853, 1026688, 1016927, 1012298, 1011047, 1012298, 1017040, 1025416, 1036038, 1048487, 1063527, 1080329, 1096422, 1110802, 1124031, 1134850, 1140038, 1138498, 1132296, 1122845, 1109249, 1091474, 1071999, 1053073, 1035077, 1018601, 1005340, 995803, 988750, 983812, 982152, 983865, 987506, 992751, 1000614, 1010456, 1020002, 1029043, 1039833, 1052881, 1065718, 1076879, 1087666, 1098607, 1107438, 1112165, 1113164, 1110794, 1103924, 1092416, 1078435, 1063841, 1048675, 1033169, 1018514, 1004723, 990556, 976383, 964161, 953912, 943587, 933272, 925857, 922402, 920532, 918821, 919009, 922184, 926395, 929978, 933910, 938944, 943648, 947187, 950871, 955085, 957796, 958022, 957666, 958156, 958430, 958121, 959415, 963604, 968816, 973236, 977699, 983163]
58374I83163N399M597N108O511O930P065Q735J0863J1415J1670J3861J6443J6667
58361A108427J5899J7137J9177J8804J6840J6377J6651J4587J0805Q273O522L122
58349A272621o16j470l83o82j733m73K264L300L437N764R167J0127R683J1704
58335A322710J5537J7238J7002J8312K0734K0728J8777J8513J9486J7910J4006
58324A520953J1438J0161O942K341o2o16k532m731l318O10K325J879L374O566
58310A555330P383O268P741J1806J3997J3773J4770J7036J7223J6161J7802K0992
58298A720282K0897J8195J8047K0341K0176J7726J8116K1457K2651K1249K1865
58287A941002K4587K4831K3000K4207K7992K8570K5892K5979K9645L1455L0769
$$ y = [983163, 988562, 993159, 998267, 1004778, 1011708, 1018773, 1027508, 1038371, 1049786, 1061456, 1075317, 1091760, 1108427, 1124326, 1141463, 1160640, 1179444, 1196284, 1212661, 1229312, 1243899, 1254704, 1262977, 1269499, 1272621, 1272005, 1270535, 1270152, 1269470, 1267737, 1267264, 1269528, 1272828, 1276265, 1282029, 1291196, 1301323, 1311006, 1322710, 1338247, 1355485, 1372487, 1390799, 1411533, 1432261, 1451038, 1469551, 1489037, 1506947, 1520953, 1532391, 1542552, 1549494, 1551835, 1551773, 1551157, 1548625, 1543894, 1540576, 1541186, 1543511, 1545390, 1548764, 1555330, 1562713, 1568981, 1576722, 1588528, 1602525, 1616298, 1631068, 1648104, 1665327, 1681488, 1699290, 1720282, 1741179, 1759374, 1777421, 1797762, 1817938, 1835664, 1853780, 1875237, 1897888, 1919137, 1941002, 1965589, 1990420, 2013420, 2037627, 2065619, 2094189, 2120081, 2146060, 2175705, 2207160, 2237929]
58276B237929L2897L8284M1397M1573M4013M8888N0614M9078N0299N4739N6560
58265B746271N5584N8035O4169O7507O7566P0634P6547P7952P4389P3583P6858
58254C509095P7129P3416P3024P6995P8133P6029P8995Q8142R4878R7182J02774
58243D425792J13053J20226J23567J31671J44992J53725J56819J64910J80238
58234E714993J92559J99577K11679K31206K47402K57742K73381K97211L18106
58225G943856L33627L56054L88746M19671M45863M80092N25399N68669O07999
58216A2069976O59481P27551P97143Q65369R50703J059609J176491J299358J451328
58207B1057009J643066J860824K107515K416826K809875L281108L846751M559550
$$ y = [2237929, 2270826, 2309110, 2350507, 2392080, 2436093, 2484981, 2535595, 2584673, 2634972, 2689711, 2746271, 2801855, 2859890, 2924059, 2991566, 3059132, 3129766, 3206313, 3284265, 3358654, 3432237, 3509095, 3586224, 3659640, 3732664, 3809659, 3887792, 3963821, 4042816, 4130958, 4225836, 4323018, 4425792, 4538845, 4659071, 4782638, 4914309, 5059301, 5213026, 5369845, 5534755, 5714993, 5907552, 6107129, 6318808, 6550014, 6797416, 7055158, 7328539, 7625750, 7943856, 8277483, 8633537, 9022283, 9441954, 9887817, 10367909, 10893308, 11461977, 12069976, 12729457, 13457008, 14254151, 15119520, 16070223, 17129832, 18306323, 19605681, 21057009, 22700075, 24560899, 26668414, 29085240, 31895115, 35176223, 39022974, 43582524]
58199D3582524N450442O504148P718920R138624J0800519J2713376J4910529J7430399
58191A28249481K0181575K2912837K5400873K7602399K9547447L1147273L2113587
58184C17155472L1817558K9037076K2185714J0501053m624813j9750314l1251392
58177C55070354l7335019l8463194l6253773l2271467k7606989k2967100j8752076
58170A41420736j5094072j2014048r595773p984687p237861p197967p500142p718742
58162F7077444p577286p063357o341399n567886m811381m106007l492489k985216
58154B5132423k557165k186035j879114j637211j433904j249847j093783r71801
58146A2123563q67178p67958o85126o25875n75355n21707m74578m42564m14960
$$ y = [43582524, 49032966, 55537114, 63256034, 72394658, 83195177, 95908553, 110819082, 128249481, 148431056, 171343893, 196744766, 224347165, 253894612, 285041885, 317155472, 348973030, 378010106, 400195820, 410696873, 406072060, 386321746, 355070354, 317735335, 279272141, 243018368, 210746901, 183139912, 160172812, 141420736, 126326664, 114312616, 104716843, 96732156, 89494295, 82296328, 74796186, 67077444, 59500158, 52436801, 46095402, 40527516, 35716135, 31610128, 28117639, 25132423, 22575258, 20389223, 18510109, 16872898, 15438994, 14189147, 13095364, 12123563, 11256385, 10488427, 9803301, 9177426, 8602071, 8080364, 7605786, 7163222, 6748262]
58137F748262l81557l49523l25732l02065k72401k45667k28414k12047j90087
58128D240769j71157j62385j56281j46114j38422j38276j37377j28850j19507
58119B942400j15854j11773j01518r1538q7930q4716p5931o7368o5312o4723n9431
58108B016306n3544n2303n1655m6877m2198m2258m3153m0809l9207m1724m3324
58097A519254l9828l6025l6344l6342l1710k6942k6650k6828k3148j9690k0947
58086A194800k3028k1101j8215j8596j9473j7391j5635j7588j9622j8073j6469
58075I89609j8436k0304j8267j6053j7832k0045j8020j4462j3763j3874j1454
58064H07099r222j0541j2211j0194p286p719r232p831n584o338q328q068p257
$$ y = [6748262, 6366705, 6017182, 5691450, 5389385, 5116984, 4871317, 4642903, 4430856, 4240769, 4069612, 3907227, 3750946, 3604832, 3466410, 3328134, 3190757, 3061907, 2942400, 2826546, 2714773, 2613255, 2521717, 2433787, 2349071, 2273140, 2205772, 2140460, 2075737, 2016306, 1962762, 1910459, 1858804, 1811927, 1769729, 1727471, 1684318, 1643509, 1604302, 1562578, 1519254, 1479426, 1443401, 1407057, 1370715, 1339005, 1312063, 1285413, 1258585, 1235437, 1215747, 1194800, 1171772, 1150671, 1132456, 1113860, 1094387, 1076996, 1061361, 1043773, 1024151, 1006078, 989609, 971173, 950869, 932602, 916549, 898717, 878672, 860652, 846190, 832427, 818553, 807099, 797877, 787336, 775125, 764931, 757645, 749926, 740694, 732863, 727279, 720941, 712613, 704545, 697288]
58051F97288q864j0641r259o926p277q674p861o298o679p140n083k847l509m972
58037F01258m123k933m406o462n845m343n188o935o840o557q591j0760j0098q658
58023E09519r521j0702r000o335o145o900n348k942k839l667k403n39j182k834
58009D39162k180m74r94k623k067j66l4r85j92J603J711R17J713K997K080J37
57993D40605K16J574J314m4O9J005K27j614k034j552k272l302k527j283k221m099
57977D24062l772j839j391k483k751k101k068j962l22J335P94n04J7J083K8j767
57961D06359j173O61J91k058k588j332j339k790k911j482j141k341k928k550k823
57946C79755l336k118K23J289J424K978N530O442N778O106P680Q363Q111Q967
$$ y = [697288, 688424, 677783, 668524, 661598, 654321, 645647, 637786, 631488, 624809, 617669, 612586, 609739, 606230, 601258, 597135, 594202, 589796, 583334, 577489, 573146, 567958, 561023, 554183, 547626, 539035, 528275, 518177, 509519, 499998, 489296, 480296, 473961, 467816, 460916, 455568, 452626, 449787, 446120, 443717, 443178, 441996, 439162, 436982, 436508, 435514, 432891, 430824, 430658, 430624, 429639, 429447, 431050, 432761, 433678, 435391, 438388, 440468, 440605, 440821, 442395, 443709, 443665, 443734, 444739, 444966, 443352, 441318, 439766, 437494, 434192, 431665, 430382, 428161, 424062, 420290, 418451, 417060, 414577, 411826, 409725, 407657, 405695, 405373, 406708, 407502, 406998, 407015, 408098, 408126, 406359, 405186, 405847, 406038, 403980, 401392, 400060, 398721, 395931, 393020, 391538, 390397, 388056, 385128, 382578, 379755, 376419, 374301, 374524, 375813, 377237, 380215, 385745, 392187, 397965, 404071, 411751, 420114, 428225, 437192]
57932D37192J0768J1247J0401J0412J1283J0762Q574O652N253K926P3j516k418
57919E21609m745p862r185q880r421j0709j0237p987o680o952o701n381m620m393
57905D17856k981r68p59j863j179J473K770J511L09P06J070N15O33J948K637K134
57889D25812K257L509L943K973K593L507L642J972L59J02n9j019j625j367j707
57874D44892l213m223l799l322l862m520m554m545m474l206q98O31Q54J241K346
57859D09348K828K252K077K984L881M431N794Q008R338R143Q769Q813Q202O766
57845D92634N932N941N162L087J310N84l51k083l433l987m988o677p505p035o906
57830D71685p847q345p443o245n544m540l073k452k924k847j577o20q20r13j34
$$ y = [437192, 447960, 459207, 469608, 480020, 491303, 502065, 510639, 517291, 522544, 525470, 525543, 524027, 521609, 516864, 509002, 499817, 490937, 481516, 470807, 460570, 452583, 445903, 438951, 432250, 426869, 422249, 417856, 414875, 413907, 413148, 411285, 410106, 411579, 414349, 415860, 416169, 416875, 417945, 418460, 419093, 421041, 423678, 425812, 428069, 431578, 435521, 438494, 441087, 444594, 448236, 450208, 450567, 450669, 450610, 449591, 447966, 446599, 444892, 441679, 437456, 433657, 430335, 426473, 421953, 417399, 412854, 408380, 405174, 404276, 404907, 405761, 407002, 409348, 412176, 414428, 416505, 419489, 423370, 427801, 433595, 441603, 450941, 460084, 468853, 477666, 485868, 492634, 498566, 504507, 509669, 512756, 514066, 514650, 514299, 512216, 508783, 504796, 499808, 493131, 485626, 478591, 471685, 463838, 455493, 448050, 441805, 436261, 431721, 428648, 426196, 423272, 420425, 418848, 418228, 417408, 416495, 416361]
57815D16361K80m95j392j635k082l183l908l856m094m813m611l260k649l772n156
57800C71735n623o087p189p679o673n328m712m133k968k004j632p67J026K405
57786C20371K534K505L210L911M126M771O283P634Q345R354J0839J1468J0946
57773D06297J0753J1295J0896Q978P485P545P419N579L213J701J32k533n095o204
57759D67461o673p585q103p387o727p444q378p777o111m839l880k507j348j254
57745C87448j335k81J349K048J636R56K73m44o65j18M90O95J018J545J313K48
57729C96176k4J356K990L565L817M606N000M069K826K444K178J054j4J63P75M92
57713D31473j50N9N76M3j351k310k507k465k314k218l042m973o526o360n130m106
$$ y = [416361, 416641, 416146, 414754, 413119, 411037, 407854, 403946, 400090, 395996, 391183, 386572, 383312, 380663, 376891, 371735, 366112, 360025, 352836, 345157, 338484, 333156, 328444, 324311, 321343, 319339, 317707, 316940, 317966, 320371, 322905, 325410, 328620, 332531, 336657, 341428, 347711, 355345, 363690, 373044, 383883, 395351, 406297, 417050, 428345, 439241, 448219, 455704, 463249, 470668, 476247, 479460, 481161, 481293, 478760, 473665, 467461, 460788, 453203, 445100, 437713, 430986, 423542, 415164, 407387, 401276, 396437, 392557, 390050, 388702, 387448, 386113, 385832, 387181, 389229, 390865, 391821, 392094, 391650, 390985, 390867, 391357, 392052, 393070, 394615, 395928, 396176, 396152, 397508, 400498, 404063, 407880, 412486, 417486, 421555, 424381, 426825, 429003, 430057, 430043, 430206, 430981, 431473, 431323, 431382, 431958, 432001, 430650, 428340, 425833, 423368, 421054, 418836, 415794, 410821, 404295, 397935, 392805, 388699]
57697C88699l237j994p94p6P59J915K195R06o42j237j725l098m286m037l422m088
57681C65838n163m415j623J490M038O543R265J2002J5167J9407K4539L0092L6147
57668E13327M2430M7710N1473N4917N8813O1569O0846N5434M4059K4690k142l0715
57656I82411n3681o7741p3907p3757o8337n9862n1168m3340l5893k9001k3448
57645D02276j8950j4711j1226r388q368o634m598l884m362m320l371k766k827
57632C06871k374r62M24J129J517J748J506J011O82k4j870m084n066m611l800
57617B92097k981j710m10j62q53j314j299j563k086j977j226q42j128j350j203
57602B71993j122j194j088r67j156j153m27K22l88j840k698k654k525k519k307
$$ y = [388699, 385462, 383468, 382674, 382598, 383357, 385272, 387467, 388373, 387731, 386494, 384769, 381671, 377385, 373348, 369926, 365838, 360675, 356260, 354637, 356127, 360165, 366708, 375973, 387975, 403142, 422549, 447088, 477180, 513327, 555757, 603467, 654940, 709857, 768670, 830239, 891085, 946519, 990578, 1015268, 1013126, 982411, 928730, 860989, 787082, 713325, 644988, 585126, 533958, 490618, 454725, 425724, 402276, 383326, 368615, 357389, 348001, 339633, 332999, 328401, 324517, 320155, 315835, 312464, 309698, 306871, 304497, 303535, 303959, 305088, 306605, 308353, 309859, 310870, 311552, 311528, 309658, 305574, 300508, 295897, 292097, 289116, 287406, 286996, 286834, 285981, 284667, 283368, 281805, 279719, 277742, 276516, 275674, 274546, 273196, 271993, 270871, 269677, 268589, 267622, 266466, 265313, 264886, 265108, 264720, 262880, 260182, 257528, 255003, 252484, 250177]
57587B50177k328l176l980l329j632o64r09j260j211j373j804j791j370j363j826
57572B22161k159k546l529m335l666k034j276j759k109j696j252r29j9J091R57
57557A96900m71j481j188n03m8P56J891K174J358R01J728K877L304L351L566L546
57541B18661K865J901R99lq36p73n7R2n79q60j98L30j28q55r55p63r46j288j246
57522B15361p87k2J031J869J776J069R31J598J992J563J163J486K005K103K070
57507B35208K168J925J115M70N80R86R97O75L69M0m39r16j286j588j730j685j893
57490B34996k613l191k904k277k295k670k361j501j140j194n97N05O92k78r12
57475B12260m46P6j94o09n82o79j310j832j844j915k235j982r28j92m76q94m41
$$ y = [250177, 247849, 244673, 240693, 237364, 235732, 235068, 234159, 232899, 231688, 230315, 228511, 226720, 225350, 223987, 222161, 220002, 217456, 213927, 209592, 205926, 203892, 202616, 200857, 198748, 197052, 195800, 194871, 194852, 195943, 196900, 196429, 194948, 193760, 193257, 193209, 193965, 195856, 198030, 199388, 200289, 202017, 204894, 208198, 211549, 215115, 218661, 221526, 223427, 224426, 224423, 223587, 222814, 222757, 222849, 222270, 221410, 221212, 221542, 221414, 220559, 219604, 218841, 217895, 216607, 215361, 214574, 214552, 215583, 217452, 219228, 220297, 221228, 222826, 224818, 226381, 227544, 229030, 231035, 233138, 235208, 237376, 239301, 240416, 240886, 241466, 242452, 243449, 244124, 244493, 244533, 244094, 243178, 241892, 240304, 238574, 236889, 234996, 232383, 229192, 226288, 224011, 221716, 219046, 216685, 215184, 214044, 212850, 212253, 212758, 213450, 213172, 212260, 211814, 211890, 211696, 211087, 210505, 209826, 208516, 206684, 204840, 202925, 200690, 198708, 197780, 197588, 197112, 196218, 195777]
57458A95777N63J351J838K076J755J055Q03J084Q92j55j019q86l34j19j5L62P80
57441B05808J093J580K011J648P40N33J310J948J932K092K611K349J119O42J839
57426B29255L040K453Q32j9J4j08m89m96j97m5J42N29M70l74j015n49L73P40Q82
57407B35438J587K441K614K449K759L201K873J946J294R49L55k77k46L44P60Q34
57391B59321R82J375J999L093M516N254M570L233K618L091M093N295O610P528
57377C13578P464O505N140L611K159J238Q62L35o91j632j990k123k284j953r21
57362C29298JK81O18J593K448K398K149K758L790L998L252K548K518L042L854
57347C64546M595M806M671N029N922O076M783L245K936L611M125M248M301M000
$$ y = [195777, 196340, 197691, 199529, 201605, 203360, 204415, 205218, 206302, 207194, 207039, 206020, 205134, 204800, 204681, 204666, 205028, 205808, 206901, 208481, 210492, 212140, 212880, 213413, 214723, 216671, 218603, 220695, 223306, 225655, 226774, 227416, 229255, 232295, 234748, 235580, 235561, 235575, 235467, 234978, 234482, 234285, 234240, 234382, 234911, 235381, 235007, 233992, 233443, 233816, 234556, 235438, 237025, 239466, 242080, 244529, 247288, 250489, 253362, 255308, 256602, 257551, 257906, 257629, 257383, 257727, 258487, 259321, 260303, 261678, 263677, 266770, 271286, 276540, 281110, 284343, 286961, 290052, 294145, 299440, 306050, 313578, 321042, 327547, 332687, 336298, 338457, 339695, 340557, 340892, 340201, 338569, 336579, 334456, 332172, 330219, 329298, 329299, 329580, 330198, 331791, 334239, 336637, 338786, 341544, 345334, 349332, 352584, 355132, 357650, 360692, 364546, 369141, 373947, 378618, 383647, 389569, 395645, 400428, 403673, 406609, 410220, 414345, 418593, 422894, 426894]
57333D26894L102K451K903L815L976L425L095L264L612M089M523M159K904K198
57319D74410L174M820N476N279N439N843N388M207L641M147M984N767O771P759
57305E47105Q083P884P860P978P701P255P379Q030Q632R227J0126J0774J0433
57292F58467R634R494R931R981R622R684J0202J0411J0262J0491J1266J2065J2758
57279G94268J3502J3926J3746J3770J4825J6138J6415J6072J6550J7722J8017
57268I64951J7140J6636J7465J8808J9667K0077K0300K0314K0478K1432K2938
57257A180206K4065K4637K5290K6129K6613K6876K7708K9175L0561L1771L3378
57246A486409L5293L6839L8125L9875M1842M3003M3411M4186M5464M6060M5574
$$ y = [426894, 429996, 432447, 435350, 439165, 443141, 446566, 449661, 452925, 456537, 460626, 465149, 469308, 472212, 474410, 477584, 482404, 487880, 493159, 498598, 504441, 509829, 514036, 517677, 521824, 526808, 532575, 539346, 547105, 555188, 563072, 570932, 578910, 586611, 593866, 601245, 609275, 617907, 627134, 637260, 648034, 658467, 668101, 677595, 687526, 697507, 707129, 716813, 727015, 737426, 747688, 758179, 769445, 781510, 794268, 807770, 821696, 835442, 849212, 864037, 880175, 896590, 912662, 929212, 946934, 964951, 982091, 998727, 1016192, 1035000, 1054667, 1074744, 1095044, 1115358, 1135836, 1157268, 1180206, 1204271, 1228908, 1254198, 1280327, 1306940, 1333816, 1361524, 1390699, 1421260, 1453031, 1486409, 1521702, 1558541, 1596666, 1636541, 1678383, 1721386, 1764797, 1808983, 1854447, 1900507, 1946081]
57235A946081M5168M5765M6962M8262N0010N2483N5213N7688N9720O1056O1723
57224B530131O2776O5260O8352P0048O9828O9069O8713O8201O7104O6106O5681
57213C271269O5286O4497O3729O3413O3700O5197O8549P2940P6421P8194P9170
57202D032365Q0050Q0272P9296P7356P4579P0879O7089O4618O3505O2362O0600
57191D812971N9095N8264N7289N5814N4615N3904N2800N1204N0470N1260N2439
57180E410125N3015N3508N4444N5182N5330N5808N7287N8879N9542N9509N9385
57169F032014N8946N7856N6467N5081N3513N2034N1394N1365N0659M8933M7277
57158F615539M6125M4434M1781L9384L7952L6404L3902L1469L0179K9277K7613
$$ y = [1946081, 1991249, 2037014, 2083976, 2132238, 2182248, 2234731, 2289944, 2347632, 2407352, 2468408, 2530131, 2592907, 2658167, 2726519, 2796567, 2866395, 2935464, 3004177, 3072378, 3139482, 3205588, 3271269, 3336555, 3401052, 3464781, 3528194, 3591894, 3657091, 3725640, 3798580, 3875001, 3953195, 4032365, 4112415, 4192687, 4271983, 4349339, 4423918, 4494797, 4561886, 4626504, 4690009, 4752371, 4812971, 4872066, 4930330, 4987619, 5043433, 5098048, 5151952, 5204752, 5255956, 5306426, 5357686, 5410125, 5463140, 5516648, 5571092, 5626274, 5681604, 5737412, 5794699, 5853578, 5913120, 5972629, 6032014, 6090960, 6148816, 6205283, 6260364, 6313877, 6365911, 6417305, 6468670, 6519329, 6568262, 6615539, 6661664, 6706098, 6747879, 6787263, 6825215, 6861619, 6895521, 6926990, 6957169, 6986446, 7014059]
57147G014059K5492K3780K2306K0403J7911J4592R831L786k412q377j4774k1249
57135G105348k6005k8333k9412k9462k6542j9622j0746k411M923J1037J4011J2471
57123F975257P853K081n263j5262k6674l6805m3844m6557m3655l5765k6151j7168
57111F688047p786L472J5530K7358M1043N9238Q1768J07960J40166J81648K33345
57100G571789K96357L75309M75201N97032P40504R08254J102482J319507J552373
57091A4938808J795539K040758K271037K465851K610604K695897K714424K669625
57083C4202543K579703K452914K260065J958669J558075J138316P78657M74313
57075D7403255J45289k74864p77648j301667j786671k194777k502942k702055
$$ y = [7014059, 7039551, 7063331, 7085637, 7106040, 7123951, 7138543, 7148374, 7152160, 7149748, 7141371, 7126597, 7105348, 7079343, 7051010, 7021598, 6992136, 6965594, 6945972, 6935226, 6932815, 6937738, 6948775, 6962786, 6975257, 6983110, 6985191, 6979928, 6964666, 6937992, 6901187, 6857343, 6810786, 6767131, 6731366, 6705215, 6688047, 6680261, 6683733, 6699263, 6726621, 6767664, 6826902, 6908670, 7016630, 7156796, 7338444, 7571789, 7868146, 8243455, 8718656, 9315688, 10056192, 10964446, 12066928, 13386435, 14938808, 16734347, 18775105, 21046142, 23511993, 26122597, 28818494, 31532918, 34202543, 36782246, 39235160, 41495225, 43453894, 45011969, 46150285, 46928942, 47403255, 47548544, 47273680, 46496032, 45194365, 43407694, 41212917, 38709975, 36007920]
57067C6007920k803020k828117k792374k699204k552646k365533k154576j933816
57059A5878634j714585j506652j316568j147196r99893q75087p70467o81460o04546
57050F262180n38423m81875m32725l89466l51914l19604k91105k65361k42196
57041B949511k21076k01015j82084j65423j51156j37835j24569j12176j01434
57032A552743r1668q2039p2917o4771n6873m8332l9605l1652k4179j5955o606
57021A018146K923J1630J9342K6431L3204L9494M4526M7348M7294M3207L2293
57010A365838J1666j7486m8267p2231q5163q8155q4328p6339o6505n6881m8375
56999G33774m0790l4051k8440k3645j8921j4358j0751q075n359k354J1J319K436
$$ y = [36007920, 33204900, 30376783, 27584409, 24885205, 22332559, 19967026, 17812450, 15878634, 14164049, 12657397, 11340829, 10193633, 9193740, 8318653, 7548186, 6866726, 6262180, 5723757, 5241882, 4809157, 4419691, 4067777, 3748173, 3457068, 3191707, 2949511, 2728435, 2527420, 2345336, 2179913, 2028757, 1890922, 1766353, 1654177, 1552743, 1461075, 1379036, 1306119, 1241348, 1184475, 1136143, 1096538, 1064886, 1040707, 1024752, 1018146, 1021069, 1032699, 1052041, 1078472, 1111676, 1151170, 1195696, 1243044, 1290338, 1333545, 1365838, 1377504, 1360018, 1311751, 1239520, 1154357, 1066202, 981874, 905535, 839030, 782149, 733774, 692984, 658933, 630493, 606848, 587927, 573569, 562818, 554743, 549384, 547030, 547041, 548360, 550796]
56986E50796M023N578O610P583Q803R439Q544O139K470k779r419j5693j9505k0368
56972E42221j9356j7578j5490j3218j0728p933n065k548j37K994O851J0175J2132
56959D82320J3482J5256J7168J8340J8693J8258J5800R684R2j0688k0089k6567
56947E51749k9539k9263k6833k3456j9591j5256j0873o981l486Q8L810P503J1352
56934D09224J5532J9498K2493K4559K6300K7774K8100K5891J9705Q859n201j8883
56922F03851k8822l4157l5930l5159l2474k8942k5718k3019k0479j8230j6492
56911C04429j4598j1755q605o577n780m875l170j555j072j602k271k266j206N55
56897B39652J969K485K953M417O383P557Q035R185J1360J3346J4415J5374J6932
$$ y = [550796, 554819, 560397, 567007, 574590, 583393, 592832, 601376, 607515, 609985, 607206, 597787, 582094, 562589, 542221, 522865, 505287, 489797, 476579, 465851, 457918, 452853, 450305, 450168, 453162, 460013, 470188, 482320, 495802, 511058, 528226, 546566, 565259, 583517, 599317, 609001, 609093, 598405, 578316, 551749, 522210, 492947, 466114, 442658, 423067, 407811, 396938, 389957, 386471, 386559, 390369, 397872, 409224, 424756, 444254, 466747, 491306, 517606, 545380, 573480, 599371, 619076, 627935, 622734, 603851, 575029, 540872, 504942, 469783, 437309, 408367, 382649, 359630, 339151, 320921, 304429, 289831, 278076, 269471, 262894, 257114, 252239, 249069, 247514, 246442, 244840, 242569, 240303, 239097, 239652, 241621, 244106, 247059, 251476, 257859, 265416, 273451, 282636, 293996, 307342, 321757, 337131, 354063]
56884C54063J8362J8533J7104J4020Q901J861n738j2136j6307j7877j6787j3651
56872C50348r791o245l049J82L507O896J0609J4852J9417K3979K8426L2562L5994
56859E07687L8488M0023M0190L7869L1687K0866N969j0560k4924l4007l7214l6030
56847E80044l2081k6339j9730j3172o743K51Q046J6028K3780L1573L9480M6795
56835F47932N2825N7628O1543O4356O5058O1919N2736L5899J1964j5765m2252
56824A053843o2459p3178p4448o9367o1596n2807m2928l2278k2236j3708o149
56813E42689J428R263J6965K4126L0455L5804M0236M3725M5680M4906L9770K8321
56801I03368R546j4273l7270n3674o1818o3580o0849n4381m5595l6911k9666k3290
$$ y = [354063, 372425, 390958, 408062, 422082, 430983, 432844, 427106, 414970, 398663, 380786, 363999, 350348, 340557, 334312, 331263, 331445, 334952, 341848, 352457, 367309, 386726, 410705, 439131, 471693, 507687, 546175, 586198, 626388, 664257, 695944, 716810, 722779, 712219, 687295, 653288, 616074, 580044, 547963, 521624, 501894, 488722, 481979, 482230, 490276, 506304, 530084, 561657, 601137, 647932, 700757, 758385, 819928, 884284, 949342, 1011261, 1063997, 1099896, 1111860, 1096095, 1053843, 991384, 918206, 843758, 774391, 712795, 659988, 617060, 584782, 562546, 548838, 542689, 544117, 553380, 570345, 594471, 624926, 660730, 700966, 744691, 790371, 835277, 875047, 903368, 912914, 898641, 861371, 807697, 745879, 682299, 621450, 567069, 521474, 484563, 454897, 431607]
56789D31607j7101j1221n435J012P684J2740J5433J7286J9791K2371K3600K3032
56777E40799K0515J4971N565o515j8593k8416l4828l7451l6843l4466l1471k7916
56765C25351k3714j9612j6407j3910j1643r907r198r026q304o737m970l624k801
56752A85498k401k307k368k474k546k330j636q68p57j366j987k114j907j549r52
56737A57936k49K11N29J073J583J374N81J14K11K77K80R14J982K219J359Q42J564
56720A72800K406K084J129P62R19P79L83L93Q70J476K263L183L511K762J651J103
56704A98474R45N52J34K33N62M22m3j06L30O81N89J61l84o88l72K89L70m19j124
56685B00606r02j50M01R01J717K343K145J535J365J618J696J566J581J540R79
$$ y = [431607, 414506, 403285, 397850, 398862, 406546, 419286, 434719, 452005, 471796, 494167, 517767, 540799, 561314, 576285, 581850, 575335, 556742, 528326, 493498, 456047, 419204, 384738, 353267, 325351, 301637, 282025, 265618, 251708, 240065, 230158, 220960, 211934, 203630, 196893, 191923, 188299, 185498, 183097, 180790, 178422, 175948, 173402, 171072, 169436, 168568, 167811, 166445, 164458, 162344, 160437, 158888, 157936, 157687, 157898, 158427, 159500, 161083, 162457, 163038, 163152, 163363, 163640, 163920, 164834, 166816, 169035, 170394, 171236, 172800, 175206, 177290, 178419, 179181, 180100, 180879, 181262, 181655, 182525, 184001, 186264, 189447, 192958, 195720, 197371, 198474, 199419, 199971, 200105, 200338, 200900, 201322, 201279, 201173, 201503, 202184, 202773, 202934, 202550, 201862, 201490, 201779, 202149, 201730, 200606, 199704, 199554, 199955, 200856, 202573, 204916, 207061, 208596, 209961, 211579, 213275, 214841, 216422, 217962, 218941]
56670B18941J15l53k50M4K91M66M46L02M93J155J578J119K43mO92J723K302K022
56652B31325J122M99R35K028K549K095J516J390J190N10q2j40j84p09j242j277
56636B41525j168j261j167p43p27j521k334k496k499k779k668j712q65j017j422
56621B17146j010l17n38j505k105k118k112k138j889j657j835j928j260j82N47
56606A97099R13J197J103N04J62N15O69p7o80J10J625K269J901J517J307P85K26
56589B11145K96P33R42J300K236K778J875N22N31J657K005J022J3j96j29j19K19
56572B26830P98J036J168J996L332M126M178M264M619M865N297O563Q177R051
56558B86300R523J1040J3652J5590J5580J3960J1177O911J336m076p664q798p848
$$ y = [218941, 219056, 218703, 218453, 218497, 218788, 219254, 219700, 220002, 220495, 221650, 223228, 224347, 224590, 224586, 225278, 227001, 229303, 231325, 232447, 232946, 233881, 235909, 238458, 240553, 242069, 243459, 244649, 245159, 245077, 244937, 244753, 244044, 242802, 241525, 240357, 239096, 237929, 237186, 236459, 234938, 232604, 230108, 227609, 224830, 222162, 220450, 219585, 218568, 217146, 216136, 215819, 215281, 213776, 211671, 209553, 207441, 205303, 203414, 201757, 199922, 197994, 196734, 196552, 197099, 198012, 199209, 200312, 200816, 200978, 201493, 202162, 202085, 201405, 201515, 203140, 205409, 207310, 208827, 210134, 210919, 211145, 211441, 212174, 213116, 214416, 216652, 219430, 221305, 221827, 222358, 224015, 226020, 227042, 227055, 226859, 226730, 226611, 226830, 227628, 228664, 229832, 231828, 235160, 239286, 243464, 247728, 252347, 257212, 262509, 269072, 277249, 286300, 295823, 306863, 320515, 336105, 351685, 365645, 376822, 383733, 385069, 380993, 373329, 364531, 356683]
56545C56683n992m846n122n687n068l632k980l489m062m128m244m591m435l439
56531B94968k178j195o47p80j598k210j823j124j349k276k594j974j194n66N8
56516B73518J26j011k492k852k266k067k298j887j013r66j643j615r02j221k890
56501B48521l922l064j494n90q6M91N36k37p76l64J07l26j083j072k62O99J484
56484B38562J939J829J327R50O88J21m95m05K56N45L39M69J074J235O18j2j86
56467B48854k26j80L02P88L83m90l18J099K149J763P05M6j29l4K90L96j72o67
56449B54559P6J495J844J026Q55K067L182L103K679K761K608J408k73j549k314
56434B73527k466j540J2O49k63j560k036j828j463r98n76n12m10M35J485J397
$$ y = [356683, 350691, 345845, 340723, 335036, 329968, 326336, 323356, 319867, 315805, 311677, 307433, 302842, 298407, 294968, 292790, 291595, 290948, 290168, 288570, 286360, 284537, 283413, 282064, 279788, 277194, 275220, 274026, 273460, 273518, 273644, 272633, 270141, 267289, 265023, 262956, 260658, 258771, 257758, 256792, 255149, 253534, 252632, 251411, 248521, 244599, 241535, 240041, 239451, 239365, 239856, 240392, 240155, 239379, 239015, 239122, 238796, 237713, 236641, 236379, 237078, 238562, 240501, 242330, 243657, 244607, 245295, 245416, 244921, 244516, 244772, 245317, 245656, 246125, 247199, 248434, 249052, 249040, 248854, 248628, 248448, 248750, 249538, 249921, 249431, 249113, 250212, 252361, 254124, 254829, 254875, 254746, 254712, 255002, 255398, 255226, 254559, 254635, 256130, 257974, 259000, 259855, 261922, 265104, 268207, 270886, 273647, 276255, 277663, 277390, 275841, 273527, 271061, 269521, 269533, 270182, 269919, 268359, 266323, 264495, 263032, 262034, 261458, 260946, 260536, 260971, 262456, 263853]
56418B63853J56r20j370j786j789k12K318L496K679J715J663J295j72j433j476
56403B68017j251j559j504m66M53M27L30P94R03K30P6J099J808J020o0J9O53P60
56385B71749Q55J667K354K008J466J794K319K005J428J595K000J592O55J20j1
56370B93596j71j20L57O99N71O39J308J907J990K020K042J269q2m09P84J850J564
56353C09814Q70Q57J017Q37J117K161K603J646O10O71R47L85k59m8L66L59Q41
56336C24794K394L730L790L612M267M779M063L183L568M557M712M148L674L108
56322C78379K227J876K369K392J208K23N85J026J04j278j580j169j057q52k9M63
56306C84887lL9J915M432N807O331P039P468O986O683P634Q755Q574P617O984
$$ y = [263853, 264009, 263089, 261719, 259933, 258144, 257932, 260250, 263746, 266425, 268140, 269803, 271098, 270926, 269493, 268017, 266766, 265207, 263703, 263237, 263690, 264117, 264447, 265241, 266144, 266374, 266450, 267549, 269357, 270377, 270317, 270336, 270989, 271749, 272604, 274271, 276625, 278633, 280099, 281893, 284212, 286217, 287645, 289240, 291240, 292832, 293487, 293607, 293596, 293425, 293305, 293662, 294361, 294932, 295571, 296879, 298786, 300776, 302796, 304838, 306107, 306025, 305616, 306400, 308250, 309814, 310684, 311541, 312558, 313395, 314512, 316673, 319276, 320922, 321532, 322203, 323150, 323535, 323276, 323228, 323594, 323953, 324794, 327188, 330918, 334708, 338320, 342587, 347366, 351429, 354612, 358180, 362737, 367449, 371597, 375271, 378379, 380606, 382482, 384851, 387243, 388451, 388674, 389259, 390285, 390389, 389111, 387531, 386362, 385305, 384453, 384424, 384887, 384884, 384923, 386838, 391270, 397077, 403408, 410447, 417915, 424901, 431584, 439218, 447973, 456547, 464164, 471148]
56291D71148O220M706L465L407L567L101L149M562N902N956O085P601R022Q735
56277E46626Q105R048J0586J0911J0798J1763J2809J2363J1695J2911J5159J6296
56265F89070J6794J8511K0974K2435K3411K5676K8874L1468L4023L8244M3798
56254I93278M9309N5214O2512O9996P6151Q2479R1300J01556J10466J18093J26498
56243A936852J35309J42091J46370J49439J50842J48720J43198J35782J25999
56234C214602J12097R4548P5277N4185L0053M302j9861m1582o2108q0978r6226
56223C284309j07915j17797j25662j29695j30223j29586j28462j25611j21051
56214B168307j16171j11000j04589r7727r2087q7190q1347p4963o9686o5089n9563
$$ y = [471148, 477368, 482074, 485539, 488946, 492513, 495614, 498763, 503325, 509227, 515183, 521268, 528869, 537891, 546626, 554731, 563779, 574365, 585276, 596074, 607837, 620646, 633009, 644704, 657615, 672774, 689070, 705864, 724375, 745349, 767784, 791195, 816871, 845745, 877213, 911236, 949480, 993278, 1042587, 1097801, 1160313, 1230309, 1306460, 1388939, 1480239, 1581795, 1692261, 1810354, 1936852, 2072161, 2214252, 2360622, 2510061, 2660903, 2809623, 2952821, 3088603, 3214602, 3326699, 3421247, 3496524, 3550709, 3580762, 3585064, 3565203, 3523621, 3461513, 3380535, 3284309, 3176394, 3058597, 2932935, 2803240, 2673017, 2543431, 2414969, 2289358, 2168307, 2052136, 1941136, 1836547, 1738820, 1646733, 1559543, 1478196, 1403233, 1333547, 1268458, 1208895]
56203A208895n3693m9297m6013m2267l8554l6096l3523k8848k3577k0716j9738
56192H16573j7857j5214j4128j4152j2678r888q371q155o936m825m104m542l752
56179F91971j944j477k023j134N99K23j817j905M65K052J827K269M021M700L920
56164G01747M323O485P776P358P533R096J0092J0234J1722J4625J6181J5829J6286
56151H39287J8600K0737K2112K4795K9175L3072L6177M0800M7297N3405N9007
56140A224464O6763P7126Q7456R6854J06925J17169J24876J30365J36787J43643
56130B312428J46067J41737J33019J21231J04980Q5900O9921O0278N4225M8468
56120C278254M2551L5208K3135N952j2454k9496m5915o1049p1903p8913q7080
$$ y = [1208895, 1155202, 1105905, 1059892, 1017625, 979071, 942975, 909452, 880604, 857027, 836311, 816573, 798716, 783502, 769374, 755222, 742544, 732656, 724285, 716130, 709194, 704369, 700265, 695723, 691971, 690027, 688550, 686527, 685393, 685992, 686215, 684398, 682493, 682958, 685010, 686837, 689106, 693127, 697827, 701747, 706070, 712555, 720331, 727689, 735222, 744318, 754410, 764644, 776366, 790991, 807172, 823001, 839287, 857887, 878624, 900736, 925531, 954706, 987778, 1023955, 1064755, 1112052, 1165457, 1224464, 1291227, 1368353, 1455809, 1552663, 1659588, 1776757, 1901633, 2031998, 2168785, 2312428, 2458495, 2600232, 2733251, 2854482, 2959462, 3045362, 3115283, 3175561, 3229786, 3278254, 3320805, 3356013, 3379148, 3385100, 3372646, 3343150, 3297235, 3236186, 3164283, 3085370, 2998290]
56109B998290r9108j12469j24945j37282j48312j53329j50013j41043j28939j13666
56099A689184r6928q2834p2067o1135m9283m0195l4903k9515k2331j6702j4176
56088A169115j1389o633l091k425j514J268K853J765J398L655N407M670M205N810
56074A175094P080O960Q313J1809J3671J2612J2543J5197J6867J5701J5315J7617
56062A328779J9035J7674J7091J9184K0248J8090J6085J6334J5865J3442J2786
56051A514613J5184J6350J4606J4433J7909K0577J9935J9828K2202K3019K0865
56040A719521K0738K4550K6957K5610K6155L1609L6328L6459L6772M0883M4337
56029B069919M3962M4434M8673N1510M9884M9487N4009N7657N6113N4791N8391
$$ y = [2998290, 2899182, 2786713, 2661768, 2524486, 2376174, 2222845, 2072832, 1931789, 1802850, 1689184, 1592256, 1509422, 1437355, 1376220, 1326937, 1286742, 1251839, 1222324, 1199993, 1183291, 1169115, 1157726, 1151093, 1148002, 1145577, 1144063, 1145331, 1148184, 1149949, 1151347, 1155002, 1160409, 1165079, 1169284, 1175094, 1182174, 1189134, 1197447, 1209256, 1222927, 1235539, 1248082, 1263279, 1280146, 1295847, 1311162, 1328779, 1347814, 1365488, 1382579, 1401763, 1422011, 1440101, 1456186, 1472520, 1488385, 1501827, 1514613, 1529797, 1546147, 1560753, 1575186, 1593095, 1613672, 1633607, 1653435, 1675637, 1698656, 1719521, 1740259, 1764809, 1791766, 1817376, 1843531, 1875140, 1911468, 1947927, 1984699, 2025582, 2069919, 2113881, 2158315, 2206988, 2258498, 2308382, 2357869, 2411878, 2469535, 2525648, 2580439, 2638830]
56018B638830O2261O2279O3153O8598P3458P4057P5904Q2654Q8269Q8881R1058
56007C469402R9144J06168J07020J08644J16764J24849J27112J30044J39605J49489
55997D678241J53958J59666J72558J86033J94414K04789K22589K39527K49313
55988F461088K60781K81425L03099L18813L37698L67606L99402M25163M54707
55979I609782M96624N40981N79578O24426O86323P54963Q21433Q99381J001186
55970A6014677J115517J233175J371849J549092J756209J988047K272017K636761
55962B9937344L081977L614298M280197N122179O134796P307406Q675199J0283006
55954G8436402J2143301J4279220J6739208J9477051K2270245K4869999K7205904
$$ y = [2638830, 2701091, 2763370, 2826523, 2895121, 2968579, 3042636, 3118540, 3201194, 3289463, 3378344, 3469402, 3568546, 3674714, 3781734, 3890378, 4007142, 4131991, 4259103, 4389147, 4528752, 4678241, 4832199, 4991865, 5164423, 5350456, 5544870, 5749659, 5972248, 6211775, 6461088, 6721869, 7003294, 7306393, 7625206, 7962904, 8330510, 8729912, 9155075, 9609782, 10106406, 10647387, 11226965, 11851391, 12537714, 13292677, 14114110, 15013491, 16014677, 17130194, 18363369, 19735218, 21284310, 23040519, 25028566, 27300583, 29937344, 33019321, 36633619, 40913816, 46035995, 52170791, 59478197, 68153396, 78436402, 90579703, 104858923, 121598131, 141075182, 163345427, 188215426, 215421330]
55947B15421330K9339086L1232729L2613309L2870476L0843171K4907452J3970443
55940D11197996j098121j7147325l0311794l8202479m0776036l9482886l5971257
55933B08208098l1480921k6847306k2567067j8821706j5612790j2922932j0730569
55926F9224807q955891p496021o295931n329864m546105l886117l331633k883266
55918B6499979k514921k191927j911708j685811j500538j331713j180192j058341
55910A3124828r57464q60374p71083p02185o46449n88618n32378m89434m54172
55901G122671m14123l74058l45786l24656k98823k71661k53260k39360k19720
55892D381224j98404j85540j77363j63900j48448j40532j36955j28191j16657
$$ y = [215421330, 244760416, 275993145, 308606454, 341476930, 372320101, 397227553, 411197996, 410099875, 392952550, 362640756, 324438277, 283662241, 244179355, 208208098, 176727177, 149879871, 127312804, 108491098, 92878308, 79955376, 69224807, 60268916, 52772895, 46476964, 41147100, 36600995, 32714878, 29383245, 26499979, 23985058, 21793131, 19881423, 18195612, 16695074, 15363361, 14183169, 13124828, 12167364, 11306990, 10535907, 9833722, 9187273, 8598655, 8066277, 7576843, 7122671, 6708548, 6334490, 5988704, 5664048, 5365225, 5093564, 4840304, 4600944, 4381224, 4182820, 3997280, 3819917, 3656017, 3507569, 3367037, 3230082, 3101891, 2985234]
55883B985234j10902j08111r9568q7712q1196p8379p1513o2263n7848n6486n1256
55872B120000m3967m1326m1846l9909l8234m3075n1360n5418n6139n9044o1780
55861A587902n8261n1169m7867m7424m3676l7636l4986l4524l0817k5281k3457
55850A152804k4104k1935j8415j9051k2668k3783k3021k4846k7560k5926k1475
55839I00020k0128k1585k0676j7322j5682j5462j3224j0431j1087j3366j2330
55828G28727r001q096q939p386m597m980p369p098n062n935r045r695q109q418
55814F24997j0123r088n854m593m918k956M99J219j00J153M824O456N751O676
55800F13943R486J0419R074Q680R181P280L154N5k288o878j2636j5412j5362j6241
$$ y = [2985234, 2874332, 2766221, 2666653, 2578941, 2497745, 2419366, 2347853, 2285590, 2227742, 2171256, 2120000, 2076033, 2034707, 1992861, 1952952, 1914718, 1871643, 1820283, 1764865, 1708726, 1649682, 1587902, 1529641, 1478472, 1430605, 1383181, 1339505, 1301869, 1266883, 1232359, 1201542, 1176261, 1152804, 1128700, 1106765, 1088350, 1069299, 1046631, 1022848, 999827, 974981, 947421, 921495, 900020, 879892, 858307, 837631, 820309, 804627, 789165, 775941, 765510, 754423, 741057, 728727, 719726, 711630, 702691, 695305, 690708, 685728, 678359, 671261, 666199, 660264, 651219, 641524, 633415, 624997, 614874, 605786, 599932, 595339, 590421, 587465, 587964, 589183, 589083, 590236, 595060, 601516, 607267, 613943, 623429, 633848, 642922, 651602, 660783, 668063, 671217, 671272, 668984, 662106, 649470, 634058, 618696, 602455]
55786F02455j7993j7182j4332j3384j4064j2232p884n466n856n365l337l493o634
55773D75233q805q096p018o923n986l925k993l281k364l83k07j986k924k696l685
55758D13961n562n444l719l937o315p221n788n245o717p426o284n746o743o921
55744C30893n394m429n089n646n354n507n951m977l174l039m337m355k884k289
55730B68468k566j482K73n19l563m841l270k140k978l321j946j080j805k168j401
55715B35661j392k464k228j09J326R91R02J982K505J952K089L007K507N58o1J176
55699B48402J351p04k534k735k959l779l175r19P3j243k021n62R13O87N79K104
55683B33478L497L135K514L370M797N414N621N816N183L780L022K765J048k075
$$ y = [602455, 584462, 567280, 552948, 539564, 525500, 513268, 505384, 499918, 494062, 488697, 485360, 481867, 475233, 466428, 458332, 451314, 444391, 438405, 434480, 431487, 428206, 425842, 425459, 425252, 423266, 420342, 417646, 413961, 408399, 402955, 399236, 395299, 388984, 381763, 375975, 370730, 364013, 356587, 350303, 344557, 337814, 330893, 325499, 321070, 315981, 310335, 304981, 299474, 293523, 288546, 285372, 282333, 277996, 273641, 270757, 268468, 265902, 264420, 264693, 264174, 260611, 255770, 252500, 250360, 247382, 244061, 242115, 241035, 239230, 237062, 235661, 234269, 231805, 229577, 229468, 230794, 231785, 232687, 234669, 237174, 239126, 241215, 244222, 246729, 247287, 247226, 248402, 249753, 249049, 246515, 243780, 240821, 237042, 233867, 232948, 233021, 231778, 229757, 229195, 230108, 230795, 231374, 233478, 236975, 240110, 242624, 245994, 250791, 256205, 261826, 267642, 272825, 276605, 279627, 282392, 283440, 281365]
55669B81365l788k951j816j886j627J1J327J067O29J211J708J255J012J748K399
55654B81664K488L063M056L756K137J391J922J230j715m498n306n507o399o791
55640B71491n904n401o399p376p022o341o122n243l363k310k937l416k517j701
55626B05439k044k133r87j18o16r50J21J152P17p3R0L65k04p26m83n42j467j867
55608A95674j046o09j613k607k388k059k478k381j083l80j519k780k396j447j577
55593A69311k102j713r32o62l14N30O78m14j091k18P67N11K13J282K738L154L154
55576A74892L754M260M018M263N975P827Q408Q626R699J0677J0282R379R383R754
55562B81197R249Q060O726M587J275j919m047o119q839j0751j0606r718r755j0058
$$ y = [281365, 277577, 274626, 272810, 270924, 269297, 269308, 270635, 271702, 272331, 273542, 275250, 276505, 277517, 279265, 281664, 284152, 287215, 291271, 295027, 297164, 298555, 300477, 301707, 299992, 295494, 290188, 284681, 278282, 271491, 265587, 260186, 253787, 246411, 239389, 233048, 226926, 221683, 218320, 216010, 213073, 209657, 207140, 205439, 203395, 201262, 200275, 200157, 199541, 198591, 198712, 199864, 200581, 200508, 200598, 200963, 200759, 200033, 199550, 199008, 197541, 195674, 194628, 194019, 192406, 189799, 187411, 185352, 182874, 180493, 179410, 179030, 177511, 174731, 172335, 170888, 169311, 167209, 165496, 164564, 163902, 163588, 164118, 164796, 164382, 163291, 163073, 163840, 164351, 164564, 165846, 168584, 171738, 174892, 178646, 182906, 186924, 191187, 197162, 204989, 213397, 222023, 231722, 242399, 252681, 262060, 271443, 281197, 290446, 298506, 305232, 309819, 311094, 309175, 305128, 299009, 290170, 279419, 268813, 259095, 249340, 239282]
55548B39282r273p924p098o277m687l232k949l042k392j506j124n96M75Q77o8
55533A90466q86m75k13j383k616k272j358j536k214k148k125l224m193l476k225
55518A60122k422l388l236k427k767l876l844k649j983k123j868j131r67j317
55504A26124j114m36k51l40L94J748K407K086J688J566J260O38q3r77j818j716
55488A31176n76J55l72q92j49Q79P77J86M26R19L42q10j107o86n86n30L15J234
55470A30701R78J28J67Q69Q86K50K7J05m39j274j331r32j198j823j590p70p78
55453A23976j723k325k041j371l74J163K392K172J007L45L13o1p44p92k56j37
55437A21544n40o47l56k74k70L25J196J349P85M22N27O04N55O51P13N27N40R76
$$ y = [239282, 230009, 222085, 214987, 208710, 204023, 200791, 197842, 194800, 192408, 190902, 189778, 189182, 189657, 190534, 190466, 189580, 189105, 188892, 187509, 184893, 182621, 181263, 179727, 177513, 175365, 173240, 170016, 165823, 162347, 160122, 157700, 154312, 151076, 148649, 145882, 142006, 138162, 135513, 133530, 131407, 129539, 128408, 127441, 126124, 125010, 124574, 124323, 123983, 124377, 126125, 128532, 130618, 132306, 133872, 135132, 135770, 135687, 134710, 132892, 131176, 130600, 130755, 130383, 129491, 129342, 130221, 130998, 131184, 131610, 132529, 132871, 132061, 130954, 130268, 129682, 129152, 129467, 130701, 131679, 131807, 131974, 132843, 133729, 133979, 134006, 134111, 133672, 132398, 131067, 130135, 128937, 127114, 125524, 124754, 123976, 122253, 119928, 117887, 116516, 116142, 117305, 119697, 121869, 122876, 123221, 123534, 123473, 122729, 121937, 121681, 121544, 121004, 120357, 120001, 119727, 119457, 119782, 120978, 122327, 123112, 123534, 124061, 124665, 125220, 125871, 126584, 127111, 127651, 128627]
55419A28627R86k0j069j049m75l48k31P39J922K115J612J409J224L22n53j97P11
55402A35725M99p41j390r25l00j8J75L7q16j611j332n18l76o19j61O24M98j99
55384A28552L7J168J583P92N3J76N80P44Q11O80J7p16p57l88m44p85p35n09o72
55365A30187p11L4P00M4j296j730j308j267j468p07P06J133L65j40J56K20l93
55348A24525q43p82p78p61j3J115J381Q04O65J175J109J06o14l38J43J15j09k22
55330A26678m17m96Q6J013J343J025P75N40l81j663k097j449o29p1N16Q96N16
55313A26185j35j32J16m62j369j092J70N83l10q62p4J010J235Q58N28L50M42R39
55295A27980J138J72j298j659o82L48Q35J334J783J348K96o9L87M70k4L7P45O41
$$ y = [128627, 129613, 129593, 128524, 127475, 127000, 126652, 126421, 127160, 129082, 131197, 132809, 134218, 135442, 135764, 135211, 135014, 135725, 136224, 135483, 134093, 133168, 132868, 132850, 133025, 133062, 132246, 130635, 129303, 128785, 128409, 127790, 127629, 128253, 128751, 128552, 128589, 129757, 131340, 132132, 132185, 132361, 132941, 133685, 134496, 135176, 135193, 134477, 133720, 133332, 132888, 132103, 131368, 130859, 130187, 129476, 129510, 130210, 130254, 128958, 127228, 125920, 124653, 123185, 122478, 123184, 124317, 124682, 124542, 124698, 124918, 124525, 123682, 122900, 122122, 121361, 121348, 122463, 123844, 124648, 125313, 126488, 127597, 127703, 127089, 126751, 126894, 127009, 126900, 126678, 126261, 125765, 125851, 126864, 128207, 129232, 130007, 130547, 130166, 128503, 126406, 124957, 124328, 124257, 124773, 125669, 126185, 126050, 125918, 126034, 125572, 124203, 123111, 123281, 123864, 123554, 122692, 122618, 123628, 124863, 125721, 126249, 126599, 127041, 127980, 129118, 129290, 127992, 126333, 125651, 125999, 126834, 128168, 129951, 131299, 131595, 131526, 131913, 132383, 132359, 132396, 133141, 133782]
55277A33782o89j660j172j41K65J83K7m02q54m24Q01J368O16k45rQ94J383J091
55259A34814J25j213k036j441N6R59Q65P19Q83O44j35n43l02j40k18J08O55L72
55241A34172n90p83P9N68N3k59L89R74N83j68o14j174k044k387j834j217r42l21
55223A24485O90Q31k81j029j29J431K007J544R74N55K3n33r28j229j221m75O28
55206A27343J070O87L12K46M5q0O06J571J333q1r62o77m09o44k85Q54J218K67
55188A32414l77K00N56l06r17jJ065N69o26p39j3K30J52P21J529J443O60J79k9
55169A36710o24j330j357q53m71j93J79K16k37k65P47J883K065J702J610J432
55153A41214N12n84r40p92q17q01l28J45K12N01J328J556L31j091j003J70P63
$$ y = [133782, 133093, 131433, 130261, 130120, 130385, 130568, 130595, 130193, 129339, 128915, 129716, 131084, 131700, 131455, 131446, 132340, 133723, 134814, 134939, 133726, 131690, 130249, 130305, 131264, 132129, 132848, 133731, 134375, 134240, 133697, 133395, 133255, 133037, 133145, 133800, 134172, 133582, 132799, 132878, 133446, 133499, 133240, 133629, 134603, 135186, 135018, 134404, 133230, 131186, 128799, 126965, 125748, 124806, 124485, 125175, 126006, 125725, 124696, 124567, 125998, 128005, 129549, 130523, 131078, 131101, 130568, 129640, 128411, 127190, 126715, 127343, 128413, 129100, 129412, 129658, 129703, 129623, 130229, 131800, 133133, 133052, 132090, 131413, 131004, 130360, 130075, 130929, 132147, 132414, 132037, 132237, 132793, 132487, 131570, 131569, 132634, 133203, 132577, 131838, 131825, 132055, 132207, 132928, 134457, 135900, 136560, 136739, 136710, 136086, 134756, 133399, 132546, 132075, 131882, 132061, 132277, 132040, 131775, 132522, 134405, 136470, 138172, 139782, 141214, 141726, 141142, 140202, 139410, 138593, 137792, 137464, 137609, 137821, 138322, 139650, 141206, 141537, 140446, 139443, 139613, 140376]
55136A40376M98L78N62K66n31r97r21q76j092j346j637j862j370M5J298J347P50
55119A34888O21P82L75l67m61J42P12J157J792K095J232l17j056m64O06J333J662
55102A44732J704J484J244J195J074P01N67J030J398P57o53j770k056j679q32
55087A48896K74J128J446J557J640J265L76k25k14n43j775k629j694K50J208P24
55071A51684R1Q6J87m9k41p6J11m3m84r69j200r02k49P4k30n81l70J59M80N38
55051A48016M41Q4l90n13m02p45j390j105M25J673J320R1o30p56q46o73J22Q70
55033A45592Q27M46L90J98n90j097m23O20P04Q6j54j10m45o25K67J484J424J31
55015A48725p99o45r4L16O00M51l81j021m64O10P24nj89L99O29K66L74J290J979
$$ y = [140376, 140874, 141252, 141814, 142080, 141549, 140552, 139631, 138755, 137663, 136317, 134680, 132818, 131448, 131493, 132791, 134138, 134888, 135509, 136291, 136666, 136299, 135838, 135980, 136692, 137849, 139641, 141736, 142968, 142651, 141595, 141131, 141737, 143070, 144732, 146436, 147920, 149164, 150359, 151433, 152134, 152701, 153731, 155129, 155886, 155233, 153463, 151407, 149728, 148896, 149170, 150298, 151744, 153301, 154941, 156206, 156582, 156357, 156143, 155600, 153825, 151196, 149502, 149752, 150960, 151684, 151775, 151861, 152048, 151999, 151758, 151682, 151793, 151750, 151266, 150297, 149097, 148195, 147946, 148020, 147790, 147209, 146839, 146998, 147478, 148016, 148457, 148541, 148151, 147638, 147236, 146491, 145101, 143996, 144421, 146094, 147414, 147505, 146875, 146119, 145273, 144600, 144722, 145592, 146419, 146865, 147255, 147453, 146863, 145766, 145343, 145963, 146667, 146753, 146599, 146489, 146044, 145419, 145686, 147170, 148594, 148725, 147926, 147281, 147187, 147503, 148103, 148554, 148173, 147152, 146688, 147298, 148022, 148017, 147828, 148227, 148856, 149122, 149496, 150786, 152765]
54996A52765J822J422J220Q17R9l05j36R8J03J25J73m9l08j21K71L03K83Q55J465
54977A60902R08n68j316o08N39J095J176J139R45P24P87P96J23p62o07O59J546
54960A67478J073o9q02r42p40k74K41L71J84K13M64L38k15m03K21J079J377R19
54942A70513k8r28j062j52J030J405Q39Np10j247j177j24J272J974K020K265K843
54925A78738L094K943L123L959N046O146P266P962P680O799O122N504M190K313
54911B50885P12o41k530m828o429o934o956o676n653m221l467l453l039j891j169
54896A93710j630k484k703k237j370q7J249J798J353O91L73K40K72Q59J868K649
54880A94551L202M138N267N616N179N160O001O636O282N541M997M078K191k31
$$ y = [152765, 154587, 156009, 157229, 158046, 158145, 157840, 157704, 157802, 157905, 158030, 158203, 158154, 157846, 157725, 157996, 158299, 158582, 159437, 160902, 161810, 161242, 159926, 159318, 159857, 160952, 162128, 163267, 164212, 164936, 165723, 166519, 166642, 165880, 165273, 165932, 167478, 168551, 168482, 167680, 166738, 165998, 165724, 165965, 166336, 166520, 166733, 167197, 167535, 167320, 166917, 167138, 168217, 169594, 170513, 170485, 169557, 168495, 168343, 169373, 170778, 171617, 171622, 170912, 169665, 168488, 168364, 169636, 171610, 173630, 175895, 178738, 181832, 184775, 187898, 191857, 196903, 203049, 210315, 218277, 225957, 232756, 238878, 244382, 248572, 250885, 251597, 250956, 248426, 243598, 237169, 230235, 223279, 216603, 210950, 206729, 203262, 199809, 196770, 194879, 193710, 192080, 189596, 186893, 184656, 183286, 183199, 184448, 186246, 187599, 188290, 188663, 188903, 189175, 190034, 191902, 194551, 197753, 201891, 207158, 212774, 217953, 223113, 229114, 235750, 242032, 247573, 252570, 256648, 258839, 258608]
54866B58608k591m884o908p856p502o758o333n893n196m786m793m282k791j398
54852A86637j179j596j524j033r79j428j679j428j023q45j069j707k350k357j732
54837A64708j288j475j739j492j023q45q31o12k66j5K47O01P73N92L05J23o5k82
54819A57416l24k18k03r9N49J497J823J206L44r1j50K2N35J200J477J326J267
54802A67577J376J129N18K48O13J085J343J577J611Q93k90q58o55p04j314j357
54786A72792j91J092J333R25P81P91M71J84N61J372J990K324K493K269J679J480
54770A92346K254L616M960O192P229P655P548P731Q396Q531P453N909M734L452
54756B78006J303j283l365m886o234p120p090o611o506o728o640o080n306m362
$$ y = [258608, 256017, 251133, 244225, 236369, 228867, 222109, 215776, 209883, 204687, 199901, 195108, 190826, 188035, 186637, 185458, 183862, 182338, 181305, 180326, 178898, 177219, 175791, 174768, 173923, 172854, 171147, 168797, 166440, 164708, 163420, 161945, 160206, 158714, 157691, 156846, 156015, 155403, 155137, 155122, 155369, 155970, 156743, 157335, 157640, 157763, 157698, 157416, 157092, 156874, 156671, 156572, 157121, 158618, 160441, 161647, 161991, 161900, 161750, 161772, 162307, 163507, 164984, 166310, 167577, 168953, 170082, 170600, 170848, 171461, 172546, 173889, 175466, 177077, 177970, 177680, 176822, 176167, 175463, 174149, 172792, 172601, 173693, 175026, 175951, 176732, 177523, 177994, 178178, 178739, 180111, 182101, 184425, 186918, 189187, 190866, 192346, 194600, 198216, 203176, 209368, 216597, 224252, 231800, 239531, 247927, 256458, 263911, 269820, 274554, 278006, 279309, 278026, 274661, 269775, 263541, 256421, 249331, 242720, 236214, 229486, 222846, 216766, 211460, 207098]
54742B07098l313k606k425k228j615j010p90n21R5M93L42M32J367K284K223J915
54726B01741K680M191M954M662M407M687M775M273L862M052M269L664K070j26
54712B54161k427m290n353n841o259o728o915o588n791m611l278k346k247k675
54698A88812k857k334j269j20O46Q26O69N98N50Q5p21j126p88l66n14r57j105
54681A80029r97j048j319j573j686j506q62o3J68l00p37p21p32j112j296q16j94
54664A65235j3J25P04J155O50m28r23m41M30J107J356J010J77n18o50o11q96j209
54646A66260r44k07M12P42J001J242J392J467J320O45l26p94n53l59n65m04N81
54629A70910J420J108K19j26n0l48p56l50O99J206P02j04n20m77n1O31J061Q27
$$ y = [207098, 203785, 201179, 198754, 196526, 194911, 193901, 193111, 192590, 192685, 193178, 193520, 193952, 195319, 197603, 199826, 201741, 204421, 208612, 213566, 218228, 222635, 227322, 232097, 236370, 240232, 244284, 248553, 252217, 254287, 254161, 251734, 247444, 242091, 236250, 229991, 223263, 216348, 209760, 203969, 199358, 196080, 193734, 191487, 188812, 185955, 183621, 182352, 182232, 182878, 183704, 184373, 184971, 185521, 185606, 184885, 183759, 182971, 182605, 182091, 181134, 180029, 179032, 177984, 176665, 175092, 173406, 171900, 171038, 170975, 171143, 170843, 170106, 169385, 168653, 167541, 166245, 165429, 165235, 165222, 165347, 166051, 167206, 167856, 167428, 166505, 166064, 166494, 167601, 168957, 169967, 170144, 169626, 168976, 168365, 167469, 166260, 165316, 165109, 165521, 166263, 167264, 168506, 169898, 171365, 172685, 173330, 173004, 172210, 171657, 171298, 170733, 170329, 170910, 172330, 173438, 173657, 173531, 173481, 173133, 172377, 172027, 172726, 173932, 174634, 174530, 174010, 173533, 173482, 174113, 175174, 176001]
54611A76001K39j97n80j102j275o63Q9O8m95o91m61m48o48m53J08L34Nl83m91
54592A68957k34O15J939K673J941N13o8L26M53j86p16n30k10l69p29p82n23j64
54574A72906J79K50k02q93j208r55l84L61J146J453R52K75L08Q70R97M20j77k49
54556A76049J11O92J249J265M94m07p11o92q82p60M37J953K155R25j47p9M47O77
54538A82776Q39J185J348J199J186J342J074L99J38L73N0j219k202j806p05k15
54522A85762m64p11p30p63o15J20J116J518J039K50k19k54j35j43l59o67r47j188
54504A82610j201n74O42J449Q80n67j314o68L56M73l34j029q23K14J351J874J661
54487A85000J227R28M60l64q27j85R19J057O2p49n34J7J19J69Q28J674J722Q14
$$ y = [176001, 176240, 176043, 175463, 174361, 173086, 172423, 172512, 172580, 172085, 171394, 170933, 170485, 169837, 169384, 169492, 169826, 169831, 169448, 168957, 168723, 169338, 171277, 173950, 175891, 176404, 176336, 176662, 177115, 176929, 176213, 175683, 175473, 175104, 174375, 173593, 173070, 172906, 173085, 173335, 173133, 172240, 171032, 170077, 169693, 170054, 171200, 172653, 173605, 173880, 174188, 175058, 176055, 176475, 176298, 176049, 176160, 176852, 178101, 179366, 179860, 179453, 178742, 178050, 177168, 176408, 176845, 178798, 180953, 181878, 181731, 181652, 182099, 182776, 183615, 184800, 186148, 187347, 188533, 189875, 190949, 191348, 191486, 191859, 191909, 190690, 188488, 186682, 185977, 185762, 185298, 184587, 183857, 183094, 182479, 182599, 183715, 185233, 186272, 186522, 186303, 186049, 185914, 185771, 185412, 184745, 183798, 182610, 181409, 180835, 181477, 182926, 183806, 183239, 181925, 181257, 181613, 182086, 181752, 180723, 179900, 180114, 181465, 183339, 185000, 186227, 187155, 187615, 187251, 186424, 186239, 187158, 188215, 188277, 187528, 186994, 187011, 187130, 187299, 188127, 189801, 191523, 192337]
54469A92337k01m91J10J157J982K197K047K009K054J778J270J132J437J395M69
54454B10682p58j342j173r08j045j438j592j178l84J61L6m37o21l87j14L0J30
54437A99662k8q10j883k304j739r38o73q08q33p02o37n09kP97J432J667J706J842
54419A95240K044J978J424O19O8J1K99P51J311J643J242J87p52j112j316j693
54403B01944j706p89N97J615K184K612K606J733M97j17N0M08O91R86R61L06l53
54386B14225j38O32R29P18Q03J142Q31j50p39o48q30j599j824p33P55J341R84
54369B15699N05L87O96J328J791J473O91O47J825L254L894L849L692L442K899
54354B46072K264J766J248O40K46Op89k442m089m638m046l244l030l402l688l236
$$ y = [192337, 192136, 191645, 191755, 192912, 194894, 197091, 199138, 201147, 203201, 204979, 206249, 207381, 208818, 210213, 210682, 209924, 208582, 207409, 206501, 205456, 204018, 202426, 201248, 200864, 201025, 201061, 200624, 200003, 199616, 199502, 199532, 199662, 199634, 198824, 196941, 194637, 192898, 191960, 191287, 190479, 189646, 188944, 188307, 187798, 187796, 188593, 190025, 191692, 193398, 195240, 197284, 199262, 200686, 201305, 201373, 201384, 201683, 202434, 203745, 205388, 206630, 206817, 206065, 204953, 203637, 201944, 200238, 199449, 200046, 201661, 203845, 206457, 209063, 210796, 211293, 211176, 211226, 211634, 212325, 213311, 214272, 214578, 214225, 214087, 214719, 215648, 216366, 217169, 218311, 219142, 218992, 218253, 217605, 216775, 215176, 213352, 212619, 213374, 214715, 215699, 216204, 216591, 217287, 218615, 220406, 221879, 222570, 223217, 225042, 228296, 232190, 236039, 239731, 243173, 246072, 248336, 250102, 251350, 251990, 252236, 252242, 251453, 249011, 244922, 240284, 236238, 232994, 229964, 226562, 222874, 219638]
54338B19638k212j570j804k096j485m65k24o53n42K73O13Q1j84M96J171Q84J53
54321B12074j37r3j04J37Q66J418J097J83p05j428j887j676r40n68q06o62M58
54304B07227J523J357L17n25r55j234j051j48O53M01n11r80q84r32j220j142n85
54287B01311j39j42l31m30l45O0Q20J572J955K012J867J397O78J82J02pm40q34
54269B09288q27n95k08O28J695K053J449R68J475K273K275J603J012N44n0l33
54253B23250K01J030J298J092R58P61J14n88p19n80p93j071p40p8R0k21m15n82
54235B23007j250k147k458k111j648j004K38J606K056J481P45K49k82o87k96Q15
54219B18314J689J805J510J053K51p04j155q98m06L1M60N94%r54j351j035p55
$$ y = [219638, 217426, 215856, 214052, 211956, 210471, 210006, 209782, 209129, 208587, 208860, 209473, 209554, 209370, 209866, 211037, 211921, 212074, 211937, 211844, 211740, 211877, 212743, 214161, 215258, 215441, 214736, 213308, 211421, 209745, 208805, 208237, 207431, 206769, 207227, 208750, 210107, 210424, 209899, 208944, 207710, 206659, 206511, 207164, 207565, 207054, 206074, 205190, 204258, 203038, 201896, 201311, 201172, 201030, 200699, 200269, 199924, 199984, 200804, 202376, 204331, 206343, 208210, 209607, 210285, 210467, 210569, 210562, 210122, 209288, 208461, 207866, 207658, 208286, 209981, 212034, 213483, 214451, 215926, 218199, 220474, 222077, 223089, 223633, 223583, 223250, 223451, 224481, 225779, 226871, 227829, 228590, 228704, 228116, 227397, 226817, 226024, 224953, 224213, 224135, 224225, 224004, 223589, 223007, 221757, 219610, 217152, 215041, 213393, 212389, 212627, 214233, 216289, 217770, 218515, 218764, 218482, 217795, 217499, 218314, 220003, 221808, 223318, 224371, 224622, 223918, 222763, 221865, 221459, 221490, 221950, 222544, 222544, 221590, 220239, 219204, 218449]
54202B18449q16o94j85J38j6j26J67M22K17j33j84j1J08R3j14n35p36j43R41J379
54182B18221O49l76n87P4Q78J366J580J616J472J218R40O52M06K94K28m6n84j046
54164B26955j031n11R9K16m18j353j797j471r18o83o05k81J30K00L1J45O39R80
54146B20327N98n30j807k272j314N24J790J657P98L37M51O29P05Q56R07N18j62
54129B24012p69j344j971k099j147M07J389J286N35k90q02o18K70J130J332J286
54113B22607J697K250K141J582J498J890J863J351J333K025K294J505O91J059
54099B45786K247K947K710K228K250K852L672M333M719M988N308N603N778N910
54085C01331N869N007K845j18k868m950o427p128o792n851n105m628l864k766
$$ y = [218449, 217633, 216939, 216754, 216892, 216876, 216750, 216917, 217339, 217556, 217423, 217239, 217228, 217336, 217429, 217315, 216780, 216044, 215901, 216842, 218221, 218870, 218494, 217907, 217981, 218859, 220225, 221805, 223421, 224893, 226111, 227051, 227703, 228109, 228403, 228631, 228585, 228001, 226955, 225924, 225413, 225512, 225728, 225310, 223957, 222160, 220689, 219771, 219088, 218483, 218202, 218332, 218532, 218563, 218708, 219347, 220327, 220925, 220395, 218588, 216316, 215002, 215526, 217316, 218973, 219771, 220108, 220559, 221188, 221893, 222749, 223656, 224174, 224012, 223243, 221899, 219928, 217829, 216682, 217089, 218478, 219764, 220299, 220009, 219207, 218589, 218859, 219989, 221321, 222607, 224304, 226554, 228695, 230277, 231775, 233665, 235528, 236879, 238212, 240237, 242531, 244036, 244727, 245786, 248033, 250980, 253690, 255918, 258168, 261020, 264692, 269025, 273744, 278732, 284040, 289643, 295421, 301331, 307200, 312207, 315052, 314934, 312066, 307116, 300689, 293561, 286769, 280918, 275813, 271185, 267321, 264555]
54071B64555j887j298n16M05P25L64K67J031K022K396K182J893J665J429J348
54056B76581J604K075K550K935L143L148L242L715M322M553M306L688K430M67
54042C18759j150j104K72J187P66J12N37J906L326M442N329N949O464P255Q036
54027C62086P756O153M606M503N385N674M795L569K766K286J783J288R74P45K69
54012D14638o77j895k778k913k673k861l706m644n190n466n716n895n985o170
53998C58069o401o269n650m922m307l548k568j902j979k502k899k998k857k496
53984C06771k128k157k484k365j437m46l42j058j710j819j627j405j030l49M17
53969B86831Q33O55J34k02j06J15J02N3M56J329K193K632K508J776P38L22J293
$$ y = [264555, 262668, 261370, 260854, 261259, 261984, 262348, 262615, 263646, 265668, 268064, 270246, 272139, 273804, 275233, 276581, 278185, 280260, 282810, 285745, 288888, 292036, 295278, 298993, 303315, 307868, 312174, 315862, 318292, 318759, 317609, 316505, 316777, 317964, 318730, 318842, 319379, 321285, 324611, 329053, 334382, 340331, 346795, 354050, 362086, 369842, 375995, 380601, 385104, 390489, 396163, 400958, 404527, 407293, 409579, 411362, 412650, 413624, 414369, 414638, 413961, 412066, 409288, 406375, 403702, 400841, 397135, 392491, 387301, 381835, 376119, 370224, 364239, 358069, 351668, 345399, 339749, 334827, 330520, 326972, 324404, 322502, 320523, 318021, 315122, 312124, 309267, 306771, 304643, 302486, 300002, 297637, 296200, 295754, 295412, 294354, 292644, 290825, 289198, 287793, 286763, 286414, 286831, 287664, 288319, 288453, 288251, 288145, 288260, 288362, 288415, 288871, 290200, 292393, 295025, 297533, 299309, 300047, 300369, 301662]
53952C01662L194M801N608O153O787P194P305P774R021J0616J2005J3156J4184
53939D09460J5012J5791J6712J7011J5081J0278L960j841o113q797r945r740q765
53926D58104p448n701l623j920r58o6J400K913L542L495L864N104O574P507P739
53911D80526P588P536Q032R041R942J0184R798Q987P609N576L369J648N25l49
53897E70012j261k393l824n184n738n339m893n271o201o797o891p095p844q968
53883D92313j0043j0628j0403r618r072r165r282q725p774p097o527n447m176
53870C84356l875m816n769n581m635m142m482m927m823m387m128m017l656l087
53856C22031k853l161l492l391l098k911k410j183L7j0j296k393k410j980j956
$$ y = [301662, 304856, 309657, 315265, 321418, 328205, 335399, 342704, 350478, 359499, 370115, 382120, 395276, 409460, 424472, 440263, 456975, 473986, 489067, 499345, 503305, 501464, 495351, 486554, 476609, 466869, 458104, 450656, 444955, 441332, 439412, 438454, 438388, 439788, 442701, 446243, 449738, 453602, 458706, 465280, 472787, 480526, 488114, 495650, 503682, 512723, 522665, 532849, 542647, 551634, 559243, 564819, 568188, 569836, 570361, 570012, 568751, 566358, 562534, 557350, 551612, 546273, 541380, 536109, 529908, 523111, 516220, 509125, 501281, 492313, 482270, 471642, 461239, 451621, 442549, 433384, 424102, 415377, 407603, 400506, 393979, 388532, 384356, 380481, 375665, 369896, 364315, 359680, 355538, 351056, 346129, 341306, 336919, 332791, 328774, 325118, 322031, 319178, 316017, 312525, 309134, 306036, 303125, 300715, 299532, 299569, 299559, 298263, 295870, 293460, 291480, 289524]
53841B89524k101j768j047m82k39j45j28l3M55J203J502J047M67L37L62J06j47
53824B88913n3m7o12j155o77P50K018K406K122J634J221J136J559K318L019L388
53808C07940L275K697K233K722M084N036M718L963M154N323O365O750O944P306
53794C73510P559P391O747N614M210L314L542M305M324L213J886J306J539K084
53780D30544K366J793J11k104l738m292m340m735n682o718p281p170o664o132
53766C75958n570m747l866l548l866m067l672l285l567m058l892l229k971l268
53752C22352l379k930k399k254k391k582k751k723k266j530q96m82k72n45j456
53737B93496k292j993n52Q63J312J000O43N18M73L94L63N06Q29J054Q63M45M84
$$ y = [289524, 287423, 285655, 284608, 284126, 283887, 283742, 283614, 283581, 284036, 285239, 286741, 287788, 288255, 288592, 288954, 289060, 288913, 288860, 288813, 288201, 287046, 286369, 287119, 289137, 291543, 293665, 295299, 296520, 297656, 299215, 301533, 304552, 307940, 311215, 313912, 316145, 318867, 322951, 327987, 332705, 336668, 340822, 346145, 352510, 359260, 366204, 373510, 381069, 388460, 395207, 400821, 405031, 408345, 411887, 416192, 420516, 423729, 425615, 426921, 428460, 430544, 432910, 434703, 434814, 432710, 428972, 424680, 420340, 415605, 409923, 403205, 395924, 388754, 382090, 375958, 370388, 365641, 361775, 358227, 354361, 350294, 346622, 343337, 339770, 335712, 331820, 328591, 325620, 322352, 318973, 316043, 313644, 311390, 308999, 306417, 303666, 300943, 298677, 297147, 296251, 295769, 295497, 294952, 293496, 291204, 289211, 288659, 289522, 290834, 291834, 292477, 292995, 293468, 293862, 294225, 294731, 295560, 296614, 297477, 297922, 298406]
53720B98406J229J973J922J248P08P12J267K354L523L663K167P9r25m91M20J208
53704C19463K148L203L714L449L010K890K990L300M081N075N502N162M722M612
53690C73321M393L638K591J583N55m05p53k54N14Q28N63n4q13j362j307q22o36
53673C81580j002j278q93k54j67p75j471j628j109l22J03o2k95LN66N47k37j069
53655C72237j391j413j391j115n13o0j16l05nQ75J899K506K302J409O33P02J264
53638C77518J300O52L18R28J821K075J707J296J125J268J849K604K754K000J136
53623D00351J078J754K546L280M042M540M483M321M730N553N995N734N266N154
53609D58827N575O409P292P609P067O186N683N479M883L742K646J970J405O57
$$ y = [298406, 299635, 301608, 303530, 304778, 305486, 306198, 307465, 309819, 313342, 317005, 319172, 319251, 318326, 317835, 318255, 319463, 321611, 324814, 328528, 331977, 334987, 337877, 340867, 344167, 348248, 353323, 358825, 363987, 368709, 373321, 377714, 381352, 383943, 385526, 386081, 385676, 384923, 384669, 385183, 386011, 386574, 386520, 385707, 384345, 383038, 382216, 381580, 380578, 379300, 378407, 378153, 377986, 377211, 375740, 374112, 373003, 372681, 372784, 372722, 372427, 372430, 372996, 373543, 373306, 372237, 370846, 369433, 368042, 366927, 366414, 366354, 366238, 365933, 365928, 366803, 368702, 371208, 373510, 374919, 375552, 376254, 377518, 378818, 379470, 379788, 380716, 382537, 384612, 386319, 387615, 388740, 390008, 391857, 394461, 397215, 399215, 400351, 401429, 403183, 405729, 409009, 413051, 417591, 422074, 426395, 431125, 436678, 442673, 448407, 453673, 458827, 464402, 470811, 478103, 485712, 492779, 498965, 504648, 510127, 515010, 518752, 521398, 523368, 524773, 525430]
53595E25430L1j18k7j52m68o30o52r31j563k159k485k814l312l455k647j241l27
53578E02480m18r53j269j454j804k161k298k490k953l163k545j565j231j668k029
53563D74479j796j277p76k35J57q4q64j325r34m8Q35J621K164K080J499J156J280
53546D77932J133K68n24k33R80K191K949L444L801M047M386M868N060M675M270
53531E19247M624N669O733P573Q480R468J0150J0424J0682J1223J1974J2830J3861
53518F42938J5047J6201J7193J8071J8905J9758K0662K1513K2156K2733K3611
53507H58788K4728K5483K5652K5918K6940K8251K8826K8501K8026K7810K7480
53496A156403K6785K6175K6048K6025K5402K4095K2735K1951K1749K1648K1300
$$ y = [525430, 525461, 525343, 525316, 525164, 524696, 524066, 523414, 522483, 520920, 518761, 516276, 513462, 510150, 506695, 504048, 502807, 502480, 502062, 501109, 499840, 498386, 496582, 494421, 492123, 489633, 486680, 483517, 480972, 479407, 478176, 476508, 474479, 472683, 471406, 470630, 470395, 470552, 470468, 469604, 468279, 467345, 467297, 468132, 469753, 471917, 473997, 475496, 476652, 477932, 479065, 479333, 478809, 478576, 479556, 481747, 484696, 488140, 491941, 495988, 500374, 505242, 510302, 514977, 519247, 523871, 529540, 536273, 543846, 552326, 561794, 571944, 582368, 593050, 604273, 616247, 629077, 642938, 657985, 674186, 691379, 709450, 728355, 748113, 768775, 790288, 812444, 835177, 858788, 883516, 908999, 934651, 960569, 987509, 1015760, 1044586, 1073087, 1101113, 1128923, 1156403, 1183188, 1209363, 1235411, 1261436, 1286838, 1310933, 1333668, 1355619, 1377368, 1399016, 1420316]
53485A420316K0974K1226K2042K2670K2525K1903K1375K0801J9713J8394J7764
53474A649703J8028J8224J7440J5762J3648J0977P472L647N43j478l086n067p530
53461A738283j0079j2350j4135j5394j6383j7499j8680j9237j8706j7695j7498
53450A560627j8767k0927k2962k4356k5123k5277k4756k3703k2458k1266k0184
53439A310848j9254j8527j7810j6635j4543j1544q244n579m115l542k979j867
53427A186209m11R56K221L637N208O687P943R087J0286J1729J3613J5854J8065
53414A291084J9998K1855K3754K5307K6186K6859K8111K9992L1882L3566L5484
53403A594078L7800L9948M1424M2484M3694M5228M7007M9148N1796N4706N7338
$$ y = [1420316, 1441290, 1462516, 1484558, 1507228, 1529753, 1551656, 1573031, 1593832, 1613545, 1631939, 1649703, 1667731, 1685955, 1703395, 1719157, 1732805, 1743782, 1751254, 1754901, 1755444, 1753966, 1750880, 1745813, 1738283, 1728204, 1715854, 1701719, 1686325, 1669942, 1652443, 1633763, 1614526, 1595820, 1578125, 1560627, 1541860, 1520933, 1497971, 1473615, 1448492, 1423215, 1398459, 1374756, 1352298, 1331032, 1310848, 1291594, 1273067, 1255257, 1238622, 1224079, 1212535, 1204291, 1198712, 1194597, 1191055, 1188076, 1186209, 1185798, 1186754, 1188975, 1192612, 1197820, 1204507, 1212450, 1221537, 1231823, 1243552, 1257165, 1273019, 1291084, 1311082, 1332937, 1356691, 1381998, 1408184, 1435043, 1463154, 1493146, 1525028, 1558594, 1594078, 1631878, 1671826, 1713250, 1755734, 1799428, 1844656, 1891663, 1940811, 1992607, 2047313, 2104651]
53392B104651N9384O0943O2196O3082O3447O3444O3533O3851O3765O2604O0735
53381B791635N9261N8387N6946N4058N0425M7164M4095M0281L5698L1061K6297
53370C295308K0683J4505R101M865N41n048j1665j8611k5841l3411m0674m6892
53358C162861n1961n5916n8450n9574o0094o0675o1035o0712n9983n9259n8226
53347B516976n6389n4061n1959n0216m8564m7168m6496m6477m6537m6311m5728
53336A977070m4600m2717m0306l7844l5441l2830k9874k6770k3873k1489j9706
53325A621620j8282j6982j6058j5949j6417j6684j6596j6771j7306j7259j6069
53314A437247j4553j3660j2962j1470r306p480o353n361m013k270o4K560M965
$$ y = [2104651, 2164035, 2224978, 2287174, 2350256, 2413703, 2477147, 2540680, 2604531, 2668296, 2730900, 2791635, 2850896, 2909283, 2966229, 3020287, 3070712, 3117876, 3161971, 3202252, 3237950, 3269011, 3295308, 3315991, 3330496, 3339597, 3344462, 3345003, 3339955, 3328290, 3309679, 3283838, 3250427, 3209753, 3162861, 3110900, 3054984, 2996534, 2936960, 2876866, 2816191, 2755156, 2694444, 2634461, 2575202, 2516976, 2460587, 2406526, 2354567, 2304351, 2255787, 2208619, 2162123, 2115646, 2069109, 2022798, 1977070, 1932470, 1889753, 1849447, 1811603, 1776162, 1743332, 1713458, 1686688, 1662815, 1641326, 1621620, 1603338, 1586356, 1570298, 1554349, 1537932, 1521248, 1504652, 1487881, 1470575, 1453316, 1437247, 1422694, 1409034, 1396072, 1384602, 1375296, 1367816, 1361463, 1356102, 1352089, 1349819, 1349755, 1352315, 1357280]
53301A357280O461P287Q279R740J1393J3274J5671J8205J9991K0948K2065K4040
53289A534634K6385K8208K9225K9697K9870K9885K9854K9680K9005K7525K5273
53278A849241K2505J9506J6488J3496J0487P546M815K100j078m784q384j1363
53266A920575j3919j6340j8402k0006k1895k4805k8224l0900l2415l3365l4073
53255A646231l4107l3252l2116l1550l1923l3055l4267l4529l3299l1313k9891
53244A286929k9381k9004k8258k7609k7463k7347k6655k5609k4917k4832k4988
53233I90866k4890k4183k2687k0594j8492j6880j5683j4399j2733j1011r968j0051
53221G89295j0884j1570j1627j1428j1542j2064j2812j3758j4762j5275j4974
$$ y = [1357280, 1363741, 1371028, 1379307, 1389047, 1400440, 1413714, 1429385, 1447590, 1467581, 1488529, 1510594, 1534634, 1561019, 1589227, 1618452, 1648149, 1678019, 1707904, 1737758, 1767438, 1796443, 1823968, 1849241, 1871746, 1891252, 1907740, 1921236, 1931723, 1939269, 1944084, 1946184, 1945106, 1940322, 1931938, 1920575, 1906656, 1890316, 1871914, 1851908, 1830013, 1805208, 1776984, 1746084, 1713669, 1680304, 1646231, 1612124, 1578872, 1546756, 1515206, 1483283, 1450228, 1415961, 1381432, 1348133, 1316820, 1286929, 1257548, 1228544, 1200286, 1172677, 1145214, 1117867, 1091212, 1065603, 1040686, 1015854, 990866, 965976, 941793, 919106, 898512, 880020, 863140, 847457, 833058, 820325, 809314, 799346, 789295, 778411, 766841, 755214, 743786, 732244, 720180, 707368, 693610, 678848, 663573, 648599]
53210F48599j4406j4329j4548j4220j3174j2121j1458j0764r687q634q114q041
53198E09103q047q050q146q217p984p239n993m648m064m874o565p704p355n943
53184D14274m532l704l408l523l910m228m087l524l050l067l367l349k724j876
53170C65925j323j026n80o3r6q32j465j281p12p41j586k557l045k902k151j001
53154C44564j59l18j230j878j727j177p54m83k29o7l6K6J32ro09j478k167k207
53136C30194j351Q8J229J446J082Q52P57K39o37j037n26L76J092J699K409K949
53120C40861K979K669K381K103J635J124R78J336J895K280K426K552K783K832
53106C70834K271J078k81j489k649l730m189l751l080l043l566l851l521k791
$$ y = [648599, 634193, 619864, 605316, 591096, 577922, 565801, 554343, 543579, 533892, 525258, 517144, 509103, 501056, 493006, 484860, 476643, 468659, 461420, 455427, 450779, 446715, 441841, 435276, 427572, 420217, 414274, 409742, 406038, 402630, 399107, 395197, 390969, 386882, 383358, 380308, 377241, 373874, 370525, 367801, 365925, 364602, 363576, 362996, 362933, 362837, 362005, 360540, 359259, 358547, 357806, 356220, 353663, 350618, 347716, 345565, 344564, 344405, 344087, 342857, 340979, 339252, 338075, 337321, 336838, 336609, 336542, 336506, 336532, 336664, 336655, 336046, 334568, 332401, 330194, 328843, 328931, 330160, 331606, 332688, 333540, 334297, 334536, 333899, 332862, 332336, 332712, 333804, 335503, 337912, 340861, 343840, 346509, 348890, 350993, 352628, 353752, 354730, 356066, 357961, 360241, 362667, 365219, 368002, 370834, 373105, 374183, 373902, 372413, 369764, 366034, 361845, 358094, 355014, 351971, 348405, 344554, 341033, 338242]
53092C38242j865q89l36n73j131j250j021j076j314r91j28L88K56J88N76Q65O99
53075C30640O13R89J296R99L60k47r50j687j798j085m83p58j336j267p18m79n80
53058C23509n00l10n15r31p72O8Q18R32O87N66O65R02J227J507J574J415J086
53041C31928N28j98p06p96q63j279j651j336n31r3k84n01l56k31m75p34n60j81
53023C21681j15l33l08J77P61R62O47K4n26o25j10P34J365J476J262J104J124
53006C29300J171J107R44P60O44P07R62J195J095O08l7o09r52q99l85K65O24P33
52988C37233J007J415J423R34O76J152J803J827J386J286J753K259K352J957J093
52973C59556l8p33m27M66R39O53J90J44N57J173J629J506Q29L75P33J314J111
$$ y = [338242, 336377, 335488, 335152, 334579, 333448, 332198, 331177, 330101, 328787, 327796, 327668, 328056, 328312, 328500, 329076, 329941, 330640, 331253, 332242, 333538, 334537, 334897, 334650, 333700, 332013, 330215, 329130, 328647, 327889, 326553, 325286, 324568, 324089, 323509, 323009, 322699, 322184, 321253, 320481, 320549, 321367, 322299, 322986, 323552, 324217, 325119, 326346, 327853, 329427, 330842, 331928, 332456, 332258, 331552, 330756, 329893, 328614, 326963, 325627, 325096, 325003, 324719, 324218, 323862, 323631, 323156, 322422, 321862, 321681, 321566, 321233, 320925, 321102, 321863, 322825, 323472, 323496, 322970, 322345, 322235, 322969, 324334, 325810, 327072, 328176, 329300, 330471, 331578, 332522, 333282, 333926, 334633, 335595, 336790, 337885, 338493, 338456, 337847, 336895, 335996, 335611, 335876, 336500, 337233, 338240, 339655, 341078, 342012, 342688, 343840, 345643, 347470, 348856, 350142, 351895, 354154, 356506, 358463, 359556, 359518, 358785, 358358, 358824, 359763, 360416, 360606, 360750, 361307, 362480, 364109, 365615, 366444, 366819, 367552, 368866, 369977]
52956C69977K71j08L40Q45P82L14l78j406k469k920k794k769k881k430j485j160
52940C51729j850k417j918j028q56j321j635j616j520j286q90q26j293j465n46
52925C31262R08J642J305N56Nj60K11R81J407Q79j35o26l55N2J41N7N0J46L46
52906C38672O43Q90R64Q64M49n38j868k757k817k556k422k056j080m0L12K13M75
52889C27348J168J597J424J028Q30Q89J081J086M19r05j940j651j31J559K546
52874C36348K620J959J060O74J151J951K370K458K606K648K202J689K020L178
52860C64934L948L287J410o30j994k542k682k869l099l034k682k571l005l554
52846C44917l736l694l725l620l079k411k164k312k391k148j570o81J65L22k61
$$ y = [369977, 370248, 370140, 370480, 371325, 372107, 372421, 372043, 370637, 368168, 365248, 362454, 359685, 356804, 354374, 352889, 351729, 349879, 347462, 345544, 344516, 343660, 342339, 340704, 339088, 337568, 336282, 335392, 334566, 333273, 331808, 331262, 332170, 333812, 335117, 335673, 335678, 335518, 335729, 336710, 338117, 338996, 338861, 338235, 337880, 337932, 338073, 338130, 338180, 338326, 338672, 339315, 340205, 341169, 342033, 342482, 341944, 340076, 337319, 334502, 331946, 329524, 327468, 326388, 326348, 326660, 326873, 327348, 328516, 330113, 331537, 332565, 333395, 334284, 335365, 336451, 336870, 335965, 334025, 332374, 332243, 333802, 336348, 338968, 340927, 341987, 342661, 343812, 345763, 348133, 350591, 353197, 355845, 358047, 359736, 361756, 364934, 368882, 372169, 373579, 372949, 370955, 368413, 365731, 362862, 359763, 356729, 354047, 351476, 348471, 344917, 341181, 337487, 333762, 330142, 327063, 324652, 322488, 320176, 317785, 315637, 314067, 313386, 313551, 313873, 313612]
52831C13612o97m08m4l77r27p25J00O51P95J110J542J401O41lk29m23o81o27k89
52812C14422j19qO76J867K645K494J849J185N45J65M81J159J077k14j775k472
52796C23977k193j501q07l22k60o41j234j869k392k360j460k58K31j44n17k70
52780C07980L65J004J561J858J647J237J161J120L35q61j085K1J080J067P29J010
52764C20229J255L67j169j889j507j022r10n93K44J022J239J092Q19K51n39q57
52748C18032j70J094J995K025J383N50j1O7Q39J838K396K310K009J924J903J585
52732C39769J173J316K044K448J835Q47P41J744K809K966K284J384O02n1n57r46
52716C60408j417k032k465k326j728j317j610k333k568j721l29M37J31n55q62
$$ y = [313612, 312915, 312507, 312463, 312086, 311159, 310434, 310534, 311185, 311980, 313090, 314632, 316033, 316674, 316671, 316442, 316019, 315338, 314711, 314422, 314303, 314295, 314971, 316838, 319483, 321977, 323826, 325011, 325556, 325721, 326202, 327361, 328438, 328224, 326449, 323977, 321784, 320283, 319476, 319154, 318894, 318253, 317019, 315150, 312758, 310398, 308938, 308680, 308911, 308767, 308250, 307980, 308345, 309349, 310910, 312768, 314415, 315652, 316813, 317933, 318268, 317407, 316322, 316343, 317423, 318490, 319219, 320229, 321484, 321851, 320682, 318793, 317286, 316264, 315354, 314761, 315005, 316027, 317266, 318358, 319177, 319428, 318889, 318032, 317862, 318956, 320951, 322976, 324359, 324909, 324898, 324965, 325804, 327642, 330038, 332348, 334357, 336281, 338184, 339769, 340942, 342258, 344302, 346750, 348585, 349432, 350173, 351917, 354726, 357692, 359976, 361360, 361962, 361911, 361354, 360408, 358991, 356959, 354494, 352168, 350440, 349123, 347513, 345180, 342612, 340891, 340562, 340999, 341130, 340575, 339713]
52701C39713q81r85r48l51M99P99L55k14l14P1O53J123J213R18O04N39N37L65
52683C43696J79J42R4O2M94J303J433K94j055j284p91q66j479j510r50r35j525
52666C37302j344M0J214J065L13L7J45K69P46J616J838P87l97k05J263K767L668
52649C51124M077M028L543L065K781K077O32n88n30K88M75k63j015j190j011n94
52633C66899K38J249J803J715J403J279J611K654M208N257N026M085L480K996
52619D03903J443j394m257o048o874p115o569n126l515k541k126j680j142r37
52605C56022j130j210q14k18J10J99M79J016J239P13j05l46J28O60Q75J098J434
52588C60150J233P3j282j703j124m38j67M2O59J571K254K235J446M36N3N25J032
$$ y = [339713, 338832, 337847, 336899, 336548, 337047, 337846, 338201, 337987, 337673, 337744, 338397, 339520, 340733, 341651, 342255, 342794, 343331, 343696, 343875, 344017, 344111, 344173, 344667, 345970, 347403, 347697, 346642, 345358, 344567, 343701, 342222, 340712, 339762, 338827, 337302, 335958, 335998, 337212, 338277, 338590, 338627, 338772, 339041, 339787, 341403, 343241, 344028, 343631, 343426, 344689, 347456, 351124, 355201, 359229, 362772, 365837, 368618, 370695, 371327, 370739, 370209, 370497, 370972, 370709, 369694, 368504, 367493, 366899, 367137, 368386, 370189, 371904, 373307, 374586, 376197, 378851, 383059, 388316, 393342, 397427, 400907, 403903, 405346, 403952, 399695, 393647, 386773, 379658, 373089, 367963, 364448, 361907, 359781, 358101, 356959, 356022, 354892, 353682, 352868, 352650, 352760, 352959, 353438, 354454, 355693, 356406, 356301, 355955, 356083, 356743, 357618, 358716, 360150, 361383, 361456, 360174, 358471, 357347, 356909, 356742, 356784, 357443, 359014, 361268, 363503, 364949, 365385, 365438, 365963, 366995]
52571C66995O49m75j383j562j341j133q80m35Q2M89P91R55P12j79j474k440k398
52554C56973j406k66K43R6k95q08j534k054j574m3J484J982J448N48j59l15J89
52537C54509Q63Q81K17j65K66Q00O99M24O62R51M51l74k25J053K187K273J775
52520C67247J514J620J761J703J422J147J442K614M036M696M407L840L470L247
52506D04166L211L481L532K499M89j336k355l228m543n624n549m683m214m456
52492C81390m512l656k316j384j069q55l93j7k18q63j254j003m44j9L87J096J885
52475C66755K088J468N79K25P39J771K612K816K701L000L807M292L809K940K771
52460D02373L393L859L496K600J687P50n04k100l719m891n207m717m095m012m333
$$ y = [366995, 367644, 367169, 365786, 364224, 362883, 361750, 360870, 360435, 360517, 361006, 361797, 362752, 363464, 363285, 361811, 359371, 356973, 355567, 355301, 355544, 355640, 355345, 354537, 353003, 350949, 349375, 349332, 350816, 352798, 354246, 354794, 354635, 354320, 354509, 355372, 356253, 356470, 356305, 356571, 357371, 358070, 358494, 359156, 360107, 360558, 360184, 359959, 361012, 363199, 365472, 367247, 368761, 370381, 372142, 373845, 375267, 376414, 377856, 380470, 384506, 389202, 393609, 397449, 400919, 404166, 407377, 410858, 414390, 416889, 417378, 416042, 413687, 410459, 405916, 400292, 394743, 390060, 385846, 381390, 376878, 373222, 370906, 369522, 368453, 367598, 367205, 367188, 366970, 366107, 364853, 363850, 363406, 363387, 363774, 364870, 366755, 368843, 370311, 370890, 371115, 371854, 373625, 376237, 379053, 381754, 384754, 388561, 392853, 396662, 399602, 402373, 405766, 409625, 413121, 415721, 417408, 418158, 417654, 415554, 411835, 406944, 401737, 397020, 392925, 388913, 384580]
52445C84580m290l532k581k156k372k748k729k131j251n42j31J91M06J73m88q95
52429C59504o12j42r8j34M74J480J924J539R80O54L14r1j62J44L23K56N11J384
52411C68248K423L185L760M173M172M027M662O385Q197R087R350R940J1030J2019
52397D60658J2494J2273J0802P449K601k343o235r025j1107j2332j2052j0103
52385D43080p377n213m167l673k973k093j488j075l33P28J485J761K190L157M042
52370D28051M138L766L798M404M861M490L317J893Q58M92M14j50j447k714k949
52355D53222k052q62j72KJ86P55J513J827J286L10j98J55Q93J449J887K479L006
52338D65686K982K463K126K486L452M634N814O978Q100Q965R324R267R374J0285
$$ y = [384580, 380290, 376758, 374177, 372021, 369649, 366901, 364172, 362041, 360790, 360248, 360117, 360308, 360714, 360887, 360399, 359504, 358892, 358750, 358652, 358518, 358992, 360472, 362396, 363935, 364915, 365569, 365883, 365792, 365630, 365774, 366097, 366353, 366864, 368248, 370671, 373856, 377616, 381789, 385961, 389988, 394650, 401035, 409232, 418319, 427669, 437609, 448639, 460658, 473152, 485425, 496227, 503676, 506277, 503934, 497699, 488674, 477567, 465235, 453183, 443080, 435703, 430490, 426323, 422650, 419677, 417584, 416096, 415021, 414688, 415416, 416901, 418662, 420852, 424009, 428051, 432189, 435955, 439753, 444157, 449018, 453508, 456825, 458718, 459576, 460068, 460482, 460332, 458885, 456171, 453222, 451170, 450308, 450136, 450138, 450324, 451079, 452592, 454419, 455705, 456015, 455817, 455972, 456865, 458314, 460201, 462680, 465686, 468668, 471131, 473257, 475743, 479195, 483829, 489643, 496621, 504721, 513686, 523010, 532277, 541651, 551936]
52324E51936J1933J3512J4317J4424J4352J4410J4517J4481J4150J3496J2798
52313G04326J2525J2866J3552J4341J5342J6664J8054J9249K0395K1668K2737
52302H91719K3152K3098K3258K3845K4332K4209K3551K2614K1256J9158J6416
52291A136608J3554J0937Q415N704K991Q86l07j074k143l543m560m684m212l719
52277A154853l382l193l412m240n145n128l874k101p05K02J085K231L514M781
52263A135486O065P339Q310Q658Q519Q556R417J1117J3113J4987J6785J8513J9621
52250A286486J9499J8391J7258J6466J5297J3088J0405Q335O996N530L566J747
52238A423064N87l28j484k644l526m619o293p736p961p588q267j0161j1473j1004
$$ y = [551936, 563869, 577381, 591698, 606122, 620474, 634884, 649401, 663882, 678032, 691528, 704326, 716851, 729717, 743269, 757610, 772952, 789616, 807670, 826919, 847314, 868982, 891719, 914871, 937969, 961227, 985072, 1009404, 1033613, 1057164, 1079778, 1101034, 1120192, 1136608, 1150162, 1161099, 1169514, 1175218, 1178209, 1179095, 1178788, 1177714, 1175571, 1172028, 1167468, 1162784, 1158572, 1154853, 1151471, 1148278, 1144866, 1140626, 1135481, 1130353, 1126479, 1124378, 1123673, 1123875, 1124960, 1127191, 1130705, 1135486, 1141551, 1148890, 1157200, 1165858, 1174377, 1182933, 1192350, 1203467, 1216580, 1231567, 1248352, 1266865, 1286486, 1305985, 1324376, 1341634, 1358100, 1373397, 1386485, 1396890, 1405225, 1412221, 1417751, 1421317, 1423064, 1423651, 1423323, 1421839, 1419195, 1415669, 1411050, 1404757, 1397021, 1389060, 1381472, 1373205, 1363044, 1351571, 1340567]
52224A340567r838r641j0348j0666j0197r676r479r142q357p433o558n499m229
52211A229504l169k536k028j298l10Q74K192L350M080M609N367O183O409N982
52197A259209N651N893O251O140N835O119P244Q727R911J0444J0234R360P986
52184A359004O293M421K487N55j400l374n270p002q533r720j0358j0589j0836
52171A305678j1069j0569q963o968n494m409l051j569o76k75N13J811K702K731
52157A260392K615K987L432L357K865K180J086l30j193r38l24l68q26n62P65K317
52141A277455L239L438L300L174L186L112K513J374L96K68Q64J559K148K995M404
52126A313425O252Q205R987J1586J3371J5732J8397K0480K1512K2011K2685K3481
$$ y = [1340567, 1330729, 1321088, 1310740, 1300074, 1289877, 1280201, 1270722, 1261580, 1253223, 1245790, 1239232, 1233733, 1229504, 1226335, 1223799, 1221771, 1220473, 1220163, 1221037, 1223229, 1226579, 1230659, 1235268, 1240635, 1246818, 1253227, 1259209, 1264860, 1270753, 1277004, 1283144, 1288979, 1295098, 1302342, 1311069, 1320980, 1331424, 1341658, 1351018, 1359004, 1365297, 1369718, 1372205, 1372760, 1371360, 1367986, 1362716, 1355714, 1347181, 1337461, 1327103, 1316514, 1305678, 1294609, 1284040, 1275077, 1268109, 1262615, 1258206, 1255155, 1253586, 1252910, 1252635, 1253148, 1254959, 1257661, 1260392, 1263007, 1265994, 1269426, 1272783, 1275648, 1277828, 1278914, 1278584, 1277391, 1276453, 1276129, 1275761, 1274935, 1274373, 1275138, 1277455, 1280694, 1284132, 1287432, 1290606, 1293792, 1296904, 1299417, 1300791, 1301187, 1301455, 1302319, 1303878, 1306026, 1309021, 1313425, 1319677, 1327882, 1337869, 1349455, 1362826, 1378558, 1396955, 1417435, 1438947, 1460958, 1483643, 1507124]
52114A507124K3864K3634K2997K2122K1125K0206J9336J8150J6598J5392J5246
52103A725794J5973J6842J7556J8240J8804J8969J8771J8415J7672J6110J3786
52092A916932J1156Q304M884Q11l468p468j1005j4013j6396j8052j8737j8161
52080A834787j6637j5321j5160j5725j5665j4355j2445j0855r813q996q031o613
52068A685171m597k205J07K097L758N022N866O683Q033R918J1713J2944J3766
52055A758276J4620J5659J6702J7388J7375J6571J5204J3508J1490R175O799M415
52043A917182J626j795n264p927r670j1022j2192j2987j3517j4224j5031j5245
52031A799934j4596j3752j3484j3795j4123j3998j3337j2516j2279j3038j4194
$$ y = [1507124, 1530988, 1554622, 1577619, 1599741, 1620866, 1641072, 1660408, 1678558, 1695156, 1710548, 1725794, 1741767, 1758609, 1776165, 1794405, 1813209, 1832178, 1850949, 1869364, 1887036, 1903146, 1916932, 1928088, 1936392, 1941276, 1942087, 1938619, 1931151, 1920146, 1906133, 1889737, 1871685, 1852948, 1834787, 1818150, 1802829, 1787669, 1771944, 1756279, 1741924, 1729479, 1718624, 1708811, 1699815, 1691784, 1685171, 1680574, 1678369, 1678476, 1680573, 1684331, 1689353, 1695219, 1701902, 1709935, 1719853, 1731566, 1744510, 1758276, 1772896, 1788555, 1805257, 1822645, 1840020, 1856591, 1871795, 1885303, 1896793, 1905968, 1912767, 1917182, 1918808, 1917013, 1911749, 1903822, 1894152, 1883130, 1870938, 1857951, 1844434, 1830210, 1815179, 1799934, 1785338, 1771586, 1758102, 1744307, 1730184, 1716186, 1702849, 1690333, 1678054, 1665016, 1650822]
52020A650822j4717j4501j4389j4724j4781j4076j3338j3338j3512j2695j0852
52009A499899r103q159p690p299p341q398j0496j3145j5791j8023j9615k0650
51997A354189k1357k1760k1644k0963k0038j9225j8593j8040j7565j7242j7125
51986A140637j7250j7656j8292j8979j9567j9965k0014j9560j8807j8317j8360
51975I33870j8519j8247j7672j7342j7173j6288j4154j1289q473n701k510R44
51963G87446L849N800P186Q379R077Q754P399N467L330J015j610m488p120q742
51949H25742r046q591q113p454n806l014N4K642M945P406R864J1837J3235J4253
51935H47954J4964J5451J5923J6222J5685J4014J1833R878Q119O204M229K320
$$ y = [1650822, 1636105, 1621604, 1607215, 1592491, 1577710, 1563634, 1550296, 1536958, 1523446, 1510751, 1499899, 1490796, 1482637, 1474947, 1467648, 1460307, 1451909, 1441413, 1428268, 1412477, 1394454, 1374839, 1354189, 1332832, 1311072, 1289428, 1268465, 1248427, 1229202, 1210609, 1192569, 1175004, 1157762, 1140637, 1123387, 1105731, 1087439, 1068460, 1048893, 1028928, 1008914, 989354, 970547, 952230, 933870, 915351, 897104, 879432, 862090, 844917, 828629, 814475, 803186, 794713, 789012, 786502, 787446, 791295, 797095, 804281, 812660, 821737, 830491, 837890, 843357, 846687, 847702, 846092, 841604, 834484, 825742, 816696, 808105, 799992, 792538, 786732, 783718, 783772, 786414, 791359, 798765, 808629, 820466, 833701, 847954, 862918, 878369, 894292, 910514, 926199, 940213, 952046, 961924, 970043, 976247, 980476, 982796]
51923I82796J44k335m104m354m052n045p758j1044j4271j8019k2405k6062k7601
51910H35890k7047k5141k2206j8474j4715j1559q678n486k183O10K803M607N720
51897G14141N627M505K946R11k123n899r211j1303j2719j4281j5728j5992j4563
51884F26311j2047r342o746m062j295J134K905M239N586P040Q362R462J0549J1621
51870F53717J2269J2173J1495J0468Q852O228K785o31l294n132o314o747o235
51857F89634n014l730k801k054j191l94j91o69j197j138o92p31j871l837n767
51842F58357p013p620q147q985r885j0195r590q390p052n617l901k037m67N32
51828E69990J026J202J241J352J605J780J553Q22l33j779l107l501k486p94J96
$$ y = [982796, 982940, 980605, 976501, 972147, 968095, 963050, 955292, 944248, 929977, 911958, 889553, 863491, 835890, 808843, 783702, 761496, 743022, 728307, 716748, 708070, 702584, 700401, 701011, 703814, 708421, 714141, 719768, 724273, 727219, 728130, 726007, 720108, 710897, 699594, 686875, 672594, 656866, 640874, 626311, 614264, 604922, 598176, 594114, 592819, 593953, 596858, 601097, 606683, 613723, 622085, 631547, 642096, 653717, 665986, 678159, 689654, 700122, 708974, 715202, 717987, 717356, 714062, 708930, 702616, 695869, 689634, 684620, 680890, 678089, 676035, 674844, 674450, 674259, 673590, 672393, 671255, 670563, 669832, 667961, 664124, 658357, 651344, 643724, 635577, 626592, 616707, 606512, 596922, 588532, 581480, 575863, 571962, 569925, 569458, 569990, 571016, 572218, 573459, 574811, 576416, 578196, 579749, 580571, 580238, 578459, 575352, 571851, 569365, 568571, 568767]
51813E68767L7k50L85J625K283J886J182J094J629J952J324j68j710k520k539
51798E74977k318k222j982j203j41L92M6m78j51J090K146J974O91p97j930k732
51782E67362l026k249l99J335J631M92p34q08L73K061L534M565N361O238P323
51767E93059Q567R982J1611J3125J3736J2918J1050R051P423N796L345m44n106
51754F94113r177j1346j1840j2170j3097j3631j2598j0550r037q468p884o674
51742E67641n320m275l253j945n00J071L065N262O807P379P669Q201Q531Q228
51728F08561P810P795P483N726K639l46k030k302j611m12Q60J826K404K499J552
51713F42454r80m516p270p736o038l650j948j285j276j530j893k209k247j945
$$ y = [568767, 568804, 568554, 568939, 570564, 572847, 574733, 575915, 577009, 578638, 580590, 581914, 581746, 580036, 577516, 574977, 572659, 570437, 568455, 567252, 567111, 567503, 567549, 567071, 566920, 568010, 570156, 572130, 572821, 572024, 570094, 567362, 564336, 562087, 561688, 563023, 564654, 565146, 564412, 563604, 563977, 566038, 569572, 574137, 579498, 585736, 593059, 601626, 611608, 623219, 636344, 650080, 662998, 674048, 683099, 690522, 696318, 699663, 699219, 694113, 684936, 673590, 661750, 649580, 636483, 622852, 610254, 599704, 590667, 582199, 574315, 567641, 562321, 558046, 554793, 552848, 552348, 553419, 556484, 561746, 568553, 575932, 583601, 591802, 600333, 608561, 616371, 624166, 631649, 637375, 640014, 639668, 637638, 635336, 633725, 633313, 634173, 635999, 638403, 640902, 642454, 641474, 636958, 629688, 621952, 615914, 612264, 610316, 609031, 607755, 606225, 604332, 602123, 599876, 597931]
51699E97931j443p03N93K474M202M857M203K661O82j354k747k832j866q83m88
51684F05287m07m43j076k639m452n457n320m488l417k294j257l75M56J260J806
51669E77184J917J887K168K887L869M961O089P233Q570J0409J2655J4577J5283
51656F69689J4266J1438P048J858l004o693q976r802r063p063m692k696j059M77
51642F51728J675J917P68j854n596r433j2068j3063j3108j2737j1492q961o012
51629E61764l982l056k370j446n58J59R56J718J885J353O67J80l70j224k191l049
51613E50436l762m158l977l395k998k994l017k819k547k231j613p57k18k58m33
51598E15259k49L29J288K884N041O954P931Q291Q912J0119J1480J2394J2354J0904
$$ y = [597931, 596488, 595785, 596378, 598852, 603054, 607911, 612114, 614775, 615457, 614103, 611356, 608524, 606658, 605775, 605287, 604880, 604437, 603361, 600722, 596270, 590813, 585493, 581005, 577588, 575294, 574037, 573662, 574118, 575378, 577184, 579101, 580988, 583156, 586043, 589912, 594873, 600962, 608195, 616765, 627174, 639829, 654406, 669689, 683955, 695393, 702441, 704299, 701295, 694602, 685626, 675824, 666761, 659698, 655006, 652310, 651251, 651728, 653403, 655320, 656088, 654234, 648638, 639205, 627137, 614074, 600966, 588229, 576737, 567776, 561764, 557782, 554726, 552356, 550910, 550352, 550511, 551467, 553185, 555070, 556423, 557090, 557270, 556900, 555676, 553485, 550436, 546674, 542516, 538539, 535144, 532146, 529152, 526135, 523316, 520769, 518538, 516925, 516168, 515950, 515692, 515259, 515010, 515339, 516627, 519511, 524552, 531506, 539437, 547728, 556640, 566759, 578239, 590633, 602987, 613891]
51584F13891P938M031Q0l305n697o532n549l424j252P23L215O597J0224J3387
51570F34327J6279J9413K2596K5149K6960K8571L0321L2113L4046L6473L9119
51559I45367M0862M0948M0009L9309L9285L9371L8925L7612L4941L0256K3308
51548A350193J4387L768q325k0986l2493m1372m7434n1415n3863n4663n3488n0429
51536I53880m6131m1442l6831l2234k7473k2658j8016j3646r867p410o531o214
51524F85427n181l589k781l129l425k842k315l116m966o583p415p780p799p290
51510F17216o460n748n135m431l930m002m267m148l936m327n102n344m883m420
51496E51083m214l748k852k041j445n39P34J542J467J223J493J861J565O50l08
$$ y = [613891, 621829, 625860, 625940, 622635, 616938, 610406, 604857, 601433, 600181, 600904, 604119, 610716, 620940, 634327, 650606, 670019, 692615, 717764, 744724, 773295, 803616, 835729, 869775, 906248, 945367, 986229, 1027177, 1067186, 1106495, 1145780, 1185151, 1224076, 1261688, 1296629, 1326885, 1350193, 1364580, 1368348, 1360023, 1339037, 1306544, 1265172, 1217738, 1166323, 1112460, 1057797, 1004309, 953880, 907749, 866307, 829476, 797242, 769769, 747111, 729095, 715449, 705582, 698172, 691641, 685427, 680246, 676657, 673876, 670747, 667322, 664480, 662165, 659049, 654083, 647500, 640085, 632305, 624506, 617216, 610756, 605008, 599873, 595442, 591512, 587510, 583243, 579095, 575159, 570832, 565730, 560386, 555503, 551083, 546869, 543121, 540269, 538228, 536783, 536244, 536978, 538520, 539987, 541210, 542703, 544564, 546129, 546779, 546471]
51481E46471j002j354j273j034j331k253k877k540j931k013k435k031p33J66k66
51466E23564j547k626l066l051k818k514k267k139k130k261k437k312j673r73
51452D91750r59j605j930j150L58J660K485L431M971O819Q366R407J0186J0976
51438E44765J1876J2926J4073J4923J4857J3510J1053P956M644J535q54k115k284
51425F46865j874j664k416m371o751q173q023p176o860p085o850n769m639m202
51411E71012m192l953l316k427j240J86J350J789J627J217O20r7m21J03J225K427
51395E65910L710N259O616P087O907P134Q281R952J1973J4863J8717K2568K5630
51382G14607K8479L2177L6749M1420M6068N1259N6938O1990O5415O7097O7205
$$ y = [546471, 545469, 544115, 542842, 541808, 540477, 538224, 535347, 532807, 530876, 528863, 526428, 524397, 523664, 523830, 523564, 522017, 519391, 516325, 513274, 510456, 507942, 505675, 503536, 501406, 499145, 496708, 494396, 492723, 491750, 490791, 489186, 487256, 486106, 486464, 488124, 490609, 494040, 499011, 505830, 514196, 523603, 533789, 544765, 556641, 569567, 583640, 598563, 613420, 626930, 637983, 645939, 650583, 652118, 651264, 649149, 646865, 644991, 643327, 640911, 636540, 629789, 621616, 613593, 606417, 599557, 592472, 585622, 579853, 575214, 571012, 566820, 562867, 559551, 557124, 555884, 556070, 557420, 559209, 560836, 562053, 562673, 562576, 562155, 562258, 563483, 565910, 569620, 574879, 581495, 588582, 595489, 602623, 610904, 620856, 632829, 647692, 666409, 688977, 714607, 743086, 775263, 812012, 853432, 899500, 950759, 1007697, 1069687, 1135102, 1202199, 1269404]
51371A269404O5568O2110N7137N0494M0988K7382R968r343k8250m4872n7740o6027
51359A376819p0103p1403p1225o9866o7022o2725n7595n2284m6973m1470l5748
51348G30405l0301k5797k2363j9460j6708j4500j3352j2881j2028j0322q318o712
51336E37663n598m860m610m794m898m513l918l503k997j827j38J165J440R34L71
51321D99917K70P03J368J837J961K066K526L167L336K630J270j89j274j704j436
51306E16448p59j65M0p5l07o33j162j898k595k968l030l106l438l819l862l530
51290D85141l125k804k461k133k061k139j786o87P37K004L291M981O747P718P563
51275E00986O923O666P026P497P351O241M536K980J956J224N06K6J27O92J338
$$ y = [1269404, 1334972, 1397082, 1454219, 1504713, 1545701, 1573083, 1583051, 1573708, 1545458, 1500586, 1442846, 1376819, 1306716, 1235313, 1164088, 1094222, 1027200, 964475, 906880, 854596, 807623, 766153, 730405, 700104, 674307, 651944, 632484, 615776, 601276, 587924, 575043, 563015, 552693, 544375, 537663, 532065, 527205, 522595, 517801, 512903, 508390, 504472, 500969, 497972, 496145, 496007, 497172, 498612, 499546, 499917, 500187, 500890, 502258, 504095, 506056, 508122, 510648, 513815, 517151, 519781, 521051, 520862, 519588, 517884, 516448, 515689, 515524, 515564, 515489, 515182, 514549, 513387, 511489, 508894, 505926, 502896, 499790, 496352, 492533, 488671, 485141, 482016, 479212, 476751, 474618, 472557, 470418, 468632, 467945, 468682, 470686, 473977, 478958, 485705, 493423, 500986, 507909, 514575, 521601, 529098, 536449, 542690, 547226, 550206, 552162, 553386, 553892, 553918, 554045, 554737, 556075]
51260E56075J946K595L147L359L195K614J342o93k828m192m686m899n221n550
51246E46204n816o068o122n696n049m785m912m725l847k784k184k032j941j780
51232D88463j612j370r89o62n95o29m18J34P51J159J383J727K385L146L558L415
51216D99846K874K118J229N59O86J566K153J504O0p85k74J054K173K449J903J219
51200E20334J383K655L979M049K932J909J773K105K224J988J440M80p36j693k106
51185E42716k146j916j334o55l75m53l19J50M55M07L79L15m80k097l424l426k355
51168E25442j058R5J036J462J279R65Q70P65O60J335L154N031N630N022M206L406
51152E59300K037Q9j590k417k614k574k514k729l407m095m092l394k660k247j973
$$ y = [556075, 558021, 560616, 563763, 567122, 570317, 572931, 574273, 573580, 570752, 566560, 561874, 556975, 551754, 546204, 540388, 534320, 528198, 522502, 517453, 512668, 507756, 503031, 499184, 496400, 494216, 492184, 490243, 488463, 486851, 485481, 484492, 483830, 483235, 482606, 482188, 482322, 483073, 484232, 485615, 487342, 489727, 492873, 496431, 499846, 502720, 504838, 506067, 506626, 507312, 508878, 511031, 512535, 512595, 511810, 511536, 512590, 514763, 517212, 519115, 520334, 521717, 524372, 528351, 532400, 535332, 537241, 539014, 541119, 543343, 545331, 546771, 547251, 546515, 544822, 542716, 540570, 538654, 537320, 536665, 536290, 535837, 535518, 535668, 536123, 536530, 536909, 537224, 536744, 534647, 531223, 527797, 525442, 524384, 524479, 525515, 526977, 528256, 529221, 530091, 530856, 531516, 532851, 536005, 541036, 546666, 551688, 555894, 559300, 561337, 561426, 559836, 557419, 554805, 552231, 549717, 546988, 543581, 539486, 535394, 532000, 529340, 527093, 525120]
51137E25120j786j913k243k289j908j458j113o41L6O89J296K089K931L292L104
51122E25206L005L460M218M852N281N406M898L791K736K171J623M98q40j368p00
51107E64237N35J534J982J894J427R28P47P55M66j02j91O56J741J906J040J34
51091E79689j41k38p71j466j640j306r92p71k62M22O16J75j10L49J093J372J228
51074E77247J248J623K090K503K879L039K830K615K986L923M762N102N378O335
51060F24560Q243J0763J3411J5953J8466K1033K3395K5037K5615K5130K3543K0618
51048H55767J6508J2277R384Q502R118J0201J0879J0434Q201M082r46n235p790
51035I41382r096j0448j2430j4243j4574j2869r629n936l114k472m598q619j2598
$$ y = [525120, 523334, 521421, 519178, 516889, 514981, 513523, 512410, 511769, 511805, 512494, 513790, 515879, 518810, 522102, 525206, 528211, 531671, 535889, 540741, 546022, 551428, 556326, 560117, 562853, 565024, 566647, 567145, 566305, 564937, 564237, 564772, 566306, 568288, 570182, 571609, 572537, 573284, 574039, 574505, 574403, 574212, 574868, 576609, 578515, 579555, 579689, 579548, 579310, 578539, 577073, 575433, 574127, 573135, 572364, 572102, 572524, 573140, 573315, 573205, 573554, 574647, 576019, 577247, 578495, 580118, 582208, 584711, 587590, 590629, 593459, 596074, 599060, 602983, 607745, 612847, 618225, 624560, 632803, 643566, 656977, 672930, 691396, 712429, 735824, 760861, 786476, 811606, 835149, 855767, 872275, 884552, 893936, 902438, 911556, 921757, 932636, 943070, 951271, 955353, 954407, 949172, 941382, 932286, 921838, 909408, 895165, 880591, 867722, 858093, 852157, 849043, 846571, 841973, 833354, 820756]
51022H20756j4855j4763j2550r004n362k679r93M52J947L014L527M328O126Q470
51008G88414J0487J2092J3722J5288J6145J5981J5064J3719J2167J0640R119P054
50996I39892M012N49k155l602m440n547p078q438q961q498p517o496n215k957
50982H73549L79L811O400Q356J0508J3059J5577J7954K0515K3200K5478K7159
50970A045945K8670L0284L1666L2497L3066L4007L5759L8515M2434M7522N3335
50959A453700N8952O3382O6182O7753O8829O9593O9577O8451O6426O3622N9572
50948B176039N3921M7247M0585L4376K8429K2670J7340J2556Q369N154L355K865
50936B452906L119L611L771K554j008o613j2639j7503k0778k3030k5128k7812
$$ y = [820756, 805901, 791138, 778588, 769584, 764222, 761543, 760550, 761002, 762949, 765963, 769490, 773818, 779944, 788414, 798901, 810993, 824715, 840003, 856148, 872129, 887193, 900912, 913079, 923719, 932838, 939892, 943904, 944453, 942298, 938696, 934256, 928709, 921631, 913193, 904232, 895734, 888217, 881721, 876506, 873549, 873928, 877739, 884139, 892495, 903003, 916062, 931639, 949593, 970108, 993308, 1018786, 1045945, 1074615, 1104899, 1136565, 1169062, 1202128, 1236135, 1271894, 1310409, 1352843, 1400365, 1453700, 1512652, 1576034, 1642216, 1709969, 1778798, 1848391, 1917968, 1986419, 2052845, 2116467, 2176039, 2229960, 2277207, 2317792, 2352168, 2380597, 2403267, 2420607, 2433163, 2441532, 2446686, 2450041, 2452906, 2456025, 2459636, 2463407, 2465961, 2464953, 2458340, 2445701, 2428198, 2407420, 2384390, 2359262, 2331450]
50924B331450l1391l5603l9919m4100m8256n2435n6373n9569o1514o2036o1633
50913A778621o0993o0000n7717n3846m9439m5608m2121l8259l4382l1418k9167
50902A275671k6459k3020j9957j8212j7570j7351j7028j5961j3668j0762q563
50891A087120p381o191m408k877k450k530j869j81J834L451M292M257L779L714
50877A080560M450N508O457P537Q952J0177J0680J0787J1094J1605J2172J3252
50865A193231J5266J7578J9188K0257K2023K5125K8846L2221L5162L8197M1713
50854A488807M5815N0670N6514O3393P0988P8760Q6325R3834J01828J10606J19829
50843B367369J28871J37302J44844J51110J55763J58763J60131J59541J56365
$$ y = [2331450, 2300059, 2264456, 2224537, 2180437, 2132181, 2079746, 2023373, 1963804, 1902290, 1840254, 1778621, 1717628, 1657628, 1599911, 1546065, 1496626, 1451018, 1408897, 1370638, 1336256, 1304838, 1275671, 1249212, 1226192, 1206235, 1188023, 1170453, 1153102, 1136074, 1120113, 1106445, 1095683, 1087120, 1079739, 1073548, 1069140, 1066263, 1063813, 1061283, 1059414, 1059233, 1061067, 1064518, 1068810, 1073067, 1076846, 1080560, 1085010, 1090518, 1096975, 1104512, 1113464, 1123641, 1134321, 1145108, 1156202, 1167807, 1179979, 1193231, 1208497, 1226075, 1245263, 1265520, 1287543, 1312668, 1341514, 1373735, 1408897, 1447094, 1488807, 1534622, 1585292, 1641806, 1705199, 1776187, 1854947, 1941272, 2035106, 2136934, 2247540, 2367369, 2496240, 2633542, 2778386, 2929496, 3085259, 3244022, 3404153, 3563694, 3720059]
50834C720059J50108J40576J27769J11930R3760P4350N4844L6100J8590K554j1667
50823D518973k3399l1895l6795l8195l6393l1959k5990j9792j4239r845p518q541
50811D234412j3480k1720l2457m5557o0836p7012r2292j05877j18064j28895j37508
50800C400714j43096j45841j46333j44447j39481j31381j21299j10653r9917q8712
50790B129554p6936o5359n4940m6006l8327l1613k5574j9764j4000q808m976k669
50778A740582j473j106j492k222k753l266m516o574q456r526j0403j1855j3486
50765A663454j4407j4804j5762j7659j9664k0986k1837k2715k3334k2886k1159
50754A448241j8883j6944j5487j4021j2154r986p799n608l267p21K082N446R736
$$ y = [3720059, 3870167, 4010743, 4138512, 4250442, 4344202, 4418552, 4473396, 4509496, 4528086, 4530640, 4518973, 4495574, 4463679, 4426884, 4388689, 4352296, 4320337, 4294347, 4274555, 4260316, 4250471, 4242953, 4234412, 4220932, 4199212, 4166755, 4121198, 4060362, 3983350, 3891058, 3785181, 3667117, 3538222, 3400714, 3257618, 3111777, 2965444, 2820997, 2681516, 2550135, 2428836, 2318183, 2218266, 2129554, 2052618, 1987259, 1932319, 1886313, 1847986, 1816373, 1790799, 1771035, 1757035, 1748227, 1743251, 1740582, 1739109, 1738003, 1736511, 1734289, 1731536, 1728270, 1723754, 1717180, 1708724, 1699198, 1688795, 1676940, 1663454, 1649047, 1634243, 1618481, 1600822, 1581158, 1560172, 1538335, 1515620, 1492286, 1469400, 1448241, 1429358, 1412414, 1396927, 1382906, 1370752, 1360766, 1352967, 1347359, 1344092, 1343371, 1345453, 1350899, 1360635]
50741A360635J4898K0384K5597L0275L4547L8837M3591M8780N3792N8207O2435
50730A791978O7050P1656P5115P7001P8108P9355Q0704Q1479Q1114P9327P6119
50719B639006P2000O7712O3310N7853N0433M1165L0777J9603P477n485j8359k9632
50707B995860l7897m2556m3999m2923l9586l4120k7388k0756j4902r573m805j518
50695B675837m94j563m420r528j7387k7439l8412m9410n9876o8923p5617p9764
50683B243004q1654q1149p7849p2106o5072n7573m9673m1434l3398k5917j8580
50672A638599j0833k900M384J0529J5854K0854K5437K8999L1144L2067L2113L1276
50660A857523K9405K6790K4038K1504J9195J7217J5855J5109J4592J4099J3828
$$ y = [1360635, 1375533, 1395917, 1421514, 1451789, 1486336, 1525173, 1568764, 1617544, 1671336, 1729543, 1791978, 1859028, 1930684, 2005799, 2082800, 2160908, 2240263, 2320967, 2402446, 2483560, 2562887, 2639006, 2711006, 2778718, 2842028, 2899881, 2950314, 2991479, 3022256, 3041859, 3049336, 3043851, 3025492, 2995860, 2957963, 2915407, 2871408, 2828485, 2788899, 2754779, 2727391, 2706635, 2691733, 2682160, 2677355, 2675837, 2675343, 2673780, 2669360, 2659832, 2642445, 2615006, 2576594, 2527184, 2467308, 2398385, 2322768, 2243004, 2161350, 2080201, 2002352, 1930246, 1865174, 1807601, 1757928, 1716494, 1683096, 1657179, 1638599, 1627766, 1624866, 1629250, 1639779, 1655633, 1676487, 1701924, 1730923, 1762067, 1794134, 1826247, 1857523, 1886928, 1913718, 1937756, 1959260, 1978455, 1995672, 2011527, 2026636, 2041228, 2055327, 2069155]
50649B069155J4034J4776J6059J7755J9359K0396K1184K2575K4866K7574L0412
50638B298145L3638L7216M0453M2878M4769M6354M7258M7290M6974M6635M5638
50627B777248M3362M0333L7597L5353L2995L0209K7265K4278K0493J4189L433
50616C086755j2012k9032m2438m8860m8887m5000l8667l0478k1821j4491q999
50605B746070m829k150j853l924p355j1734j7735k5717l4968m4550n3838o2061
50593B475356o8418p2906p6122p7986p7700p5154p1361o7182o2643n7843n3445
50582A714596m9766m6318m2864l9933l7680l5130l1426k7123k3368k0312j7164
50571A343512j3540r910o778m053j276J859N233Q345J0813J2886J5161J7640J9571
$$ y = [2069155, 2083189, 2097965, 2114024, 2131779, 2151138, 2171534, 2192718, 2215293, 2240159, 2267733, 2298145, 2331783, 2368999, 2409452, 2452330, 2497099, 2543453, 2590711, 2638001, 2684975, 2731610, 2777248, 2820610, 2860943, 2898540, 2933893, 2966888, 2997097, 3024362, 3048640, 3069133, 3083322, 3086755, 3074743, 3045711, 3003273, 2954413, 2905526, 2860526, 2821859, 2791381, 2769560, 2755069, 2746070, 2741241, 2739091, 2737238, 2733314, 2725959, 2714225, 2696490, 2670773, 2635805, 2591255, 2537417, 2475356, 2406938, 2334032, 2257910, 2179924, 2102224, 2027070, 1955709, 1888527, 1825884, 1768041, 1714596, 1664830, 1618512, 1575648, 1535715, 1498035, 1462905, 1431479, 1404356, 1380988, 1360676, 1343512, 1329972, 1320062, 1313284, 1309231, 1307955, 1309814, 1315047, 1323392, 1334205, 1347091, 1362252, 1379892, 1399463]
50558A399463K0574K1450K3319K6102K8461K9379K9419L0137L2303L4969L6561
50547A712137L6694L6448L6715L6997L6392L5170L4509L4886L5703L6523L7746
50536B109920L9882M2889M6634N1296N6963O3275O9776P6174Q2033Q6801R0506
50525B816149R3995R8078J02781J07641J12291J16426J19535J21024J20503J17767
50515C926190J12798J05856R7206Q6603P3466N7708M0047K1299J866j7781l6557
50504D468701n3194o7190p8963q9041r7136j02080j02744r9038r1798q1698o8733
50493C537086n3179l6342j9707l831J1036K3613L2167L6363L7168L4660K7175
50482C626209J3371n851k8204n1853p5550r7709j16462j30578j39684j43820j43348
$$ y = [1399463, 1420037, 1441487, 1464806, 1490908, 1519369, 1548748, 1578167, 1608304, 1640607, 1675576, 1712137, 1748831, 1785279, 1821994, 1858991, 1895383, 1930553, 1965062, 1999948, 2035651, 2072174, 2109920, 2149802, 2192691, 2239325, 2290621, 2347584, 2410859, 2480635, 2556809, 2638842, 2725643, 2816149, 2910144, 3008222, 3111003, 3218644, 3330935, 3447361, 3566896, 3687920, 3808423, 3926190, 4038988, 4144844, 4242050, 4328653, 4402119, 4459827, 4499874, 4521173, 4523039, 4505258, 4468701, 4415507, 4348317, 4269354, 4180313, 4083177, 3981097, 3878353, 3779315, 3687517, 3605819, 3537086, 3483907, 3447565, 3427858, 3424027, 3435063, 3458676, 3490843, 3527206, 3564374, 3599034, 3626209, 3639580, 3633729, 3605525, 3553672, 3478122, 3380413, 3263951, 3133373, 2993689, 2849869, 2706521]
50471B706521j39067j31913j22691j12351j02081r2569q3445p4084o4715n6319
50461A727286m9553m4242l9803l5803l2174k9095k6576k4054k0804j6823j2856
50450A395503r295n618j344L050O706R477J1785J3858J5757J7905K0710K3735
50438A502229K5959K6949K7228K7282K6679K4509K0487J5515J1170Q543P407O653
50426A730610N629M798M858N606O167O199O280P065Q493J0073J1677J3759J6849
50413A838063K0932K5431K9902L4646M0386M7183N3909N9053O2004O3367O4160
50402B339036O4849O5067O4025O1200N6703N1064M4634L7321K8941J9630R793
50391B842263k74j0580k1224l2002m2328n1643n9827o6893p2173p4386p2897o8573
$$ y = [2706521, 2567454, 2435541, 2312850, 2200499, 2098418, 2005849, 1922404, 1848320, 1783605, 1727286, 1677733, 1633491, 1593688, 1557885, 1525711, 1496616, 1470040, 1445986, 1425182, 1408359, 1395503, 1386208, 1380590, 1379246, 1382296, 1389002, 1398479, 1410264, 1424122, 1439879, 1457784, 1478494, 1502229, 1528188, 1555137, 1582365, 1609647, 1636326, 1660835, 1681322, 1696837, 1708007, 1716550, 1723957, 1730610, 1736239, 1741037, 1745895, 1751501, 1757668, 1763867, 1770147, 1777212, 1785705, 1795778, 1807455, 1821214, 1838063, 1858995, 1884426, 1914328, 1948974, 1989360, 2036543, 2090452, 2149505, 2211509, 2274876, 2339036, 2403885, 2468952, 2532977, 2594177, 2650880, 2701944, 2746578, 2783899, 2812840, 2832470, 2842263, 2841989, 2831409, 2810185, 2778183, 2735855, 2684212, 2624385, 2557492, 2485319, 2410933, 2338036, 2269463]
50379B269463o2796n5972m7637l7811k7356j7050p213J562Q268J2466J4694J5383
50367B066001J3983R782L014n453j5075k5524l5958m5140n2280n7329o0400o1412
50355A734209o0326n7457n3421m8846m4086l9169l4122k9360k5390k2100j8749
50344A301183j4845j0724p063m256k528k250l756o941j1286j6004k0021k2214
50332A179295k2074j9985j6769j3204j0015p724o145m445k094N19K713M337N612
50319A090021O597P274P877Q670R518J0089J0289J0209R883R385Q938Q601Q132
50306A205483P548P512Q671J0770J2836J4203J5040J6005J7726K0395K3582K6449
50294A386220K8452K9811L1125L2669L4227L5418L5724L4099K8820J8194K075
$$ y = [2269463, 2206667, 2150695, 2103058, 2065247, 2037891, 2020841, 2013628, 2015190, 2023458, 2035924, 2050618, 2066001, 2079984, 2089766, 2092780, 2087327, 2072252, 2046728, 2010770, 1965630, 1913350, 1856021, 1795621, 1734209, 1673883, 1616426, 1563005, 1514159, 1470073, 1430904, 1396782, 1367422, 1342032, 1319932, 1301183, 1286338, 1275614, 1268551, 1264295, 1261767, 1259517, 1255761, 1248820, 1237534, 1221530, 1201509, 1179295, 1157221, 1137236, 1120467, 1107263, 1097248, 1089524, 1083379, 1078934, 1076840, 1077359, 1080072, 1084409, 1090021, 1096618, 1103892, 1111769, 1120439, 1129957, 1140046, 1150335, 1160544, 1170427, 1179812, 1188750, 1197351, 1205483, 1213031, 1220543, 1229214, 1239984, 1252820, 1267023, 1282063, 1298068, 1315794, 1336189, 1359771, 1386220, 1414672, 1444483, 1475608, 1508277, 1542504, 1577922, 1613646, 1647745, 1676565, 1694759, 1696834]
50283A696834j6919l4164m5688n0432m9810m5600l9001l1311k4062j7989j2691
50272A329167p822l926j548k23J074K917N289P850R912J0779J0635J0539J1108
50259A385751J1829J2148J2486J3551J5344J7541K0177K3137K5656K7204K8328
50248A593152K9692L0827L0773K9446K7432K4857K1673J8683J6990J6486J6010
50237A856021J4967J3646J1903Q699L365l500j0740j7569k3542k8221l1281l2543
50225A761205l1897k9560k6357k3143k0118j7300j5506j6070j9467k4822l0738
50214A506227l6025l9677m1088m0514l8750l6199l2831k8987k5479k2755k0590
50203A143332j8708j7121j5735j4307j2908j1896j1310j0845j0401j0053r549
$$ y = [1696834, 1679915, 1645751, 1600063, 1549631, 1499821, 1454221, 1415220, 1383909, 1359847, 1341858, 1329167, 1321345, 1317419, 1315871, 1315648, 1316722, 1319639, 1324928, 1332778, 1342690, 1353469, 1364104, 1374643, 1385751, 1397580, 1409728, 1422214, 1435765, 1451109, 1468650, 1488827, 1511964, 1537620, 1564824, 1593152, 1622844, 1653671, 1684444, 1713890, 1741322, 1766179, 1787852, 1806535, 1823525, 1840011, 1856021, 1870988, 1884634, 1896537, 1905236, 1908601, 1905101, 1894361, 1876792, 1853250, 1825029, 1793748, 1761205, 1729308, 1699748, 1673391, 1650248, 1630130, 1612830, 1597324, 1581254, 1561787, 1536965, 1506227, 1470202, 1430525, 1389437, 1348923, 1310173, 1273974, 1241143, 1212156, 1186677, 1163922, 1143332, 1124624, 1107503, 1091768, 1077461, 1064553, 1052657, 1041347, 1030502, 1020101, 1010048, 1000499]
50192A000499q561p427o815o575n822m408l317l239l592l475k881k368k072j690
50178I38257j084l85K61O47N24p8p11r48p10o9R09J956K629K733K493K245K271
50161I50940K882M122N421O076O156O369O930P296P167P077P614Q740J0220J2129
50147A049139J4424J6577J8193J9570K1165K2791K3929K4607K5537K7512L0944
50136A294388L5713M1206M6677N1796N6686O1249O4847O6924O7593O7302O6187
50125A920568O4099O1097N7501N3635M9710M5682M0966L4493K5388J3642L5j4441
50113B352375k8863m2381n4199o3624p0129p3486p3980p2331o9304o5367o0631
50102A678080n4968m8473m1978l6903l4099l2903l1831l0200k8591k7750k7603
$$ y = [1000499, 991938, 984511, 977696, 971121, 965299, 960891, 957574, 954335, 950743, 947268, 944387, 942019, 939947, 938257, 937173, 936788, 937049, 937696, 938220, 938142, 937431, 936483, 935773, 935704, 936613, 938569, 941198, 943931, 946424, 948669, 950940, 953822, 957944, 963365, 969441, 975597, 981966, 988896, 996192, 1003359, 1010436, 1018050, 1026790, 1037010, 1049139, 1063563, 1080140, 1098333, 1117903, 1139068, 1161859, 1185788, 1210395, 1235932, 1263444, 1294388, 1330101, 1371307, 1417984, 1469780, 1526466, 1587715, 1652562, 1719486, 1787079, 1854381, 1920568, 1984667, 2045764, 2103265, 2156900, 2206610, 2252292, 2293258, 2327751, 2353139, 2366781, 2366816, 2352375, 2323512, 2281131, 2226932, 2163308, 2093179, 2019693, 1945713, 1873382, 1804078, 1738711, 1678080, 1623112, 1574639, 1532661, 1495758, 1461659, 1428756, 1396925, 1366725, 1338134, 1310384, 1282781]
50091A282781k7541k7100k6074k4306k1765j8646j5288j2095r463p511n908m335
50079A082749l029k479k607k752k398j473k5J808L439M242M417M890O091P448
50065A100321Q250Q444Q315P979P515P068O494N394L861K577J909J352K99j098
50051A168680k222k811l110l489m157m908n066m138k602j433p17N70K975N645
50037A143217P491Q631R989J1958J4176J6214J7820J8774J9199J9794K1084K2661
50025A331008K3735K4324K5185K6564K7725K7954K7615K7867K9409L1733L3660
50014A636779L4655L5343L6500L7683L7392L4585K9600K3539J7438J2253Q896
50003A944663P618P616P653O867M855J517k835p778j3495k0707k9429l8314m5740
$$ y = [1282781, 1255240, 1228140, 1202066, 1177760, 1155995, 1137349, 1122061, 1109966, 1100503, 1092992, 1087084, 1082749, 1079720, 1077241, 1074634, 1071882, 1069484, 1068011, 1067986, 1069794, 1073233, 1077475, 1081892, 1086782, 1092873, 1100321, 1108571, 1117015, 1125330, 1133309, 1140824, 1147892, 1154386, 1159780, 1163641, 1166218, 1168127, 1169479, 1169778, 1168680, 1166458, 1163647, 1160537, 1157048, 1152891, 1147983, 1142917, 1138779, 1136177, 1134744, 1134027, 1134597, 1137572, 1143217, 1150708, 1159339, 1169328, 1181286, 1195462, 1211676, 1229496, 1248270, 1267469, 1287263, 1308347, 1331008, 1354743, 1379067, 1404252, 1430816, 1458541, 1486495, 1514110, 1541977, 1571386, 1603119, 1636779, 1671434, 1706777, 1743277, 1780960, 1818352, 1852937, 1882537, 1906076, 1923514, 1935767, 1944663, 1952281, 1959897, 1967550, 1974417, 1979272, 1980789, 1977954, 1970176, 1956681, 1935974, 1906545, 1868231, 1822491]
49990A822491n1061n4351n5546n4653n2360m9628m6809m3837m1098l9236l8144
49979A295768l6834l4562l1587k8648k6084k3625k0867j7853j5181j3473j2649
49968A034405j1946j0766r243p875o975o591o510o194n170l761k873k694k264
49955I51543p25J580L820N798P700R284J0213J0802J1516J1989J1411R771P895
$$ y = [1822491, 1771430, 1717079, 1661533, 1606880, 1554520, 1504892, 1458083, 1414246, 1373148, 1333912, 1295768, 1258934, 1224372, 1192785, 1164137, 1138053, 1114428, 1093561, 1075708, 1060527, 1047054, 1034405, 1022459, 1011693, 1002450, 994575, 987600, 981009, 974499, 968305, 963135, 959374, 956501, 953807, 951543, 950818, 952398, 956218, 962016, 969716, 979000, 989213, 1000015, 1011531, 1023520, 1034931, 1044702, 1052597]
$$ [...]
##END NTUPLES=NMR SPECTRUM
##END=
