##TITLE=AC1702_ROEFFECT0027_8637201_Sj94R7fawi
##JCAMPDX= 6.0         $$ Bruker NMR JCAMP-DX V2.0
##DATA TYPE= NMR SPECTRUM
##DATA CLASS= NTUPLES
##ORIGIN= BRUKER
##OWNER= Administrator
$$ 1.72 TOPSPIN		Version 2.1
$$ 2014-05-22 15:42:13.245 -0700  Administrator@X
$$ Compression mode = diff/dup
##.OBSERVE FREQUENCY= 400.02188249412
##.OBSERVE NUCLEUS= ^1H
##.ACQUISITION MODE= SIMULTANEOUS (DQD)
##.ACQUISITION SCHEME= undefined
##.AVERAGES= 8
##.DIGITISER RES= 22
##SPECTROMETER/DATA SYSTEM= spect
##.PULSE SEQUENCE= zg30
##.SOLVENT NAME= COFFEE_meoh
##.SHIFT REFERENCE= INTERNAL, COFFEE_meoh, 1, 14.98509
##AUDIT TRAIL= $$ (NUMBER, WHEN, WHO, WHERE, PROCESS, VERSION, WHAT)
$$ ##TITLE= Audit trail, TOPSPIN		Version 2.1
$$ ##JCAMPDX= 5.01
$$ ##ORIGIN= Bruker BioSpin GmbH
$$ ##OWNER= Administrator
$$ $$ E:\/data/COFFEE/nmr/AC1702_ROEFFECT0027_8637201_Sj94R7fawi/10/pdata/1/auditp.txt
$$ ##AUDIT TRAIL=  $$ (NUMBER, WHEN, WHO, WHERE, PROCESS, VERSION, WHAT)
(   1,<2014-05-22 15:42:04.347 -0700>,<Administrator>,<X>,<go>,<TOPSPIN 2.1>,
      <created by zg
	started at 2014-05-22 15:40:59.003 -0700,
	POWCHK enabled, PULCHK disabled,
       configuration hash MD5:
       C8 4E 4E 5D D3 5C D8 9E 9F 52 82 E0 59 8A DE 15
       data hash MD5: 64K
       72 4D B4 2C 99 A9 B6 6A B3 D7 12 0B 2D C6 12 6B>)
(   2,<2014-05-22 15:42:08.503 -0700>,<Administrator>,<X>,<proc1d>,<TOPSPIN 2.1>,
      <Start of raw data processing
       efp LB = 0 FT_mod = 6 PKNL = 1 PHC0 = 0 PHC1 = 0 SI = 32K 
       data hash MD5: 32K
       4D 3A 76 20 F6 7D A4 65 4D 60 61 50 BA 92 7D 3F>)
(   3,<2014-05-22 15:42:08.878 -0700>,<Administrator>,<X>,<proc1d>,<TOPSPIN 2.1>,
      <pk PHC0 = 94.92188 PHC1 = 0 
       data hash MD5: 32K
       6B BC 6F 00 E4 6B EF F3 93 95 BA B3 BD CF 49 6F>)
(   4,<2014-05-22 15:42:09.519 -0700>,<Administrator>,<X>,<proc1d>,<TOPSPIN 2.1>,
      <abs ABSG = 1 
       data hash MD5: 32K
       69 B4 30 71 B7 E1 40 25 F6 F7 20 AB 7E 4F 73 3D>)
(   5,<2014-05-22 15:42:09.597 -0700>,<Administrator>,<X>,<proc1d>,<TOPSPIN 2.1>,
      <abs ABSG = 2 
       data hash MD5: 32K
       2F 05 C5 A8 CC 30 18 A1 9F 72 31 51 DE BF 1B 52>)
(   6,<2014-05-22 15:42:09.659 -0700>,<Administrator>,<X>,<proc1d>,<TOPSPIN 2.1>,
      <abs ABSG = 3 
       data hash MD5: 32K
       29 92 A5 02 22 E7 65 2A 96 E7 71 10 29 E1 0C A9>)
(   7,<2014-05-22 15:42:09.753 -0700>,<Administrator>,<X>,<proc1d>,<TOPSPIN 2.1>,
      <abs ABSG = 4 
       data hash MD5: 32K
       E0 D1 D5 E4 22 94 9B D6 A1 4C 02 DA B3 E3 0E E9>)
(   8,<2014-05-22 15:42:09.815 -0700>,<Administrator>,<X>,<proc1d>,<TOPSPIN 2.1>,
      <abs ABSG = 5 
       data hash MD5: 32K
       24 A5 3A 58 51 6F BD E3 7A C8 02 94 4A 76 A6 C4>)
$$ ##END=
$$ 
$$ $$ hash MD5
$$ $$ 4C BB 7D 95 3C 4C 68 68 A2 A5 85 7A 02 66 4D 7D
##$RELAX= 
##$RELAX= 
##$RELAX= 
##$RELAX= 
##$RELAX= 
##$RELAX= 
##$RELAX= 
$$ Bruker specific parameters
$$ --------------------------
##$DU= <E:\>
##$EXPNO= 10
$$ [...]
150 150 150 150 150 150 150 150
##$TP07= 0
##$TPNAME0= <>
##$TPNAME1= <>
##$TPNAME2= <>
##$TPNAME3= <>
##$TPNAME4= <>
##$TPNAME5= <>
##$TPNAME6= <>
##$TPNAME7= <>
##$TPOAL= (0..7)
0.5 0.5 0.5 0.5 0.5 0.5 0.5 0.5
##$TPOFFS= (0..7)
0 0 0 0 0 0 0 0
##$TUNHIN= 0
##$TUNHOUT= 0
##$TUNXOUT= 0
##$USERA1= <user>
##$USERA2= <user>
##$USERA3= <user>
##$USERA4= <user>
##$USERA5= <user>
##$V9= 5
##$VALIST= <valist>
##$VCLIST= <CCCCCCCCCCCCCCC>
##$VD= 0
##$VDLIST= <DDDDDDDDDDDDDDD>
##$VPLIST= <PPPPPPPPPPPPPPP>
##$VTLIST= <TTTTTTTTTTTTTTT>
##$WBST= 1024
##$WBSW= 4
##$XGAIN= (0..3)
0 0 0 0
##$XL= 0
##$YL= 0
##$YMAX_a= 601573
##$YMIN_a= -511222
##$ZGOPTNS= <>
##$ZL1= 120
##$ZL2= 120
##$ZL3= 120
##$ZL4= 120
##$ABSF1= 14.98509
##$ABSF2= -5.573092
##$ABSG= 5
##$ABSL= 3
##$ALPHA= 0
##$AQORDER= 0
##$ASSFAC= 0
##$ASSFACI= 0
##$ASSFACX= 0
##$ASSWID= 0
##$AUNMP= <proc_prof1d_extract_pilot.lims>
##$AXLEFT= 0
##$AXNAME= <>
##$AXNUC= <1H>
##$AXRIGHT= 0
##$AXTYPE= 0
##$AXUNIT= <>
##$AZFE= 0.1
##$AZFW= 0.1
##$BCFW= 0
##$BC_mod= 0
##$BYTORDP= 0
##$COROFFS= 0
##$CY= 15
##$DATMOD= 1
##$DC= 0
##$DFILT= <>
##$DTYPP= 0
##$F1P= 0
##$F2P= 0
##$FCOR= 0.5
##$FTSIZE= 32768
##$FT_mod= 6
##$GAMMA= 0
##$GB= 0
##$INTBC= 1
##$INTSCL= 1
##$ISEN= 128
##$LB= 0
##$LEV0= 0
##$LPBIN= 0
##$MAXI= 10000
##$MC2= 0
##$MEAN= 0
##$ME_mod= 0
##$MI= 0
##$NCOEF= 0
##$NC_proc= -8
##$NLEV= 6
##$NOISF1= 0
##$NOISF2= 0
##$NSP= 0
##$NTH_PI= 0
##$NZP= 0
##$OFFSET= 14.98509
##$PC= 1
##$PHC0= 94.92188
##$PHC1= 0
##$PH_mod= 1
##$PKNL= yes
##$PPARMOD= 0
##$PPDIAG= 0
##$PPIPTYP= 0
##$PPMPNUM= 2147483647
##$PPRESOL= 1
##$PSCAL= 4
##$PSIGN= 0
##$PYNMP= <proc.py>
##$REVERSE= no
##$SF= 400.02
##$SI= 32768
##$SIGF1= 0
##$SIGF2= 0
##$SINO= 400
##$SIOLD= 32768
##$SPECTYP= <>
##$SREGLST= <1H.CDCl3>
##$SSB= 0
##$STSI= 32768
##$STSR= 0
##$SW_p= 8223.68421052631
##$SYMM= 0
##$S_DEV= 0
##$TDeff= 65536
##$TDoff= 0
##$TI= <>
##$TILT= no
##$TM1= 0
##$TM2= 0
##$TOPLEV= 0
##$USERP1= <user>
##$USERP2= <user>
##$USERP3= <user>
##$USERP4= <user>
##$USERP5= <user>
##$WDW= 1
##$XDIM= 32768
##$YMAX_p= 464067231
##$YMIN_p= -714751
##$CURPLOT= <Network HP LaserJet P1505>
##$CURPRIN= <$Network HP LaserJet P1505>
##$DFORMAT= <normdp>
##$LAYOUT= <+/1D_H.xwp>
##$LFORMAT= <normlp>
##$PFORMAT= <normpl>
##$SURQMSG= 1
$$ End of Bruker specific parameters
$$ ---------------------------------
##NTUPLES= NMR SPECTRUM
##VAR_NAME=  FREQUENCY,     SPECTRUM/REAL,   SPECTRUM/IMAG
##SYMBOL=    X,             R,               I
##VAR_TYPE=  INDEPENDENT,   DEPENDENT,       DEPENDENT
##VAR_FORM=  AFFN,          ASDF,            ASDF
##VAR_DIM=   32768,         32768,           32768
##UNITS=     HZ,            ARBITRARY UNITS, ARBITRARY UNITS
##FACTOR=    0.250966925370066, 1,           1
##FIRST=     8223.43324360094, -41013,       132425
##LAST=      0,             77877,           -195046
##MIN=       0,             -714751,         0
##MAX=       8223.43324360094, 464067231,    0
$$ Real data points
##PAGE= N=1
##DATA TABLE= (X++(R..R)), XYDATA
$$ [...]
19579d6332l383D31047H238c70642F8503a13344l21294Q8855C47875g196l08789
19568c15985L085d9069k1714b562m16465K01056A77746e4436o3144A84750i7042
19556I1039j2203i5221p8193P3018l9383E0160j8262J87214e5130E5986k2851
19545C3135h9953D2943b21503d9939A8770b13439g420A37997d74107A53232g4304
19533A9470b74111f3345A79649d7264A19399Q652a59293M8651A45673a59395c2739
19521b3710l8289D84054g4683a5588j24238k75923a99490A4917b76374b2846E338
19509a21616A36323m0797g2401k50465J35265F9364G058e5265B61239b82181e2348
19497I383L6123b6049B50444i9657r5489P1937b4881e872l48905J67616E1143
$$ plain form
19579 -46332 -49715 431047 8238 -370642 68503 -113344 -434638 -345783 347875 -7196 -315985
19568 -315985 -312900 -49069 -70783 -2562 -419027 -217971 177746 -54436 -117580 184750 -97042
19556 91039 78836 -95221 -173414 -100396 -139779 50160 31898 219112 -55130 55986 33135
19545 33135 -89953 42943 -221503 -49939 18770 -213439 -7420 137997 -474107 153232 -74304
19533 19470 -274111 -63345 179649 -47264 119399 128051 -159293 -110642 145673 -159395 -32739
19521 -23710 -61999 484054 -74683 -15588 -139826 -415749 -199490 14917 -276374 -22846 5338
19509 -121616 136323 95526 -72401 -322866 -187601 69364 7058 -55265 261239 -282181 -52348
19497 9383 45506 -26049 250444 -99657 -195146 -123209 -24881 -5872 -354777 -187161 51143
19485g2633k41365a29741B1465O177f0866o5366b7588j1712J1398p353p675r7316
19473a40246k5004A31490j3269b10193H5617a47820G1629j121K8228k2937a04696
19461b25022A78542g8331m6687B2098a55945C1254J15893b93069L2635J6860d8190
19449H1693b26974e0061j05890B9010a27492A55148g228k57776J13228k78279
19439d30055b09467m5801J04120b7597j09776c4054A44859a83635A37170b03818
19428f3095b5405F4351d1426m9307b5016k60040D6755a19432A32970d61347D1677
19416a59844j41520J6913D5905a34082q9607C9366K7579e22043b9236A75602b39016
19404a08705K7858C07641r0360h6581A36755b09790f3023j5712K6906A74461P3010
$$ plain form
19485 -72633 -313998 -129741 21465 27642 -60866 -126232 -27588 -39300 -27902 -35255 -42930 -140246
19473 -140246 -165250 131490 118221 -210193 85617 -147820 71629 70508 98736 75799 -104696
19461 -225022 178542 -78331 -125018 22098 -155945 31254 147147 -293069 -260434 -243574 -48190
19449 81693 -226974 -50061 -155951 29010 -127492 155148 -7228 -265004 -151776 -430055
19439 -430055 -209467 -255268 -151148 -27597 -137373 -34054 144859 -183635 137170 -203818
19428 -63095 -25405 64351 -41426 -90733 -25016 -285056 46755 -119432 132970 -461347 41677
19416 -159844 -301364 -284451 45905 -134082 -223689 39366 66945 -522043 -29236 175602 -239016
19404 -108705 -80847 307641 217281 -86581 136755 -209790 -63023 -78735 -51829 174461 247471
19393B47471D171K68190i8p106A61354b85323C8563b12513q7229f1327D5525g9218
19380a02429m1743j53725e9234A1066a58891A72794a64250B7823f9539b5838j16199
19369a42037K0731c7937a7373k82934h5697B44317h7469r8520i280B05322A00344
19357a81619e3777O98H8193a16968B04722E9823c66272F5808O6151g5436o1809
19346a37245r7041m3588C2597d1115j08099E2513b7005A12469D1338c06195A66311
19334B19114d6676A06644D8365K12848J33557j26283A17463b13235A931J99337
19324B01268n4988f3841A833J58996c8841I5574O9359l1863a90720A23514c37445
19312B28196b93413O8653L0424B62514b58042O2206j33759A985a66670l14176
$$ plain form
19393 247471 4171 272361 -98 -7204 161354 -285323 38563 -212513 -299742 -61327 45525 -79218
19380 -102429 -144172 -297897 -59234 11066 -158891 172794 -164250 27823 -69539 -25838 -142037
19369 -142037 -121306 -37937 -17373 -300307 -85697 244317 -87469 -185989 -9280 205322 100344
19357 -181619 -53777 -53079 88193 -116968 204722 59823 -366272 65808 131959 -75436 -137245
19346 -137245 -234286 -277874 32597 -41115 -149214 52513 -27005 112469 41338 -306195 166311
19334 219114 -46676 106644 48365 261213 394770 268487 117463 -213235 1931 201268
19324 201268 146280 -63841 1833 160829 -38841 95574 164933 133070 -190720 123514 -337445
19312 228196 -293413 -224760 -194336 262514 -258042 -195836 -329595 1985 -166670 -480846
19302d80846B38328a74094P6146E15407b88317A49078c12132j42395h5176j93520
19292b78696a14585n9494J5877d8628A35934O2907n7560i3295I8717d50524A20789
19280b05592a02429C7710c18655b5533i060r1365I4150e8328b4093k06000M6872
19269a83221d5867p4906J3245k46363D558c38959a05621A9150b40461f4285k68551
19258c32836A28088a87852k48G8879d9590A03987P8268D5922a05128j51667f9203
19246b49953A44092a16417I7743a64741b3307H7125G46O7369b53684M0755A97927
19234i8998B3187P0483M5992b73998a25016J8922H2178k7625k5480G877N7451
19223F5328b14013C3943c78331f8179E9968K18909a68350d7393k806b2216j36791
$$ plain form
19302 -480846 238328 -174094 -97948 515407 -288317 149078 -312132 -454527 -85176 -278696
19292 -278696 -114585 -174079 -158202 -48628 135934 198841 141281 -93295 98717 -450524 120789
19280 -205592 -102429 37710 -318655 -25533 -9060 -100425 94150 -58328 -24093 -230093 -183221
19269 -183221 -45867 -120773 -107528 -353891 4558 -338959 -105621 19150 -240461 -64285 -332836
19258 -332836 128088 -187852 -188100 78879 -49590 103987 182255 45922 -105128 -256795 -69203
19246 -249953 144092 -116417 97743 -164741 -23307 87125 746 68115 -253684 -212929 197927
19234 -98998 23187 93670 139662 -273998 -125016 -106094 82178 54553 29073 7877 65328
19223 65328 -214013 33943 -378331 -68179 59968 278877 -168350 -47393 -50199 -22216 -159007
19212a59007p5002B14346a4709r8318A40358B1202E547b45142a13661D2323b3898
19200A1385b32687B42065c2754j73973d2297B69059H1563a39295g299k35952A15164
19188C1081L9226a23656A84760a62741p3235A19301a12965D7838K18595a7618
19177c369I0347a66505j27543P3648c3417j06418j68017a5404l99259D5009a00335
19165b33472p9523e9067k5608n6248B24803H7458b57587J13653F6398J94349a92230
19153c22155h1083k2635K7874j7375j13077B03376a22247G5697a35120J5457k07243
19142c26906A26954J47904a69728I3134b81487l7998G703a42918B00199d02496
19131a9501k82963J14940j86350H4657A3264a99990Q4006a8392A68690P8121D1033
$$ plain form
19212 -159007 -234009 214346 -14709 -113027 140358 21202 5547 -245142 -113661 42323 -23898
19200 11385 -232687 242065 -32754 -206727 -42297 269059 81563 -139295 -7299 -243251 115164
19188 31081 70307 -123656 184760 -162741 -235976 119301 -112965 47838 266433 -17618
19177 -3369 90347 -166505 -294048 -220400 -33417 -139835 -307852 -15404 -414663 45009 -100335
19165 -233472 -312995 -59067 -84675 -140923 224803 87458 -257587 -143934 66398 260747 -192230
19153 -322155 -81083 -103718 -75844 -93219 -206296 203376 -122247 75697 -135120 -119663 -326906
19142 -326906 126954 274858 -169728 93134 -281487 -319485 7703 -142918 200199 -402496
19131 -19501 -302464 -187524 -373874 84657 13264 -199990 -115984 -18392 168690 246811 41033
19119A27112J87042a65935n1855n3692d7932J9751j8034D4282e6325k27000a39021
19107b6311j50931K9804D0587Q053L2267K50746a123j9670j90059o8261f9275
19095b1142k6812m0746k4578M9537K2667j90694g2327k70525A491f4794N422m4836
19083a04208I7905f0076k70396b8952c520k1500r8837K4299B56K25520d2267C3134
19070i3058e951q7116A17507a00433B4680R0691n2824C0258J43223f0711I8029
19058c35156A14329c0381G1920b81065N2097a02227p3574d8746A09145C9763c5092
19046d2680C24476e0927I0507M8241b86384M6500m8255a23124n6243M7325I0837
19034F8200j0441N25769A17324m2799o14K98918b55656a7944N21j39059G1565
$$ plain form
19119 127112 314154 -165935 -217790 -271482 -47932 -28181 -46215 44282 -56325 -283325 -139021
19107 -26311 -177242 -147438 40587 48640 80907 331653 -1123 -20793 -210852 -279113 -69275
19095 -21142 -47954 -88700 -113278 -63741 -41074 -231768 -72327 -342852 1491 -64794 -59372 -104208
19083 -104208 97905 -60076 -330472 -28952 -3520 -25020 -123857 -99558 256 225776 -42267 33134
19070 -93058 -5951 -93067 117507 -100433 24680 115371 62547 30258 173481 -60711 98029
19058 -335156 114329 -30381 71920 -281065 -228968 -102227 -175801 -48746 109145 39763 -35092
19046 -42680 324476 -50927 90507 138748 -286384 -239884 -288139 -123124 -179367 -132042 90837
19034 68200 57759 583528 117324 74525 73911 372829 -255656 -17944 -17423 -156482 71565
19022f1432C2069K27327b751k75001a17200A34392H421b37234h329n5253B17510
19010a95187P4292j78154H282c17273e1716o7773B52471b9512h844p9487r4471
18999a82802j26227F5538J29820c1101l33328a65662K6743j49801C11582E9789
18988g7350O161F5358a05807B0015a2134k2896j16095A902e3923p3039B67467
18976a02290k11771R9902c7925A3992L00622P684A44563a4572C3408d13411a56457
18964G5287L4601m3694J15997C637J77535a24963a9993C7023e57595b21179f684
18952b69770J8767O1418H4342l037b36482C4073a80240C61199g6366B90474I3912
18940C8397J31992a14143m05573F799b8353P366B06294i3786A54401E7173L1969
$$ plain form
19022 -61432 32069 259396 -2751 -277752 -117200 134392 8421 -237234 -8329 -63582 217510
19010 -195187 -120895 -299049 8282 -317273 -51716 -119489 252471 -29512 -8844 -88331 -182802
18999 -182802 -309029 65538 195358 -31101 -364429 -165662 -138919 -288720 311582 59789
18988 -77350 -71189 65358 -105807 20015 -12134 -35030 -151125 1902 -53923 -126962 267467
18976 -102290 -314061 -214159 -37925 13992 314614 322298 144563 -14572 33408 -413411 -156457
18964 75287 109888 66194 182191 3637 181172 -124963 -19993 37023 -557595 -221179 -6684
18952 -269770 -251003 -189585 84342 81305 -236482 34073 -180240 361199 -76366 290474 93912
18940 38397 170389 -114143 -519716 6799 -28353 -20987 206294 -93786 154401 57173 89142
18929H9142L7964N6544b12185I5699L6061m4942c88266I3360J17160a34827n4306
18918a89133r8693g2790P746D5527c0115I9718k8742b47761P3009j28939c4200
18906a5502C9118e1610B64290b14121A41883D1775f4882q7263r9184J24795A23094
18894a99175D008d5012F0761b17986a5213j09403B1567d16090a06026j23792i4627
18882h7324A61941P4005h4857L179c33r1598K9254B3136b11187O5218j0958A6130
18869B08752F1609a21943k41628B04092P7950a88614E2373K57675n8639f8548
18858d52483h6435j11182F6811c44525J43013G7181K9345a07077K6465J8985C6428
18846B52068a6760A44739O8460a45371j08542A20283J7722L3211q4280a25504
$$ plain form
18929 89142 127106 183650 -212185 95699 131760 86818 -388266 93360 210520 -134827 -189133
18918 -189133 -287826 -72790 -65044 45527 -30115 99718 70976 -247761 -174752 -303691 -34200
18906 -15502 39118 -51610 264290 -214121 141883 41775 -64882 -152145 -251329 -126534 123094
18894 -199175 4008 -45012 60761 -217986 -15213 -124616 21567 -416090 -106026 -229818 -94627
18882 -87324 161941 235946 -84857 -81678 -333 -91931 -62677 23136 -211187 -145969 -156927 16130
18869 208752 61609 -121943 -363571 204092 282042 -188614 52373 310048 251409 -68548
18858 -452483 -86435 -197617 66811 -344525 -201512 77181 106526 -107077 -80612 -61627 36428
18846 252068 -16760 144739 213199 -145371 -253913 120283 138005 171216 86936 -125504
18835b54345R1242A33012l4747a96851c7161H9607b8644k00354J8126E4318a73389
18823A17124K937j6252a30732A47984a31334B7878a61456H6701h8216C8014J40231
18812A78245a19428A14824J9005J82115m1162a91433B43224a5431A88454B0238
18801a94140j36795b7251k50620D6893j1321P6581Q9416g9956k89003d2847K0433
18790b2414k150l348o86839a34443j40585B18547g4863q5300j46378i2816a7104
18778A54545J03356a52786M965K7362J7847B01940B8269a46854F7098M162M44316
18767E15576b38226B0902a1379o2537k01642j17337a9078A09223a71679Q3882
18757h7797j14269B04817c24448a54045F8044a38324A03139a74295k20207c4435
$$ plain form
18835 -254345 -163103 133012 98265 -196851 -37161 89607 -28644 -228998 -210872 54318 -173389
18823 117124 120061 103809 -130732 147984 -131334 27878 -161456 86701 -88216 38014 178245
18812 178245 -119428 114824 133829 315944 274782 -191433 243224 -15431 188454 20238
18801 -194140 -330935 -27251 -277871 46893 35572 112153 201569 -79956 -368959 -42847 -22414
18790 -22414 -24564 -27912 -714751 -134443 -275028 218547 -74863 -160163 -306541 -92816 -17104
18778 154545 257901 -152786 -147821 -120459 -102612 201940 28269 -146854 67098 71260 515576
18767 515576 -238226 20902 -11379 -73916 -275558 -392895 -19078 109223 -171679 -87797
18757 -87797 -202066 204817 -324448 -154045 68044 -138324 103139 -174295 -394502 -34435
18746c08532C14368b66971a07311j33782L603c5371j4137C5693L3636c5716A51404
18734C74316f2025A49455b4672r4297m4707j51944F8235h6955k6969j2771o8326
18723a95021B5336b08738d1492k43509E2314O8567H756a0521A04963N2923a03695
18711F3459P399B4619g8881I3644K6537a18561j97501j37525h6462j45783A36046
18699G5738G262i2735o6627h578o9237K9759n06432A53686b48121a21211H8295
18687A97519J23447i3388j93519c669D3001M387j1280j7112o624J10707C6114
18675c34532N9908A9614J5494i2695A03574c8494j00875k68984B75107a58616
18664d1577n3982H1161c0984j45880A68688a12760j18177a15228k39007c656m7951
$$ plain form
18746 -308532 314368 -266971 -107311 -241093 -237490 -35371 -49508 35693 69329 -35716 151404
18734 374316 -62025 149455 -24672 -118969 -163676 -315620 68235 -86955 -113924 -126695 -195021
18723 -195021 25336 -208738 -41492 -285001 52314 120881 8756 -10521 104963 157886 -103695
18711 63459 70858 24619 -78881 93644 120181 -118561 -316062 -453587 -86462 -232245 136046
18699 75738 7262 -92735 -159362 -8578 -77815 -48056 -554488 153686 -248121 -121211 88295
18687 197519 320966 -93388 -286907 -3669 43001 47388 36108 18996 12372 123079 36114
18675 -334532 -274624 19614 35108 -92695 103574 -38494 -139369 -408353 275107 -158616
18664 -41577 -95559 81161 -30984 -176864 168688 -112760 -230937 -115228 -354235 -3656 -51607
18653e1607j00728E3231a312k34014A92979d6417j59964n215D0827b23559I7474
18641c6409l1952k5407A54863e149B52687j23864a1458k16275R2004M7425o9409
18630a57713n7608B3906P8317h0341q6696A62406D2219c6601L517k4191n5378
18619a12653A5180d4656A72124Q8150q8815a26119k45000A21520b99309p6316
18609c75625A12857A3188J84801d6445A30429F0148a11139K006k4658C60463f5759
18597A31830A9001J35347b655k72387B37048n7354p8351c87540a21894E4196a6409
18585A10819b48409F9320i0144p8902j77982O5099A58328e45552C0344f2465b8032
18573e2709C7252c69253A34192g7320e369k49068K2754f4264B92198b44726h0917
$$ plain form
18653 -51607 -152335 53231 -1312 -235326 192979 -46417 -206381 -211596 40827 -223559 97474
18641 -36409 -68361 -93768 154863 -5149 252687 128823 -11458 -227733 -135729 -88304 -157713
18630 -157713 -215321 23906 102223 -80341 -167037 162406 42219 -36601 -33084 -57275 -112653
18619 -112653 15180 -44656 172124 260274 171459 -126119 -371119 121520 -299309 -375625
18609 -375625 112857 13188 197989 -46445 130429 60148 -111139 -109133 -133791 360463 -65759
18597 131830 19001 154348 -2655 -275042 237048 179694 101343 -387540 -121894 54196 -16409
18585 110819 -248409 69320 -90144 -169046 -347028 -281929 158328 -545552 30344 -62465 -28032
18573 -52709 37252 -369253 134192 -77320 -5369 -254437 -231683 -64264 292198 -244726 -80917
18561a23038k29893b5675j7939G0909e60230J96028B6518b88474B3154h0660j72212
18550b52872H7063b23111O6676D4827A0914j280R8355j3937l5771d69350I9590
18538E6898b07942A0833a95742j3784g1698j32438I0761J02199f5479A72518a77575
18526b6699p6054D4777f6579j09358A75144A1608h1360q0130k94228a41040A43645
18514a95387i2180B12728g4586D352h3468r7323A31359f4823A47324E6749N7256
18503A14005j5458J23658r9504i0908j00558j24603d3451B5524R2978A9280d40482
18491a25330A44684f0274k29075L0433p730j72864J06218A20975a3126G4387b87469
18479A20183a74606O990O9455A68840h5744j81388e0356j58613H8114a10423r5278
$$ plain form
18561 -123038 -352931 -25675 -43614 70909 -560230 -364202 26518 -288474 23154 -80660 -252872
18550 -252872 87063 -223111 -156435 44827 10914 9634 107989 94052 58281 -469350 99590
18538 56898 -207942 10833 -195742 -209526 -71698 -204136 90761 192960 -65479 172518 -177575
18526 -26699 -102753 44777 -66579 -175937 175144 11608 -81360 -161490 -455718 -141040 143645
18514 -195387 -92180 212728 -74586 4352 -83468 -180791 131359 -64823 147324 56749 114005
18503 114005 98547 222205 122701 -90908 -191466 -316069 -43451 25524 118502 19280 -440482
18491 -125330 144684 -60274 -289349 -258916 -266646 -439510 -333292 120975 -13126 74387 -287469
18479 120183 -174606 -167616 -98161 168840 -85744 -267132 -50356 -208969 88114 -110423 -205701
18468b05701a3938C15001A09522a17278M729k9116o9460B7554M27093c0236G2898
18456B13042a76805g3500A72592c02345D9072a61832j64946J32355B6656b97042
18445a31245A11993a61495l7598c3428B1619J68731a54529D7170a98998j02467
18435c01465e6370D9835I799Q1841c28778B71887c43730D00787a61303j76005
18425c37308a04508A44231c5457o9441j50564B33732g3025o1756j24116p7033
18415c35930A44017K440i0073j99400I322c03790a49229N8446o4720D0778a43407
18403c8674j85997k91362a16246k45229h3632j52159B41148b38132F3756a94724
18392e4760A2909R0959a95003B35606f8071E4129O1896B7273a97185L5498A31930
$$ plain form
18468 -205701 -13938 315001 109522 -117278 -112549 -141665 -211125 27554 454647 -30236 72898
18456 213042 -176805 -73500 172592 -302345 49072 -161832 -326778 -194423 26656 -297042
18445 -131245 111993 -161495 -199093 -33428 21619 190350 -154529 47170 -198998 -301465
18435 -301465 -56370 49835 9799 91640 -328778 271887 -343730 400787 -161303 -337308
18425 -337308 -104508 144231 -35457 -104898 -255462 233732 -73025 -134781 -258897 -335930
18415 -335930 144017 146457 -90073 -289473 9322 -303790 -149229 -90783 -155503 40778 -143407
18403 -38674 -224671 -516033 -116246 -361475 -83632 -235791 241148 -238132 63756 -194724
18392 -54760 12909 103868 -195003 235606 -68071 54129 116025 27273 -197185 -161687 131930
18380G9740b34940B4612A1978c7259a7793A75677d82717d4019p6773B0252d43209
18368b1517o1543B39027r9986p892J33216C2703d0042q6247j37250f1831E359
18356b29007j22020e7114q977G2829B9756b62256A2586N829a36882j21959A72038
18344a19364p8802N6051K7695D110b6911G8645M5180c4832k55692a02829p724
18333a10553N3462F4747a20344m9719l2593A09170d8125a7951E3287i3026B03327
18321b97136j43935g3760H1618h5790A82741a65746O3407D4457a77105e5682A03073
18309f1951p3471j95458D8244J12030a76115I7442f5894A15227a5995B78097o0682
18298B17415f1508A82430f5702p2479E519d2614q6561A19849l817i1476n9464
$$ plain form
18380 79740 -234940 24612 11978 -37259 -17793 175677 -482717 -44019 -120792 20252 -443209
18368 -21517 -83060 239027 139041 131149 264365 32703 -40042 -126289 -263539 -61831 5359
18356 -229007 -351027 -57114 -66091 72829 29756 -262256 12586 18415 -136882 -258841 172038
18344 -119364 -198166 -142115 -114420 4110 -26911 78645 123825 -34832 -290524 -102829 -110553
18333 -110553 -57091 64747 -120344 -170063 -202656 109170 -48125 -17951 53287 -93026 203327
18321 -297136 -441071 -73760 81618 -85790 182741 -165746 -102339 44457 -177105 -55682 103073
18309 -61951 -135422 -330880 48244 160274 -176115 97442 -65894 115227 -15995 278097 217415
18298 217415 -61508 182430 -65702 -138181 5519 -42614 -129175 119849 116032 -91476 -150940
18287a50940J2297j30307P7351H0529i9237n5406C13845K4008k0636f3601D7971
18275b03624j06954a05699D16509d4208k182q3909e111k65481f3290j98678k2978
18264b84946B57780c387o2948A80328b79761j48824a82140n9754A12293e6035
18253E3761c09949d1333A98414a46752j11914l0383m017E7520h3782C67734i6988
18241A48172c32947f8341a4151k82655A14454q706a09830D4251C794a57464B62536
18229a21451A76148e90j68186A20514b83637A104f6322A71288F8115b83141J38497
18218a44644I4340A9869L8321R0931a14343C5511c27763R3854C3064h7471B8215
18206A23913a88570h5820l1912B09105b0725j02440B14248E4525b71855f7416
$$ plain form
18287 -150940 -138643 -268950 -191599 80529 -99237 -154643 313845 337853 317217 -63601 47971
18275 -203624 -310578 -105699 416509 -44208 -46390 -130299 -5111 -270592 -63290 -261968 -284946
18264 -284946 257780 -3387 -66335 180328 -279761 -428585 -182140 -241894 112293 -56035
18253 53761 -309949 -41333 198414 -146752 -258666 -289049 -293066 57520 -83782 367734 -96988
18241 148172 -332947 -68341 -14151 -296806 114454 105748 -109830 44251 3794 -157464 262536
18229 -121451 176148 -590 -168776 120514 -283637 1104 -66322 171288 68115 -283141 -144644
18218 -144644 94340 19869 58190 149121 -114343 35511 -327763 -233909 33064 -87471 28215
18206 123913 -188570 -85820 -117732 209105 -20725 -123165 214248 54525 -271855 -67416
18195B14566a31329b993A95560a20237M3485L4937J2288H1320c36438a35890A31084
18183g695H5113b2004k23105A53451m5786b33630f163k01389b9982C17119a13073
18171a41777o0458b8611j42728f4279j25229a9442j67660b6068o8007D3732J1290
18160E5022A9949Q7866b65040R1363A0830f8815C3287c83687a07334A40108l028
18149A37080J55898b04576k0004a0968k65646k0002O4956h0913E0755a28860B13350
18137a47792c0885q881B9558b44673E4617q01c74705a80402E4239J81317a90466
18125b52599C9509b1559k3850B72894A15437j1372A988M9446d1438C25940c01672
18113D9133a73358l3150B28084c23157a06980l1441j47924b6396j93190A80670
$$ plain form
18195 214566 -131329 -2993 195560 -120237 -76752 -41815 -29527 81320 -336438 -135890 131084
18183 -7695 85113 -22004 -245109 153451 107665 -233630 -6163 -207552 -29982 317119 -113073
18171 -141777 -202235 -28611 -171339 -64279 -189508 -19442 -187102 -26068 -94075 43732 55022
18160 55022 19949 107815 -265040 -173677 10830 -68815 33287 -383687 -107334 140108 137080
18149 137080 292978 -204576 -224580 -10968 -276614 -296616 -231660 -80913 50755 -128860 213350
18137 -147792 -30885 -39766 29558 -244673 54617 53816 -374705 -180402 54239 235556 -190466
18125 -252599 39509 -21559 -45409 272894 115437 104065 1988 51434 -41438 325940 -301672
18113 49133 -173358 -206508 228084 -323157 -106980 -138421 -286345 -26396 -219586 180670
18102a35743l8772n70B60932F3330j1076d8709k96452D1474J79844a38629j02663
18091b41292P9087e7248a6996o2723l1837H0923B3710a22238A6962a04479j20964
18080b25443P7746H2937b72535A61273f4851A66515f5941G2223a72496L8804C39901
18068c9720j83469A2305L35000i3708B34436d582A11681o919g3824B964b16462
18056B68605a23613b219A95535H8835a96381B769K66329A33871d42651A74168
18045h3132c5439l82263J80421G1001b08630F0726R0948C5468a77633b8836j51921
18034a80757Q1033f819H5707a12090A34353n5425a02577A6774J35654o1014b49406
18022F1360b00437R2728D6003J34905D2664J67240G4963a45709k6909e6308F3559
$$ plain form
18102 -135743 -174515 -175085 260932 63330 52254 -48709 -345161 41474 221318 -138629 -241292
18091 -241292 -162205 -57248 -16996 -79719 -111556 80923 23710 -122238 16962 -104479 -225443
18080 -225443 -147697 82937 -272535 161273 -64851 166515 -65941 72223 -172496 -133692 339901
18068 -39720 -223189 12305 347305 -93708 234436 -4582 111681 104762 -73824 2964 -216462
18056 268605 -123613 -2219 195535 88835 -196381 2769 269098 133871 -442651 174168
18045 -83132 -35439 -417702 -237281 71001 -208630 60726 151674 35468 -177633 -28836 -180757
18034 -180757 -99724 -6819 85707 -112090 134353 78928 -102577 16774 152428 91414 -249406
18022 61360 -200437 -107709 46003 180908 42664 209904 74963 -145709 -172618 -56308 63559
18010G6515H5d5963j54368A74011a79528B03917q0467b31110P0079A20515d79362
17998B07433J50457G6357f851B02818g2932j07740F2330K48056c3053A26919O985
17987A33904J44247a11912E7585A5352a76376j61896g1514C23879C3129J30184
17977A63313a83034k66100b24474C07337b49674H3215a85303q8569a30667k18595
17967c49262a19721m55598B0891Q8723b5485A22702j5250L6162a9565B2012a25837
17955b37675D6166a61612g2324k64541j5957M4997a52682G8933b6765H6755P4611
17944A61366R8182c7190j15043B33910a73160C18508A05126j3368j9965p082a61793
17932a08790A84549a07502e0264j99246J71A66724b69557b150m558A87205b02252
$$ plain form
18010 76515 85 -45963 -200331 174011 -179528 203917 123450 -231110 -161031 120515 -479362
17998 207433 357890 76357 -6851 202818 -72932 -180672 62330 310386 -33053 126919 133904
17987 133904 278151 -111912 57585 15352 -176376 -338272 -71514 323879 33129 163313
17977 163313 -183034 -449134 -224474 307337 -249674 83215 -185303 -273872 -130667 -349262
17967 -349262 -119721 -575319 20891 109614 -25485 122702 107452 143614 -19565 22012 -125837
17955 -237675 46166 -161612 -72324 -336865 -352822 -307825 -152682 78933 -26765 86755 161366
17944 161366 259548 -37190 -152233 233910 -173160 318508 105126 91758 71793 64711 -161793
17932 -108790 184549 -107502 -50264 -249510 -249339 166724 -269557 -2150 -6708 187205 -202252
17920b00974a8545j69016b9258o4208A05889a11999q6011A68139n8686m4328O4419
17909A29544a78746A80040K1360c20476a2457G1107g3647j80530j2025B56884
17898B10572i600A12449c12063A13272e32776B07406a54034b1820l9395B88711
17887A93950a48268a9038A37921b276k75578A35111a42558A01444b14586R5599
17877a18987k10032B2528i2482b9079N011l46822A37730a8189F0928k8200j0087
17866B2641J4607L12272b71616b330o01D46680A15158b14110e8354B23987B7789
17854A40546F5161g0663k4798d7211A54898a85270H23J61076C050L9237j5935
17843B6352a97168I2135B3509d8521H7378b90942a08570A16133A0955J85242c3072
$$ plain form
17920 -200974 -18545 -187561 -29258 -93466 105889 -111999 -198010 168139 109453 65125 129544
17909 129544 -178746 180040 201400 -320476 -12457 71107 -73647 -254177 -266202 256884
17898 210572 -9600 112449 -312063 113272 -532776 207406 -154034 -21820 -61215 288711
17887 193950 -148268 -19038 137921 -2276 -277854 135111 -142558 101444 -214586 -118987
17877 -118987 -329019 22528 -92482 -29079 -24068 -370890 137730 -18189 60928 32728 22641
17866 22641 37248 349520 -271616 -2330 -2931 446680 115158 -214110 -58354 223987 27789
17854 140546 65161 -70663 -95461 -47211 154898 -185270 823 161899 3050 42287 26352
17843 26352 -197168 92135 23509 -48521 87378 -290942 -108570 116133 10955 196197 -33072
17831a22729F088N5505g1695A38674b5604A01963a41689A61435b9175k71617M4683
17820b56109J08168E3044L5905g0825p2673q5237G8131a36894b2367G9293J47363
17809B26656I7547K61852E0111O0691l3194g6530F9469A8458J11646i4562C3801
17797F4954a32974C8517J6933M0756l7543L4360a3152r0645n8202L7206A44802
17785D23359b3870B03892a22199K9972K660B2165a72871E3190K03457b3461k24933
17774b48394a2872o6523A77945a82724M6842j0538f5482G1420K90583D8678a38217
17762A94465G2707d65372m9434a69260M4773j94716C85331I3023b82501N9658
17752b22843C38239j17145f7514A86406b43643A9633b5031k90171h9174a7388
$$ plain form
17831 -122729 6088 61593 -71695 138674 -25604 101963 -141689 161435 -29175 -300792 -256109
17820 -256109 -147941 53044 88949 -70825 -143498 -228735 78131 -136894 -22367 79293 226656
17809 226656 97547 359399 50111 110802 77608 -76530 69469 18458 130104 -94562 33801
17797 64954 -132974 38517 55450 96206 58663 93023 -13152 -103797 -161999 -124793 144802
17785 423359 -23870 203892 -122199 -92227 -89567 22165 -172871 53190 256647 -23461 -248394
17774 -248394 -12872 -79395 177945 -182724 -135882 -146420 -65482 71420 362003 48678 -138217
17762 194465 72707 -465372 -514806 -169260 -124487 -319203 385331 93023 -282501 -222843
17752 -222843 338239 221094 -67514 186406 -243643 19633 -25031 -315202 -89174 -17388
17741b8154j80823j20033J44268A9961K89502a66262C04789a11027e2656J9596
17731c3060p986n69429h1472K6100A12027J71861j24179Q3432H9994b65310N4912
17720b10398M0028A09743a65538f5007B00663A1691a48000G850O6243e8650B25825
17708a40826C77886E1759a07191A54343A9516f6251h833A81989a682n3418a9404
17696A21667k6316k9363Q3481c8681E5015b14768B11174B1397f9376H8308b0740
17684a75241A99001a18035A04334j8544c3746B70888b8284O157m28911E3114G314
17672A70659D0541L1566d865E9398K6000c36507D7247R4307a04608q85A13792
17660a30955p1192A2028K2952A1632a73509C54161H4302J59206a37887j27627
$$ plain form
17741 -28154 -208977 -329010 -184742 19961 309463 -166262 304789 -111027 -52656 -33060
17731 -33060 -41046 -610475 -81472 -55372 112027 283888 159709 243141 89994 -265310 -210398
17720 -210398 -170370 109743 -165538 -65007 200663 11691 -148000 7850 74093 -58650 225825
17708 -140826 377886 51759 -107191 154343 19516 -66251 -8833 181989 -1682 -55100 -19404
17696 121667 95351 65988 149469 -38681 55015 -214768 211174 21397 -69376 88308 -20740
17684 -175241 199001 -118035 104334 85790 -33746 270888 -28284 -22127 -451038 53114 7314
17672 170659 40541 72107 -4865 59398 85398 -336507 47247 141554 -104608 -105493 113792
17660 -130955 -202147 12028 34980 11632 -173509 354161 84302 243508 -137887 -265514
17650b65514A13509c22536J56841d2494j08047B61387H9760J06915G4970b263
17639G7708A1428g8858A30879a62272M9853K1744G5000C4176c6878H3741q309
17628G5432b10925A62835G7466k6676f4725q8276f6509a9843A46220M365J7112
17617A67697L4730I9359M3314D0793d12139B48025c5769a687D8082n567a57015
17605b12868B54024p0580a12486A599K35394a16418K7787A87046o5423C0595K77474
17594C08069h0485j03010A48172o5022J59051e3390A57649o3623b8114l6483A79012
17582a4060m23792G6587k4125a822B41339i4684j57966a10341A85069C2061a48195
17570C74244a13310B19702B9455N1747K53663j25228a32901A0839c08721g1196
$$ plain form
17650 -265514 113509 -322536 -165695 -42494 -150541 261387 89760 196675 74970 -2263
17639 77708 11428 -78858 130879 -162272 -112419 -90675 75000 34176 -36878 83741 75432
17628 75432 -210925 162835 77466 50790 -64725 -153001 -66509 -19843 146220 150585 167697
17617 167697 202427 99359 142673 40793 -412139 248025 -35769 -1687 48082 42515 -157015
17605 -212868 254024 183444 -112486 1599 236993 -116418 -88631 187046 121623 30595 308069
17594 308069 -80485 -183495 148172 83150 242201 -53390 157649 94026 -28114 -64597 179012
17582 -14060 -437852 76587 52462 -1822 241339 -94684 -252650 -110341 185069 32061 -148195
17570 374244 -113310 219702 29455 81202 334865 209637 -132901 10839 -308721 -71196
17559A11929a29737d4689k09862e124k39653C09393A38901F5839a16305j08405
17549b24710l0157H8517a07347B19820d5280C67794a07801B5380K5103J80830
17539B31313a18225B2316d608A75085b9482G4853a2046I3600L74351i9173A98845
17527B72094D8577a4E1520q953P5055J26038a8838k8245B53619e5482H6782a49154
17514A8274a3797k099A30260m1146a96187A61841J73077A38206e9780C00140b5651
17502G4643c15957B91415E2776K66200j15369I9977M8761b71151G6401b166k02806
17491b04972E8020J35742K16091A3998M255L0674B3359c22603g1852K9177C14082
17479B37841I6217B5457L4228J04519p0278d597E3849K85365j17433D8683N0778
$$ plain form
17559 111929 -129737 -44689 -254551 -5124 -244777 309393 138901 65839 -116305 -224710
17549 -224710 -254867 88517 -107347 219820 -45280 367794 -107801 25380 50483 231313
17539 231313 -118225 22316 -4608 175085 -29482 74853 -12046 93600 467951 -99173 198845
17527 272094 48577 -14 51520 42567 117622 243660 -18838 -47083 253619 -55482 86782 -149154
17514 18274 -13797 -15896 130260 89114 -196187 161841 334918 138206 -59780 300140 -25651
17502 74643 -315957 291415 52776 318976 203607 99977 148738 -271151 76401 -2166 -204972
17491 -204972 58020 193762 409853 13998 18253 48927 23359 -322603 -71852 -42675 314082
17479 237841 96217 25457 59685 164204 93926 -4597 53849 339214 221781 48683 99461
17468I9461K77158A0210K48967D3363j4713J77824r2071e6760A26837a67144A65811
17456E0498b05510R9373D5964J63392L19316H01J66653C9776J29043J35179A21936
17444F48994k34347j25971J5658K266n1374E1972N79211k89812k3031J47789A74857
17432H9439J56405P2654j33137k1520j8813J6293K90286A10080J32232L24530
17422E66842a94930D32068J77898B52468J08029K91323B1512b0027B56202n7971
17412A98231J46430a53309f0214N083l6100A04201e7978B32479C1468a84320B50797
17400D96244b18742A77281E9832L4348f4459B9303a18943A80600j9894J76884
17390C37590b76019B23217c5486C66312F0184k900M81937g6477B64999I5725b2338
$$ plain form
17468 99461 376619 10210 259177 43363 28650 206474 114403 -56760 126837 -167144 165811
17456 50498 -205510 -106137 45964 209356 528672 801 167454 39776 168819 303998 121936
17444 648994 414647 288676 304334 306600 255226 51972 631183 341371 318340 466129 174857
17432 89439 245844 318498 185361 163841 145028 161321 451607 110080 242312 566842
17422 566842 -194930 432068 609966 252468 360497 651820 21512 -20027 256202 198231
17412 198231 344661 -153309 -60214 -55131 -91231 104201 -57978 232479 31468 -184320 250797
17400 496244 -218742 177281 59832 94180 -64459 29303 -118943 180600 160706 337590
17390 337590 -276019 223217 -35486 366312 60184 57284 539221 -76477 264999 95725 -22338
17378C3728O4178b7487B40567J62230A32014b4289A5687M9591J78640J76621A10980
17366D95855A39202c39550J54663A73328J93067a2337C14368b4030A82490l4811
17356A47679B3866L09784j60617R212h4506B06404d7234E97093I5246c03555C37601
17344A44444F5688k7833J63830J95846I6006J26813j10047i41j25394A06793b01175
17332A46435d8194C96808l6646B1855K02856F5493B4878J9600b28570a4180A16276
17320B28710G9933K6776K15938q1692j19059J0081J11002A06543B4354J84053
17310B08407J01018A21335J8133B421K7816Q6265m1082R4029G419K02919r3235
17299A17103O8314a1672E9230Q1219b2688B60633a44339c054A57033J71754A46055
$$ plain form
17378 33728 97906 -27487 240567 402797 132014 -24289 15687 65278 243918 420539 110980
17366 495855 139202 -339550 -184887 173328 366395 -12337 314368 -24030 182490 147679
17356 147679 23866 333650 173033 182245 -84506 206404 -47234 597093 95246 -303555 337601
17344 144444 65688 37855 201685 397531 96006 222819 112772 -941 -126335 106793 -201175
17332 146435 -48194 396808 360162 21855 224711 65493 24878 44478 -228570 -14180 116276
17320 228710 79933 106709 322647 240955 121896 131977 242979 106543 24354 208407
17310 208407 309425 121335 139468 2421 30237 116502 75420 169449 7419 210338 117103
17299 117103 185417 -11672 59230 140449 -22688 260633 -144339 -3054 157033 328787 146055
17287a31319A57260N2944h5187I3275K34466n5495H2009K915K76754J02941A04063
17275e1132D19595j21850a45287B39414M9536A39657J97357a11762B7278N72822
17265F00100A3727O9347B3444J62030L1234a0688A26308J50888J24881p8130J36004
17254D59951R4906k60181n8235K81333A90439g9049C13014K62072E8690K22628
17244B81318G7636J17220f2571A33926n772P9363J33442r1122j0115J49665k7308
17233C62079A24344Q2825G5329k7227L41077j18366C1312k279J81681D3452K59045
17222C02497J51269A397J52500Q3575o1661K17320N890N8461A46547K75289j84854
17211B36982D6823R0429A5254K11638q4803f7939B45361q3094K46291j16617J29876
$$ plain form
17287 -131319 157260 210204 -85187 93275 327741 272246 82009 84924 361678 464619 104063
17275 -51132 419595 297745 -145287 239414 288950 139657 337014 -111762 27278 600100
17265 600100 13727 83074 23444 185474 216708 -10688 126308 277196 402077 323947 459951
17254 459951 554857 294676 236441 517774 190439 -79049 313014 575086 58690 281318
17244 281318 77636 194856 -62571 133926 128154 207517 340959 249837 239722 389387 362079
17233 362079 124344 207169 75329 48102 389179 270813 31312 29033 210714 43452 302497
17222 302497 453766 1397 153897 237472 175811 393131 399021 457482 146547 421836 236982
17211 236982 46823 137252 15254 226892 142089 -67939 245361 162267 408558 291941 421817
17200D21817F4158a17277a462A12285K10884A1861L82111A08697K92556A84059
17189C55106j49098J67719J29907I1153Q9852Q5659J03671q7932J43967f3320
17178B91721p1488d4008D24305Q8305o4576d1508E08356k38760j03545l7227K71515
17167D00339A92938i43A82366G2345N58O9648D6161a73400E14981E7560K51058
17156C08618I5653N42096e8102I5569M10232A73470j8813J17768M5552j25217
17146A92760L8222F9027K08820J18401O4881A20012M16676B35626J06823M8562
17136C91011j68116D0647L37020h607B89423j0976o6836R0459P6649n0790L1773
17125C59702O4136k11165R6109K49915j56690N5762N6736k26928A31359Q1961
$$ plain form
17200 421817 64158 -117277 -1462 112285 323169 11861 393972 108697 401253 184059
17189 355106 206008 373727 503634 91153 181005 266664 370335 282403 426370 -63320
17178 291721 220233 -44008 424305 512610 448034 -41508 508356 269596 166051 128824 400339
17167 400339 192938 -943 182366 72345 72903 142551 46161 -173400 514981 57560 308618
17156 308618 95653 637749 -58102 95569 505801 173470 154657 272425 317977 192760
17146 192760 230982 69027 277847 396248 461129 120012 536688 235626 342449 391011
17136 391011 222895 40647 377667 -8607 289423 278447 211611 302070 378719 327929 359702
17125 359702 423838 212673 308782 558697 402007 457769 514505 287577 131359 213320
17115B13320K00101Q1400p9929m5160j49444k6712K33645M9864A89640K20421
17105D10061J77145B83536p5355j207J50547L8239j1500j8832N6900J29309B46880
17093D38498J8734n7474j06889P9993Q5069n4452A13189M25735g0615F21744k18957
17082D02787F3139M27947j20475q0812j9503J34546L05154j15614j53146j4347
17072D26889j15705L2602Q4118Q975K07907j29996J12637C06149J55057A5727
17061E78663j74766m8365P0767J63300O4087j8144J187l10478q4879L09422J3253
17050E64047j16945R1026A73197K84957L77971l81589K93702l31387R4665R4357
17040F05873k29601O159R5457J17942q5304K8782B18880O35350k18823k59191
$$ plain form
17115 213320 413421 494821 414892 369732 220288 193576 427221 477085 189640 410061
17105 410061 587206 283536 208181 206974 357521 395760 384260 365428 422328 551637 246880
17093 438498 457232 399758 292869 372862 457931 403479 113189 538924 -70615 621744 402787
17082 402787 63139 491086 370611 289799 270296 404842 709996 594382 441236 426889
17072 426889 311184 343786 427904 436879 644786 514790 627427 306149 461206 15727
17061 578663 403897 355532 426299 589599 653686 635542 636729 326251 241372 550794 564047
17050 564047 447102 538128 173197 458154 836125 454536 748238 416851 511516 605873
17040 605873 376272 382431 477888 595830 510526 539308 218880 854230 635407 376216
17030C76216J70017n1941k17886J42204N459K86305O2331k76619K98612C07393
17019E22356J93164L2108j36703p7639K89358k70642o7334P1502K06766K77589
17009A040525j71587m05438M4509l7732M88258D10091M13019l532j95857j25083
16999D98638L47087k42677p699j92881O0411j14594N15104n3795K45921n19003
16989E36512K0829L1510L35370k68972j46119J97878M027j290K08439j5694J61295
16978A063785l50508K7703q9907N099J98190P042J40907l80359O8895K47352j27816
16967H10383l38343K39073J53508j77776K44630k99320N130O99181k75946j68318
16957H92202M9603L32206l51544R7400J90704l19112K45930j57117k41975M71004
$$ plain form
17030 376216 546233 494292 276406 418610 424069 710374 772705 496086 794698 307393
17019 522356 715520 747628 610925 533286 822644 552002 484668 556170 762936 1040525
17009 1040525 868938 463500 508009 470277 958535 410091 823110 819578 623721 498638
16999 498638 845725 603048 595349 402468 462879 348285 863389 809594 1055515 536512
16989 536512 557341 588851 924221 655249 509130 707008 711035 709745 918184 902490 1063785
16978 1063785 713277 740980 651073 656172 854362 861404 1002311 621952 690847 938199 810383
16967 810383 472040 711113 864621 686845 931475 632155 637285 1336466 1060520 892202
16957 892202 941805 1274011 922467 1019867 1210571 891459 1137389 980272 738297 1209301
16947A209301p0277m32800L26474L582L06564m37402M56905F56814M74532K03596
16937A334942j16296J6174N0650j23067l76557N41874j18516j21508J4144o6707
16927A035133O3669J45063k00236M37482k96428j03121M77577l58797J54242q5422
16917A269162l00628J71126K15173M09854l44673K45247j30220l13626N04007
16908A725422L5488k43092M3871k87966j11162M42544N7533j84360L4676J75763
16898A688717j68934k94399N85720p385n8695p3215J65370m72730M35857n9057
16888A741249L52921k29957J08998j54011K37701j9246k57138J62638O6842J7079
16878B027076l09247M30485j26716J32662N4333j73232J20399j18605K53631m0057
$$ plain form
16947 1209301 1139024 706224 1032698 1036280 1342844 905442 1362347 656814 1131346 1334942
16937 1334942 1218646 1234820 1285470 1162403 785846 1327720 1209204 1087696 1101840 1035133
16927 1035133 1098802 1243865 1043629 1481111 1184683 1081562 1559139 1200342 1354584 1269162
16917 1269162 968534 1139660 1354833 1764687 1420014 1665261 1535041 1221415 1725422
16908 1725422 1760910 1517818 1561689 1273723 1162561 1605105 1662638 1478278 1512954 1688717
16898 1688717 1519783 1225384 1811104 1803719 1745024 1671809 1837179 1364449 1800306 1741249
16888 1741249 2094170 1864213 1973211 1819200 2056901 2037655 1780517 1943155 2009997 2027076
16878 2027076 1717829 2148314 2021598 2154260 2208593 2035361 2155760 2037155 2290786 2250729
16868B250729J4561j49455J96924M0385J64108l49216Q9501J13295M7088p2876
16858B345044J64041L48272l18172J15221P8196K93966m2446o36532N73118k01264
16848B719444J39284M5167K35922k05388j14676N68989j06643M57121q27821Q8598
16838B999997N39316j65718M42845Q1690m44802K17777J65384k02400R6969L27926
16828D058984j00702k22019M61634N20664l16181J5372J88560N8549j05374j09097
16818D450390N41666J7422o1760L09980l60445K16601r4180L89387K10010k1386
16808E597685L10526K09453j69639K17954k16039M96562K96270J10294J2749L5801
16798F901616j52724M55403m6722N85824L09044K12978m04428N31270M67925j18024
$$ plain form
16868 2250729 2265290 2115835 2312759 2353144 2517252 2168036 2257537 2370832 2417920 2345044
16858 2345044 2509085 2857357 2539185 2654406 2732602 3026568 2984122 2347590 2920708 2719444
16848 2719444 2858728 2903895 3139817 2934429 2819753 3388742 3282099 3739220 2911399 2999997
16838 2999997 3539313 3373595 3816440 3898130 3453328 3671105 3836489 3634089 3731058 4058984
16828 4058984 3958282 3736263 4197897 4718561 4402380 4417752 4606312 4664861 4559487 4450390
16818 4450390 4992056 5009478 4947718 5257698 4897253 5113854 5019674 5409061 5619071 5597685
16808 5597685 5908211 6117664 5948025 6165979 5949940 6446502 6742772 6853066 6865815 6901616
16798 6901616 6748892 7204295 7157573 7743397 8052441 8265419 7860991 8392261 8860186 8742162
16788H742162N24116J75695J59598J05807J78591O00598L46801M67016m6145M83579
16778A1737818J94916R9808P56370M8227L89431O95238M15307L20932P27016K44763
16768A5629826J73543R12238N58009O71973O79429N77963P35499R69612N59632
16759B1467724J029824O08578J177262Q88147J149378Q96395J558599J491744
16751C0267651R44216J450982J967512J666004J306780K392031K114352K046219
16743D4155747K546311K098726K957483K834745L179089L464302L468574L864794
16735F8569771M205769M615753M928847M717948N671605N832521O386001O327989
16727A11256204O850296P262150P840480P659731P874554P298348Q054661P166076
$$ plain form
16788 8742162 9266278 9441973 9601571 9707378 9885969 10486567 10833368 11300384 11254239 11737818
16778 11737818 11932734 12032542 12788912 12837139 13226570 13921808 14337115 14658047 15385063 15629826
16768 15629826 15803369 16715607 17273616 17945589 18625018 19202981 19938480 20908092 21467724
16759 21467724 22497548 23106126 24283388 25171535 26320913 27217308 28775907 30267651
16751 30267651 31211867 32662849 34630361 36296365 37603145 39995176 42109528 44155747
16743 44155747 46702058 48800784 51758267 54593012 57772101 61236403 64704977 68569771
16735 68569771 72775540 77391293 82320140 87038088 92709693 98542214 104928215 111256204
16727 111256204 118106500 125368650 133209130 140868861 148743415 156041763 164096424 171262500
16719A71262500O521615N923370M583214L637153K055450L63322o46232k492810
16711A91207582l574263n383053o059031o668196p754602q220856q373322q121477
16703A37052782p554343q376640p064040p098838p177037o359822n821417n447111
16695H2153534n504015m539591m600734m369940l652836l325061l244128l173091
16687D9744138l242374k191111k443977k196296k132567j852633k023029j864097
16679C1798054j264969j582379r32031j562097j218954r10259j224536r69734
16671B2133095j052326p59242o03993r88311r51460m07712q38557j99888q03680
16662A5527926r35920j56821p57113o76746j03839l72891j77887p49257j86348
$$ plain form
16719 171262500 177784115 183707485 188290699 191927852 193983302 194346624 193700392 191207582
16711 191207582 187633319 182250266 176191235 169523039 161768437 153547581 145174259 137052782
16703 137052782 129498439 121121799 114057759 106958921 99781884 93422062 87600645 82153534
16695 82153534 76649519 72109928 67509194 63139254 59486418 56161357 52917229 49744138
16687 49744138 46501764 44310653 41866676 39670380 37537813 35685180 33662151 31798054
16679 31798054 30533085 28950706 28018675 26456578 25237624 24327365 23102829 22133095
16671 22133095 21080769 20321527 19717534 18729223 17777763 17370051 16531494 16331606 15527926
16662 15527926 14592006 14435185 13678072 13001326 12897487 12524596 12346709 11597452 11411104
16653A1411104m57531o81253j28847j00435o16723m18503M3173k93044l19044
16644H438897l19415N1640l36322j70947n1825l41908m13010r5687j6095k50323
16634F495005p3061n57428j05821Q5600j39823n26581J72266m5852k27657k51131
16624D825517L80569k94077m31185J90542m42290K96757l16309M2204l25284N7424
16614C983868j39069m1607m4083q9629p9384J63487m04744L4651L14682n77258
16604C120914N2439J1356j77531L38441n97431L34091p8658l21791K56406l48633
16594B589603L9751L00151j40819k22499j29806l19743L93527k64843L89731l86357
16584B248696j71492o2883K97286l97028J9654o4353K33606j28472k65690O24197
$$ plain form
16653 11411104 10953573 10272320 10143473 10043038 9426315 9007812 9050985 8757941 8438897
16644 8438897 8119482 8171122 7834800 7663853 7612028 7270120 6857110 6761423 6745328 6495005
16634 6495005 6421944 5864516 5758695 5844295 5704472 5177891 5350157 5304305 5076648 4825517
16624 4825517 5206086 4912009 4480824 4671366 4229076 4525833 4209524 4251728 3926444 3983868
16614 3983868 3844799 3803192 3759109 3669480 3590096 3753583 3348839 3383490 3698172 3120914
16604 3120914 3173353 3184709 3007178 3345619 2748188 3082279 3003621 2681830 2938236 2589603
16594 2589603 2629354 2929505 2788686 2566187 2436381 2116638 2510165 2245322 2635053 2248696
16584 2248696 2077204 2014321 2311607 1914579 1934233 1869880 2103486 1975014 1709324 2333521
16574B333521j13676n81094K0085J07835m0433L8237J97809l60539L67447k82078
16564A687114L2961j54534k16370J80997k41159J5812L67946m30743L84127k17578
16554A408573J9060Q1088m23649K99410l5885k20679R9775K05624j10124k31840
16544A091353L8943K17706j34540K36878l40732j76639M6350L8731o5426k45358
16534G07266M96315l22015K43536l78179M35606l44840J05665p8738K02935q6108
16524I81443K6083j09258n5062J2221R2689N5056K035J44482m50287L30384m08533
16513F21253M42261O3941j58493j49072J04041J16876l24282L07496l32846K60102
16503I51277p1672l75013K40542m5108l45548J69680P7020r3304K19407L5083
$$ plain form
16574 2333521 2219845 1638751 1658836 1766671 1726238 1764475 1962284 1601745 1969192 1687114
16564 1687114 1720075 1565541 1349171 1530168 1289009 1304821 1672767 1242024 1626151 1408573
16554 1408573 1427633 1508721 1085072 1384482 1348597 1127918 1227693 1433317 1323193 1091353
16544 1091353 1130296 1348002 1213462 1450340 1109608 932969 979319 1018050 952624 707266
16534 707266 1203581 881566 1125102 746923 1182529 837689 943354 864616 1067551 981443
16524 981443 1007526 898268 843206 855427 948116 1003172 1005207 1149689 699402 1029786 621253
16513 621253 1063514 1127455 968962 819890 923931 1040807 716525 1024021 691175 951277
16503 951277 879605 504592 745134 700026 354478 524158 601178 507874 727281 762364
16493G62364M5640l18526L42262j60069j6953k6180j13999M36698k1728m18000
16483E11509k01534N88005C95245J65614Q9241k72402L54897k6400j21996k14446
16473C69753M68654C77700Q4692p302i1803A34282J60480J99205L00161k51081
16463E43047J92958C50713K62206K3660j02539r0433A83224L55576N5098j67602
16453D26296j25177r9827M84250l34625K06354A30545Q0895J67264j08558l8829
16443B31317L72554B75530p6764L25522k53690A09423K37307K05609N4441k80803
16433C25977o1495O1611r7304N27033k0416H3775H333K05967L6774A11128M9999
16422A61127J30107k4380j00172a1603B30906L38901j83187j41153A17676J97531
$$ plain form
16493 762364 808004 489478 831740 671671 654718 628538 514539 951237 929509 511509
16483 511509 309975 897980 395245 560859 650100 377698 732595 706195 584199 369753
16473 369753 838407 377700 462392 455090 -91803 134282 294762 493967 794128 543047
16463 543047 736005 350713 612919 636579 534040 443607 183224 538800 593898 426296
16453 426296 301119 201292 685542 350917 557271 130545 211440 378704 270146 231317
16443 231317 603871 275530 198766 524288 270598 109423 346730 552339 606780 325977
16433 325977 264482 326093 228789 755822 735406 83775 8333 214300 251074 111128 161127
16422 161127 291234 266854 166682 -11603 230906 569807 386620 245467 117676 315207
16412C15207K9804j34015J45668P6369K43416C12907j1425n9512I7423c76639
16401B09443k5589N010L17502B36678O8352A29541Q0973q1937D5107a07358f847
16389g788G4548O1605G219J074J74241R0054C6019m175a68426A51972l2752L84783
16377E04003a108D4566K53354l4661j10278K24555q9345o5950i8636B51627k443
16366B49184L7356j37532K70299e4058C05391A45170N23630B83919n9581E4165
16355a90324B05550O0376o4509p780g4769G9140K38019a18475m966A88142P2590
16344B60732j7367m932a98086B98678F9576C2977f3532A65055J59446F0899c2906
16332B746b2170C71771G8834b35577E5582J39229e713B82769D06J72727Q213G9727
$$ plain form
16412 315207 345011 210996 356664 433033 676449 312907 301482 241970 97423 -376639
16401 209443 183854 188864 506366 236678 305030 129541 210514 128577 45107 -107358 -6847
16389 -7788 74548 136153 7219 8293 182534 272588 36019 31844 -168426 151972 119220 504003
16377 504003 -1108 44566 297920 263259 152981 377536 288191 222241 -98636 251627 249184
16366 249184 286540 149008 419307 -54058 305391 145170 668800 283919 224338 54165
16355 -190324 205550 265926 201417 193637 -74769 79140 317159 -118475 -123441 188142 260732
16344 260732 243365 238433 -198086 298678 69576 32977 -63532 165055 324501 60899 -32906
16332 2746 -22170 371771 78834 -235577 55582 194811 -5713 282769 406 173133 181346 79727
16319A67202h5441A05668M7167l0907K5262J49024g4029A48963o6302K50328q7399
16308B45590b18800A90946r3591d0657l3159C16250a08953B6760a4568o9970l8304
16297a22842A02656L228b52249J2350B47442p9854B28a4064j472A23330P2288
16286A95618m0778D508e1888A38459J03266A01836g7103A52962K36234B3614K40547
16275B64161A0763L64013I9026b2905C0982a67134A32528J97088A17372a17581
16264d4999G759Q3067N6024J36546A35097D1701a44581A99090A0571J10463f904
16252A15167b17736E0768J53380b86149a23687A10895m7366b5563F37K86445E830
16240b46838r115a06923F7766J24937G7886P2606J37172a28042A50932b89471
$$ plain form
16319 167202 -85441 105668 152835 121928 147190 296214 -74029 148963 82661 332989 245590
16308 245590 -218800 190946 97355 -40657 -73816 316250 -108953 26760 -14568 -84538 -122842
16297 -122842 102656 105884 -252249 -239899 247442 167588 228 -14064 -15536 123330 195618
16286 195618 154840 4508 -51888 138459 241725 101836 -77103 152962 389196 23614 264161
16275 264161 10763 374776 99026 -22905 30982 -167134 132528 329616 117372 -117581
16264 -44999 7759 90826 146850 283396 135097 41701 -144581 199090 10571 121034 -6904
16252 115167 -217736 50768 204148 -286149 -123687 110895 63529 -25563 637 287082 5830
16240 -246838 -255953 -106923 67766 192703 77886 150492 287664 -128042 150932 -289471
16229i3943B71279B3486J34910L5234b3043H0367N9620f0172B16757B3573a3993
16217H4953l909e7670A59321f1344F266d4822k2504H1288h3544j8176A34250b21407
16204a21694k2221e7259H0215m632K46909F6268a17293I437M7851a26837f097
16192D03253A64161b61416i4901B0221K69534i6425D0030N3419K52398a43608
16181f3342A64664g5966A98392e0427B52208a13202M9202A96239n2970b24263
16170f7834j85131a471k39320a15383B84617d5346I030a82468I0946b62095F6651
16158b29000C17497E8072b22492L9825A09594a13795F3040f618k33548h3766j74167
16147b57933C4342a00208o9914K7968A70556e7975C05a02864I4419k942a86342
$$ plain form
16229 -93943 271279 23486 158396 193630 -23043 80367 139987 -60172 216757 23573 -13993
16217 84953 81044 -57670 159321 -61344 6266 -44822 -67326 81288 -83544 -101720 134250 -221407
16204 -121694 -143915 -57259 80215 75583 322492 66268 -117293 9437 57288 -126837 -6097
16192 403253 164161 -261416 -94901 20221 289755 -96425 40030 93449 345847 -143608
16181 -63342 164664 -75966 198392 -50427 252208 -113202 -64000 196239 143269 -224263
16170 -67834 -252965 -1471 -240791 -115383 284617 -45346 9030 -182468 90946 -262095 66651
16158 -229000 317497 58072 -222492 -182667 109594 -113795 63040 -6618 -240166 -83766 -257933
16147 -257933 34342 -100208 -170122 -142154 170556 -57975 305 -102864 94419 91477 -186342
16135h6988b3031C12675f0723A95142p5260b8367k318l26530C5664b84691H9888
16123A13794b25389d7967E8457n612c59971f8474D5134N8292o305L8835b64954
16111a0327B98936a61379N755c7630j8193j8976j60545A35873B5426j2617L09906
16100C22715G9235J5894c42134a61198G7854d4051l04916a02619b2125A01749
16089D7763L3696b92536A46460a82979j14109B21171J18842a33603O2577B26085
16078B78242i2852A8133L89919d0571I9489K2108f1873A3702J00362b5262A26167
16066A61861d5845K28j57823A3173P5355a78663I2750K48147a91962j29999b4187
16054c75810l8213B1903a34041I5483f1927n745k01636D19170A37252K19470E0493
$$ plain form
16135 -86988 -23031 312675 -60723 195142 119882 -28367 -30685 -357215 35664 -284691 89888
16123 113794 -225389 -47967 58457 52845 -359971 -68474 45134 103426 97121 135956 -264954
16111 -10327 298936 -161379 -155624 -37630 -55823 -74799 -235344 135873 25426 12809 322715
16100 322715 79235 95129 -342134 -161198 77854 -44051 -348967 -102619 -22125 101749
16089 47763 81459 -292536 146460 -182979 -297088 221171 340013 -133603 -71026 226085
16078 278242 -92852 18133 408052 -40571 99489 121597 -61873 13702 114064 -25262 126167
16066 161861 -45845 -45617 -203440 13173 88528 -178663 92750 340897 -191962 -321961 -24187
16054 -375810 -414023 21903 -134041 95483 -61927 -67672 -269308 419170 137252 356722 50493
16042A48555d6881k74516G9780c6084j24367B3889a46968c6709m9254A85053d2091
16030c0256n6226A21094g4595A05021B7476a65099e7711l1325K7850l40084J72279
16019b28991e5596l26118A7402f4392A08656a21208B25249B7500b05850p208P2405
16008a40653J8625A96508a97716G4442k1702h4203A8743O9081a63224L9065D18384
15996a8706k77020a24274D0921a56356d6933F7018b85212C7948J86016a24364
15985b10381C8255b29844I8773M62619N246k19186A07026j4041D5117A4526Q1417
15974I5943J85677h8722O027O778H0273D951J52666P6542C0811J2761Q3064a86407
15961b43224B10077n6854c28061A54218b4496A78d7513o8813o2099g3365m4796
$$ plain form
16042 148555 -46881 -321397 79780 -36084 -160451 23889 -146968 -36709 -85963 185053 -42091
16030 -30256 -86482 121094 -74595 105021 27476 -165099 -57711 -89036 -61186 -401270 -228991
16019 -228991 -55596 -381714 17402 -64392 108656 -121208 225249 27500 -205850 -213058 -140653
16008 -140653 -122028 196508 -197716 74442 52740 -84203 18743 87824 -163224 -124159 418384
15996 -18706 -295726 -124274 40921 -156356 -46933 67018 -285212 37948 223964 -124364
15985 -210381 38255 -229844 98773 561392 566638 347452 107026 92985 45117 14526 95943
15974 95943 281620 -88722 -82695 -75917 80273 4951 157617 234159 30811 43572 126636 -186407
15961 -243224 210077 153223 -328061 154218 -24496 178 -47513 -116326 -178425 -73365 -118161
15950a18161A22246C9572a83216N3689B28660d2093j49175A81954k1235n6140
15940A04579b90531O0010O4474f4580l3919q7993N1026G3784J40467Q5987A09273
15928b01402L2836e8670k45797J34708G8137N4364d6150I4017d50217R3237J7483
15917c39497j46924B37149B3696L29758a1362C88047j36423n2482e388p2267p2717
15906a50372M6821A70306a22233J2901H0793h1335a4387j62795O5904J610C44630
15894e8267j08618D5910e7552C01923j23811h1423k8937q9420A78283D5934h6197
15882A86819G9679K15055h2038A71004f5220A90786c18227P8863e0412j36179
15872a86591N606F3043a16604H937L71317a0147B87088j41393G2253d16224a68487
$$ plain form
15950 -118161 122246 39572 -183216 -129527 228660 -42093 -191268 181954 160719 104579
15940 104579 -290531 -230521 -166047 -64580 -98499 -186492 -135466 73784 214251 300238 109273
15928 -201402 -168566 -58670 -304467 -169759 78137 132501 -46150 94017 -450217 -356980 -339497
15917 -339497 -486421 237149 23696 353454 -11362 388047 251624 199142 -5388 -77655 -150372
15906 -150372 -103551 170306 -122233 -109332 80793 -81335 -14387 -177182 -111278 -109668 344630
15894 -58267 -166885 45910 -57552 301923 178112 -81423 -110360 -199780 178283 45934 -86197
15882 186819 79679 294734 -82038 171004 -65220 190786 -318227 -239364 -50412 -186591
15872 -186591 -180985 63043 -116604 8937 380254 -10147 287088 145695 72253 -416224 -168487
15860e4199D0964b34645A71536B6690b39228f7890c0302l3374B92442F4176I446
15848B20442a23867B21499h3967j158I646J1921J67983e32827b25151F560a779
15836D7085a43363L6280E7564B5038a27244m0833N2666E3966j5263J90579f6402
15824B2752g1890L4971B38190i9528n522k31692G6929b08485N4083B11543J12012
15813C23555b0169j68037j60820A4812a84586F249a89767n7668a18842k02892
15803c21734a40601A30239b52372H3656C4887d1239G6953i2837K1206m9095c9958
15791A82027b00241D2579b35832i9545o57d0754A89686B1747J26789G0728d0689
15779d1909E6451a08563B17568N7076a28130C06956d9442j23456b4240m10114
$$ plain form
15860 -54199 40964 -234645 171536 26690 -239228 -67890 -30302 -63676 292442 64176 9446
15848 220442 -123867 221499 -83967 -85125 9646 21567 189550 -532827 -225151 6560 -1779
15836 47085 -143363 -107083 57564 25038 -127244 -168077 -115411 53966 38703 229282 -66402
15824 22752 -71890 -36919 238190 -99528 -105050 -336742 76929 -208485 -154402 211543 323555
15813 323555 -20169 -188206 -349026 14812 -184586 6249 -189767 -247435 -118842 -321734
15803 -321734 -140601 130239 -252372 83656 34887 -41239 76953 -92837 -71631 -120726 -39958
15791 182027 -200241 42579 -235832 -99545 -100202 -40754 189686 21747 148536 70728 -40689
15779 -41909 56451 -108563 217568 274644 -128130 306956 -49442 -172898 -24240 -434354
15769d34354c8398A97866c04684c4285A7496d77952a5342F3533c06691A34222
15758A39624C8881a39177B59334a19660B45212B2264d8369A71479g9334D8047
15747C9389L09783c62908C22708A26492J92845B8544d9679k74140A22350n3434
15737F8916b65334B59188b7918C48854H2366J5943a40170a3171j66685k64018
15727d43874a6581B0661K35935K9750A34885e989r8203A51617b36161p0127a07259
15715C6717R3413a0018A71749c03887d9719q3257N2223j8646E977b71591N0245
15704b21346a4660A22080c32506J10714B35293H7042R4649n7027f3030A27903
15693A27988h7227D74265A40003a61105H215g0558c3791C6211c04336A76949a39356
$$ plain form
15769 -434354 -38398 197866 -304684 -34285 17496 -477952 -15342 63533 -306691 134222
15758 139624 38881 -139177 259334 -119660 245212 22264 -48369 171479 -79334 48047
15747 39389 349172 -362908 322708 126492 319337 28544 -49679 -323819 122350 68916
15737 68916 -265334 259188 -27918 348854 82366 98309 -140170 -13171 -179856 -443874
15727 -443874 -16581 20661 256596 286346 134885 -5989 -104192 151617 -236161 -306288 -107259
15715 36717 130130 -10018 171749 -303887 -49719 -132976 -80753 -99399 5977 -271591 -221346
15704 -221346 -14660 122080 -332506 -221792 235293 87042 181691 124664 -63030 127903
15693 127988 -87227 474265 140003 -161105 8215 -70558 -33791 36211 -304336 176949 -139356
15681a81250C20999c13906a49972b7281C07467d06240D4496e3300A35698J40437
15671B76135C590b0057A38728g482K957B79819a27659L704A87530a48502K6510
15660a21992a1563m8891j15713H8265f9899k9762A39799c8046C70283G1995O9984
15649A41979K4149E1941O9076D51c3628o1661j45152B63387b30224c7314j15820
15638a53134j75276E5306K67853a85106f8618G0361N7591C401J03128K77355a2274
15626A77383a0462B86777A06998C2941J51432B4499K44975H9143J49898D4570
15615a53049J6229d9911B03082m085e5269k8769l10863a57220A86013J00049a51212
15603I0111R4418D2318d036l512m6828B12982q3811h80j509A1962e61900a78909
$$ plain form
15681 -181250 320999 -313906 -149972 -27281 307467 -406240 44496 -53300 135698 276135
15671 276135 3590 -20057 138728 -7482 -4525 279819 -127659 -123955 187530 -148502 -121992
15660 -121992 -11563 -60454 -176167 88265 -69899 -99661 139799 -38046 370283 71995 141979
15649 141979 166128 51941 121017 451 -33628 -95289 -240441 263387 -230224 -37314 -153134
15638 -153134 -328410 55306 323159 -185106 -68618 70361 127952 3401 106529 383884 -12274
15626 177383 -10462 286777 106998 32941 184373 24499 269474 89143 239041 44570
15615 -153049 -136820 -49911 203082 198997 -55269 -84038 -394901 -157220 186013 286062 -151212
15603 90111 184529 42318 -4036 -7548 -54376 212982 129171 -880 -2389 11962 -561900 -178909
15590d56225L4738e9710C3326R3578F193J59274B1461O4775K23343A22892i3909
15578a62893N3416m6005L6872I874l674J1082O244j1055K03850b40989a13281
15566A84151l7186b3759p8375k38992A40586N49a68801j5732A13173b1128q6284
15555a07412l7106C6574b59815b9900l21132D1816a10127E0896b3159m4339h527
15543a9286I64c2710A21310B8653J40366P5904L30607A49739D4403J93000b57241
15531a92830D6536R9368a27780k60946A37369E0433P0638f8437A01217k8811j3662
15520E8744a75567A0200d3672B76558a14220B09744J54990b311j1783m1200j78140
15509b33434q754D6041i9336b7271B00615a35054I8353g9007C7250E603J18864
$$ plain form
15590 -456225 -421487 -59710 33326 126904 6193 165467 21461 86236 309579 122892 -93909
15578 -162893 -109477 -155482 -118610 9874 6200 17282 23526 12471 216321 -240989 -113281
15566 184151 146965 -23759 -102134 -341126 140586 141135 -168801 -184533 113173 -21128 -107412
15555 -107412 -144518 36574 -259815 -29900 -351032 41816 -110127 50896 -23159 -67498 -8527
15543 -19286 964 -32710 121310 28653 169019 244923 575530 149739 44403 237403 -257241
15531 -192830 46536 145904 -127780 -388726 137369 50433 121071 -68437 101217 72406 58744
15520 58744 -175567 10200 -43672 276558 -114220 209744 364734 -2311 -14094 -55294 -233434
15509 -233434 -242188 46041 -99336 -27271 200615 -135054 98353 -79007 37250 5603 124467
15498A24467J75849C2506J85083a18473M6440E1288e9027j3735H8826J65545I3691
15486A11371E0136c35776E5539f940k17129A84806B560c5135a5450m4638M276
15475e5812B65519A12392A566J98021H5381b077A35500a45520C51041b72543K4863
15464b47680A73930a94382F3248L4074p589M10K36351J11362f4158k0547A82432
15452b94695A22343Q1979f4553k58642h1840b6365l42824f4260B71461G5560Q9726
15441A65286l1352a11175a8776B92292A32241O7260p5370n7091d0802P75B39225
15429B28438B9297L6247a39262C68730a83530B35224h8550B50758d9138p5808
15419a24946f616E4889b5260j85946M4050p1203a1893k68873a22939n610I4335
$$ plain form
15498 124467 300316 32506 217589 -118473 -72033 51288 -59027 -72762 88826 254371 93691
15486 111371 50136 -335776 55539 -6940 -224069 184806 2560 -35135 -15450 -60088 -55812
15475 -55812 265519 112392 1566 199587 85381 -2077 135500 -145520 351041 -272543 -247680
15464 -247680 173930 -194382 63248 97322 89733 90143 326494 437856 -64158 -84705 182432
15452 -294695 122343 204322 -64553 -323195 -81840 -26365 -369189 -64260 271461 75560 165286
15441 165286 133934 -111175 -18776 292292 132241 199501 124131 67040 -40802 -40027 239225
15429 228438 29297 65544 -139262 368730 -183530 235224 -88550 250758 -49138 -124946
15419 -124946 -6616 54889 -25260 -211206 -167156 -238359 -11893 -280766 -122939 -128549 94335
15407a34706A49305a4616H4377c24690B42359l9277E1458M55038a38859j58237
15397b97096p6753a13964d3494A25266K7895Q0615g0194k9280a9318k49630A41628
15385d5827E7552a73717i054j0526E8184c5355l74354A77766b81269J35923c5740
15373B09826a54001A05141J2617b5419j92573p2512C3677e8628C95490E7732i885
15361D3702O4019a40266A72522D0631K1645C452N2644P8727D6231P4400m0737
15350G9894R4755M7674a81220e567j00619B67314a56070A97148a78470A03242
15339A57176b39756B19497a85110m1928p6149B4478a7560O933A58315b58295a03624
15327C35521b6605A66876o5523L8450F4623d5320C6239c11383Q8395B34965r849
$$ plain form
15407 -134706 149305 -14616 84377 -324690 242359 203082 51458 506496 -138859 -297096
15397 -297096 -373849 -113964 -43494 125266 153161 233776 -70194 -99474 -19318 -268948 141628
15385 -45827 57552 -173717 -9054 -19580 58184 -35355 -409709 177766 -281269 -145346 -35740
15373 209826 -154001 105141 117758 -25419 -217992 -290504 33677 -58628 395490 57732 -9885
15361 43702 107721 -140266 172522 40631 62276 3452 56096 134823 46231 120631 79894
15350 79894 174649 222323 -181220 -5567 -106186 267314 -156070 197148 -178470 103242
15339 157176 -239756 219497 -185110 -227038 -303187 24478 -17560 -10627 158315 -258295 -103624
15327 335521 -26605 166876 101353 139803 64623 -45320 36239 -311383 -222988 234965 225116
15316B25116f5344A14416a70280b8933C95099J55156D2493L04219j55823a4566
15305a41278I4264L5818r468J15847a52797C50901g1131A78671e3754B24617e4631
15293f1844A94041a61250B47019i8758L9377G8398a30561C1361J09127B81h5867
15281b13552A29566P5461d7454B20287c537B3745J41896j6557h7215D1490L53448
15270C94938E1111a53046I6107j0755M6127h4603D4310K818K19908e2861A20134
15258D5077K9262J1895K71205B238a15632B06245k2903p2888K12207p6673J40778
15247C86766j10472O65042J042307q37191K42219o14954k66421H7878c04037B3994
15236c1952D8453J04434L85832C5754h4469A43733a40577C8700J83271d49863
$$ plain form
15316 225116 -65344 114416 -170280 -28933 395099 550255 42493 346712 190889 -14566
15305 -141278 94264 130082 120614 236461 -152797 350901 -71131 178671 -53754 224617 -54631
15293 -61844 194041 -161250 247019 -98758 -59381 78398 -130561 31361 140488 281 -85867
15281 -213552 129566 205027 -47454 220287 -3537 23745 165641 149084 -87215 41490 394938
15270 394938 51111 -153046 96107 85352 131479 -84603 44310 47128 267036 -52861 120134
15258 45077 74339 86234 357439 2238 -115632 206245 183342 110454 322661 245988 386766
15247 386766 276294 941336 1983643 1146452 1388671 773717 507296 87878 -304037 23994
15236 -31952 48453 152887 538719 35754 -84469 143733 -140577 38700 221971 -449863
15225g5580j5413A10359a32002N1705A02383J97031c58118A70793m1557R4500
15215B23736E1874L138J74902p7595g7613E8935d1283I6308A1249g7342A76875
15203A45632b20958h8859J5412A53475b8125A09783a49360B37660g6549C49062
15192A36978j3501b8370D33131F5530P0072g9875B09631f1711k62524d6654B03356
15180B94480G5725a5474D6226L25662G4208M988k6137k2183b6470G929J93480
15169B01409J8157r8165a74006M8957A10944b14043m0012B07778q6387i6139A80471
15157I904i9621C41381A8759Q2711c16100A4449a80795C46330c8283q7903j6976
15146a43162B21073N7633r9155N00093A28154J9776d0081G9897P6920a59355A26401
$$ plain form
15225 -75580 -90993 110359 -132002 -80297 102383 299414 -358118 170793 129236 223736
15215 223736 51874 55012 229914 152319 -77613 58935 -41283 96308 11249 -77342 176875
15203 145632 -220958 -88859 -73447 153475 -28125 109783 -149360 237660 -76549 349062
15192 136978 123477 -28370 433131 65530 135602 -79875 209631 -61711 -324235 -46654 203356
15180 294480 75725 -15474 46226 371888 74208 79196 53059 30876 -26470 7929 201409
15169 201409 219566 121401 -174006 -125049 110944 -214043 -254055 207778 121391 -96139 180471
15157 9904 -99621 341381 18759 101470 -316100 14449 -180795 346330 -38283 -126186 -143162
15146 -143162 221073 278706 179551 679644 128154 147930 -40081 79897 156817 -159355 126401
15134C47932C1163M5654Q1686a1971C18717D4255N0650a37618B90176A16514O9317
15123A85831J60731a28184c3814A28081L95083k46709J78371H7018K8783a12518
15112A88714M3299j5411J48279A03805K25639h6238E27228A35232O2600I912J09162
15101A19074L4991b27816B02978J86707H2a33278A38893b48990B30787R4791j47198
15090A78380m0133M1765G2757e889G1127J61053p0032K01538H5682C2487a09482
15078I2277K13028A43865g6613p7138D80490d7959A06902K110m4416J0304k0484
15067E4416J99187J91665A80193J35897q5593l1293n7261a43457A72447J59352
15057C31799A18769n1082Q5411a231A58865f7850K9825B44086F4180c3526j25596
$$ plain form
15134 347932 31163 76817 158503 -11971 318717 44255 94905 -137618 290176 116514 185831
15123 185831 346562 -128184 -33814 128081 523164 276455 454826 87018 115801 -112518
15112 188714 232013 216602 364881 103805 329444 -86238 527228 135232 197832 9912 119074
15101 119074 154065 -227816 202978 389685 82 -133278 138893 -248990 230787 325578 178380
15090 178380 138247 180012 72757 -5889 71127 232180 162148 363686 85682 32487 -109482
15078 92277 305305 143865 -76613 -153751 480490 -47959 106902 109012 64596 74900 54416
15067 54416 253603 445268 180193 316090 230497 199204 141943 -143457 172447 331799
15057 331799 118769 67687 153098 -1231 158865 -67850 -38025 244086 64180 -33526 -159122
15046a59122B74993J94000j08135l6485M9230N4919I1420O0372C5482K83956j09980
15035B09458A01237Q9701H1827K71109m8782g5354A17283P4902D5192J80911J11847
15024C37950J61806k16012l2747j21173n0014N7652C7305b0244G7475M97033A47569
15012B91162A24956K4516J68120r284H907J15072g8756B69134K9511L2458A57645
15000A5630M61163A76968q930c8099A82249g5807D3925L12755j60565E0267d2947
14988B82272j04250F6476K01094q8915G3310J21313a28471A46012k311R5343H8087
14976D05690A99088J03517A3645A398K86179r0284a2932D27563G2705b32605B45766
14964B26195l1848N7704R9147E5432j3229a54051B71238P4854H9101J0804M16305
$$ plain form
15046 -159122 274993 468993 360858 324373 373603 428522 91420 151792 35482 319438 209458
15035 209458 101237 190938 81827 352936 304154 -75354 117283 192185 45192 226103 337950
15024 337950 499756 283744 250997 129824 79810 137462 37305 -20244 77475 574508 147569
15012 291162 124956 149472 317592 308308 8907 123979 -78756 269134 298645 331103 157645
15000 15630 476793 176968 168038 -38099 182249 -75807 43925 356680 196115 50267 -42947
14988 282272 178022 66476 267570 178655 73310 194623 -128471 146012 143701 239044 88087
14976 405690 199088 302605 13645 1398 287577 197293 -12932 427563 72705 -232605 245766
14964 226195 194347 252051 351198 55432 42203 -154051 271238 346092 89101 99905 516210
14953E16210J715I556O0025B2687J91854m8862b7824B90556o7494J18130G0173
14941A88261n2565P36702B97614k6383L6081j30124p9916L79007B09480h7807
14930E06917B50970R7375j29020K7963j22857J41479m7380j00936E0092j2107
14920C7985L29235A66619J292K0941E9894a05638B38770K47486G8494N90255j82716
14909D86033E4620O9381J53549k6076j5706J31900B4969K45269K4829j16932J53522
14898C31657F4960J50048j3678M13801A58931C2744J60312n9006R0784o5593n7958
14887A01283a01509D51413m5296p6549J66491j96587J57583J268J17911A54038
14876F29411D8436L08235m8528A41167M25722B38826a31824B94847K9071J51722
$$ plain form
14953 516210 517925 9556 69581 22687 214541 165679 -27824 290556 223062 341192 70173
14941 188261 135696 872398 297614 271231 307312 177188 97272 476279 209480 -87807
14930 506917 250970 348345 219325 247288 124431 265910 218530 117594 50092 37985
14920 37985 367220 166619 167911 188852 59894 -105638 238770 486256 78494 668749 486033
14909 486033 54620 124001 277550 251474 235768 367668 24969 270238 295067 178135 331657
14898 331657 64960 215008 201330 615131 158931 32744 193056 134050 224834 159241 101283
14887 101283 -101509 451413 406117 329568 496059 299472 457055 458323 576234 154038
14876 629411 48436 356671 308143 141167 566889 238826 -131824 294847 323918 475640
14866D75640k22928r5197J32755k8105p8641J46638f0322E82006J9012B79147
14855D88794j9961J7994j16229J21213F3978L93967Q5612j65554L27948k14541
14845D91410A49797L04170q2709K86891B96440Q3331j52959N2916N6312J21206
14835D57246D596K65661Q1261J39187j7626O9207l9817B19927J63814A55062M98008
14824F53070B66534J16115L6998N4473o5187Q6508P102j46232N2216N1600j06866
14813C53261m1723A28622J96253J79322L1388A92764J99365j91695L30754j84545
14803C46643J38286j87232j1020L32986k85065J94729k12221K8331J61256k23014
14793B83679o2201J98148L03500C04781L87366J5276j98881j42962N5384L53141
$$ plain form
14866 475640 252712 157515 290270 262165 183524 330162 -60322 582006 601018 279147
14855 488794 468833 486827 370598 491811 63978 457945 543557 378003 705951 491410
14845 491410 149797 453967 371258 658149 296440 379771 226812 279728 336040 457246
14835 457246 4596 270257 351518 490705 473079 542286 502469 219927 383741 155062 653070
14824 653070 266534 382649 419647 474120 408933 495441 502543 356311 408527 460127 353261
14813 353261 311538 128622 324875 504197 535585 192764 392129 200434 531188 346643
14803 346643 484929 297697 286677 619663 334598 529327 317106 345437 506693 283679
14793 283679 221478 419626 723126 304781 692147 707423 508542 365580 420964 774105
14783G74105k49773B53824K95584B63425N28281A01946K70536M42329k55303J0466
14773E69974B40905m1139J41503K64071J5940k96886K86997Q0195r1459o2814
14763E37313j45279J40624j92313O5029P3564k3876J58392K1277M08754l63503
14753F79982j46035R7372j75635K99235j13711j39826J59746k70424J31642L3555
14743E55901J43455B61915L31088q7829K45232J55696j46490k18118P33K20135
14733G62362l37189L43055j98835L06266j08733J6679l05508J5390M26303l63981
14723E55809R7172k59152N60255l17139R6498M8542J15249l25158K40011k13007
14713E99080K8461P5630j05475K08715N9110L2555l13311P5432J6909Q5592j71763
$$ plain form
14783 774105 524332 253824 549408 263425 791706 101946 372482 814811 559508 569974
14773 569974 240905 199766 341269 605340 621280 324394 611391 691586 600127 537313
14763 537313 392034 532658 340345 405374 478938 455062 613454 634731 1043485 679982
14753 679982 533947 631319 455684 754919 641208 501382 661128 390704 522346 555901
14743 555901 699356 261915 593003 505174 750406 906102 759612 541494 542227 762362
14733 762362 425173 768228 569393 875659 766926 783605 478097 493487 919790 555809
14723 555809 652981 393829 954084 636945 733443 781985 897234 572076 812087 599080
14713 599080 627541 703171 597696 806411 865521 898076 584765 660197 677106 762698 590935
14702E90935M8647M05282k04808j31132Q9632j59316k25444J62823L47422k04674
14692G19367j3156K01909J34677k05232k5182j37096K09110J08487j70773K83119
14682A105230n26358L45052M35908n62773J09880n2101q4461p1666J46330K05050
14672A050091j58987j32630o8524K22995m0045P0758K97825l98897O4866J37311
14662A044763k07335j26954L50180P1765l44418K48093j58423O2479K39067R3032
14652A272249k07742J01371J80454m97030J84027K6190n1032j53885J74957k09643
14642H19916K05281q203J00830J28034J83595l52955R3904R3233m6068p5882q0008
14631A061677R595N8674J69377j57836j93044J39548N2495M43615o99456M02477
$$ plain form
14702 590935 639582 1044864 840056 708924 798556 639240 413796 576619 924041 719367
14692 719367 706211 908120 1042797 837565 812383 675287 884397 992884 822111 1105230
14682 1105230 578872 923924 1359832 797059 906939 854838 770377 698711 845041 1050091
14672 1050091 891104 758474 689950 912945 872900 943658 1241483 842586 907452 1044763
14662 1044763 837428 710474 1060654 1132419 788001 1036094 877671 940150 1179217 1272249
14652 1272249 1064507 1165878 1346332 849302 1033329 1059519 1008487 854602 1029559 819916
14642 819916 1025197 1016994 1117824 1245858 1429453 1076498 1170402 1263635 1217567 1141685 1061677
14631 1061677 1071272 1129946 1299323 1141487 948443 1087991 1140486 1584101 884645 1287122
14621A287122J37576l81843K76322J32452k21588m7683k14671N30691k43552L40581
14611A595407l23106n5802J1013j85784M64854j37231r8671J18955j16967P9257
14601A351925k18725P98128n19815j54126M56408l22658K67386j36579j76175
14592A345769L71397j75549J51646R3953q1222j0050p1742k32626K42891j73017
14582A461450K00316J56070J959q5857J25120j90252J74553N4444L6532j33413
14572A800922P7540L2032K10350k38452j8742K82920j48442L29694m95728O10221
14562B442315r4063P8416k87804L65195m5957J40529Q6015Q6542M02952J50984
14552C325124M26102L20456O06864J521866L397592P125473K0709389J2711985
$$ plain form
14621 1287122 1424698 1042855 1319177 1451629 1230041 1182358 967687 1498378 1254826 1595407
14611 1595407 1272301 1216499 1227512 1041728 1506582 1369351 1270680 1389635 1272668 1351925
14601 1351925 1133200 1931328 1411513 1257387 1713795 1391137 1658523 1521944 1345769
14592 1345769 1717166 1541617 1693263 1787216 1705994 1695944 1624202 1391576 1634467 1461450
14582 1461450 1661766 1817836 1819795 1733938 1859058 1668806 1843359 1897803 1934335 1800922
14572 1800922 1878462 1910494 2120844 1882392 1863650 2146570 1998128 2327822 1832094 2442315
14562 2442315 2348252 2426668 2138864 2504059 2458102 2598631 2684646 2771188 3174140 3325124
14552 3325124 3751226 4071682 4678546 6200412 9598004 16723477 37432866 50144851
14544E0144851A7464613G589494j763009j450620j927122n46576q9011l0224l89850
14535A393082R7341R7317K60200l93009L36029p1657J71184J42698J5353k31389
14525A817149P6799J22379K94004m16947R0576k09858N83038K8845l42399J99131
14515B242717p1038L59809m13190P8615O71072l83346j16549J05454K69868n69672
14505B173740R7415P98021p85883M63402K5388j18031R6657R2921J1643J0010
14495B865283P5414j21959M4599J57994N4929J68006L6009j80119j05259j65562
14485B829335L87956j9384K3920m1065J11858k8424L91063j03022l23331K13804
14475C442710L87017l77575K11183j79036L66785q6944J32092p1M7825K79567
$$ plain form
14544 50144851 17464613 7589494 5826485 4375865 2448743 1902167 1813156 1782932 1393082
14535 1393082 1490423 1587740 1847940 1454931 1790960 1719303 1890487 2033185 2048538 1817149
14525 1817149 1893948 2016327 2310331 1893384 1983960 1774102 2357140 2385985 2043586 2242717
14515 2242717 2171679 2531488 2118298 2196913 2867985 2484639 2368090 2473544 2743412 2173740
14505 2173740 2271155 3069176 2283293 2746695 2772083 2654052 2750709 2843630 2855273 2865283
14495 2865283 2940697 2818738 2863337 3021331 3076260 3244266 3280275 3100156 2994897 2829335
14485 2829335 3217291 3197907 3221827 3180762 3292620 3264196 3655259 3552237 3228906 3442710
14475 3442710 3829727 3452152 3663335 3484299 3851084 3764140 3896232 3896161 3943986 4223553
14465D223553k53156J71497j736o022K22139k54145J82656k89862J8584L33436
14455D346944K2546J0386k4M41621p9351j88267L40078J26391M4310P2941j77014
14444D960561J83720j01256K93696k98305K69749m1729m1215L52583j77352J98184
14434E598636J22316J53398J72192o2587p7285J23412K83154n1353L12854n1699
14424F523038k09258J03539L74196K38579j76151R6186P9587J24643L55263q057
14414G501565j07248l6932K74937O11106k91654K43226N4762K81293p2048q2092
14404H376915K22750J94069K84437O2417Q9363K40735K93879J9076J42068k16861
14394I708848L58838K27428J36020K74300L3198K78873J50093K92822K65578P847
$$ plain form
14465 4223553 3970397 4141894 4140158 4134136 4356275 4102130 4284786 3994924 4013508 4346944
14455 4346944 4369490 4379876 4379852 4821473 4742122 4553855 4893933 5020324 5064634 5137575 4960561
14444 4960561 5144281 5043025 5336721 5038416 5308165 5266436 5225221 5577804 5400452 5598636
14434 5598636 5720952 5874350 6046542 5983955 5906670 6030082 6313236 6261883 6574737 6523038
14424 6523038 6313780 6417319 6791515 7030094 6853943 6950129 7029716 7154359 7509622 7501565
14414 7501565 7394317 7357385 7632322 8243428 7951774 8195000 8249762 8531055 8459007 8376915
14404 8376915 8599665 8793734 9078171 9140588 9229951 9470686 9764565 9783641 9925709 9708848
14394 9708848 10067686 10295114 10431134 10705434 10738632 11017505 11167598 11460420 11725998 11733845
14384A1733845O33773l2882J58355M25037r021K44992J18468N12277J18579K75326
14374A4178749n3905O62596L22579n5670N78626K16697L68056K59674J99320M83569
14364A7160291M62584M70769K05469O30043L03370L83975L74766O40866N35989
14355B1168122L04095O91033L65147O02317P39721J45065N76293Q35707Q68616
14346B6296116J24997O86342Q24994J061532N47869J141103L07790R56196J242877
14337C3189816O67440J209194P09696J220741R62822J252604J253680J431635
14329D1897628J066940J435306J571272J524693J777708J016609K069615J947134
14321E4306905J476836K454619K181925K310091K411011K297620K335095L020062
$$ plain form
14384 11733845 12367618 12334736 12493091 12918128 12909107 13154099 13272567 13784844 13903423 14178749
14374 14178749 14124844 14787440 15110019 15054349 15632975 15849672 16217728 16477402 16676722 17160291
14364 17160291 17622875 18093644 18299113 18929156 19232526 19616501 19991267 20632133 21168122
14355 21168122 21472217 22163250 22528397 23130714 23870435 24015500 24591793 25427500 26296116
14346 26296116 26421113 27107455 27932449 28993981 29541850 30682953 30990743 31946939 33189816
14337 33189816 33857256 35066450 35776146 36996887 37959709 39212313 40465993 41897628
14329 41897628 42964568 44399874 45971146 47495839 49273547 50290156 52359771 54306905
14321 54306905 55783741 58238360 60420285 62730376 65141387 67439007 69774102 72794164
14313G2794164K925955L428428L249280L150045M239603L667567L813678M907846
14305A02176566M093791N546492N058600N500700O167516O356012O753996O880550
14297A48534223P896099Q063531Q669955R214986R553406J0377782J0520666J1502899
14289B24333547J1560871J2572955J2921360J3698196J4254465J4654413J5402029
14282C19397836J5622660J5545554J5749277J5474240J5374426J4856122J3680928
14275D25701043J2342952J1541355Q858731K835297J042888J744965j042593m019312
14267D59005326m190201m760741j0314982j2937833j4574481j5738367j6501335
14260C79987386j7095996j7029809j6811516j6497422j6491459j5474353j5009560
$$ plain form
14313 72794164 75720119 79148547 82397827 85547872 89787475 93455042 97268720 102176566
14305 102176566 106270357 111816849 116875449 122376149 128543665 134899677 141653673 148534223
14297 148534223 156430322 164493853 173163808 182378794 191932200 202309982 212830648 224333547
14289 224333547 235894418 248467373 261388733 275086929 289341394 303995807 319397836
14282 319397836 335020496 350566050 366315327 381789567 397163993 412020115 425701043
14275 425701043 438043995 449585350 458444081 461279378 462322266 464067231 463024638 459005326
14267 459005326 454815125 450054384 439739402 426801569 412227088 396488721 379987386
14260 379987386 362891390 345861581 329050065 312552643 296061184 280586831 265577271
14253B65577271j4221144j2257268j3201166j1694833j1808682j0871097r659871
14246A81863210r527866q900964p894511p807291p354525o874083o907474n521891
14238A21074605n582053m787915n169133m623994m771974m147679l760175k943875
14230H5287807l586792l769652k883971k913152l105140k625376k144607k264756
14222F1994361k320262k250701k319087j228837k139825j899613j617280j538268
14214D6680488j225061j070657j995121j158535j074427j373718j307545k07421
14206C7268003j223896j359346r98918q35971q96656q77046o60359q14356j249697
14197B8351758n59474j043462n30631m32059m15775n18482p82894q33953n67796
$$ plain form
14253 265577271 251356127 239098859 225897693 214202860 202394178 191523081 181863210
14246 181863210 172335344 163434380 155539869 147732578 140378053 133503970 126596496 121074605
14238 121074605 115492552 110704637 105535504 100911510 96139536 91991857 88231682 85287807
14230 85287807 81701015 77931363 75047392 72134240 69029100 66403724 64259117 61994361
14222 61994361 59674099 57423398 55104311 53875474 51735649 49836036 48218756 46680488
14214 46680488 45455427 44384770 42389649 41231114 40156687 38782969 37475424 37268003
14206 37268003 36044107 34684761 33685843 32849872 31953216 31076170 30415811 29601455 28351758
14197 28351758 27792284 26748822 26218191 25786132 25370357 24851875 24068981 23235028 22667232
14188B2667232m33692q78924l0188o84163j68106p08414m98926m86593j26157
14179A8652069k88932o09593k07402n54694l8547n72705l06284l3218l01678m39101
14169A5299915k87301l06919l53009l65053j71208m2819n06327k42311k83766
14160A2741202j24650J7024n98728Q4349l23044j86478l94995k32390o9559r7370
14150A0815361k5310l78162k04458j93639j46941J89841j79573o62462R3184O9176
14140I377017k81072j91541j48170M0192l16740J1338k9986k56808k56475J73732
14130H121487k99080j25549p4260k49540Q9786j56322P8502k72823j08101q1166
14120F922934m4589j45801o1031l9936k93617K02043l12630L09897m12795j95614
$$ plain form
14188 22667232 22233540 21354616 21324428 20640265 20472159 19763745 19264819 18778226 18652069
14179 18652069 18363137 17753544 17546142 16991448 16952901 16380196 16073912 16040694 15739016 15299915
14169 15299915 15012614 14705695 14352686 13987633 13816425 13773606 13267279 13024968 12741202
14160 12741202 12616552 12633576 12034848 12119197 11796153 11609675 11214680 10982290 10912731 10815361
14150 10815361 10790051 10411889 10207431 10013792 9866851 10056692 9877119 9214657 9307841 9377017
14140 9377017 9095945 8904404 8756234 8796426 8479686 8491024 8461038 8204230 7947755 8121487
14130 8121487 7822407 7696858 7622598 7373058 7462844 7306522 7385024 7112201 7004100 6922934
14120 6922934 6878345 6732544 6671513 6631577 6337960 6540003 6227373 6537270 6124475 5928861
14110E928861J41135k53678m4707j88221R5010l013j40740o9515L72869o43841
14100E194160l50651K70449N8516p6350j45418o3819R9976j1547K54338l87156
14090D842498l55438J17102l3703k91573M23554l45557J9755J24941m86273J78341
14080D193647J42519l5157r4866p357j13128l35239p088K65103o4785M495j17748
14069C830396J43747k55071j21783J90263o3950l62323K07569Q5066k98446K95011
14059C650479J39003l55132K90616q9539m01263K30263n60066N60018m1807j3619
14049C408953k62204l57796K64139K3258K08288n40987L00359k69783J22798L18493
14039C215518m72800R9284q9184j90439J54945o9795M9473j47468q3352J41244
$$ plain form
14110 5928861 6069996 5816318 5771611 5583390 5678400 5675387 5534647 5465132 5838001 5194160
14100 5194160 4843509 5113958 5172474 5096124 4950706 4886887 4986863 4975316 5229654 4842498
14090 4842498 4487060 4604162 4570459 4278886 4702440 4356883 4376638 4501579 4015306 4193647
14080 4193647 4336166 4301009 4206143 4198786 4085658 3750419 3743331 4008434 3943649 3948144 3830396
14069 3830396 3974143 3719072 3597289 3787552 3723602 3361279 3568848 3653914 3355468 3650479
14059 3650479 3789482 3434350 3724966 3635427 3234164 3464427 2904361 3464379 3422572 3408953
14049 3408953 3146749 2788953 3053092 3076350 3284638 2743651 3044010 2774227 2897025 3215518
14039 3215518 2742718 2842002 2752818 2562379 2717324 2647529 2697002 2549534 2466182 2607426
14029B607426L33914l82017q4567N0006R2810j74596j27765K00773j52146J50701
14019B514539m01987O17345o62029L25708l00149K38056l54176N6462L8014p8084
14009A993699R6708m481J05916k97454l14141J79910J74887r9081J19686K71019
13999B226668n59892M9563K2132j36003N50870m49221L71431k36821L87038M2325
13989B268090K94975K471223N467046J8166436K5554130B4053756A1717217n091817
13981F625400j804897r65356q72919Q391r464o30257N15314k25089j71833k80960
13971B188330O4807j0352J73275l56333l871R3989r4660R751l60425j38325L36615
13960A902801L2545o7762j35985k43598L42218l82491K15244K96155k69755l0257
$$ plain form
14029 2607426 2941340 2559323 2474756 2524762 2617572 2442976 2315211 2515984 2363838 2514539
14019 2514539 2112552 2729897 2067868 2393576 2093427 2331483 1977307 2033769 2071783 1993699
14009 1993699 2090407 2085926 2191842 1894388 1580247 1760157 1935044 1835963 1955649 2226668
13999 2226668 1666776 1716339 1738471 1602468 2153338 1704117 2075548 1838727 2225765 2268090
13989 2268090 2563065 5034288 10501334 28667770 54221900 24053756 11717217 6625400
13981 6625400 4820503 3855147 2982228 2990619 2981155 2350898 2866212 2641123 2469290 2188330
13971 2188330 2253137 2242785 2416060 2059727 2055856 2149845 2055185 2064936 1704511 1566186 1902801
13960 1902801 1935346 1867584 1731599 1488001 1830219 1447728 1662972 1959127 1689372 1659115
13950A659115j41834J79733n0764l3916J28996J6727M0980l79086J69976J01542
13940A691469j4307j24125J00849k11031L02110l61859M23785o08217K87936l19432
13930A167178J44683J93853J49730m28549O7273K19489k76339j3259J48694J03707
13920A476460n49422L84443J15007m11309N02336l37057K91726O0129k67299j33804
13910A131210O1024K29237J34495n18265J04805k30904M13805j67854q7941J11152
13900A180764J47295p2870P2352m41508N74228m88124K01783L12882k12445k20191
13890A054166m8374r7611J85454k5601r7612P3298L05113l07504K12216l71517
13880H82028K88112k79554K54144J01731l133N1419J21221n47868Q3855J37320
$$ plain form
13950 1659115 1517281 1697014 1646250 1612334 1741330 1758057 1799037 1419951 1589927 1691469
13940 1691469 1677162 1553037 1653886 1442855 1744965 1383106 1806891 1198674 1486610 1167178
13930 1167178 1311861 1505714 1655444 1226895 1294168 1513657 1237318 1224059 1372753 1476460
13920 1476460 927038 1311481 1426488 1015179 1517515 1180458 1472184 1532313 1265014 1131210
13910 1131210 1192234 1421471 1555966 1037701 1142506 911602 1325407 1157553 1069612 1180764
13900 1180764 1328059 1255189 1327541 886033 1460261 972137 1173920 1486802 1274357 1054166
13890 1054166 1005792 908181 1093635 1068034 970422 1043720 1348833 1041329 1253545 882028
13880 882028 1170140 890586 1144730 1246461 1243328 1294747 1415968 868100 951955 1089275
13870A089275j37278n7648l7777K0210Q7205m9736L0562p2803K6285j93743K11649
13859I16201j15925l17157K45553O3934K01411M9741j01543q1862N3807J46419
13849A060579m40626N09297m7293k87036k90205J9503L68397P6867j16052J63747
13839A017178r7401k81723K8183m568K13395l56461L36097R8399o5890j22651
13829G64558N8554j97095j11399K57016J43756o8292k51394K69093j91470K26700
13819I00027l06436K65101L92968n56811j82055M0864M29598l70062L42887l43923
13809F12158J8232L8196r9254K24497P1174J18881k02489k37501o3928J56392
13799F36358k8612J0991K40236k54848Q918J8054j30349j3995J47718r085j68941
$$ plain form
13870 1089275 951997 894349 856572 876782 963987 914251 944813 872010 898295 704552 916201
13859 916201 800276 483119 728672 792606 994017 1043758 942215 860353 914160 1060579
13849 1060579 619953 1129250 1081957 794921 504716 524219 892616 969483 853431 1017178
13839 1017178 919777 638054 666237 661669 875064 518603 854700 953099 887209 764558
13829 764558 823112 626017 514618 771634 915390 847098 595704 864797 673327 900027
13819 900027 593591 858692 1251660 694849 512794 553658 983256 613194 956081 612158
13809 612158 630390 668586 569332 793829 865003 983884 781395 543894 479966 636358
13799 636358 607746 618737 858973 604125 613043 631097 500748 486753 634471 625386 456445
13788D56445K62950J4584k10756J82059l10057J29064k343J09654N0944M8484
13778G31028l43111J43669L08132j36027j71593k50040P5588J87612J18005K50034
13768I13297P3407j40616l21431J34417P962r2408M08724D41617O0512J46628
13758F48757j64178j87403Q8677L7833j43465N78056D09981L36084k65586L96507
13748H76986C07893L10271j89076L91581j69717j18376j29855J25489J68382O3760
13738G60352j23210o8034j99579N8841L22267J2019r5713k8614p0759B53354J32660
13727C86014j58921J84515J13192N28381m52682r4286j46054n0071M9066k7694
13717C31460J12964K4955k32367M45814k29635K36874l43093K83607F8733L98200
$$ plain form
13788 456445 719395 733979 523223 705282 395225 524289 521946 631600 682544 731028
13778 731028 387917 531586 839718 703691 532098 282058 357646 545258 663263 913297
13768 913297 986704 846088 524657 659074 667036 574628 983352 441617 502129 648757
13758 648757 484579 297176 385853 423686 280221 858277 409981 746065 480479 876986
13748 876986 307893 618164 429088 820669 650952 532576 402721 528210 696592 760352
13738 760352 637142 569108 369529 428370 750637 762656 666943 638329 567570 253354 386014
13727 386014 227093 411608 524800 1053181 600499 506213 360159 310088 359154 331460
13717 331460 444424 469379 237012 682826 453191 690065 346972 630579 68733 466933
13707D66933k7110p3225K53219k77293K89279m3569j11098k900j76577N08000
13697H05659o0025k62960O8059H0339N11080k91907J01375P3230o8709j66482
13687B38926M3382N5063J13320L6926j25159l733j16759K765j0265K91484j05025
13676D20925J91781k01396R6597l8013r5294K55557k19607l6733H2189L45592
13666D27781j04441l3658J49506o7929M5324J1019j51449J91883j39970M5359
13656C73425h7532C72669J49978N0998k84133K2843J26330j64134L21387B45545
13645C10217m2153j30282K84076L4557A82944K1370j0300M25893k88315K6207
13635C57799K27663k35260O7369j02454A32592b2967B54566N0866j37871J63020
$$ plain form
13707 466933 439823 366598 619817 342524 631803 588234 477136 474236 297659 805659
13697 805659 745634 482674 550733 80339 591419 299512 400887 474117 405408 238926
13687 238926 282308 337371 450691 487617 362458 358725 241966 244731 234466 525950 420925
13676 420925 612706 411310 507907 469894 374600 630157 410550 373817 82189 427781
13666 427781 323340 289682 439188 371259 416583 427602 276153 468036 328066 373425
13656 373425 -87532 372669 522647 573645 289512 312355 438685 274551 595938 245545
13645 310217 268064 137782 421858 456415 182944 204314 194014 619907 331592 357799
13635 357799 585462 350202 417571 315117 132592 -22967 254566 305432 167561 330581
13625C30581J97444A98551E0150L19684j42785M27514j82630j57643J64571A56081
13614A66853O9339N2615a37579E93601k30845J6973j73111J30749A63429K21853
13604C85282N2259G1095L13269c4098C35000C8233L94688A79595K49281p0251
13594C58625Q1111o0783P4986j77979p306K60232j72948D5601J54794l0000j944
13583A68451p8814L0429N11965l09147A58822L7378f0268A97894p0600L7765P9834
13572B44893D9344M09349j73282B4087L67262j22514A9997K74745L2426N3373
13562C80541j08357J22500K08583A65034J63013O9670o0590f8423C43009j34152
13552B08857J09081J22918B19826J86283A94243K4315a25874B96151a21404B76550
$$ plain form
13625 330581 528025 198551 50150 369834 227049 654563 471933 314290 478861 156081
13614 166853 236192 288807 -137579 593601 362756 379729 206618 337367 163429 385282
13604 385282 437541 71095 384364 -34098 335000 38233 432921 179595 428876 358625
13594 358625 439736 378953 453939 275960 268654 528886 355938 45601 200395 170395 168451
13583 168451 89637 120066 632031 322884 158822 196200 -60268 197894 127294 165059 244893
13572 244893 49344 458693 285411 24087 391349 268835 19997 294742 327168 380541
13562 380541 272184 394684 603267 165034 328047 397717 337127 -68423 343009 208857
13552 208857 317938 440856 219826 406109 194243 218558 -125874 296151 -121404 276550
13541B53044E6982Q6059K8377R1006q8627C2388J45751M25778A41366M20656B01689
13529A1387N7846B1370L29009c9679B28294L1689K44024i5599C16827L62962A83906
13517A63481R1382J81849B14986l9740i6646G9196L87657J80203B76996J35207
13507D12203o4953J037H1540J8336C7677J03467a04289L4616j4056H4050M05097
13496D89147j29071H4236J82546a09020B91223A32496d459l4183A05377Q8343
13486A93720Q7374F1877Q6960P8261M2057P0961j06657K88068A55077C1322R2398
13475A23720K07056b32494B90307K33216B46509B936K73860A20935Q2052b133
13464b2567A25279N07572B88067K09639k04957c5939A66206L12954d4434B76908
$$ plain form
13541 253044 56982 143041 171418 262424 173797 32388 178139 603917 141366 562022 201689
13529 11387 69233 21370 350379 -39679 228294 259983 504007 -95599 316827 679789 183906
13517 163481 254863 436712 214986 175246 -96646 79196 466853 647056 276996 412203
13507 412203 347250 348287 81540 99876 37677 141144 -104289 -69673 -83729 84050 489147
13496 489147 360076 84236 266782 -109020 291223 132496 -4459 -38642 105377 193720
13486 193720 281094 61877 148837 227098 269155 340116 233459 521527 155077 31322 123720
13475 123720 330776 -232494 290307 523523 246509 2936 276796 120935 202987 -2133
13464 -22567 125279 632851 288067 497706 292749 -35939 166206 479160 -44434 276908
13453F03812j73612I5510d9168C8467R2492l5283K7036K69854A90477G1051K6253
13442I7304K1238b10477A96814k8719J89786N8810j86394b74636O2206B72384
13431D1806M06620F0319K13541j13732F0250k7221L92455A04948K59686c41044
13420A45086j448l5627L0046K28145a54551d7322B541K86900F6755L01282A13367
13408b91935B51479j06411J37564j6289m5986o4996K27824A90264J0179K53167
13398D53610b0214A86503F3862Q7552a99793B77556L41578j55039a43331A21232
13387B04070b7511I9784a9023B30544F1541O0002c9478B42064j10215a93584B89331
13375d3187B28261E2234B3944L36707j23781J60260A0737L38943A04761J07172
$$ plain form
13453 603812 430200 95510 -49168 38467 130959 95676 122712 392566 190477 71051 97304
13442 97304 118542 -210477 196814 168095 357881 416691 230297 -274636 -212430 272384
13431 41806 448426 60319 273860 160128 60250 33029 425484 104948 364634 -341044
13420 145086 143638 108011 138057 366202 -154551 -47322 2541 289441 66755 368037 113367
13408 -291935 251479 145068 282632 266343 220357 155361 383185 190264 200443 453610
13398 453610 -20214 186503 63862 151414 -199793 277556 619134 464095 -143331 121232
13387 204070 -27511 99784 -19023 230544 61541 121543 -39478 242064 131849 -193584 289331
13375 -43187 228261 52234 23944 360651 236870 397130 10737 349680 104761 211933
13365B11933K40906A75578J70503i2123D87223A58910F5749L60192C3062K09633
13355B42695H3651J77794J6861q2317K67590l5645o9631F8943j6702K25314G9866
13343B83664r1193L23716K60944C13878c59742B52218k7255M22864k86105q3174
13333B78548A16009a16363A33843h7927B97194j43697l3939d56569i8388E6893
13322I2062c9689p0113L2463C1625j0065K36316J41168j41341J259K78921B10379
13310d9487C21220A52850i9894C5918K02901L7716h4064A20000a89606C57075
13299a20708B7694P8413J24637q606c52415B57507K60988A20405n3626J1901K98895
13288C77575j70686k570G9511J75524R695J53069j77319A17503K37185b75492
$$ plain form
13365 211933 452839 175578 346081 -92123 487223 158910 65749 425941 33062 242695
13355 242695 83651 261445 278306 195989 463579 427934 358303 68943 52241 277555 79866
13343 283664 192471 516187 777131 313878 -359742 252218 224963 647827 361722 278548
13333 278548 116009 -116363 133843 -87927 297194 153497 119558 -456569 -98388 56893
13322 92062 -39689 -109802 -77339 31625 21560 257876 399044 257703 258962 537883 210379
13310 -49487 321220 152850 -99894 35918 238819 276535 -84064 120000 -189606 357075
13299 -120708 27694 106107 230744 222138 -352415 257507 518495 120405 66779 78680 377575
13288 377575 206889 204319 79511 255035 264730 417799 240480 117503 354688 -275492
13277a99367B88515m0114d5285E1461J67859a77165a7666B30552a34561C75422
13266B15160J03592k9575i8311A99012K8925J6050J76064a0869G7424l5875J80611
13255B22160A04393J27474a02409F8026K39503R3787j49282J080B5838b22376
13244C59937a02368M1264A27488D9508a69335L8486A17762K73863D9345h0550
13233B03807k3254J16437c2626l6912H8999C2203h5795A38134l5591K3649K88936
13222D15128l9278A46965L7685l4472p0697a1705E92633E3995O9758B7922K08613
13211B36535o392h6023a9439l06170B60939f1621K5286j27842G8192A599a71395
13199D5420f5660C68706a71638B09983a02268E3830B0240L11514A18947N3223
$$ plain form
13277 -199367 288515 248401 -45285 51461 219320 -177165 -17666 230552 -134561 375422
13266 215160 318752 289177 -98311 199012 227937 243987 420051 -10869 77424 41549 222160
13255 222160 104393 231867 -102409 68026 307529 401316 252034 253114 25838 -222376
13244 359937 -102368 -61104 127488 49508 -169335 -130849 117762 391625 49345 -80550
13233 203807 180553 296990 -32626 -69538 88999 32203 -85795 138134 102543 126192 415128
13222 415128 375850 146965 184650 150178 79481 -11705 592633 53995 123753 27922 236535
13211 236535 230143 -86023 -19439 -325609 260939 -61621 -36335 -164177 78192 1599 -171395
13199 45420 -65660 368706 -171638 209983 -102268 53830 20240 331754 118947 172170
13189A72170n6674b20277A516K3215a78154f5985o7942F244K61598c6189j9981
13178e6170j77167a801D06811a7059C5166K13505C8600J15897m4005D6577a71185
13166H1279h3367C3861b27369I4524A8415b25228I3753J86463o6191a09816E8095
13154E0023L68061E2164c9503j8368A0999J03955J71042b38474c8018A6005P3762
13143H9767O0063A1097K26412a37079A3366b0964I0318b3685k31801B76033o0163
13132B15870F4778J14124g7339p9399D678J5800a5333M217A33606K04882C0575
13120A78695G5635J651i4751j03012C4484j6594i239I6252J15818I5284b37451
13108A81264a47859H3123a32691j6365C7036b0658F4902b30520c2311q9972B1290
$$ plain form
13189 172170 115496 -220277 1516 24731 -178154 -65985 -133927 6244 267842 -36189 -56170
13178 -56170 -233337 -1801 406811 -17059 35166 248671 38600 154497 110492 46577 -171185
13166 81279 -83367 33861 -227369 94524 18415 -225228 93753 280216 214025 -109816 58095
13154 50023 418084 52164 -39503 -57871 10999 114954 285996 -238474 -38018 16005 89767
13143 89767 149830 11097 237509 -137079 13366 -20964 90318 -23685 -255486 276033 215870
13132 215870 64778 178902 -77339 -156738 4678 20478 -15333 -11116 133606 338488 30575
13120 178695 75635 77286 -94751 -197763 34484 17890 -9239 96252 212070 95284 -237451
13108 181264 -147859 83123 -132691 -149056 37036 -20658 64902 -230520 -32311 -122283 21290
13096H968J55555a16789E7399J94361c05569Q6101B45629F6447K30713R5669i0740
13084c575j84623a1196B85746f1906C6670I086J54404g9613B25448E9288K305
13073F1593L35984f7106o9010A69301a93601F4149R5731M8226O5358p8347a06341
13061C0506J39347J6098a38394B34306I537b42243a1729m8081C1892b1691q643
13050c0334j34360C69895h7645A58954b5643D9601K94721A08562N550c1056A89886
13038G8282b10171b2701k0555J3305C09544O9125b6323A20914B2981J41128C3193
13026A79980c8310E1070L63483E7469O7418J87647A2752J91371e719D9028L5099
13015H4127L19982A23864C1429a8280B13777q7954a0314o9063I0310K87587a24075
$$ plain form
13096 8968 164523 -116789 57399 251760 -305569 -219468 245629 66447 297160 392829 -90740
13084 -3575 -188198 -11196 285746 -61906 36670 9086 163490 -79613 225448 59288 61593
13073 61593 397577 -67106 -136116 169301 -193601 64149 159880 208106 273464 195117 -106341
13061 30506 169853 185951 -138394 234306 9537 -242243 -11729 -59810 31892 -21691 -30334
13050 -30334 -164694 369895 -87645 158954 -25643 49601 344322 108562 114112 -31056 189886
13038 78282 -210171 -22701 -43256 -29951 309544 378669 -26323 120914 22981 164109 33193
13026 179980 -38310 51070 414553 57469 124887 312534 12752 204123 -5719 49028 84127
13015 84127 404109 123864 31429 -18280 213777 125823 -10314 -79377 90310 377897 -124075
13003H4657K54179A17864P476K23834G2052N3928A8762M22757H6979h9698J6296
12992g3402B12876a9425A55369J27347A40289l7414e7479j28355A63369E2581
12981D7081a46971B55349i3776D1296P8053f77B03578h378A62811d60498H2573
12969C9276K47847c21847d8929k33515J38674j50171i0307D92914B09645b13389
12958B90788F9042d3430H1760A7355J12345i513k46693D40950A170i3242A12401
12946i0800M0537D6971c0678E9160j3165a03114B19902f2439K5712n8059n1984
12935a46770G1968O971b209G1940b36776b2303H532a06378N0910C7227P0904O2795
12923A70926J7649b16708d5864j9854A38022a16204C32994H0047i4819D5669a6667
$$ plain form
13003 84657 338836 117864 125340 349174 72052 125980 18762 441519 86979 -89698 -73402
12992 -73402 212876 -19425 155369 282716 140289 102875 -57479 -185834 163369 52581
12981 47081 -146971 255349 -93776 41296 119349 -677 203578 -8378 162811 -460498 82573
12969 39276 287123 -321847 -48929 -282444 -143770 -293941 -90307 492914 209645 -213389
12958 290788 69042 -43430 81760 17355 129700 -9513 -256206 440950 1170 -93242 112401
12946 -90800 -50263 46971 -30678 59160 45995 -103114 219902 -62439 -36727 -94786 -146770
12935 -146770 71968 78939 -2209 71940 -236776 -22303 8532 -106378 -55468 37227 108131 170926
12923 170926 188575 -216708 -45864 -65718 138022 -116204 332994 80047 -94819 45669 -16667
12911b13208h815j39263n376P5780K191A93815J32861B8348F210b93195a02172
12899f9976G9490a59129D17002q1339I7641g4606D9039a59957b6483B74206j10645
12888A63561N2498j2471f3336B40132c958A03794A4919a06562M0129d371A47728
12876c3113A25351B67L9126P5618K6900a94751N2252C19355H8037K10666g7551
12864C6320J78024f176B28610b57133F8044d1557A91755p6040E204J68493c0244
12852a94481B01815b37260J16616f870k46813a0373A23056b12307E3027J15383
12842A68410j9208c58901a22063B31115r0006m2044L35012a0967j5075G3896A7359
12830I5173J86612A8641L52010j81750a3852k55964J14369C59600p5413p6765
$$ plain form
12911 -213208 -8815 -148078 -153454 -77674 -75483 193815 326676 28348 6210 -293195 -102172
12899 -69976 79490 -159129 417002 335663 97641 -74606 49039 -159957 -26483 274206 163561
12888 163561 216059 203588 -63336 240132 -3958 103794 14919 -106562 -66433 -4371 147728
12876 -33113 125351 267 39393 115011 141911 -194751 -142499 319355 88037 298703 -77551
12864 36320 214344 -6176 228610 -257133 68044 -41557 191755 115715 5204 173697 -30244
12852 -194481 201815 -237260 -120644 -6870 -253683 -10373 123056 -212307 53027 168410
12842 168410 149202 -358901 -122063 231115 141109 99065 434077 -10967 -26042 73896 17359
12830 95173 281785 18641 370651 188901 -13852 -269816 -155447 359600 284187 207422
12820B07422B6698d20858I8099k3459a40764f4493B54470A07545a57428A56413
12809A03701J1089k1858a68024c9477K838k52987a03689H975c89998e3260B874
12797e29849G3149B0796c0911J1639A46014e614m6085a614k39178A34214E6108
12785C13201j23053a17064o6810F1045b32534f637l719B59724n2277c952I5781
12773i7277D95247a12315N3757j07273o4569P9938A19115f6501o5142B04245r7015
12762A07230a38482l56215a25057C7759L9974J31150l8139C1229d6042n4662n8468
12751a59172B70894A23943d9632C58050F495Q3122C9895f8546b9231I2157c8988
12739a37555A49263a13532C64836C0792b84737D0127K18185a61399b9717A66280
$$ plain form
12820 207422 26698 -420858 98099 74640 -140764 -64493 254470 107545 -157428 156413
12809 103701 114790 92932 -168024 -39477 -36639 -289626 -103689 8975 -389998 -53260 2874
12797 -529849 73149 20796 -30911 -19272 146014 -5614 -51699 -1614 -240792 134214 56108
12785 313201 190148 -117064 -183874 61045 -232534 -6637 -10356 259724 207447 -3952 95781
12773 -97277 495247 -112315 -58558 -165831 -230400 -150462 119115 -66501 -131643 204245 107230
12762 107230 -138482 -494697 -125057 37759 77733 208883 170744 31229 -46042 -100704 -159172
12751 -159172 270894 123943 -49632 358050 6495 89617 39895 -68546 -29231 92157 -38988
12739 -137555 149263 -113532 364836 30792 -284737 40127 258312 -161399 -29717 166280
12728a7903B82596f2055j55958j9308C3959d7922B04327G3021e7674k6006l5605
12717a19285l3108b415n9272A87348a8809C5281M17536a03009b6441E14080k43654
12706B70426O2420I0034h9874j7690M9062j13047K0388C0124f0287H5790l1281
12695E4509a31227A20259b06050n9870f5586p0252c5707j7749J6565I3188a07227
12683B32314o2552J29022C5165M2805I852J81497b8762l8030A92586a83434A0468
12671A17437K3860K1223j0843m6174i416j26614I1061k1539a2088l9750B14620
12659A0979B520K64667L659r4528M847C7474A035c0104B22288D3766J68479E2393
12646A97956A4490c2433A28475E775J0640Q4003Q9417a20203d2949m005A90019
$$ plain form
12728 -17903 282596 -62055 -218013 -237321 33959 -47922 204327 73021 -57674 -83680 -119285
12717 -119285 -152393 -2415 -61687 187348 -18809 35281 452817 -103009 -26441 514080 270426
12706 270426 332846 90034 -89874 -107564 -58502 -171549 -151161 30124 -60287 85790 54509
12695 54509 -131227 120259 -206050 -265920 -65586 -135838 -35707 -53456 -36891 93188 -107227
12683 232314 169762 298784 35165 77970 9852 191349 -28762 -66792 192586 -183434 10468
12671 117437 141297 162520 151677 105503 -9416 -136030 91061 69522 -12088 -51838 214620
12659 10979 2520 267187 270846 176318 181165 37474 1035 -30104 222288 43766 212245 52393
12646 197956 14490 -32433 128475 5775 16415 100418 189835 -120203 -42949 -46954 190019
12634C61898A18764D2466K08575J34350A17002J23724L4452L2851A48607l1416
12624A17191o622J39143A01665a4711j17388H2186h6355I9938i3339A54417D8628
12612c869j24007K7131n1665e4311H7058j2823k850J66475d33444E1962M3400
12601I5362e3792F8115J08170J72426j73399G3080K20791f6620a9788A07879a42056
12589B31574e5750K1846A26181e1707G103J6116a34348p4888K6602c8266a3024
12577I1904a25705o7131E1789c29434A2412J89131A8343h2186C0152K30184a50834
12565a41817C9713a70973B22217h1806A26094J62769b19080C63393A08109K35328
12555C43437d5690K2022A54569f5631j12719A73020a15057A9766P3130R0615K6586
$$ plain form
12634 361898 118764 42466 251041 385391 117002 240726 275178 308029 148607 117191
12624 117191 110569 249712 101665 -14711 -132099 82186 -86355 99938 -93339 154417 48628
12612 -3869 -127876 -100745 -152410 -54311 87058 74235 71385 237860 -433444 51962 95362
12601 95362 -53792 68115 176285 348711 175312 73080 293871 -66620 -19788 107879 -142056
12589 231574 -55750 -33904 126181 -51707 7103 23219 -134348 -209236 -182634 -38266 -13024
12577 91904 -125705 -192836 51789 -329434 12412 201543 18343 -82186 30152 260336 -150834
12565 -141817 39713 -170973 222217 -81806 126094 288863 -219080 363393 108109 343437
12555 343437 -45690 -23668 154569 -65631 -178350 173020 -115057 19766 92896 183511 210097
12544B10097c7838E7144a8065A07522a49789m1208D2689K2619H681b46518a5729
12532E2278a33413A97213K3577Q6385H1784C5793a03226A53475E532K07083a89576
12520b89217c5354G4847B9589J32412n0004d9518A32967b57659E8647L63649b31439
12508a15191B56141f0010l4500A11480a09033f118B85072A03573a30481A1015
12497C9848i6901A08715O4869R7408b57218H4549n574b39361A90750H3143a0195
12485B22363p7935g698F1738b0565r5556A32622C5071b31786L9811O9601k59464
12474c81838H5945K14180j07657b47667a01602H3459a90668J4237M9440k07365
12464c34356M74K5861a5823A80803d13225J83099a3702j22403B50738m1389a61810
$$ plain form
12544 210097 -37838 57144 -18065 107522 -149789 -190997 42689 65308 8681 -246518 -15729
12532 52278 -133413 197213 220790 307175 81784 35793 -103226 153475 5532 212615 -189576
12520 -289217 -35354 74847 29589 162001 111997 -49518 132967 -257659 58647 422296 -231439
12508 -115191 256141 -60010 -94510 111480 -109033 -6118 285072 103573 -130481 11015
12497 39848 -96901 108715 173584 270992 -257218 84549 78975 -239361 190750 83143 -10195
12485 222363 144428 -7698 61738 -20565 -116121 132622 35071 -231786 -191975 -122374 -381838
12474 -381838 85945 300125 192468 -247667 -101602 83459 -190668 -176431 -126991 -334356
12464 -334356 -333882 -308021 -15823 180803 -413225 -230126 -13702 -136105 250738 209349 -161810
12452h123j18039B80927e098o8405p8088B49939C6497N4643D0420L6824J925e58566
12439G3425f3438j1366A04795D8130c1248C43789j61806h72m93211J67725a05102
12427b99272c0495B39327H4657c5535A12364a07724c233p9518C9213b17027D08565
12415b03749A59565L34044C7573K91533q8129j14139a19534M7597k5298A22165
12404a16272A42782b65963A00261c675A44168F9651J79436B2595p087a05028J9105
12393h5923m2104j07078P7063E0907a02066A62387K50445b68467q5578J75872
12383a78173D97131A71216a55027J3507j02519m2855A95294a20618A57096i3241
12372G8475a40837k187A48735J95728C611P9179a94856A63058C7649L30359i5981
$$ plain form
12452 -8123 -126162 280927 -5098 -73503 -151591 249939 36497 91140 40420 77244 79169 -558566
12439 73425 -63438 -74804 104795 48130 -31248 343789 181983 -872 -494083 -326358 -105102
12427 -299272 -30495 239327 84657 -35535 112364 -107724 -3233 -82751 39213 -217027 408565
12415 -203749 159565 493609 37573 329106 240977 126838 -119534 -71937 -97235 122165
12404 -116272 142782 -265963 100261 -3675 144168 69651 249087 22595 15508 -105028 -85923
12393 -85923 -128027 -235105 -158042 50907 -102066 162387 412832 -268467 -354045 -178173
12383 -178173 497131 171216 -155027 -141520 -244039 -286894 195294 -120618 157096 -93241
12372 78475 -140837 -143024 148735 344463 3611 82790 -194856 163058 37649 368008 -95981
12360e5940p019A65816J0556m6853e1198A59151a74530d1087o9657A52072D4296
12348c2151A44941j7809A0837Q6865h0567R949C03615j48376a02911A37245E6536
12336A59379b2093j50434k24183D35957F5603J3601J32925H5438a63090g6419
12325e5922A68682a38127A37704K6095e4914j5333k30722A20020e00942A09046
12314G0659a16316d7927j82130B01R0883a83374B3531K6168b26446c1206B16473
12302c07642A56579g9977L5305j9161F6058c77694J64902A65977i5900b5902j50955
12291a76857e8017B00994a39439A8168g2687E0702a45396I3745O4261G7341K71729
12280C49070d24827B00819A827a69805A03591L223L0891O1567J21785A12104R113
$$ plain form
12360 -55940 -62959 165816 176372 129519 -51198 159151 -174530 -41087 -110744 152072 44296
12348 -32151 144941 127132 10837 97702 -80567 -70618 303615 155239 -102911 137245 56536
12336 159379 -22093 -172527 -396710 435957 65603 79204 212129 85438 -163090 -76419
12325 -55922 168682 -138127 137704 163799 -54914 -70247 -300969 120020 -500942 109046
12314 70659 -116316 -47927 -230057 201 91084 -183374 23531 49699 -226446 -31206 216473
12302 -307642 156579 -79977 -44672 -63833 66058 -377694 -212792 165977 -95900 -25902 -176857
12291 -176857 -58017 200994 -139439 18168 -72687 50702 -145396 93745 158006 77341 349070
12280 349070 -424827 200819 1827 -169805 103591 106814 137705 199272 321057 112104 121217
12269A21217J92749a3890C74869H2763J41541P400I1296b3852p6629I0984b900
12257A04718k0684J06911I3548J08331j9023o7354n87N8917C515L86691j53852
12246B36354H4784k3995J40729B85K08927c84356B4601c32338C64988A59576J9302
12235A78878m5364K1720b6895A86200h9610F1202M228J71144J0024I0581J64205
12224B54786q4070e6707C07115l3275H6875J13834g059B72837J40825A06680L04100
12213D10780j01904K61499f6541B72778A02594K31052A44937n7460L7450M7543
12203A72470b24172D52996j60153j08168J29869o8480a6417C45975j70067L02012
12193D77920B04016J40900j02683J24940B341a0650H3568a5866H6317J76556b3144
$$ plain form
12269 121217 313966 -13890 374869 82763 224304 231704 91296 -23852 -100481 90984 -2900
12257 104718 84034 190945 93548 201879 182856 115502 114915 173832 3515 390206 236354
12246 236354 84784 60789 201518 285 209212 -384356 24601 -332338 364988 159576 178878
12235 178878 133514 155234 -26895 186200 -89610 61202 65430 236574 246598 90581 254786
12224 254786 170716 -56707 307115 273840 86875 200709 -7059 272837 413662 106680 410780
12213 410780 308876 570375 -66541 272778 102594 333646 144937 87477 124927 172470
12203 172470 -224172 452996 292843 184675 314544 246064 -16417 345975 175908 477920
12193 477920 204016 344916 242233 367173 2341 -10650 83568 -15866 86317 262873 -23144
12181A20115a0576m2190R096J2716A10638a0701B84691H7803b1911C23504o1609
12170B61895j8134A5285O9983O9807M7959i051B77088r7376J47142A41223K07115
12159C48338j04541j05997b1945A05367n2089a4976B26346a10739A12087c46797
12148I3100f9310F3896M9862a66668b7614A7159M8117K83362d6463B48086a50519
12136a04985B5288a22285b5100n7239f757A59063J05412a44995R006B70169g4181
12124I5597h289B80328r8155c04377C1322N4069M1116e7785A59479m3341L0432
12113A46570E7070g0428B7577b96799g3695j31205K4820B9397b65789e4065j80563
12102b34628D6543a79225A12473d8226l2821A33298l9521a01495A88929b46578
$$ plain form
12181 120115 -10576 -52766 -43670 -30954 110638 -10701 284691 87803 -21911 323504 261895
12170 261895 243761 15285 85268 155075 203034 -9051 277088 179712 326854 141223 348338
12159 348338 243797 137800 -21945 105367 53278 -14976 226346 -110739 112087 -346797
12148 93100 -69310 63896 113758 -166668 -27614 17159 65276 348638 -46463 248086 -150519
12136 -104985 25288 -122285 -25100 -82339 -6757 159063 264475 -144995 -135989 270169 -74181
12124 95597 -8289 280328 182173 -304377 31322 85391 126507 -57785 159479 116138 146570
12113 146570 57070 -70428 27577 -296799 -73695 -204900 -180080 29397 -265789 -54065 -234628
12102 -234628 46543 -179225 112473 -48226 -81047 133298 93777 -101495 188929 -246578
12091a83995j22551C44105A36622i2858A99942E0650J18932a81885J2330b5516
12080h2927C26604M6722Q30767J591416A028091m84397H5257Q6468a17210M1043
12070g6167L3757A55706h5012C23561E7646N7034g273H5432l0302b58529b5367
12058e118A07521i7243D33779a76004N9857a7729A77183P5786b0156C81440i6699
12046b8264B10261B1533b37033a8989j47698A16073K6318d1349A63169a15912
12035A5238J17950a50997A78486p4879F788f0973E8067J4230j7374a31419j44189
12024b75608j49483B27595H1550A359d23355a53999G278b22298B27349P0835j26036
12013A72148L9416k9414a21387j16199C8255d5903A56651i3519C06613b40803
$$ plain form
12091 -183995 -306546 344105 136622 -92858 199942 50650 169582 -181885 -169555 -25516
12080 -82927 326604 373326 1204093 2795509 1028091 543694 85257 171725 -117210 -76167
12070 -76167 -42410 155706 -85012 323561 57646 114680 -7273 85432 55130 -258529 -25367
12058 -5118 107521 -97243 433779 -176004 -116147 -17729 177183 252969 -20156 381440 -96699
12046 -28264 210261 21533 -237033 -18989 -166687 116073 142391 -41349 163169 -115912
12035 15238 133188 -150997 178486 103607 6788 -60973 58067 72297 54923 -131419 -275608
12024 -275608 -425091 227595 81550 1359 -423355 -153999 7278 -222298 227349 298184 172148
12013 172148 211564 182150 -121387 -237586 38255 -45903 156651 -93519 306613 -240803
12002A65008b01491B14982i314A73491l299D5964O1478a33933H1947b6456F9194
11990I2219b59080q5790J64112O0540B7615R515A1240K2433a70893I0372g3738
11978d77920A36093n3432A8886d9177k05351b2843B66203E9777M1217a34033n7882
11967a91915o013j20028a30838n5090K9847A73877a23810n90306c43040a29122
11956a01475A18763J2036a12151j21341a10847j48093h8945J7417I8519D720R990
11945A4710g1781D8559a54942A52179b75998C4100a10955k48573J67231I8857
11934G7246K53961a06616A06260d44067K05272A38531B7331h5790B57737c6287
11923A92091b26835d0712j47903A89454n3174a04612J656A0156R4807L9099K2230
$$ plain form
12002 165008 -201491 214982 -9314 173491 170192 45964 107442 -133933 81947 -26456 69194
11990 92219 -259080 -344870 -180758 -120218 27615 37130 11240 33673 -170893 90372 -73738
11978 -477920 136093 82661 18886 -49177 -254528 -22843 266203 59777 100994 -134033 -191915
11967 -191915 -197928 -317956 -130838 -185928 -156081 173877 -123810 -714116 -343040 -129122
11956 -101475 118763 130799 -112151 -233492 -110847 -258940 -88945 -71528 98519 4720 14710
11945 14710 -71781 48559 -154942 152179 -275998 34100 -110955 -359528 -192297 98857
11934 77246 331207 -106616 106260 -444067 -238795 138531 27331 -85790 257737 -36287
11923 192091 -226835 -40712 -188615 189454 136280 -104612 -102956 10156 104963 144062 166292
11912A66292B2189c04980i0883k2711m7687c7658D6718i1924a0156k6097j74785
11901b11038B01257D506Q0711a01869A33593A1899L57633A82995b34065i3415
11890A04797a07801A51611L1J34638A02553b92028a0045l69916A14925a11995
11879a63282j4445g2733B04134a80062B32696A1293J60168a00094k30137J05239
11869b24992A0212a15405L9089A80113a0439j11934B3174a34777A7310a72200
11858H6957L5722h2467j4569A6050a41803k18383J70077f5725C07831F8581B9472
11846D1878a43606p726o7331D61465E8788O8240O6137q6721g2475C87026a12582
11834C440d8121E1222h2786A74824a8592l898k40660a14269I8346C8264J33864
$$ plain form
11912 166292 22189 -304980 -90883 -113594 -161281 -37658 46718 -91924 -10156 -36253 -211038
11901 -211038 201257 4506 85217 -101869 133593 11899 369532 182995 -234065 -93415
11890 104797 -107801 151611 151642 286280 102553 -292028 -10045 -379961 114925 -111995
11879 -163282 -177727 -72733 204134 -180062 232696 11293 171461 -100094 -330231 -224992
11869 -224992 10212 -115405 -76316 180113 -10439 -122373 23174 -134777 17310 -172200
11858 86957 122679 -82467 -97036 16050 -141803 -360186 -190109 -65725 307831 68581 29472
11846 41878 -143606 -151332 -218663 461465 58788 127028 193165 106444 -72475 387026 -112582
11834 3440 -48121 51222 -82786 174824 -18592 -22490 -263150 -114269 98346 38264 172128
11823A72128a80565A8127L3152n896b33795E1022g2334I4765O3227C0339K2204
11812E2543f705j58588m7437a4430D48242a59491M5722G7908b85816B0674J27659
11801A48333M2026b53363K2454B99447j38928M1424c2792k62706B47367A7012
11790E4589K5521R9138b05880A3116K790Q608L8321K71016i4506j14113B05373
11778a23257D3577a93964h2636E59199B55129c12978A08110E0838K16356b24306
11767a55786L3965j9368B89466a20131A1527J45539I005c8733G2998c7985j56493
11756a94478A46860a325H1088a73055g6326c4708a958G739K34565a28100A43493
11744f8352I5858C2242a00798a4706p7093A0839e8538n2634D15381C3281c8982
$$ plain form
11823 172128 -180565 18127 51279 45383 -233795 51022 -72334 94765 157992 30339 52543
11812 52543 -6705 -165293 -212730 -14430 448242 -159491 -113769 77908 -285816 20674 148333
11801 148333 190359 -253363 -230909 299447 160519 201943 -32792 -295498 247367 17012
11790 54589 80110 179248 -205880 13116 15906 24514 62835 333851 -94506 -208619 205373
11778 -123257 43577 -193964 -82636 559199 255129 -312978 108110 50838 267194 -224306
11767 -155786 -121821 -141189 289466 -120131 11527 157066 9005 -38733 72998 -37985 -194478
11756 -194478 146860 -1325 81088 -173055 -76326 -34708 -1958 7739 242304 -128100 143493
11744 -68352 95858 32242 -100798 -14706 -91799 10839 -58538 -111172 415381 33281 -38982
11732G8289a47648L9937C3032J96895l1681c4847C8089d7867A32370d2317E2363
11720A68894H2519A6433R9744n5141Q7485I644K58468C6628L9726a32367B78247
11708i2512l5463l258a3000k46655a08991B8205i7645A2833a0637k01145c2752
11696f0527F9189a61137B22225C2373b3317j17172K8585A64475c57166b8652B94075
11684d5568k3714b155A79293m7190i2324n5050A56857G0856J15446p4053b1790
11672i740A47026n5637m3499a88702E3571G571J09788Q7085o7859a63400E4022
11660c86645I6655C870e22244A22107E7512J75376M4520a47627b5577A75564G8773
11648b41309B8414d19680R4984k10058a68710b6856q0391D7682k2675A1919K81713
$$ plain form
11732 78289 -147648 -107711 33032 229927 198246 -34847 38089 -47867 132370 -42317 52363
11720 168894 82519 16433 116177 61036 148521 9644 268112 36628 76354 -132367 278247
11708 -92512 -127975 -131233 -13000 -259655 -108991 28205 -97645 12833 -10637 -211782 -32752
11696 -60527 69189 -161137 222225 32373 -23317 -140489 -111904 164475 -357166 -28652 294075
11684 -45568 -69282 -2155 179293 132103 -92324 -147374 156857 70856 186302 112249 -21790
11672 -9740 147026 91389 47890 -188702 53571 7571 117359 204444 136585 -163400 54022
11660 -386645 96655 3870 -522244 122107 57512 232888 277408 -147627 -25577 175564 78773
11648 -241309 28414 -419680 -324696 -534754 -168710 -26856 -107247 47682 25007 11919 293632
11637B93632b9050n2245A65659a43000c1865j70289n2071Q2765D34127j64418
11627B69709E1721c1459C35742I3275M08919B00163i1173H5070J51032a05990
11616b55937A29713o332e8566A44522d1874j06183k05412B32908a79425A44498
11605G2240J50505b85846H4054m2021d0587A36501B656L3018J4006H109O508L34520
11593C49137i7964D2864b87098H5463b0525H4651K1881c9749C07765j06558j9950
11582A81257A7280a40471H1090k0056A8595i5574G3789a67656A6050a64736I8512
11570C15376N7647A31130P1973a07017F9348J16874k8106o6995b19795A23143
11559H4480o924a32301B98553G4354J87981A04602J35806i9109k0089B70552O8953
$$ plain form
11637 293632 -29050 -81295 165659 -143000 -31865 -202154 -254225 -171460 434127 269709
11627 269709 51721 -31459 335742 93275 502194 200163 -91173 85070 236102 -105990
11616 -255937 129713 123381 -58566 144522 -41874 -148057 -353469 232908 -179425 144498
11605 72240 222745 -285846 84054 42033 -40587 136501 2656 35674 49680 8109 14617 349137
11593 349137 -97964 42864 -287098 85463 -20525 84651 106532 -39749 307765 201207 181257
11582 181257 17280 -140471 81090 61034 18595 -95574 73789 -167656 16050 -164736 98512
11570 315376 373023 131130 203103 -107017 69348 186222 158116 91121 -219795 123143
11559 84480 77556 -132301 298553 74354 262335 104602 240408 -99109 -119198 270552 339505
11548C39505j31035b3075I5026b56186B29549b21494A9064N4604i6718D7682b20859
11536A9881Q1440J99928M450C0406Q7255O6855e9312A29146b99018A32282a22187
11524C50150h5688A7889J05766J38945a1497p8322H7661L1870J95966a20468B68780
11512D6309b3560A97077P3157b8318A72522i4966A67316d786A21887E2452a36591
11500A22563J90355b79591B4281L71787J176C1050J2396d464A5809b61676A8085
11488d1646B22832a38347E9360m327a28896B26738N3607L1528A0816K31613K39497
11477D81926A96478C5132L05237b2700B90461j04327J78897d5611A02239m7320
11467E4919d1371A60256g7407a355A86903F1317a1094I2273J75186b80803B15625
$$ plain form
11548 339505 208470 -23075 95026 -256186 229549 -221494 19064 73668 -96718 47682 -220859
11536 19881 101321 301249 305699 30406 117661 184516 -59312 129146 -299018 132282 -122187
11524 350150 -85688 17889 123655 262600 -11497 -89819 87661 119531 315497 -120468 268780
11512 46309 -23560 197077 270234 -28318 172522 -94966 167316 -4786 121887 52452 -136591
11500 122563 312918 -279591 24281 396068 397244 31050 43446 -4464 15809 -261676 18085
11488 -41646 222832 -138347 59360 55033 -128896 226738 280345 311873 10816 242429 481926
11477 481926 196478 35132 340369 -22700 290461 186134 365031 -45611 102239 54919
11467 54919 -41371 160256 -77407 -1355 186903 61317 -11094 92273 267459 -280803 215625
11455D79249a74814d1820j79792C11102H8086a05892B13301e7567A75354l162
11445A72192K65185b8443j46661I1403C4862K73850O3342A24362K0739A7747g3700
11433b22335A56972a14999A39140J95009a12738k49117A85381a46330I4505B055
11422e9922I0123K61368e51m8754B14309h8865F6154e4999B38698f590j13353
11411a19943C53603A48981e515k05890A67616a41386A49660J69605A44531A9072
11400b96097J22845F929a6376B40098c86288B775M82962A47495f9348A454b69474
11388f436D5899a58554a0384l5140k82809B16525b56513C53818j21067G1992N3793
11377A25785a06386B49690d7320K0953C7067b28185f2405k8618k7580B21379m1095
$$ plain form
11455 479249 -174814 -41820 -221612 311102 88086 -105892 213301 -57567 175354 172192
11445 172192 437377 -28443 -175104 91403 34862 308712 372054 124362 145101 17747 -73700
11433 -222335 156972 -114999 139140 334149 -112738 -361855 185381 -146330 94505 2055
11422 -59922 90123 351491 -551 -49305 214309 -88865 66154 -54999 238698 -6590 -119943
11411 -119943 353603 148981 -5515 -211405 167616 -141386 149660 319265 144531 19072
11400 -296097 -173252 6929 -16376 240098 -386288 2775 485737 147495 -69348 1454 -269474
11388 -6436 45899 -158554 -10384 -45524 -328333 216525 -256513 353818 232751 71992 125785
11377 125785 -106386 249690 -47320 -26367 37067 -228185 -62405 -91023 -118603 221379 180284
11366A80284c91902a19109j35042d4412r7061d6543A87125a36532e982o7293j85667
11355b58942n6809H989i7477F8398a51640L8852j50721h3755j9038A06715J09611
11344B16326a09538e684B49958b14398E0535b32710I194M9480J95802c21191J50975
11333a70216j85239e3281j1698A34698a21602A61421G550a2389m0110j39666N1096
11322a41069c4429J476l7377B58875b6118q4326a7964n3661a4538A46911d2916
11310a06049l31813c9601J0174D4062b5193j96348r230J06947L2379l0644N2290
11299f9799B61336q5512D8395c5393j10019A5625J41100H35O4079h7850a6518
11287a78777l5924j6455f5803A47855a02545E3706b01793q3266a26927O2786D6112
$$ plain form
11366 180284 -391902 -119109 -254151 -44412 -141473 -46543 187125 -136532 -5982 -73275 -258942
11355 -258942 -315751 8989 -97477 68398 -151640 -112788 -263509 -83755 -102793 106715 216326
11344 216326 -109538 -5684 249958 -214398 50535 -232710 9194 58674 254476 -321191 -170216
11333 -170216 -355455 -53281 -64979 134698 -121602 161421 7550 -12389 -52499 -192165 -141069
11322 -141069 -34429 -32953 -70330 258875 -26118 -110444 -17964 -71625 -14538 146911 -42916
11310 -106049 -437862 -39601 -29427 44062 -25193 -221541 -230771 -123824 -91445 -122089 -69799
11299 -69799 261336 175824 48395 -35393 -145412 15625 156725 835 64914 -87850 -16518
11287 -178777 -214701 -231156 -65803 147855 -102545 53706 -201793 -285059 -126927 -64141 46112
11275A84348a49119A96077a133C758i8483I591a58757A59420E8172d9465A14807
11263a81286N3757m6741j28989A58381R2770A02434M264c12999a14410A57680
11252c74510A8443c24601a32283l0274N7446q0606Q7096D2524M3454b50363f9270
11240A03016b06274j2188C0964J5006c89646f029m6341B09675b31802B26020A07174
11228G3704i2059p1842A92623G9156k4455a28731k8352A0000g6007F337c72563
11216b79032A30187b6601A88295i8041B9967d9904A72193c73830R8427B11437
11205a47430D4141J5425A7474N9677a51441A67491G8011Q5153e8620j84587N5725
11194a87482i156C42323a0368p9898a0308D0192J06339e5650k11390a12039A28205
$$ plain form
11275 184348 -149119 196077 -1133 3758 -98483 9591 -158757 159420 58172 -49465 114807
11263 -181286 -127529 -174270 -303259 158381 251151 102434 106698 -312999 -114410 157680
11252 -374510 18443 -324601 -132283 -162557 -105111 -185717 -98621 42524 85978 -250363 -69270
11240 103016 -206274 -218462 30964 45970 -389646 -6029 -52370 209675 -231802 226020 107174
11228 73704 -92059 -163901 192623 79156 54701 -128731 -157083 10000 -76007 6337 -372563
11216 -279032 130187 -26601 188295 -98041 29967 -49904 172193 -373830 -275403 211437
11205 -147430 44141 59566 17474 77151 -151441 167491 78011 163164 -58620 -243207 -187482
11194 -187482 -9156 342323 -10368 -90266 -10308 40192 146531 -55650 -267040 -112039 128205
11182A27310a9586D6381E334J07644b4950A26364Q9553C2452K64151a32173r7343
11171b29516m355c3614D9356a78097b6055B35403c03245K0560h5532k36083J41799
11160a79816G5055O0074E8534J41164b68668R9167A85735a4827o8220C40534i7874
11148b08511A26584b8363I2069k4628K21113d72213B31927B7991a95779A31807
11137B59855H3142a42569F4499a28738j30539b7619k532A40827c7788k27128n5400
11126c20316A10974b28860C37875j10649H8749i8820G4205K68045A08053K3629
11116A31682o3003i3433B0948L22981a34441A27869k180q284c3216D04610A61083
11104a63125A85591p8452l2488R5441b28258C31760k8695n9178j18087J04477
$$ plain form
11182 127310 -19586 46381 5334 112978 -24950 126364 215917 32452 296603 -132173 -229516
11171 -229516 -233871 -33614 49356 -178097 -26055 235403 -303245 -282685 -85532 -321615 -179816
11160 -179816 75055 135129 58534 199698 -268668 -169501 185735 -14827 -83047 340534 -97874
11148 -208511 126584 -28363 92069 67441 288554 -472213 231927 27991 -195779 131807
11137 259855 83142 -142569 64499 -128738 -259277 -27619 -30151 140827 -37788 -264916 -320316
11126 -320316 110974 -228860 337875 227226 88749 -98820 74205 342250 108053 131682
11116 131682 68679 -93433 20948 343929 -134441 127869 125689 117405 -33216 404610 161083
11104 -163125 185591 107139 74651 170092 -228258 331760 303065 243887 125800 230277
11094B30277J19862j26906N4010j26196a65464B04728H8676j3336L27323j36752
11084B65911J58168j36946q7377k4799E748K11429N305J1495l9789R3046A08110
11072I0678K6573J43071M1382J00024k694K1794j48700A11347J22535K7387J12968
11061C74237A73998P6929M50904k90677A99232J80253J71354L30228l42283J66073
11051G04857o9665J97594l83235K29615L0142K44950j91352J01722j98565O7912
11041G33975K40868l11583j72899N5708K74422l21022O6249K58500q7399p4072
11031F62747R9840j93312M1005k41800L07829k7634M692j10658L03716J85307
11021A031732l30867r3135N6761M144P3560q2642J8414j03535k65338J04347J62344
$$ plain form
11094 230277 350139 223233 277243 151047 -165464 204728 88676 75340 402663 265911
11084 265911 424079 287133 199756 174957 5748 217177 222482 233977 194188 287234 108110
11072 90678 117251 260322 301704 401728 399034 420828 272128 111347 233882 261269 374237
11061 374237 173998 250927 701831 411154 199232 379485 550839 881067 538784 704857
11051 704857 635192 832786 449551 679166 709308 954258 762906 864628 666063 733975
11041 733975 974843 663260 490361 546069 820491 499469 565718 824218 736819 662747
11031 662747 762587 569275 610280 368480 676309 648675 653367 542709 846425 1031732
11021 1031732 700865 607730 664491 668635 742195 659553 677967 574432 309094 413441 575785
11010E75785O5049k8708A20509N20703K07896l55437K98570j8933k79748n9950
11000D33610O15657k74832L6139k13436L9657m5262j49162P1353L13273l04096
10990E22901K69282J50248k71060k15293K77553R8692K45724k1381J48599l2779
10980A172486q5532L94146j97397k0426N72685n9615O67838K67250P3772j42198
10970B643009j3584K94731n77286J56615m80702k61166J67676l0746k64720L64325
10960A998152k4727q0341J07440Q0200L6798n14345L37103k51020p04594L2026
10950A016692l68320L03758D40581J67997O6099k85934J01396o6460A31560J02947
10940B34507C7808L620j2658L04444r7108L3537j20479f8630B21624a58101q8407
$$ plain form
11010 575785 640834 612126 120509 641212 849108 493671 792241 773308 493560 433610
11000 433610 1049267 774435 810574 597138 636795 591533 442371 513724 826997 522901
10990 522901 792183 942431 671371 456078 733631 832323 1078047 1056666 1205265 1172486
10980 1172486 1086954 1481100 1283703 1263277 1835962 1776347 2444185 2711435 2785207 2643009
10970 2643009 2629425 2924156 2346870 2503485 2022783 1761617 1929293 1898547 1633827 1998152
10960 1998152 1973425 1893084 2000524 2080724 2117522 1603177 1940280 1689260 984666 1016692
10950 1016692 648372 952130 440581 608578 674677 388743 490139 423679 131560 234507
10940 234507 37808 41428 28770 333214 236106 269643 149164 -68630 221624 -158101 -246508
10929b46508C4543K1052a06810m8379D4858A3768P2925Q014K26042b15616f6318
10917A33913J4233a781A42137b56718C0645J10998a92534C70026A73636c91746
10906b7089F5457J58385E3881b45692N1783C51942E9369N8983a37737B8821J29324
10895A58145J6207C3036J6881a30322k4780B11983a32769I8179a05896A47665
10884C29212E7250p669g3072a8701r5163F3649J19339l5947F7167i4587a6000
10872C272c38506H0134a64817F7799L7653a22162b4135G4345a15917B37075A09240
10860A38061a38140K6822k5642l3035I1436l4597O7819J30469d3741H4005Q5807
10849A69812f5514m6350k34052A41752L7723a82662A14148b58064n7509e5485
$$ plain form
10929 -246508 34543 55595 -106810 -155189 44858 13768 86693 94707 320749 -215616 -66318
10917 133913 148146 -1781 142137 -256718 30645 141643 -192534 370026 173636 -391746
10906 -27089 65457 223842 53881 -245692 -193909 351942 59369 118352 -137737 28821 158145
10895 158145 174352 33036 49917 -130322 -155102 211983 -132769 98179 -105896 147665
10884 329212 57250 49581 -73072 -18701 -113864 63649 182988 147041 67167 -94587 -16000
10872 3272 -338506 80134 -164817 67799 105452 -122162 -24135 74345 -115917 237075 109240
10860 138061 -138140 -111318 -136960 -169995 91436 56839 124658 255127 -43741 84005 169812
10849 169812 -65514 -111864 -345916 141752 179475 -182662 114148 -258064 -315573 -55485
10838A92646L349c61971a69405B60676i2180l9098B71608E2918J12094P4292a58258
10826d1978g095B97250i4440q6462e2572a7087e087k26967d5591j03884j54541
10815c04016A33b67183A54684a06127p7610f8820f203l21735M8043I5825J91863
10804B87688b55044A6535c3322l1350J9308A15582a90383A41760A6597a56917
10793a48403I1797a08235A04168a56434C1508b44320J20624l21420C0691f4834
10782H2699h0041K9103k19529d6898p1124q3505j09255B34293f407A04163h835
10770H6255a56809k23915C9574a27101k9989o8505C4714d9329J5005M0k8401k18030
10758b80715A06393a10181J8988K4897N022B59241b59143A31638A2035K01648
$$ plain form
10838 192646 195995 -361971 -169405 260676 -92180 -131278 271608 52918 165012 239304 -158258
10826 -41978 -7095 297250 -94440 -180902 -52572 -17087 -5087 -232054 -45591 -149475 -304016
10815 -304016 133 -267183 154684 -106127 -183737 -68820 -6203 -327938 -279895 95825 287688
10804 287688 -255044 16535 -33322 -64672 -45364 115582 -190383 141760 16597 -156917
10793 -148403 91797 -108235 104168 -156434 31508 -244320 -123696 -445116 30691 -64834
10782 82699 -80041 -50938 -270467 -46898 -118022 -201527 -310782 234293 -6407 104163 -8835
10770 86255 -156809 -380724 39574 -127101 -157090 -225595 34714 -49329 -34324 -34284 -62685 -280715
10758 -280715 106393 -110181 -91193 -66296 -61274 259241 -259143 131638 12035 213683
10748B13683f1964j24732B87965F7365b41100m561a4920C39769j69819a68888
10737G6312J23830k9957k8826J96a68156c5172j7816I350a8220q53B3068g6215
10724e2221A95208F210c78982f3053A91619b12695d9449k1981j78555M896C7459
10712d3972j57827C6102P415L8367d24003J68465e1520q5216A54830D2421K47462
10701B89883b88854J17251A8413c710n6239A66789C3116R6500b9450A63487g8081
10689h678C194L5721M7340O9741i3453k66234A57678m7509J4806h4055r1895D615
10676c36821H1902b9160j55007c550m6169B3806h7260l1124G0119h7335l6874
10665a24209o7550d4392j28180A57703b75261B6594b60200J21682N5087A87657
$$ plain form
10748 213683 -61964 -186696 287965 67365 -241100 -245661 -14920 339769 169950 -168888
10737 76312 200142 170185 141359 141555 -168156 -35172 -52988 9350 -18220 -19073 23068 -76215
10724 -52221 195208 6210 -378982 -63053 191619 -212695 -49449 -71430 -249985 -245089 37459
10712 -43972 -201799 36102 43517 81884 -424003 -255538 -51520 -136736 154830 42421 289883
10701 289883 -288854 -171603 18413 -3710 -59949 166789 33116 129616 -29450 163487 -78081
10689 -8678 3194 38915 86255 155996 -93453 -359687 157678 110169 124975 -84055 -175950 4615
10676 -336821 81902 -29160 -184167 -3550 -49719 23806 -87260 -118384 70119 -87335 -124209
10665 -124209 -191759 -44392 -172572 157703 -275261 26594 -260200 -138518 -83431 187657
10654A8432f2376B48110h0098a5673H5209b324l72365A5678g5712l49021a3970
10642I6590c27649h1635F174d7015M613j53078A53042e364k54428a13285A74205
10630f9269J1708D3663J93312a04962K6100k35612B1413J42076g804D6596f243
10618c333k31208k89805A22972j8831b1068j88073A93057c13069B05673b51733
10607a2731j1318j4902j06064N4771a2893N100k17459A35947K3406J35045m1181
10596B53217k3251g1970I589J18204C5125R9916D7304k0848K8361a70577k3456
10585a94033A20410D2943b20402g0445B34553g3306j24468E5386b97410g5970
10574c41220J59746D0316c88517a56740A06993d83380a37917A18070b29724I6593
$$ plain form
10654 18432 -62376 248110 -80098 -15673 85209 -2324 -374689 15678 -75712 -424733 -13970
10642 96590 -327649 -81635 6174 -47015 -42402 -195480 153042 -5364 -259792 -113285 174205
10630 -69269 -57561 43663 236975 -104962 -78862 -314474 21413 163489 -7804 46596 -6243
10618 -3333 -234541 -524346 122972 104141 -21068 -209141 193057 -313069 205673 -251733
10607 -12731 -24049 -38951 -145015 -90244 -12893 -7793 -225252 135947 159353 294398 253217
10596 253217 229966 -71970 9589 127793 35125 135041 47304 26456 54817 -170577 -194033
10585 -194033 120410 42943 -220402 -70445 234553 -73306 -197774 55386 -297410 -75970
10574 -341220 -181474 40316 -388517 -156740 106993 -483380 -137917 118070 -229724 96593
10563I3711b49053i5284B72908c5751C2286J84492J19151b33611D6339b88914
10552i3127A49854b03104C01410n1800p8039H3127M9766a84880B3968i9788I4990
10540E3931A5043b58488J19599A4021a85840r469p1107O6325A52472c2648j03282
10529a35930c435A94176b8420j4658G7895a38214D1043J38607c5791C02911b37879
10517I4774l7980b32241h2723A8021b29912q9537a33944A93196c46370a06400
10506B40809b3738j67755p863k3850A02421a88296G4245a2972r6931I9239B4599
10494E5660J05057d4170B27823m5860f7247L1135r8082k79145H5744a35131C06103
10482a25141B98220A17880R7285K46773k6709A64453k1863L6179a5348j63444
$$ plain form
10563 93711 -249053 -95284 272908 -35751 32286 216778 335929 -233611 46339 -288914
10552 -93127 149854 -203104 301410 249610 171571 83127 132893 -184880 23968 -99788 94990
10540 53931 15043 -258488 -138889 14021 -185840 -195309 -266416 -200091 152472 -32648 -135930
10529 -135930 -3435 194176 -28420 -43078 77895 -138214 41043 179650 -35791 302911 -237879
10517 94774 56794 -232241 -82723 18021 -229912 -319449 -133944 193196 -346370 -106400
10506 240809 -23738 -191493 -199356 -223206 102421 -188296 74245 -12972 -109903 99239 24599
10494 55660 160717 -44170 227823 181963 -67247 -36112 -134194 -413339 85744 -135131 306103
10482 -125141 298220 117880 215165 461938 435229 164453 142590 178769 -15348 -178792
10472a78792A53774h82A30931K5802J46510G666a9589l45009B08904c12841b3429
10460A41524i5391j68044a07821H9824K9269A398Q9235d3343k44053e6479p9820
10449a36299d4176A73917m94L565L5934D2588f3350A52855c3166j76465a9279
10437e8829k29250O846a31431N3432b2028A03697J47287j09470g9337B33483E9983
10425a61500o6424a01673A02988b59094d877I1782f4035n5177A48627a65315D13734
10413B05034a55758B0941q607c75136a82086o5253P7551D3799a24011D6900c27719
10401A42581D9335c8653C6900A1462O3039c8205B15343F0443Q9230B6905J95351
10390B22256h2902G9432B3085c782C31624e1563j0330K7722n4018l4225C05719
$$ plain form
10472 -178792 153774 -882 130931 156733 303243 7666 -19589 -364598 208904 -312841 -23429
10460 141524 -95391 -263435 -107821 89824 119093 1398 90633 -43343 -287396 -56479 -136299
10449 -136299 -44176 173917 173423 176988 212922 42588 -63350 152855 -33166 -209631 -19279
10437 -58829 -288079 -281233 -131431 -77999 -22028 103697 250984 141514 -79337 233483 59983
10425 -161500 -227924 -101673 102988 -259094 -4877 91782 -64035 -119212 148627 -165315 413734
10413 205034 -155758 20941 12334 -375136 -182086 -247339 -169788 43799 -124011 46900 -327719
10401 142581 49335 -38653 36900 11462 74501 -38205 215343 60443 149673 26905 222256
10390 222256 -82902 79432 23085 -3782 331624 -51563 -61893 -34171 -88189 -122414 305719
10378A58078J27768J42092A28156E9447e2980B22772E0876b2422B06872M29186
10368F36058F9418L10247k0398K65700J50084l44261a5498D11394I016K25300
10358B34316J70642j38382h4802B74316J71900A86069q9321M86582k27606n7838
10348B97886j38425M10594k35708A48393J22999N4663J09403R0353g18C33940
10337d8369A25860n3470K12815H9100J60652R9297A41102K12128q6210i0026D3385
10325D51331j81499q3219n2060J32955Q4242j46764q8320m3256I325J05985a9476
10313F0260K76483e228A29039d0853n8601A01847b7766n8689A17612l3856a81891
10301A7429d2830C28969A06991Q210B7312a23463k56016D01037F8101b41387A26239
$$ plain form
10378 158078 285846 427938 128156 59447 -52980 222772 50876 -22422 206872 636058
10368 636058 69418 379665 359267 624967 775051 430790 -15498 411394 9016 234316
10358 234316 404958 266576 -84802 274316 446216 186069 96748 583330 355724 297886
10348 297886 159461 570055 334347 148393 271392 326055 435458 525811 -718 333940
10337 -48369 125860 72390 285205 89100 249752 349049 141102 353230 267020 -90026 43385
10325 451331 269832 186613 134553 267508 351750 204986 116666 73410 9325 115310 -19476
10313 60260 336743 -5228 129039 -40853 -99454 101847 -27766 -86455 117612 83756 -181891
10301 17429 -42830 328969 106991 115201 27312 -123463 -379479 401037 68101 -241387 126239
10289h0971m3090k64540a76175O3656l9671O5074c8059j14953k2288q5909L5636
10278b25573E8359a31309j0445k8139a740I3623e6926B3703c2591o1991A35277
10266C7481J5641M3303b15787J02858k76356B42493j8287f6671C49200J24260
10256D73460q9295A48612M1539R66p9526K57972d9764J0711a8461A50834l5772
10245A15062b4282B41511g3803r5889A05835l4343e0362n8583A28442b27570a03317
10233b79182C43449a11646d0970j36765j0146A82247H2910K6756c46679a5331
10222G8361b67482M8576A39620h4966b2077H6784P86e6413B453a12294p6670j2357
10210b01321H4194c8654B24681c7636C31190D2605b51547n131B22508a45098C618
$$ plain form
10289 -80971 -124061 -388601 -176175 -112519 -152190 -87116 -38059 -153012 -175300 -261209 -225573
10278 -225573 58359 -131309 -141754 -169893 -1740 93623 -56926 23703 -32591 -94582 135277
10266 37481 53122 96425 -215787 -112929 -389285 242493 224206 -66671 349200 473460
10256 473460 384165 148612 190151 191117 111591 369563 -49764 -39053 -18461 150834 115062
10245 115062 -24282 241511 -73803 -169692 105835 71492 -50362 -108945 128442 -227570 -103317
10233 -279182 343449 -111646 -40970 -177735 -187881 182247 82910 109666 -346679 -15331
10222 78361 -267482 -218906 139620 -84966 -22077 86784 87570 -56413 2453 -112294 -188964 -201321
10210 -201321 84194 -38654 224681 -37636 331190 42605 -251547 -256678 222508 -145098 3618
10198a609j7304B33168g0746I422c341l54224a32000e8442j29278F8097L2155
10187A00252d2785j47066p6412J30532e6940B55919b40219O7025m7096H9444B646
10175g441n4898H6604h1130k51340H4250b45990B7713i011o6230C3039K9471a32231
10162a12027n4061D3473a23224r8332C74899A12998h9538l895l14354A6537a36766
10150A0810c6209I4046J92228c31317J08790b2717l5287I7926a8057k38392A39785
10138g1519L505r617E5484M7702D3538a50259a2170A25342a87198A28929b29029
10126h3175J9177j82638i4734a7619j0933j60338L7931D8225a6820j27228a9266
10114i3228F0136a42116I6677b17880A40014a17924j87181R1491q9753J19534
$$ plain form
10198 -1609 -18913 233168 -70746 9422 -3341 -357565 -132000 -58442 -187720 68097 100252
10187 100252 -42785 -189851 -266263 -135731 -56940 255919 -240219 -173194 -220290 89444 2646
10175 -7441 -62339 86604 -81130 -332470 84250 -245990 27713 -9011 -75241 33039 62510 -132231
10162 -112027 -166088 43473 -123224 -221556 374899 112998 -89538 -93433 -407787 16537 -136766
10150 10810 -36209 94046 286274 -331317 -222527 -22717 -58004 97926 -18057 -256449 139785
10138 -71519 -68014 -77631 55484 103186 43538 -150259 -12170 125342 -187198 128929 -229029
10126 -83175 -63998 -246636 -94734 -17619 -28552 -188890 -150959 48225 -16820 -144048 -19266
10114 -93228 60136 -142116 96677 -217880 140014 -117924 -305105 -213614 -303367 -183833
10104a83833e5506k10433i4842M008C05976L56a80563E9423J69542a67343P294
10093a60049A30831f6418j30554d6446I9440D2106e03639a2191A36563F7888i9255
10081g9624J3948B09591j029a64420H2185K90763b2263A02838k9054d19373e3589
10069H6372L9422m2919N968R4322i0172L6495A24048e0080j60279A73906r229
10058A64677J05067i3911m2640n6864g3801A0201K2482K00671a96784g0631k19673
10047b90304D0222h5644E2170a17114N5347j2240o4066c4690B78056h8077k82260
10036c70337A66561N2154i9158a4000C9718e9961j82285P1488m807j33711A11784
10024a99983k5745b7708A09344f4775j62307h9338K1845C2737j5190J46504i9294
$$ plain form
10104 -183833 -55506 -265939 -94842 -90834 305976 306332 -180563 59423 228965 -167343 -160049
10093 -160049 130831 -66418 -196972 -46446 99440 42106 -503639 -12191 136563 67888 -99255
10081 -79624 -65676 209591 208562 -164420 82185 372948 -22263 102838 73784 -419373 -53589
10069 86372 125794 82875 88843 183165 -90172 -53677 124048 -50080 -210359 173906 164677
10058 164677 269744 -93911 -136551 -193415 -73801 10201 32683 233354 -196784 -70631 -290304
10047 -290304 40222 -85644 52170 -117114 -61767 -74007 -138073 -34690 278056 -88077 -370337
10036 -370337 166561 218715 -99158 -14000 39718 -59961 -242246 -170758 -175565 -309276 111784
10024 -199983 -225728 -27708 109344 -64775 -227082 -89338 -67493 32737 17547 164051 -99294
10012c17252B6743b79505a38221r0757J02834o2234D14302A28235P8500R330E6273
10000d8662j59051q8132J47271P4049A41363g1082H795b05355j93971n447a3853
9988b80473h6404B30239a41523l2861A98752L5281d6113j93022J07580L210k7003
9977a55348N4669l5255j20582H1587J10139f4708p4178A29070a91081J1512B5438
9965b02190e2661a310j1630G8233M08487c85690A17720a26722j05258B2284a47957
9953A44364b16254J3961A06644b39201l8869I8481a09533C7007J03755k6685m7969
9942F6108c83344a50482l21371D6714P6251a25337l1617A70138a77996k15031
9932c93027A81368C9667J66118e22450h6422j57599J18270B8909f9039h83j09344
$$ plain form
10012 -317252 26743 -279505 -138221 -228978 -126144 -188378 414302 128235 206735 216065 56273
10000 -48662 -207713 -295845 -148574 -74525 141363 -71082 8795 -205355 -399326 -404773 -13853
9988 -280473 -86404 230239 -141523 -174384 198752 234033 -46113 -239135 -131555 -128345 -155348
9977 -155348 -100679 -135934 -256516 81587 191726 -64708 -138886 129070 -191081 -179569 25438
9965 -202190 -52661 -1310 -12940 78233 486720 -385690 117720 -126722 -231980 22284 -147957
9953 144364 -216254 -202293 106644 -239201 -278070 98481 -109533 37007 140762 114077 66108
9942 66108 -383344 -150482 -471853 46714 122965 -125337 -156954 170138 -177996 -393027
9932 -393027 181368 39667 205785 -522450 -86422 -244021 -125751 28909 -69039 -883 -110227
9921a10227H4578e2763F536a96426j2690d6894A37389b21814F4990c72736E6411
9909a20989j16746C77412a84475I0586a6735l0635k45581J19662A88215b17188
9898D1245a86535P0380k12765P835D38267A8260b04241d078A96349b63591C20412
9886a52394f7945F851b29726c6943j93220j4471I7394h1726q1841E8260b4296
9874a09462K9559B86236f3401l58177f5798o1618a0430q1724C05040A33573a96059
9862C5290g5596A03306b40446G8201C6925a23350n7887J6551N0807m4005g8055
9850c03805P2613B42698e0573o5770b3441C36508a88340A6326a22297o9283j95993
9839c87573C9271b54277K4r0926J60256A08722b37189Q5895m6870A3363c9060
$$ plain form
9921 -110227 84578 -52763 6536 -196426 -209116 -46894 137389 -221814 64990 -372736 56411
9909 -120989 -237735 377412 -184475 90586 -16735 -47370 -292951 -173289 188215 -217188
9898 41245 -186535 -116155 -328920 -321085 438267 18260 -204241 -4078 196349 -263591 320412
9886 -152394 -67945 6851 -229726 -36943 -230163 -244634 97394 -81726 -163567 58260 -24296
9874 -109462 -79903 286236 -63401 -421578 -65798 -127416 -10430 -92154 305040 133573 -196059
9862 35290 -75596 103306 -240446 78201 36925 -123350 -181237 -164686 -113879 -157884 -78055
9850 -303805 -231192 242698 -50573 -116343 -23441 336508 -188340 16326 -122297 -191580 -387573
9839 -387573 39271 -254277 -254253 -345179 -184923 108722 -237189 -151294 -198164 13363 -39060
9827A31603m0751c34203i3275n2490O3082k38276D5405a92820A70122q0564J1395
9816A00953J02048N0518a04024J5330G1050c17932B3029D716c4807J0300n22096
9805e46603K23623M2186J5674d9628j81664o9567J29473B19429a84162H2828a26327
9793E3704J86399n2230P3963b42114R9946d1234j18703K1965A09849n3468g0286
9781a75320J2762D35985h9084c5394m4941L4842m00128a25771r1521E8211o153
9770E2058N8623a93957B43260A3833a4546D6409N1008b29336C8716N1995i1181
9758c9322B20135b01838A51053A6074a21202B06024H7715g5625L6323p9069n1409
9747a69780j25047J06043k55386J35959q6885a10228D1594b87570D7882a14383
$$ plain form
9827 131603 90852 -334203 -93275 -145765 -82683 -320959 45405 -192820 170122 89558 100953
9816 100953 203001 253519 -104024 -88694 71050 -317932 23029 4716 -34807 -24507 -546603
9805 -546603 -322980 -280794 -265120 -49628 -231292 -300859 -171386 219429 -184162 82828 -126327
9793 53704 240103 187873 261836 -242114 -142168 -41234 -159937 -137972 109849 56381 -70286
9781 -175320 -162558 435985 -89084 -35394 -80335 -45493 -445621 -125771 -217292 58211 52058
9770 52058 110681 -193957 243260 13833 -14546 46409 97417 -229336 38716 90711 -91181
9758 -39322 220135 -201838 151053 16074 -121202 206024 87715 -75625 -39302 -118371 -169780
9747 -169780 -294827 -188784 -444170 -308211 -395096 -110228 41594 -287570 47882 -114383
9736A57424J1673b11233m7685n5725A20689i7083M3396E2750a66648m2132C4231
9724G5349A9940f1691j23175e6913B78430i552k15716O6537a2985k70320B3320
9712a70895e3930k78240B4491b16735O2729j56359C90171a00437L3228F9498Q1954
9701A51452n2822b44057c6512J7412B22544b18999C01866h4641B41539j15035
9691A26504i0344B31053a83634j23944r6342a35420m02059h6292k8762Q804L3891
9680g2359A35079b84332A07383K1244k2208b25408J9616d541j05645E5547i1896
9668A17668j2705k5853O1950i6339B09080a87099B43130b16805A67196G116M6159
9657E3275j7233b96254J00304d9306l38185B16389a78103k8092A27407a62695
$$ plain form
9736 157424 169097 -211233 -258918 -314643 120689 -97083 -53687 52750 -166648 -208780 34231
9724 75349 19940 -61691 -184866 -56913 278430 -9552 -225268 -158731 -12985 -283305 23320
9712 -170895 -53930 -332170 24491 -216735 -154006 -310365 390171 -100437 -67209 69498 151452
9701 151452 98630 -244057 -36512 -19100 222544 -218999 301866 -84641 241539 126504
9691 126504 -90344 231053 -183634 -307578 -403920 -135420 -537479 -86292 -115054 -106250 -72359
9680 -72359 135079 -284332 107383 128627 106419 -225408 -205792 -4541 -110186 55547 -91896
9668 117668 104963 79110 141060 -96339 209080 -187099 243130 -216805 167196 7116 53275
9657 53275 36042 -296254 -195950 -49306 -387491 216389 -178103 -206195 127407 -162695
9646a24512k44438f8409b5490R465I255J66670h2742a9898m1075E0966p609a72191
9633B44638j05413n4760d9422A26b98702p0457M4735C83248a10136d1397k4437
9622f5834p374p3038a6953A75803c38034Q0227o2654B19187b48332f429B0202
9610G428g3365B59435b91681O5230a1378j33724A68926b60702N3917p940A48223
9598e2558H8098a67738q3263H0492l9792f3100m4534A17039b71522f9874l5448
9587a05322k14291A41234N8484a24466M0241j33797G1084b7295C08999b94198
9576a67361p4896D83293a19729H5970a61168I0749h1632b977A70375h7380k04883
9565b92263h6848j4619d7631j10853j83078g9476B58171j14751d34743k0255A45740
$$ plain form
9646 -124512 -368950 -68409 -25490 -16025 9255 175925 -82742 -19898 -60973 50966 43357 -172191
9633 244638 139225 84465 -49422 126 -298702 -369159 -324424 383248 -110136 -41397 -65834
9622 -65834 -73208 -146246 -16953 175803 -338034 -257807 -320461 219187 -248332 -6429 20202
9610 7428 -73365 259435 -291681 -226451 -11378 -145102 168926 -260702 -206785 -214725 148223
9598 -52558 88098 -167738 -251001 80492 40700 -63100 -107634 117039 -271522 -69874 -105322
9587 -105322 -319613 141234 199718 -124466 -84225 -218022 71084 -27295 308999 -294198
9576 -167361 -242257 483293 -119729 85970 -161168 90749 -81632 -2977 170375 -87380 -292263
9565 -292263 -86848 -101467 -47631 -158484 -341562 -79476 258171 143420 -434743 -454998 145740
9553C10474a92318k4879N8727f4510A57202c94685J92794h1671B5362P8846f0060
9541h9892J2752J9667K3701m2053D2189N8390L0519J2213A9871o378L20636d00767
9528a14362J5559m7929m5509m3671d0854l18670J55489B035b56371e7465B01555
9516b52289H3118a08833a5574q7729A39113b43406J01592k60383a34202p0031
9506b04233O0872A27315c3276o7470E9792c9896k1599G9691Q0683a33513k8727
9495a62240k16795J24731A03553J85564c18351B46978E5166q265a69388O0472
9485a08916j68638a33969j41036d9207k3127j58412i0695A59793a40500C1609
9474C0665a22005j00998f2586B48246i7443j62535g6392j04373J7854j249i826
$$ plain form
9553 310474 -192318 -217197 -158470 -64510 157202 -394685 -201891 -81671 25362 104208 -60060
9541 -89892 -77140 -57473 -33772 -75825 42189 100579 131098 143311 19871 13493 334129 -400767
9528 -114362 -98803 -146732 -192241 -235912 -40854 -359524 -204035 2035 -256371 -57465 201555
9516 -252289 83118 -108833 -15574 -103303 139113 -243406 -141814 -402197 -134202 -204233
9506 -204233 -143361 127315 -33276 -100746 59792 -39896 -61495 79691 160374 -133513 -162240
9495 -162240 -379035 -254304 103553 289117 -318351 246978 55166 46901 -169388 -108916
9485 -108916 -277554 -133969 -275005 -49207 -72334 -230746 -90695 159793 -140500 31609
9474 30665 -122005 -223003 -62586 248246 -97443 -259978 -76392 -180765 -162911 -164160 -9826
9462h1188A58150a9575B89828a96970r2647H4561L30611A65842J5769R2380a71560
9450c38190G8001a51259p1923M4487h7702k39084a09465L5624I287i7020D5920
9438a71862j72039a0887A47673K09160c06130i7512A7202L5001J41207i5890I164
9426a48646k6669A29082m6957b47342J04681b0360k73881A61153f2099O547k29386
9415b84938P0128J00212A132b0749F5040e05629F2607a55006D1028K9668a19840
9403A5360L7963c39605f9446A20211b43553i6548A64635a13034M5938l05597O4231
9392c08462P7559E6451P8535g7224F9415a08434k58166A5693a94084D8584b31070
9380F1719a82375A27920o079f0941C1909a55870l03759a27233I5509b34852A75735
$$ plain form
9462 -81188 158150 -19575 289828 -196970 -289617 84561 415172 165842 181611 273991 -171560
9450 -338190 78001 -151259 -223182 -178695 -87702 -326786 -109465 -73841 9287 -97020 45920
9438 -171862 -343901 -10887 147673 356833 -306130 -97512 17202 52203 193410 -95890 9164
9426 -148646 -175315 129082 82125 -247342 -142661 -20360 -294241 161153 -62099 -55552 -284938
9415 -284938 -214810 -114598 1132 -20749 65040 -505629 62607 -155006 41028 70696 -119840
9403 15360 53323 -339605 -69446 120211 -243553 -96548 164635 -113034 -67096 -372693 -308462
9392 -308462 -230903 56451 134986 -77224 69415 -108434 -366600 15693 -194084 48584 -231070
9380 61719 -182375 127920 121841 -60941 31909 -155870 -459629 -127233 95509 -234852 175735
9368b88092b662k87031J38852p6003A38809R215m5904J0824d7893B8056b12064
9356b46882L9864J00828b0688j9918m7657A08514b80864d2453C28207d4715b1557
9344a52471P0935A58623a72095o4281B6215J2957b06960c7632j63829o1542c2606
9332G7340a07565G1281i4090k24127J50764C83532c12607c6696j83041A48806
9321B1880M2553b67744A47844G2753i4320A39566b18958C1621K02504F2538b33843
9309C1649c17728b1067G7068J20747i4401j48342E0295f4493l54976C2816a01124
9297a74390g2297j07502f5516C7275A1231J6318a81628A77232o1860K5873b03739
9285a42542b915j68381A4801J66928D7665M20904D1888a00841k92197A56246B3410
$$ plain form
9368 -288092 -2662 -289693 -150841 -226844 138809 148024 102120 112944 -47893 28056 -212064
9356 -246882 -207018 -106190 -20688 -40606 -88263 108514 -280864 -42453 328207 -44715 -21557
9344 -152471 -81536 158623 -172095 -236376 26215 39172 -206960 -37632 -201461 -263003 -32606
9332 77340 -107565 71281 -94090 -318217 -167453 383532 -312607 -36696 -219737 148806
9321 21880 64433 -267744 147844 72753 -94320 139566 -218958 31621 234125 62538 -233843
9309 31649 -317728 -21067 77068 197815 -94401 -242743 50295 -64493 -419469 32816 -101124
9297 -174390 -72297 -179799 -65516 37275 11231 27549 -181628 177232 115372 141245 -203739
9285 -142542 -2915 -171296 14801 181729 47665 468569 41888 -100841 -393038 156246 23410
9273a40560I9792d1049F3323b35948D0896b08947B6632h8549J6958l17800a14264
9261a63728o0484C6163b48891a3753A64520b02326Q7078B6298e58323A11441B5190
9249c43714R5525m4248J30287A52218J17537C9627c22907B34702I2939a8315A7126
9237A18459a71691a7361j59082N8139B25933M6072B1547b90243D9029f1005r1034
9226a52039k0088R88I7787b52228c6295m3650o226A25500a53399k05626B45141
9214c9122j33276j44751b0866A53217J5581c49701B47113A9128h2035B17601I7132
9202A09b96202h3140k12142D9995J42268h5114K7819r9769q6156J02568B08397
9190d0227C4416A3385e66013d2278R759o4567A8301b56890o2022j58308a04679
$$ plain form
9273 -140560 99792 -41049 63323 -235948 40896 -208947 26632 -88549 -71591 -389391 -114264
9261 -163728 -224212 36163 -248891 -13753 164520 -202326 -115248 26298 -558323 111441 25190
9249 -343714 -248189 -292437 -162150 152218 269755 39627 -322907 234702 92939 -18315 17126
9237 118459 -171691 -17361 -176443 -118304 225933 272005 21547 -290243 49029 -61005 -152039
9226 -152039 -172127 -171139 97787 -252228 -36295 -79945 -86171 125500 -153399 -359025 245141
9214 -39122 -172398 -317149 -20866 153217 168798 -349701 247113 19128 -82035 217601 97132
9202 109 -296202 -83140 -295282 49995 192263 -85114 -57295 -157064 -243220 -140652 208397
9190 -40227 34416 13385 -566013 -42278 -32519 -97086 18301 -256890 -318912 -477220 -104679
9178b19986C54437j53275c14384p2038N5705J64505A22558e2209A49566b57689
9167d0270a6846B40157I3836c74584r614B4990b72894F880Q354J94534a42250
9155b3732j5583m2155L3732m0934a0375A66722g8381k50345A71295a66983j1671
9144a78654k34844a98659F9566a9209H6107a28084A9710K12575H8095K7831a38211
9132a72378A0213d4895A59687a77941l27844f3335j23819j48618Q3758I4598a29799
9120I916b43721A25965B6316a13965A62174c62126D8535P8531i6124a1703B49638
9108b2715k03508A17707c24498A04455n688a73994b3882B9040a42493C07940a72360
9096A83033H701R3737B2090f8934k61225G3369K66126b3510q9717A91681c76082
$$ plain form
9178 -219986 354437 201162 -314384 -386422 -330717 -166212 122558 -52209 149566 -257689
9167 -40270 -16846 240157 93836 -374584 -384198 24990 -272894 6880 15234 209768 -142250
9155 -23732 -39315 -81470 -47738 -88672 -10375 166722 -78381 -328726 171295 -166983 -178654
9144 -178654 -413498 -198659 69566 -19209 86107 -128084 19710 232285 88095 115926 -138211
9132 -172378 10213 -44895 159687 -177941 -505785 -63335 -187154 -335772 -252014 94598 -129799
9120 9916 -243721 125965 26316 -113965 162174 -362126 48535 127066 -96124 -11703 249638
9108 -22715 -226223 117707 -324498 104455 98767 -173994 -23882 29040 -142493 307940 -172360
9096 183033 8701 102438 22090 -68934 -330159 73369 339495 -23510 -113227 191681 -376082
9084A37489a66074k1303d7396G9414c3072k53241l83623a28381P958q1089j33054
9073c34566J37951h3870j89314g4182B19588l5504a74718j47921A64606D9960
9062a37162b9240k805G1958a0134A02957a2774B52847d0755q8478k00433a40233
9050h8981r3490b5193H9105a93935I5938c33624A55457b17230B9133b7941G5253
9038E3772a33635p1464a8795H0031b43722f8666k7293B858a28867A43628d4490
9026A83049g0302C3424b39047E6294i8004q2842Q8675b3761B4594J67667b02492
9014b26522j26952A6359b11053i5337A18650d10505c5599j68591D2862h1988F6379
9002C16914e06272i8267l1034j07338J15531B48557n8594c24681a06545B852a12488
$$ plain form
9084 137489 -166074 -187377 -47396 79414 -33072 -286313 -669936 -128381 -120423 -201512 -334566
9073 -334566 -196615 -83870 -273184 -74182 219588 184084 -174718 -322639 164606 49960
9062 -137162 -29240 -32045 71958 -10134 102957 -12774 252847 -40755 -129233 -329666 -140233
9050 -88981 -182471 -25193 89105 -193935 95938 -333624 155457 -217230 29133 -27941 75253
9038 53772 -133635 -205099 -18795 80031 -243722 -68666 -95959 2858 -128867 143628 -44490
9026 183049 -70302 33424 -239047 56294 -98004 -180846 -92171 -23761 24594 192261 -202492
9014 -226522 -353474 16359 -211053 -95337 118650 -410505 -35599 -204190 42862 -81988 66379
9002 316914 -506272 -98267 -129301 -236639 -121108 248557 189963 -324681 -106545 2852 -112488
8990E9252b21622L6687j10952J34142b0435A98173a55871a900j00200J8093p3851
8979a57858J7177q8258l3619C00096f8170l22500a58097B59985F0352a81471g947
8967h8001e021B11672q5913b6115A28079f2662j46781h9072C9473b24622A66708
8955b95460J28718A47577b27439J09239A14036J79909A35892k1345c1693l1052
8945f2745C9006O7960a95162j50099A50982b32793c0007M067B27247D9284c0339
8933F06188A9570b09360B09705i4979H5044b067A18969a46087c5515E53273J72307
8922G25580K795758J0720298C359664I58652C05839j39296n4558a88949H9305
8912a69013A38332o4727C5554c4276o22A85488q7760a60778F730j757a1322k09320
$$ plain form
8990 59252 -221622 -184935 -295887 -161745 -20435 198173 -155871 -1900 -102100 -84007 -157858
8979 -157858 -140681 -228939 -262558 300096 -68170 -390670 -158097 259985 60352 -181471 -7947
8967 -88001 -5021 211672 125759 -26115 128079 -62662 -209443 -89072 39473 -224622 166708
8955 -295460 -166742 147577 -227439 -118200 114036 293945 135892 114547 -31693 -62745
8945 -62745 39006 106966 -195162 -345261 150982 -232793 -30007 -25940 227247 49284 -30339
8933 606188 19570 -209360 209705 -94979 85044 -2067 118969 -146087 -35515 553273 725580
8922 725580 3521338 14241636 3359664 958652 305839 166543 111985 -188949 89305
8912 -169013 138332 73605 35554 -34276 -34898 185488 97728 -160778 6730 4973 -11322 -220642
8900b20642h3897o6301j31092R6619A10266b10221f6559A79884k3551d1003B9984
8888i8945k3669L7853r395L5218l74302i3906D9344O6390e3587l10807A61083
8876A65237b1294n15615J99468a13563j38267F9035J25437a44826I6446b00554
8865B04373e5870k54377I6436b8628A05593c26396a01737a9580A04688c6127F7087
8853A20452L1626b9814B35114N4039d710m6944k30951A10499o636C0957a41895
$$ plain form
8900 -220642 -83897 -150198 -281290 -184671 110266 -210221 -66559 179884 156333 -41003 29984
8888 -98945 -122614 -84761 -94156 -58938 -433240 -93906 49344 115734 -53587 -364394 161083
8876 165237 -21294 -536909 -337441 -113563 -251830 69035 194472 -144826 96446 -200554
8865 204373 -55870 -310247 96436 -28628 105593 -326396 -101737 -19580 104688 -36127 67087
8853 120452 152078 -29814 235114 289153 -4710 -51654 -282605 110499 103863 30957 -141895
$$ [...]
##END NTUPLES=NMR SPECTRUM
##END=
