##TITLE=AC1703_ROEFFECT0028_8638083_HofIGIQ86H
##JCAMPDX= 6.0         $$ Bruker NMR JCAMP-DX V2.0
##DATA TYPE= NMR SPECTRUM
##DATA CLASS= NTUPLES
##ORIGIN= BRUKER
##OWNER= Administrator
$$ 1.72 TOPSPIN		Version 2.1
$$ 2014-05-23 03:14:22.741 -0700  Administrator@X
$$ Compression mode = diff/dup
##.OBSERVE FREQUENCY= 400.02188249412
##.OBSERVE NUCLEUS= ^1H
##.ACQUISITION MODE= SIMULTANEOUS (DQD)
##.ACQUISITION SCHEME= undefined
##.AVERAGES= 8
##.DIGITISER RES= 22
##SPECTROMETER/DATA SYSTEM= spect
##.PULSE SEQUENCE= zg30
##.SOLVENT NAME= COFFEE_meoh
##.SHIFT REFERENCE= INTERNAL, COFFEE_meoh, 1, 14.98509
##AUDIT TRAIL= $$ (NUMBER, WHEN, WHO, WHERE, PROCESS, VERSION, WHAT)
$$ ##TITLE= Audit trail, TOPSPIN		Version 2.1
$$ ##JCAMPDX= 5.01
$$ ##ORIGIN= Bruker BioSpin GmbH
$$ ##OWNER= Administrator
$$ $$ E:\/data/COFFEE/nmr/AC1703_ROEFFECT0028_8638083_HofIGIQ86H/10/pdata/1/auditp.txt
$$ ##AUDIT TRAIL=  $$ (NUMBER, WHEN, WHO, WHERE, PROCESS, VERSION, WHAT)
(   1,<2014-05-23 03:14:16.241 -0700>,<Administrator>,<X>,<go>,<TOPSPIN 2.1>,
      <created by zg
	started at 2014-05-23 03:13:10.553 -0700,
	POWCHK enabled, PULCHK disabled,
       configuration hash MD5:
       C8 4E 4E 5D D3 5C D8 9E 9F 52 82 E0 59 8A DE 15
       data hash MD5: 64K
       1B B7 EB 4F 16 DC 33 35 7B 87 0E 1C 70 AA 9E 11>)
(   2,<2014-05-23 03:14:19.178 -0700>,<Administrator>,<X>,<proc1d>,<TOPSPIN 2.1>,
      <Start of raw data processing
       efp LB = 0 FT_mod = 6 PKNL = 1 PHC0 = 0 PHC1 = 0 SI = 32K 
       data hash MD5: 32K
       67 4F 4C C9 76 9C DD B3 81 7B B7 93 98 CF 1F 92>)
(   3,<2014-05-23 03:14:19.459 -0700>,<Administrator>,<X>,<proc1d>,<TOPSPIN 2.1>,
      <pk PHC0 = 93.88916 PHC1 = 0 
       data hash MD5: 32K
       7D 0E FB B4 12 4D EF 55 29 DC 40 B5 0B 59 0C 94>)
(   4,<2014-05-23 03:14:19.584 -0700>,<Administrator>,<X>,<proc1d>,<TOPSPIN 2.1>,
      <abs ABSG = 1 
       data hash MD5: 32K
       E6 B3 44 F6 15 DB 27 15 65 AF 6E 55 EC 39 49 44>)
(   5,<2014-05-23 03:14:19.631 -0700>,<Administrator>,<X>,<proc1d>,<TOPSPIN 2.1>,
      <abs ABSG = 2 
       data hash MD5: 32K
       FC 82 AB 43 48 A4 CD 46 CD 65 3C E3 2A 0E C9 A8>)
(   6,<2014-05-23 03:14:19.694 -0700>,<Administrator>,<X>,<proc1d>,<TOPSPIN 2.1>,
      <abs ABSG = 3 
       data hash MD5: 32K
       E0 D1 4F D3 6F 26 B9 AB 0C 58 25 72 96 7F 39 9C>)
(   7,<2014-05-23 03:14:19.741 -0700>,<Administrator>,<X>,<proc1d>,<TOPSPIN 2.1>,
      <abs ABSG = 4 
       data hash MD5: 32K
       08 60 D8 41 2B 49 AA 72 FC 67 5B 50 24 7B 80 AA>)
(   8,<2014-05-23 03:14:19.803 -0700>,<Administrator>,<X>,<proc1d>,<TOPSPIN 2.1>,
      <abs ABSG = 5 
       data hash MD5: 32K
       C2 40 83 D5 ED B7 5B 13 7B 50 11 3A BE 34 C2 B9>)
$$ ##END=
$$ 
$$ $$ hash MD5
$$ $$ 33 AB FF AE 5D 76 0E 10 50 58 56 D2 2E 90 16 78
##$RELAX= 
##$RELAX= 
##$RELAX= 
##$RELAX= 
##$RELAX= 
##$RELAX= 
##$RELAX= 
$$ Bruker specific parameters
$$ --------------------------
##$DU= <E:\>
##$EXPNO= 10
$$ [...]
##$TP= (0..7)
150 150 150 150 150 150 150 150
##$TP07= 0
##$TPNAME0= <>
##$TPNAME1= <>
##$TPNAME2= <>
##$TPNAME3= <>
##$TPNAME4= <>
##$TPNAME5= <>
##$TPNAME6= <>
##$TPNAME7= <>
##$TPOAL= (0..7)
0.5 0.5 0.5 0.5 0.5 0.5 0.5 0.5
##$TPOFFS= (0..7)
0 0 0 0 0 0 0 0
##$TUNHIN= 0
##$TUNHOUT= 0
##$TUNXOUT= 0
##$USERA1= <user>
##$USERA2= <user>
##$USERA3= <user>
##$USERA4= <user>
##$USERA5= <user>
##$V9= 5
##$VALIST= <valist>
##$VCLIST= <CCCCCCCCCCCCCCC>
##$VD= 0
##$VDLIST= <DDDDDDDDDDDDDDD>
##$VPLIST= <PPPPPPPPPPPPPPP>
##$VTLIST= <TTTTTTTTTTTTTTT>
##$WBST= 2048
##$WBSW= 25
##$XGAIN= (0..3)
0 0 0 0
##$XL= 0
##$YL= 0
##$YMAX_a= 646184
##$YMIN_a= -546678
##$ZGOPTNS= <>
##$ZL1= 120
##$ZL2= 120
##$ZL3= 120
##$ZL4= 120
##$ABSF1= 14.98509
##$ABSF2= -5.573092
##$ABSG= 5
##$ABSL= 3
##$ALPHA= 0
##$AQORDER= 0
##$ASSFAC= 0
##$ASSFACI= 0
##$ASSFACX= 0
##$ASSWID= 0
##$AUNMP= <proc_prof1d_extract_pilot.lims>
##$AXLEFT= 0
##$AXNAME= <>
##$AXNUC= <1H>
##$AXRIGHT= 0
##$AXTYPE= 0
##$AXUNIT= <>
##$AZFE= 0.1
##$AZFW= 0.1
##$BCFW= 0
##$BC_mod= 0
##$BYTORDP= 0
##$COROFFS= 0
##$CY= 15
##$DATMOD= 1
##$DC= 0
##$DFILT= <>
##$DTYPP= 0
##$F1P= 0
##$F2P= 0
##$FCOR= 0.5
##$FTSIZE= 32768
##$FT_mod= 6
##$GAMMA= 0
##$GB= 0
##$INTBC= 1
##$INTSCL= 1
##$ISEN= 128
##$LB= 0
##$LEV0= 0
##$LPBIN= 0
##$MAXI= 10000
##$MC2= 0
##$MEAN= 0
##$ME_mod= 0
##$MI= 0
##$NCOEF= 0
##$NC_proc= -8
##$NLEV= 6
##$NOISF1= 0
##$NOISF2= 0
##$NSP= 0
##$NTH_PI= 0
##$NZP= 0
##$OFFSET= 14.98509
##$PC= 1
##$PHC0= 93.88916
##$PHC1= 0
##$PH_mod= 1
##$PKNL= yes
##$PPARMOD= 0
##$PPDIAG= 0
##$PPIPTYP= 0
##$PPMPNUM= 2147483647
##$PPRESOL= 1
##$PSCAL= 4
##$PSIGN= 0
##$PYNMP= <proc.py>
##$REVERSE= no
##$SF= 400.02
##$SI= 32768
##$SIGF1= 0
##$SIGF2= 0
##$SINO= 400
##$SIOLD= 32768
##$SPECTYP= <>
##$SREGLST= <1H.CDCl3>
##$SSB= 0
##$STSI= 32768
##$STSR= 0
##$SW_p= 8223.68421052631
##$SYMM= 0
##$S_DEV= 0
##$TDeff= 65536
##$TDoff= 0
##$TI= <>
##$TILT= no
##$TM1= 0
##$TM2= 0
##$TOPLEV= 0
##$USERP1= <user>
##$USERP2= <user>
##$USERP3= <user>
##$USERP4= <user>
##$USERP5= <user>
##$WDW= 1
##$XDIM= 32768
##$YMAX_p= 470986703
##$YMIN_p= -821671
##$CURPLOT= <Network HP LaserJet P1505>
##$CURPRIN= <$Network HP LaserJet P1505>
##$DFORMAT= <normdp>
##$LAYOUT= <+/1D_H.xwp>
##$LFORMAT= <normlp>
##$PFORMAT= <normpl>
##$SURQMSG= 1
$$ End of Bruker specific parameters
$$ ---------------------------------
##NTUPLES= NMR SPECTRUM
##VAR_NAME=  FREQUENCY,     SPECTRUM/REAL,   SPECTRUM/IMAG
##SYMBOL=    X,             R,               I
##VAR_TYPE=  INDEPENDENT,   DEPENDENT,       DEPENDENT
##VAR_FORM=  AFFN,          ASDF,            ASDF
##VAR_DIM=   32768,         32768,           32768
##UNITS=     HZ,            ARBITRARY UNITS, ARBITRARY UNITS
##FACTOR=    0.250966925370066, 1,           1
##FIRST=     8223.43324360094, 64756,        -93062
##LAST=      0,             -35914,          52191
##MIN=       0,             -821671,         0
##MAX=       8223.43324360094, 470986703,    0
$$ Real data points
##PAGE= N=1
##DATA TABLE= (X++(R..R)), XYDATA
$$ [...]
19518a43549D7501a06614k8541B00638m4893a24521b4489l31480f6671A83467
19507d5293A6416R6977c00354a42326o9061a1199n5766n5277A18413m0941L0537
19496A08009a31382o1736D5650K14676n5581b37951B55460A3264a33811c7358
19485b97668f0228A78973B1162N0281A0944d3735l6327B83335a41756j52923n3866
19474c48545J61966E1327d5810k93551G915a23303J4667d167j82129h2949j12929
19463a95878G7511a20118j10493A49345B6648b00419G5047e1723a1992o9878q8180
19452a70050j2569B10530p0654a06583b7738B60476e8764A70763q1448a07650
19441a51890M472L9177A48587l71o7012c0699q5854K1210j67589K72a6741j29270
$$ plain form
19518 -143549 47501 -106614 -135155 200638 155745 -124521 -24489 -355969 -66671 183467
19507 -45293 16416 113393 -300354 -142326 -211387 -11199 -66965 -122242 118413 77472 108009
19496 108009 -131382 -193118 45650 260326 204745 -237951 255460 13264 -133811 -37358
19485 -297668 -60228 178973 21162 71443 10944 -43735 -80062 283335 -141756 -294679 -348545
19474 -348545 -186579 51327 -45810 -339361 7915 -123303 -108636 -4167 -186296 -82949 -195878
19463 -195878 77511 -120118 -230611 149345 26648 -200419 75047 -51723 -11992 -81870 -170050
19452 -170050 -182619 210530 139876 -106583 -27738 260476 -58764 170763 89315 -107650
19441 -151890 -147418 -108241 148587 148216 81204 -30699 -116553 -95343 -262932 -262660 -16741 -146011
19429a46011j034j04788f4349B71990a17127k1582J7124g646E7675f4827G0735
19417A16912J54937a25085A64817h0986A0489c14641R816a8045A06849b82515
19406c09353a03988d4020C5487g0380p8223d5569l44034a15522r6868o0567E0778
19394e5854A52228b59789C5797h5404H9249a14327e5716B46447f4055j62618A64673
19382a53300A01475h165j66204j3926j08831i9347G5595O9996l2395i8902L333
19371i5569B0062g822j08954l01129a40939P517C9460K34765f263k67009C1471
19359H4989B4577f4593A11328a63718E3516a11186K9470r9623A63397g184A36328
19347b71653L5489C6784b20094E8150b97417a29126A55842b2313I2003b96061
$$ plain form
19429 -146011 -147045 -251833 -64349 271990 -117127 -138709 -121585 -7646 57675 -64827 70735
19417 116912 271849 -125085 164817 -80986 10489 -314641 -304825 -18045 106849 -282515
19406 -309353 -103988 -44020 35487 -70380 -148603 -45569 -389603 -115522 -212390 -272957 50778
19394 -55854 152228 -259789 35797 -85404 89249 -114327 -55716 246447 -64055 -226673 164673
19382 -153300 101475 -8165 -174369 -188295 -297126 -99347 75595 145591 113196 -98902 -95569
19371 -95569 20062 -7822 -116776 -417905 -140939 -133422 39460 274225 -6263 -273272 31471
19359 84989 24577 -64593 111328 -163718 53516 -111186 -81716 -181339 163397 -7184 136328
19347 -271653 -236164 36784 -220094 58150 -297417 -129126 155842 -22313 92003 -296061
19336f6072k12566c1233A20776f2624C85929b29259m9498M8809P2811o9017B25601
19324e3631k03073N3652j45790o6985g8270q6327A13387a98150a1869F7688b87592
19312A74034d5758j06238J6791H9306b59863J27028B2414F973J92745l6825G9477
19300h1653L4192A86822a42264k25130A60690R6023A22058a640C4520h0873n0306
19289a31179j5261A20720a9576m9744m5289h752o430r3363A07451b64215h1484
19277A0782P2896a99869j18628M7231A83237a8989j20995k08145C86339a44417
19266c23309A58215E9875b19072B3629c3075B29857K9576G4473c23107F0723a75978
19254c06013B00073a93605A5342L670b54761D2388b94223O6839A99420n9351f6057
$$ plain form
19336 -66072 -278638 -31233 120776 -62624 385929 -229259 -278757 -229948 -157137 -226154 225601
19324 -53631 -256704 -203052 -348842 -415827 -78270 -164597 113387 -198150 -11869 67688 -287592
19312 174034 -45758 -151996 -135205 89306 -259863 -132835 22414 6973 199718 162893 79477
19300 -81653 -47461 186822 -142264 -367394 160690 256713 122058 -1640 34520 -80873 -131179
19289 -131179 -146440 120720 -19576 -69320 -114609 -8752 -15182 -108545 107451 -264215 -81484
19277 10782 83678 -199869 -318497 -271266 183237 -18989 -139984 -348129 386339 -144417
19266 -323309 158215 59875 -219072 23629 -33075 229857 259433 74473 -323107 60723 -175978
19254 -306013 200073 -193605 15342 19012 -254761 42388 -294223 -227384 199420 140069 -66057
19242f6424l8045C0422Q2231a13433k24671A66675E2242J04417i4124k6543E4265
19230c58825a15135q3431a0111C20142b62166C06318c3528A78671b36725N5946
19220a80779A79927b58811h1538n6003M2121E4397c43442f856l69064A55636b34879
19208g1171j09512B1204a68100K0047e2300B78540D1550a17605I2698a77123H281
19196a85335B8572L6487a46343C22832C687J58415a0137o7713A38574i1551m4331
19185a35882I1502B0306K73342j39095a48170k19063F1944B6805b30505A590M6272
19174D7862R46e8332j0397a0591j41761q7790I669J1519d6673m06238e593G590
19161a52330N4373B76780C1377d02091a72054g2666c3871p0211C0784K7697J51599
$$ plain form
19242 -66424 -104469 30422 112653 -113433 -338104 166675 52242 156659 -94124 -120667 54265
19230 -358825 -115135 -198566 -10111 320142 -262166 306318 -33528 178671 -236725 -180779
19220 -180779 179927 -258811 -81538 -137541 -95420 54397 -343442 -6856 -375920 155636 -234879
19208 -71171 -180683 21204 -168100 -148053 -52300 278540 41550 -117605 92698 -177123 8281
19196 -185335 28572 65059 -146343 322832 3687 162102 -10137 -77850 138574 -91551 -135882
19185 -135882 91502 20306 293648 154553 -148170 -367233 61944 26805 -230505 1590 47862
19174 47862 48808 -58332 -68729 -10591 -152352 -240142 9669 21188 -46673 -452911 -5593 7590
19161 -152330 -97957 276780 31377 -402091 -172054 -72666 -33871 -104082 30784 58481 210080
19150B10080j03379D6527K96787b01693a8565j17977B01535l2545D5528L6001
19140H1529c8738A3219a11752j26419F8244Q4295o4187b00984i1107l03234a48249
19128i3881j5323E2549K4533b40621O2396n2679j9150j7673A09410J6e0013l3317
19116h3330m7721k26520h9448m5683c1522a5219j37744R136n59e5558p1644D1824
19103b48078J12743j19263r622B17434J63839c56702a03719p3630L4663k6780
19093a69466p0520b166r6585m9104c8471A82562K9544e6783m8355k44456J04404
19082b45190J08721e3718C3495J03g1907D19718c69428a06730j70960g205l6095
19071d3300n4312j80284H918L1848K25174a93239N1397A7212b35975a06327r8998
$$ plain form
19150 210080 106701 46527 343314 -201693 -18565 -136542 201535 168990 45528 81529
19140 81529 -38738 13219 -111752 -238171 68244 152539 88352 -200984 -91107 -394341 -148249
19128 -93881 -109204 52549 77082 -240621 -178225 -230904 -250054 -267727 109410 109426 -50013 -83330
19116 -83330 -131051 -357571 -89448 -135131 -31522 -15219 -152963 -143827 -144386 -55558 -127202 41824
19103 -248078 -135335 -254598 -264220 217434 381273 -356702 -103719 -177349 -142686 -169466
19093 -169466 -239986 -2166 -98751 -147855 -38471 182562 212106 -56783 -105138 -349594 -245190
19082 -245190 -136469 -53718 33495 33598 -71907 419718 -369428 -106730 -277690 -7205 -43300
19071 -43300 -97612 -277896 8918 40766 265940 -193239 -141842 17212 -235975 -106327 -205325
19060b05325h7695A86388L4134c02076A01776a09515a3635A03738m6642J28346
19050A85442H6564A6226c1251j27842l096M3910B40899j06634D5908d2689k2171
19039f4860I6351d25933i493H6482I93K34701A7088a14051k8267A1029a00582
19027a25553D754Q1356C8211a2736E7630a18822B39423h7656B19500e5839p8709
19016a34548D0956i8741I7919j9799a22983e9179F8748J00448a0211j18906O4244
19005f4873B5129b06249A30733B5356a6343k59491a10470E8546A2818i6260J4208
18994h2052k72190B0592b22285a04340c0858A5423h2157B88104d89506b01102
18983i2980j36696B6870a02103e207k68280c5548j89618q4544B97349c54311h8954
$$ plain form
19060 -205325 -87695 186388 220522 -302076 101776 -109515 -13635 103738 57096 185442
19050 185442 86564 16226 -31251 -159093 -162189 -118279 240899 134265 45908 -42689 -64860
19039 -64860 96351 -425933 -9493 86482 993 235694 17088 -114051 -142318 11029 -100582
19027 -125553 4754 86110 38211 -12736 57630 -118822 239423 -87656 219500 -55839 -134548
19016 -134548 40956 -98741 97919 78120 -122983 -59179 68748 169196 -10211 -129117 -64873
19005 -64873 25129 -206249 130733 25356 -16343 -275834 -110470 58546 12818 -96260 -82052
18994 -82052 -354242 20592 -222285 -104340 -30858 15423 -82157 288104 -489506 -201102
18983 -92980 -229676 26870 -102103 -5207 -273487 -35548 -225166 -309710 297349 -354311 -88954
18971c878r226q4160H1378R8201a65065G8906c333B0771a64522f5505A28082a18101
18958A05979H159J16388k1750k8123A1824c02191C54910b53990i1644j21859C78281
18946b02029A1241J52793a9412F9148a45436G1115J34161a67495e3377p131q8561
18935a49069A95206C3668a5596D2056O851e0397j8029A29474c46389b5471j49718
18924a75189B9665b4803j2448r0633c8021n2070M4421j16063M6625j7085O640
18913a25553A52806a48596l3190j01071G3793b88900j4174A79683C2766b2282
18902H1469c24644a05039C24424a49129a8482H030c07565J21876A8288J04815
18892A23103g9263A21308f1495I5441c8818k11445E0799K20374b01133A09991
$$ plain form
18971 -3878 -13104 -97264 81378 179579 -165065 78906 -3333 20771 -164522 -65505 128082 -118101
18958 105979 8159 124547 102797 74674 11824 -302191 354910 -253990 -91644 -213503 378281
18946 -202029 11241 164034 -19412 69148 -145436 71115 205276 -167495 -53377 -60508 -149069
18935 -149069 195206 33668 -15596 42056 48907 -50397 -68426 129474 -346389 -25471 -175189
18924 -175189 29665 -24803 -37251 -127884 -38021 -90091 -45670 -161733 -115108 -132193 -125553
18913 -125553 152806 -148596 -181786 -282857 73793 -288900 -303074 179683 32766 -22282
18902 81469 -324644 -105039 324424 -149129 -18482 8030 -307565 -185689 18288 123103
18892 123103 -79263 121308 -61495 95441 -38818 -250263 50799 271173 -201133 109991
18881B85671c2751A29468n3329h490n8919k2156C3072d16117B9022c33000F5097
18869i7670A48194n4322C4438a36173N5687l6378j61897c9914D2681f489l50814
18858c57303g661A11990Q7225c07956a01640k7711D09636a55750j36710a30836
18847A67121d4841a6627D35301F1150j5219a95690J8191C5394a67764J4237F6015
18835H5750D1841J8968A014J03708A0952a7063j36656B8697P0342r889H097K15212
18823B23309a66997h1329A42326A0351J21199a62377B3716e3502b4079k04731
18813b28810K5036d8123C67422f9679B59573f3650I2251N5195l8361g8823A93827
18801a67465K2157K9935m0154c2091j2378K0975B5688i8434p2314O9138k51344
$$ plain form
18881 285671 -32751 129468 76139 -8490 -67409 -89565 33072 -416117 29022 -333000 65097
18869 -97670 148194 93872 34438 -136173 -80486 -116864 -278761 -39914 42681 -6489 -357303
18858 -357303 -7661 111990 199215 -307956 -101640 -129351 409636 -155750 -292460 -130836
18847 167121 -44841 -16627 435301 61150 45931 -195690 -177499 35394 -167764 -153527 66015
18835 85750 41841 60809 1014 104722 10952 -17063 -153719 28697 99039 89150 8097 223309
18823 223309 -166997 -81329 142326 10351 131550 -162377 23716 -53502 -24079 -228810
18813 -228810 -203774 -48123 367422 -69679 259573 -63650 92251 147446 109085 -78823 193827
18801 -167465 -145308 -115373 -155527 -32091 -44469 -23494 25688 -98434 -170748 -101610 -352954
18790c52954B99392c9014j65778f1870l54736F9045j7041g472p2795a4383q4033
18779i8416B35661b9219k48046J03304O1939n2512N9201G0462O6067F0000a31773
18767a55849j356B75154K6686e8644l3643b6669k5357r6070d9799K0966l0773
18756e9606G1962J8057e4903k72785J20101d7175B34156a11064A09048b10874
18745G722f971I9083Q9132c50954A28982b36352O4128e7175n7459j62021C2509
18733c15832a33080C8945e7785A30107d0098k65034b5489n2258p4880A33366B6521
18721b11057Q5321j3950c7227l62631C6976a95952I7156M3669h0064E0532a85857
18709a85812j75564a60609e2943B44037c7274q9496d3536n9792A5473a22134C3973
$$ plain form
18790 -352954 299392 -39014 -204792 -61870 -416606 69045 52004 -7472 -80267 -14383 -98416
18779 -98416 235661 -29219 -277265 -173961 -112022 -164534 -105333 70462 136529 60000 -131773
18767 -155849 -157205 275154 301840 -58644 -92287 -26669 -52026 -148096 -49799 -28833 -59606
18756 -59606 71962 90019 -54903 -327688 -207587 -47175 234156 -111064 109048 -210874
18745 7722 -6971 99083 188215 -350954 128982 -236352 -172224 -57175 -114634 -276655 32509
18733 -315832 -133080 38945 -57785 130107 -40098 -305132 -25489 -77747 -152627 133366 26521
18721 -211057 -125736 -139686 -37227 -399858 36976 -195952 97156 140825 -80064 50532 -185857
18709 -185812 -361376 -160609 -52943 244037 -37274 -126770 -43536 -103328 15473 -122134 33973
18697b52567G7015c96566I454P803b24263E2204c82806a82955M0298M5333l0546
18686a27870A36778c04953b8425M616m4877A13489a77204A5623b04452B04039
18675c6318k79220J37156B51512q3868a34273f1063J4183m9919r3633A59610b17493
18663B59922b81226b3735A13872a43232M8927l89803F9335J14893m7079A7262
18652B7244K9820d8058b790p9176C2113b35790B06254d0065B27857c65694B15776
18640a39200Q008m6997A86311a56301e0510D0482c15837B33249G296O2487J03085
18629A72868a85006o20j67945f8185l35696h9677m9804f5708D33059f0062k08521
18618b68583a05421j35181k1170a19593b8879B9439J4047d24419a57420C1001
$$ plain form
18697 -252567 77015 -396566 9454 17257 -224263 52204 -382806 -182955 -142657 -97324 -127870
18686 -127870 136778 -304953 -28425 -23809 -68686 113489 -177204 15623 -204452 204039
18675 -36318 -315538 -178382 251512 167644 -134273 -61063 -46880 -96799 -190432 159610 -217493
18663 259922 -281226 -23735 113872 -143232 -94305 -484108 69335 184228 137149 17262
18652 27244 57064 -48058 -2790 -81966 32113 -235790 206254 -40065 227857 -365694 215776
18640 -139200 -131192 -178189 186311 -156301 -50510 40482 -315837 233249 7296 69783 172868
18629 172868 -185006 -185626 -353571 -68185 -403881 -89677 -139481 -65708 433059 -60062 -268583
18618 -268583 -105421 -240602 -261772 -119593 -28879 29439 43486 -424419 -157420 31001
18607a25504p1658H2546b73216g05j92243Q9386K4257i149j3436q091r9536q917
18595a39129A12928a0775q763k62295d1438E7346B1242b10674R6000j7239l18438
18584d50351A46815F8268a03105B08677a4731j87364g9451C2461R4847b73827
18573c7804A990b50780A13018J817Q5048e8440l7369B27836a2501m98151C0784
18561a73603j37328Q8018q6420q2889i6316q6334q8943P1924R7529C75469a09068
18549D0182c78900g7263B94016b17134R0369F1112d5414j5172C42003b3044C4100
18537I3236h7916l82310a4429k94051m0155A3178K30578g1540A01985K2232J75360
18526B99577i9069K1665B0309f9276G4667a70957Q0704A8149J1325a18932N4082
$$ plain form
18607 -125504 -197162 82546 -273216 -705 -192948 -103562 -79305 -9149 -22585 -30676 -130212 -139129
18595 -139129 112928 -10775 -19538 -281833 -41438 57346 21242 -210674 -114674 -131913 -450351
18584 -450351 146815 68268 -103105 208677 -14731 -202095 -79451 32461 127308 -273827
18573 -37804 1990 -250780 113018 114835 199883 -58440 -95809 227836 -12501 -510652 30784
18561 -173603 -310931 -222913 -309333 -392222 -96316 -182650 -271593 -199669 -102140 375469 -109068
18549 40182 -378900 -77263 294016 -217134 -126765 61112 -45414 -60586 342003 -23044 34100
18537 93236 -87916 -470226 -14429 -308480 -348635 13178 243756 -71540 101985 124217 299577
18526 299577 -99069 -77404 20309 -69276 74667 -170957 -90253 18149 29474 -118932 -64850
18515f4850I8515b87817D4465L9735h1429H5556J82878B1695L05146d84283g113
18503a50714b7852l3118G1944b92055h1900F5938B6973N623c69990g083l58445
18492c65528B85240a30149l5506f238n5961q4513l6669I6370J44148b5069l85034
18481d10103k20437b09635d4988j44771A86912D9625b93993B8921J61335B0427
18470D9647a02400I6164a80329B21191c63392A30757a88485I990c1290D31715
18459G377L02812a67574B52495a56239A27984c15929A09624E2369a31838k0850
18449a52688n0894m7089A02372c0727A01731J54910E8174f42561A77160q7210
18439H9950b80091J00448j19733g2013I020J19221b17587B32554d55214B0127
$$ plain form
18515 -64850 98515 -287817 44465 84200 -81429 85556 268434 21695 326841 -484283 -7113
18503 -150714 -27852 -60970 71944 -292055 -81900 65938 26973 32596 -369990 -7083 -365528
18492 -365528 285240 -130149 -165655 -6238 -62199 -146712 -183381 96370 240518 -25069 -410103
18481 -410103 -630540 -209635 -44988 -189759 186912 49625 -293993 28921 190256 20427
18470 49647 -102400 96164 -180329 221191 -363392 130757 -188485 9990 -31290 431715
18459 7377 310189 -167574 252495 -156239 127984 -315929 109624 52369 -131838 -152688
18449 -152688 -203582 -250671 102372 -30727 101731 256641 58174 -642561 177160 89950
18439 89950 -280091 -179643 -299376 -72013 9020 128241 -217587 232554 -455214 20127
18428b21582E3998a36172B07149h1228L8385J9324k20661A19707b43270j44815
18418c88085B15238a11445j51715i943k7989o428A16559J77878h0770L6347A31253
18406D3116a59612A33912J57719A10769h2576A08065j1963C060L08383a08265
18395a28645A38309K02469A04903A1192c1542A2546a87522j07936j48525h1675
18384b23585A81501a62645B44552e3080B47792a54618K876m97061g7490J726j66778
18373b42542A92695E3511b21314A08707d6828k92689a36588p6270A37364a36070
18362A97356a41919A48426L7199J70996e8792B32030a26131C4606c17897J3840
18352c04057f2216C05638e3678c16r0195A25106A7390J10791c06293A51387f975
$$ plain form
18428 -221582 53998 -136172 207149 -81228 -42843 -23519 -244180 119707 -243270 -388085
18418 -388085 215238 -111445 -263160 -9943 -37932 -44360 116559 294437 -80770 -44423 131253
18406 43116 -159612 133912 291631 110769 -82576 108065 96102 3060 311443 -108265
18395 -128645 138309 340778 104903 11192 -31542 12546 -187522 -295458 -443983 -81675
18384 -223585 181501 -162645 244552 -53080 247792 -154618 -151742 -648803 -77490 -75764 -242542
18373 -242542 192695 53511 -221314 108707 -46828 -339517 -136588 -212858 137364 -136070
18362 197356 -141919 148426 185625 356621 -58792 232030 -126131 34606 -317897 -304057
18352 -304057 -62216 305638 -53678 -316 -90511 125106 17390 128181 -306293 151387 -6975
18340B44217b23915C5333e471k98213c7812F7710b97856B05262D004J56600a60062
18328d4383q5240C28330a11203j20462O6353B71837a18868o2491q7730a17473
18317a15350D82973C3129p283a72108h432r9008M2341C9124h2022j47499F4144
18305a33770O919k12773J59769H4485B2205f1754k47757i5519B0098J93762q2381
18294A31479c12670A62480c2544j52885C66195a36958e3416G7582Q3304a69413
18283G548c2136B704J12830b41454k105d0500A68567E8669b75247A07208c5184
18271A73830a56492r9247d4638j16405j66386N2764a6085j85293c0678F2368a16386
18259b45395a07058p3602a0081k307o4130B64377b48472I4903a10484o1852B25778
$$ plain form
18340 244217 -223915 35333 -5471 -303684 -37812 67710 -297856 205262 4004 160604 -160062
18328 -44383 -129623 328330 -111203 -231665 -165312 271837 -118868 -181359 -269089 -117473
18317 -115350 482973 33129 25846 -172108 -8432 -107440 -65099 39124 -82022 -229521 64144
18305 -133770 -126851 -339624 -179855 84485 22205 -61754 -309511 -95519 20098 213860 131479
18294 131479 -312670 162480 -32544 -185429 366195 -136958 -53416 77582 160886 -169413
18283 7548 -32136 2704 115534 -241454 -243559 -40500 168567 58669 -275247 107208 -35184
18271 173830 -156492 -255739 -44638 -161043 -327429 -274665 -16085 -201378 -30678 62368 -116386
18259 -245395 -107058 -180660 -10081 -12388 -76518 264377 -248472 94903 -110484 -172336 225778
18247E2501K04115m0033p5038a26703j5787i527F6061a75849J5365A38186a56841
18235b53849g5677C58118b82629e9259j0268A22602A1739c1419E612a39532n6553
18224a96085A35569a64041b0653I6776f4476G1322j2608J10574e55571a84386
18213D3436N952a17636J7221o1056H3155J86882b56548d997D7399c95695h0194
18201C8736b26534B44987A0611c37369B68773A30217j8377J59037a91352D3059
18190a23245j9398A29612J01879A10685l3612g1121k58247H1527c8639M13o8872
18179a07098j46733Q8242A74106i3109k36754A0503f5529o9780d907l54710G5844
18167A83490b51093j37657A66334G3692a50190L1727C64775A53221a2322j62654
$$ plain form
18247 52501 256616 216583 141545 -126703 -142490 -9527 66061 -175849 -160484 138186 -156841
18235 -253849 -75677 358118 -282629 -59259 -69527 122602 11739 -31419 5612 -139532 -196085
18224 -196085 135569 -164041 -20653 96776 -64476 71322 58714 169288 -555571 -184386
18213 43436 49388 -117636 -100415 -161471 83155 270037 -256548 -4997 47399 -395695 -80194
18201 38736 -226534 244987 10611 -337369 268773 130217 111840 270877 -191352 43059
18190 -123245 -142643 129612 231491 110685 77073 -71121 -329368 81527 -38639 -38226 -107098
18179 -107098 -253831 -165589 174106 -93109 -329863 10503 -65529 -135309 -4907 -359617 75844
18167 183490 -251093 -388750 166334 73692 -150190 -118463 364775 153221 -12322 -174976
18157a74976C95101a62096k2689o2919B2787O5732a05580D2184b35761f6819j65720
18146b32539j175h3731A35450A883L18826j19425h3190L910l2197q7997E3012
18134A67149C9437P4591f6814I7669f3559q6794E9711l425b35196g748B2506J87368
18122B09874a6596j8158A89773P3917J4561a06792c8672C14338j35260a33406
18111b51538J22765J8888C22510e0870G2857Q1169J39094a77769n5682A43055
18100a50800A7671a22549n7464K8499C51796F3965d4908H8875J06929h9875j66282
18089b56157B1182a24195j00227A30697a27161A36133d6504j78042A34907b97491
18078B65345e35643F6711N2124o31A7513h1985j23989G80a88914B02694a35086
$$ plain form
18157 -174976 395101 -162096 -184785 -247704 22787 88519 -105580 42184 -235761 -66819 -232539
18146 -232539 -233714 -83731 135450 1883 320709 201284 -83190 -79280 -111477 -199474 53012
18134 167149 39437 114028 -66814 97669 -63559 -150353 59711 56286 -235196 -7748 22506 209874
18122 209874 -16596 -34754 189773 263690 278251 -106792 -38672 314338 179078 -133406
18111 -251538 -128773 -109885 322510 -50870 72857 154026 293120 -177769 -233451 143055
18100 -150800 17671 -122549 -180013 -151514 351796 63965 -44908 88875 195804 -89875 -256157
18089 -256157 21182 -124195 -224422 130697 -127161 136133 -46504 -224546 134907 -297491
18078 265345 -535643 66711 118835 118204 17513 -81985 -205974 780 -188914 202694 -135086
18066A09242J12959c58855E9183a65058l23973a05182b150k24347h1824b1797
18055H0213a25793A47040A3202f3121C9719N3527M68649I9576a86142I7092a13398
18043I0347c69939a70067E6789b3263j86064a4269A52361b86053A84828a78588
18032h4425j88256d5014m1068K4396B02384p0620h9788h643c379G0216b87586
18020a57292Bc4722j84994A17521d3462A26231g1709j14222B66512i4954m2913
18009a37867j01333A0940a85367j42472A19471a52759P437N6072L3927k1430k91209
17998c67962A01794b37936N8203A5016e7535C8026b656l0715H1892J07919b07177
17986g785C46368b10632A01254A5276a26610D0745b75342a01056C38202i5994
$$ plain form
18066 109242 222201 -358855 59183 -165058 -489031 -105182 -2150 -226497 -81824 -21797
18055 80213 -125793 147040 13202 -63121 39719 93246 561895 99576 -186142 97092 -113398
18043 90347 -369939 -170067 56789 -23263 -209327 -14269 152361 -286053 184828 -178588
18032 -84425 -272681 -45014 -86082 -61686 202384 131764 -89788 -8643 -3379 70216 -287586
18020 -157292 2 -34722 -219716 117521 -43462 126231 -71709 -185931 266512 -94954 -137867
18009 -137867 -239200 10940 -185367 -327839 119471 -152759 -145322 -89250 -55323 -76753 -367962
17998 -367962 101794 -237936 -179733 15016 -57535 38026 -2656 -33371 81892 189811 -207177
17986 -7785 346368 -210632 101254 15276 -126610 40745 -275342 -101056 338202 -95994
17975a16163r3006M7112J9967o8198A7634b31172A21997a02613B73309R2000a16300
17963a25201r7446l069f7164n3201a6750B10912a45981e6028p7581i741A40140
17951E7827b14944a06914A02140a21816a6651j37149k18591B12177r8732a37056
17940I7738J4954C2524e6549p9978c8518j22703F0836j2793h5407d518j21393
17929a25911G0705M9353E5885b95452Q4243N4121j85768a07251j25723A97251
17918B29358D9473J22272c8531I7758b44586A07584b57539C7861J35192b70453
17907A09284C0945b84176E0130b30645I07J997a28565H9708b08152J9011L4792
17896a54349l5660e6977j72873I6738b61146F2485N6366K8960a30154C1750J95741
$$ plain form
17975 -116163 -209169 -162057 -142090 -210288 17634 -231172 121997 -102613 273309 365309 -116300
17963 -125201 -222647 -225716 -67164 -120365 -16750 210912 -145981 -56028 -133609 -9741 140140
17951 57827 -214944 -106914 102140 -121816 -16651 -153800 -372391 212177 113445 -137056
17940 97738 112692 32524 -56549 -136527 -38518 -161221 60836 48043 -85407 -4518 -125911
17929 -125911 70705 120058 55885 -295452 -211209 -157088 -342856 -107251 -232974 197251
17918 229358 49473 171745 -38531 97758 -244586 107584 -257539 37861 173053 -270453
17907 109284 30945 -284176 50130 -230645 907 2904 -128565 89708 -208152 -189141 -154349
17896 -154349 -190009 -56977 -229850 96738 -261146 62485 118851 147811 -130154 31750 227491
17885B27491r2659b7602j08915c0724l01960C7883b63878e0600m2499A55125b80575
17873d5594C3371a89055h3260l170f861E6697a92637H9925b1999I4473d27641
17861B74238a06161A55679a82896e23k21754C06563b75649H6494a67241O3691
17851a03550a229l3032D57099B0540a12014B7963f8056A77553a73107a5592A14184
17839A92267O6023d66994g5261F7720h928C4842J42960D9102A2N1786J98442F1335
17826H5097l4641O953N8017b91586C1503K24893a88906A12023f6826a7255P924
17815i331k04395j83726O5866I1143a72832G3668O9765a50745I0680J22940b78521
17803I8920G752a03614I9550N9014a10292A01090B0635J2854h2939A30322c0770
$$ plain form
17885 227491 134832 -27602 -136517 -30724 -332684 37883 -263878 -50600 -93099 155125 -280575
17873 -45594 33371 -189055 -83260 -86430 -6861 56697 -192637 89925 -21999 94473 -427641
17861 274238 -106161 155679 -182896 -523 -222277 306563 -275649 86494 -167241 -103550
17851 -103550 -1229 -34261 457099 20540 -112014 27963 -68056 177553 -173107 -15592 114184
17839 192267 258290 -466994 -75261 67720 -8928 34842 177802 49102 12 51798 250240 61335
17826 85097 50456 57409 115426 -291586 31503 256396 -188906 112023 -66826 -17255 -9331
17815 -9331 -213726 -397452 -331586 91143 -172832 73668 143433 -150745 90680 213620 -278521
17803 98920 7752 -103614 99550 158564 -110292 101090 20635 33489 -82939 130322 -30770
17791e0615C9809J58948m3713C8446a3434j77975l3764O583A73431E9544Q7715
17780A47259m8014a88096O2124A38103J54388J36253A07702J40003F8298L10501
17770C78799d6217E0836J60956f16596A13491K5976D5956b93923a12773K8194
17760h4579B44263I8789c25305J11623E022J48710J26043f3321G6022K513Q9504
17749A68039o0078a06788K8109k31899a01961B71033A4370J41456n9949a05084
17738A1273P9910L327l2993e1451B11599o7143J16124A15637K6492b0371C11872
17726c45946d9416j69952H1525j7647b00307P9212e0394o7141q8251A74504c4923
17714a75903A38032a92649h4375J1150J4688C1458M5408K7826a15947j10134R8250
$$ plain form
17791 -50615 39809 198757 155044 38446 -13434 -191409 -225173 -218590 173431 59544 147259
17780 147259 99245 -188096 -125972 138103 292491 428744 107702 247705 68298 378799
17770 378799 -46217 50836 211792 -616596 113491 139467 45956 -293923 -112773 -84579
17760 -84579 244263 98789 -325305 -213682 5022 153732 279775 -63321 76022 78535 168039
17749 168039 107961 -106788 -78679 -310578 -101961 271033 14370 155826 95877 -105084
17738 11273 91183 94510 61517 -51451 211599 144456 260580 115637 142129 -20371 311872
17726 -345946 -49416 -219368 81525 63878 -200307 -121095 -50394 -117535 -205786 174504 -34923
17714 -175903 138032 -192649 -84375 -73225 -58537 31458 76866 104692 -115947 -226081 -127831
17703a27831A25892j0396i8243j06919b4565k00241M2694g5147C05013a3888k24147
17692b38035B45166E7359J46536k0258g8047A19690D1618a34976D00140A04086
17681A14871B2998b71980P0879K6901B50392e4990j56295g4600C7851J17280c99809
17669a7552A14281m1569K0439l0952a83361A7447J13540m653A2793L60215E2551
17657A71858a92609P2054A7931a11787M6293m2719j66153C6184e8952B9263c09846
17645C29489a66683B81093E3089a79332l615B1674b94689A53544i9257B6598b29173
17633c8780p4606F9845N1922a35201B05718D3154J8161Q1759m5859b69573C42943
17621B38512q0366L0422m6707a52784O4663E5780c99754B5834a57815G9523a2524
$$ plain form
17703 -127831 125892 115496 -98243 -205162 -24565 -224806 -182112 -75147 305013 -13888 -238035
17692 -238035 245166 57359 203895 183637 -78047 119690 41618 -134976 400140 104086
17681 114871 22998 -271980 -201101 -174200 250392 -54990 -211285 -74600 37851 155131 -399809
17669 -17552 114281 72712 93151 62199 -183361 17447 130987 126334 12793 373008 52551
17657 171858 -192609 -120555 17931 -111787 -65494 -108213 -274366 36184 -58952 29263 -309846
17645 329489 -166683 281093 53089 -179332 -182947 21674 -294689 153544 -99257 26598 -229173
17633 -38780 -113386 69845 121767 -135201 205718 43154 61315 143074 97215 -269573 342943
17621 238512 158146 188568 141861 -152784 -88121 55780 -399754 25834 -157815 79523 -12524
17609B70818I6138e0404l5219c967j59617B02175b49099F2326J12793p8845b9212
17597a28620j21962G8180A8714K42918H9475c2734A84692a12273j57567a28519
17586D7812a90574i3323j6372B02602G5581L5541J19612C0570J3509P743c9212
17574I5276A7245e6462A0219K7715a05439d3885j77309N9246C31249I4767A6722
17562A7114b01167C04033j24303C2434J55342a4648k95185A57456i4920l7591
17552a32511j25588F3055K68541j26955a38331A21071m5084K64271b2359C1653
17541g7322A36494h1043K7615G3111A9715L22262E5147J99628q1385B2128J86835
17530B08963b5306A84259h107A65400J24697a65355I8645J31623k2040a37655
$$ plain form
17609 270818 96138 -50404 -85623 -3967 -163584 202175 -249099 62326 175119 96274 -29212
17597 -128620 -250582 78180 18714 261632 89475 -32734 184692 -112273 -269840 -128519
17586 47812 -190574 -93323 -109695 202602 75581 111122 230734 30570 44079 51822 -39212
17574 95276 17245 -56462 10219 37934 -105439 -43885 -221194 -161948 331249 94767 16722
17562 17114 -201167 304033 179730 32434 187776 -14648 -309833 157456 -94920 -132511
17552 -132511 -258099 63055 331596 204641 -138331 121071 75987 340258 -22359 31653
17541 -77322 136494 -81043 -53428 73111 19715 341977 55147 254775 173390 22128 208963
17530 208963 -25306 184259 -8107 165400 290097 -165355 98645 230268 208228 -137655
17519B14724K1553p2911h8632K7943m2927D0094K98713d7449p0886j4974I7862
17507A09811J74242a49062B06620a56727P0244E9168P2690J64451e1967r5512
17497a47479C54696I521i0870k3603j38953i9741H6907a1723B86733A09298K21011
17486C30309h769C89046A69568m9124J77115n2849O9788c855A60707o8980a9909
17474D4603e718C7858L59224A2238a37457K8527A75207c9142C00802a92884A12720
17462B44137d723n563B89213A39410F725i4429A45303g008B51756G4316J66159
17451B40475o9622D2136a08672B68957j4562J27338J64576q9982F580L41911A29083
17439D50513n4883J08664J4891j21885j47627O5682j8506r0068h8212A91947I0120
$$ plain form
17519 214724 236277 163366 -88632 -60689 -103616 40094 338807 -47449 -118335 -133309 97862
17507 109811 284053 -149062 206620 -156727 -86483 59168 131858 296309 -51967 -147479
17497 -147479 354696 9521 -90870 -114473 -253426 -99741 86907 -11723 286733 109298 330309
17486 330309 -8769 389046 169568 120444 297559 244710 314498 -3855 160707 91727 -19909
17474 44603 -5718 37858 397082 12238 -137457 -108930 175207 -39142 300802 -192884 112720
17462 244137 -4723 -10286 289213 139410 6725 -94429 145303 -7008 251756 74316 240475
17451 240475 170853 42136 -108672 268957 254395 381733 546309 456327 6580 348491 129083
17439 450513 395630 504294 519185 397300 249673 315355 296849 206781 -88212 191947 90120
17427A34643J40547L6991j36907R1435A28808J80647J05920L1928J29465k5309
17417E51459G6470O4423P04698l40418A70516L9128J44363j0909A60081J30141
17407B90222p8550j157O3311K52012B43495J36980A1194a25022P85A31683K78274
17396D09957A59820J60329k2913q8542j3131M8334L4190k9082F5226b3180l34599
17385c57779C87164r2493A26213J80564n1312b63211A18110J68961f3163C51268
17374d6148A56083O7705P484E1817J83314M8165g4410F8531R7329J01137J63273
17363D30270H3023K02142A0072J48102D640K49228l0455N9090G0914a3584j50970
17352a64554j2035A63952L48529A05340K81154r8386A10365K6267m0018a36287
$$ plain form
17427 134643 275190 312181 175274 266709 128808 309455 415375 447303 576768 551459
17417 551459 76470 140893 845591 505173 170516 209644 354007 343098 160081 290222
17407 290222 211672 210515 273826 525838 243495 380475 11194 -125022 -124237 131683 409957
17396 409957 159820 320149 297236 208694 195563 243897 278087 249005 65226 -23180 -357779
17385 -357779 387164 294671 126213 306777 255465 -263211 118110 287071 -63163 351268
17374 -46148 156083 223788 231272 51817 235131 283296 -74410 68531 165860 266997 430270
17363 430270 83023 285165 10072 158174 4640 253868 223413 282503 70914 -13584 -164554
17352 -164554 -176589 163952 512481 105340 386494 288108 110365 136632 96614 -136287
17341A40486K96013f949A55217E4677j711k0054J4855a97690e5014B51076F8828
17329B04436k1931C7296b9255E07446j69694A6652O5097J16558r2797K98754D5032
17317B04458l0072M9882H1967L7648M7267n3517o941D5044N1743L15920A40049
17305A98506J78904j79977N7766o5637J42690C3793L18586A18563D1411J14749
17295A56160b1674A45801J6256b4938C70390F1111J7856E853J28413a07016A3500
17283A05018J64222l4818G3103Q5006J25314c5337B90506p6079I9938L19277r4625
17272C24590p4551A16051J71108A08383K58658n8266J10380j75892h739j03452
17262a12191n229B12485J72180l7399L8402B9512b09219A63821n5213M3099D5598
$$ plain form
17341 140486 436499 -6949 155217 54677 52966 32912 47767 -197690 -55014 251076 68828
17329 204436 182505 37296 -29255 507446 337752 16652 81749 198307 105510 404264 45032
17317 204458 174386 224268 81967 119615 166882 113365 106424 45044 96787 412707 140049
17305 198506 377410 197433 255199 189562 332252 33793 352379 118563 41411 156160
17295 156160 -21674 145801 162057 -24938 370390 61111 78967 5853 134266 -107016 13500
17283 105018 269240 234422 73103 158109 283423 -35337 290506 214427 99938 419215 324590
17272 324590 250039 116051 287159 108383 367041 308775 419155 243263 -8739 -112191
17262 -112191 -117420 212485 384665 347266 385668 29512 -209219 163821 108608 151707 45598
17250B40895p2828K60280k10376j7080E5161R8058C4209K73018K4454o3411k0537
17239B47733h3173j03836B51444o0718a63826C78089j05088l6893l9400L1789
17229B28497m9694J11377A38639C0646J17129K50663A74632E7329R3984a5759
17218h1018A07468J9864J4954L77610C1946K69844o1032P0757A49135J5661a28178
17206C70826j4041C7492K69753J15653A7059L16072A64157L0964J17624J41919
17196D54664B17680O4378P0197M6702j33345G7190R5528K62307Q329j37981r6463
17185B08910o2438o1523K79390p3392A21448J58473I4746M31943j53059n2188
17175C21442A45511D9956K0098J30092L06958M4848B74666K23791j76077E0999
$$ plain form
17250 240895 168067 428347 217971 200891 55161 153219 34209 307227 331681 268270 247733
17239 247733 -83173 -187009 251444 190726 -163826 378089 273001 236108 196708 228497
17229 228497 178803 290180 138639 30646 147775 398438 174632 57329 151313 -15759
17218 -81018 107468 127332 142286 519896 31946 301790 240758 311515 149135 164796 -128178
17206 370826 356785 37492 307245 422898 17059 333131 164157 195121 312745 454664
17196 454664 217680 282058 352255 398957 265612 77190 172718 435025 443354 305373 208910
17185 208910 146472 84949 364339 290947 121448 279921 94746 526689 373630 321442
17175 321442 145511 49956 70054 200146 507104 551952 274666 498457 322380 50999
17164A78842J53986A40377j6985J30694l9646J03202q3516J64299n2838L5676
17154C81263J07747p3837H8529K79854J82140k32936J78596k06656O2493H2605
17143B22218K22433j3732L02839k77275j63456p9847q7431J56128J22540r814
17133C94603j48936o4925L36121e0803F69495A60697E7177N20433o0864A21328
17122D97848C8831M23798j78732J64640j88663K5074k5925J6825K24490L47405
17112H47743C67353J18004j742A63933J58899F1654L60106j8214N2979q6566J53093
17101E23052j37407L54090k72307j67020L26952C08273l0186L78933j90231J7012
17091D83801B27414j01639N36403j8760J37192C16232K21429p5805j48488A53995
$$ plain form
17164 178842 332828 140377 123392 254086 214440 317642 234126 398425 345587 381263
17154 381263 489010 415173 88529 368383 550523 317587 496183 289527 352020 82605
17143 222218 444651 430919 733758 456483 293027 213180 125749 281877 404417 394603
17133 394603 245667 180742 516863 -50803 669495 160697 57177 577610 516746 121328
17122 497848 38831 462629 283897 448537 259874 284948 259023 275848 500338 847743
17112 847743 367353 485357 483615 163933 322832 61654 421760 403546 456525 369959 523052
17101 523052 385645 739735 467428 300408 627360 308273 278087 657020 466789 483801
17091 483801 227414 125775 662178 643418 780610 316232 537661 461856 313368 153995
17080D00829K21907R275o9510J2344I8189L3899N00580K005j90460K25540C29757
17068B36393N44087C21467q7848L08698p3900J60724n2259J06411k20044R4943
17058E58192q6569m1344j23527L28347r0276L38751C22127J49720M5558J64184
17048F81589J15817B72749M87746k11218k197K20771C53798K53621k6483k31425
17038C49511M69010m01853J47592j9815p4078K14125B97550J74831O4148J60520
17028F97049C40291L49029j18189L19510k58568n2389P8729R8814k8405j83366
17018E45456L47714k52296K16268Q9645D33725M02872j49891k92318N66553l29597
17008F31344M33620j5599m45220q3854J98185J65723k65195K87233l34330J28781
$$ plain form
17080 400829 622736 632011 562501 574845 98189 132088 632668 634673 444213 669753 329757
17068 236393 780480 321467 233619 542317 468417 629141 576882 683293 463249 558192
17058 558192 471623 430279 306752 635099 544823 883574 322127 471847 517405 681589
17048 681589 797406 272749 760495 549277 547080 767851 353798 607419 580936 349511
17038 349511 818521 416668 564260 544445 470367 684492 297550 472381 536529 697049
17028 697049 340291 689320 571131 890641 632073 579684 658413 757227 728822 545456
17018 545456 893170 640874 857142 946787 433725 836597 686706 394388 960941 631344
17008 631344 1064964 1049365 604145 520291 718476 884199 619004 906237 571907 700688
16998G00688J68154m8234m0333k53882K46297j853J14229P2326j63024J75554
16988I69922k686j93998J20051n8564q7549J95872k8343j69918L07700j74741
16978H77746j10812J72269j38669L90742n56641M45340p9186j94521Q243M18476
16968A232987j61366k33699K91423n48430L50869R3789J12831q2018j92273n4867
16958H09246J80968L3061J39942m48439M81739M9199k2596r9427k36619J48027
16948A035101Q0523K49864n5106j79080R323j16407K25371j76261m63719Q44759
16938A454368n52768M26219k80944n8541M39092k65883J81475j81193L52771j88810
16928A325786L47254r8456j29460p0333j59963L97958k26823N1692J32966o05445
$$ plain form
16998 700688 868842 820608 780275 526393 772690 770837 885066 957392 794368 969922
16988 969922 967236 773238 893289 834725 747176 943048 914705 744787 1052487 877746
16978 877746 766934 939203 800534 1191276 634635 1079975 1000789 806268 814511 1232987
16968 1232987 1071621 837922 1129345 580915 931784 1025573 1138404 1056386 864113 809246
16958 809246 990214 1023275 1163217 714778 1196517 1245716 1223120 1123693 887074 1035101
16948 1035101 1115624 1365488 1310382 1131302 1140625 1024218 1249589 1073328 609609 1454368
16938 1454368 901600 1327819 1046875 988334 1427426 1161543 1343018 1161825 1514596 1325786
16928 1325786 1673040 1574584 1445124 1374791 1214828 1612786 1385963 1437655 1570621 965176
16918I65176K25462N86881m70252L81805k23997R8212k10278N86770m30205L2767
16908A542341J08660J31701k6464j03876o3344O58619p11969k408J93077o9417
16898A656920J59662o3319J85648j45162L03478m53893K58738o0780j33023K92396
16888B000665l39072K60637k2115L14266q364q2210K79603l1140K8992j11410
16878B289852j64115J09029o4194L30368r9025j94246M44280k9530o5759K72991
16868B829651j47884O0760j16205j36905L89464n076R252k0617K32862J06806
16858C202108l89465J02745J32463K86282m9458l62256N25529k88886J39885j5874
16848C283073q9519M77785J26516j67272M8600L28636l07548p242j24949L41381
$$ plain form
16918 965176 1190638 1777519 1307267 1689072 1465075 1563287 1353009 1939779 1509574 1542341
16908 1542341 1651001 1782702 1756238 1652362 1589018 2247637 1535668 1533260 1726337 1656920
16898 1656920 1816582 1753263 1938911 1793749 2097227 1643334 1902072 1841292 1708269 2000665
16888 2000665 1661593 1922230 1900115 2214381 2206017 2123807 2403410 2372270 2401262 2289852
16878 2289852 2125737 2234766 2170572 2500940 2401915 2207669 2651949 2622419 2556660 2829651
16868 2829651 2681767 2742527 2626322 2489417 2878881 2873805 2883057 2862440 3095302 3202108
16858 3202108 2812643 2915388 3047851 3334133 3284675 2922419 3447948 3159062 3298947 3283073
16848 3283073 3193554 3671339 3797855 3630583 3679183 4007819 3700271 3693029 3568080 3909461
16838C909461K1054j40393K68338k6663J66452J47447L18138o1789k15662L23335
16828D709718o8455q1736J52233Q4527R1654J61894p2765J64139L44667J82427
16818E668303j17186L54312j58805J09863M28018l23326L48423P804J08700K93765
16808F719871j04190K52413j06792L39213K72119O7012K72642R9250Q1408N43325
16798H436271L29606L9115j34341L73453K69351L09981k91768O54379L30840L21224
16788A0638111K14049J95569J47960M6190O21326O10300L35024M2508K65203O74214
16778A3790454J75349K19207Q16332M01368N49903M60656P89217K70058N24771
16769A7997315M87446Q28991O60382O65527L16974P22468Q88105J260653Q25563
$$ plain form
16838 3909461 3930515 3790122 4058460 4031797 4198249 4345696 4663834 4602045 4386383 4709718
16828 4709718 4641263 4559527 4711760 4796287 4887941 5049835 4977070 5141209 5485876 5668303
16818 5668303 5551117 5905429 5746624 5856487 6284505 5961179 6309602 6317406 6426106 6719871
16808 6719871 6615681 6868094 6761302 7100515 7372634 7439646 7712288 7811538 7892946 8436271
16798 8436271 8765877 8804992 8670651 9044104 9313455 9623436 9331668 9986047 10316887 10638111
16788 10638111 10852160 11047729 11195689 11241879 11863205 12473505 12808529 12851037 13116240 13790454
16778 13790454 13965803 14185010 15001342 15402710 15952613 16413269 17202486 17472544 17997315
16769 17997315 18484761 19313752 19974134 20639661 20956635 21679103 22567208 23827861 24653424
16760B4653424L84963J466886O52153J333368P98933J321709J427913J457101
16752C3496450J350280J575403J589041J373462J946310K039056K640661J586725
16744D7597388K553530K434322K980826K590596L449446K964675L683389L783081
16736G2037253L980217M425971M483135M940541M965998N658787N629614O574898
16728A12696414O181599O509756O766440O820327P470715O639976O652329O688453
16720A66426009O021260M890484M826796L489351K283133J268665M65528j462680
16712A88208546k445796l397310m450051n281556n756666o797328o787857p028357
16704A46263625p344304p146588p092363o509853o851575o657319n875274n599361
$$ plain form
16760 24653424 25038387 26505273 27157426 28490794 29289727 30611436 32039349 33496450
16752 33496450 34846730 36422133 38011174 39384636 41330946 43370002 46010663 47597388
16744 47597388 50150918 52585240 55566066 58156662 61606108 64570783 68254172 72037253
16736 72037253 76017470 80443441 84926576 89867117 94833115 100491902 106121516 112696414
16728 112696414 118878013 125387769 132154209 138974536 146445251 153085227 159737556 166426009
16720 166426009 172447269 177337753 182164549 185653900 187937033 189205698 189671226 188208546
16712 188208546 185762750 182365440 177915389 172633833 166877167 160079839 153291982 146263625
16704 146263625 138919321 131772733 124680370 118170517 111318942 104661623 98786349 93186988
16696I3186988n318085n248211m458928m452853m415209l532359l625727l308708
16688E8826908l316891k969158k587473k317012k397279k404172j840075k068636
16680C8926212j995116j839892j599414j408564j442325j329613j260301r22648
16672B7128339j346816j037982j242264p72845p90072p27638q30235o80652r31588
16663A8768247p36208n41784n90055o69982k37740n99120m65131o25274j02463
16654A4200490r81646l02553k03910k90990q37874m20288O2900o84301j98532
16645A0343296l01444j49846j61851k58442m78041M3290j6016n62551l23687J18538
16635H253246j83087k64151o17329J9337k4019k44267l15252M3912m37649p5435
$$ plain form
16696 93186988 87868903 82620692 78161764 73708911 69293702 65761343 62135616 58826908
16688 58826908 55510017 52540859 49953386 47636374 45239095 42834923 40994848 38926212
16680 38926212 36931096 35091204 33491790 32083226 30640901 29311288 28050987 27128339
16672 27128339 25781523 24743541 23501277 22728432 21938360 21210722 20380487 19699835 18768247
16663 18768247 18032039 17490255 16900200 16230218 15992478 15393358 14928227 14302953 14200490
16654 14200490 13218844 12916291 12712381 12421391 11583517 11163229 11226129 10541828 10343296
16645 10343296 10041852 9892006 9730155 9471713 8993672 9036962 9020946 8458395 8134708 8253246
16635 8253246 8070159 7806008 7188679 7208016 7183997 6939730 6624478 6668390 6230741 6155306
16625F155306k26852J17697M591j83707j42494k00263K0144j45418k05779o0619
16615E132606k63677L56232j84174k14996n8077j86841j36775N0530j82929J06653
16605D418552l57570l19122N8606K08902j10035j57622j73807j9450J37475P5704
16595C761633q4898l20218j87257O7451K13519n04575j10392j4076M53636l17762
16585B957061J07491j88847M3835j42548l11158K47098Q3473k89262J3743L0823
16575B551709K69167n78078P5521K37765k1458n10401K58953k79922L0478J56186
16565B189920J29045n67235n000L79912j12253Q7636j71689m62366L74771K98603
16555B141344k57927R4750j00958m37574r1199M90311j72640r5364j40669J86907
$$ plain form
16625 6155306 5928454 6046151 6050742 5867035 5724541 5524278 5544422 5399004 5193225 5132606
16615 5132606 4868929 5225161 5040987 4825991 4767914 4581073 4444298 4494828 4311899 4418552
16605 4418552 4060982 3741860 3800466 4009368 3899333 3741711 3567904 3548454 3685929 3761633
16595 3761633 3676735 3356517 3169260 3236711 3450230 2945655 2835263 2821187 3274823 2957061
16585 2957061 3064552 2875705 2919540 2776992 2465834 2712932 2796405 2507143 2520886 2551709
16575 2551709 2820876 2242798 2318319 2556084 2534626 2024225 2283178 2003256 2033734 2189920
16565 2189920 2318965 1751730 1746730 2126642 2014389 2102025 1930336 1467970 1842741 2141344
16555 2141344 1883417 1978167 1877209 1439635 1348436 1838747 1666107 1570743 1430074 1616981
16545A616981m3714J6777L40695k62603N2835n6767q2470K06137j03854m15210
16535A268807P323L5563J24764k2750J3105k07544M174l48993O49577k63880K52393
16524A512539J84709m45369k08263K2585o0306K23224r118k23749J22746j46313
16514I72685L05507j03109l40615L37439q2191j2591o4328Q5858l3027l05853
16504G59775N7350q2136L51830k23433l3719k99567L56847m964Q9679J0698l0164
16493I52196J16041j8877j75893j43215J71652R2133l21146N00547j28870j09327
16483I35241k70109K01879K76799l48631l0886K32769l06527L23253l55626m178
16473F53984L26588k03202K93774l21076r8515M0282L11283m17330R4961K10850
$$ plain form
16545 1616981 1573267 1590044 1930739 1668136 1720971 1664204 1581734 1787871 1684017 1268807
16535 1268807 1276130 1311693 1436457 1413707 1426812 1219268 1223442 874449 1524026 1260146 1512539
16524 1512539 1697248 1251879 1043616 1066201 1005895 1229119 1220001 996252 1118998 972685
16514 972685 1278192 1175083 834468 1171907 1089716 1077125 1012797 1098655 1065628 759775
16504 759775 817125 734989 1086819 863386 829667 530100 886947 881983 971662 982360 952196
16493 952196 1068237 1049360 873467 730252 901904 994037 672891 1173438 1044568 935241
16483 935241 665132 867011 1143810 795179 764293 997062 690535 1013788 658162 653984
16473 653984 980572 777370 1071144 750068 651553 691835 1003118 585788 680749 891599
16463H91599j38026P0302j54907M16770l86557J37308n1826R8441j09543k45745
16453E27816L44246j63826Q1350j08846j90619J26847j73124N2591J90960C19938
16442E36520J15591k43611J40357P5457k0531A93317M84978J7671O7260j38164
16432F25062H1184N98304k37038L23143j82403J48846k51541R9850B84409K04452
16422D88861L80613l74794B27201J14759j59031L57577k44169P6103q6343M87613
16412G73710J8028B93797Q6138n4497j13097J39056J66263A79695M3425J94436
16402D17556l7547n9870N1124j1599j70521j823L53948j04938e406E74169A63951
16390E24680j19015o5767A47603J80297J45943B01100n2385J9128a6940A81472
$$ plain form
16463 891599 753573 823875 668968 1085738 699181 836489 784663 883104 773561 527816
16453 527816 872062 708236 789586 680740 490121 616968 443844 496435 687395 319938
16442 536520 652111 408500 548857 624314 603783 193317 678295 695966 763226 625062
16432 625062 81184 679488 442450 765593 583190 732036 480495 580345 284409 488861
16422 488861 869474 494680 227201 341960 182929 540506 296337 372440 286097 773710
16412 773710 791738 293797 379935 325438 212341 351397 517660 179695 223120 417556
16402 417556 380009 320139 371263 359664 189143 187320 541268 436330 -5406 574169 163951
16390 524680 405665 339898 147603 327900 473843 201100 148715 167843 -16940 181472
16379E33289j85272p2223l977q2981E3580K13557K97251j42086j40837N5904A63517
16367D56821n6928j8395N94860C35831B0911K84924K49969j72674M2390J03692
16357E29212j81642n0413K1092l8085K28110B36117J26141r8339l7805a27481
16346A84053N9130q8812J39044j5673a59774H7773J49994I7328J40613J87629
16336D25570h0132J5314I5357J25238J14955a88795C9467K98585F3872K62431
16326C26303G3656K68205J3269J03574e9033C83950j12968q136P3125F8508Q6543
16315A55051N07390D6880L61724B02589o0703O172a1990A39039J15127o3056J0663
16304B01773f2514B95518b5450B38460a03828M968F91778A85575a31623d6090
$$ plain form
16379 533289 348017 275794 271817 188836 53580 267137 564388 422302 281465 337369 163517
16367 456821 399893 381498 976358 335831 20911 305835 555804 383130 425520 529212
16357 529212 347570 297157 318249 280164 508274 236117 362258 263919 226114 -127481
16346 184053 243183 154371 293415 277742 -159774 87773 237767 97328 237941 425570
16336 425570 -80132 -64818 95357 220595 335550 -188795 39467 338052 63872 326303
16326 326303 73656 341861 355130 458704 -59033 383950 270982 262846 335971 68508 155051
16315 155051 662441 46880 408604 202589 141886 148058 -11990 139039 254166 191110 201773
16304 201773 -62514 295518 -25450 238460 -103828 -98860 691778 185575 -131623 -46090
16293C41334g3652C28724j30731M9739k7129J34725A9962K31886j14608J82878
16283C20118q2732J82193k01670F0167h7436C6707K12733a3844G5736J13744M6778
16272B36258M450b66794a3022H8818L97581k2585I3852q031J28164p4322a43484
16260A66734a28416d5009D89481B01824p1803a30192B1105K53134L1547g5213
16249A72623K22408K0313a5184A36309P6926L23342b6490k47515C27943A53238
16238E6130a05282B02442N8940d3638A40501l8853k3445R6049a1595j10785A05235
16226d25987A23281k0399J73617k1143b5212I4998J26950q3003K94259k04713
16216B28491a22008B01698a25878j8069C95190b58366g0789j41058g7731B33917
$$ plain form
16293 341334 -73652 328724 197993 247732 220603 355328 19962 251848 137240 320118
16283 320118 237386 419579 217909 60167 -87436 36707 249440 -13844 75736 189480 236258
16272 236258 240708 -266794 -13022 88818 486399 463814 93852 85821 213985 139663 -143484
16260 166734 -128416 -45009 489481 201824 130021 -130192 21105 274239 305786 -75213
16249 172623 395031 415344 -15184 136309 213235 536577 -26490 -274005 327943 153238
16238 56130 -105282 202442 261382 -43638 140501 101648 78203 174252 -11595 -122380 105235
16226 -425987 123281 102882 276499 255356 -25212 94998 221948 138945 433204 228491
16216 228491 -122008 201698 -125878 -143947 395190 -258366 -70789 -211847 -77731 233917
16205C19746R8307A68682d4777B73706A14411a81542C54512E2878A7475J26945
16195A44420b11144E2230A9987K8018a41819F905J24722f1057C8663J31488A115
16183a90200B5000J77552O949h1381A2989d8689B80831a08562q8290I1217J25196
16172B16413j06938J52766i9337j07602A3801b05275F8483A2868J52721m2033
16162A23556K837M2309A5919a69548e6684j35840E1471g9538F8323J48766g0194
16150b96546A72428G4904C1773a23618K3552L2528m7155B49680g5077p191J7916
16139f4352m8898O347j47658I5821D900J99446b5150B20528n5680a3748k405C19211
16126A01640r659J9939E0725a46536C03099K7500j50585J1222c2806C8099R1248
$$ plain form
16205 319746 418053 168682 -44777 273706 114411 -181542 354512 52878 17475 144420
16195 144420 -211144 52230 19987 48005 -141819 6905 131627 -61057 38663 170151 1115
16183 -190200 25000 202552 209501 -81381 12989 -48689 280831 -108562 -196852 91217 216413
16172 216413 109475 262241 -99337 -206939 13801 -205275 68483 12868 165589 123556
16162 123556 126393 168702 15919 -169548 -56684 -192524 51471 -79538 68323 217089 -70194
16150 -296546 172428 74904 31773 -123618 -100066 -67538 -114693 249680 -75077 -82268 -64352
16139 -64352 -113250 -106903 -254561 95821 4900 204346 -25150 220528 164848 -13748 -16153 319211
16126 101640 91981 111920 50725 -146536 303099 330599 180014 191236 -32806 38099 129347
16115A29347n0069J62706o7554g4387A56080d01222C4709e1390A32057a42045
16104A21414L1792l4801c7479B26193j12442K34347a72401B05638p7456B4687
16093c9122B62460j22375a23976G1966K5753a25075a6788j02343n3775p9320a20801
16081b09078r694A31619E3258b5753A51446l3408e9582K1360A59724d22836a08662
16069G0802b21559f0415B82911K9732A05521C4711Q8347e5695J4026C04867f4496
16057a72774A85303c87401P7216f0934C65899b17124I604d8542E7097K05982b73111
16045A17492b88815B20855o1880c72156j0047a57503p8963L5764n2347a08664
16034b21475i3913c8988m20604B11043q9146C6761L0595A6822a51091I4596k6642
$$ plain form
16115 129347 79278 241984 174430 -74387 156080 -401222 34709 -51390 132057 -142045
16104 121414 153206 118405 -37479 226193 113751 348098 -172401 205638 128182 24687
16093 -39122 262460 140085 -123976 71966 97719 -125075 -16788 -119131 -172906 -252226 -120801
16081 -209078 -218772 131619 53258 -25753 151446 118038 -59582 -38222 159724 -422836 -108662
16069 70802 -221559 -60415 282911 312643 105521 34711 123058 -55695 -41669 304867 -64496
16057 -172774 185303 -387401 -310185 -60934 365899 -217124 9604 -48542 57097 263079 -273111
16045 117492 -288815 220855 158975 -372156 -382203 -157503 -236466 -200702 -253049 -108664
16034 -221475 -93913 -38988 -459592 211043 121897 36761 67356 16822 -151091 94596 67954
16023F7954k6444N3969b13876A93842b07638A26258Q2562a87881D3483a00980
16012e8550A24987a79957A53839a02024q4956G6418l7655a46112d3049j25532
16002a68581A14962b41519m6639G8900f7077L0630A08966m7275b75146B9559O9653
15991I9212J7198b0710C07507i2316A35982L17370h8019c7054A17444J52048B4283
15979i1094j61850D87265b621k95913A87771a41473b6583B9439K51933A22811
15968E3637a49978a188D3285K57069b21400A00970b33608A44695h118m14789J99799
15957b23108g8787B7554H775a04322A53574a68324I002N9813d5278k29527p1219
15946c46024J59909A19036a2985j61548G6773k0923J71764a04115H8836d01351
$$ plain form
16023 67954 41510 95479 -213876 193842 -207638 126258 208820 -187881 43483 -100980
16012 -58550 124987 -179957 153839 -102024 -186980 76418 38763 -146112 -43049 -168581
16002 -168581 114962 -241519 -288158 78900 -67077 -36447 108966 61691 -275146 29559 99212
15991 99212 116410 -20710 307507 -92316 135982 453352 -88019 -37054 117444 269492 24283
15979 -91094 -252944 487265 -2621 -298534 187771 -141473 -26583 29439 281372 122811
15968 53637 -149978 -1188 43285 300354 -221400 100970 -233608 144695 -8118 -422907 -223108
15957 -223108 -78787 27554 8775 -104322 153574 -168324 9002 68815 -45278 -274805 -346024
15946 -346024 -186115 119036 -12985 -174533 76773 55850 227614 -104115 88836 -401351
15935a45643C93709a64114k5773K0180n7418A76489b02770i92F8944b8813o2969
15924i1782F865L45889i1865k40755p380Q2016c108k51170f1464j67379a04306
15912B00084c9218A24302b05126D2186b18748R9165A79895i752A44510N0249a92947
15900a14212I1092l9070e4943j56516B24338A4267d0570D2703P1080b1770j39300
15889a61070P9296a915D9215a64513B07571r0410a26864B568a52524e0475m4157
15878i4632q0352n3847C98554a27565q579E78046c13208J44197e3087o0620A65218
15866b3553n8233N154k18239A55066a61643A98206a68170p6851Q1312f3479p303
15855g0782A4250K5170Q5251J43370j0694a93102A27486e3255p4095A74368c2193
$$ plain form
15935 -145643 393709 -164114 -189887 -169707 -227125 176489 -202770 -992 68944 -28813 -91782
15924 -91782 6865 352754 -91865 -332620 -340000 -257984 -3108 -254278 -61464 -228843 -104306
15912 200084 -39218 124302 -205126 42186 -218748 -119583 179895 -9752 144510 194759 -192947
15900 -114212 91092 52022 -54943 -211459 224338 14267 -40570 42703 113783 -21770 -161070
15889 -161070 -81774 -1915 49215 -164513 207571 117161 -126864 2568 -152524 -50475 -94632
15878 -94632 -174984 -228831 398554 -127565 -136144 578046 -313208 -169011 -53087 -113707 165218
15866 -23553 -81786 -76632 -294871 155066 -161643 198206 -168170 -245021 -163709 -63479 -70782
15855 -70782 14250 39420 124671 268041 257347 -193102 127486 -53255 -127350 174368 -32193
15843A77220h750A14217m8658c68306f7376q4786A42214C1400a30753j4138M7139
15832i7752k62547a15945J1101M7949k29087C0235a39112M3696A07130K1434i9004
15820H0338C7587j8443c20019J13977A44272d7219j24714k482j87871F7425d31425
15808b14047j31883A76212c8888E5463b7832j76394d4940A05123C8226J23854
15798A62080N5419B1983a03089C76760J30313A83642L51665F449J59351d50692
15787b27816a9162C09906e2887A36462b40806A06137J04044D5454a13989k51798
15777c65787a398k953A8833K1700b7505o7136k02280B56245b00110F7151J71178
15766B38329b22186A7694K44020d2991j80395A92314b39676A64949m3806D617
$$ plain form
15843 177220 -8750 114217 65559 -368306 -67376 -152162 142214 31400 -130753 -144891 -97752
15832 -97752 -360299 -115945 -104844 -56895 -285982 30235 -139112 -95416 107130 128564 -99004
15820 80338 37587 19144 -320019 -206042 144272 -47219 -171933 -174415 -362286 67425 -431425
15808 -214047 -345930 176212 -38888 55463 -27832 -204226 -44940 105123 38226 162080
15798 162080 217499 21983 -103089 376760 507073 183642 535307 6449 165800 -450692
15787 -227816 -19162 309906 -52887 136462 -240806 106137 210181 45454 -113989 -365787
15777 -365787 -1398 -4351 18833 40533 -27505 -94641 -296921 256245 -200110 67151 238329
15766 238329 -222186 17694 261714 -42991 -223386 192314 -239676 164949 121143 4617
15755d5676B85392B5411K65215a38714C5586J02913K8183O731D4885J12356K9588
15744A86829c1061p0923A60839b71710H7759J78994a86848C0443K4666h0223p0061
15733a50284B31228a21217L441j71964C2403b94026m7702A19981K37298e81583
15722b32341E0265g269k90370B37658h4249A10764M3374d14435a70509j85541
15712c56050a30340I6461b71176j3612J35427B87985A0545J45445M0345c2202
15701A53569e5303p5664A47782b2509k73168J22499d3448C11706J48993j38599
15691C22100b0796G0463Q372L7186B5463b93649A4547J58521q1175e9279b7032
15679B13175E0078c63664A8541K9386c10271L8770P6929g7563C36610i0143I5037
$$ plain form
15755 -45676 285392 25411 290626 -138714 35586 138499 166682 173413 44885 157241 186829
15744 186829 -31061 -101984 160839 -271710 87759 266753 -186848 30443 55109 -80223 -150284
15733 -150284 231228 -121217 -117776 -289740 32403 -294026 -341728 119981 357279 -581583
15722 -232341 50265 -7269 -297639 237658 -84249 110764 154138 -414435 -170509 -356050
15712 -356050 -130340 96461 -271176 -284788 -149361 287985 10545 155990 196335 -32202
15701 153569 -55303 -130967 147782 -22509 -295677 -173178 -43448 311706 460699 322100
15691 322100 -20796 70463 78835 116021 25463 -293649 14547 173068 91893 -59279 -27032
15679 213175 50078 -363664 18541 47927 -310271 -271501 -194572 -77563 336610 -90143 95037
15667c41000R8289B12379f2226g431o9691k96166A85407k4899b02088I5976A1707
15655d9376j63014P6285j06998l0594i1338P034q072J6744L7617B8999Q2474b42531
15642B3881N535Q8497n5369a34538k9084n4325A16003d150n1880o0100D5368J2466
15630E7834M1289e6470A48761j1213f5064j14417Q2331A67455g6071F8302J01903
15619A70205b43386B60627A18694b0716B09674k1224b84888a09305c4548g373
15608B0862J41777j6040b66396B24013f9399I7638O3028n7591D8186J75528a65430
15596A01087b81461d6082j08144b5050I8315b84822J20793e9175A94741A5408
15585A75955i8750D2704a85549O3503j80047A6982J48047J01103a33053C5600
$$ plain form
15667 -341000 -242711 212379 -62226 -7431 -77122 -373288 185407 160508 -202088 95976 11707
15655 -49376 -212390 -136105 -243103 -273697 -91338 -84304 -92376 -75632 -38015 28999 111473 -242531
15642 23881 29416 117913 62544 -134538 -163622 -217947 116003 -4150 -56030 -116130 45368 57834
15630 57834 99123 -56470 148761 137548 -65064 -179481 -97150 167455 -76071 68302 170205
15619 170205 -243386 260627 118694 -20716 209674 188450 -284888 -109305 -34548 -7373
15608 20862 162639 146599 -266396 224013 -69399 97638 160666 103075 48186 223714 -165430
15596 101087 -281461 -46082 -154226 -25050 98315 -284822 -164029 -59175 194741 15408
15585 175955 -98750 42704 -185549 -122046 -302093 16982 165029 266132 -133053 35600
15574I8184b72794k3188J26265L0334A24134a3598A9438a6342E4905J50698e4395
15562a52266A48459N9167E8892a16614q546c8828l8996n7831B6572F613J00310
15551A06923b090B1557M6821a2010D1003b55170h3805m3099L9256m8377N9145
15540g6880H2461l2430a30399A81442m7824o3195g7551J3482A82006l0704F059
15528F2624L03503a1276n1164A7087J36999d1290J0921H0890L70241d6402r5984
15517a42386C318M02200o3433h249E2881J14145j7368l1372J26679j03390b46010
15505B76009E9599l915j7087P609J28905b6861D15760a33968C18054d6884B83958
15493g0680l7212j41208E9607e9332A66501g6047E484J3150b18108Q8888h493
$$ plain form
15574 98184 -272794 -295982 -169717 -139383 124134 -13598 19438 -16342 54905 205603 -54395
15562 -152266 148459 207626 58892 -116614 -125160 -38828 -77824 -135655 26572 6613 106923
15551 106923 -2090 21557 68378 -12010 41003 -255170 -83805 -126904 -87648 -136025 -76880
15540 -76880 82461 50031 -130399 181442 133618 70423 -77551 -64069 182006 151302 6059
15528 62624 366127 -11276 -62440 17087 154086 -41290 -30369 80890 451131 -46402 -142386
15517 -142386 3318 405518 342085 -8249 52881 167026 149658 118286 244965 141575 -246010
15505 276009 59599 55684 38597 46206 175111 -26861 415760 -133968 318054 -46884 283958
15493 -70680 -107892 -249100 59607 -59332 166501 -76047 5484 18634 -218108 -129220 -8493
15481a29113o5471A63678b63293J15770b4034k26714A84191F678i5803j18949
15471b14752B6709J16613c50528h4451a1028E4994R0158N8588a10035o7313B9208
15459c85965b8262j34336E5571h704A04787a03961K7133C9441K92582A15928a23113
15447B16517R7474b15324K8195g8656A46264c500j31603b4090A57059D6102Q5754
15436A31856a562C0513a05198b4705g60G8940a801B48835a00837J2883B74116
15424b42932H7034b43573E3267c10982a7735A99240a7474C14636a10968j2389
15414a23357C01364e7465I4554i5387A09066K1440a03953J8759o8751M7676B76674
15402a71158P3165D5826g9240a6224j47164B57572b1124B05301n0100c04982f2080
$$ plain form
15481 -129113 -194584 163678 -263293 -147523 -24034 -250748 184191 6678 -95803 -214752
15471 -214752 26709 143322 -350528 -84451 -11028 54994 145152 203740 -110035 -177348 29208
15459 -385965 -28262 -162598 55571 -8704 104787 -103961 -76828 39441 332023 115928 -123113
15447 216517 313991 -215324 -187129 -78656 146264 -3500 -135103 -24090 157059 46102 131856
15436 131856 -1562 30513 -105198 -24705 -760 78940 -1801 248835 -100837 -87954 274116
15424 -242932 87034 -243573 53267 -310982 -17735 199240 -17474 314636 -110968 -123357
15414 -123357 301364 -57465 94554 -95387 109066 130506 -103953 -85194 -153945 -106269 276674
15402 -171158 -97993 45826 -79240 -16224 -163388 257572 -21124 205301 155201 -304982 -62080
15390A48690A2736a97338A67113c73771J27500J13629o3452p8451A74517c0258
15379A59236c08789c614I7295J80726b46611D29049b1829E1662a36250A83633
15368C23715a91913M456C30286A13710J19323b4541j03154A70226A7847J41291
15358A59138a60311L0785B7998a22713B6599K83504c39710e856l27113a44481
15347b95915j59721B08126f4363A44941C3696b2542J083k18209A17995Q6696b0368
15335A04146O2217M7629a36788c7951E7062a81793a0925B2353b90094A81837A8538
15323E8613a68355b2249j63198n2277A46698A1215b49335B08024d0076E9023k1720
15312C7303K26443o5660D5329J73844J79166j05893H9360A3515J64370J4112a72995
$$ plain form
15390 148690 12736 -197338 167113 -373771 -246271 -132642 -196094 -274545 174517 -30258
15379 159236 -308789 -3614 97295 278021 -246611 429049 -21829 51662 -136250 183633
15368 323715 -191913 -187457 330286 113710 233033 -24541 -127695 170226 17847 159138
15358 159138 -160311 -129526 27998 -122713 26599 310103 -339710 -5856 -332969 -144481
15347 -295915 -455636 208126 -64363 144941 33696 -22542 -21459 -239668 117995 204691 -20368
15335 104146 166363 213992 -136788 -37951 57062 -181793 -10925 22353 -290094 181837 18538
15323 58613 -168355 -22249 -185447 -237724 146698 11215 -249335 208024 -40076 59023 37303
15312 37303 263746 198086 45329 219173 398339 292446 89360 13515 177885 191997 -172995
15300A24643r004m4837J54343R3146b06432E2378g9800n2828K1357N0288p6379
15289a37362B14938b09170g4860j55776F6678d5852a0698G0609j455N360f3675
15277H1653N3185P7455L28312d9980A22575b09654A17965D5780R102O775h1637
15265A81527l1696J58214j25526G6652L5512a15800B10292i5048a8626j8176A09141
15253H0969f5279E7513P2031n2728P8207K60908P46620Q36745p12724K84704k66325
15242A304951D24869k6827o8557l0754a58215A00807K3086M7917F7294J85716
15232B53010b0786B60359G8503e0760d966C25962N6615a53440P848A34235b2070
15220A29771E9311J44124I5839O2833A0744d1772B16467J6439a49220B20093L95
$$ plain form
15300 124643 115639 70802 225145 318291 -206432 52378 -79800 -132628 -111271 -60983 -137362
15289 -137362 214938 -209170 -74860 -230636 66678 -45852 -10698 70609 69154 74514 -63675
15277 81653 134838 212293 540605 -49980 122575 -209654 117965 45780 54882 61657 -81637
15265 181527 149831 308045 182519 76652 112164 -115800 210292 -95048 -18626 -36802 109141
15253 80969 -65279 57513 129544 76816 155023 415931 1162551 1999296 1286572 1571276 1304951
15242 1304951 424869 398042 329485 298731 -158215 100807 123893 171810 67294 253010
15232 253010 -20786 260359 78503 -50760 -4966 325962 382577 -153440 -145592 134235 -22070
15220 129771 59311 203435 95839 158672 10744 -41772 216467 232906 -149220 220093 220488
15209B20488j9218n1110b55626B17797G4313R4463b413q2599E21242k52584A29005
15197a46851D6609c23579B61497J79459a28354N251N1299c2764D89732G6515p813
15186F8702K89013C0090N2725L3086E3628A72f3707A27224C8084a72425K4602
15175a47823B28968J37611F8465b86542b4174l58590a72266A49421D6300J60716
15165B07016B6883a798D83463A40550J6732a99309E6227C113J85139a93216R3694
15154i9522E9777a17319A12932g1812I4455c8294q1753L161G5067c0497j47870
15143a78367A22968B4930K31317M175a1944j22253E27475B4754J69619a10486
15132D9848N3779a66004m7359B91820g7253L1846B12278g3908E7954O3176E9738
$$ plain form
15209 220488 201270 150160 -255626 217797 74313 168776 -2413 -85012 521242 268658 129005
15197 -146851 46609 -323579 261497 440956 -128354 -123103 -71804 -32764 489732 76515 68702
15186 68702 357715 30090 82815 115901 53628 172 -63707 127224 38084 -172425 -147823
15175 -147823 228968 366579 68465 -286542 -24174 -382764 -172266 149421 46300 207016
15165 207016 26883 -1798 483463 140550 157282 -199309 56227 3113 188252 -193216 -99522
15154 -99522 59777 -117319 112932 -71812 94455 -38294 -120047 -116886 75067 -30497 -178367
15143 -178367 122968 24930 256247 260422 -11944 -134197 527475 24754 194373 -110486
15132 49848 103627 -166004 -213363 291820 -77253 -45407 212278 -73908 57954 121130 59738
15120D96293A96387O4831P7105a8427A32209n5521N192a26457C29954J55052j56861
15109C28145j05812J14844h6224a7258r1493B10326a7492n2602A88731L21834
15099E10565a57585A71866Q6945a63774C3313M26923B6281L36536E4286P9744
15089A34030K00352I1057L69985g2577C3862K11992H0473K68055E3118J88264
15079B41382p7242J8782H13K30371P2338b45367A86526k3064F8301J32024R0323
15068B90648k9213Q732E6610b01301I4826L50394C7892K31148K25694C8645Q1948
15057A20593a15914d7095D9421J46976k5218q500L16661c7912A35932M9790K82882
15046D68604E0888P4744J67050o8364J54011A12102L5956c068D18388A34972O1237
$$ plain form
15120 496293 196387 261218 338323 -18427 132209 76688 81880 -126457 329954 485006 328145
15109 328145 222333 337177 -86224 -17258 -108751 210326 -17492 -70094 188731 510565
15099 510565 -157585 171866 258811 -163774 33313 460236 26281 362817 54286 134030
15089 134030 334382 91057 461042 -72577 33862 245854 80473 348528 53118 241382
15079 241382 164140 182922 813 231184 303522 -245367 186526 163462 68301 200325 290648
15068 290648 261435 270167 56610 -201301 94826 445220 37892 269040 494734 38645 120593
15057 120593 -115914 -47095 49421 196397 171179 162679 479340 -37912 135932 185722 468604
15046 468604 50888 125632 292682 224318 378329 112102 148058 -3068 418388 134972 196209
15035A96209h4816C08744J05651A99165b08202D04518j97171k9284C994J42464
15025A46458J01500F8090O9067a81736B16305J30616a28710C47179O4363j76390
15015B35152f7744C52887a16308C52438j10873A16095a20304D17372j78487J7272
15005B56157j00453d9865C43552A0354M79892k38565M593B3332M76934A46536
14994a46978B89044a75082K2673B50422J58287p0703Q113J48449a38125O6428
14984g1697C76897a9722B86144N4790o2470I5576M6214a29058A32846N7692i219
14972F99507q6467B30692K00915A56098J39154A23847K18257A03715K60409L6258
14962D00382A90692K65915B26590c3343B59018r9885J97579K4801j32827I9070
$$ plain form
15035 196209 -84816 308744 414395 199165 -208202 404518 207347 178063 3994 146458
15025 146458 247958 68090 137157 -181736 216305 346921 -128710 347179 411542 235152
15015 235152 -67744 352887 -116308 352438 241565 116095 -120304 417372 238885 256157
15005 256157 155704 -49865 343552 10354 490246 251681 256274 23332 500266 146536
14994 -146978 289044 -175082 -152409 250422 408709 338006 346119 494568 -138125 -71697
14984 -71697 376897 -19722 286144 340934 278464 95576 141790 -129058 132846 190538 -9219
14972 699507 613040 230692 431607 156098 295252 123847 342104 103715 364124 400382
14962 400382 190692 456607 226590 -33343 259018 159133 356712 381513 248686 99070
14951A19256J89244F3813B3184J45927J43490F5752J04162k6118J18783o8301
14941A94278J66297h6936D07266k3683a4427C16722O2632j2797j47604M17579
14931F36532k19270A54365B0319J46855K91784L49102k47325k39511j4415j47498
14921A59311F7587l552M69729k51547L4522A50980c15010F8325K20489J82912
14911D71726J05161p6688r4135P8113A99283J92367A94023K39821n4729J33282
14901E12397O5121k63097J23683A28998N07083A24520N037K34271J25135Q933
14891D97896J62325B40992L66780j82687K49788B89304n2500J90864K26393j56009
14881D98052J8564j56895M1565o6411A66793L2110M40913k56942O541K08475B34834
$$ plain form
14951 119256 308500 63813 23184 169111 312601 65752 169914 143796 262579 194278
14941 194278 360575 -86936 407266 383583 -14427 316722 379354 366557 218953 636532
14931 636532 417262 154365 20319 167174 458958 808060 560735 321224 306809 159311
14921 159311 67587 64035 533764 282217 316739 150980 -315010 68325 288814 471726
14911 471726 576887 500199 406064 484177 199283 391650 194023 433844 379115 512397
14901 512397 577518 314421 438104 128998 636081 124520 129557 363828 488963 497896
14891 497896 660221 240992 607772 425085 674873 289304 236804 427668 654061 498052
14881 498052 516616 359721 401286 334875 166793 198903 639816 382874 389415 597890 234834
14869D14031j15468j22569O63835l81119P7375l4370j71662M64933j84986l1745
14859E78255c3115E62731j48160j8820F5155L44135j89795L24758j04595m3721
14849C95937j61228K64744j39457L03212j93828p4048j8941j2177N5769j04272
14839C15711O3940A02396d539D93882j57895L36427k09255m1724L54009l09717
14829D65727N4641p74o4236J05178j08304j64191A29469N28124B58423k9405O95048
14818I24066C69189K92511B9520P74687C97398K19364j94489j571j31685L74894
14808F63911O9312r3017k2053l2331M6199O933k4155r4990j25387J92519k32450
14797C54491L84446l05325L28628C59835n4801L17989l09286j08804L20366L35511
$$ plain form
14869 414031 298563 175994 839829 458710 536085 501715 330053 794986 610000 578255
14859 578255 -33115 562731 414571 395751 65155 409290 219495 544253 439658 395937
14849 395937 234709 499453 359996 663208 469380 395332 376391 364214 419983 315711
14839 315711 379651 102396 -4539 493882 335987 672414 463159 421435 775444 465727
14829 465727 520368 519594 455358 560536 452232 288041 129469 657593 258423 229018 924066
14818 924066 369189 661700 29520 804207 397398 616762 422273 420702 289017 663911
14808 663911 733223 640206 618153 585822 632021 638954 614799 519809 394422 586941 354491
14797 354491 738937 433612 762240 359835 305034 623023 313737 204933 525299 860810
14787H60810j91183k65583r5849J72174k36020L41358j95239p9136L85058j43234
14777E53156j65187L48560R6580o2935j68244k37204J89643P0446p6534k34374
14767C13907J93966K2656o1142O3606K28257C43519K86801q7257m3033M236K35675
14756G39941L0738j17332L04380j97226L46107m29652L31525l15328P8183k21005
14746E50331A45824L83151O4854K10302Q1667k12122K5726k52808K33964n9443
14736F21115o163J78110J5514k30468J11576o0331P9563j42310Q6253r7141O9268
14725F24986p8039K22428L6933J2036L69603k71575k49693L16815P1085r4161
14715I60418q1971j22285n3046j48842P4144R6758L45737l37271M53517k15916
$$ plain form
14787 860810 669627 404044 308195 480369 244349 585707 390468 311332 696390 553156
14777 553156 387969 736529 833109 770174 601930 364726 554369 624815 548281 313907
14767 313907 507873 530529 469387 532993 761250 343519 630320 543063 500030 504266 739941
14756 739941 770679 653347 957727 760501 1106608 676956 1008481 693153 771336 550331
14746 550331 145824 528975 593829 804131 885798 673676 699402 446594 680558 621115
14736 621115 614952 793062 808576 578108 689684 629353 708916 566606 652859 555718 624986
14725 624986 546947 769375 806308 818344 1187947 916372 666679 983494 1054579 960418
14715 960418 878447 756162 703116 554274 628418 725176 1070913 733642 1187159 971243
14705I71243m43796N47091l39279O5019m7533P0444M86065l44756l60188K13225
14695H17535K60345l49269J96322Q7516j66321k48166K25063J93186K2263l85001
14685F53473P12079k34812l90590L76256m76385Q5674M20721l14673K36315k41917
14675H26141J58378o7374J61608j2165L50819k36340J11769k60782o4723K40588
14665A207919R0686Q3899k20219Q5478k93191J3437L22743j83403J91204j82468
14655A116085k60027K82225M3986M07006k30732r6471K2527l24993N6193J06844
14645A122643m0861j25369L13227J0103M4479k11286l6820m6623K26545J8179
14635A274217K44803j18756l64002J07648n4864O8905J67785R7522L096k61353
$$ plain form
14705 971243 527447 1074538 735259 800278 752745 823189 1309254 964498 604310 817535
14695 817535 1077880 728611 924933 1012449 846128 597962 823025 1016211 1038474 653473
14685 653473 1365552 1130740 740150 1116406 640021 725695 1146416 831743 1068058 826141
14675 826141 984519 917145 1078753 1066588 1417407 1181067 1292836 1032054 967331 1207919
14665 1207919 1298605 1382504 1162285 1247763 954572 968009 1290752 1107349 1298553 1116085
14655 1116085 856058 1138283 1182269 1589275 1358543 1262072 1284599 959606 1015799 1122643
14645 1122643 1081782 956413 1269640 1279743 1324222 1112936 1076116 1029493 1256038 1274217
14635 1274217 1519020 1400264 1036262 1143910 1089046 1157951 1325736 1423258 1426354 1165001
14625A165001K97810N8234k99249J10729K27043j36708J15855n9179J09596k66893
14615A322239J60185l34883O38760j03548j72099N52192n11097K5806L7209m33396
14605A181368O99424l84835N9475J95593m06886J71809L92540k6818m6531r9857
14595A735282p9325K07195j96535k5887L24964k56272k4286r7464M01527l60385
14585A628814M28462j41185J53082j18627J06058J9306n6412J0788j90403L10524
14575B150407k26734L38727n3993j58266J86981l69285N99552j57522M67059m68388
14565B308538k5115N20572j78327j32517J05922L10184j95720K90685k82195M85332
14555C207359J76857L92915K16922M5394O27845Q54539J697569K980715R313595
$$ plain form
14625 1165001 1462811 1521045 1221796 1332525 1559568 1422860 1538715 1479536 1589132 1322239
14615 1322239 1482424 1147541 1786301 1682753 1510654 2062846 1551749 1577555 1614764 1181368
14605 1181368 1880792 1495957 1555432 1751025 1344139 1515948 1908488 1881670 1835139 1735282
14595 1735282 1655957 1863152 1666617 1640730 1965694 1709422 1685136 1587672 1989199 1628814
14585 1628814 2057276 1916091 2069173 1950546 2056604 2075910 2019498 2030286 1839883 2150407
14575 2150407 1923673 2262400 2208407 2050141 2237122 1867837 2467389 2309867 2776926 2308538
14565 2308538 2283423 2803995 2625668 2493151 2599073 2909257 2713537 3004222 2722027 3207359
14555 3207359 3384216 3777131 3994053 4039447 4667292 5521831 7219400 10200115 19513710
14546A9513710J9788643P276460B0654613r915297l514640l224426j470456j57977
14538B371817J76925m59274J49539j22491l47207K58329L7258L7924O7403J44133
14528B314356j0212J39808q2493O6999J10856j43982K18793M8656P2351j75764
14518B559368l13632K24132N09248n18884K35653L5395O3624q6926K77342R0138
14508C075458k98190p4134L10762J02291j80799K64169k37198J34672n7597L43065
14498C382499p8251j91844L85140J19827r4957r9020j51258J58621K31734o2527
14488C599964j24551K06041P873j02289J53623L33851j96329o4485O3886L25458
14478D203042P5228j0766k26633r9898L60688j4396j02890l24492N31834l242
$$ plain form
14546 19513710 39302353 46578813 20654613 10739316 7224676 4000250 2529794 2371817
14538 2371817 2548742 2089468 2239007 2116516 1769309 2027638 2064896 2102820 2170223 2314356
14528 2314356 2304144 2443952 2361459 2428458 2539314 2395332 2614125 2662781 2735132 2559368
14518 2559368 2245736 2469868 2979116 2460232 2695885 2731280 2794904 2707978 2985320 3075458
14508 3075458 2777268 2703134 3013896 3116187 2935388 3199557 2962359 3097031 3039434 3382499
14498 3382499 3304248 3112404 3497544 3617371 3522414 3423394 3272136 3430757 3662491 3599964
14488 3599964 3475413 3681454 3689327 3587038 3740661 4074512 3878183 3813698 3877584 4203042
14478 4203042 4278270 4267504 4040871 3940973 4301661 4287265 4184375 3859883 4391717 4388475
14468D388475J59302k0593J03327o6176J30220j17987L58117k22632Q013L3504
14458D753570k1060L00226L76284J21627m32620O71010n65761L01130j5269j5550
14448E473587J70485J99555J29481l19638O6419J71382J45922K17567L7587J47929
14438F440276l9370j02596L22120M93859m41904p0381K80568M39540k77676M23397
14428G467833j39408l41503L37311K38150N9715m5977K41053L33460l75218M50566
14418H225982L50312k72331M16068J69859P5662o365J56303J11444Q6430M40388
14408I753752k48309J64748K09596k00275N37919q0537M34902L63379m1822J62121
14398A1055474J4933M469M74415M44711J09473L1309K06775Q4530L77012j028
$$ plain form
14468 4388475 4547777 4527184 4630511 4564335 4694555 4576568 4934685 4712053 4720066 4753570
14458 4753570 4732510 5032736 5409020 5530647 5098027 5769037 5203276 5504406 5489137 5473587
14448 5473587 5644072 5843627 5973108 5653470 5719889 5891271 6037193 6254760 6292347 6440276
14438 6440276 6400906 6298310 6620430 7114289 6672385 6602004 6882572 7322112 7044436 7467833
14428 7467833 7328425 6986922 7324233 7562383 7622098 7576121 7817174 8150634 7775416 8225982
14418 8225982 8576294 8303963 8720031 8889890 8965552 8959187 9115490 9226934 9313364 9753752
14408 9753752 9505443 9670191 9879787 9679512 10217431 10136894 10571796 10935175 10893353 11055474
14398 11055474 11070407 11074876 11549291 11994002 12103475 12134784 12341559 12426089 12803101 12802073
14388A2802073L05794J49304J68732O92477n1282M24906K3679K18183M67917J58838
14378A5360621P13777j68091O20275M56739j5581O67327K03238J23064L91207
14369A8352576O65031Q6165K80399M11393M96208L99944M81264N94517K48692
14360B2016189N28757M75573P32873L12397O79485L43876O03165N33319Q44728
14351B7070362K59322J178267Q29052N46016R64219M54119R62252R51242M91455
14342C3706306R64789R72204Q63444J080280R27359J487362J206837J242757O33199
14333D3084537J684383J301990J253754J684763J641329J310185J295357K216808
14325E5473106J704695J427803K380027J778980K221283K281750K471320K359853
$$ plain form
14388 12802073 13107867 13257171 13425903 14118380 14067098 14492004 14515683 14733866 15201783 15360621
14378 15360621 16074398 15906307 16526582 16983321 16967740 17635067 17838305 17961369 18352576
14369 18352576 19017607 19103772 19384171 19795564 20291772 20691716 21172980 21767497 22016189
14360 22016189 22544946 23020519 23753392 24065789 24745274 25089150 25692315 26225634 27070362
14351 27070362 27329684 28507951 29337003 29883019 30847238 31301357 32263609 33214851 33706306
14342 33706306 34671095 35643299 36506743 37587023 38514382 40001744 41208581 42451338 43084537
14333 43084537 44768920 46070910 47324664 49009427 50650756 51960941 53256298 55473106
14325 55473106 57177801 58605604 60985631 62764611 64985894 67267644 69738964 72098817
14317G2098817K613186L203823K736918L069772L182336L354460L674611L658242
14309I7592165L780924M112915M797238M900134M539955N530547N232423O007934
14301A36494235O241239O876582P012515P115194P947726Q598370Q637917R126023
14293A98049801R869252J0653573J0845309J1740899J1942277J2469433J3695117
14286B79265661J3446130J4133555J4668764J4961372J5013848J5529965J4806979
14279C81826274J5280981J4459027J3501239J2664207J1190921R569322P900646
14272D66392617M594086l41052j591983j509813m676845m648508p369526q395094
14264D42453882j0971584j2578600j4588108j5517190j6059812j6223986j6354597
$$ plain form
14317 72098817 74712003 77915826 80652744 83722516 86904852 90259312 93933923 97592165
14309 97592165 101373089 105486004 110283242 115183376 119723331 125253878 130486301 136494235
14301 136494235 142735474 149612056 156624571 163739765 171687491 180285861 188923778 198049801
14293 198049801 207919053 218572626 229417935 241158834 253101111 265570544 279265661
14286 279265661 292711791 306845346 321514110 336475482 351489330 367019295 381826274
14279 381826274 397107255 411566282 425067521 437731728 448922649 458491971 466392617
14272 466392617 470986703 470645651 469053668 467543855 462867010 458218502 450848976 442453882
14264 442453882 431482298 418903698 404315590 388798400 372738588 356514602 340160005
14257C40160005j5977477j5431509j5198882j4489770j3095882j2939169j3143953
14250B39883363j1809463j1633264j0986561j0176543r399176r193333q200858
14243A68484165q210614p466561p469199o430125o298475n433361n598482n291196
14235A16286152n058092n002353m150417m036628l630166l894389l826008l284799
14227H3403300l153787l213571l056857k110477k785790k477859k482331j873107
14219F2249521k155433k039722j926005j882887j651510j254194j691621j616096
14211D8032053j553800j299054j425061j291192q35418q12673j451569j270188
14203C8093098j037479j303804l89499p09374j451560j010627m68168r08238p05193
$$ plain form
14257 340160005 324182528 308751019 293552137 279062367 265966485 253027316 239883363
14250 239883363 228073900 216440636 205454075 195277532 185878356 176685023 168484165
14243 168484165 160273551 152806990 145337791 138907666 132609191 127175830 121577348 116286152
14235 116286152 111228060 106225707 102075290 98038662 94408496 90514107 86688099 83403300
14227 83403300 80249513 77035942 73979085 71868608 69082818 66604959 64122628 62249521
14219 62249521 60094088 58054366 56128361 54245474 52593964 51339770 49648149 48032053
14211 48032053 46478253 45179199 43754138 42462946 41627528 40814855 39363286 38093098
14203 38093098 37055619 35751815 35362316 34652942 33201382 32190755 31722587 30814349 30109156
14194C0109156o05457p20439p83096o01989o15361q65968n92437m83379o84582
14185B4156448k84647p15140n93039p28215j37597l68292m29262m22517o56777
14176A9820962j72631n63245j60247n38135n09145k32393m70412J91901q21563
14167A6545092j07843R1270r83971l63693L48527o72555K4360n38781j86564n31289
14157A3624553O9126m06996l04273K46791k83488j76602m78202J00456k72544
14148A2118821o0240o35640j61580k44674Q7380o88871O7354J06158k97324m3058
14138A0248326K32238p54002p3165j74445J19501l73162j60287O4278m36136R5961
14128H789107K47466m78600N1628k10230k59729M3395n14391K19774j54836k98662
$$ plain form
14194 30109156 29503699 28783260 28000164 27398175 26782814 25916846 25324409 24841030 24156448
14185 24156448 23871801 23156661 22563622 21835407 21697810 21329518 20900256 20477739 19820962
14176 19820962 19648331 19085086 18924839 18386704 17877559 17645166 17174754 17366655 16545092
14167 16545092 16437249 16528519 15544548 15180855 15529382 14856827 14881187 14342406 14155842 13624553
14157 13624553 13693679 13286683 12982410 13229201 12945713 12769111 12290909 12391365 12118821
14148 12118821 12058581 11422941 11261361 11016687 11104067 10415196 10482550 10588708 10291384 10248326
14138 10248326 10480564 9726562 9653397 9478952 9598453 9225291 9065004 9129282 8693146 8789107
14128 8789107 9036573 8557973 8609601 8399371 8139642 8183037 7668646 7888420 7733584 7434922
14118G434922J06700m9440K98884m51270k25636j07052j52523m2837j50388O6467
14108F727827J31700m96432P5788J17286M0563l70951q5174J00618l00324j52281
14098E788620l5289K5846k85372J48489N860k73804K9004j36930J83951m0671
14088E409704j55942k44667o502k2262J02579L8222l3126l66418P6048K89926
14078E087562J30931m43474l04672Q7500J17895j90877j28968P3694j17519K82573
14068D594645j34885o317n19508J97519j42824J19526L5632l58300M6828K35416
14058D067732k45027K6494K76577l47309j32034K93758r5672M9197m01987N2909
14048C544638K86598j99681k62958K74388k53667L1568l56406K53000k52687K00512
$$ plain form
14118 7434922 7541622 7492182 7791066 7339796 7114160 7007108 6854585 6811748 6661360 6727827
14108 6727827 6859527 6363095 6438883 6556169 6596732 6225781 6140607 6241225 5940901 5788620
14098 5788620 5753331 5779177 5493805 5642294 5648154 5374350 5403354 5266424 5450375 5409704
14088 5409704 5253762 5009095 5002593 4980331 5082910 5121132 5088006 4721588 4797636 5087562
14078 5087562 5218493 4775019 4470347 4557847 4675742 4484865 4355897 4429591 4312072 4594645
14068 4594645 4459760 4453443 3933935 4131454 3988630 4108156 4143788 3785488 3832316 4067732
14058 4067732 3822705 3849199 4125776 3778467 3646433 3940191 3844519 3893716 3491729 3544638
14048 3544638 3831236 3631555 3368597 3642985 3389318 3420886 3064480 3317480 3064793 3265305
14038C265305o85289O96441k04304J6923K842J32149k22763L74431k57377L3056
14028C151414j66080j70539Q241K62106J03950n19173Q8361o083l6716N006k6767
14017B693720M7216l33789J67152k2366J13194q8033j38214L25139l78711j32252
14007B253056o3269j32596L28546j93171K01857k42964J49715j75060M33135n45220
13997B014029j00119O19307m42727Q6525j80751j61808O70566M5603J008845J897211
13987E456681O586699J9122226J7989038k2711058j2761730n395687k114492j246520
13979D925157q41491l92279n41250Q554l44695M1452l11272K37787m51459K99787
13969B630291k93838L83538l57667j24020J19587j32915L68638l14061L12808
$$ plain form
14038 3265305 2580016 3276457 3072153 3089076 3091918 3224067 3001304 3375735 3118358 3151414
14028 3151414 2985334 2814795 2823036 3085142 3189092 2669919 2758280 2752197 2715481 2720487 2693720
14017 2693720 2740936 2407147 2574299 2551933 2665127 2577094 2438880 2764019 2385308 2253056
14007 2253056 2189787 2057191 2385737 2192566 2394423 2151459 2301174 2126114 2559249 2014029
13997 2014029 1913910 2533217 2090490 2177015 1996264 1834456 2505022 2550625 3559470 5456681
13987 5456681 12043380 31165606 49154644 26443586 13681856 8286169 6171677 4925157
13979 4925157 4083666 3691387 3150137 3158691 2813996 2855448 2544176 2781963 2330504 2630291
13969 2630291 2336453 2719991 2362324 2238304 2357891 2224976 2593614 2279553 2592361
13960B592361l44724p793j58878j23150j16247J13530O4753k44131j73300O12726
13950B215147n7749k67189J29198j16523O9932k46740Q986L75986M2561l74811
13940A778798K03604k11026L28137m13724k16130M70208j83039j18698P0124k4342
13930A683912K42253l03057r1615J18768r4070P4176n1778r6613J95533n66640
13920A110869K81904K35885j70729M7345R7764l64183Q7K90175J4621k26379k0266
13909A297093L74230l50203n9466J33952j18748J14353J51009k07412K11962n43643
13899A003127L64524k34491J57516Q3390O2318k8853p2541j63818K17786l8947
13889A350011K38694l51480q768j40164M71063l50338J42907o6543J68253o9200
$$ plain form
13960 2592361 2247637 2239844 2080966 1957816 1841569 1955099 2019852 1775721 1602421 2215147
13950 2215147 2157398 1890209 2019407 1902884 1972816 1726076 1735062 2111048 2153609 1778798
13940 1778798 1982402 1771376 2099513 1685789 1469659 1939867 1756828 1638130 1708254 1683912
13930 1683912 1926165 1623108 1531493 1650261 1556191 1630367 1578589 1481976 1677509 1110869
13920 1110869 1392773 1628658 1457929 1505274 1603038 1238855 1238942 1529117 1543738 1317359 1297093
13909 1297093 1671323 1321120 1261654 1395606 1276858 1391211 1542220 1334808 1546770 1003127
13899 1003127 1367651 1133160 1290676 1374066 1436384 1407531 1334990 1171172 1388958 1350011
13889 1350011 1588705 1237225 1228457 1088293 1559356 1209018 1351925 1285382 1453635 1384435
13879A384435j45702j32870L52474m55689K56456p2792o4361j3586J1883K5044
13869A145292J0923p8934K36380k82830m8150j14450P8202J49632R6076k82957
13859I09184L07329k79883K21555j57516R0313J55379k20282L48889m54534k640
13849I17794K98943m1225k82924J68679m69704L01502K59158R2278E91346O35822
13839A227168k89818J01911q6491J06162j71955J39411J23623l27224K74641o4418
13829A033010j66206j75063L59570K8469j60211M0016J09103l99245J81827K17525
13819A068795k2187j59407J2413Q8415k69401O911K05413K66774n09416J31801
13809H20111J75120j12060L23410k24788j40583K87611M8099D58970J66397P0718
$$ plain form
13879 1384435 1238733 1105863 1458337 1002648 1259104 1186312 1121951 1108365 1120248 1145292
13869 1145292 1156215 1077281 1313661 1030831 982681 868231 946433 1096065 1192141 909184
13859 909184 1216513 936630 1158185 1000669 1090982 1246361 1026079 1374968 920434 917794
13849 917794 1216737 1175512 892588 1061267 591563 893065 1152223 1244501 591346 1227168
13839 1227168 937350 1039261 952770 1058932 886977 1026388 1150011 822787 1097428 1033010
13829 1033010 866804 691741 1051311 1079780 919569 959585 1068688 669443 851270 1068795
13819 1068795 1046608 887201 899614 988029 718628 725539 930952 1197726 688310 820111
13809 820111 995231 883171 1206581 981793 841210 1128821 1176920 458970 625367 696085
13799F96085L8670N7749j85283J12449K67187o1501j39581j10162j74193N21715
13789A023135l40591K3657K8858J89912k34450K85881k98725k66739L90169j85864
13779F15243J1532j3414J28000k4428j97104J79457J10433J4360q9854j50519
13769E83706P0094K37688j94629j2648j1542l526j93564J09938L81945j90584
13759G76878l61224L54620L6057j33136p2862K54091j58110J8470l43974M23794
13749G94604l02277j41297J28318K57475j2361j63328R1882J69686C01092K93495
13739E94587K93076k83055j8114m0200L8782K79959j12939k94209n1510M19966
13729H26343B72445M18862j63004K2831l590K08833j25717j8836N7103K1923R1874
$$ plain form
13799 696085 734755 792504 607221 719670 986857 925356 785775 675613 501420 1023135
13789 1023135 682544 706201 735059 924971 690521 976402 677677 410938 801107 615243
13779 615243 626775 613361 741361 716933 519829 699286 809719 824079 734225 583706
13769 583706 653800 891488 696859 684211 672669 669143 475579 585517 967462 776878
13759 776878 415654 770274 806331 673195 600333 854424 696314 714784 370810 794604
13749 794604 492327 351030 479348 736823 724462 561134 653016 822702 301092 594587
13739 594587 887663 604608 586494 546294 585076 865035 752096 457887 406377 826343
13729 826343 272445 691307 528303 551134 547544 756377 630660 611824 668927 690850 782724
13718G82724k47503K2488L75661k93446p6131j28059J7628K2883K77223K860k75518
13707D80810P9903k31819J28580O2603L6519j79111K01790k7566p3120L318A91841
13695D67731m6794q7339L13880o4746J02969j01717E9106N02335J59711l25286
13685C95866J50619K44098A60862j4797M43932j43260o6883K69651O310k61691
13675C94124M0790J0335j39091K93630B50491L67739j95986j61092L56731m9318
13665E68565k12707k240q4186P5500J5432J71889k41704J18580p9694P0749Q0715
13654D80899J70237k63885j31153k9627M85853l20842o0598L94729A44092p429
13644A36663K84782R8648K25407A43673K75197B02239J12227K79552M2992l8715
$$ plain form
13718 782724 535221 557709 933370 639924 563793 435734 453362 476245 753468 756328 480810
13707 480810 560713 328894 457474 520077 556596 377485 579275 551709 478589 481907 191841
13695 467731 420937 333598 647478 582732 685701 583984 59106 561441 721152 395866
13685 395866 546485 790583 160862 146065 589997 446737 379854 649505 655815 394124
13675 394124 434914 445249 306158 599788 250491 618230 422244 261152 617883 568565
13665 568565 355858 353618 269432 344932 360364 532253 290549 409129 329435 400184 480899
13654 480899 651136 387251 256098 226471 712324 391482 330884 725613 144092 136663
13644 136663 421445 520093 745500 143673 418870 202239 314466 594018 637010 598295
13634E98295k87514K03082j90537J20932P9973q915B36775o947M36928N7166B79299
13622B23061M65156k13187o0209L64254A14696K12055J61679J13715p9201E0207
13611I8491M36018J4870l0601O7498m382j85166J6491J00098j9909O9082r5407
13600D67083l2348N0763l8490a70643C02275J35958j71165Q7824j65831G1538
13589C05057P9504M1838A94095l5733C3350K0596M60366k49673n0195J76858o6803
13578C24499q3509k9303L62609j45671m1961J7126R9139c6591D7145K47469L364
13567B97978A12122J67245j05202L13047J14061k48413j42352J58188L22832k21298
13557D70230i137B3818a57049D89302K38485A34969P1896K36720K9152O8970B53370
$$ plain form
13634 598295 310781 513863 323326 444258 524231 515316 236775 229828 666756 723922 279299
13622 223061 688217 475030 414821 779075 114696 326751 488430 602145 522944 50207
13611 98491 534509 549379 518778 586276 581894 396728 413219 513317 493408 562490 467083
13600 467083 434735 485498 447008 -170643 302275 438233 267068 354892 189061 71538
13589 305057 384561 426399 194095 158362 33350 53946 514312 264639 214444 391302 324499
13578 324499 240990 211687 574296 428625 386664 403790 502929 -36591 47145 294614 297978
13567 297978 112122 279367 174165 487212 601273 352860 210508 368696 691528 470230
13557 470230 -9137 23818 -157049 489302 727787 134969 206865 443585 472737 541707 253370
13545C30707o6214L3821I019a57921B10429Q5383L22053B77006G3988K11254l6282
13534B48960b022C37707J1149r9337O6721o6481K59711r6061A76287J453P378
13523A85118L9278q8792P7519J76809j43393O1621e4693B25796J74791j76704
13513B23883K1538J79315O7405a4739A79016L1856J43094j5564J1867J10183k24984
13502B35468o8448J29878O9468o5014J27218I6225J73933J12547l6897N3949n2306
13491C47451k1423J05350j29593C4945a4702B94954n4236L007P4575A14548K7865
13480A42413J49755N3850N1919R931A51954J80114p0422K50669k11808O7706E3444
13468C28451A21430k8923J76168k6054L8271J98080A3645K25853N1186k5122K5627
$$ plain form
13545 330707 264493 298314 9019 -157921 210429 295812 617865 277006 73988 285242 248960
13534 248960 -2022 337707 348856 249519 316240 249759 509470 413409 176287 177740 185118
13523 185118 224396 135604 213123 389932 246539 308160 -54693 225796 400587 223883
13513 223883 245421 424736 492141 -14739 179016 210872 353966 338402 350269 460452 235468
13502 235468 167020 296898 366366 301352 428570 96225 270158 382705 345808 399757 347451
13491 347451 326028 431378 301785 34945 -14702 294954 240718 243725 318300 114548 142413
13480 142413 292168 346018 397937 407868 151954 332068 261646 512315 300507 368213 53444
13468 328451 121430 92507 268675 242621 280892 478972 13645 239498 290684 265562 291189
13457B91189B8670P8365O05815I4917A8759J90100D7111K12150R9825C1223Q3357
13446A14580j8065J54922J10930D8088O5108J2145J71135j00016p9406J34184
13436B51238h1424A55150L8783r1337M21201A38602K1899E7891L14264K5669A48857
13424a11700C62415j06613P0763Q760J38638k35731r447J18878l6517B2891d5817
13412b24140E25007j49695j64882n2408b3857B85815j24739K4423o6337Q9858
13402B09020G7590H892L1281c15712B77069f2435D44677j08915j30999k3320Q9700
13391B71143j08690a8438A57693J37542a2587B42584J02200H9289K58074k7691
13381C19672J21451j95827D645b3856A08180L05741j47648N4315A22194J11632
$$ plain form
13457 291189 28670 107035 712850 94917 18759 208859 47111 259261 359086 31223 114580
13446 114580 96515 251437 362367 48088 113196 125341 296476 196460 117054 251238
13436 251238 -81424 155150 193933 102596 523797 138602 160501 57891 372155 397824 148857
13424 -111700 362415 255802 326565 335325 473963 238232 228785 347663 311146 22891 -45817
13412 -224140 525007 375312 210430 158022 -23857 285815 161076 185499 119162 209020
13402 209020 77590 8892 40173 -315712 277069 -62435 444677 335762 204763 181443 271143
13391 271143 162453 -18438 157693 295235 -12587 242584 344784 89289 347363 319672
13381 319672 441123 245296 4645 -23856 108180 413921 266273 320588 122194 233826
13371B33826O519C8972M9881J26172K89474A90361q5682J83783K45001j80474
13361C52989A33196a72315H9012J86282L1291j30543J02409N322g6374k5662A25188
13349B74574L6588j05412L57446B32274K37747A96369M68190j28044B64089K02627
13339D66716G7115J74067L12241A15354B0261J46626K02614A9076J89709K71811
13329D80596B9878L02959P0566n1631I1935M50536B46807J27845l1725j01507
13319B41420j00915L57708A03995L62426j93674j661I7736C5489d98101A89926
13308g0448A57465b35874c4853C55147A42210J30249a8472n3635B85203g7723
13297B90899H711L64617a82770H6473J51271J10359a60356D20561N5933a52449
$$ plain form
13371 233826 240345 38972 88853 215025 504499 190361 104679 288462 533463 352989
13361 352989 133196 -172315 89012 275294 306585 176042 278451 283773 -76374 -102036 125188
13349 274574 311162 205750 563196 232274 470021 196369 664559 536515 264089 466716
13339 466716 77115 251182 563423 115354 20261 166887 369501 19076 208785 480596
13329 480596 29878 332837 403403 351772 91935 542471 246807 374652 342927 241420
13319 241420 140505 498213 103995 466421 272747 271086 97736 35489 -498101 189926
13308 -70448 157465 -235874 -34853 355147 142210 272459 -18472 -72107 285203 -77723
13297 290899 8711 373328 -182770 86473 237744 348103 -160356 420561 476494 -152449
13286B03955f3409b0714A29729J0556a9352B45717A02253J01691a90068f3927
13275B23262Q1791G7215L09508j43905A14312a05206A80718K17607j89203L17771
13265E26893g7704D22942H3461l8999J62463I7639L5830J69370a75289H5468O9668
13254A55136d683A04417R8802J59133a19705C17934D9428a11122D77235d9935
13243a81780B0744O13821a04813B93148j32996c5506r238j59038B29725p1805
13233A57920b5522A43797e0587A95954h4895j63174a03035B19028G2165b60835
13222E45109b2763A04492a57353f3548D015K04880d0642A8027L4313G750Q3323
13211I1073d9897B71117A5351P4636K27034k5466l2430J25215C6399h0607A12755
$$ plain form
13286 203955 -63409 -20714 129729 140285 -19352 245717 102253 203944 -190068 -63927
13275 223262 305053 77215 386723 242818 114312 -105206 180718 398325 209122 526893
13265 526893 -77704 422942 83461 44462 206925 97639 133469 302839 -175289 85468 155136
13254 155136 -4683 104417 203219 362352 -119705 317934 49428 -111122 477235 -49935
13243 -181780 20744 634565 -104813 293148 160152 -35506 -44744 -203782 229725 157920
13233 157920 -25522 143797 -50587 195954 -84895 -248069 -103035 219028 72165 -260835
13222 545109 -22763 104492 -157353 -63548 4015 208895 -40642 18027 52340 7750 91073
13211 91073 -49897 271117 15351 89987 317021 291555 259125 384340 36399 -80607 112755
13199A86621g495G6936i1085A650b39019G4323M7240c2828D95314c1447r7638
13188a29085A9037K55896a02611G2419a36864q729I9287j4178D1949J54422i0855
13176I7692L50510j95418h3832B03254g231A46142n1856J14749E9692k2348L18719
13165C56063I8159B0638M66053a77255M5320k849c7900B7870J19310i1993l4821
13154a26814A41156P7964j00949g0034j22346h815B76565M4925g44C18578L7057
13143C55635g3733C17013A20555c4423D38224A63723J84981b5691A24384l1960
13133I2424h8778A03117g4800j7650F2397b33620A90097J13101b39417B62837
13122C43468F2047b594I7244h0785C02888j47532m0135K30639b30693B6474a20568
$$ plain form
13199 186621 -7495 76936 -91085 1650 -239019 74323 121563 -32828 495314 -31447 -129085
13188 -129085 19037 274933 -102611 72419 -136864 -145593 99287 85109 41949 196371 -90855
13176 97692 448202 252784 -83832 203254 -7231 146142 94286 209035 59692 37344 356063
13165 356063 98159 20638 486691 -177255 -131935 -134784 -37900 27870 147180 -91993 -126814
13154 -126814 141156 219120 118171 -70034 -192380 -8815 276565 321490 -744 318578 355635
13143 355635 -73733 317013 120555 -34423 438224 163723 348704 -25691 124384 92424
13133 92424 -88778 103117 -74800 -92450 62397 -233620 190097 303198 -239417 262837
13122 343468 62047 -2594 97244 -80785 302888 155356 115221 345860 -230693 26474 -120568
13110c27404A49560e5377j5293m2393B02361a99144B09203a03429C2231J50566
13100A82797b2813A45303J54041j48896a01272h035p8487c9448A35699e7841l502
13089f1343j88728l2372A45498e0105B29697K88460k18519o1068D3363g202o4943
13078g2145l5637A88265j395o9821q060M25357f6571r2357B5963f4040C7155Q5540
13066A22695J56657a29055A50123D8399b6836A08675K5638D2004J47022K2508
13056B11534J12618H4343J21546q9858A6084b04455A42984L8998Q8504c043D69454
13044i0907D13951K8379c9168a4822E7454r094M776I123J05229E7022L83187a48779
13031A34327g4298A59946J10890C3753K91332c76978B32316F8755k0135K1544
$$ plain form
13110 -327404 149560 -55377 -70670 -113063 202361 -199144 209203 -103429 32231 182797
13100 182797 -22813 145303 299344 150448 -101272 -8035 -86522 -39448 135699 -57841 -61343
13089 -61343 -250071 -282443 145498 -50105 229697 518157 299638 238570 43363 -7202 -72145
13078 -72145 -107782 188265 186870 117049 108989 534346 -66571 -158928 25963 -64040 37155 122695
13066 122695 279352 -129055 150123 48399 -26836 108675 134313 42004 189026 211534
13056 211534 324152 84343 205889 116031 16084 -204455 142984 181982 270486 -3043 469454
13044 -90907 413951 442330 -39168 -14822 57454 48360 53136 9123 114352 57022 440209 -148779
13031 134327 -74298 159946 270836 33753 325085 -376978 232316 68755 48620 70164
13021G0164J78356K3148m0961D5794k2186J76745e455m6256H0204L21303A34249
13009I2662a63908a1430r6503C97471j36214B3791m003e8716m4257B23233r7351
12998A25882L2099N8202B9378b6845A99171C9364q370J90239a7441A03380d1201
12986f3159j11927C36827j60685G4294N8344c573C16227a59674E6332K3612B1620
12974B13832K09334j73261e9456o2838B01893a32547C75460g7722K7117A57939
12963B8983K19029C4340b19377R0849m3679B26110a81444b6328j73482C53960
12952A42752g5585C2353N8884g1353F9467a83148A52016c8803B32352a4091A11324
12940g5537D2451L01520D6753b24527A25198B5428J14483a625A48719C4015L36819
$$ plain form
13021 70164 248520 271668 230707 45794 23608 200353 -5455 -51711 80204 401507 134249
13009 92662 -163908 -11430 -107933 397471 261257 23791 19788 -58716 -102973 223233 125882
12998 125882 157981 216183 29378 -26845 199171 39364 30994 221233 -17441 103380 -41201
12986 -63159 -175086 336827 176142 74294 132638 -3573 316227 -159674 56332 79944 21620
12974 213832 423166 249905 -59456 -122294 201893 -132547 375460 -77722 -50605 157939
12963 28983 248012 34340 -219377 -128528 -172207 226110 -181444 -26328 -199810 353960
12952 142752 -75585 32353 91237 -71353 69467 -183148 152016 -38803 232352 -14091 111324
12940 -75537 42451 343971 46753 -224527 125198 25428 139911 -1625 148719 34015 370834
12929C70834A53932e2682b151j37500B83216a38041A94152E7558J38054b38921
12918a06701B00544c82502D8596d60312F2624p342a46518i0l49587i2228K9219
12907f3009D858J22290f9033C4588J12731K31466A2469J36821a2838A7682M2811
12896F0493A9498L64282H1854C2487J69876o7216J8646L4084B0487K09497F1840
12884h574A36401C5675b16420A16096J77958d5709A87581a43428B4424a9847p6991
12873i6838o0737B04681c27051B62131j096J46299I937a10682M2951B84094q9605
12862A94489k4902c13197h8117o0568c8963A73251j2278K0551C5438c9277A19229
12850A37932M4613a86154B0506D563a8161r9466B82829A2665a51444r3271G6909
$$ plain form
12929 370834 153932 -52682 -2151 -139651 283216 -138041 194152 57558 195612 -238921
12918 -106701 200544 -382502 48596 -460312 62624 55282 -146518 -90 -349677 -92228 -63009
12907 -63009 4858 127148 -69033 34588 147319 378785 12469 149290 -12838 17682 60493
12896 60493 19498 383780 81854 32487 202363 135147 153793 187877 20487 229984 61840
12884 -8574 136401 35675 -216420 116096 294054 -45709 187581 -143428 24424 -19847 -96838
12873 -96838 -157575 204681 -327051 262131 261035 407334 9937 -110682 -67731 284094 194489
12862 194489 169587 -313197 -88117 -148685 -38963 173251 160973 181524 35438 -39277 119229
12850 137932 182545 -186154 20506 4563 -18161 -117627 282829 12665 -151444 -244715 76909
12838c45492f6418D8206K15152H1508B1306J42561J86431D1440Q1243b32188A29827
12826c2701k19425l765f5565k63956n4700B49448G9667M6522J38863E6067M2974
12815I9041D6280J15796L4866a8622B0809o556b36183A39777c5672l1785B62122
12803B8749N1947a31540K154H9560a5948B07807f4321I0544b4739l01582A12830
12791G4684M92062c5661B52266k7389a7978m9485Q790D55375q7321b9029A57907
12779a60759l7175E5768a25531C85465a9124C30284a73574B29963A02174K52823
12769C54997A68708a41310c2797G59N6133a13514c3949B43856c2206l5628a1523
12757b3696h341l5283K0811j40075b9999B56866E2358Q704k7217b20150D1943
$$ plain form
12838 -345492 -66418 48206 263358 81508 21306 163867 350298 41440 122683 -232188 129827
12826 -32701 -252126 -255891 -65565 -329521 -384221 249448 79667 126189 265052 56067 99041
12815 99041 46280 162076 196942 -18622 20809 14253 -236183 139777 -35672 -67457 262122
12803 28749 80696 -131540 -129386 89560 -15948 207807 -64321 90544 -24739 -326321 112830
12791 74684 566746 -35661 252266 224877 -17978 -67463 -58673 455375 368054 -29029 157907
12779 -160759 -197934 55768 -125531 385465 -19124 330284 -173574 229963 102174 354997
12769 354997 168708 -141310 -32797 759 56892 -113514 -33949 243856 -32206 -67834 -11523
12757 -23696 -8341 -43624 -22813 -162888 -29999 256866 52358 61062 33845 -220150 41943
12745A10589L1989c60343a30949b2578F2201j2508Q2618a23979A1253J42195J58698
12734C12146D6084K3484i4103m439B30051b41012a07270c5311A76598A9142J56683
12723A75825i2916A17419a76929A53184o2950R5032a32989k50584E2767b34206
12712A18905J59873h2560D46251A81125a51302A12920J05277J8602O2614B2500
12701A45359l7464k0437Q9529E7027d5365A24089D5226L9461J27108F3807F065
12689A84445R4365A39069Q1488b65125A13301K7917K41694A08821B4096R1820
12679A15916K38088j14037j3096L1905j17329M3853j7033J00319n8313h1955B39715
12667f4690A96568b1763A37964c1668j67651B25387g5664I1780a88876D19078
$$ plain form
12745 110589 142578 -360343 -130949 -22578 62201 49693 132311 -123979 11253 153448 312146
12734 312146 46084 69568 -94103 -98542 230051 -241012 -107270 -35311 176598 19142 175825
12723 175825 -92916 117419 -176929 153184 90234 185266 -132989 -383573 52767 -234206
12712 118905 278778 -82560 446251 181125 -151302 112920 218197 236799 299413 22500
12701 145359 107895 87458 176987 57027 -45365 124089 45226 84687 211795 63807 6065
12689 184445 278810 139069 220557 -265125 113301 141218 382912 108821 24096 115916
12679 115916 354004 239967 226871 258776 141447 185300 168267 268586 210273 -81955 239715
12667 -64690 196568 -21763 137964 -31668 -199319 225387 -75664 91780 -188876 419078
12656C89975A24278e417C92439a01817G7188c18734A81561K77321f5206A64376
12645A52867J06268c62492C8004J29466D627N6940b75298G8371b7605B15405m47
12634B14958o9785N43m3717g4797B05487K6228k7507b35762A21757K51425L9571
12623D12753r0741j47417j8224b8189B83921d0532m05p3281A47701R5865I99N7842
12611E8841b09152B15820a08509A77794k8389b27374D33258A97052q3201O7342
12601A81193G6241c0636A1793L14402n8731a6867C6825e1738E4987K74084B9589
12589A38910J04941J01318r4866H0991l4886i8482C47321j51565G5344d6839K0432
12578b6407H9146J00469H4968c27813d1851B49706J19737f4485A10240l6497J58554
$$ plain form
12656 389975 124278 -5417 392439 -101817 77188 -318734 181561 458882 -65206 164376
12645 152867 259135 -362492 38004 167470 4627 61567 -275298 78371 -27605 215405 214958
12634 214958 145173 145716 101999 -74797 205487 231715 204208 -235762 121757 373182 412753
12623 412753 322012 174595 156371 -28189 283921 -40532 -40937 -114218 147701 243566 999 58841
12611 58841 -209152 215820 -108509 177794 149405 -227374 433258 197052 113851 181193
12601 181193 76241 -30636 11793 326195 267464 -16867 36825 -51738 54987 329071 29589
12589 138910 243851 345169 250303 80991 46105 -98482 347321 195756 75344 -46839 -26407
12578 -26407 89146 189615 84968 -327813 -41851 249706 369443 -64485 110240 73743 232297
12567B32297m48d0749H4877L12985c3990C8277K71176A46424O2086e7833F6510
12555G7377K57340J7848B3966R1556a20814B65011d3715d364j41555d4997A51915
12543E1184b446l05403D03038A05179Q8493a14598B65099B9024M2955L0204j5027
12532H7156J73336b67111k0782B22165b59842j2096A3500J97808K5089K4363D670
12520B19060D8178N2434g4527B91451A40842b93311A44147J32392j04348a29900
12509A00845R4936K30411C0644L97097f1255m2330A30753b19314I4611b58954
12498A1479a35055A98405o9099a26551B26282a84239B69409a88354A00188R9406
12488A99594h0323k9675B6045A0176K56857b2287m6327C6805a71085n5278i0382
$$ plain form
12567 232297 231849 -40749 84877 397862 -33990 38277 309453 146424 208510 -57833 66510
12555 77377 334717 352565 23966 115522 -120814 265011 -43715 -4364 -145919 -44997 151915
12543 51184 -2446 -307849 403038 105179 193672 -114598 265099 29024 71979 102183 87156
12532 87156 260492 -267111 -287893 222165 -259842 -271938 13500 211308 236397 260760 4670
12520 219060 48178 100612 -74527 291451 140842 -293311 144147 276539 172191 -129900
12509 100845 195781 426192 30644 427741 -61255 -103585 130753 -219314 94611 -258954
12498 11479 -135055 198405 129306 -126551 226282 -184239 269409 -188354 100188 199594
12488 199594 -80323 -109998 26045 10176 267033 -22287 -68614 36805 -171085 -226363 -90382
12476C8679h769F636c4018A46033J49212p5458g2618j59355C12742j15738a35940
12464A16649j7795G210a90644B1740b3947j14267N3188c4558j98551m483A8629
12452h4663n0665F4537K37301e6334k8505l59561c6956j44976A68847G8777i4493
12440e6053q1440M4040j23644A92236a94780A22050b65854a20687A13384K26263
12430C39647L0587A41750J35568a72850D6353J29397a07294C22790B9696J4811
12420D4507P8813K86170c73109a78689n4719F0454e9303B45974b94635a2786l29369
12409c42155a5856A035J57862G7765J93129h970l14337B19900b4909A75053a35721
12397b60099i8853J6043B74425a4974j33443A62773a80495p7398b8946j926j60443
$$ plain form
12476 38679 -8769 6636 -34018 146033 295245 219787 -72618 -231973 312742 197004 -135940
12464 116649 98854 7210 -190644 21740 -23947 -138214 -85026 -34558 -233109 -237592 18629
12452 -84663 -135328 64537 301838 -56334 -84839 -444400 -36956 -181932 168847 78777 -94493
12440 -56053 -137493 -93453 -217097 192236 -194780 122050 -265854 -120687 113384 339647
12430 339647 370234 141750 277318 -172850 46353 175750 -107294 322790 29696 44507
12420 44507 123320 409490 -373109 -178689 -233408 60454 -59303 245974 -294635 -12786 -342155
12409 -342155 -15856 1035 158897 77765 270894 -8970 -323307 219900 -24909 175053 -135721
12397 -260099 -98853 -82810 274425 -14974 -148417 162773 -180495 -257893 -28946 -30872 -191315
12386a91315B34938A2003J84666a16726j5746b6356k6790G0350J68089r4017b29034
12374B50996b34521f8347H6400M00004b63630H3038b00062j39871J40716A10971
12363f4404A04002d23877B6544f5440j13604B10032b6432n5348a2553k6070r1955
12352a30578l9987H360a11347C40138A440L27111a21018A43461e1663l2076C60918
12340A31759a98090H7727J8049a19249j49894B03624i7007C57010A74491a40033
12329g3220F8176b28533E6800n635M9236c3828J841B67475B3936J17882b40245
12317c7443m47582J63855A66668B0540J21472a10949i152B04148C6477J105i2722
12305i9131F6047P8426a8255B5750h2587C7199P0777j8059J50461i8808p2455
$$ plain form
12386 -191315 234938 12003 196669 -116726 -132472 -26356 -53146 70350 238439 144422 -229034
12374 250996 -234521 -68347 86400 486404 -263630 83038 -200062 -339933 -199217 110971
12363 -64404 104002 -423877 26544 -65440 -179044 210032 -26432 -81780 -12553 -38623 -130578
12352 -130578 -170565 8360 -111347 340138 1440 328551 -121018 143461 -51663 -83739 360918
12340 131759 -198090 87727 105776 -119249 -269143 203624 -97007 357010 174491 -140033
12329 -73220 68176 -228533 56800 51165 100401 -33828 -31987 267475 23936 141818 -240245
12317 -37443 -485025 -321170 166668 20540 142012 -110949 -9152 204148 36477 37582 -92722
12305 -99131 66047 144473 -18255 25750 -82587 37199 107976 89917 240378 -98808 -171263
12294a71263A67699c3843A71141K25720j70916n1727a13833j57361A3212O3810
12284G7022l7920J67288c2327E9496K39835p3243E1870b46810B24189K18347C6309
12272F26928A74324c7653D18633e4664B05545A3697K4611K00153F7817a60405
12261A89942e8067B58297a694A0242Q2505K47524j61078R594G7863c344C66878
12249E24649c6861A65354b25071o0336A48667K00066e8365j31773B89435i2535
12238C0589i0979G0317J93483I2510K85072b3656B27421b8919D4381G2c08943
12226e162C95815A56207J48218p8826R1913j02698r2733Q8956j726K61815n0907
12215D20219A91704K38829b24184A37043M18037B62067D5584J36074m4532b9195
$$ plain form
12294 -171263 167699 -33843 171141 396861 225945 174218 -113833 -271194 13212 77022
12284 77022 39102 206390 -32327 59496 299331 226088 51870 -246810 224189 442536 36309
12272 626928 174324 -37653 418633 -54664 205545 13697 38308 238461 67817 -160405
12261 189942 -58067 258297 -1694 10242 92747 340271 179193 188787 77863 -3344 366878
12249 524649 -36861 165354 -225071 -285407 148667 348733 -58365 -190138 289435 -92535
12238 30589 -90979 70317 263800 92510 377582 -23656 227421 -28919 44381 72 -308943
12226 -5162 395815 156207 304425 225599 317512 214814 122081 211037 209311 471126 420219
12215 420219 191704 430533 -224184 137043 555080 262067 45584 181658 137126 -29195
12204b9744B3488L81745L4738A93340o4649J59693A29943L37913A76759O9426
12194B46185O5966J10042A07018a13479H2759K80141j32351K491J49483B5816
12183C49157k5072k6356j14061H0084k0770B3720K6002M9997L93842B43477J29272
12172C72749M7849K9857l6548e5266j85755D8037L1108l5347K53667K4402k1188
12161C00679e5545B01632k0650F0841a41884A02248j013c337l18463B33098m4490
12150A88608p9686g680H378K92922g1831j62360J11425A67749b00836B15921A29
12138B1147b29849B78956i51I6953C6959J19834J00243L7289I5777k5243K40014
12127C10548g1463L600A14433J7576a95765G8618K5705b8281j65305N3640k34923
$$ plain form
12204 -29744 23488 405233 439971 193340 128691 288384 129943 467856 176759 246185
12194 246185 312151 422193 107018 -113479 82759 362900 230549 233040 382523 25816
12183 349157 324085 297729 183668 80084 59314 23720 49722 99719 493561 243477 372749
12172 372749 420598 450455 413907 -55266 -241021 48037 79145 43798 297465 321867 300679
12161 300679 -55545 201632 180982 60841 -141884 102248 101235 -3337 -321800 233098 188608
12150 188608 108922 -7680 8378 301300 -71831 -234191 -122766 167749 -200836 215921 129
12138 21147 -229849 278956 -951 96953 36959 156793 257036 294325 95777 70534 310548
12127 310548 -71463 -67863 114433 132009 -195765 78618 104323 -28281 -193586 -139946 -374869
12116c74869a06853B0381K2658K92790a83121h2578L1448a2027L796B47340h6988
12104A03661a9065j22172F358b58194A95204k3527E4878J13694c9279G2255J86285
12093B58540g1992l5149l57957B01169b3924I5494a77441f7673k21496a26643
12082I4797c6054o5309l06357P9793J24155F1891c15551A32559n6856K88672D9348
12070B64638b66829F6971J04327P59303M17965K94500G60522A70941b547A66613
12059B71038A28372f9353d475A09557K64759j48706q5968K4216L4738I8549J32562
12048B31111l6785a56102j72348C0668P4007A8214L8327c46405J01337A01120
12037A10722a24529I8524M285N2628a29306p6776a02984j07259m9395a162j01325
$$ plain form
12116 -374869 -106853 20381 43039 335829 -183121 -82578 -51130 -12027 -8231 247340 -86988
12104 103661 -19065 -141237 6358 -258194 195204 171677 54878 168572 -39279 72255 258540
12093 258540 -71992 -107141 -465098 201169 -23924 95494 -177441 -67673 -289169 -126643
12082 94797 -36054 -101363 -407720 -327927 -203772 61891 -315551 132559 75703 364375 49348
12070 264638 -266829 66971 171298 930601 1348566 1643066 760522 170941 -2547 166613
12059 271038 128372 -69353 -4475 109557 374316 225610 139642 163858 198596 98549 231111
12048 231111 194326 -156102 -328450 30668 104675 18214 56541 -346405 -245068 101120
12037 110722 -124529 98524 102809 155437 -129306 -206082 -102984 -210243 -259638 -1162 -102487
12026a02487k60181H8346K69960M499A73109J88685c0850F7866a8514A80736e2874
12014E7247a65199c0562B60113A24463j7805j1814c92041P2836E0933K1477a76242
12002E5469P7913d2168r9218r4138c9771B14771D0644f2344E3495b9491k717Q022
11990b4186j80763b8342E2423e1625J38k43343a35875B68501J9392b47311G3594
11978a43855I6734k447c21649E8757a47451N8910c7925l9545j49371B74962b71158
11966G6800J38516J22214j52516g1621l81708G8724J42264J87260b87724J07903
11956a79821A15042e6171j4245C0353d4990A56711K3242i0073L7365j69315f2856
11944d7910H4814e7391j18128p0822d6754J1018B6068b00721o0149f8939j10747
$$ plain form
12026 -102487 -362668 88346 358306 362805 173109 361794 -30850 67866 -18514 180736 -52874
12014 57247 -165199 -30562 260113 124463 106658 94844 -392041 -319205 50933 72410 -176242
12002 55469 133382 -42168 -141386 -235524 -39771 214771 40644 -62344 53495 -29491 -32208 -24186
11990 -24186 -204949 -28342 52423 -51625 -51487 -294830 -135875 268501 287893 -247311 73594
11978 -143855 96734 94287 -321649 58757 -147451 -88541 -37925 -77470 -226841 274962 -271158
11966 76800 215316 337530 185014 -71621 -453329 78724 220988 408248 -287724 -179821
11956 -179821 115042 -56171 -70416 30353 -44990 156711 179953 -90073 -52708 -222023 -62856
11944 -47910 84814 -57391 -175519 -246341 -46754 -35736 26068 -200721 -260870 -68939 -179686
11933a79686C6392J48905C1362K34162a3911l05633A17242L20383G7543a97274
11922c5341n796j605A7674a23221A0857J3888e9709R576I2977J29509b09752B0403
11909c854l5915j84234O1977G6357K76727h4538C50361a37975E9747j6959l892
11898C8896i5588A23416B6800b21716A55700b47639B48461A10976c21454D7229
11887F7030N6931b6838O755A22118i5582B4125J39700a81835C9845P3799a10410
11875d0529k72423g3116k02152B62351B5267G712a35093j12090C863J407L13791
11864C19061g3351j77225B1173a4939B35414a50155G2878b41620B21098f4516
11853a95355c93H0519c15809d8956A3980M241a62956r412M3991d7471p0878D101
$$ plain form
11933 -179686 36392 185297 31362 265524 -13911 -319544 117242 437625 77543 -197274
11922 -35341 -41137 -42742 17674 -123221 10857 24745 -59709 -50133 92977 222486 -209752 20403
11909 -3854 -39769 -224003 -162026 76357 353084 -84538 350361 -137975 59747 42788 38896
11898 38896 -95588 123416 26800 -221716 155700 -247639 248461 110976 -321454 47229
11887 67030 123961 -26838 -20083 122118 -95582 24125 163825 -181835 39845 113644 -110410
11875 -40529 -312952 -73116 -275268 262351 25267 7712 -135093 -247183 3863 5270 319061
11864 319061 -73351 -250576 21173 -14939 235414 -150155 72878 -241620 221098 -64516
11853 -195355 -393 80519 -315809 -48956 13980 18221 -162956 -172368 -128377 -47471 -118349 4101
11840D5799b6912j26244p491A90555b56992Q9630A53184E3425R9393a3609j3846
11829b7455A03806b21941H3516a75394L4653b3703l45415a65303F7162c61667
11818a38777A99497G3386a49051M7073k4448j1226R852j15086J9353A67950A1341
11806A05819J564N8558a31180A84569a91708D953a36867m3319A38033e3324F8288
11794a71246L4624K314M7997k4056C56437a47110d7464k59633B9968a41895K2623
11783a19272H7634K73891I6453J04118F5620a6504B03064f0818k14605B01184
11772a12630I3196d9515F1996B0413a69462A305b06586j3794F2957b16352R285
11761b07067K9968F1496J27716G5841j9272a3287H5748N4816Q0142j9152a89673
$$ plain form
11840 45799 -26912 -153156 -160647 190555 -256992 -167362 153184 53425 152818 -13609 -27455
11829 -27455 103806 -221941 83516 -175394 -140741 -23703 -369118 -165303 67162 -361667
11818 -138777 199497 73386 -149051 -101978 -126426 -137652 -127800 -242886 -223533 167950 11341
11806 105819 107383 165941 -131180 184569 -191708 4953 -136867 -180186 138033 -53324 68288
11794 -171246 -136622 -134308 -86311 -110367 356437 -147110 -47464 -307097 29968 -141895 -119272
11783 -119272 87634 361525 96453 200571 65620 -16504 203064 -60818 -275423 201184
11772 -112630 93196 -49515 61996 20413 -169462 1305 -206586 -220380 62957 -216352 -207067
11761 -207067 -177099 61496 189212 75841 56569 -13287 85748 140564 220706 201554 -189673
11749A55161J7492A5852c76510J44873A92847n4998d6321l5504n1814h872j07596
11738a16468b9480j6398I5718a41898A9193M6238j0986Q3435L5749G3233L8181
11727A11414f3067J6288k5593H520d1095j53151K5226d6135B35956I9790J4684
11716A14474D8381i5150G1708B9018a85715A72032J12360i08D6953d6854B60312
11704F2446K41477F6939J99217b71159C22078g7521B78352f2123p905A46362m891
11693A41471c71241B11213g4690F4166l0942d8098p8944A90013f1967B78459A2199
11681c16771a1862G8171J01185J30949h5535C24444A39175k785A4500c10476A5377
11669g6726B49034r8767Q2746F4704b91313A67810a02015a4331l64324G7541j8412
$$ plain form
11749 155161 172653 15852 -376510 -231637 192847 137849 -46321 -81825 -133639 -8872 -116468
11738 -116468 -29480 -45878 95718 -141898 19193 65431 54445 137880 173629 73233 111414
11727 111414 -63067 -46779 -72372 8520 -41095 -194246 -169020 -46135 235956 99790 114474
11716 114474 48381 -95150 71708 29018 -185715 172032 284392 -908 46953 -46854 260312
11704 62446 303923 66939 266156 -271159 322078 -77521 278352 -62123 -70028 146362 141471
11693 141471 -371241 211213 -74690 64166 33224 -48098 -127042 190013 -61967 278459 12199
11681 -316771 -11862 78171 179356 310305 -85535 324444 139175 136390 14500 -310476 15377
11669 -76726 249034 150267 233013 64704 -291313 167810 -102015 -14331 -378655 77541 59129
11658E9129c06694a41050A69676G6125J85172F3847J13364j1058e0020q7139A0081
11646a37808C0375b1966B89370a40599f7345b2769E6110b18546Q6590D62899A543
11634c7626j53720G9899J09120N2934N2236n4023J58504J20272e3549C91502b68669
11622A78861m6998a06311l3801E84872F7251a24106C10204p0928J12833b52797
11611h8705K5056p7087j78092E825J75041H3844g6824j099B95303p7146a24259
11599C8949K1434a27117e5625B04557a01174A53429A8275M54394b5501C02376
11588B67845J6244r3127E8238J62468G590Q2763J81882M280A0952K60241C6564
11576F4671J95028C1754a46811D78259j32474B2336P9703L28105E1128J72192
$$ plain form
11658 59129 -306694 -141050 169676 76125 261297 63847 177211 166153 -50020 -137159 10081
11646 -137808 30375 -21966 289370 -140599 -67345 -22769 56110 -218546 -131956 462899 1543
11634 -37626 -191346 79899 189019 241953 294189 240166 398670 518942 -53549 391502 -268669
11622 178861 131863 -106311 -140112 584872 67251 -124106 310204 239276 352109 -252797
11611 -88705 -63649 -140736 -318828 5825 180866 83844 -76824 -77923 295303 218157 -124259
11599 38949 60383 -127117 -55625 204557 -101174 153429 18275 472669 -25501 302376
11588 267845 284089 190962 58238 220706 7590 90353 272235 276515 10952 271193 36564
11576 64671 259699 31754 -146811 478259 345785 22336 102039 430144 51128 223320
11566B23320b7668j40461A73791i9510j71525C8912R1969Q7559b500A32438E2146
11554a40480A60072a23843A42969A0392K64736J5214I1242J24469b26923I6618
11543D555J98203F5919N5343e9493j70531B48255B3714b7183A86896J29546H1262
11531A13479J67754K43903B03978N8504P2070j03382r2886Q80d4984k472A63183
11519A07423j8530a15152C7186J17979h169A01789f5125I0579J98605J5555a95092
11507A03478K27851n1388i0129B23273L11374A90010M8040p5485K99759k09588
11497B52736j2410O0185o990A16370K17272b3479A63621k6345j7751i2949j71715
11486b64664G9259K24667i6652B7549J62301J92380A65450M5940L36153k64732
$$ plain form
11566 223320 -27668 -168129 173791 -99510 -271035 38912 130881 218440 -2500 132438 52146
11554 -140480 160072 -123843 142969 10392 275128 290342 91242 215711 -226923 96618
11543 4555 202758 65919 121262 -59493 -230024 248255 23714 -27183 186896 316442 81262
11531 113479 281233 525136 203978 262482 334552 231170 138284 139164 -44984 -47456 163183
11519 107423 88893 -115152 37186 155165 -8169 101789 -65125 90579 289184 304739 -195092
11507 103478 331329 279941 -90129 223273 534647 190010 238050 162565 462324 252736
11497 252736 240326 300511 293521 116370 333642 -23479 163621 137276 119525 -92949 -264664
11486 -264664 79259 303926 -96652 27549 189850 382230 165450 211390 547543 282811
11476B82811K74776I6096O5443b4416r3790A32441K11898b063B19663r2218L3867
11465A61312p0281K59209P549b71316E58981H9469J37979c4120A1134f3843a7231
11453D07199a87632g984G2584L50396e4323A71136K64577a4343r9322I5512j6468
11442G9044a15941p0434B28808b24820A85336J15203a49976A10011a6392D23994
11431b0295C29391A40756c8194j49141C07171E9298B1051P1305f3313a7931G9988
11419E8990c2464B52767I5348a60786B30442e5238b562m13050D0473a22061K576
11408a19485d2453B3632J17658B0678Q7439J3609f0934G3883J21012J62311D2147
11396A95237q6710k2125J00258g6296o261I8553r951a52653H0644j5897e4933
$$ plain form
11476 282811 557587 96096 161539 -24416 -118206 132441 344339 -2063 219663 127445 161312
11465 161312 91031 350240 357789 -271316 558981 89469 227448 -34120 11134 -63843 -17231
11453 407199 -187632 -7984 72584 422980 -54323 171136 435713 -14343 -113665 95512 79044
11442 79044 -115941 -186375 228808 -224820 185336 300539 -149976 110011 -16392 423994
11431 -20295 329391 140756 -38194 -187335 307171 59298 21051 92356 -63313 -17931 79988
11419 58990 -32464 252767 95348 -160786 230442 -55238 -2562 -415612 40473 -122061 -119485
11408 -119485 -42453 23632 141290 20678 108117 121726 -60934 73883 194895 357206 42147
11396 195237 108527 86402 186660 -76296 -82557 98553 88602 -152653 80644 64747 -54933
11384b0615k15125D6270A405g7287G130e4299D1365F752a10617a3691B69130C0954
11371G6306C6325L37385j38257a13979n6869B72585a82779q8775K1843I4227a6250
11359c39568a02689n0780F8374d13300a97836J8174A79714i8981B18349F008g3236
11347A80085i9383A41635L8367a05578B34632e8946J5354A00886b56715g3823
11336A58705A0853P3504a46560C18453D8563l718a0880l00050H0654N9199J13338
11325B53191g1884C9631a1386j37766g1883a5661B55294j07863m0663M0465a96030
11313A38360L6775L1840e1021G958K58826A23128A6591b9159I6250J21289g0838
11301F7990J12679q3113P1419P6168a06162A05682J16261b24125F4604b09358
$$ plain form
11384 -20615 -235740 46270 1405 -77287 7130 -54299 41365 6752 -110617 -13691 269130 30954
11371 76306 36325 373710 235453 -113979 -170848 272585 -182779 -271554 -249711 94227 -16250
11359 -339568 -102689 -153469 68374 -413300 -197836 -179662 179714 -98981 218349 6008 -73236
11347 180085 -99383 141635 180002 -105578 234632 -58946 -43592 100886 -256715 -73823
11336 158705 10853 84357 -146560 318453 48563 44845 -10880 -310930 80654 139853 253191
11325 253191 -71884 39631 -11386 -149152 -71883 -15661 255294 147431 106768 147233 -196030
11313 138360 175135 206975 -51021 7958 266784 123128 16591 -29159 96250 217539 -70838
11301 67990 180669 97556 168975 245143 -106162 105682 221943 -224125 64604 -209358
11290E4716J3772f0879a2689j4859B29213J43896g1091a5752k57339J04336A63262
11278A01361K11595a0681l45287B71234b07337F5364O582J62728o2239b63237
11267A87719q9042C6348h4034K2837C11764b17887A04296j2189l4168a29055j16773
11256b45828i0039j39390a04870G8597c26103B16039J13681A04771h6924j91684
11246b78608B84062r1434b60505j0179p7300A9166a60291K7932H4282a16080B345
11234A8506K66917b33233n7436A37213a83412B56566e9735K5661l7724B47422
11223c00949b8647j91936D189J0905M0075B5630l171e0414k07344O7224k8487
11212b19021A57024a03029j2774A6687i0509j43888g6441A0576i0618B5917c1455
$$ plain form
11290 54716 68488 -60879 -12689 -27548 229213 373109 -71091 -15752 -273091 -168755 163262
11278 101361 312956 -10681 -355968 271234 -207337 65364 71946 234674 172435 -263237
11267 187719 98677 36348 -84034 -61197 311764 -217887 104296 92107 57939 -129055 -245828
11256 -245828 -90039 -229429 -104870 78597 -326103 216039 329720 104771 -86924 -278608
11246 -278608 284062 192628 -260505 -270684 -347984 19166 -160291 -132359 84282 -116080 2345
11234 18506 285423 -233233 -290669 137213 -183412 256566 -59735 -34074 -71798 247422
11223 -300949 -28647 -220583 4189 15094 55169 25630 22459 -50414 -257758 -190534 -219021
11212 -219021 157024 -103029 -115803 16687 -90509 -234397 -76441 10576 -90618 25917 -31455
11200b6707j58510l7168B041J1917J30480J86189N3021h4873C4699a46835M3211
11189a03624H2932b70238B70804b4302n1581A02097A7809a20829B26681b90602
11178b86800A6675a80619B86241b06037d9765A71024a84022D0669Q3282b40344
11167A03889J15932a7486j6466k11540a07267f398A01243J37471b48087F2797
11156A29816B6565b33418B20077p7084J97516b06148o9658A58559b75891f4327
11145b38595j53207A53017a75781m7578B59737B0136c5219n9049j72417O4304
11135b02381K2795A6188K6940J32601K97161b5447n373B41682A18080b0237p3943
11124i4180H3182K85088d3925A6924d14074A5198a78831A52740L8316m0613J47877
$$ plain form
11200 -26707 -185217 -222385 2041 13958 144438 330627 383648 -84873 34699 -146835 -103624
11189 -103624 82932 -270238 270804 -24302 -75883 102097 17809 -120829 226681 -290602
11178 -286800 16675 -180619 286241 -206037 -49765 171024 -184022 40669 123951 -240344
11167 103889 219821 -17486 -33952 -245492 -107267 -6398 101243 238714 -248087 62797
11156 129816 26565 -233418 220077 142993 340509 -206148 -275806 158559 -275891 -64327
11145 -238595 -391802 153017 -175781 -223359 259737 20136 -35219 -94268 -266685 -202381
11135 -202381 -179586 16188 43128 175729 472890 -25447 -30820 241682 118080 -20237 -94180
11124 -94180 83182 368270 -43925 16924 -414074 15198 -178831 152740 191056 150443 298320
11113B98320I0428O0685o2504c9059B36355b86876A22627h1419C19838A46602
11102A37063R7647j05759b19511A98506K4056R073k4764R0669K21680A18694a06870
11090A05683R4085m2175M022J73991C8227J74705l5573J0306O6022K64283J48316
11079F66286A13049L49545j69535C1315O4567J90892A15941L37230H876J61945
11069A70821M16919j73147k2631L6976n671J81110J16924Q0402k40362J5181J02659
11058F79181m9509j39413K50715j95995L58769n6939M5390k11696J73290K38679
11048A092472j44036Q5658n8467j87103n8517K29525J39547m55254J00157J13479
11038H57461J01075J44953m18533L54967p0430O2822j94766J4734l38569Q1850
$$ plain form
11113 298320 90428 151113 88609 -39059 236355 -286876 122627 -81419 319838 146602
11102 137063 234710 128951 -219511 198506 222562 231635 206871 297540 519220 118694 -106870
11090 105683 199768 157593 161615 335606 38227 212932 177359 187665 253687 517970 666286
11079 666286 113049 462594 293059 31315 95882 286774 115941 453171 8876 170821
11069 170821 587740 414593 391962 428938 423267 604377 721301 801703 561341 576522 679181
11058 679181 629672 490259 740974 544979 903748 846809 892199 680503 853793 1092472
11048 1092472 948436 1034094 975627 788524 730007 959532 1099079 643825 743982 857461
11038 857461 958536 1103489 684956 1039923 969493 1032315 837549 852283 513714 595564
11028E95564L88647K2960k7528m6911j14081L89381n29577L4044L12317k73204
11018G51612J56127K71596n69777M08891m51057P3782L15638j76884J72338l6848
11008I15418O4331K49406n81109J05896P7384l1352K54900k62148K21038l48771
10998F64993K78507O2474j40598O9240r1372j94290L02584K92193j1253n21171
10988G11307M19507J99130j5615j08289r4315N00106m23295L57463P475k1170
10978A532304P9136N57256K5688K99567J81083O60326L15545q8486J48894q202
10968C703111j23268J35334n39697m14441k91451j35253k2596k74080J76264K1368
10958B235291n9853L796j18235j88699J425k15724n45382L52816j76251m46586
$$ plain form
11028 595564 984211 1007171 979643 932732 818651 1208032 678455 712499 1024816 751612
11018 751612 907739 1179335 609558 1018449 567392 641174 956812 779928 952266 915418
11008 915418 979749 1229155 648046 753942 831326 799974 1054874 792726 1013764 664993
10998 664993 943500 1005974 865376 934616 843244 648954 951538 1243731 1232478 711307
10988 711307 1130814 1329944 1314329 1206040 1111725 1611831 1188536 1545999 1553474 1532304
10978 1532304 1611440 2168696 2194384 2493951 2675034 3335360 3650905 3562419 3711313 3703111
10968 3703111 3579843 3715177 3175480 2761039 2469588 2334335 2311739 2037659 2213923 2235291
10958 2235291 2175438 2179234 2060999 1872300 1873725 1658001 1112619 1465435 1289184 842598
10948H42598k84104J09507k33388p5538J83982J10731k37253E3291K06209k9077
10938B30423j5025J0659a1125I4465J88627J2582j11065J72814A6896J65826F2086
10926B28319a3542B95563a18481F4760o866J31519a53642J8276C04957H5285a07319
10914A25204J17464C8458K35295a74454r1580b7219j1118A74675G5816b3359j03988
10903a27347G1190i0081j06517E3038B364K63536a60030A46054a16257A2134e2768
10891C3728b48156B30636e4943K1112I343c8481k46423A22664f0652j66806l8841
10880b66299C21490b30463A74778a60132r3326a23404e8868B6497b37541b7830
10869G0659a39513l7927A7777b45390D27047G7043G086J01790g7236A92569c1947
$$ plain form
10948 842598 558494 668001 434613 359075 543057 653788 416535 53291 259500 230423
10938 230423 215398 226057 -11125 94465 283092 295674 184609 357423 16896 182722 62086
10926 228319 -13542 295563 -118481 64760 57894 189413 -153642 -135366 304957 85285 -107319
10914 125204 242668 38458 273753 -174454 -266034 -27219 -38337 174675 75816 -23359 -127347
10903 -127347 71190 -90081 -196598 53038 2364 265900 -160030 146054 -116257 12134 -52768
10891 33728 -248156 230636 -54943 -33831 9343 -38481 -284904 122664 -60652 -227458 -266299
10880 -266299 321490 -230463 174778 -160132 -253458 -123404 -58868 26497 -237541 -27830
10869 70659 -139513 -177440 17777 -245390 427047 77043 7086 108876 -77236 192569 -31947
10857A2694b2430A66818c60962a8977H2746k4561K16969d8004j03186A85762a67755
10845a2862k80514I3041a30503M0612A77932l0118J37484i464C88727e1285n8312
10834a09597B94369A25477e2689F6611b34514f8783B3002N4931B6338K4953a89989
10822h6004B00441b1186I5503A935K78298k721b41708C1174a9086k00868O7649
10811a52305o0104d0861D198i6699q0275r4920g8480c7446H6437Q7191N9519a50752
10798d9206I4070a39204i940k8744A14029m8137J61198C1976b81824H427h6817
10786b52414H642c38175a04113k03907i289j25436j7968J364K3482D3620J19283
10775A62903B6207K4526K63016b06876D41299b51039a11039H7259J4691J66965
$$ plain form
10857 12694 -22430 166818 -360962 -18977 82746 58185 275154 -48004 -151190 185762 -167755
10845 -12862 -293376 93041 -130503 -89891 177932 147814 285298 -9464 388727 -51285 -109597
10834 -109597 294369 125477 -52689 66611 -234514 -68783 23002 77933 26338 51291 -189989
10822 -86004 200441 -21186 95503 1935 280233 277512 -241708 31174 -19086 -219954 -152305
10811 -152305 -212409 -40861 4198 -96699 -176974 -271894 -78480 -37446 86437 173628 233147 -150752
10798 -49206 94070 -139204 -9940 -38684 114029 65892 227090 31976 -281824 8427 -86817
10786 -252414 8642 -338175 -104113 -308020 -9289 -134725 -152693 -151329 -127847 43620 162903
10775 162903 26207 50733 313749 -206876 441299 -251039 -111039 87259 101950 268915
10765B68915D4095f1032L0361j66292A74913C3586c40107j9031E1982L51811e482
10753C22477E7943P733a7735p9281a2526I5340b36586Q6084A64008M2707e3872
10741b4778j61296G9336a59948B28786c76633F5915e0825B4043J80949a14483
10730f7329B51294a1134m50213H4673b64827C0985J10640a74284M4208B01596
10719f1414E0344F125c73010A07297e6354k75521J23407c1803C8209h7196k89656
10708c76852J04496a16206A25622l4693N0235b59362d6120k04435A41344j7199
10698A24145a56729L3356F8177J08632a21545L90B6272c446j88371Q2452d4699
10686b2640j18994A04668b36993H2613C4526a70498l1182p5319j93087K31448
$$ plain form
10765 268915 44095 -61032 -30671 -196963 174913 33586 -340107 -359138 51982 403793 -5482
10753 322477 57943 65676 -17735 -97016 -12526 95340 -236586 -150502 164008 206715 -53872
10741 -24778 -186074 79336 -159948 228786 -376633 65915 -50825 24043 204992 -114483
10730 -67329 251294 -11134 -461347 84673 -264827 30985 141625 -174284 -130076 201596
10719 -61414 50344 6125 -373010 107297 -56354 -331875 -208468 -31803 38209 -87196 -376852
10708 -376852 -272356 -116206 125622 90929 141164 -259362 -46120 -250555 141344 124145
10698 124145 -156729 -123373 68177 176809 -121545 -121155 26272 -3446 -191817 -109365 -44699
10686 -22640 -141634 104668 -236993 82613 34526 -170498 -201680 -276999 -470086 -238638
10676b38638L8476F0988c7386D95089a36529M4642j30513b8776A74249H1529a10095
10664e8131j91390O8256j9670A84631A494J37937q560J16621b69722F5874j2958
10653E2916b80110B08893a63654p0857e6908I1886a13662D5367k233b87614C9122
10641I2012e88718J28347g7211A54683A5681a76258d918A65237a91437j71337
10631c62774a51354j5616b7387F3309b20670b1582n4506o0650k22261F8310R8136
10620A66446e3694C02011c56339J32221A52063d7117G2446a90584K8693I0607
10609a6991j12302c073l40431K2592c95H3428a33206I5887J07635f2351H473K36817
10597B45290a01586k7962c9713C98919c5061G9359a60346c1195j22002A27445
$$ plain form
10676 -238638 -200162 60988 -37386 495089 -136529 -91887 -222400 -28776 174249 81529 -110095
10664 -58131 -249521 -181265 -200935 184631 1494 139431 130871 247492 -269722 65874 52916
10653 52916 -280110 208893 -163654 -234511 -56908 91886 -113662 45367 43134 -287614 39122
10641 92012 -588718 -460371 -77211 154683 15681 -176258 -4918 165237 -191437 -362774
10631 -362774 -151354 -166970 -27387 63309 -220670 -21582 -76088 -136738 -358999 68310 166446
10620 166446 -53694 302011 -356339 -224118 152063 -47117 72446 -190584 -161891 90607
10609 -16991 -129293 -3073 -343504 -320912 -395 83428 -133206 95887 203522 -62351 8473 245290
10597 245290 -101586 -129548 -39713 398919 -35061 79359 -160346 -31195 -153197 127445
10586A44916G2348a20285B5988J2368c22615B26167b02460p6042A10415d7820
10575b9826p8661m4707k0766E5461i8883k99754J97465C1607L2249B5798L7976
10564F3774K46707D7129a83504M124l59746F7861b86710f3123o9738A54830o2382
10553I2448d3819j26848H8173J07042a25397G437Q5947l2528b29541d4541o2702
10542a07243D5329O6001A2575Q5128b3816j9130l55599g7830J2036F3189a04656
10530B07663h2039p5620H0240M191K62656C0975e4261C16099G7449L01789A05255
10518I9516a26385b1470j34650C36151b77763A34366a2372B64066D0700A1305
10507B97864n2720p4058a7148I1359b00313E4111g4162B73994M3328B2043b40152
$$ plain form
10586 144916 72348 -120285 25988 38356 -322615 226167 -202460 -278502 110415 -47820
10575 -29826 -108487 -153194 -173960 55461 -98883 -398637 -201172 31607 63856 25798 63774
10564 63774 310481 47129 -183504 -179380 -539126 67861 -286710 -63123 -132861 154830 92448
10553 92448 -43819 -170667 88173 195215 -125397 7437 93384 60856 -229541 -44541 -107243
10542 -107243 45329 111330 12575 97703 -23816 -42946 -398545 -77830 -65794 63189 -104656
10530 207663 -82039 -157659 80240 84431 347087 30975 -54261 316099 77449 379238 105255
10518 99516 -126385 -21470 -156120 336151 -277763 134366 -12372 264066 40700 11305
10507 297864 245144 171086 -17148 91359 -200313 54111 -74162 273994 317322 22043 -240152
10495F1731c6217A31931b6228r0668A35382b84955d1448B9690a73515e5262D2335
10483C28692A32503J04875a8561C39717O2203l0929j58862M44576B85973A32569
10472C5896J37400o2865R9901F6077b05228B66447I1424A8110J92665B3691a35896
10460C03233b34913R5270r3925A43332M5797M4838F6572b46881J05599K2834I2152
10448d4437A73743J1104b26802I2498a11473D36140d2897I759b89849J08449e4320
10436C02439h3196A37535K1595J10000l2889h0848D8015i433A00969a70634A76809
10424a83410g089j7374H3594K4498K4337M0486d82431K33674B300L16819c8711
10412b14455B36973f6126B7637g4630A0273a43016f3527F3387A0347g5339p2871
$$ plain form
10495 61731 -36217 131931 -26228 -116896 135382 -284955 -41448 29690 -173515 -55262 42335
10483 328692 132503 237378 -18561 339717 401920 370991 212129 656705 285973 132569
10472 35896 173296 110431 210332 66077 -205228 266447 91424 18110 210775 23691 -135896
10460 303233 -234913 -139643 -233568 143332 189129 233967 66572 -246881 -141282 -118448 92152
10448 -44437 173743 184847 -226802 92498 -111473 436140 -42897 9759 -289849 -181400 -54320
10436 302439 -83196 137535 159130 269130 236241 -80848 48015 -9433 100969 -170634 176809
10424 -183410 -7089 -24463 83594 108092 132429 172915 -482431 -248757 2300 319119 -38711
10412 -214455 236973 -66126 27637 -74630 10273 -143016 -63527 63387 10347 -75339 -148210
10401a48210k04026g8765H0068O1027n7009c46650C09325b69729a13285j27151
10391b40436B86159j04435D9168K80342l2611a55974C21313r9375b08884E52598
10380B50395P4295K2887J02190o4452b25955F1686J56258l5927K31427M8639J3060
10369D75143K42392C11329K88678j99828j65958O59101l89156q8881j87678L37794
10359E65401j10276A36159n3902K15871J31281f6989A64103K84375K5301K93990
10349G67769k43888K71601C54110r1872K7630M158J71672A22986Q5099j9163L02300
10338D91222k38847k2993l4495L75227j15199D6842g0441B89586j06155M1951
10328B25382b26720C81279j40550P5364b05257D0932L40039K0562K3650R5695
$$ plain form
10401 -148210 -352236 -78765 80068 141095 84086 -346650 309325 -269729 -113285 -240436
10391 -240436 286159 181724 49168 329510 296899 -155974 321313 221938 -208884 552598
10380 250395 324690 347577 449767 385315 -225955 61686 217944 182017 413444 462083 475143
10369 475143 717535 311329 600007 400179 234221 893322 504166 415285 227607 565401
10359 565401 455125 136159 82257 298128 429409 -66989 164103 448478 473779 767769
10349 767769 523881 795482 354110 262238 289868 294026 465698 122986 208085 188922 491222
10338 491222 252375 229382 194887 570114 454915 46842 -70441 289586 183431 225382
10328 225382 -226720 381279 240729 316093 -205257 40932 380971 401533 425183 520878
10318E20878A69163k1752J42428g7267C56733r5670b05323D6540b41792i3250
10307a91652c3362n8138D06559c49670a2765E9766O9199J8330a21060f0281k3217
10296h3498C48572g6123B46304g7385A95665i2544B18890a5901C72745a59374
10285A65419c9731A70813q2753c59504f3218A28984b17513K7170c842j42290H2472
10273b80238A82689A0870a64973E9959B9339O7477N6747a8101D4781M7759Q8565
10262A81105k2536O6402k0810N0835M91437l39666I5677M19142L2243G5907M90994
10251E66901h0509j84979A37271E0940a27492M4874b7959l103o5875N380k3650
10240a15207p5731m818d7157k22339N3614C1864L0399O4434f7573A14638R106
$$ plain form
10318 520878 169163 147411 289839 -77267 356733 261063 -205323 46540 -241792 -93250
10307 -191652 -33362 -91500 406559 -349670 -12765 59766 128965 147295 -121060 -60281 -83498
10296 -83498 348572 -76123 246304 -77385 195665 -92544 218890 -15901 372745 -159374
10285 165419 -39731 170813 88060 -359504 -63218 128984 -217513 -190343 -3842 -146132 82472
10273 -280238 182689 10870 -164973 59959 29339 96816 153563 -18101 44781 92540 181105
10262 181105 158569 224971 204161 254996 746433 406767 95677 514819 547062 75907 566901
10251 566901 -80509 -265488 137271 50940 -127492 -82618 -27959 -31062 -96937 -91557 -115207
10240 -115207 -190938 -195756 -47157 -269496 -215882 31864 62263 126697 -67573 114638 123744
10229A23744a89124c3734j01996A30527g8198B16414a4149F7150B2652a20203
10218A05146a19945A6927b5407p3332j41881I1341a73594A61297a41606j65063
10208c06669B53056H245h3935M057p4086d5054B79520i2208J9834B57277c13424
10196e7821m4905A49215I503c64852F2287g5135E3695J21461a63486e2727b502
10184B0620N107g5667m6624j29036m7894A5052a79153d4646k45450A33802o5166
10173F8636g7749b628A14163O8954f679i30E7188J98743b00598B41401A14587
10161a85548c8560j70801R0040d8719F5460b55821A94291i3639K6235a0808q2312
10150i3120l2732k51305J88312A26158c59594C59610b73841B27368a2726l3531
$$ plain form
10229 123744 -189124 -33734 -135730 130527 -78198 216414 -14149 67150 22652 -120203
10218 105146 -119945 16927 -25407 -98739 -240620 91341 -173594 161297 -141606 -306669
10208 -306669 253056 8245 -83935 -79878 -153964 -45054 279520 -92208 -72374 257277 -313424
10196 -57821 -102726 149215 9503 -364852 62287 -75135 53695 175156 -163486 -52727 -2502
10184 20620 25727 -75667 -122291 -251327 -299221 15052 -179153 -44646 -290096 133802 68636
10173 68636 -77749 -2628 114163 183117 -6679 -930 57188 255931 -200598 241401 114587
10161 -185548 -38560 -209361 -119321 -48719 65460 -255821 194291 -93639 -67404 -10808 -93120
10150 -93120 -125852 -377157 -188845 126158 -359594 359610 -273841 227368 -12726 -46257
10140d6257j35549e7148j06978g7789j39266M4067b6628B27675c1783k5267k14827
10129b71877Q7091i2303b3341E0783c5953k81099D3533K5249b20625C30456r9543
10118B30913p8249a71237b7812j11610a3396l1125j70210H1797K3129a4441m58433
10107d72874a82564q9364a7542m53918J44430e6830j09233k80131a78411k61120
10097d39531e8376k40733A85977a08216h174n8793j24932k41374a39334f540B77959
10085e9519l0455L0811l42189a00868A2065O6992a44358j14028Q3020E5668N2868
10074A08536a1735r8146l3323l4420h4331n5759M3001M2409B99288d28702a8245
10062c83876A19200l2605K45457a74814g8130j36994b0783F262a00618F1899K05429
$$ plain form
10140 -46257 -181806 -57148 -164126 -77789 -217055 -172988 -26628 227675 -31783 -57050 -271877
10129 -271877 -184786 -92303 -23341 50783 -35953 -317052 43533 68782 -220625 330456 230913
10118 230913 152664 -171237 -27812 -139422 -13396 -44521 -214731 81797 104926 -14441 -472874
10107 -472874 -182564 -271928 -17542 -471460 -327030 -56830 -166063 -446194 -178411 -439531
10097 -439531 -58376 -299109 185977 -108216 -8174 -66967 -191899 -433273 -139334 -6540 277959
10085 -59519 -89974 -59163 -401352 -100868 12065 79057 -144358 -258386 -175366 55668 108536
10074 108536 -11735 -109881 -143204 -177624 -84331 -140090 -97089 -54680 299288 -428702 -18245
10062 -383876 119200 86595 332052 -174814 -78130 -215124 -20783 6262 -100618 61899 267328
10051B67328d053A35635c05540f2140o2020f1552G1589c4515I5464l1710J68949
10040B32703a69634B23115i4969j00676b0857C4958M81380B50217j1549r3305
10030A45363b05369b0801n8578r1916J7828k17856F9246a97937e1509k15749J8879
10019b48379i6091c4532r5814O3393A84355e2995l74g420A54991J87778A08210
10007A63157b022B3043M7067a90855J8371J7883J416a8920p3610l7528j77599
9996c07657J00693A30280b32028F5506a11361H7025a3442E9117J07356o7094L140
9985A02519b25493A94257C5174b40115e2416j42739q7418F5765R5156f6082k33215
9974b99297a14005l9072l2705J2863k4119P4594A5151J08740a38274e5239k04938
$$ plain form
10051 267328 -4053 135635 -305540 -62140 -124160 -61552 71589 -34515 95464 63754 232703
10040 232703 -169634 223115 -94969 -195645 -20857 34958 516338 250217 238668 145363
10030 145363 -205369 -20801 -79379 -171295 -153467 -371323 69246 -197937 -51509 -267258 -248379
10019 -248379 -96091 -34532 -130346 -66953 184355 -52995 -53369 -7420 154991 342769 108210
10007 163157 -2022 23043 70110 -190855 -172484 -154601 -153185 -18920 -92530 -130058 -307657
9996 -307657 -206964 130280 -232028 65506 -111361 87025 -13442 59117 166473 99379 102519
9985 102519 -225493 194257 35174 -240115 -52416 -195155 -282573 65765 160921 -66082 -299297
9974 -299297 -114005 -153077 -185782 -172919 -197038 -122444 15151 123891 -138274 -55239 -260177
9963b60177i3371A21958d6518R701j0829p1947E1523b32306D6441a51763a1024
9951a02282q0799A23093a33705E4679a93866h1184n3553o839c2882B18336e000
9939a41217A06211B3888O539N322B944a61256O0206l6786a2739k37654A29379
9927h2423o2642F9435K4883b24585F614J54904f2543j83758B23720n9488E8399
9915B50213E2628a32056N728a7571q3190j32092f042j36487E4133a56996f971
9903c2836A33648a96887M6103M6557d0056D8318j7754a15650I1256i4332K904
9892i1428G5849J21955b75598d535E8749L7931a2888j87720b3071j00274o0863
9881a84208N6472B12085a39189r7699a15591I3933b77940k2990i6558p124k92865
$$ plain form
9963 -260177 -93371 121958 -46518 -36817 -47646 -119593 51523 -232306 46441 -151763 -11024
9951 -102282 -183081 123093 -133705 54679 -193866 -81184 -134737 -141576 -32882 218336 -5000
9939 -141217 106211 23888 30427 35749 2944 -161256 -101050 -137836 -12739 -250393 129379
9927 -82423 -145065 69435 94318 -224585 6614 161518 -62543 -246301 223720 164232 58399
9915 250213 52628 -132056 -126328 -17571 -100761 -232853 -6042 -142529 54133 -156996 -6971
9903 -32836 133648 -196887 -150784 -104227 -40056 48318 30564 -115650 91256 -94332 -91428
9892 -91428 75849 197804 -275598 -4535 58749 96680 -12888 -200608 -23071 -123345 -184208
9881 -184208 -127736 212085 -139189 -236888 -115591 93933 -277940 -300930 -96558 -103682 -396547
9870c96547J83096m2567P5606q6215J22941d8455a1090k2404j20355g4226J2829
9859f1397b5118l843j13694B90192d21010K05022j06616i3792J1568B77951a23647
9847b8840A69224a94877F296g425A32657a91242d4273D323a69165P7105J832B8082
9834B32338B3803g746q6724d2061k44922L8900k850J972j47150a20991r5312h6300
9821E7908e8266J3812E1446a5550A23583d46198a11414p6722A21851b21645e5934
9809b22456j04300M4056c3750k21609g2627B7753b08118K4676g9910J1423A94296
9797a15601A30579B9712h7932B24047b22667k31814E0430b19844f0317l54237
9787d14554g9721F627a78972d5q4177a3866k24984b4901j04258C7932J24334c11514
$$ plain form
9870 -396547 -213451 -256018 -180412 -266627 -143686 -48455 -11090 -33494 -153849 -74226 -61397
9859 -61397 -25118 -28961 -142655 290192 -421010 -215988 -322604 -93792 -82224 277951 -123647
9847 -28840 169224 -194877 6296 -7425 132657 -191242 -44273 4323 -169165 -92060 -90228 28082
9834 232338 23803 -7746 -94470 -42061 -286983 -248083 -250933 -248961 -396111 -120991 -216303 -86300
9821 57908 -58266 -44454 51446 -15550 123583 -446198 -111414 -188136 121851 -221645 -55934
9809 -222456 -326756 -282700 -33750 -255359 -72627 27753 -208118 -183442 -79910 -68487 194296
9797 -115601 130579 29712 -87932 224047 -222667 -454481 50430 -219844 -60317 -414554
9787 -414554 -79721 6627 -178972 -45 -84222 -13866 -238850 -24901 -129159 37932 162266 -311514
9774b43198R1634j67711B06836h7722j0888A7411K78735b73540j76744A04355
9763c9744A95324G7572a39561B30313a71169h3096o2062A0518J49112l5521J29876
9752B53985A12204K5121a81056m0892d1842k92217o4790E8862K4471a44593j56047
9741c00640H1797c16923C7118b44522f671B5914g7999a2204E3548h370m1892B26972
9728e17163a42010B9304J40133J01184b2487j18322b1076D3710A52a68138D7656
9716D639a02722k8785F4109b80926Q814Q1378q8500J34721A89936K14696H5060
9704B05507b75240B7806J03563n9349J14206D1524K30328b35616a0671j39180
9694a49851g581G9705a4232A21736g8816l93791a46404j57470a24983k04088F4235
$$ plain form
9774 -243198 -151564 -319275 206836 -87722 -98610 17411 296146 -273540 -450284 104355
9763 -39744 195324 77572 -139561 230313 -171169 -83096 -145158 10518 159630 124109 253985
9752 253985 112204 137325 -181056 -221948 -41842 -334059 -398849 58862 83333 -144593 -300640
9741 -300640 81797 -316923 37118 -244522 -6671 25914 -77999 -12204 53548 -8370 -50262 226972
9728 -517163 -142010 29304 169437 270621 -22487 -140809 -21076 43710 152 -168138 47656
9716 4639 -102722 -131507 64109 -280926 -272112 -190734 -279234 -144513 189936 404632 85060
9704 205507 -275240 27806 131369 72020 186226 41524 271852 -235616 -10671 -149851
9694 -149851 -7581 79705 -14232 121736 -78816 -472607 -146404 -303874 -124983 -329071 64235
9682B84491A36842b80910g6951A37904f4434A94978e8788j99298F4370c57124
9671c43204N9722D5885M3595K16092b17605c1024j81262c4910l05025B9928j0507
9660A9421a54173A54875E7696a43663C4741M396J27288I529a12722M0357k95361
9649c67726a56417o837M7057E678b67752B1871b14772A34576a94445E3263P2859
9638A26122c2947A67095m9995P4714a3637B2484J1681b27822G5849a70857f6387
9626b3629o47077C3570e6330m7133N0913r3081e9671j09051e5765k25389D6599
9614a76636j06383A78896D5022a01174p356i216E5703i6723M0860A28308b31444
9602b5430l7345m6921B4657i6759q8980k0543A1650L8072J9565b62081P0245h3963
$$ plain form
9682 284491 136842 -280910 -76951 137904 -64434 194978 -58788 -258086 64370 -357124
9671 -343204 -283482 45885 89480 305572 -217605 -31024 -212286 -34910 -339935 29928 19421
9660 19421 -154173 154875 57696 -143663 34741 39137 166425 9529 -112722 -72365 -367726
9649 -367726 -156417 -163254 -116197 5678 -267752 21871 -214772 134576 -194445 53263 126122
9638 126122 -32947 167095 117100 191814 -13637 22484 34165 -227822 75849 -170857 -66387
9626 -23629 -670706 33570 -56330 -103463 -52550 -145631 -59671 -168722 -55765 -281154 46599
9614 -176636 -283019 178896 45022 -101174 -108530 -9216 55703 -96723 -55863 128308 -231444
9602 -25430 -62775 -109696 24657 -96759 -185739 -206282 11650 49722 69287 -262081 -191836 -83963
9589c4345A10618b40444h3877F632h4500l31437J92416K6297A50107a35662A12557
9577h7914r9389m9732J321A88002p5729b89118B41169J5026b66245J3633f8439
9565b98793A09987c58861b835j66916H4581l4667c29963d2466m0992A19165J7784
9554A36949M0951G341L100b25326a6023A99914J06370c9647j3137E4032a12140
9542A91313o989D4641h5987b187B17166b34042g9224c138m23187a53806C1415
9530b20984b8145m485i382j78225B7328b60723P3402j0916R4395j0734A7598c73148
9517a29842j28713A3301a49584B15628b89588B6770c18626A9802a49464a7466
9506b39507J03565N9593k48690a05708A33379a2847D1998a50340b9250j78737
$$ plain form
9589 -34345 110618 -240444 -83877 6632 -84500 -415937 -223521 -197224 150107 -135662 112557
9577 -87914 -187303 -237035 -235714 188002 112273 -289118 241169 256195 -266245 -252612 -68439
9565 -298793 109987 -358861 -2835 -169751 84581 49914 -329963 -42466 -83458 119165 136949
9554 136949 177900 7341 10441 -225326 -16023 199914 306284 -39647 -52784 54032 -112140
9542 191313 184324 44641 -85987 -2187 217166 -234042 -79224 -3138 -426325 -153806 31415
9530 -220984 -28145 -32630 -9382 -187607 27328 -260723 -187321 -198237 -103842 -114576 17598 -373148
9517 -129842 -258555 13301 -149584 215628 -289588 26770 -318626 19802 -149464 -17466
9506 -239507 -135942 -76349 -325039 -105708 133379 -12847 41998 -150340 -29250 -207987
9496b07987G4537g0670r3094e8573j54380l1044E8419b2038j78251i477I2689
9484A51387c77294a47418j44209o6077a38220C8713b87197k5003F08a36921o0447
9473a97368j0828j1770h3982H0102a00683E5242a28920G2171a0827k53608H0268
9461b79383E01805B01034m8117L8944E5870a33408k95437f7806k29024A18195
9450a79979l5290B94833A8201a64301e6958j6019j59186i5445l11362a56334k29647
9439c85981A94016J85995a85153N1689B50444a65185P5520L136J1639n3877G7416
9427b99081J08984k8701J09283K6744m7679K4898j89876I602a37426l2296m8425
9416b18147a373r7957r6707F0797d0175p0899j93207G5365Q1886a98762E4564
$$ plain form
9496 -207987 74537 -70670 -163764 -58573 -212953 -243997 58419 -22038 -200289 -9477 92689
9484 151387 -377294 -147418 -291627 -357704 -138220 38713 -287197 -312200 608 -136921 -197368
9473 -197368 -208196 -219966 -83982 80102 -100683 55242 -128920 72171 -10827 -264435 80268
9461 -279383 501805 201034 152917 191861 55870 -133408 -428845 -67806 -296830 118195
9450 -179979 -215269 294833 18201 -164301 -56958 -72977 -232163 -95445 -406807 -156334 -385981
9439 -385981 194016 380011 -185153 -133464 250444 -165185 -89665 -86529 -74890 -128767 77416
9427 -299081 -190097 -218798 -109515 -82771 -130450 -105552 -295428 9602 -137426 -169722 -218147
9416 -218147 -1373 -99330 -196037 60797 -40175 -111074 -304281 75365 157251 -198762 54564
9404a42225c4431k18506R7386r1234b5227n7759F5363d30085D9627a01529D47196
9392a79861G409d541j22349B04196B2420d0004D6036O6502a92267H4393e8918
9380g4073A5233R2608b74591K2913A83670I0225r11h4625B54149G1471b42762
9368e1486A27535B310c62272d8497B29952G7458a71121E3285a08059r9762j98572
9357d06393a0439j67354c0551j3949A2795g1379k94945a79552K2353D7591i3748
9345c257k46491h7527k05594a22408M7448A5888L19717a92502E5878b9307l23181
9334c52488a623j2544k60633G6290g62C2857a85367A40427b80201D15287A45317
9322a04016j98140e8538j8992q3797H8629a69332J048b2830k23428a10146C2385
$$ plain form
9404 -142225 -34431 -252937 -155551 -246785 -25227 -82986 65363 -430085 49627 -101529 447196
9392 -179861 7409 -4541 -126890 204196 22420 -40004 46036 112538 -192267 84393 -58918
9380 -74073 15233 107841 -274591 -251678 183670 90225 89314 -84625 254149 71471 -242762
9368 -51486 127535 2310 -362272 -48497 229952 77458 -171121 53285 -108059 -207821 -406393
9357 -406393 -10439 -177793 -30551 -44500 12795 -71379 -366324 -179552 -157199 47591 -93748
9345 -3257 -249748 -87527 -293121 -122408 -74960 15888 335605 -192502 55878 -29307 -352488
9334 -352488 -1623 -14167 -274800 76290 -762 32857 -185367 140427 -280201 415287 145317
9322 -104016 -302156 -58538 -77530 -161327 88629 -169332 -168284 -22830 -246258 -110146 32385
9310i7256l86225I9242N102b25588P3195P1632b1853A112d52829e5121j45795
9299b00916e34j36744A67172D2493f4099q9460j58822O9198B68432a2351o8170
9288h0521B4965b70291A43581h3499i162F8098b16484p2105e4089j65471a8597
9276a53597k81645J73394J03598A27812b18788a08067q6783L28c6337k15094F7546
9264a1810A36574i4521L828A85552a36690L375C974J18880m2262K91187g6729
9252c32812a65082E7649k8345L2198f1991A00260a26366A19172N1009p9041Q6980
9241A78120c39390a52240E533b00868A77927c2713A45666a05746R401j75490c8422
9229b38936a17476K1278D4230h8455n3620A81074a19636J2774K5673n59K9172
$$ plain form
9310 -97256 -483481 99242 104344 -225588 -152393 -80761 -21853 1112 -452829 -55121 -200916
9299 -200916 -534 -137278 167172 42493 -64099 -153559 -312381 -243183 268432 -12351 -80521
9288 -80521 24965 -270291 143581 -83499 -9162 68098 -216484 -288589 -54089 -219560 -18597
9276 -153597 -435242 -261848 -158250 127812 -218788 -108067 -194850 -194522 -36337 -251431 67546
9264 -11810 136574 -94521 -90693 185552 -136690 -133315 3974 122854 80592 371779 -76729
9252 -332812 -165082 57649 29304 61502 -61991 100260 -126366 119172 170181 91140 178120
9241 178120 -339390 -152240 5533 -200868 177927 -32713 145666 -105746 -96345 -271835 -38422
9229 -238936 -117476 -96198 44230 -88455 -142075 181074 -119636 -106862 -81189 -81748 -52576
9218e2576H9289a00707A04402D718a40306H0266a2889A38111b7618j33097I067
9206c81827B83430a27149j8010B13266e4579j66052A13942d7201A24787b51851
9195b55448i5976o6186B99740a91111e9671A07949b23547k8520N9673p1010O2101
9184b01303j9528Q3036m2526H7955a57640A52628a42690O7492n5317D1017b79675
9172A04402b95505B48878b5247j58929g7054A13502i5611b8974o7259j06684p7729
9161b80646o7125H5143a32292A8585h8292j92912A31753a13281A22201h1817p4936
9150a56753j06919h3329J6728k2354A49677g4649m780J904l60617J76483J5557
9139b46102J08007j50081h253E9684b78733a39087f5907b8514j41219j57241d7091
$$ plain form
9218 -52576 89289 -100707 104402 4718 -140306 80266 -12889 138111 -27618 -160715 9067
9206 -381827 283430 -127149 -145159 213266 -54579 -220631 113942 -47201 124787 -251851
9195 -255448 -95976 -162162 299740 -191111 -59671 107949 -223547 -252067 -192394 -263404 -201303
9184 -201303 -220831 -137795 -180321 87955 -157640 152628 -142690 -75198 -130515 41017 -279675
9172 104402 -295505 248878 -25247 -184176 -77054 113502 -95611 -28974 -96233 -202917 -280646
9161 -280646 -347771 85143 -132292 18585 -88292 -281204 131753 -113281 122201 -81817 -156753
9150 -156753 -263672 -83329 -66601 -88955 149677 -74649 -79429 -77525 -438142 -261659 -246102
9139 -246102 -138095 -288176 -8253 59684 -278733 -139087 -65907 -28514 -169733 -326974 -47091
9127e4656K3568k80921i5807A57319a65127C9150L0046a07605k9385A3632Q6574
9116A00206d13182B1789J47715G1747a23558B11778a62328H2813a57264k83297
9106d40561b7242k74839r5566A23119b83124E703K67967a78768B28b85738C5134
9094c15125a21467j17397A48628c69268c0195p1576B05123G4200b43567H2678
9083A48368b17820j35787F5457a27717D0481b95755o5043d4706j21845k8121H5846
9071I2376a34348A58143C8235a62689p2732C6293K7565a22942J5109C54075a07257
9059a45001A41541C5570m134c5867k62152i4076k426I3715a50614o447l1461B52745
9046C50029j07458j2065a37991A75629d24676B16541I1677b34121i6726I9101
$$ plain form
9127 -54656 -31088 -312009 -95807 157319 -165127 39150 69196 -107605 -136990 13632 100206
9116 100206 -413182 21789 169504 71747 -123558 211778 -162328 82813 -157264 -440561
9106 -440561 -27242 -302081 -397647 123119 -283124 5703 273670 -178768 228 -285738 35134
9094 -315125 -121467 -238864 148628 -369268 -30195 -101771 205123 74200 -243567 82678
9083 148368 -217820 -353607 65457 -127717 40481 -295755 -360798 -44706 -166551 -194672 85846
9071 92376 -134348 158143 38235 -162689 -235421 36293 63858 -122942 -107833 354075 -107257
9059 -145001 141541 35570 31436 -35867 -298019 -94076 -96502 93715 -150614 -157061 -188522 252745
9046 350029 242571 230506 -137991 175629 -424676 216541 91677 -234121 -96726 99101
9035b30006A73905q2884C2501d99686G8949b45960R1878G9782J74147q6131b28037
9023b06276Q8498A8987a27157e9872k702C7208b33782r444e6509o5766j260m1763
9011a65298O2823d6974l83742i1661n0998I1533d2908j09392e5777k67376F0495
8999a04984H7052b75841d5712j15754a2239C8360O9963f2685q4931k4390e9807
8987A33730a28907J7965B01948a2563q09108b45645A61519P0739a16533D1958
8976i30j12119D9448L80109B2782b47643J18610l10842a28068B62042a14199j58569
8965b72768a11651A161a33849g376o5018c256j475k85162k0652i9631A80603B6321
8952B66537c5034n6705A38687e5450A41505J01598b00658j77153g6042j92510
$$ plain form
9035 -230006 173905 91021 32501 -499686 78949 -245960 -154082 79782 253929 167798 -228037
9023 -206276 -117778 18987 -127157 -59872 -62574 37208 -233782 -243226 -56509 -122275 -123535 -165298
9011 -165298 -102475 -46974 -430716 -91661 -142659 91533 -42908 -152300 -55777 -323153 60495
8999 -104984 87052 -275841 -45712 -161466 -12239 38360 108323 -62685 -147616 -172006 -59807
8987 133730 -128907 -110942 201948 -12563 -821671 -245645 161519 232258 -116533 41958
8976 -930 -113049 49448 429557 22782 -247643 -129033 -439875 -128068 262042 -114199 -272768
8965 -272768 -111651 1161 -133849 -7376 -72394 -3256 -4731 -289893 -310545 -99631 180603 26321
8952 266537 -35034 -91739 138687 -55450 141505 243103 -200658 -377811 -76042 -268552
8942b68552D4450a30168B29221i6471A32505a95216L0570C83753k960e4606j13973
8931a68579N9045a7418H3315K9290J2240K37657J1594K49354J822157O105695
8921H551302O71318B865010A017135m31134B32069l7904J02117C2421h8241k8805
8911a17046H5802L1616M9966J70228a43132o3529K7482N5039e6827j82276c1287
8899a39073d0189k581A75566G2705b83800a37396N4177E2079a72747a8093j2734
8888c0827j84071M8030C08075K7622a5852n71565b80397B03081o2801l4405D0716
$$ plain form
8942 -268552 44450 -130168 229221 -96471 132505 -195216 -164646 383753 380793 -54606 -168579
8931 -168579 -109534 -17418 83315 112605 124845 362502 374096 623450 2445607 8551302
8921 8551302 9222620 2865010 1017135 586001 232069 194165 296282 32421 -88241 -117046
8911 -117046 85802 117418 167384 337612 -143132 -206661 -179179 -124140 -56827 -239103 -31287
8899 -139073 -40189 -42770 175566 72705 -283800 -137396 -83219 52079 -172747 -18093 -30827
8888 -30827 -214898 -166868 308075 335697 -15852 -587417 -280397 203081 140280 105875 40716
$$ [...]
##END NTUPLES=NMR SPECTRUM
##END=
