##TITLE=AC1703_ROEFFECT0028_8638083_HofIGIQ86H
##JCAMPDX= 6.0         $$ Bruker NMR JCAMP-DX V2.0
##DATA TYPE= NMR SPECTRUM
##DATA CLASS= NTUPLES
##ORIGIN= BRUKER
##OWNER= Administrator
$$ 1.72 TOPSPIN		Version 2.1
$$ 2014-05-23 03:27:21.100 -0700  Administrator@X
$$ Compression mode = diff/dup
##.OBSERVE FREQUENCY= 400.02188249412
##.OBSERVE NUCLEUS= ^1H
##.ACQUISITION MODE= SIMULTANEOUS (DQD)
##.ACQUISITION SCHEME= undefined
##.AVERAGES= 64
##.DIGITISER RES= 22
##SPECTROMETER/DATA SYSTEM= spect
##.PULSE SEQUENCE= noesygpps1d.comp
##.SOLVENT NAME= COFFEE_meoh
##.SHIFT REFERENCE= INTERNAL, COFFEE_meoh, 1, 14.96087
##AUDIT TRAIL= $$ (NUMBER, WHEN, WHO, WHERE, PROCESS, VERSION, WHAT)
$$ ##TITLE= Audit trail, TOPSPIN		Version 2.1
$$ ##JCAMPDX= 5.01
$$ ##ORIGIN= Bruker BioSpin GmbH
$$ ##OWNER= Administrator
$$ $$ E:\/data/COFFEE/nmr/AC1703_ROEFFECT0028_8638083_HofIGIQ86H/12/pdata/1/auditp.txt
$$ ##AUDIT TRAIL=  $$ (NUMBER, WHEN, WHO, WHERE, PROCESS, VERSION, WHAT)
(   1,<2014-05-23 03:27:16.163 -0700>,<Administrator>,<X>,<go>,<TOPSPIN 2.1>,
      <created by zg
	started at 2014-05-23 03:15:46.709 -0700,
	POWCHK enabled, PULCHK disabled,
       configuration hash MD5:
       C8 4E 4E 5D D3 5C D8 9E 9F 52 82 E0 59 8A DE 15
       data hash MD5: 64K
       62 4A 08 F1 04 D6 96 74 BA F3 91 1D 93 E2 E4 D9>)
(   2,<2014-05-23 03:27:19.178 -0700>,<Administrator>,<X>,<proc1d>,<TOPSPIN 2.1>,
      <Start of raw data processing
       efp LB = 0.3 FT_mod = 6 PKNL = 1 PHC0 = 0 PHC1 = 0 SI = 128K 
       data hash MD5: 128K
       86 BB 06 C8 AE 39 6F E9 72 C1 0B 0B 7D A9 D3 E5>)
(   3,<2014-05-23 03:27:20.100 -0700>,<Administrator>,<X>,<proc1d>,<TOPSPIN 2.1>,
      <pk PHC0 = -84.2157 PHC1 = 0 
       data hash MD5: 128K
       A8 6F 4A AC D7 4A E7 03 DA 8D CA 1B 00 F6 A7 E7>)
(   4,<2014-05-23 03:27:20.491 -0700>,<Administrator>,<X>,<proc1d>,<TOPSPIN 2.1>,
      <abs ABSG = 1 
       data hash MD5: 128K
       1C 96 13 2D B3 9F 6A 40 89 38 8F 52 55 6A 0E 04>)
(   5,<2014-05-23 03:27:20.616 -0700>,<Administrator>,<X>,<proc1d>,<TOPSPIN 2.1>,
      <abs ABSG = 2 
       data hash MD5: 128K
       94 83 69 22 D6 FF AF 39 B8 06 56 75 DB 08 74 84>)
(   6,<2014-05-23 03:27:20.709 -0700>,<Administrator>,<X>,<proc1d>,<TOPSPIN 2.1>,
      <abs ABSG = 3 
       data hash MD5: 128K
       89 44 C3 B7 BA 47 69 1D 12 1C A8 48 86 D4 FD 88>)
(   7,<2014-05-23 03:27:20.788 -0700>,<Administrator>,<X>,<proc1d>,<TOPSPIN 2.1>,
      <abs ABSG = 4 
       data hash MD5: 128K
       A6 66 92 DA 53 73 40 4C 59 06 0C BA 98 B2 4D B6>)
(   8,<2014-05-23 03:27:20.881 -0700>,<Administrator>,<X>,<proc1d>,<TOPSPIN 2.1>,
      <abs ABSG = 5 
       data hash MD5: 128K
       67 B8 39 69 F4 B1 65 FE DE 08 53 B4 58 94 D1 B4>)
$$ ##END=
$$ 
$$ $$ hash MD5
$$ $$ AA 79 5F 1D BC 52 B4 A7 DC BC 45 13 47 CC 3E 44
##$RELAX= 
##$RELAX= 
##$RELAX= 
##$RELAX= 
##$RELAX= 
##$RELAX= 
##$RELAX= 
##$RELAX= 
$$ Bruker specific parameters
$$ --------------------------
##$DU= <E:\>
##$EXPNO= 12
$$ [...]
##$TP07= 0
##$TPNAME0= <>
##$TPNAME1= <>
##$TPNAME2= <>
##$TPNAME3= <>
##$TPNAME4= <>
##$TPNAME5= <>
##$TPNAME6= <>
##$TPNAME7= <>
##$TPOAL= (0..7)
0.5 0.5 0.5 0.5 0.5 0.5 0.5 0.5
##$TPOFFS= (0..7)
0 0 0 0 0 0 0 0
##$TUNHIN= 0
##$TUNHOUT= 0
##$TUNXOUT= 0
##$USERA1= <user>
##$USERA2= <user>
##$USERA3= <user>
##$USERA4= <user>
##$USERA5= <user>
##$V9= 5
##$VALIST= <valist>
##$VCLIST= <CCCCCCCCCCCCCCC>
##$VD= 0
##$VDLIST= <DDDDDDDDDDDDDDD>
##$VPLIST= <PPPPPPPPPPPPPPP>
##$VTLIST= <TTTTTTTTTTTTTTT>
##$WBST= 2048
##$WBSW= 25
##$XGAIN= (0..3)
0 0 0 0
##$XL= 0
##$YL= 0
##$YMAX_a= 7198073
##$YMIN_a= -15511979
##$ZGOPTNS= <>
##$ZL1= 120
##$ZL2= 120
##$ZL3= 120
##$ZL4= 120
##$ABSF1= 14.96087
##$ABSF2= -5.597312
##$ABSG= 5
##$ABSL= 3
##$ALPHA= 0
##$AQORDER= 0
##$ASSFAC= 0
##$ASSFACI= 0
##$ASSFACX= 0
##$ASSWID= 0
##$AUNMP= <proc_prof1d_extract.lims>
##$AXLEFT= 0
##$AXNAME= <>
##$AXNUC= <1H>
##$AXRIGHT= 0
##$AXTYPE= 0
##$AXUNIT= <>
##$AZFE= 0.1
##$AZFW= 0.1
##$BCFW= 0
##$BC_mod= 0
##$BYTORDP= 0
##$COROFFS= 0
##$CY= 15
##$DATMOD= 1
##$DC= 0
##$DFILT= <>
##$DTYPP= 0
##$F1P= 0
##$F2P= 0
##$FCOR= 0.5
##$FTSIZE= 131072
##$FT_mod= 6
##$GAMMA= 0
##$GB= 0
##$INTBC= 1
##$INTSCL= 1
##$ISEN= 128
##$LB= 0.3
##$LEV0= 0
##$LPBIN= 0
##$MAXI= 10000
##$MC2= 0
##$MEAN= 0
##$ME_mod= 0
##$MI= 0
##$NCOEF= 0
##$NC_proc= -2
##$NLEV= 6
##$NOISF1= 0
##$NOISF2= 0
##$NSP= 0
##$NTH_PI= 0
##$NZP= 0
##$OFFSET= 14.96087
##$PC= 1
##$PHC0= -84.2157
##$PHC1= 0
##$PH_mod= 1
##$PKNL= yes
##$PPARMOD= 0
##$PPDIAG= 0
##$PPIPTYP= 0
##$PPMPNUM= 2147483647
##$PPRESOL= 1
##$PSCAL= 4
##$PSIGN= 0
##$PYNMP= <proc.py>
##$REVERSE= no
##$SF= 400.020009687221
##$SI= 131072
##$SIGF1= 0
##$SIGF2= 0
##$SINO= 400
##$SIOLD= 131072
##$SPECTYP= <>
##$SREGLST= <1H.CDCl3>
##$SSB= 0
##$STSI= 131072
##$STSR= 0
##$SW_p= 8223.68421052631
##$SYMM= 0
##$S_DEV= 0
##$TDeff= 65536
##$TDoff= 0
##$TI= <>
##$TILT= no
##$TM1= 0
##$TM2= 0
##$TOPLEV= 0
##$USERP1= <user>
##$USERP2= <user>
##$USERP3= <user>
##$USERP4= <user>
##$USERP5= <user>
##$WDW= 1
##$XDIM= 131072
##$YMAX_p= 423435930
##$YMIN_p= -14040
##$CURPLOT= <Network HP LaserJet P1505>
##$CURPRIN= <$Network HP LaserJet P1505>
##$DFORMAT= <normdp>
##$LAYOUT= <+/1D_H.xwp>
##$LFORMAT= <normlp>
##$PFORMAT= <normpl>
##$SURQMSG= 1
$$ End of Bruker specific parameters
$$ ---------------------------------
##NTUPLES= NMR SPECTRUM
##VAR_NAME=  FREQUENCY,     SPECTRUM/REAL,   SPECTRUM/IMAG
##SYMBOL=    X,             R,               I
##VAR_TYPE=  INDEPENDENT,   DEPENDENT,       DEPENDENT
##VAR_FORM=  AFFN,          ASDF,            ASDF
##VAR_DIM=   131072,        131072,          131072
##UNITS=     HZ,            ARBITRARY UNITS, ARBITRARY UNITS
##FACTOR=    0.0627417313425164, 1,          1
##FIRST=     8223.62146879497, 695,          -74905
##LAST=      0,             3049,            -75800
##MIN=       0,             -14040,          0
##MAX=       8223.62146879497, 423435930,    0
$$ Real data points
##PAGE= N=1
##DATA TABLE= (X++(R..R)), XYDATA
$$ [...]
63795C94104m426m720n225n802o121n962n478n089m968m811m180l146k322k101
63781C29753k123j798j206j022j505k078k054j523j155j355j877k179j979j410
63767C06489q14m59m77r28j688k285k187j451p67n46l75K27R27J082Q56R43J336
63750B99883J244L74o12j088j145r01o7J285K278K280J847J901K450K832K816
63735C15377K716K644K454K316K614L199L453L235L185L884N053N904N992N522
63721C67548N014M830N008N387N760N908N626M937M079L112J663n13k832m300
63707D11227m633m381l931l143k168j693j849j707o15N80O67n0oJ535L618M898
63691C98349N010M408L579K807K260J945J697J386R71M08k74q36j116j291j581
$$ plain form
63795 394104 389678 384958 379733 373931 367810 361848 356370 351281 346313 341502 337322 334176 331854 329753
63781 329753 327630 325832 324626 323604 322099 320021 317967 316444 315289 313934 312057 309878 307899 306489
63767 306489 305675 305216 304739 303811 302123 299838 297651 296200 295433 294887 294512 294739 295666 296748 297604 298547 299883
63750 299883 301127 301501 300889 299801 298656 297755 297688 298973 301251 303531 305378 307279 309729 312561 315377
63735 315377 318093 320737 323191 325507 328121 331320 334773 338008 341193 345077 350130 356034 362026 367548
63721 367548 372562 377392 382400 387787 393547 399455 405081 410018 414097 417209 418872 418359 415527 411227
63707 411227 406594 402213 398282 395139 392971 391278 389429 387722 387107 387687 388354 388304 388298 389833 393451 398349
63691 398349 403359 407767 411346 414153 416413 418358 420055 421441 422412 422820 422546 421710 420594 419303 417722
63676D17722j769j408m46P00J669K351K665K625K631L204M216M789M218K745J251
63661D47163L49r2o71j776l177m259m754n011n417n854n980n791n476m906l835
63646C90513k511j541j033m32O97K125L391M337N030N529N970O569P250P565P266
63631D40725O743O587O896P250P295P021O499N735M889M453M912O216P721Q806
63617E31748R433J0069J1121J2604J4348J6279J8430K0820K3456K6314K9221L1875
63605G55718L4056L5669L6529L6326L4843L1939K7306K0719J2824N225o68m726
63593A025760p649r740j0668j0325r328q565q684j0052j2744j6327j9967k3001
63581H78710k5229k6622k7036k6371k4782k2571j9992j7296j4786j2610j0569
$$ plain form
63676 417722 415953 414545 414099 414799 416468 418819 421484 424109 426740 429944 434160 438949 443167 445912 447163
63661 447163 447512 447420 446749 444973 441796 437537 432783 427772 422355 416501 410521 404730 399254 394348 390513
63646 390513 388002 386461 385428 384996 385693 387818 391209 395546 400576 406105 412075 418644 425894 433459 440725
63631 440725 447468 454055 460951 468201 475496 482517 489016 494751 499640 504093 509005 515221 522942 531748
63617 531748 541181 551250 562371 574975 589323 605602 624032 644852 668308 694622 723843 755718
63605 755718 789774 825443 861972 898298 933141 965080 992386 1013105 1025929 1031154 1030486 1025760
63593 1025760 1018111 1008371 997703 987378 978050 969485 960801 950749 938005 921678 901711 878710
63581 878710 853481 826859 799823 773452 748670 726099 706107 688811 674025 661415 650846
63570F50846q263n485k481J64J906K564K354J690J109J240K461M359N865O243
63556F64572N869N771O542Q039J0044J2689J6098K0049K4375K9395L5496M2379
63544H81318M9195N5511O1460O6312O7295O0990M6522K7004P482q278j8903k4410
63532A271498k5420k3242j9600j5820j2654j0843j1034j3020j5945j9486k4022
63521A080412k9376l4287l7679l9625m0488l9958l7767l4631l1551k8677k5701
63510G00672k2867k0682j8943j7016j4875j2957j1291r646q400q224q916r446
63498E37409r267q765q358p902p148o167n177m404m054l869l065j371J84M54j22
63483D68378k3J242K694L541M039M494M658M576M846N504N763N333M993N119M793
$$ plain form
63570 650846 642583 637098 634617 634781 636687 639251 641605 643295 644404 645644 648105 652464 658329 664572
63556 664572 670441 676212 682754 690793 700837 713526 729624 749673 774048 803443 838939 881318
63544 881318 930513 986024 1047484 1113796 1181091 1242081 1288603 1315607 1323089 1314811 1295908 1271498
63532 1271498 1246078 1222836 1203236 1187416 1174762 1163919 1152885 1139865 1123920 1104434 1080412
63521 1080412 1051036 1016749 979070 939445 898957 858999 821232 786601 755050 726373 700672
63510 700672 677805 657123 638180 621164 606289 593332 582041 572395 563995 555771 546855 537409
63498 537409 528142 519377 511019 503117 495969 489802 484625 480221 476167 472298 469233 467862 468046 468500 468378
63483 468378 468355 469597 472291 475832 479871 484365 489023 493599 498445 503949 509712 515045 520038 525157 529950
63468E29950L195R33q83k067k916l160k542j700j359j046J22J747K494J994J173
63453E25935P17L86rj18J23K09R3O32K360M485N735N846N611N834O772Q435J0853
63436E83899J4020J7857K2360K7787L4675M3387N3002O0569O2251N6033M3415
63425A019255K8188J3755J761p277j3016j5200j3873r374k418N771J3841K1156
63413A042569K7893L3953L8240L9431L7175L1972K4269J4579M394m037r358j2038
63401A269042j3244j3469j2727j1606j1252j2467j5260j9244k3914k8602l2701
63390A074556l5999l8545m0164m0492l9373l7032l3927l0690k7940k5751k3413
63379G01230k0269j6599j3203j0249p191l813p24J407K578L229L798M719O420
$$ plain form
63468 529950 533145 534078 533195 531128 528212 525052 522510 520810 519451 518405 518527 520274 522768 524762 525935
63453 525935 526652 527038 527029 526911 527034 527243 527336 527968 530328 534813 540548 546394 552005 557839 564611 573046 583899
63436 583899 597919 615776 638136 665923 700598 743985 796987 857556 919807 975840 1019255
63425 1019255 1047443 1061198 1062959 1055682 1042666 1027466 1013593 1004219 1001801 1007572 1021413 1042569
63413 1042569 1070462 1104415 1142655 1182086 1219261 1251233 1275502 1290081 1294475 1290438 1281080 1269042
63401 1269042 1255798 1242329 1229602 1217996 1206744 1194277 1179017 1159773 1135859 1107257 1074556
63390 1074556 1038557 1000012 959848 919356 879983 842951 809024 778334 750394 724643 701230
63379 701230 680961 664362 651159 640910 633719 629906 629182 630589 633167 636396 640194 644913 651333
63366F51333Q882J1514J3725J5495J7190J9082K1272K3948K7398L1739L6607M1210
63354I19395M4810M7266M8931M9895M9534M7044M2151L5126K6426J6748P157j323
63342A333160q139j2913j5161j4913j3300j1849j1260j1481j2647j5215j9188
63331A187094k3980k9020l3778l7346l8913l8618l7139l4575l0688k6096k1932
63320H35009j8091j3080o097J709Q274J1773J0478L292q427k0659k9663l4562
63308G39956l6370l5674l2573k8015k3500j9647j6222j3344j1431j0161q719p128
63296D97172o203o113o000n258m320l858l912m125m190l874l174k587k732l490
63282D37336m061l953l425k848k229j637j467j887k369k214j352k91N72J291K004
$$ plain form
63366 651333 660215 671729 685454 700949 718139 737221 758493 782441 809839 841578 878185 919395
63354 919395 964205 1011471 1060402 1110297 1159831 1206875 1249026 1284152 1310578 1327326 1334483 1333160
63342 1333160 1325021 1312108 1296947 1282034 1268734 1256885 1245625 1234144 1221497 1206282 1187094
63331 1187094 1163114 1134094 1100316 1062970 1024057 985439 948300 913725 883037 856941 835009
63320 835009 816918 803838 797741 799450 807724 819497 829975 833267 824840 804181 774518 739956
63308 739956 703586 667912 635339 607324 583824 564177 547955 534611 523180 513019 504300 497172
63296 497172 490969 484856 478856 473598 469278 465420 461508 457383 453193 449319 446145 443558 440826 437336
63282 437336 433275 429322 425897 423049 420820 419183 417716 415829 413460 411246 409894 409603 410175 411466 413470
63267D13470K555K644K273J865J827K184K761L507M245M407L720L010L517N162
63253D57147O435O385N837N978O621O815O493O409O734O914O745O667O901P248
63239E49329P779Q941J0795J2845J4702J6293J7457J8032J8480J9606K1482K3281
63227G39022K4325K4701K4684K4252K3482K2716K2147K1684K1510K2104K3451
63216I94078K4753K5363K5443K5392K5052K3880K1669J8697J5295J1477O867J050
63204A219016n705j2231j7440k1467k5202k8733l1031l1377l0322k8742k6649
63193I60117k3492j9236j4603j0427p045m057n82L871Q705J2921J6605K0849K5899
63180I69525L0340L2750L3439L3731L4212L4567L4577L4216L3124L1068K8788
$$ plain form
63267 413470 416025 418669 420942 422807 424634 426818 429579 433086 437331 441738 445458 448468 451985 457147
63253 457147 463582 469967 475804 481782 488403 495218 501711 508120 514854 521768 528513 535180 542081 549329
63239 549329 557108 566049 576844 589689 604391 620684 638141 656173 674653 694259 715741 739022
63227 739022 763347 788048 812732 836984 860466 883182 905329 927013 948523 970627 994078
63216 994078 1018831 1044194 1069637 1095029 1120081 1143961 1165630 1184327 1199622 1211099 1217966 1219016
63204 1219016 1213311 1201080 1183640 1162173 1136971 1108238 1077207 1045830 1015508 986766 960117
63193 960117 936625 917389 902786 892359 885314 881257 880675 884546 893251 906172 922777 943626 969525
63180 969525 999865 1032615 1066054 1099785 1133997 1168564 1203141 1237357 1270481 1301549 1330337
63169A330337K7191K5922K3849K0944J8355J6328J3443Q619K605l427r799j7488
63157A456879k6072l3930m0325m5873n0773n3877n4191n2377m9973m7644m4979
63146I56865m1608l7787l3949l0348k7124k4259k1402j8221j5037j2695j1581
63135F82854j1074j0177q527o605n112m301l857l340k717k361k386k238j256M42
63121F19345K050L003L402L434K962K017J213J203J894K622K899K718K274J849
63107F52885J834K399L079L078K152R29J89K5n8l09k68P13K553M340N268N503
63091F84312N883O853Q038Q760Q559P211M725J600j304l448m912n897o270n871
63077G08239m856l385j374J065L258M552N042N338N802O426P271Q493J0006J1561
$$ plain form
63169 1330337 1357528 1383450 1407299 1428243 1446598 1462926 1476369 1484988 1487593 1484166 1474367 1456879
63157 1456879 1430807 1396877 1356552 1310679 1259906 1206029 1151838 1099461 1049488 1001844 956865
63146 956865 915257 877470 843521 813173 786049 761790 740388 722167 707130 694435 682854
63135 682854 671780 661603 653076 646471 641359 637058 633201 629861 627144 624783 622397 620159 618903 619345
63121 619345 621395 624398 627800 631234 634196 636213 637426 638629 640523 643145 646044 648762 651036 652885
63107 652885 654719 657118 660197 663275 665427 666356 666545 666570 666512 666203 665935 666648 669201 673541 678809 684312
63091 684312 690195 697048 705086 713846 722405 729616 734341 735941 734637 731189 726277 720380 714110 708239
63077 708239 703383 699998 698624 699689 702947 707499 712541 717879 723681 730107 737378 745871 755877 767438
63063G67438J3132J4818J6496J7931J9275K0980K3281K6014K8950L1934L4794
63052A015043L7463M0225M3516M7378N1345N4852N7638N9788O1537O2927O3550
63041A595262O2931O1259N9447N8200N7412N6821N6702N7410N8589N9524N9918
63030B243475N9613N7858N3714M7096L8700K8922J7643N089p939k0836l3465m5533
63018B444337n6273o5021p1443p5113p5620p3386o9641o5150n9539n2180m3233
63007A737738l3441k3363j3277l415O094J5221K3693L1025L7117M2374M7018N0773
62995A917557N3460N5367N6624N6863N6026N4994N4718N5063N5126N4447N3229
62984B523474N1536M8900M4751L8701L0426J9845P414o048j9976l4127m8185o1710
$$ plain form
63063 767438 780570 795388 811884 829815 849090 870070 893351 919365 948315 980249 1015043
63052 1015043 1052506 1092731 1136247 1183625 1234970 1289822 1347460 1407248 1468785 1531712 1595262
63041 1595262 1658193 1719452 1778899 1837099 1894511 1951332 2008034 2065444 2124033 2183557 2243475
63030 2243475 2303088 2360946 2414660 2461756 2500456 2529378 2547021 2552110 2544171 2523335 2489870 2444337
63018 2444337 2388064 2323043 2251600 2176487 2100867 2027481 1957840 1892690 1833151 1780971 1737738
63007 1737738 1704297 1680934 1667657 1664242 1670336 1685557 1709250 1740275 1777392 1819766 1866784 1917557
62995 1917557 1971017 2026384 2083008 2139871 2195897 2250891 2305609 2360672 2415798 2470245 2523474
62984 2523474 2575010 2623910 2668661 2707362 2737788 2757633 2765047 2758999 2739023 2704896 2656711 2595001
62972B595001p4392q5814r4986j00756j02964j02697j00988r7774r2616q6143
62962A655871p9935p4896p0398o5374n9778n4468m9955m5918m2002l8433l5564
62951A039150l3242l1033k8884k7139k5969k5066k3920k2266k0306j8570j7377
62940G65378j6430j5141j3420j1836j0795r963q864p622o726o286n991n581m985
62927F41738m154l169k367j957j752j636j941k847l767l935l451l040k952k797
62913F01973k341j740j071k73M72R75J406J819J536N2j693k171j445j159k005
62898E94335k631j763j67N12Po70r72j268j785k123j960j591j557k008k507k342
62882E71510j191M41J763K610L364L988L884K871J584N40m47j533k304k503k551
$$ plain form
62972 2595001 2520609 2434795 2339809 2239053 2136089 2033392 1932404 1834630 1742014 1655871
62962 1655871 1575936 1501040 1430642 1365268 1305490 1251022 1201067 1155149 1113147 1074714 1039150
62951 1039150 1005908 974875 945991 918852 892883 867817 843897 821631 801325 782755 765378
62940 765378 748948 733807 720387 708551 697756 687793 678929 671307 664581 658295 652304 646723 641738
62927 641738 637584 634415 632048 630091 628339 626703 624762 621915 618148 614213 610762 607722 604770 601973
62913 601973 599632 597892 596821 596548 597020 597995 599401 601220 602756 602808 601115 598944 597499 596340 594335
62898 594335 591704 589941 589774 590286 590293 589623 588651 587383 585598 583475 581515 579924 578367 576359 573852 571510
62882 571510 570319 570760 572523 575133 578497 582485 586369 589240 590824 591364 590917 589384 587080 584577 582026
62867E82026k752k725k309k223k944l606l010j320J81P96Q49P16M43K55M76Q93
62851E65746R23N61M27Q79J657K409K944K969K290J275N97M18L76L50N89J106
62835E85516J552J760J885J937J782J621J833K313K567K586K910L634M127L980
62821F20003L632L609L735L552L092K681K317J785J183Q97J068J487J957K459
62807F53457K934L186L185L275L917N078O061O211N802N914P144Q792R687R691
62793G34334R790J0770J2354J3860J5239J7064J9798K3337K7231L1091L4894L9009
62781I88771M3845M9385N5184O0907O6683P2722P8739Q4040Q8252R1643R4573
62770A774744R6645R6721R3884Q8248Q0631P1429O0142M6130K9803J2713l566
$$ plain form
62867 582026 579274 576549 574240 572017 569073 565467 562457 561137 561318 562114 562963 563679 564122 564377 564853 565746
62851 565746 566669 567230 567657 568536 570193 572602 575546 578515 580805 582080 582677 583095 583471 583821 584410 585516
62835 585516 587068 588828 590713 592650 594432 596053 597886 600199 602766 605352 608262 611896 616023 620003
62821 620003 623635 627244 630979 634531 637623 640304 642621 644406 645589 646486 647554 649041 650998 653457
62807 653457 656391 659577 662762 666037 669954 675032 681093 687304 693106 699020 706164 714956 724643 734334
62793 734334 744124 754894 767248 781108 796347 813411 833209 856546 883777 914868 949762 988771
62781 988771 1032616 1082001 1137185 1198092 1264775 1337497 1416236 1500276 1588528 1680171 1774744
62770 1774744 1871389 1968110 2061994 2150242 2230873 2302302 2362444 2408574 2438377 2451090 2447524
62759B447524j8647l3240m7837o1729p3528q2486q8866r3027r4857r4441r2600
62748A666266r0043q6483q1425p5477o9822o4588n8894n2633m6973m2576l8578
62737I58774l4050k9484k5894k3223k0699j8192j6115j4359j2382j0183q227o519
62725G39447m708k977j868j198q4J740L511M595N343O411P889R477J1042J2678
62711G91298J4534J6860J9832K3172K6354K9328L2704L6966M1895M6984N2121
62700A132048N7531O3315O9292P5209Q0952Q6689R2847R9708J06912J13411J17992
62689B095906J19801J18486J14061J06676R6317Q2736O5813M5933K3962J032k1595
62678B849128m2723o1709p8584r3418j05674j14480j19339j20369j18131j13693
$$ plain form
62759 2447524 2428877 2395637 2347800 2286071 2212543 2130057 2041191 1948164 1853307 1758866 1666266
62748 1666266 1576223 1489740 1408315 1332838 1263016 1198428 1139534 1086901 1039928 997352 958774
62737 958774 924724 895240 869346 846123 825424 807232 791117 776758 764376 754193 745966 739447
62725 739447 734739 731762 729894 728696 728612 730352 733863 738458 743801 750212 758101 767578 778620 791298
62711 791298 805832 822692 842524 865696 892050 921378 954082 991048 1032943 1079927 1132048
62700 1132048 1189579 1252894 1322186 1397395 1478347 1565036 1657883 1757591 1864503 1977914 2095906
62689 2095906 2215707 2334193 2448254 2554930 2651247 2733983 2799796 2845729 2869691 2870723 2849128
62678 2849128 2806405 2744696 2666112 2572694 2467020 2352540 2233201 2112832 1994701 1881008
62668A881008j08470j03434r8431r2739q6193p9325p2608o6172o0148n4672m9485
62657A009331m4148l8867l4411l1055k8065k4670k1069j8132j6293j5200j4304
62646G23117j3441j2770j2320j1768j0739r244p715o490n489m422l143j646MJ504
62632F25438K334K179J261K9j270k492l424l952m181m134l622k716j902j486j187
62617F00875o84j23L27Q81J612K033J888J852K690M109N282O089O917P597P655
62602F49000P533Q355J0384J2693J4618J6625J9388K2778K6155K9178L1998L5042
62590H83747L8644M2560M5916M8052M9084M9176M7744M4223L9187L3573K7102
62579A349008J8813R082l40q466j5869k3063k9476l4594l8763m2204m4313m4767
$$ plain form
62668 1881008 1772538 1669104 1570673 1477934 1391741 1312416 1239808 1173636 1113488 1058816 1009331
62657 1009331 965183 926316 891905 860850 832785 808115 787046 768914 752621 737421 723117
62646 723117 709676 696906 684586 672818 662079 652835 645120 638630 633141 628719 625576 623930 623934 625438
62632 625438 627772 629951 631212 631241 629971 627479 624055 620103 615922 611788 608166 605450 603548 602062 600875
62617 600875 600191 600068 600395 601276 602888 604921 606809 608661 611351 615460 620742 626831 633748 641345 649000
62602 649000 656533 664888 675272 687965 702583 719208 738596 761374 787529 816707 848705 883747
62590 883747 922391 964951 1010867 1058919 1108003 1157179 1204923 1249146 1288333 1321906 1349008
62579 1349008 1367821 1376903 1376563 1368097 1352228 1329165 1299689 1265095 1226332 1184128 1139815 1095048
62567A095048m4309m3596m2248l9768l6654l3699l0971k8219k5606k3261k0774
62556G25943j7918j5233j3200j1561j0068r115q813q295o944n481m829m599l890
62543F05997k853k176j581k58J505K583K764K858L087K733J633O88N55R22J518
62528F19975K710M615O521P857Q951J0291J1766J3235J5188J8115K1703K5360
62516G66287K9131L3401L8020M2398M6395N0382N4531N8646O2750O7079P1101
62505A320121P3205P1987O7711O1813N5085M6961L6809K5201J3417K114q732j8768
62493A746924k6919l2318l5008l5507l4148l1130k6803k1561j5615r068k018N483
62481A482312J3239K0673K7156L2569L6926L9244L7620L1096K1113J0584J573
$$ plain form
62567 1095048 1050739 1007143 964895 925127 888473 854774 823803 795584 769978 746717 725943
62556 725943 708025 692792 679592 668031 657963 648848 640035 631740 624796 619315 614486 609887 605997
62543 605997 603144 600968 599387 599129 600634 603217 605981 608839 611926 614659 616292 616980 617535 618457 619975
62528 619975 622685 627300 633821 641678 650629 660920 672686 685921 701109 719224 740927 766287
62516 766287 795418 828819 866839 909237 955632 1006014 1060545 1119191 1181941 1249020 1320121
62505 1320121 1393326 1465313 1533024 1594837 1649922 1696883 1733692 1758893 1772310 1774424 1765692 1746924
62493 1746924 1720005 1687687 1652679 1617172 1583024 1551894 1525091 1503530 1487915 1478847 1476829 1482312
62481 1482312 1495551 1516224 1543380 1575949 1612875 1652119 1689739 1720835 1741948 1752532 1754105
62470A754105n958j3591k3048l4783m7334n8190o5682o9935p1919p2207p1046
62459A220412o8931o6320o3085n8931n4065m8865m3208l6920l0705k5678k2028
62448G01676j8899j5738j2920j0840r133p250n307l783k710j611k07J196K099
62435F16573K431K561K670K363J154o72k149k780l114l903n017n753n874n766
62421E92724n649n283m576l936l763l871l740l170k492k186k402k879l257l385
62407E42135l301l074k841k846l132l314k979k233j425n10P38J942K398K225K355
62392E26138L111L706L630L548M120M769M616L959L734M038M276M441N098O235
62378E85419P232P936Q703R385R350Q722Q511R184R986J0161R998J0178J0740
$$ plain form
62470 1754105 1748147 1734556 1711508 1676725 1629391 1571201 1505519 1435584 1363665 1291458 1220412
62459 1220412 1151481 1085161 1022076 963145 909080 860215 817007 780087 749382 723704 701676
62448 701676 682777 667039 654119 643279 634146 626896 621589 617806 615096 613485 613278 614474 616573
62435 616573 619004 621565 624235 626598 627752 627080 624931 622151 619037 615134 610117 604364 598490 592724
62421 592724 587075 581792 577216 573280 569517 565646 561906 558736 556244 554058 551656 548777 545520 542135
62407 542135 538834 535760 532919 530073 526941 523627 520648 518415 516990 516480 517218 519160 521558 523783 526138
62392 526138 529249 532955 536585 540133 544253 549022 553638 557597 561331 565369 569645 574086 579184 585419
62378 585419 592651 600587 609290 618675 628025 636747 645258 654442 664428 674589 684587 694765 705505
62365G05505J1327J1970J3123J5167J8221K2180K6683L1301L5981M1050M6657
62354I79165N2482N8034O2802O6139O7496O6891O4595O0261N3015M2839L1285
62343A605004K0319J0775K333n378j2295j8387k4002k9575l5150m0255m4176m6422
62331A382791m7113m6843m6099m4899m3063m0635l7952l5347l2978l0878k9103
62320I47881k7765k6901k6308k5625k4682k3613k2579k1517k0311j9053j7851
62309F91676j6518j4713j2376r802p354n291l764k769k127j692j498j552j635
62296F10585j498j140p30l86j35J12O43J646K731L210L007K845L154L429L156
62281F30629K755K911L476L843M005M318M525M024L000K317K289K534L040M315
$$ plain form
62365 705505 716832 728802 741925 757092 775313 797493 824176 855477 891458 932508 979165
62354 979165 1031647 1089681 1152483 1218622 1286118 1353009 1417604 1477865 1530880 1573719 1605004
62343 1605004 1625323 1636098 1638431 1633053 1620758 1602371 1578369 1548794 1513644 1473389 1429213 1382791
62331 1382791 1335678 1288835 1242736 1197837 1154774 1114139 1076187 1040840 1007862 976984 947881
62320 947881 920116 893215 866907 841282 816600 792987 770408 748891 728580 709527 691676
62309 691676 675158 660445 648069 638267 630913 625622 621858 619089 616962 615270 613772 612220 610585
62296 610585 609087 607947 607217 606831 606696 606808 607451 609097 611828 615038 618045 620890 624044 627473 630629
62281 630629 633384 636295 639771 643614 647619 651937 656462 660486 663486 665803 668092 670626 673666 677981
62267F77981O273P963Q950J0071J2290J5453J8750K1852K5067K8850L3577L9444
62255I06521M6030N2342N7779O2734O7756P2217P4323P2438O6328N7249M6924
62244A582641L6340K5332J3471J275r794j8617k5392l1302l7430m4075n0633n5968
62232A385848n9192o0284n9828n8246n5624n2211m8507m4732m0641l6066l1301
62221H39216k6841k3040k0051j7792j5890j4066j2558j1713j1224j0347q953p736
62209F59005p147o767n993m794l466k146r13N7P86J589K639L723M689N699O837
62194F53798P902Q781R591J0277J0624J0918J1899J3619J5038J5321J5042J5395
62182G98205J6570J7690J8089J7870J7237J6048J4328J2677J1783J1745J2158
$$ plain form
62267 677981 684254 692217 701167 711238 723528 738981 757731 779583 804650 833500 867077 906521
62255 906521 952551 1004893 1062672 1125406 1193162 1265379 1339702 1412140 1478468 1535717 1582641
62244 1582641 1618981 1644313 1657784 1659059 1649265 1630648 1605256 1573954 1536524 1492449 1441816 1385848
62232 1385848 1326656 1266372 1206544 1148298 1092674 1040463 991956 947224 906583 870517 839216
62221 839216 812375 789335 769284 751492 735602 721536 708978 697265 686041 675694 666741 659005
62209 659005 651858 645091 639098 634304 630838 628692 627779 627836 628622 630211 632850 636573 641262 646961 653798
62194 653798 661700 670481 680072 690349 700973 711891 723790 737409 752447 767768 782810 798205
62182 798205 814775 832465 850554 868424 885661 901709 916037 928714 940497 952242 964400
62171I64400J2828J4141J6609K0098K3771K6898K9500L2009L4560L7088L9801
62160A251703M2916M5736M6684M4498L9114L1362K2343J3185M811k517r070j4995
62148A515770k0199k4919k9720l4613l8781m1586m3230m4059m3837m2293l9818
62137A112715l6933l3480k9078k4151j9782j6549j4028j1423q350n038k080J21
62125I11944J799L626N893Q258J0450J2712J5189J7315J8363J8334J7798J7045
62113A058726J5933J4452J2917J1577J0260Q388N219M28n226j0047j2584j2539
62101A097504j0449o958k765J184M108N923O939P350P365P573Q500R913J1110
62088A147297J1819J2419J3288J4399J5548J6520J7091J7252J7495J8562K0797
$$ plain form
62171 964400 977228 991369 1007978 1028076 1051847 1078745 1108245 1140254 1174814 1211902 1251703
62160 1251703 1294619 1340355 1387039 1431537 1470651 1502013 1524356 1537541 1542352 1539835 1530765 1515770
62148 1515770 1495571 1470652 1440932 1406319 1367538 1325952 1282722 1238663 1194826 1152533 1112715
62137 1112715 1075782 1042302 1013224 989073 969291 952742 938714 927291 918941 913903 911823 911944
62125 911944 913743 917369 923262 931520 941970 954682 969871 987186 1005549 1023883 1041681 1058726
62113 1058726 1074659 1089111 1102028 1113605 1123865 1132253 1137472 1137900 1132674 1122627 1110043 1097504
62101 1097504 1087055 1080097 1077332 1078516 1082624 1088547 1095486 1102836 1110201 1117774 1126274 1136187 1147297
62088 1147297 1159116 1171535 1184823 1199222 1214770 1231290 1248381 1265633 1283128 1301690 1322487
62077A322487K3948K7449L0725L3265L4782L5274L4915L3891L2421L0611K8186
62066A667954K4762K0633J6889J4439J3239J2791J2945J3682J4504J4706J4113
62055A840657J3069J1789J0236Q461O565M398J827q38l271o028j0359j6886k4797
62042A834823l2609l9482m5535n1083n5896n9422o1595o3029o4087o4145o2372
62031A235568n9090n5562n2283m8438m3413l7953l3112k8907k4878k1403j9278
62020H11251j8255j7152j5448j3843j3019j2686j2104j0944r358p637o059m849
62008F69897m026l452k853j726M16L327N920P391Q104Q762R125Q383O552M578
61994G20398L035J598m4j630k873l972n278o901q785j0663j1951j2223j1886j1775
$$ plain form
62077 1322487 1346435 1373884 1404609 1437874 1472656 1507930 1542845 1576736 1609157 1639768 1667954
62066 1667954 1692716 1713349 1730238 1744677 1757916 1770707 1783652 1797334 1811838 1826544 1840657
62055 1840657 1853726 1865515 1875751 1884212 1890777 1895175 1897002 1896164 1892893 1886865 1876506 1859620 1834823
62042 1834823 1802214 1762732 1717197 1666114 1610218 1550796 1489201 1426172 1362085 1297940 1235568
62031 1235568 1176478 1120916 1068633 1020195 976782 938829 905717 876810 851932 830529 811251
62020 811251 792996 775844 760396 746553 733534 720848 708744 697800 688442 680805 674746 669897
62008 669897 665871 662419 659566 657840 658256 661583 667503 674894 682998 691760 700885 709268 715820 720398
61994 720398 723433 725031 724987 723357 720484 716512 711234 704333 695548 684885 672934 660711 648825 637050
61980F37050j2072j2227j1908j1278j0295q656o677n331n002m962m501l838l414
61967E36889l011k298j602j424j605j591j349j251j303j029j99Q60J645J956K000
61952E26688K216K899L845M575N025N735P137Q997J0761J2188J3411J4772J6711
61939F34960J9386K2116K3743K3958K3755K4053K4463K4107K3157K2540K2318
61928H88556K1495J9539J7172J5109J2900R675N583J695j320l824o398q939j0722
61915I60521j1138j0097p893m973j849J008L513O141R443J3201J6314J7802J7811
61902A009804J7254J6500J4826J1375O309P42m305q513j2010j4859j6986j8316
61890A001821j8873j8831j8494j8120j7685j7018j6135j5282j4569j3833j3022
$$ plain form
61980 637050 624978 612751 600843 589565 579270 570614 563937 558606 553604 548642 544141 540303 536889
61967 536889 533878 531580 529978 528554 526949 525358 524009 522758 521455 520426 520227 521087 522732 524688 526688
61952 526688 528904 531803 535648 540223 545248 550983 558120 567117 577878 590066 603477 618249 634960
61939 634960 654346 676462 700205 724163 747918 771971 796434 820541 843698 866238 888556
61928 888556 910051 929590 946762 961871 974771 984446 990029 991724 990404 986580 980182 971243 960521
61915 960521 949383 939286 931393 926420 924571 925579 929092 935233 944676 957877 974191 991993 1009804
61902 1009804 1027058 1043558 1058384 1069759 1076068 1076810 1072505 1063992 1051982 1037123 1020137 1001821
61890 1001821 982948 964117 945623 927503 909818 892800 876665 861383 846814 832981 819959
61879H19959j2355j1930j1392j0425r356q775q619q063o528m481k974k525k603
61866G19933k210r00Q25K147K928L792N122O497P471Q475J0305J2959J5737J8405
61852H11486K1406K4853K8167L0980L3633L6323L8532L9757M0132L9765L8048
61841A183082L4349K8965K2715J5996Q848J662m901j0457j4798j7507j8285j7475
61829A212194j5658j2901q933l921J538O934J1750J5197J6748J6769J5875J3759
61817A269351R535L171m174j1404j8240k4592k9957l3894l6506l8093l8664l8066
61805A008467l6291l3540l0230k7056k4570k2641k0628j8155j5421j2877j0990
61794G56068j0140j0182j0202r312p699o265n278m164k663j373q35q29r52j247
$$ plain form
61879 819959 807604 795674 784282 773857 764501 755726 747107 739044 732516 728035 725061 722536 719933
61866 719933 717723 716823 717648 719795 722723 726515 731637 738134 745605 754080 764385 777344 793081 811486
61852 811486 832892 857745 885912 916892 950525 986848 1025380 1065137 1105269 1145034 1183082
61841 1183082 1217431 1246396 1269111 1285107 1293955 1295617 1290716 1280259 1265461 1247954 1229669 1212194
61829 1212194 1196536 1183635 1174702 1170781 1172319 1179253 1191003 1206200 1222948 1239717 1255592 1269351
61817 1269351 1278886 1282057 1277883 1266479 1248239 1223647 1193690 1159796 1123290 1085197 1046533 1008467
61805 1008467 972176 938636 908406 881350 856780 834139 813511 795356 779935 767058 756068
61794 756068 745928 735746 725544 716232 708533 702268 696990 692826 690163 688790 687955 687126 686174 684927
61780F84927j797k233k184j811j543j551j802k237k636k633k218j873j969k321
61766F56119k573k617k434j945j271p66m43J14R45J281M75r07j530p66O49J415
61750F45746Q46p21k342l257l431l395l618m113m564m587l883k503j033k38l26
61735F08581p17o87m8P55J053M91n91j327j145l46M26J053J838K741L372L703
61719F19152M096M592M797M607M319L917K961J473J79n32j244k629m487o128p237
61704F27836p837p870p356o610n946n356m825m514m370m016l424l177l630m297
61690E54608m535m335l936l266k358j843k194k886l066k787k720k928k789k122
61676E12843j477j237j227j369j946k855l314k748j628r02q75r98o95j00R4o00
$$ plain form
61780 684927 683130 680897 678713 676902 675359 673808 672006 669769 667133 664500 662282 660409 658440 656119
61766 656119 653546 650929 648495 646550 645279 644513 644070 644184 645129 646410 646885 645978 644448 643682 644331 645746
61750 645746 646592 645871 643529 640272 636841 633446 629828 625715 621151 616564 612681 610178 609145 608907 608581
61735 608581 607864 607177 607129 607884 608937 609428 608837 607510 606365 606019 606445 607498 609336 612077 615449 619152
61719 619152 623248 627840 632637 637244 641563 645480 648441 649914 650093 649561 648317 645688 641201 635073 627836
61704 627836 619999 612129 604773 598163 592217 586861 582036 577522 573152 569136 565712 562535 558905 554608
61690 554608 550073 545738 541802 538536 536178 534335 532141 529255 526189 523402 520682 517754 514965 512843
61676 512843 511366 510129 508902 507533 505587 502732 499418 496670 495042 494140 493265 492267 491572 491472 491566 490966
61660D90966j799k488j974n91P36J488J837K099K252K161J922J821K096K822L815
61645E07163M571M530L672K678K282K496K697K452J908J281L82r89k413l171l181
61630E26358l079l220l203k645j892j456j243r24o40o68p20l69L6k11r21j106
61614E04097m62J61m8j020k422m247o246p642p996p857p935q049p504o144m542
61599D32144l327k769k772k973l008k841k679k546k380k481l222m169m285l297
61585C89395k120j566j397j161j112j564k024j829j192p64n06J18J046J514J056
61570C77894Pr79j470j375r58o26n24m44k89k41k99j63J98L84K87K86M18J49n17
61551C71738o01L91J432J429R25J197K164K552J916J196J220J755K226K447K476
$$ plain form
61660 490966 489167 486679 484705 484114 484850 486338 488175 490274 492526 494687 496609 498430 500526 503348 507163
61645 507163 511734 516264 519936 522614 524896 527392 530089 532541 534449 535730 536112 535123 532710 529539 526358
61630 526358 523279 520059 516856 514211 512319 510863 509620 508696 508056 507388 506668 506299 506335 506124 505203 504097
61614 504097 503635 503796 503748 502728 500306 496059 489813 482171 474175 466318 458383 450334 442830 436686 432144
61599 432144 428817 426048 423276 420303 417295 414454 411775 409229 406849 404368 401146 396977 392692 389395
61585 389395 387275 385709 384312 383151 382039 380475 378451 376622 375430 374666 374160 374278 375324 376838 377894
61570 377894 377901 376922 375452 374077 373119 372493 371969 371525 371236 370995 370696 370533 370731 371115 371402 371688 372106 372255 371738
61551 371738 371137 371528 372960 374389 375314 376511 378675 381227 383143 384339 385559 387314 389540 391987 394463
61536C94463K474K853L864M977N311M646L507K337J234L54k07p98j797k893l529
61521D16796l782m011l926l011j737j202j516j686j218p15o13m82l6J66k96q79
61505C91852q68l77Mj5m54j274k138k414j909j160p15n57m90n46o38l77L27R90
61487C79241J226J229J199R07K55k08Q3R12J609J864J844J781J892K373L073L355
61471D02635K762J603O02N1k79n93p73n89mO88J009O63j23q58j307j501j361p32
61453D01893J06M84J35m24n22p5N70J166J713K265K773L059K932K533K449L064
61437D24121L962M375M210M036M058L751K755J571R90J271K027K590K338J207
61423D63262L0j34P60J727K113K287K704L034K809K250J834J448P10k47r95j575
$$ plain form
61536 394463 396937 399790 403654 408631 413942 418588 422095 424432 425666 426020 425813 425015 423218 420325 416796
61521 416796 413014 409003 405077 402066 400329 399127 397611 395925 394707 393992 393379 392897 392861 393027 392731 391852
61505 391852 390984 390607 390611 390596 390142 388868 386730 384316 382407 381247 380532 379975 379485 378939 378301 377924 378251 379241
61487 379241 380467 381696 382895 383802 384057 383849 383932 384844 386453 388317 390161 391942 393834 396207 399280 402635
61471 402635 405397 407000 407602 407653 407374 406781 406008 405419 405415 406103 407112 407775 407652 406794 405487 403986 402625 401893
61453 401893 401999 402483 402618 402194 401672 401597 402167 403333 405046 407311 410084 413143 416075 418608 421057 424121
61437 424121 428083 432458 436668 440704 444762 448513 451268 452839 453829 455100 457127 459717 462055 463262
61423 463262 463292 463158 463918 465645 467758 470045 472749 475783 478592 480842 482676 484124 484834 484587 483592 482017
61407D82017k307l016l132k651k324k699l388l631l265k823k722k729k364j657
61393D43309j128r98q76m68j39k85n60m17p7j57m75k33O37J265J268J316J869
61376D43851K363K277K087K398K875K865K480K200J915J276O25N82J000J220J227
61361D71241J637K588L479L852L867L837L953M460N417O318O603O576P124Q455
61347E39407R910J1076J2241J3421J3779J2675J0693Q964P846O917N963N251M807
61334F62950M094K698R37n27j511k412l576m786n541n607n207m714m396m341m414
61319F23647m251l538k352j055J50J247K114K563K819L435M502N421N819O227
61305F46748P318Q894J0236J1208J2244J3263J3390J1968R313O148K868l92l335
$$ plain form
61407 482017 479710 476694 473562 470911 468587 465888 462500 458869 455604 452781 450059 447330 444966 443309
61393 443309 442181 441183 440307 439839 439700 439415 438855 438438 438361 438204 437729 437496 438133 439398 440666 441982 443851
61376 443851 446214 448491 450578 452976 455851 458716 461196 463396 465311 466587 467212 467794 468794 470014 471241
61361 471241 472878 475466 478945 482797 486664 490501 494454 498914 504331 510649 517252 523828 530952 539407
61347 539407 549317 560393 572634 586055 599834 612509 623202 632166 640012 646929 652892 658143 662950
61334 662950 667044 669742 670679 670152 668641 666229 662653 657867 652326 646719 641512 636798 632402 628061 623647
61319 623647 619396 615858 613506 612451 612601 613848 615962 618525 621344 624779 629281 634702 640521 646748
61305 646748 654066 662960 673196 684404 696648 709911 723301 735269 744582 750730 753598 753206 749871
61292G49871n603p225q537r722j0522j0483r452p900o672o203o098n684m873m055
61278F46842l174j645N88K527L223L107L461M749O142O753O722O697O810O711
61264F99513O336O054O109O345O653P310Q682J0726J2932J4696J5631J5683J5015
61251H31685J3729J1731Q976N829K844J86k524n479q137r673j0004r992j0505
61238H18666j1441j1830j0865q783o577m978l965l261k867k675j998k25K118L715
61224G55034M135M330N199O342O896O858O835O864O408N326M108L222K851L142
61210H27550M021M789M642L645K615K036J717J550J877K935M531O419Q476J0483
61196H87286J2315J4414J7370K0955K4242K6825K9083L1048L1832L0722K8126
$$ plain form
61292 749871 744268 737043 728506 718784 708262 697779 688327 680427 673755 667552 661454 655770 650897 646842
61278 646842 643668 642023 642611 645138 648361 651468 654929 659678 665820 672573 679295 685992 692802 699513
61264 699513 705849 711903 718012 724357 731010 738320 747002 757728 770660 785356 800987 816670 831685
61251 831685 845414 857145 866121 871950 874794 874980 872456 866977 858840 849167 839163 829171 818666
61238 818666 807225 795395 784530 775747 769170 764192 760227 756966 754099 751424 749426 749201 751319 755034
61224 755034 759169 763499 768698 775040 781936 788794 795629 802493 808901 814227 818335 821557 824408 827550
61210 827550 831571 836360 841002 844647 847262 849298 851015 852565 854442 857377 861908 868327 876803 887286
61196 887286 899601 914015 931385 952340 976582 1003407 1032490 1063538 1095370 1126092 1154218
61185A154218K4904K1423J7797J4464J1845R834Q153O822N686M048J474j408l731
61172A275529n727q357j1691j4585j6193j6981j7875j9050k0227k1548k3399k5384
61160A074512k6404k6037k5158k4709k4343k3068k0895j8794j7062j4821j1669
61149H41552q612o560m847k370M74K327K826K626J773l14l205n485o732p850q897
61134G96706q340n490k126k60O11K405N481Q442J0572J2757J5777J9172K2175
61121H77882K4818K7524L0305L2869L5085L7010L8697M0159M1305M1872M1653
61110A269179M0774L9582L8283L6823L4954L2321K8718K4537K0670J7589J4751
61099A598181J1170O375M94o196j3338k0258k6236l1018l4862l8041m0534m2078
$$ plain form
61185 1154218 1179122 1200545 1218342 1232806 1244651 1254485 1262638 1269460 1275146 1279194 1280668 1279260 1275529
61172 1275529 1269802 1261445 1249754 1235169 1218976 1201995 1184120 1165070 1144843 1123295 1099896 1074512
61160 1074512 1048108 1022071 996913 972204 947861 924793 903898 885104 868042 853221 841552
61149 841552 832940 826380 821533 819163 819637 821964 824790 827416 829189 828875 825670 820185 813453 805603 796706
61134 796706 788366 782876 780750 780490 781101 783506 788987 797429 808001 820758 836535 855707 877882
61121 877882 902700 930224 960529 993398 1028483 1065493 1104190 1144349 1185654 1227526 1269179
61110 1269179 1309953 1349535 1387818 1424641 1459595 1491916 1520634 1545171 1565841 1583430 1598181
61099 1598181 1609351 1615726 1616220 1610024 1596686 1576428 1550192 1519174 1484312 1446271 1405737 1363659
61087A363659m2427m1667m0339l9089l8083l7032l5668l3933l1664k8741k5583
61076I69433k2928k0928j9097j7258j5815j4774j3313j0904q159n924m188k585
61064H13560j352r32r09k75J335L264M696N412N805O543Q084J0224J2260J3769
61050H81484J4982J6272J7739J9496K1738K4246K6399K7988K9464L1002L2112
61039A142922L2552L2951L3894L5060L5757L5791L5225L4064L2786L2326L2863
61028A516191L3225L2390L0909L0138L0600L1899L3599L5329L6555L7018L7037
61017A884890L6924L6800L7406M0054M5123N1612N8927O7828P8715R0358J01556
61006B530193J12830J25418J40173J58881J84869K20503K65845L21869L92943
$$ plain form
61087 1363659 1321232 1279565 1239226 1200137 1162054 1125022 1089354 1055421 1023757 995016 969433
61076 969433 946505 925577 906480 889222 873407 858633 845320 834416 826257 820333 816145 813560
61064 813560 812208 811276 810367 810092 811427 814691 819387 824799 830604 837147 845231 855455 867715 881484
61050 881484 896466 912738 930477 949973 971711 995957 1022356 1050344 1079808 1110810 1142922
61039 1142922 1175474 1208425 1242319 1277379 1313136 1348927 1384152 1418216 1451002 1483328 1516191
61028 1516191 1549416 1581806 1612715 1642853 1673453 1705352 1738951 1774280 1810835 1847853 1884890
61017 1884890 1921814 1958614 1996020 2036074 2081197 2132809 2191736 2259564 2338279 2428637 2530193
61006 2530193 2643023 2768441 2908614 3067495 3252364 3472867 3738712 4060581 4453524
60997D453524M83792N96658P35033R07182J120410J373330J657777J959728K238790
60988A5526224K402109K324974J936027J299990O06487O0521k26847k57498r3161
60979B3578826J82136M49321N50313L52596j54692q33445j478345j936100k162007
60970A8548603k191799k085694j898056j673050j443601j228261j034063q63779
60962F130300p18790n97477m95901m11210l42323k87643k44239k09363j81034
60953B642320j57459j37432j21042j08441r8133q7929p7245o7183n8630n1756
60943A677070m6960m4786m4799m5706m6600m7107m6701m5070m2931m1262l9856
60932A185292l7715l4732l1787k9278k6746k4015k1580j9717j8129j6563j5021
$$ plain form
60997 4453524 4937316 5533974 6269007 7176189 8296599 9669929 11327706 13287434 15526224
60988 15526224 17928333 20253307 22189334 23489324 24095811 24156332 23929485 23671987 23578826
60979 23578826 23760962 24210283 24760596 25113192 24958500 24125055 22646710 20710610 18548603
60970 18548603 16356804 14271110 12373054 10700004 9256403 8028142 6994079 6130300
60962 6130300 5411510 4814033 4318132 3906922 3564599 3276956 3032717 2823354 2642320
60953 2642320 2484861 2347429 2226387 2117946 2019813 1931884 1854639 1787456 1728826 1677070
60943 1677070 1630110 1585324 1540525 1494819 1448219 1401112 1354411 1309341 1266410 1225148 1185292
60932 1185292 1147577 1112845 1081058 1051780 1025034 1001019 979439 959722 941593 925030 910009
60921I10009j3371j1599j0247r700r191p567n015k957k180k098j883j319l03J316
60907H33895L045L823L329K502K373K905L362L210K350R86m39j527k367l249l956
60892H50242l866k912j842j301j208j207j144r08l17M60Q00L65m07q19o43r6O15
60875H35812J362J928K096J888J522J207J068J150J456J991K758L629M285M479
60861H66631M396M483M933N364N145M065K710K039K407L070K964J970R11K98l01
60846I11085j371k539l083k934k596k406k488l155m693o728q486r715j0836j2043
60832H38012j2804j2493j1216r722q613p895p269o694o417o519o703o717o647
60819G28303o487n778m360l173l397m751n659n346m697m641m759m300l574l305
$$ plain form
60921 910009 896638 885039 874792 865092 855901 848334 843319 840362 838182 836084 834201 832882 832579 833895
60907 833895 836940 840763 844092 846594 848967 851872 855234 858444 860794 861780 861341 859814 857447 854198 850242
60892 850242 846376 843464 841622 840321 839113 837906 836762 835854 835537 835997 836797 837162 836755 835936 835293 835197 835812
60875 835812 837174 839102 841198 843086 844608 845815 846883 848033 849489 851480 854238 857867 862152 866631
60861 866631 871027 875510 880443 885807 890952 895017 897727 899766 902173 905243 908207 910177 911088 911386 911085
60846 911085 909714 907175 904092 901158 898562 896156 893668 890513 885820 879092 870606 860891 850055 838012
60832 838012 825208 812715 801499 791777 783164 775269 768000 761306 754889 748370 741667 734950 728303
60819 728303 721816 716038 711678 708505 705108 700357 694698 689352 684655 680014 675255 670955 667381 664076
60805F64076l299k903k343k366k861k941k349j739j569j616j684j896k115j944
60791F32451j437j199j519k010k211k054j624j115j025j777l007l753l567k873
60777F03280k223j730j388j387j772k277k700l121l572l846l785l421k736j684
60763E67638m85L91P04N72K17j30j36L34Q39O99k05j366k333k989l217k833j984
60746E55716j078k40O84J489J541N93q06j942k680l298l974m673n201n222m513
60731E26396l424k771k996l628l764k973j602l55K52J75k15n29o78q65j304k034
60715D99685k811l127k539j309l93n11j325j912j904j733j803j927j714j138n77
60700D74962l88n51o32k09N64J038Q27K53j31k01p4K43O88Q85N76J33J25N99J257
$$ plain form
60805 664076 660777 657874 655531 653165 650304 647363 645014 643275 641706 640090 638406 636510 634395 632451
60791 632451 631014 629815 628296 626286 624075 622021 620397 619282 618257 616480 613473 609720 606153 603280
60777 603280 601057 599327 597939 596552 594780 592503 589803 586682 583110 579264 575479 572058 569322 567638
60763 567638 567153 567544 568248 568820 569037 568907 568771 569105 569944 570643 570438 569072 566739 563750 560533 557700 555716
60746 555716 554638 554398 555082 556571 558112 558705 557899 555957 553277 549979 546005 541332 536131 530909 526396
60731 526396 522972 520201 517205 513577 509813 506840 505238 504883 505135 505310 505095 504566 503888 503023 501719 499685
60715 499685 496874 493747 491208 489899 489506 488995 487670 485758 483854 482121 480318 478391 476677 475539 474962
60700 474962 474574 474023 473391 473182 473746 474784 475611 475864 475733 475532 475458 475701 476389 477274 477850 477983 478108 478707 479964
60681D79964K041K989L636L304K083R50Q16J765L186M312M632M183L465K861K232
60666E22419J340L54m21r91j418j434r09l21k36n47q00q95q28j79J282K780L310
60649E22506L008K805K908K678J966J418J255Q57j16j142j746k211k913l645m031
60634E23597m005l569k659j480m50L12Q73R22J53q06q19J18P43L36l05k41K76
60617E12996M68K02k07o16q62n73J64N77K68j14Q0M57K75l85r32j279j700k054
60599E06765j959j486j027o47j83K57M45M84O14Q29J131J751K708L405L283K560
60583E18930J828J235O31R6k17n11r68j249r28k03M25Q68J369J928K461L244M543
60566E33482O043P306Q545J0242J2159J3504J3978J3996J3801J3043J1242Q261
$$ plain form
60681 479964 482005 484994 488630 491934 494017 494967 495783 497548 500734 505046 509678 513861 517326 520187 522419
60666 522419 523759 524113 523692 522701 521283 519849 518940 518619 518383 517836 517036 516141 515313 515134 516416 519196 522506
60649 522506 525514 528319 531227 533905 535871 537289 538544 539401 539285 538143 536397 534186 531273 527628 523597
60634 523597 519592 516023 513364 511884 511434 511746 512619 513541 513694 512888 512069 512187 512930 513266 512961 512720 512996
60617 512996 513464 513666 513459 512843 511981 511408 511572 512149 512417 512303 512383 512840 513115 512730 511798 510519 508819 506765
60599 506765 504806 503320 502293 501646 501463 501720 502165 502649 503263 504092 505223 506974 509682 513087 516370 518930
60583 518930 520758 521993 522624 522720 522503 521992 521024 519775 518847 518644 519069 519937 521306 523234 525695 528939 533482
60566 533482 539525 546831 555376 565618 577777 591281 605259 619255 633056 646099 657341 665602
60554F65602M385M26k546m172n314o926q594q992p653n427l208j204M58J458J964
60539F20257K727L998N117N678O375Q027J0369J2486J3904J4611J4355J2824J0333
60526G41061P615M927K037r01l169m319m696m829m754m279l568l054k831k531
60512G16709j830q50K1N93J056J670K363K683K275J403Q90J467L189N526P953
60497G45118J0349J2966J6144K0088K4702K9598L4403L8979M3178M6372M7564
60486A069461M6151M2365L6755K9443K0192R125k891j4544k4634l2494l8187m2259
60474A098483m5041m6259m5587m3456m0919l8606l6136l2770k8467k4050k0447
60463F96745j7894j5938j4071j2280j0822r674q595p643p143o912o147m604l355
$$ plain form
60554 665602 669987 670413 667867 663695 658381 651455 642861 633869 626216 620789 617581 616377 616835 618293 620257
60539 620257 622984 626982 632099 637777 644152 652179 662548 675034 688938 703549 717904 730728 741061
60526 741061 748676 753603 755640 754739 751570 747251 742555 737726 732972 728693 725125 722071 719240 716709
60512 716709 714879 714029 714050 714643 715699 717369 719732 722415 724690 726093 726983 728450 731639 737165 745118
60497 745118 755467 768433 784577 804665 829367 858965 893368 932347 975525 1021897 1069461
60486 1069461 1115612 1157977 1194732 1224175 1244367 1253492 1250601 1236057 1211423 1178929 1140742 1098483
60474 1098483 1053442 1007183 961596 918140 877221 838615 802479 769709 741242 717192 696745
60463 696745 678851 662913 648842 636562 625740 616066 607471 599828 592685 585773 579626 575022 571667
60450E71667l609n009o007n837n256n140n214m700l519k325j606j317j175r61
60436E19992n78j16K01J62l27j198k077k383j929j317j206j251n14J044K235K186
60420E12924J494J313J851K412K580K580K559K225J376M16K8M63J320K013K330
60405E37884K462K533K418K089J803J638J216L40m39m39J96Q51J444K259L004
60390E59259L062K719K950L757L966L085K169K142K458K344K264K889L485K868
60376E99417J436Q04J472K280K264J795J589J692J919K407L059L206K423J320
60362F27083Q83J319K013K432K632K853L023K881K470K244K483K841K785K510
60348F60452K865M233O005P582R285J1581J3851J4808J4118J2715J1379R756P104
$$ plain form
60450 571667 568058 563049 557042 551205 545949 540809 535595 530895 527376 525051 523445 522128 520953 519992
60436 519992 519414 519298 519499 519661 519334 518136 516059 513676 511747 510430 509224 507973 507459 508503 510738 512924
60420 512924 514418 515731 517582 519994 522574 525154 527713 529938 531314 531730 531758 532221 533541 535554 537884
60405 537884 540346 542879 545297 547386 549189 550827 552043 552383 551944 551505 551701 552552 553996 556255 559259
60390 559259 562321 565040 567990 571747 575713 578798 580967 583109 585567 587911 590175 593064 596549 599417
60376 599417 600853 601657 603129 605409 607673 609468 611057 612749 614668 617075 620134 623340 625763 627083
60362 627083 627966 629285 631298 633730 636362 639215 642238 645119 647589 649833 652316 655157 657942 660452
60348 660452 663317 667550 673555 681137 690422 702003 715854 730662 744780 757495 768874 778630 785734
60335G85734L350j033n647j0043j3282j4371j3355j1541j0351j0099j0021r316
60323F80025p854n985m120k625j830j725j900k044k306k794l000k377j183j30
60309F40152Q09K311M406O256P610R421J2459J6188J9850K3781K8550L3316L6261
60296H41370L6497L4492L0695K4868J7007P956j218r817j7203k2646k5943k7682
60284H88376k8472k8241k6672k4003k1023j8486j6687j5460j4345j2952j1346
60273F70689r931q891p975o932n919n271m992m696m029l039k120j592j378j084
60259F02840m81K42O90P53P20R19J346J656J560J193R47R07P27K21k46l11k88
60242F13395p10j343j442r82q13j312j687j158p8P62J318K048K925L518L875M463
$$ plain form
60335 785734 789084 788051 782404 772361 759079 744708 731353 719812 709461 699362 689341 680025
60323 680025 672171 666186 662066 659441 657611 655886 653986 651942 649636 646842 643842 641465 640282 640152
60309 640152 640961 643272 647678 653934 661544 670965 683424 699612 719462 743243 771793 805109 841370
60296 841370 877867 912359 943054 967922 984929 992885 991667 981850 964647 942001 916058 888376
60284 888376 859904 831663 804991 780988 759965 741479 724792 709332 694987 682035 670689
60273 670689 660758 651867 643892 636960 631041 625770 620778 616082 612053 609014 606894 605302 603924 602840
60259 602840 602359 602601 603291 604044 604764 605683 607029 608685 610245 611438 612385 613292 614019 614240 613994 613683 613395
60242 613395 612685 611342 609900 608918 608105 606793 605106 603948 603870 604632 605950 607998 610923 614441 618316 622779
60226F22779N264N660N327M669M238M101L965L608L129K900L255M086M846N180
60212F83007N331N772O629P691Q727R500R781R625R344Q981Q170O870N784N567
60198G90779N883N828N028L838K696J730R52K69n84j759l010m028m840n583o126
60183G91073o269o155o027n811n298m599m023l671l440l268l134l026l022l021
60169G30309k446q25J140J941J131n0l73pM53J184K273K709J676K07OR89J554
60152G41871J090N61O39Q54Q89J223J936K256J905J863K967M696N952O407O397
60137G81506O174N908N925O388P008P425P560P350O636N470M175K879J448Nj059
60122H54798j747k522l455l874l128j366O72K237K940K969K926L066K828J709
$$ plain form
60226 622779 628043 633703 639030 643699 647937 652038 656003 659611 662740 665640 668895 672981 677827 683007
60212 683007 688338 694110 700739 708430 717157 726657 736438 746063 755407 764388 772558 779428 785212 790779
60198 790779 796662 802490 807518 811356 814052 815782 816734 817003 816419 814660 811650 807622 802782 797199 791073
60183 791073 784804 778649 772622 766811 761513 756914 752891 749220 745780 742512 739378 736352 733330 730309
60169 730309 727863 727038 728178 730119 731250 731200 730827 730820 731273 732457 734730 737439 739115 739322 739328 740317 741871
60152 741871 742961 743522 744161 745015 745904 747127 749063 751319 753224 755087 758054 762750 768702 775109 781506
60137 781506 787680 793588 799513 805901 812909 820334 827894 835244 841880 847350 851525 854404 855852 855857 854798
60122 854798 853051 850529 847074 843200 840072 838706 839378 841615 844555 847524 850450 853516 856344 858053
60108H58053L05m17o90j680l555n078n517n808p064q799r548q708o965n247l934
60093G85348k935j948p61M85J441K133K974M073M928N045M497L704L021K683K698
60078H17386K634J918N46r77k416l976n584o660o905o775o884p389q104q756q918
60063G49140q209o849n618n052n062n353n698n771n344m731m422m154l120j223
60049F78534O19J626J920J967K070K579L768N216O090O325O607O990O637N340
60035G36288M141L682L090J414p71k249k898l473m231m949n833p258q784r548
60021F98621r584r829j0699j1522j1566j0894r997r067p986o671n192l694k378
60008E89542j503j325j821k415k145n52J626L039L041K088R92L07L84J311K648
$$ plain form
60108 858053 858358 857941 857251 855571 852016 846938 841421 835613 828549 819750 810202 801494 794529 789282 785348
60093 785348 782413 780465 779704 780189 781630 783763 786737 790810 795738 800783 805280 808984 812005 814688 817386
60078 817386 820020 821938 822484 821507 819091 815115 809531 802871 795966 789191 782307 774918 766814 758058 749140
60063 749140 740931 734082 728464 723412 718350 712997 707299 701528 696184 691453 687031 682877 679757 678534
60049 678534 679153 680779 682699 684666 686736 689315 693083 698299 704389 710714 717321 724311 730948 736288
60035 736288 740429 744111 747201 748615 747844 745595 742697 739224 734993 730044 724211 716953 708169 698621
60021 698621 689037 679208 668509 656987 645421 634527 624530 615463 607477 600806 595614 591920 589542
60008 589542 588039 586714 584893 582478 580333 579781 581407 584446 587487 589575 590567 590874 591258 592569 595217
59993E95217L767M572N305N821N768N436N497N849N748N155M813M762M103K647
59979F64460J416Q65j4j901l764m448m476m936n535n267m278l544l161k358j083
59964F21976j71k1j64j72k8K78O89P87L86Q4L69N98n4r96q58M68J730K211K408
59945F29520K595K066M14j437k217j803j232j549k911m503n209m678l651k987
59931F02418k619j967j037l44M3N74J388K140K647K985L039K668K266K309K449
59916F18959J948J006O78J312K094K392K564L001L337L264L258L765M191L617
59902F55386K181R67O28P51O17J09l43l77o7L53R36K014L553M844N148M615M190
59885F85505M550N484O308O628O491O168N946O042O501P142P659P746P236O172
$$ plain form
59993 595217 598984 603556 608861 614682 620450 625886 631383 637232 642980 648135 652948 657710 661813 664460
59979 664460 665876 666741 666727 664826 661062 656614 652138 647202 641667 636400 632122 628578 625417 623059 621976
59964 621976 621805 621784 621620 621448 621420 621698 622387 623174 623560 623644 624013 624611 624557 623561 622703 623171 624901 627112 629520
59945 629520 632115 634181 634595 633158 630941 629138 627906 626357 623446 618943 613734 609056 605405 602418
59931 602418 599799 597832 596795 596451 596494 597068 598456 600596 603243 606228 609267 611935 614201 616510 618959
59916 618959 620907 621913 622591 623903 625997 628389 630953 633954 637291 640555 643813 647578 651769 655386
59902 655386 657567 658534 659162 659913 660530 660639 660296 659919 659852 660205 661141 663155 666708 671552 676700 681315 685505
59885 685505 690055 695539 701847 708475 714966 721134 727080 733122 739623 746765 754424 762170 769406 775578
59871G75578M658K565l66l974p474r987j1139j1067j0153q965q072p601p164o468
59857F90371n653m819l668k106p77l69n86l77Q74K830M752O119O821P188P795
59842G08395Q859R951J0523J0591J0461J0025Q772O536L858J698R32J910M201
59829G96712O783Q726R500Q715O161K341j620n080q330j1560j4000j4800j4219
59816G69329j3172j2008j0608r241q338p549o091m104k776k876l822m436m144
59803F80164l184k130j394r90o53l56n59j695l534n302o298o257n448m654m624
59788F33086n209n436m797l946l648l667l313k560j884j358o82J44Q02J083R16
59773E99531L24k14O8J136J926J804J504J875K534K741K776L337M185M654M834
$$ plain form
59871 775578 780236 782801 782435 778461 770987 761000 749861 738794 728641 719676 711604 704003 696839 690371
59857 690371 684718 679899 676231 674125 673348 672979 672393 672016 672890 675720 680472 686591 693412 700600 708395
59842 708395 717254 727205 737728 748319 758780 768805 777577 784113 787971 789669 790601 792511 796712
59829 796712 803495 812221 821721 830436 836597 838938 837318 832238 823908 812348 798348 783548 769329
59816 769329 756157 744149 733541 724300 715962 708413 702322 698218 695442 692566 688744 684308 680164
59803 680164 676980 674850 673456 672466 671813 671457 670898 669203 665669 660367 654069 647812 642364 637710 633086
59788 633086 627877 622441 617644 613698 610050 606383 603070 600510 598626 597268 596586 596730 597532 598615 599531
59773 599531 599855 599641 599709 600845 602771 604575 606079 607954 610488 613229 616005 619342 623527 628181 633015
59758F33015N014M619L242K119K823M786N908N483M759M557M329L782L567L735
59744F91738L238J800O95Q65J508J520J105J040J353J658K001K478K748K646K618
59729G19011K947L233L160L059L133K988K517K461L368M663N368N125M127K745
59715G67905J760K015L147L582K529J216J253K513L611L878L721L514L235L060
59701H06939L305L669L428K489J619J435J708J952K319L412N134O084M667R63
59687H49123k974n122n394m971m333l032j130M35J162J466J502O58j158k791l255
59672H20186l145l788n489p399q734r413r721r890r938r553q374o538m675l189
59658G20340j978r32j22N77J441K276K612K681L363M838O112O269N448M092K185
$$ plain form
59758 633015 638029 642648 645890 648009 650832 655618 661526 667009 671768 676325 680654 684436 688003 691738
59744 691738 694976 696776 697471 698336 699844 701364 702469 703509 704862 706520 708521 710999 713747 716393 719011
59729 719011 721958 725191 728351 731410 734543 737531 740048 742509 745877 750540 755908 761033 765160 767905
59715 767905 769665 771680 774827 778409 780938 782154 783407 785920 789531 793409 797130 800644 803879 806939
59701 806939 810244 813913 817341 819830 821449 822884 824592 826544 828863 832275 837409 843493 848160 849123
59687 849123 846149 841027 835633 830662 826329 823297 822167 822602 823764 825230 826732 827390 826232 823441 820186
59672 820186 817041 813253 807764 800365 791631 782218 772497 762607 752669 743116 734742 728204 723529 720340
59658 720340 718362 717430 717308 717885 719326 721602 724214 726895 730258 735096 741208 747477 752925 757017 759202
59643G59202k24k450l913m832n584o005n907n704n745n580m594k970j376q1R63
59628G05200J535J348O05j68p24j063j129r16o11l90k55l54r51j887k524k528
59612F95188k208j854j275l85M14Q32J220K109L564N178O303O130M323J729k56
59597G21012j217j877k598k839k445k256k713k950k121p80M0L44P54J224J140
59582G02718L57p24j800k712l209l310l467l903m210m101l884l700l027j637l09
59567F63082J83J89M23Q10Q90Q19J011J259J133Q12P21O78K81k34k86K26J000
59550F72997J846K524K598K130J902K317K716K567K602L844O088Q283R986J1616
59536G34016J3829J7271K2013K6363K7200K2985J5748Q952M170J174J55J668M702
$$ plain form
59643 759202 758978 756528 752615 747783 742199 736194 730287 724583 718838 713258 708664 705694 704318 704237 705200
59628 705200 706735 708083 708688 708520 707796 706733 705604 704688 704077 703687 703432 703078 702127 700240 697716 695188
59612 695188 692980 691126 689851 689466 689880 690712 691932 694041 697605 702783 709086 715216 719539 721268 721012
59597 721012 719795 717918 715320 712481 710036 707780 705067 702117 699996 699216 699256 699600 700354 701578 702718
59582 702718 703075 702351 700551 697839 694630 691320 687853 683950 679740 675639 671755 668055 665028 663391 663082
59567 663082 663265 663454 663877 664687 665577 666396 667407 668666 669799 670611 671332 672010 672291 672057 671771 671997 672997
59550 672997 674843 677367 679965 682095 683997 686314 689030 691597 694199 698043 704131 712414 722400 734016
59536 734016 747845 765116 787129 813492 840692 863677 879425 888377 892547 893721 893876 895544 900246
59523I00246P003P644P566P394O409M143J404j068l696p050j0663j3571j5381
59510H90380j6300j6678j6870j6985j6607j5342j3678j2510j1766j0395p991n495
59498G29763l951l328k980k577k050j215j0J200J992K365K629L001L456L888M372
59483G36555N265O860Q864J0535J1574J2459J3603J4726J5480J6183J7295J8589
59471H87988J9387J9173J7521J3987Q851L445r73m122n951n855l663n86K086M698
59457I55986Q376J2917J6973J9955K2335K4244K5314K5964K7345K9716L2096L3596
59445A234817L3946L2485K7936J9543P696o554k1460l4200m2081m4596m3404m0170
59433A123958l5619l0652k6750k4581k3305k1795j9620j6629j2746q576n070k120
$$ plain form
59523 900246 907249 914893 922459 929853 936262 940405 941809 940741 937045 929995 919332 905761 890380
59510 890380 874080 857402 840532 823547 806940 791598 777920 765410 753644 743249 735258 729763
59498 729763 725812 722484 719504 716927 714877 713662 713652 714852 716844 719209 721838 724839 728295 732183 736555
59483 736555 741820 748680 757544 768079 779653 792112 805715 820441 835921 852104 869399 887988
59471 887988 907375 926548 944069 958056 966907 970352 969379 965257 959306 953451 949788 949202 951288 955986
59457 955986 964362 977279 994252 1014207 1036542 1060786 1086100 1112064 1139409 1169125 1201221 1234817
59445 1234817 1268763 1301248 1329184 1348727 1356423 1349869 1328409 1294209 1252128 1207532 1164128 1123958
59433 1123958 1088339 1057687 1030937 1006356 983051 961256 941636 925007 912261 903685 898615 896495
59421H96495J470O149J0904J4715J7576J9719K1074K1983K3166K4511K5159K5190
59409A108111K5421K4672J9295P186q821k3175l2291l5779l4358k8865k0845j1913
59397I88638k414P554J5521J7035R796l509j7281k7316l2689l4396l3459l0396
59385H57084k5747k0468j5649j1860q949o569m746l704l249k700j572n9J285K256
59371G55353L162M241N097N022L938K693K298L004M326N712O917P931Q893R923
59357H28510J0877J1481J1935J2990J5041J7563J9920K2201K4712K7075K8642
59346A030947K9430K9794K9501K8099K5913K3640K1056J7237J2079O538J206m236
59334A251204r967j5491k0498k5171k9212l1598l1876l0940k9854k8703k7044
$$ plain form
59421 896495 897965 904114 915018 929733 947309 967028 988102 1010085 1033251 1057762 1082921 1108111
59409 1108111 1133532 1158204 1177499 1184685 1175864 1152689 1120398 1084619 1050261 1021396 1000551 988638
59397 988638 986224 993778 1009299 1026334 1036130 1032621 1015340 988024 955335 920939 887480 857084
59385 857084 831337 810869 795220 783360 774411 767842 763096 759392 756143 753443 751871 751812 753097 755353
59371 755353 758515 762756 767853 772875 776813 779506 781804 784808 789134 794846 801763 809694 818587 828510
59357 828510 839387 850868 862803 875793 890834 908397 928317 950518 975230 1002305 1030947
59346 1030947 1060377 1090171 1119672 1147771 1173684 1197324 1218380 1235617 1247696 1254234 1255440 1251204
59334 1251204 1241237 1225746 1205248 1180077 1150865 1119267 1087391 1056451 1026597 997894 970850
59323I70850k4860k2446j9932j7446j5296j3605j2152j0824r723q718p552o504
59311H01792o101o004n174l511k282k309k703k252j148l78m6O09J835L059L936
59296G79323M855O383Q685J1588J4730J7502J9067J8561J5390R690K584m270r595
59283H94493j2812j3739j2525r918o968m193j321K063O064J0500J4821J8107J9836
59270I04408K0612K1381K1979K1381J9360J6666J3484R042L311k252o459r805
59258A033108j3220j6379j8434j9577k0589k1262k0538j8169j5176j2580j0542
59247H46642q817p379o271n281l960j874J101M541P659R961J1607J2997J4133
59234H75059J4549J3769J1773R130O587M366K030p45l707o679j0113j4107j7409
$$ plain form
59323 970850 945990 923544 903612 886166 870870 857265 845113 834289 824566 815848 808296 801792
59311 801792 795691 789687 784513 781002 778720 776411 773708 771456 770308 769930 769884 770493 772328 775387 779323
59296 779323 784178 790561 799246 810834 825564 843066 862133 880694 896084 905774 908358 904088 894493
59283 894493 881681 867942 855417 845499 838531 834338 833017 835080 841144 851644 866465 884572 904408
59270 904408 925020 946401 968380 989761 1009121 1025787 1039271 1048313 1051624 1049372 1042913 1033108
59258 1033108 1019888 1003509 985075 965498 944909 923647 903109 884940 869764 857184 846642
59247 846642 837825 830446 824175 818894 814934 813060 814161 818702 826361 836322 847929 860926 875059
59234 875059 889608 903377 915150 924280 930867 935233 937263 936518 932811 926132 916019 901912 884503
59221H84503j8524j7690j6526j5739j4525j2404j0210q680p370n729m161l194
59209G49751k514j610o07K80J341K629L439L238K529K060J889J844K147K794L059
59194G72269K399J222J02j043k162k459j502k39L00O43J943L891M879M154K704
59179G87101J886K126L005L910M496M983N932P400Q708R456J0254J1790J3702
59166H74749J5112J5836J6187J6005J4847J2870J0637Q148M921R77l039o678r918
59153I70654j2662j4654j5977j6924j7375j6819j5182j3213j1923j1774j2349
59142H11802j2647j1986j0675r608r099q673q085p777p915p814o870n411l984
59129G01258k552j050J5M34J127K966N293O716P121P739R251J1036J2334J3249
$$ plain form
59221 884503 865979 848289 831763 816024 801499 789095 778885 770205 762835 757106 752945 749751
59209 749751 747237 745627 745020 745300 746641 749270 752709 755947 758476 760536 762425 764269 766416 769210 772269
59194 772269 774668 775890 775992 774949 772787 770328 768826 768587 768887 769530 771473 775364 780243 784397 787101
59179 787101 788987 791113 794118 798028 802524 807507 813439 820839 829547 839003 849257 861047 874749
59166 874749 889861 905697 921884 937889 952736 965606 976243 984391 989312 990289 987250 980572 970654
59153 970654 957992 943338 927361 910437 893062 876243 861061 847848 835925 824151 811802
59142 811802 799155 787169 776494 766886 757787 749114 741029 733252 725337 717523 710653 705242 701258
59129 701258 698706 697656 697671 698105 699232 702198 707491 714207 721328 729067 738318 749354 761688 774937
59115G74937J4220J5179J5643J5290J4291J3310J3046J3468J3673J2888J1355
59104I27300R858Q719P704O641N485M021K134K37j080j740k137k525k828k850
59090I58939k345j192J94R59O66k51j231k380m070o235q491j0552j2118j2858
59076H99035j2910j2953j3356j3734j3701j3342j2543j0726q011n816n299n801
59064G70843n785m813l565k400j142p8J9r82k277l068l171k715j927j260j108
59049G36571j303j298q22J8J045K076K820L128L067K535J228o79k323l078l221
59034G39764l213k933k156j157k31R04K525M230N562O808Q451J0297J1886J3323
59020G94060J4915J6360J7065J6958J6287J4888J2366Q808M811J098j548k526
$$ plain form
59115 774937 789157 804336 819979 835269 849560 862870 875916 889384 903057 915945 927300
59104 927300 937158 945877 953581 960222 965707 969728 971862 972099 971019 969279 967142 964617 961789 958939
59090 958939 956594 955402 955596 956555 957221 956970 955739 953359 949289 943054 934563 924011 911893 899035
59076 899035 886125 873172 859816 846082 832381 819039 806496 795770 787759 781943 776644 770843
59064 770843 765058 760245 756680 754280 753138 753060 753079 752097 749820 746752 743581 740866 738939 737679 736571
59049 736571 735268 733970 733148 733166 734211 736287 739107 742235 745302 747837 749065 748386 746063 742985 739764
59034 739764 736551 733618 731462 730305 730074 730978 733503 737733 743295 750103 758554 768851 780737 794060
59020 794060 808975 825335 842400 859358 875645 890533 902899 911707 916518 917616 916068 913542
59008I13542k072j245o86OJ318L027M883P169R878J2162J3433J4170J4806J4751
58994A005142J3538J2011J1173J0541Q983O572M273K224l60l749p271j0254j2433
58981A040390j3625j3761j3099j1815r799p317n142l430j346J528M357O566Q934
58968I82441J2096J5072J6753J7856J9790K2284K3732K3388K1721J9104J5601
58957A189838J1578P129J431n934j3541j9379k3044k5427k6970k7639k7845k7751
58945A012446k6422k3298j9719j7266j5350j2400q712n917m242k596j051q81k152
58932H72440l495m259m924n416n183m846n621o996p235o251n692n951n434l310
58918G97827p87R61K065K665K465K151L154N295O642O441O236P294Q903J0098
$$ plain form
59008 913542 911470 910225 909539 909545 910863 913890 918773 925942 935820 947982 961415 975585 990391 1005142
58994 1005142 1018680 1030691 1041864 1052405 1061388 1067960 1072233 1074457 1074097 1070348 1063077 1052823 1040390
58981 1040390 1026765 1013004 999905 988090 978291 970974 965832 962402 961056 962584 966941 973507 982441
58968 982441 994537 1009609 1026362 1044218 1064008 1086292 1110024 1133412 1155133 1174237 1189838
58957 1189838 1201416 1208545 1209976 1204042 1190501 1171122 1148078 1122651 1095681 1068042 1040197 1012446
58945 1012446 986024 962726 943007 925741 910391 897991 889279 883362 879120 876524 875473 874592 872440
58932 872440 868945 864686 859762 854346 849163 844317 838696 831700 824465 818214 812522 806571 801137 797827
58918 797827 797040 798001 800066 802731 805196 807347 810501 815796 822438 828879 835115 842409 851312 861410
58904H61410J1189J2539J3638J4344J5540J7536J9393K0581K1759K3146K3819
58893A054894K3573K3752K5218K7084K8535L0369L3549L7563M1161M3532M3864
58882A413094M1191L5745K9166K2460J5081O796j127p781j4214k1722k9629l5990
58870A453070l9719m0957m0203l8107l5475l2684k9639k6662k4536k3341k2334
58859A099413k1225k0438j9882j8874j7599j7067j7280j7051j6035j5167j4644
58848I04151j3441j1546j0464j0627j0420q975p794q143q831q379p530p686q326
58835G81989p944o500n117m297l955m282n070n093l628j678m41M82J909L361M027
58820G43763M437N453O403N953M306K997K924L761M849N490M878K893N63j112
$$ plain form
58904 861410 872599 885138 898776 913120 928660 946196 965589 986170 1007929 1031075 1054894
58893 1054894 1078467 1102219 1127437 1154521 1183056 1213425 1246974 1284537 1325698 1369230 1413094
58882 1413094 1454285 1490030 1519196 1541656 1556737 1563533 1562406 1554625 1540411 1518689 1489060 1453070
58870 1453070 1413351 1372394 1332191 1294084 1258609 1225925 1196286 1169624 1145088 1121747 1099413
58859 1099413 1078188 1057750 1037868 1018994 1001395 984328 967048 949997 933962 918795 904151
58848 904151 890710 879164 868700 858073 847653 838678 830884 822741 813910 805531 798001 790315 781989
58835 781989 774045 767545 762428 758131 754176 749894 744824 739731 736103 734425 733984 734466 736375 739736 743763
58820 743763 748200 753653 760056 766009 770315 773312 776236 779997 784846 790336 795214 798107 798670 797558
58806G97558k197l017l294k970k878l534m183m049l583l447l360l024l098l964
58792G50960m683m386l629l105k133K9K442L682L996M624N722O503O810O988O700
58777G80520N396L607K459K168K079J784J188K5j666l131l904m510n390n951n701
58762G68973n298n372n294m309k975k105j212N66K736M122M607M902N193N213
58748G69747N161N331N491N602O320P801Q984R176R228R897J0263R313Q010Q046
58734H78370R296J0267J0381J0223J0143J0093J0333J0887J0937J0043R159R106
58722I99238R049Q039O981P324Q667R553R822J0280J0710J0228R086Q088O707
58709A113772L832Q1k767m523o805j0424j4307j7254j9219k0700k2173k4133k6481
$$ plain form
58806 797558 795361 792344 789050 786080 783202 779668 775485 771436 767853 764406 761046 758022 754924 750960
58792 750960 746277 741891 738262 735157 733024 733053 735495 739177 743173 747797 753519 760022 766832 773820 780520
58777 780520 785916 789523 791982 794150 796229 798013 799201 799226 797560 794429 790525 786015 780625 774674 768973
58762 768973 763675 758303 753009 748700 745725 743620 742408 742974 745710 749832 754439 759341 764534 769747
58748 769747 774908 780239 785730 791332 797652 805453 814437 823613 832841 842738 853001 862314 870324 878370
58734 878370 887666 897933 908314 918537 928680 938773 949106 959993 970930 980973 990132 999238
58722 999238 1008287 1016326 1023307 1030631 1039298 1048851 1058673 1068953 1079663 1089891 1098977 1107065 1113772
58709 1113772 1117604 1117685 1114918 1110395 1103590 1093166 1078859 1061605 1042386 1021686 999513 975380 948899
58696I48899k8029k7770k6368k5076k3746k1277j7731j4350j1802r854q502p910
58684G26484p455o439n495n801p013p594p052o343o003n440m263k941j900r18
58670F51827L41K088M578P758J0977J3718J6207J8612K0295K0660J9870J7815
58658H04746J3550P093P02l262n039o552q536j0193j0948j0908j0115q844q101
58645G43593q350q449p237n355l958k649n19J779L017L657M958O470O724N888
58631G39569N453N502M601K401J92j269k527l726l989k880j110N47J985L472N517
58616G53738Q702J2594J5575J6768J7206J7818J7463J4633J0056N657J903j782
58604H90331m903o414o748p195p801p824p557p727p805o954n786n191m346k141
$$ plain form
58696 948899 920870 893100 866732 841656 817910 796633 778902 764552 752750 742896 734394 726484
58684 726484 719029 712590 707095 701294 694281 686687 679635 673292 667289 661849 657586 654645 652745 651827
58670 651827 652168 654256 658834 666592 677569 691287 707494 726106 746401 767061 786931 804746
58658 804746 818296 825389 826091 822829 817790 811238 802702 792509 781561 770653 760538 751694 743593
58645 743593 735243 726794 719557 714202 710244 707595 707076 708855 711872 715529 720487 726957 733681 739569
58631 739569 745022 750524 755125 757526 757718 756449 753922 750196 746207 743327 742217 742764 744749 748221 753738
58616 753738 762440 775034 790609 807377 824583 842401 859864 874497 884553 890210 892113 890331
58604 890331 885428 879014 872266 865071 857270 849446 841889 834162 826357 819403 813617 808426 804080 801939
58590H01939M87K087L441O144R477J1567J2790J4937J7651J8961J8822J8826J8765
58577I55894J6795J3095J0013Q423P046N575N390O738Q251R618J1962J5274J8299
58564A092373K1049K4592K8238L0000K9980L0060L0020K7378K1571J4905Q741
58553A358907K262m257q603j0268j1570j3783j5225j4653j3496j3216j3214j2958
58541A229926j3590j5867j8768k1358k3815k5697k5721k4191k3055k2582k0737
58530I94545j6845j2930j0299p761m604k246j332j03K525M934N647N591N775N272
58516I68169L450J728J184O88o30j425p02j35j536l921n195n162m860m409l482
58501I43762k611k315k084j576j568k576l836m616n089n129l994j970m98J31J237
$$ plain form
58590 801939 802426 804513 807954 814098 823575 835142 847932 862869 880520 899481 918303 937129 955894
58577 955894 972689 985784 995797 1004220 1011266 1016841 1022231 1028969 1037220 1046838 1058800 1074074 1092373
58564 1092373 1113422 1138014 1166252 1196252 1226232 1256292 1286312 1313690 1335261 1350166 1358907
58553 1358907 1361169 1356912 1348309 1338041 1326471 1312688 1297463 1282810 1269314 1256098 1242884 1229926
58541 1229926 1216336 1200469 1181701 1160343 1136528 1110831 1085110 1060919 1037864 1015282 994545
58530 994545 977700 964770 954471 946710 942106 939860 938528 938425 940950 945884 951531 957122 962897 968169
58516 968169 971619 973347 974531 975219 974589 973164 972462 972327 970791 966870 961675 956513 951653 947244 943762
58501 943762 941151 938836 936752 935176 933608 931032 927196 922580 917491 912362 908368 906398 905900 906031 907268
58486I07268L213M727N255O108P995R922J1545J4144J8037K1404K2855K2924K1918
58473A077315J8822J3629Q298L956n09n799j0558j3664j5703j6860j5966j3068
58461A029893j0345q945p397m558j569P21L458P222J0330J1586J2141J2822J2099
58448A067458Q687L871o41m902r056j1807j2440j2154j1790j0408p597m821k923
58435I91477q06J953L798M030M257N494O544O864Q050J0817J3433J4922J6647
58422A087480J8942J9439J6819J3040R769N903Q68l126m651n655p846r724r872
58409A131386r991j1714j3480j3539j3096j3503j3257j0898q032o481n134k605
58397A009656k47N08J076K949M750M931M665N131M851K732Q10P90Q70p77k398
$$ plain form
58486 907268 910481 915208 920463 926571 934566 944488 956033 970177 988214 1009618 1032473 1055397 1077315
58473 1077315 1096137 1109766 1118064 1122020 1121511 1115712 1105154 1091490 1075787 1058927 1042961 1029893
58461 1029893 1019548 1010603 1003206 998648 997079 997800 1001258 1008480 1018810 1030396 1042537 1055359 1067458
58448 1067458 1076145 1080016 1079375 1074473 1065417 1053610 1041170 1029016 1017226 1006818 999221 994400 991477
58435 991477 990671 992624 996422 1000452 1004709 1010203 1016747 1023611 1031661 1042478 1055911 1070833 1087480
58422 1087480 1106422 1125861 1142680 1155720 1165489 1171392 1172260 1169134 1164483 1158828 1150982 1141258 1131386
58409 1131386 1121395 1109681 1096201 1082662 1069566 1056063 1042806 1031908 1023876 1017395 1012261 1009656
58397 1009656 1009409 1009917 1010993 1013942 1018692 1023623 1028288 1033419 1038270 1041002 1041812 1042602 1043472 1042695 1040297
58382A040297j849m00K2M80K401M248M294L934M824N657N183N335P712J0148J0489
58367A102775J0576J2610J4838J5026J4940J7011J9520J9679J8660J9029J9818
58356A284482J8617J6074J3892J1058O370K099O35K36j531k962j455J400K698
58343A351613L367N614Q069Q557Q909J1815J5507J6808J6972J9062K2018K2761
58331A511072K1891K1902K1953J9788J6696J5172J3831R973N132K719K279J325
58319A663733N84K146M623N445N729P700R848R889R763J2265J5582J6678J7030
58306A781015J9251K1362K0593J9434K1433K4292K3942K2156K2905K4503K2850
58295B023736J9674J9658K2033K2645K1949K3249K5444K5332K4638K6961L0244
$$ plain form
58382 1040297 1038448 1038048 1038070 1038550 1040951 1045199 1049493 1053427 1058251 1063908 1069091 1074426 1082138 1092286 1102775
58367 1102775 1113351 1125961 1140799 1155825 1170765 1187776 1207296 1226975 1245635 1264664 1284482
58356 1284482 1303099 1319173 1333065 1344123 1350493 1352592 1353227 1353463 1351932 1348970 1347515 1348915 1351613
58343 1351613 1354980 1360594 1368663 1377220 1386129 1397944 1413451 1430259 1447231 1466293 1488311 1511072
58331 1511072 1532963 1554865 1576818 1596606 1613302 1628474 1642305 1652278 1657410 1660129 1662408 1663733
58319 1663733 1664317 1666463 1671086 1676531 1682260 1689960 1699808 1709697 1719460 1731725 1747307 1763985 1781015
58306 1781015 1800266 1821628 1842221 1861655 1883088 1907380 1931322 1953478 1976383 2000886 2023736
58295 2023736 2043410 2063068 2085101 2107746 2129695 2152944 2178388 2203720 2228358 2255319 2285563
58284B285563L0138K8349K9556L2657L3356L2719L4720L7976L8580L8477M2002
58273B664093M6922M8103M7318M9891N4423N5720N5241N8366O3816O6188O6531
58262C276612O9813P4430P5167P4020P6705Q0914P9857P5214P4406P7141P7075
58251D111354P4827P6621Q1851Q4820Q7052R4664J05439J11987J15694J23660
58241E067969J34109J39552J42140J50314J62329J69257J72492J81447J95478
58232F515087K05627K12843K26346K45021K59264K70359K88602L13070L33421
58223H869640L50905L76543M09237M37827M64027N00091N44582N85210O25010
58214A3163072O79332P47238Q14002Q81825R68210J073761J183909J303110J452878
$$ plain form
58284 2285563 2315701 2344050 2373606 2406263 2439619 2472338 2507058 2545034 2583614 2622091 2664093
58273 2664093 2711015 2759118 2806436 2856327 2910750 2966470 3021711 3080077 3143893 3210081 3276612
58262 3276612 3346425 3420855 3496022 3570042 3646747 3727661 3807518 3882732 3957138 4034279 4111354
58251 4111354 4186181 4262802 4344653 4429473 4516525 4611189 4716628 4828615 4944309 5067969
58241 5067969 5202078 5341630 5483770 5634084 5796413 5965670 6138162 6319609 6515087
58232 6515087 6720714 6933557 7159903 7404924 7664188 7934547 8223149 8536219 8869640
58223 8869640 9220545 9597088 10006325 10444152 10908179 11408270 11952852 12538062 13163072
58214 13163072 13842404 14589642 15403644 16285469 17253679 18327440 19511349 20814459 22267337
58205B2267337J635109J834943K061513K345593K696135L104838L596296M224542
58197D3766306N020130O001054P241176Q861813J0950038J3560323J6794060K0764873
58189A32959773K5451223L0658457L6032931M0762847M3097895M0599367L1619453
58182C81181946J6947246j07925j5504898k6550645l2622188l4479947l3290059
58175B55573530l0151921k6060926k1931329j8503891j6166313j4826541j4018276
58168A13914333j3241582j2261104j1108470r886961q657655p470880o389523
58161D4898158n445305m624930l916378l326771k847208k443866k096108j808325
58153A8389267j576350j376707j197793j050027r36121q39745p51452o79002o24166
$$ plain form
58205 22267337 23902446 25737389 27798902 30144495 32840630 35945468 39541764 43766306
58197 43766306 48786436 54787490 62028666 70890479 81840517 95400840 112194900 132959773
58189 132959773 158410996 189069453 225102384 265865231 308963126 349562493 381181946
58182 381181946 398129192 398021267 382516369 355965724 323343536 288863589 255573530
58175 255573530 225421609 199360683 177429354 158925463 142759150 127932609 113914333
58168 113914333 100672751 88411647 77303177 67416216 58758561 51287681 44898158
58161 44898158 39452853 34827923 30911545 27584774 24737566 22293700 20197592 18389267
58153 18389267 16812917 15436210 14238417 13188390 12252269 11412524 10661072 9982070 9357904
58144I357904n74208n23753m81795m50125m16857l77923l43878l18983k93632
58135E576750k63647k37724k19626k01678j81934j69743j67793j65602j57225
58126C811778j49347j45885j40305j29484j20230j15699j09456r8905r0993q8817
58116B622657q5750p8461p2929p2013o9648o2925n7858n7433n5818n0062m6114
58105A913646m7355m8204m4920m2275m3585m4170m0590l6918l6260l5074l1243
58094A463052k8855k9810k9371k5099k1693k1978k1547j7491j4087j4636j5546
58083A222939j3842j2948j5752j9045j9890k0685k3126k3977k1492j9440k0155
58072A012587k0137j7048j4502j5338j6391j4618j2443j2460j2590j0867r430
$$ plain form
58144 9357904 8783696 8259943 7778148 7328023 6911166 6533243 6189365 5870382 5576750
58135 5576750 5313103 5075379 4855753 4654075 4472141 4302398 4134605 3969003 3811778
58126 3811778 3662431 3516546 3376241 3246757 3126527 3010828 2901372 2802467 2711474 2622657
58116 2622657 2536907 2458446 2385517 2313504 2243856 2180931 2123073 2065640 2009822 1959760 1913646
58105 1913646 1866291 1818087 1773167 1730892 1687307 1643137 1602547 1565629 1529369 1494295 1463052
58094 1463052 1434197 1404387 1375016 1349917 1328224 1306246 1284699 1267208 1253121 1238485 1222939
58083 1222939 1209097 1196149 1180397 1161352 1141462 1120777 1097651 1073674 1052182 1032742 1012587
58072 1012587 992450 975402 960900 945562 929171 914553 902110 889650 877060 866193 856763
58061H56763r671q889n775l733m886o320n942o370r145j0940r543q087r130j0020
58047G48312q272o224o139n932l916k758m320n630m305l174n025p412p163n721
58033F72321n600n655m313l590n553q235r092r102r864j0080q531o989o908o642
58019E72167n108m409n678o338m663l104l665m154k500p79j166j831o81N95O0
58004E28746n47P08K066J544Q26J846K877J889O56J466K894K684J969K704L707
57989E56035L052J785J625J583L26p41k24J18j553l605l798l085l151l025j552
57974E43790m90j499k706j882m80r25k348k644k318k647k448l87J749J719O97
57959E27181Q99J617J139M35J217K347J911R24J396K494K349J808K746M259M198
$$ plain form
58061 856763 847092 838203 832428 828695 823809 817489 811547 805177 796032 785092 775549 767462 758332 748312
58047 748312 740040 733816 727677 721745 717829 715071 710751 705121 700816 697642 692617 685205 678042 672321
58033 672321 666721 661066 656753 653163 647610 639375 630283 621181 611317 601237 592706 585717 578809 572167
58019 572167 567059 562650 556972 550634 545971 542867 539202 535048 532548 531769 530603 528772 528091 528686 528746
58004 528746 528199 528907 530973 532517 533343 535189 538066 539955 540611 542077 544971 547655 549624 552328 556035
57989 556035 559087 560872 562497 564080 564406 563665 563441 563559 562006 558401 554603 551518 548367 545342 543790
57974 543790 543300 541801 539095 537213 536733 535808 533460 530816 528498 525851 523403 523016 524765 526484 527181
57959 527181 528080 529697 530836 531271 532488 534835 536746 537670 539066 541560 543909 545717 548463 552722 556920
57944E56920L094L013L863M190M330N503P024P493P554Q587R975J0390J0303J0526
57930F52765R993P765N436M633M025J745j185k920m234o589q733q765p914q631
57916F37391j0431j1095j0592j0335r877p942n563m733m914m122k446j376q41
57903E53124K9M35o03j678j134l44j438l107k477M3J495J158Q62J187J062P28
57887E49342J571L136L502K452J437P65l50j483j593j349k094l229l401l340m562
57872E40804o151o108n020n044n958n668m134l282l363k794j441p43o58K78J879
57857D92597K492K219K877M662N839N833N753N829N235M447M809N721N148L087
57843E56548J625J413J003j43q24o30n91r96j074j032j851k946k650j083QL71
$$ plain form
57944 556920 560014 563027 566890 571080 575410 580913 587937 595430 602984 611571 621546 631936 642239 652765
57930 652765 662758 670523 675959 680592 684617 686362 685177 682257 678023 671434 662701 653936 646022 637391
57916 637391 626960 615865 605273 594938 585061 577119 571556 566823 561909 557787 555341 553965 553124
57903 553124 553153 553588 552985 551307 550173 549829 548391 545284 542807 542850 544345 545503 546365 547552 548614 549342
57887 549342 550913 554049 557551 560003 561440 562205 561855 560372 558779 557430 555336 552107 548706 545366 540804
57872 540804 534653 528545 523525 518481 512523 506855 502721 499439 496076 493282 491841 491098 490440 490718 492597
57857 492597 495089 497308 500185 504847 510686 516519 522272 528101 533336 537783 542592 548313 553461 556548
57843 556548 558173 559586 560589 560446 559622 558992 558401 557405 556331 555299 553448 550502 547852 546769 546777 547148
57827E47148J371L026L750L408L702N026N707M995M218M249M297L825L409L064
57813F01195J940J55j064j434j790k117j608q36j453l445m990n335n519o067o244
57798E61388n917n831n795m867l473l013l229k451o66L41J39K98J381K019J678
57783E32002J725K965M391N232O009O857P048O834P509Q997R588Q754P998Q135
57769F24044P955O433M250K301N75p86j279j466k685m895o609p272p651p722o616
57754E98577m930m526n439n533l963k411k129k212j708j074o08K04R23J50j785
57739E63536k638j654p00q83q30L95J393J071O82J396K119J602P48Q67J463J622
57723E70189J854K721L261K614J792K049K749K642J995J796J931J751J454J514
$$ plain form
57827 547148 548519 551545 555295 558703 562405 567431 573138 578133 582351 586600 590897 594722 598131 601195
57813 601195 603135 603290 602226 600792 599002 596885 595277 594441 592988 589543 584553 579218 573699 567632 561388
57798 561388 555471 549640 543845 538978 535505 532492 529263 526812 526146 526487 526626 526924 528305 530324 532002
57783 532002 533727 536692 541083 546315 552324 559181 566229 573063 580572 589569 599157 607911 615909 624044
57769 624044 631999 638432 642682 644983 645558 644772 643493 642027 639342 634447 627838 620566 612915 605193 598577
57754 598577 593647 589121 583682 578149 574186 571775 569646 567434 565726 564652 564044 564248 565171 565321 563536
57739 563536 560898 559244 558544 557661 556831 557226 558619 559690 560372 561768 563887 565489 566237 567104 568567 570189
57723 570189 572043 574764 578025 580639 582431 584480 587229 589871 591866 593662 595593 597344 598798 600312
57709F00312J628J413J283J555J744J647J933K777L210K892K980M221N553N941
57695F39089O132P171Q393Q328O675M136J236j583l619m603m946m608k944l02
57681F58555J684K328K919M605O812Q843J1464J5570K0707K6380L3470M2875N3850
57668H90062O5127P6420Q7039R3794R1880P7915N1854J7392j8491m7995o6596
57657A318401p4869p5850p1816o4339n5619m7667m0776l4220k7997k2723j8439
57646G84086j4723j1542r023o907n028l782l317k892j796l39P05J074R88Q13J098
57631G29415K103L078L013K273K211K966L212K415J659J616J491Q27O08J486K468
57616G60841K518K054J796J552J181J319K053K365J928K014L341M599M409L385
$$ plain form
57709 600312 601940 603353 604636 606191 607935 609582 611515 614292 617502 620394 623374 627595 633148 639089
57695 639089 645221 652392 660785 669113 675788 679924 681160 679577 675958 671355 666409 661801 658857 658555
57681 658555 660239 662567 665486 670091 676903 685746 697210 712780 733487 759867 793337 836212 890062
57668 890062 955189 1031609 1118648 1212442 1304322 1382237 1434091 1451483 1432992 1384997 1318401
57657 1318401 1243532 1167682 1095866 1031527 975908 928241 887465 853245 825248 802525 784086
57646 784086 769363 757821 748798 741891 736863 733081 729764 726872 725076 724737 725442 726516 727504 728317 729415
57631 729415 731518 734596 737609 739882 742093 745059 748271 750686 752345 753961 755452 756279 756887 758373 760841
57616 760841 763359 765413 767209 768761 769942 771261 773314 775679 777607 779621 782962 787561 791970 795355
57602G95355K883K997L165L482M024M073L357K842L131L279K480J550J444J695
57588H35757J668J936K911L598L259K938L624M370L958L114L114L502L137K428
57574H79314K458K874K747K630L599M992N217M292L609L602L610L627M261N198
57560I32030N469N152N200N749O020N715N229M736M330M654O099P768Q451Q181
57546A014783P730P259O612O278O639O944O396N651N836O770P492P816Q034P808
57532A112048O881O118O374O969O840O338O391O676O401O117O899Q281Q892Q688
57518A209913Q703R088R145Q970R281R947J0357J0820J1892J2781J2255J0776
57506A333928R936J0030J0042R725R791J0218J0197R719R504R481Q988Q259Q048
$$ plain form
57602 795355 798238 801235 804400 807882 811906 815979 819336 822178 825309 828588 831068 832618 834062 835757
57588 835757 837425 839361 842272 845870 849129 852067 855691 860061 864019 867133 870247 873749 876886 879314
57574 879314 881772 884646 887393 890023 893622 898614 903831 908123 911732 915334 918944 922571 926832 932030
57560 932030 937499 942651 947851 953600 959620 965335 970564 975300 979630 984284 990383 998151 1006602 1014783
57546 1014783 1022513 1029772 1036384 1042662 1049301 1056245 1062641 1068292 1074128 1080898 1088390 1096206 1104240 1112048
57532 1112048 1118929 1125047 1131421 1138390 1145230 1151568 1157959 1164635 1171036 1177153 1184052 1192333 1201225 1209913
57518 1209913 1218616 1227704 1236849 1245819 1255100 1265047 1275404 1286224 1298116 1310897 1323152 1333928
57506 1333928 1343864 1353894 1363936 1373661 1383452 1393670 1403867 1413586 1423090 1432571 1441559 1449818 1457866
57493A457866Q023P338O517O891Q277R172R141R107R327R112Q618Q876R770R990
57479A578025R305R017R760J0650J0989J1066J0900R988Q816Q805J0161J1375
57467A698857J1475J1218J1429J1808J2060J2669J3717J4241J3700J2860J2465
57456A836499J2187J1647J1461J2325J3871J5138J5590J5229J4381J3759J3997
57445A986084J4789J5182J4884J4583J4839J5435J5989J6465J6883J7147J7265
57434B159545J7186J6684J5949J5854J6801J7798J7722J7002J6863J7436J7913
57423B346753J8178J8742J9368J9270J8630J8398J8657J8675J8436J8630J9176
57412B552913J9344J9279J9836K0844K1192K0785K0718K1291K1525K1040K0750
$$ plain form
57493 1457866 1465889 1473227 1479744 1486635 1494912 1504084 1513225 1522332 1531659 1540771 1549389 1558265 1568035 1578025
57479 1578025 1587330 1596347 1606107 1616757 1627746 1638812 1649712 1659700 1668516 1677321 1687482 1698857
57467 1698857 1710332 1721550 1732979 1744787 1756847 1769516 1783233 1797474 1811174 1824034 1836499
57456 1836499 1848686 1860333 1871794 1884119 1897990 1913128 1928718 1943947 1958328 1972087 1986084
57445 1986084 2000873 2016055 2030939 2045522 2060361 2075796 2091785 2108250 2125133 2142280 2159545
57434 2159545 2176731 2193415 2209364 2225218 2242019 2259817 2277539 2294541 2311404 2328840 2346753
57423 2346753 2364931 2383673 2403041 2422311 2440941 2459339 2477996 2496671 2515107 2533737 2552913
57412 2552913 2572257 2591536 2611372 2632216 2653408 2674193 2694911 2716202 2737727 2758767 2779517
57401B779517K1256K1977K2307K2385K2284K1747K1095K1159K2043K3038K3836
57390C022644K4693K5452K5725K5910K6602K7195K6751K6012K6525K7891K8102
57379C313502K6865K6236K7318K8692K8983K8847K9233K9566K8991K7930K7137
57368C623300K6519K5936K5925K6636K7223K7191K7194K7746K8367K8710K9247
57357C923994L0063L0299K9592K8818K8643K8717K8961L0138L2241L3836L4006
57346D259308L3561L3373L2927L1776L0930L1407L2555L3188L3366L3790L4295
57335D620476L4285L3883L3565L3361L3332L4004L5360L6323L6246L5985L6479
57324E003299L7209L7188L6635L6474L6827L7164L7375L7630L7687L7364L7179
$$ plain form
57401 2779517 2800773 2822750 2845057 2867442 2889726 2911473 2932568 2953727 2975770 2998808 3022644
57390 3022644 3047337 3072789 3098514 3124424 3151026 3178221 3204972 3230984 3257509 3285400 3313502
57379 3313502 3340367 3366603 3393921 3422613 3451596 3480443 3509676 3539242 3568233 3596163 3623300
57368 3623300 3649819 3675755 3701680 3728316 3755539 3782730 3809924 3837670 3866037 3894747 3923994
57357 3923994 3954057 3984356 4013948 4042766 4071409 4100126 4129087 4159225 4191466 4225302 4259308
57346 4259308 4292869 4326242 4359169 4390945 4421875 4453282 4485837 4519025 4552391 4586181 4620476
57335 4620476 4654761 4688644 4722209 4755570 4788902 4822906 4858266 4894589 4930835 4966820 5003299
57324 5003299 5040508 5077696 5114331 5150805 5187632 5224796 5262171 5299801 5337488 5374852 5412031
57313E412031L7644L8325L8542L8482L8844L9654M0243M0124L9459L8866L9020
57302E841234L9949M0658M0202L9078L8653L9093L9207L8569L8298L9116M0099
57291F274156M0269M0099M0386M0765M0547M0108M0240M0773M0896M0370L9666
57280F718275L9268L9377L9752L9602L8392L6929L6581L7217L7232L6033L4941
57269G133599L5015L5505L5413L5081L5099L5042L4445L3940L4182L4709L5001
57258G517031L5536L6694L7597L7319L6373L5804L5620L5184L4382L3424L2262
57247G907226L1081L0424L0089K8946K6723K4699K3644K2539K0466J8326J7257
57236H181420J6687J5603J4513J4383J4725J4588J4558J5807J7826J9044J9253
$$ plain form
57313 5412031 5449675 5488000 5526542 5565024 5603868 5643522 5683765 5723889 5763348 5802214 5841234
57302 5841234 5881183 5921841 5962043 6001121 6039774 6078867 6118074 6156643 6194941 6234057 6274156
57291 6274156 6314425 6354524 6394910 6435675 6476222 6516330 6556570 6597343 6638239 6678609 6718275
57280 6718275 6757543 6796920 6836672 6876274 6914666 6951595 6988176 7025393 7062625 7098658 7133599
57269 7133599 7168614 7204119 7239532 7274613 7309712 7344754 7379199 7413139 7447321 7482030 7517031
57258 7517031 7552567 7589261 7626858 7664177 7700550 7736354 7771974 7807158 7841540 7874964 7907226
57247 7907226 7938307 7968731 7998820 8027766 8054489 8079188 8102832 8125371 8145837 8164163 8181420
57236 8181420 8198107 8213710 8228223 8242606 8257331 8271919 8286477 8302284 8320110 8339154 8358407
57225H358407J9563K0248K0454J9990J9682J9890K0060J9831J9481J9158J8611
57214H575375J7658J6266J4399J2406J1007J0163Q742O147L344J326m75k922n348
57201H668088o543o915p914r757j1333j2084j2512j2966j3345j3997j5569j7849
57189H527304j9839k1008k1665k2227k2914k3970k5353k6488k7012k7485k8626
57178H260717l0325l2046l3666l5208l6394l7177l8127l9602m1269m3072m5660
57167G848171m9082n2272n4781n7777o2169o6928p0707p3914p7611q1458q4390
57156G117082q6499q8438q9746q9474q7822q5555q2360p7507p1439o5120n8374
57145F234748n0655m2849l6459l1419k6515k1698j8248j6897j7419j9810k4229
$$ plain form
57225 8358407 8377970 8398218 8418672 8438662 8458344 8478234 8498294 8518125 8537606 8556764 8575375
57214 8575375 8593033 8609299 8623698 8636104 8647111 8657274 8666016 8672163 8675507 8676833 8676358 8673436 8668088
57201 8668088 8661545 8654630 8646716 8636959 8625626 8613542 8601030 8588064 8574719 8560722 8545153 8527304
57189 8527304 8507465 8486457 8464792 8442565 8419651 8395681 8370328 8343840 8316828 8289343 8260717
57178 8260717 8230392 8198346 8164680 8129472 8093078 8055901 8017774 7978172 7936903 7893831 7848171
57167 7848171 7799089 7746817 7692036 7634259 7572090 7505162 7434455 7360541 7282930 7201472 7117082
57156 7117082 7030583 6942145 6852399 6762925 6675103 6589548 6507188 6429681 6358242 6293122 6234748
57145 6234748 6184093 6141244 6104785 6073366 6046851 6025153 6006905 5990008 5972589 5952779 5928550
57134E928550k9968l5881m1656m7276n1726n3626n2738m9440m3370l4243k3424
57123E465202j2901l168O196J4527K0716K5469L0843L7694M5519N4764O7246Q3920
57111E836027J03752J24874J45754J65638J85525K08497K37670K74187L18502
57102G600426L72826M40600N24411O26837P53086R11035J109000J355288J659127
57093A5352636K029320K471087K984288L562452M190453M843184N488347O090221
57085D7011988O610292P007027P237064P253043O998033O412028N461945M176403
57077I8167823K651457J020714n82229k045535l289923m279084n021812n554617
57069H1066794n914231o121277o182427o101468n888914n566198n163085m710428
$$ plain form
57134 5928550 5898582 5862701 5821045 5773769 5722043 5668417 5615679 5566239 5522869 5488626 5465202
57123 5465202 5452301 5449133 5455329 5469856 5490572 5516041 5546884 5584578 5630097 5684861 5752107 5836027
57111 5836027 5939779 6064653 6210407 6376045 6561570 6770067 7007737 7281924 7600426
57102 7600426 7973252 8413852 8938263 9565100 10318186 11229221 12338221 13693509 15352636
57093 15352636 17381956 19853043 22837331 26399783 30590236 35433420 40921767 47011988
57085 47011988 53622280 60629307 67866371 75119414 82117447 88529475 93991420 98167823
57077 98167823 100819280 101839994 101257765 99212230 95922307 91643223 86621411 81066794
57069 81066794 75152563 69031286 62848859 56747391 50858477 45292279 40129194 35418766
57061C5418766m234969l759818l305608k887352k511156k176580j881792j624994
57053A3036497j402903j211144j046296r05718p85930o83116n94829n19585m55354
57044E431622m00073l53102l14360k82369k54708k30174k08936j90759j74523
57035C022618j59442j45522j32793j20962j09846r9354q9165p9009o8967n8929
57025A958629m8074l5460k0824m403J3758L3978N6036P6955Q8931Q1440M9140
57014B250106j140n3375r3595j17525j28020j28702j22025j10672r7427q3951
57004A313674p1238o0515n2294m5538l9217l3803l0014k7191k4320k1656j9891
56993H87997j8684j7359j6142j5325j4126j1783q924o434l853k52M020P621R297
$$ plain form
57061 35418766 31183797 27423979 24118371 21231019 18719863 16543283 14661491 13036497
57053 13036497 11633594 10422450 9376154 8470436 7684506 7001390 6406561 5886976 5431622
57044 5431622 5031549 4678447 4364087 4081718 3827010 3596836 3387900 3197141 3022618
57035 3022618 2863176 2717654 2584861 2463899 2354053 2254699 2165534 2086525 2017558 1958629
57025 1958629 1910555 1875095 1854271 1849868 1863626 1897604 1953640 2030595 2119526 2200966 2250106
57014 2250106 2248966 2195591 2101996 1984471 1856451 1727749 1605724 1495052 1397625 1313674
57004 1313674 1242436 1181921 1129627 1084089 1044872 1011069 981055 953864 929544 907888 887997
56993 887997 869313 851954 835812 820487 806361 794578 785654 779220 775367 775115 779135 786756 796053
56980G96053P695J597q063j7656k4052k7396k9270k9633k7648k4209k1124j8447
56968E77847j5042j1252q517o658l992k11L227N911R381J4588K0379K5194K8480
56955F39335K9496K6406J8001N644p404j8248k5562k9395l0516k9803k7799k4803
56943E25352k1177j7271j3277r452o120l109K77M355Q632J2881J7912K4505L1986
56930E55494L8426M1566L9159K9688J4150l382j8293k8417l4131l6498l6444l5060
56918E26258l3161l0679k7379k3851k0880j8373j5875j3619j1995j0573q744o874
56906C04255n674m924l983l105k960l240k949j872o22N09J627K470K759L185M846
56891B90322P777J0946J3617J5906J8219K0919K4109K6816K6840K2494J4442N084
$$ plain form
56980 796053 803748 805345 797282 779626 755574 728178 698908 669275 641627 617418 596294 577847
56968 577847 562805 551553 543036 536378 532386 532175 535402 541313 550694 565282 585661 610855 639335
56955 639335 668831 695237 713238 718882 711478 693230 667668 638273 607757 577954 550155 525352
56943 525352 504175 486904 473627 464175 458055 454946 455223 459578 468210 481091 499003 523508 555494
56930 555494 593920 635486 674645 704333 718483 715101 696808 668391 634260 597762 561318 526258
56918 526258 493097 462418 435039 411188 390308 371935 356060 342441 330446 319873 311129 304255
56906 304255 298581 293657 289674 286569 283609 280369 277420 275548 274926 275435 277062 279532 282291 285476 290322
56891 290322 298099 309045 322662 338568 356787 377706 401815 428631 455471 477965 492407 497491
56879D97491l440j0012j4128j5927j6287j5862j4356j1521q127n044k041J406
56867C82152M948Q265J2267J7945K4667L1187L7762M5468N3572N9098N8972N1518
56855G87821L6555J5911o076k4430l6482m2410m3442m0771l5884l0195k4094j7386
56843E39117j0487m088K099R005J6898K5644L5825M8095O1718P5112Q7285R6770
56831I82993R9302Q9162O4182K8613r301m1952o5024p7778q2009q0283p4590o6494
56819G66821n7610m8914m0047l0450k0789j2097m014M768J4650K5097L6093M8044
56807F81552O0153O9919P4007O8908N2136K5018o029l3052n1827o2646o7034o6018
56795G45087o1186n4752m7788m0169l2396k5722k0228j4688q687l030K161P864
$$ plain form
56879 497491 494051 484039 469911 453984 437697 421835 407479 395958 387831 382787 380746 382152
56867 382152 387100 395365 407632 425577 450244 481431 519193 564661 618233 677331 736303 787821
56855 787821 824376 840287 834211 809781 773299 730889 687447 646676 610792 580597 556503 539117
56843 539117 528630 524542 526641 535646 552544 578188 614013 662108 723826 798938 886223 982993
56831 982993 1082295 1171457 1235639 1264252 1254951 1212999 1147975 1070197 988188 907905 833315 766821
56819 766821 709211 660297 620250 589800 569011 556914 552900 557668 572318 597415 633508 681552
56807 681552 741705 811624 885631 954539 1006675 1031693 1025664 992612 940785 878139 811105 745087
56795 745087 683901 629149 581361 541192 508796 483074 462846 448158 439471 436441 438602 446466
56783D46466J4344K0748K6780L2662L6893L6196K8732J5850K94j5513k8920l7225
56771E77307l9893l9064l6886l3744k9842k6471k4348k2283j9012j5232j2417
56760B78115j0732r394q184p381o833o218n674n316m742l700k651k114k021k123
56746B01032k276k079j140K6L50k73q47q81r04j110q64k7N36L78J17K46M25M76
56728A93185P26R65M27o32q64R8R70R53R42J766K715K943K845L031L124K714K312
56711B18220K273J978J105N85J144J974K004J437J015P27L83M01Q99R01l23j978
56695B32745k853k870k534j741l84O75N15m85j194j198q80o27p02j201j481n61
56679B15224J283K334J714O47M41M73m26j649j649m14N26L60j86k44J90P15J062
$$ plain form
56783 446466 460810 481558 508338 541000 577893 614089 642821 658671 658965 643452 614532 577307
56771 577307 537414 498350 461464 427720 397878 371407 347059 324776 305764 290532 278115
56760 278115 267383 257989 249805 242424 235591 229373 223699 218383 213641 209941 207290 205176 203155 201032
56746 201032 198756 196677 195537 195563 195913 195640 194793 193912 193008 191898 191034 191007 191543 191921 192038 192284 192709 193185
56728 193185 193911 194876 195303 194671 193807 193905 194875 195828 196770 198536 201251 204194 207039 210070 213194 215908 218220
56711 218220 220493 222471 223576 224161 225305 227279 229283 230720 231735 232462 232845 233246 234145 235046 234723 232745
56695 232745 229892 227022 224488 222747 222363 223038 223553 223068 221874 220676 219796 219169 218467 217266 215785 215224
56679 215224 216507 218841 220555 221202 221643 222116 221690 220041 218392 217978 218504 218864 218678 218434 218624 219339 220401
56662B20401J103R50R74J318J629J665J627J585J203N58M63J357K512K989K689
56647B43023J920P58m78r35k60P39J185J255J475J725J692J662J932K019J354
56632B59066L13k65j99j7j84q41j845k714k905k456j857j252m90N8k09r06r73
56615B42324m45n11j475k123j733j150j077q65k1M94k35j425j719j036k35K09
56599B28977J85m60j377j624r43k38o4J81Q81J385J424J852K921L316K227R39
56583B39582Q67J399J239O33N83Q05L70m91p78l48L20J200K199K427J488O25J077
56566B53197K172K664K966M276O260P581Q251R518J1544J2929J2547J0456P174
56553C51535L382J80j567k120k234k117j892k305l677m876m615l319k385k233
$$ plain form
56662 220401 221504 222454 223428 224746 226375 228040 229667 231252 232455 233013 233476 234833 237345 240334 243023
56647 243023 244943 245701 245223 244288 244028 244767 245952 247207 248682 250407 252099 253761 255693 257712 259066
56632 259066 259379 259114 258915 258898 258714 257873 256028 253314 250409 247953 246096 244844 244354 244412 244203 243297 242324
56615 242324 241879 241368 239893 237770 236037 234887 233810 232945 232924 233418 233183 231758 230039 229003 228768 228977
56599 228977 229162 228702 227325 225701 224758 224520 224456 224637 225518 226903 228327 230179 233100 236416 238643 239582
56583 239582 240449 241848 243087 243720 244303 245108 245478 244987 244209 243861 244181 245381 247580 250007 251495 252120 253197
56566 253197 255369 258033 260999 265275 271535 279116 287367 296885 308429 321358 333905 344361 351535
56553 351535 354917 355097 353530 351410 349176 347059 345167 342862 339185 334309 329694 326375 323990 321757
56539C21757k353k644l257l630l180k478k455k779k442j504r22r53j035r43r19
56524B90263r93j162j767k741l121k333j204o69m30jM2p02j154l54O18J72j171
56507B73293j643r55k51Q8N67R06K57j029j652j282p73o10o42r36j485j445j66
56490B62242J425J961J569J229R17J05n79j29R10J130M90N4m6m11o62O6J228J399
56472B72898N51j14k76n57p57r3R82J165M53Q3M49Q75J150J474J290R8r23l14
56454B78434J136J454P26P81J830K112J049J19K08M90M64O86R81K17j409k088
56438B87190j128J1J07l33o14r58j317r15K47J054J020P92N65k10j147q79O94
56421B84179J939J838J058K71o27j160k36J679K441J231j45N3J170J606J079L26
$$ plain form
56539 321757 319404 316760 313503 309873 306693 304215 301760 298981 296539 295035 294113 293160 292125 291182 290263
56524 290263 289270 288108 286341 283600 280479 278146 276942 276273 275843 275842 275884 275182 274028 273674 274292 274464 273293
56507 273293 271650 270695 270444 270532 271099 272005 272262 271233 269581 268299 267526 266916 266274 265338 263853 262408 262242
56490 262242 263667 265628 267197 268426 269343 269448 268869 268740 269650 270780 271270 271324 271278 270867 270205 270271 271499 272898
56472 272898 273449 273335 273059 272502 271745 271652 272634 273799 274252 274335 274784 275659 276809 278283 279573 279671 278748 278434
56454 278434 279570 281024 281750 282531 284361 286473 287522 287641 287849 288339 288803 289489 290470 290687 289278 287190
56438 287190 286062 286073 286180 285847 285233 284275 282958 282043 282290 283344 284364 285156 285721 285511 284364 283485 284179
56421 284179 286118 287956 289014 289285 288658 287498 287262 288941 291382 292613 292468 292521 293691 295297 296376 296702
56405B96702j69k10K62P19M18l56n64r6J98K29P48J512J267k1p85l26K25J00J80
56386C00033J196K261K362J838J563J691K044K546K751K013O97J0K85N91K83k96
56370C21868p76j048n45J194L195L884L259K657K368J504K01j43P14J360J070
56355C40762P07Q36R03P60J042J584J334L79N6O74J046P30P04J319J663J473J601
56338C57573K143K162J756K145L303L773L308L290L974L907K771K175K722K894
56324C97896J868R97J316J967K166K419K772K228R41N87J516J943J005P9J4j93
56308D19521p97k31J864L381L148K939M337O214P172P861Q860Q837O947M847M045
56293D88945L424J606k21k02J229K444L169L946M501M496M554N040N301N251N971
$$ plain form
56405 296702 296533 296323 296585 297304 297722 297366 296802 296706 296904 297133 297881 299393 300660 300639 299854 299528 299753 299853 300033
56386 300033 301229 303490 305852 307690 309253 310944 312988 315534 318285 320298 320995 321005 321290 321881 322164 321868
56370 321868 321092 320044 319499 320693 323888 327772 331031 333688 336056 337560 337761 337618 338332 339692 340762
56355 340762 341469 342305 343208 343968 345010 346594 347928 348307 348363 349037 350083 350813 351517 352836 354499 355972 357573
56338 357573 359716 361878 363634 365779 369082 372855 376163 379453 383427 387334 390105 392280 395002 397896
56324 397896 399764 400761 402077 404044 406210 408629 411401 413629 414570 415157 416673 418616 419621 419700 419714 419521
56308 419521 418724 418493 420357 423738 426886 429825 434162 440376 447548 455409 464269 473106 480053 484900 488945
56293 488945 492369 493975 493754 493552 494781 497225 500394 504340 508841 513337 517891 522931 528232 533483 539454
56278E39454P520Q269P664P462Q761J0217J0679J1124J2297J2970J2442J2315
56266F61174J3710J5110J5082J4831J5958J7922J9858K2540K6361K9722L1760
56255H84028L4397L9304M5168N0301N5647O2564O9946P6263Q2389Q9684R7163
56244A586854J03251J08301J12882J15638J15506J13891J11870J07360R7988Q4705
56234B658246O9644N2524L2490J1490p655k4994m1992n7863p0662q0655q9280
56223B451293r5954r9103r9351r8706r7537r5122r1978q8899q4869p8778p1971
56212A449025o6499o2023n7172n2425m8885m5667m1406l6982l3863l1242k7637
56201I45224k3916k1708k0307j8200j6127j5538j5383j3686j0972r068p831o210
$$ plain form
56278 539454 546974 555243 562907 570369 579130 589347 600026 611150 623447 636417 648859 661174
56266 661174 674884 689994 705076 719907 735865 753787 773645 796185 822546 852268 884028
56255 884028 918425 957729 1002897 1053198 1108845 1171409 1241355 1317618 1400007 1489691 1586854
56244 1586854 1690105 1798406 1911288 2026926 2142432 2256323 2368193 2475553 2573541 2658246
56234 2658246 2727890 2780414 2812904 2824394 2816739 2791745 2749753 2691890 2621228 2540573 2451293
56223 2451293 2355339 2256236 2156885 2058179 1960642 1865520 1773542 1684643 1599774 1520996 1449025
56212 1449025 1382526 1320503 1263331 1210906 1162021 1116354 1074948 1037966 1004103 972861 945224
56201 945224 921308 899600 879293 861093 844966 829428 814045 800359 789387 780319 772488 766278
56189G66278n086n704o675n802l726k528k024q09L75j74j657j917j017n18l18
56174G28698O22J644J711J972L742N439N007L873M748O955P812P390P856R144
56160G96613R329Q533Q573R441R810J0255J2349J5280J6997J7814J9419K1390
56148I55803K2343K3362K6464L0728L3851L6556M1475M8630N5913O3206P2168
56137A410499Q2861R4249J06850J20833J32712J37994J36202J29543J18501J03173
56127B573417Q7321P5944O9571O5233O1656N8672N3131M1177K4135P172p231j9700
56115C090498k9303l4410l7866m5476n9001p5311r2024j08735j23026j30849j31448
56104B223049j27323j19464j07268r2716p9419o7773n5827m4444l6354l0783k4467
$$ plain form
56189 766278 761192 755488 748813 743011 739285 736757 734733 733924 734299 734125 732468 730551 729534 729016 728698
56174 728698 729320 730964 732675 734647 738389 743828 748835 752708 757456 764411 772223 779613 787469 796613
56160 796613 805942 814475 823048 832489 842299 852554 864903 880183 897180 914994 934413 955803
56148 955803 978146 1001508 1027972 1058700 1092551 1129107 1170582 1219212 1275125 1338331 1410499
56137 1410499 1493360 1587609 1694459 1815292 1948004 2085998 2222200 2351743 2470244 2573417
56127 2573417 2660738 2736682 2806253 2871486 2933142 2991814 3044945 3086122 3110257 3117429 3110198 3090498
56115 3090498 3061195 3026785 2988919 2943443 2884442 2809131 2717107 2608372 2485346 2354497 2223049
56104 2223049 2095726 1976262 1868994 1776278 1696859 1629086 1573259 1528815 1492461 1461678 1437211
56093A437211j7610j3332j1523q937n204l026k574j267R94J919J899L379N682
56080A387611O137N781P844J1222J1857J0136J0282J2724J3953J3735J5358J8663
56068A525303J9960J9165J9894K2220K2588K1208K2056K4998K5588K3314K2410
56057A768704K3616K3001K0020J8820K0304K0637J9027J9138K1476K2149K0698
56046A997590K1230K4418K6223K5969K7600L1523L3490L2976L4356L8244M0292
56035B333911L9999M1895M6377M8466M7375M8122N1838N3868N3314N4802N8925
56024B878892O0779N9870O1304O5295O6217O4055O5540P1548P5051P4347P6290
56013C619188Q3104Q8290Q9327R2133R8926J03928J05323J09086J16768J22134
$$ plain form
56093 1437211 1419601 1406269 1394746 1385809 1380605 1377579 1375005 1373738 1374732 1376651 1378550 1381929 1387611
56080 1387611 1393748 1399529 1407373 1418595 1430452 1440588 1450870 1463594 1477547 1491282 1506640 1525303
56068 1525303 1545263 1564428 1584322 1606542 1629130 1650338 1672394 1697392 1722980 1746294 1768704
56057 1768704 1792320 1815321 1835341 1854161 1874465 1895102 1914129 1933267 1954743 1976892 1997590
56046 1997590 2018820 2043238 2069461 2095430 2123030 2154553 2188043 2221019 2255375 2293619 2333911
56035 2333911 2373910 2415805 2462182 2510648 2558023 2606145 2657983 2711851 2765165 2819967 2878892
56024 2878892 2939671 2999541 3060845 3126140 3192357 3256412 3321952 3393500 3468551 3542898 3619188
56013 3619188 3702292 3790582 3879909 3972042 4070968 4174896 4280219 4389305 4506073 4628207
56003D628207J24067J29658J40287J48267J51692J58337J70217J79196J83106
55994F013034J90654K04684K16547K23147K33154K49886K64987K75857K91814
55985H163764L15802L38236L56321L80390M13472M44719M71297N05370N50695
55976A1940066N95126O35765O87302P54970Q25100Q93819R77707J083641J197704
55967A9591200J317657J464698J648125J853103K080357K360681K712329L126515
55959C6154665L616745M237047N030416O015858P256144Q876727J0983903J3635305
55951I5806810J6923819K0984544K5843603L1334885L7140302M2567280M5983291
55944C16584534M4779878L6718470K1909852L443196j4226814k7717259l5897972
$$ plain form
56003 4628207 4752274 4881932 5022219 5170486 5322178 5480515 5650732 5829928 6013034
55994 6013034 6203688 6408372 6624919 6848066 7081220 7331106 7596093 7871950 8163764
55985 8163764 8479566 8817802 9174123 9554513 9967985 10412704 10884001 11389371 11940066
55976 11940066 12535192 13170957 13858259 14613229 15438329 16332148 17309855 18393496 19591200
55967 19591200 20908857 22373555 24021680 25874783 27955140 30315821 33028150 36154665
55959 36154665 39771410 44008457 49038873 55054731 62310875 71187602 82171505 95806810
55951 95806810 112730629 133715173 159558776 190893661 228033963 270601243 316584534
55944 316584534 361364412 398082882 419992734 423435930 409209116 381491857 345593885
55937C45593885l9351835l9279501l6881507l3200527k9035897k4888096k1034693
55930A21921829j7636846j4753807j2341312j0322423q650990p288408o169177
55923D4758866n231513m450925l812677l281050k823394k435870k118788j851329
55915A8753320j613843j410763j248619j113036r88380q79532p94086p21860o51101
55906I332100n87393n38432m96221m51367m09787l79094l52719l22824k95286
55897E498977k77136k62001k42161k22766k10574k00260j85022j69701j60617
55888C568739j52986j40617j28087j21395j16112j06200r5449q9193q3537p3605
55878B461558o3756n9199n5826m8737m2682m3821m8740n1610n4708o1843o8516
$$ plain form
55937 345593885 306242050 266962549 230081042 196880515 167844618 142956522 121921829
55930 121921829 104284983 89531176 77189864 66867441 58216451 50928043 44758866
55923 44758866 39527353 35076428 31263751 27982701 25159307 22723437 20604649 18753320
55915 18753320 17139477 15728714 14480095 13367059 12378679 11499147 10705061 9983201 9332100
55906 9332100 8744707 8206275 7710054 7258687 6848900 6469806 6117087 5794263 5498977
55897 5498977 5221841 4959840 4717679 4494913 4284339 4084079 3899057 3729356 3568739
55888 3568739 3415753 3275136 3147049 3025654 2909542 2803342 2707893 2618700 2535163 2461558
55878 2461558 2397802 2338603 2282777 2234040 2191358 2147537 2098797 2047187 1992479 1930636 1862120
55867A862120o8813o5704o4890o4506o0153n4307n1477m9428m4014l7727l5049
55856A266052l4204l1349k8062k7087k5740k1118j6921j7506k0045j9924j8986
55845A005110k0995k3728k3217k1336k1720k2378j9826j6525j6756j8770j8289
55834G81570j6265j6124j6646j4557j1199r972r958q335o240o143o469m784l307
55821F51571n198q366q892p710q011q984q088o673p400q609p149m213k780j839
55807E57659J072M298M835M296O285R922J1719J1857J2865J4036J2708R458O622
55794F67632L380k447r300j3752j5948j8225k0050j9394j7398j6491j5479j1669
55782E10859o588m292n134o197o846q787j1445j2262j1102r932q800o289l232
$$ plain form
55867 1862120 1793307 1727603 1662713 1598207 1538054 1483747 1432270 1382842 1338828 1301101 1266052
55856 1266052 1231848 1200499 1172437 1145350 1119610 1098492 1081571 1064065 1044020 1024096 1005110
55845 1005110 984115 960387 937170 915834 894114 871736 851910 835385 818629 799859 781570
55834 781570 765305 749181 732535 717978 706779 696807 686849 678514 672274 666131 659662 654878 651571
55821 651571 646373 638007 629115 621405 613394 604410 596322 589649 582249 573640 566491 562278 559498 557659
55807 557659 558731 563029 567864 572160 578445 588367 600086 611943 624808 638844 651552 661010 667632
55794 667632 671012 668565 659265 645513 629565 611340 591290 571896 554498 538007 522528 510859
55782 510859 504271 499979 494845 488648 481802 473015 461570 449308 438206 428274 419474 413185 409953
55769D09953j746j383k80Q77P5j828k311j695k326m113n007n120o251p961q092
55754C62792o744n916n800n049m125m698o276o883o557o828p405o772n346m870
55740B79523n293n280m832m548l574j367Rj241l045k367j57M38o60j088p24j381
55724B44413k718k756j926k460m131m518l298k472k539k124j205j088j368m01
55710B11409J412K063J445J193J506J329J094J981K945K039K4p61m97j182k536
55695B23464k467j209j045k059k088q54k78o08j41J057R76l12l42J519L087L263
55679B21963L445M338M700M088L705L751K892J073J2J55nj047j739j593j565j744
55663B42429j005O28J837K476L558M701M461L319L372M770N586N403N822O868
$$ plain form
55769 409953 408207 406824 406544 407421 407496 405668 403357 401662 399336 395223 390216 385096 378845 370884 362792
55754 362792 356048 350132 344332 339283 335158 330460 324184 317301 310744 303916 296511 289739 284393 279523
55740 279523 274230 268950 264118 259570 255996 254629 254638 253397 250352 247985 247828 248266 247606 246518 245794 244413
55724 244413 241695 238939 237013 234553 230422 225904 222606 220134 217595 215471 214266 213178 211810 211409
55710 211409 212821 214884 216329 217522 219028 220357 221451 223432 226377 228416 228440 227679 227182 226000 223464
55695 223464 220997 219788 218743 216684 214596 213742 213464 212856 212715 213772 214748 214436 214094 215613 218700 221963
55679 221963 225408 229746 234446 238534 242239 245990 248882 249955 249967 250122 250117 249070 247331 245738 244173 242429
55663 242429 241424 242052 243889 246365 249923 254624 259085 262404 265776 270546 276132 281535 287357 294225
55649B94225O296L390L42j207k168l638n217o658q598j0613j1054r725q408p968
55635B28999p309n867m641m039l092j636q93j156j173n26k30n18l85N4n83k109
55619A94896k405p38J057J587J548J532P74p99j731j404j082j542j876j635j896
55604A86286l088l877l360k479k185k115j914j983k132j434k05j0j004j448o38
55589A58414j0l97n69L04J010N21j71J79J152J779K051K226K170K242L278N018
55573A79197O140O508P489R463J1130J1952J3043J4699J5262J3634J0862Q113
55561C07492N040J429j645l586n471q024j0204j1039j1282j1832j2106j1263r728
55548B17781q223o680n091m089l768l276k391k003k267k004p56K41J20l47l60
$$ plain form
55649 294225 300521 303911 304253 303046 300878 297240 292023 285365 276767 266154 255100 245375 236967 228999
55635 228999 221690 215823 211182 207143 204051 202415 201522 200366 199193 198667 198437 197919 197534 197588 197005 194896
55619 194896 192491 191753 192810 194397 195945 197477 198251 197452 195721 194317 193235 191693 189817 188182 186286
55604 186286 183198 179321 175961 173482 171297 169182 167268 165285 163153 161719 161514 161504 160500 159052 158414
55589 158414 158404 158007 157438 157742 158752 159273 159102 159281 160433 162212 164263 166489 168659 170901 174179 179197
55573 179197 185337 191845 199334 208797 219927 231879 244922 259621 274883 288517 299379 307492
55561 307492 312532 313961 312316 308730 303259 295235 285031 273992 262710 250878 238772 227509 217781
55548 217781 209558 202878 197787 193698 189930 186654 184263 182260 179993 177989 177233 177474 177594 177247 176887
55533A76887k44j79M06J153N04j756l624l735l199l296l325k303j054q23j277
55518A54135j511j718k357k888k748k443k426k099j096k69k09j07O54J155N25
55503A36598m45o38l71n05r14j097j243j492j220k05N54K72m63q95j263j778j735
55486A23160p68J83K35k40o17r79j199n45Q26J491R43N59J264J885J215R4j50
55469A27357J20j31o54o15k24j36j42J91M90M42O34J329J513M15j108j858j855
55452A25768j582q74J95O37J06k10N12J293J140Q00J184J471O31m80m20M16O05
55435A31192Km78o87j124j637j722j520j248m77P78J358O65j7N54J511J434P72
55418A29356Q28J284Q95o7j72P77J665K046K428K799K527J697J019N40k55j242
$$ plain form
55533 176887 176643 176464 176870 178023 178527 176771 173147 169412 166213 162917 159592 157289 156235 155412 154135
55518 154135 152624 150906 148549 145661 142913 140470 138044 135945 134849 134580 134371 134264 134918 136073 136598
55503 136598 136153 135515 135144 134639 133725 132628 131385 129893 128673 128468 129022 129294 128831 127936 126673 124895 123160
55486 123160 122392 122575 122810 122570 121953 120974 119775 119230 120056 121547 122490 123049 124313 126198 127413 127507 127357
55469 127357 127477 127346 126692 126077 125853 125717 125575 125766 126256 126698 127332 128661 130174 130589 129481 127623 125768
55452 125768 124186 123312 123507 124144 124250 124040 124552 125845 126985 127785 128969 130440 131071 130591 130171 130587 131192
55435 131192 131194 130716 130029 128905 127268 125546 124026 122778 122301 123079 124437 125102 125085 125639 127150 128584 129356
55418 129356 130184 131468 132363 132296 132124 132901 134566 136612 139040 141839 144366 146063 147082 147622 147367 146125
55402A46125j772j811j874k104k326k571k662j980n91K77l9m02L52J430J358L75
55386A31785j24J72M32L65L67M01J72rK50M45n6q42j205j318j490j141J15J233
55368A29552J153N47O15R69M92n14q67n92o24r22p08j45PqN49J265J187O13N17
55349A33086O03j35j362j811j470j405j611j140j65N0n92q81m49k04l73j05O52
55332A22688P35l05j425j655j029J99J736K559J702J9n67K19P44K20k34J82N81
55315A26369J44m67m54k44m21n04Q6Q51J014P16N11L86N7k59j89J54M03N07O30
55296A29290Q19J009J111R76O42M65O19O56J84l17j15N48P60L45N8L45P87Q59
55278A39041M97j37p77j049r08q82j241j337n25O52J185J078J051J142P66pm85
$$ plain form
55402 146125 144353 142542 140668 138564 136238 133667 131005 129025 128434 128711 128672 128270 128622 130052 131410 131785
55386 131785 131661 131833 132265 132630 132997 133398 133570 133561 133811 134256 134200 133358 132153 130835 129345 128204 128319 129552
55368 129552 130705 131252 131867 132836 133328 132814 131947 131355 130731 129809 129101 128956 128963 128955 129504 130769 131956 132569 133086
55349 133086 133689 133554 132192 130381 128911 127506 125895 124755 124590 124640 124048 123167 122718 122514 122141 122036 122688
55332 122688 123423 123118 121693 120038 119009 119208 120944 123503 125205 125224 124657 124876 125620 125840 125606 125788 126369
55315 126369 126513 126046 125592 125348 124927 124423 124509 125360 126374 127090 127601 127987 128044 127785 127596 127750 128153 128660 129290
55296 129290 130109 131118 132229 133205 133847 134312 134931 135587 135771 135454 135339 135887 136647 136992 137050 137395 138182 139041
55278 139041 139538 139401 138624 137575 136667 135785 134544 133207 132682 133334 134519 135597 136648 137790 138556 138549 138064
55261A38064n33o08o88k75N26R90Q39L80k52j061j547j173l59P4K08O93J271R95
55243A37544j68j154j341j144j002q71p53p42n08K81J127J180M98j66n37p96o92
55226A30756R2J012J238R29Q07Q16M80J52M53R00O17LM4L78n6q79p88p2k31j126
55206A35525r18O85J633P56m97o11j49j27j50L88P88K44o29q52o33o16n95j20
55188A34122M01L76M1o9k2n2L2K67J32n31r82o82j60n8j19J17L41K9n91q75n99
55167A31118N3Q58J460J472J033P36P83Q36P97R30J044N76k94o45k30J77J98M01
55149A41303R81J139M19l88n16m03p86j431j586j110m42M8K26J78K83P79J170
55132A39864Q19R7o1K86J66n20p11k1O21O11N06O39L41o07j184o77J88N37O43
$$ plain form
55261 138064 137531 136923 136235 135960 136486 137476 138315 138695 138443 137382 135835 134662 134303 134377 134585 135278 136549 137544
55243 137544 137376 136222 134881 133737 132735 131864 131111 130369 129861 130142 131269 132449 132947 132781 132244 131448 130756
55226 130756 130848 131860 133098 134027 134834 135650 136130 136282 136735 137635 138252 138255 138299 138677 138621 137742 136954 136882 136651 135525
55206 135525 134607 135292 136925 137681 137184 136573 136424 136297 136147 136535 137323 137567 136938 136086 135453 134837 134242 134122
55188 134122 134523 134899 134940 134871 134849 134797 134829 135096 135228 134697 133715 133033 132873 132815 132696 132813 133154 133183 132592 131717 131118
55167 131118 131171 132029 133489 134961 135994 136730 137513 138349 139146 140076 141120 141696 141402 140757 140527 140704 140902 141303
55149 141303 142284 143423 143842 143454 142938 142535 141749 140318 138732 137622 137180 137228 137454 137632 137915 138694 139864
55132 139864 140683 140780 140719 141005 141171 140651 139940 139919 140540 141151 141657 142296 142637 142030 140846 140169 140357 140894 141537
55113A41537R88J244J109J088J456J539R88N82P67O47l63j040m2J823K581J736
55097A56640M88k33n21n96m24j77j09m7K02L06l3l47r8L93N10M33P84J426J565
55078A60162Q19m30j584k112j681n51L71M57J9k81k53l2L21O47O09K36k0o4k97
55059A56336o86o17m4J72l96j025j147j219j495j126L89J816J627J38r92r70l47
55042A50414K65P88J140J134R01O94M70J69J03L75M48p5o07k99P77J782K059J452
55024A61990J22j343k119k017j728j764j824j595j384j364j086m01M5N7O14K312
55008A48515M004M168K941J653R06L67r1k98m24o44n05L82J388J677J495J568
54992A67102J677J022k26j020r44n56k56J38O51R49J011J162J407J333Q05J75
$$ plain form
55113 141537 142525 143769 144878 145966 147422 148961 149949 150531 151298 151945 151582 150542 150500 152323 154904 156640
55097 156640 157128 156895 156374 155778 155354 155177 155068 155021 155223 155529 155496 155149 155051 155444 155954 156387 157171 158597 160162
55078 160162 160981 160551 158967 156855 155174 154623 154994 155451 155470 155189 154936 154904 155225 155872 156481 156717 156697 156633 156336
55059 156336 155650 155033 154989 155161 154765 153740 152593 151374 149879 148753 149142 150958 152585 152723 151731 150761 150414
55042 150414 150679 151467 152607 153741 154642 155336 155806 155975 156078 156453 156901 156826 156219 155920 156697 158479 160538 161990
55024 161990 162112 160769 158650 156633 154905 153141 151317 149722 148338 146974 145888 145487 145532 145589 146203 148515
55008 148515 152519 156687 159628 161281 162187 162554 162463 162165 161741 161097 160592 160974 162362 164039 165534 167102
54992 167102 168779 169801 169575 168555 167611 167055 166799 166937 167588 168537 169548 170710 172117 173450 174255 174430
54976A74430k00k83k94n70j176j484p23O82J186P5j407j678p32L06Q58J107J182
54959A71279J038Q65P94O94P21J344K162J784j45j864j658j70P78P53N97N20Q3
54942A79575l62l0P19P41J3m01j74k1j32K26J276K239K539K446K303K170K320
54925A95447L090M152M895N493O568P914Q625Q488Q069P494O287M436K417J67
54911B73542k762n829p653p828p417p265p017o237n413n132n081m614l770l184
54897A94340l185l366k907j458K66J033O68L55Q84J350O81l58q3J582L078L634
54881A96514M128N343O840P984Q802R365R288Q426P163N699L820J630l58k112
54867B72532m149o453q135q584q149p441o588n500m300l201k375j988j921j675
$$ plain form
54976 174430 174230 173947 173653 173083 171907 170423 169700 170382 171568 171643 170236 168558 167826 168132 168990 170097 171279
54959 171279 172317 173182 173976 174670 175391 176735 178897 180681 180536 178672 177014 176844 177622 178375 178972 179492 179575
54942 179575 179213 179183 179902 180643 180656 180255 180081 180060 179928 180154 181430 183669 186208 188654 190957 193127 195447
54925 195447 198537 202689 207584 213077 219645 227559 236184 244672 252741 260235 266522 270958 273375 273542
54911 273542 270780 264951 257298 249470 242053 234788 227771 221534 216121 210989 205908 201294 197524 194340
54897 194340 191155 187789 184882 183424 183690 184723 185391 185746 186630 187980 188661 188303 188220 189802 192880 196514
54881 196514 200642 205985 212825 220809 229611 238976 248264 256690 263853 269552 273372 275002 274644 272532
54867 272532 268383 261930 253795 245211 237062 229621 223033 217533 213233 210032 207657 205669 203748 202073
54853B02073j111r26j599k338k063j162j009j968l094l716m008l885k804r19O40
54838A72111J108P68J85k99k86L73R18M76m67o38kK17l09n09J06N44J04m46k68
54819A73686K60N06N86O25J04j060j791j227J0P97J008J158J283J079O75M61M64
54802A78624N19O17O50L48k06m70k79q3j46j51Q2K34J63J07k2n95j212q49N45
54783A77876J581J349O57O53J236J718K115K741L276L260L042L231L702M043M559
54768B15039N867P748R302J0090J0441J0647J0523R712Q086N781L134N02j924
54755C04948m049n687o775p593q296q499p914p120o839o708n856m521l797l774
54741B17520l384k388j942k607l214k570j071K03R21J210J008O24J017K542M174
$$ plain form
54853 202073 200962 200036 198437 196099 194036 192874 191865 189897 186803 183087 179079 175194 172390 171471 172111
54838 172111 173219 173987 174172 173873 173587 173960 174878 175354 174887 174249 174247 174464 174155 173646 173752 174296 174400 173954 173686
54819 173686 173946 174452 175038 175663 175767 174707 172916 171689 171699 172496 173504 174662 175945 177024 177699 178160 178624
54802 178624 179143 179760 180410 180758 180552 180082 179803 179720 179574 179423 179505 179739 179902 180009 179987 179392 178180 177331 177876
54783 177876 179457 180806 181463 182116 183352 185070 187185 189926 193202 196462 199504 202735 206437 210480 215039
54768 215039 220906 228654 237956 248046 258487 269134 279657 289369 297455 303236 306370 306872 304948
54755 304948 300899 295212 288437 280844 272548 264049 256135 249015 242176 235468 229612 225091 221294 217520
54741 217520 214136 211748 209806 207199 203985 201415 200344 200547 201468 202678 203686 204310 205327 207869 212043
54726B12043M832M686M515M714N541P257R113R383P379M503K285M65j856m283
54712B70577n813o523p115p447p026o339o236o335n570m016k808k462k474k470
54698A97943k546k560k168j497q79k17M97N66m12j352r22L29N44p62k025j849
54682A82690n83N59R09M10o93j819k327k122j526o71K83O19k68j682k135j181
54666A70463J84R72J168J097Q39N67N95P53M59k80o84l35K08K69o4k84j53L09
54648A76083J008J594J562Q24n6m60k86J79N51N34J42j82n7K34J18l79n86j91
54630A80632K74J56n21j195j402j094n55q9K74P40J298J487R95K11j81l5K66M81
54612A81742O69P49M42k61r90j389j436j306j198j145r07k29O19J030R61J117
$$ plain form
54726 212043 216875 221561 226076 230790 236331 243588 252701 262084 269463 273966 276251 276716 274860 270577
54712 270577 264764 258241 251126 243679 236653 230314 224078 217743 212173 208157 205349 202887 200413 197943
54698 197943 195397 192837 190669 189172 188293 188076 188573 189139 188727 187375 186453 186782 187326 186564 184539 182690
54682 182690 182107 182666 183575 183985 183292 181473 179146 177024 175498 174827 175110 175729 175461 173779 171644 170463
54666 170463 170647 171619 172787 173884 174723 175290 175885 176638 177097 176817 176133 175798 176006 176275 176211 175927 175774 176083
54648 176083 177091 178685 180247 181071 181015 180555 180269 180448 180999 181533 181675 181493 181436 181670 181788 181409 180823 180632
54630 180632 180906 181062 180541 179346 177944 176850 176295 176206 176480 177220 178518 180005 181000 181211 181030 180995 181261 181742
54612 181742 182411 183160 183602 183341 182351 180962 179526 178220 177022 175877 174970 174741 175360 176390 177351 178468
54596A78468J718J856Q44l99m32N96J127M78l91o09n90r12j073l18R49J534J010
54579A83856J13l28j99J73N33P56P27M55J51L4O2l2m15r04j125q52j96M89Q37
54560A84135O72J66k28j48L88J033J382J125K65n66n12M13J062O16j49L2R27J144
54542A91757L49k57R8P01Q47R84J588K041J690J009O89M38j93o22j43O73P77L14
54524B02740J52K63j01p95r15l78l9k02k58J2N9k93m46j10J79kl35m99o45r14
54504A97473j101j065r18n92M9O65O81K24L3L19M77P5n31q27o84j74N23R34O75
54485A96236J09j19j43o10j323j217k1J139J278P95O13Q74J132J202J125P82K15
54468B02067q0K86R97J418J290P96K82J86Q32J847K250J536L36l64l79k31k55
$$ plain form
54596 178468 180186 182042 182886 182487 182055 182651 183778 184256 183865 183256 182666 181754 180681 180363 181312 182846 183856
54579 183856 183969 183641 183442 183615 184148 184904 185631 186086 186237 186271 186333 186301 185886 184982 183857 183005 182809 183298 184135
54560 184135 184807 184973 184745 184597 184985 186018 187400 188525 188790 188224 187712 188125 189187 189803 189654 189686 190613 191757
54542 191757 192106 191849 191947 192648 193495 194479 196067 198108 199798 200807 201496 201934 201741 201119 200976 201649 202426 202740
54524 202740 202892 203155 203054 202259 201344 200966 200927 200725 200467 200479 200538 200245 199799 199689 199868 199866 199531 199032 198387 197473
54504 197473 196372 195307 194389 193797 193846 194511 195192 195416 195449 195768 196245 196320 195789 194962 194278 194104 194627 195561 196236
54485 196236 196345 196226 196083 195473 194150 192933 192912 194051 195329 196124 196737 197611 198743 199945 201070 201852 202067
54468 202067 201987 202273 203270 204688 205978 206774 207056 207242 208074 209921 212171 213707 214043 213679 213300 213069 212814
54451B12814k52M7O14J159J302P72l02j380j894j764j349j008p84m98j27P7r2
54434B07335m23m89k15J12L98Q34J284J157L06n57p70n84n38n46k89L8R9K03Q20
54415B08175J629J937J721J451J145N26j33l34l16o14r22n18K71L29m20p64n0
54398B13113R67J427J399J248J050J063J645K327K059Q54kJ30L40j27o06l74o8
54381B26445n83j442j598j134r03r70p14j35J48O1J64N69P84O71O65R03Q94L14
54363B24139m45p52m07L28R55J058O73M24Q49J643J866J090l3m95q3M12J46p71
54345B30597j384j054j79M59P39J065J489J621J433J441J893K442K827L225L631
54330B50245L499K470R51m17j446k259k846l160l297l227k729j905j346j468j962
$$ plain form
54451 212814 212562 212609 213223 214382 215684 216456 216154 214774 212880 211116 209767 208759 207975 207477 207350 207427 207335
54434 207335 206912 206423 206208 206320 206718 207552 208836 209993 210299 209742 208972 208388 207850 207304 207015 207053 207152 207355 208175
54415 208175 209804 211741 213462 214913 216058 216584 216451 216117 215801 215187 214265 213747 214018 214347 213927 213163 213113
54398 213113 214080 215507 216906 218154 219204 220267 221912 224239 226298 227152 227150 227280 227620 227493 226887 226513 226445
54381 226445 225862 224420 222822 221688 220785 219815 219101 218966 219114 219175 219339 219908 220692 221363 222028 222931 223825 224139
54363 224139 223694 222942 222535 222863 223818 224876 225549 225973 226822 228465 230331 231421 231388 230893 230810 231222 231368 230597
54345 230597 229213 228159 227980 228439 229178 230243 231732 233353 234786 236227 238120 240562 243389 246614 250245
54330 250245 253744 256214 257165 256748 255302 253043 250197 247037 243740 240513 237784 235879 234533 233065 231103
54315B31103k193j872j161m36j68n52j092r95k35L42J90k46l50k25k47k72R3P62
54297B22446J242J255Q95L55j81n96r47j265j212m20P36J289R24L48J35o5o96
54280B24243j351j362p92j84K69O56Q02M48k10o60o11n7Q34J581J591R14M05N97
54262B27113R47O95L9k41O9N13P99J039J263J279R74M13k43o60n12jJ97q6k02
54243B33395K00L64n10j878k450j877r77m40j91o7j75m34m17m0J78j12m69j49
54225B23951R43J997K056R47n08j323j236p01r3O05J333J719J566J057L27o99
54209B31941j756k160j706j120j131j541j638j110j37R69J734J667R75O00R48
54194B26535J146K89j039j412m44Q27J301Q71J47k37n9L45M01J1k57j8L68M42
$$ plain form
54315 231103 228910 227038 225877 225441 225273 224721 223629 222634 222399 222741 222931 222685 222335 222110 221863 221591 221684 222446
54297 222446 223688 224943 225838 226193 226012 225416 224469 223204 221992 221572 222308 223597 224521 224869 225004 224939 224243
54280 224243 222892 221530 220738 220554 220823 221479 222281 222729 222519 221859 221248 221191 222025 223606 225197 226111 226516 227113
54262 227113 228060 228755 228794 228553 228622 229135 229934 230973 232236 233515 234489 234902 234659 233999 233487 233486 233683 233597 233395
54243 233395 233595 233959 233449 231571 229121 227244 226267 225827 225636 225569 225394 224960 224543 224503 224681 224569 224100 223951
54225 223951 224894 226891 228947 229894 229386 228063 226827 226126 226033 226638 227971 229690 231256 232313 232640 231941
54209 231941 230185 228025 226319 225199 224068 222527 220889 219779 219642 220611 222345 224012 224987 225587 226535
54194 226535 227681 227970 226931 225519 225075 225902 227203 228074 228221 227984 227925 228270 228671 228682 228425 228407 228775 229217
54176B29217L59L82K51l11r09j036r10r68j011o26r7K5j11j5P3m23j270j654j516
54157B19450j531j789j577o61K12L96J03j80k98k60p8L5l4K16J345K817L314K442
54139B23922J234O75N54K49j71k49NK19L00M59P85J164J450J494J169N33j97q47
54121B32748j288j307q19j55K54M03N71P16N20J0l69k99K13J117K231K954K703
54104B40203J726R28P65Q54P26L35k62j068j820k086j895j672j438p63K60P97
54088B35590M53m6J23O94Q00K44l29l52J93J058J961K494K290J419M22j33m4N34
54070B47371J319K069K601K784K543J970J320Q14M68J61k35p72j302j407p75K69
54054B59198R34Q67N41N55R67J635K617L777M425M023L068K665L407N073P157
$$ plain form
54176 229217 229576 229958 230209 229898 228989 227953 227043 226075 225064 224438 224341 224366 224255 224240 224313 223890 222620 220966 219450
54157 219450 217919 216130 214553 213892 214104 214500 214603 214423 214125 213865 213787 213822 213788 214004 215349 218166 221480 223922
54139 223922 225156 225831 226385 226634 226463 226214 226219 226438 226738 227197 227982 229146 230596 232090 233259 233792 233595 232748
54121 232748 231460 230153 229334 229179 229433 229836 230407 231123 231643 231653 231284 230985 231198 232315 234546 237500 240203
54104 240203 241929 242857 243622 244476 245202 245537 245275 244207 242387 240301 238406 236734 235296 234533 234793 235590
54088 235590 236043 235997 236120 236814 237614 237858 237529 237177 237370 238428 240389 242883 245173 246592 247014 246881 246837 247371
54070 247371 248690 250759 253360 256144 258687 260657 261977 262791 263259 263420 263185 262413 261111 259704 258929 259198
54054 259198 260132 260999 261540 262095 263062 264697 267314 271091 275516 279539 282607 285272 288679 293752 300909
54039C00909R130J0555J1559J2966J5452J8797K2471K6233K9338K9746K5539J7138
54027E29833P130k060r342j4223j6386j6370j5388j4044j2156j0050q778q513
54015D09653p975o264m304l499l799m089l973m096m912o002o659o586n954n123
54001C36418m285l307k116j240j431k576l564l573k974k549k378k093j710j595
53987C01027j779j880j664j283r95r02r09q36o69o94j126j650j713j328j042j077
53971B81480j005m99J43M82M24O1m99q92p35k68j70m37k57O42J323J040N32J011
53953B82376K310L104K789K158K093K435K529K326K361K907L557L853L956M385
53939C23139N108N412M928M342M477N025M897L758K353J323N99J99O00J797K819
$$ plain form
54039 300909 310039 320594 332153 345119 360571 379368 401839 428072 457410 487156 512695 529833
54027 529833 536963 534903 525561 511338 494952 478582 463194 449150 436994 426944 418166 409653
54015 409653 401678 395414 391110 387611 383812 379723 375750 371654 366742 360740 354081 347495 341541 336418
54001 336418 332133 328826 326710 325470 324039 321463 317899 314326 311352 308803 306425 304332 302622 301027
53987 301027 299248 297368 295704 294421 293426 292524 291615 290779 290110 289416 288290 286640 284927 283599 282557 281480
53971 281480 280475 279976 280119 280601 281025 281086 280587 279695 278960 278692 278522 278085 277828 278470 279793 280833 281365 282376
53953 282376 284686 287790 290579 292737 294830 297265 299794 302120 304481 307388 310945 314798 318754 323139
53939 323139 328247 333659 338587 342929 347406 352431 357328 361086 363439 364762 365361 365560 366160 367957 370776
53924C70776K887K447K385K761L053L240L842N008O236O953P040O772O614O895
53910D36909P507Q076Q503R072R857J0531J0886J1009J0754R727Q135O915O411
53897E54292N627L468K02l042n744q085r985j1086j1561j2036j2606j2649j1799
53884D64996j0464r155p828o192m302k539j113K78K281N278Q891J2305J5204J8244
53870D85884K2307K7192L0970L0660K4047J1575l342j6465k5463l0455l2315l1517
53858D93078k8693k5104k1699j8436j5150j2422j0834r994r143q286p777p259
53846C18281n998m122k586j921j728j467j041n69j00L03N71O85M76l30j494k106
53830B96854j575m31M06P52R42Q74J99p99j355j220q12m57j34J57M30R47J727
$$ plain form
53924 370776 373663 376110 378495 381256 384309 387549 391391 396399 402635 409588 416628 423400 430014 436909
53910 436909 444416 452492 460995 470067 479924 490455 501341 512350 523104 532831 540966 547881 554292
53897 554292 559919 563387 563589 560547 554803 546718 536733 525647 514086 502050 489444 476795 464996
53884 464996 454532 445377 437549 431357 427055 424516 423403 423681 425962 431240 440131 452436 467640 485884
53870 485884 508191 535383 566353 597013 621060 632635 629293 612828 587365 556910 524595 493078
53858 493078 464385 439281 417582 399146 383996 371574 360740 350746 341603 333317 325540 318281
53846 318281 312283 308161 305575 303654 301926 300459 299418 298849 298749 299052 299623 300308 300784 300454 298960 296854
53830 296854 295279 294848 295254 296006 296948 297822 298021 297222 295867 294647 293835 293378 293244 293401 293831 294778 296505
53813B96505K054J355K96N1O63J178J364J953L013L459K804K167K689L873M487
53798C27911M381M378M732M862M503M177M336M717M814M475L812K912J958J346
53784C83314J267J314Q85jo43o73p35j660l163m002l597k772k591l015l275l066
53768C57587k685k262j628r04n41o79j022j362j772k229k549k720k902l036k884
53753C28412k496k201k074j891j652j618j752j584r64m63p37j683k442k171p78
53738C03906Q94J693J176Jq72j187j282j258q45j7Q11J305J527J693J952K371
53722C11868K711K372J089l29o08N79K295L494L847L463K498J349N21O6l71p39
53706C34105m95M51J389J822K108K661L181L313L497M305N321N601M993M184L491
$$ plain form
53813 296505 298559 299914 300210 300261 300924 302102 303466 305419 308432 311891 314695 316862 319551 323424 327911
53798 327911 332292 336670 341402 346264 350767 354944 359280 363997 368811 373286 377098 380010 381968 383314
53784 383314 384581 385895 386780 386779 386136 385463 384728 383068 379905 375903 372306 369534 366943 363928 360653 357587
53768 357587 354902 352640 351012 350108 349567 348888 347866 346504 344732 342503 339954 337234 334332 331296 328412
53753 328412 325916 323715 321641 319750 318098 316480 314728 313144 312180 311717 310980 309297 306855 304684 303906
53738 303906 304800 306493 307669 307670 306798 305611 304329 303071 302226 302209 303020 304325 305852 307545 309497 311868
53722 311868 314579 316951 318040 317711 317103 317682 319977 323471 327318 330781 333279 334628 335149 335215 334844 334105
53706 334105 333610 334061 335450 337272 339380 342041 345222 348535 352032 356337 361658 367259 372252 376436 379927
53691C79927K531J285O96J552L247M222L598J923L43n71r29q48k29P40J321R82
53675C99790J48k23K06Q40J036P59K07o80j934l084l439k827j718p03o6J47J0
53658C88469k76m44l91k65k05o7M58J343J972J682N33o89j346j567j780j934j631
53641C83862q35RN65R00J107J066P36M14M66R55J599J967J811J385J320J891K518
53624D01736K409J687J321J862K769L235L219L283L767M472N004N082M674M076
53610D48596L778M043M685N296N533N171M229L215K897L516M433M803M402L580
53596E08177K704K079K045K632L209K971J911P69K8n37j094j209o12q9p73k491
53580E19720l627k973j181J50L76J37O0J4j88j78M25J359K201L104M514O304P809
$$ plain form
53691 379927 382458 383743 384439 385991 389238 393460 397058 398981 399324 398753 397824 396976 396747 397487 398808 399790
53675 399790 399938 399715 399921 400761 401797 402556 402763 402083 400149 397065 393626 390799 389081 388378 388312 388459 388469
53658 388469 388193 387749 387358 387093 386888 386821 387279 388622 390594 392276 392809 392120 390774 389207 387427 385493 383862
53641 383862 383027 383036 383601 384501 385608 386674 387410 387824 388290 389245 390844 392811 394622 396007 397327 399218 401736
53624 401736 404145 405832 407153 409015 411784 415019 418238 421521 425288 429760 434764 439846 444520 448596
53610 448596 452374 456417 461102 466398 471931 477102 481331 484546 487443 490959 495392 500195 504597 508177
53596 508177 510881 512960 515005 517637 520846 523817 525728 526497 526525 525988 524894 523685 523073 522984 522211 519720
53580 519720 516093 513120 511939 512089 512465 512602 512662 512676 512488 512310 512735 514094 516295 519399 523913 530217 538026
53563E38026Q639Q933Q793P988O372M230J958k74k377m130n345o099o562o630
53549E53522o007m731l380k557k159j515l38P53J092R83J269J988K337K095K184
53534E45536L248M592N267N576O469P855Q668Q590Q600R578J1254J2921J4331
53521F52485J5437J5909J5581J5071J5275J6419J7937J9280K0476K1841K3445
53510H49156K4981K6149K7073K8186K9674L1172L2124L2308L1839L0932K9868
53499A173462K8986K8442K8126K8016K8305K8828K8895K8121K7155K6859K7048
53488A482243K6777K5782K4835K4597K4864K5080K4952K4376K3398K2461K2172
53477A751537K2521K2827K2558K1720K0325J8139J5283J2489J0314Q448O183L198
$$ plain form
53563 538026 546665 555598 564391 572379 578751 582981 584939 584665 582288 578158 572813 566714 560152 553522
53549 553522 547515 542784 539404 536847 534688 533173 532835 533588 534680 535663 536932 538920 541257 543352 545536
53534 545536 548784 553376 558643 564219 570688 578543 587211 595801 604401 613979 625233 638154 652485
53521 652485 667922 683831 699412 714483 729758 746177 764114 783394 803870 825711 849156
53510 849156 874137 900286 927359 955545 985219 1016391 1048515 1080823 1112662 1143594 1173462
53499 1173462 1202448 1230890 1259016 1287032 1315337 1344165 1373060 1401181 1428336 1455195 1482243
53488 1482243 1509020 1534802 1559637 1584234 1609098 1634178 1659130 1683506 1706904 1729365 1751537
53477 1751537 1774058 1796885 1819443 1841163 1861488 1879627 1894910 1907399 1917713 1926161 1932344 1935542
53465A935542l70m278q187j1602j4191j6019j7292j7987j8035j7697j7596j8231
53453A774057j9555k1013k2182k3262k4690k6158k6695k6020k5208k5381k6189
53442A507704k6427k5645k4268k2468k0045j7333j5085j3341j1486r507q052p115
53430A306932n865m118k696j846n37J838M299N709O423P497R042J0535J2167J4579
53416A363959J7584K0242K2177K3867K5697K7510K9161L0832L2641L4467L6191
53405A664328L7783L9190M0467M1931M3946M6611M9784N3187N6306N8685O0473
53394B192691O2325O4449O6305O7514O8515O9840P1267P2174P2290P1621P0142
53383B949133O8046O5842O3697O1147N7973N4801N2162M9514M6011M1780L7670
$$ plain form
53465 1935542 1935172 1930894 1922707 1911105 1896914 1880895 1863603 1845616 1827581 1809884 1792288 1774057
53453 1774057 1754502 1733489 1711307 1688045 1663355 1637197 1610502 1584482 1559274 1533893 1507704
53442 1507704 1481277 1455632 1431364 1408896 1388851 1371518 1356433 1343092 1331606 1322099 1314047 1306932
53430 1306932 1301067 1296949 1294253 1292407 1291870 1293708 1298007 1303716 1310139 1317636 1326678 1337213 1349380 1363959
53416 1363959 1381543 1401785 1423962 1447829 1473526 1501036 1530197 1561029 1593670 1628137 1664328
53405 1664328 1702111 1741301 1781768 1823699 1867645 1914256 1964040 2017227 2073533 2132218 2192691
53394 2192691 2255016 2319465 2385770 2453284 2521799 2591639 2662906 2735080 2807370 2878991 2949133
53383 2949133 3017179 3083021 3146718 3207865 3265838 3320639 3372801 3422315 3468326 3510106 3547776
53372C547776L3974L0311K6438K2373J7782J2051M907l549j3252k3906l4478m3717
53360C576710n1161n7066o1536o4437o6066o7121o7880o8044o7483o6511o5286
53349B874119o3461o0737n7439n4466n2778n2840n4267n6079n7533n8449n8661
53338B247409n7648n5253n2277m9695m7538m5105m2060l8609l4875l0878k7024
53327A766447k3975k1990k0897k0621k1074k1713k1856k1462k1056k0854k0518
53316A530431j9748j8569j7053j5194j3082j0813q453o329m956m091k471O54M149
53303A414475O203O702P246Q816J0718J2155J3604J5944J9018K1804K3702K5060
53291A585447K6690K9129L2125L4687L5923L5881L5273L4414L2998L0948K8802
$$ plain form
53372 3547776 3581750 3612061 3638499 3660872 3678654 3690705 3695612 3692063 3678811 3654905 3620427 3576710
53360 3576710 3525549 3468483 3406947 3342510 3276444 3209323 3141443 3073399 3005916 2939405 2874119
53349 2874119 2810658 2749921 2692482 2638016 2585238 2532398 2478131 2422052 2364519 2306070 2247409
53338 2247409 2189761 2134508 2082231 2032536 1984998 1939893 1897833 1859224 1824349 1793471 1766447
53327 1766447 1742472 1720482 1699585 1678964 1657890 1636177 1614321 1592859 1571803 1550949 1530431
53316 1530431 1510683 1492114 1475061 1459867 1446785 1435972 1427519 1421190 1416234 1412143 1409672 1410326 1414475
53303 1414475 1420678 1427380 1434626 1443442 1454160 1466315 1479919 1495863 1514881 1536685 1560387 1585447
53291 1585447 1612137 1641266 1673391 1708078 1744001 1779882 1815155 1849569 1882567 1913515 1942317
53280A942317K7066K5633K4040K1929J9178J5973J2807R934O898L158q73m162
53268B103898o475q723j1661j5016j8211k1214k4181k6825k8786l0244l1661l3165
53256A847736l4603l6008l7511l8886l9514l8998l7623l6207l5329l4762l3774
53245A444521l2162l0649l0078l0469l1240l1986l2583l2819l2564l2129l1839
53234A096003l1411l0354k8768k7052k5006k2093j8524j5256j2925j1555j1225
53223H61834j2008j3193j3659j3379j3541j4809j6368j7191j7359j7555j7961
53212F94811j8298j8348j7881j6649j4910j3383j2302j1066r336p778p209p555
53200E40096q265r125j0044j0584j0352r601q836q198p595p023o372n406m384
$$ plain form
53280 1942317 1969383 1995016 2019056 2040985 2060163 2076136 2088943 2098877 2105775 2108933 2108060 2103898
53268 2103898 2097423 2088700 2077039 2062023 2043812 2022598 1998417 1971592 1942806 1912562 1880901 1847736
53256 1847736 1813133 1777125 1739614 1700728 1661214 1622216 1584593 1548386 1513057 1478295 1444521
53245 1444521 1412359 1381710 1351632 1321163 1289923 1257937 1225354 1192535 1159971 1127842 1096003
53234 1096003 1064592 1034238 1005470 978418 953412 931319 912795 897539 884614 873059 861834
53223 861834 849826 836633 822974 809595 796054 781245 764877 747686 730327 712772 694811
53212 694811 676513 658165 640284 623635 608725 595342 583040 571974 562638 554860 547651 540096
53200 540096 531831 522706 512662 502078 491726 482125 473289 465091 457496 450473 444101 438695 434311
53187D34311m056m569n018m645l825l238k779k130j713k048k630k571k010j747
53173C91332j724j086J97J021P28Jk09J97P68J125Q69m01k279l395k751r90K68
53156C83671K13n84j223j486j650j787j731j504j424j640j845j670j189q17p82
53141C64552r58j182j452j703j702j306o64q0K11J58QJ90Q46J471J496J118J055
53124C62058J488J817J660J395J359J199N44j65k11L61Q38Q23N41L30K76L35M07
53107C75055K85j67q12j439k023k586k973k985k650k168j801j845k381k883k561
53092C46066j421n06o69j494j883j464p75l82k92j59K83R90J504J370Q45P66J424
53075C44203J999J700R51P36J121J229O05k07m75j00M78P31M02j76k92K43P15
$$ plain form
53187 434311 430255 425686 420668 416023 412198 408960 406181 404051 402338 400290 397660 395089 393079 391332
53173 391332 389608 388522 388719 389740 390468 390469 390260 390457 391225 392350 393219 392818 390539 387144 384393 383403 383671
53156 383671 383884 383300 382077 380591 378941 377154 375423 373919 372495 370855 369010 367340 366151 365334 364552
53141 364552 363594 362412 360960 359257 357555 356249 355585 355505 355716 355874 355882 356072 356918 358389 359885 361003 362058
53124 362058 363546 365363 367023 368418 369777 370976 371520 371355 371144 371505 372343 373166 373707 374037 374313 374648 375055
53107 375055 375340 375173 374361 372922 370899 368313 365340 362355 359705 357537 355736 353891 351510 348627 346066
53092 346066 344645 344139 343470 341976 340093 338629 337854 337472 337180 337021 337304 338294 339798 341168 342013 342779 344203
53075 344203 346202 347902 348853 349589 350710 351939 352544 352337 351862 351762 352240 352971 353373 353197 352905 353148 353863
53058C53863M86J0J04N75N08k21p60o65m14l21L9Q25J281P51k68p35l05N61J240
53039C56554J243L39j029j830j510p19m96r64j426j485j393j404j352j023m81
53024C43024Q9N20O30L31r5j96J08M27M53L20K75L18L62N39J026J634J872J495
53006C53132Q02L42L99P65R39N27m04j299j563j130m11K82R84J584J547O03n30
52989C56569p60k7N74K86k96j47Q17J783K213K251K174K022J853J881K219K722
52973C76134L157L220K606J401K99pL68P53R48J388K228K893K844K303J811J491
52957D03837J195R57Q50O11q6j026j601j550j201r91j062j356j745j999j929j691
52941C91213j649j931k324k682l052l312l031k063r54m49p33j395j925j942j224
$$ plain form
53058 353863 354349 354359 354463 355038 355546 355325 354565 353900 353486 353165 353204 354029 355310 356061 355793 355058 354753 355314 356554
53039 356554 357797 358136 357107 355277 353767 353048 352552 351588 350162 348677 347284 345880 344528 343505 343024
53024 343024 343113 343633 344263 344594 344499 344303 344411 344838 345291 345611 345886 346204 346566 347105 348131 349765 351637 353132
53006 353132 353934 354276 354675 355440 356379 356906 356502 355203 353640 352510 352099 352381 353365 354949 356496 357099 356569
52989 356569 355809 355782 356356 356642 356346 356199 357016 358799 361012 363263 365437 367459 369312 371193 373412 376134
52973 376134 379291 382511 385117 386518 386817 386810 387178 387931 388879 390267 392495 395388 398232 400535 402346 403837
52957 403837 405032 405989 406839 407450 407364 406338 404737 403187 401986 400995 399933 398577 396832 394833 392904 391213
52941 391213 389564 387633 385309 382627 379575 376263 373232 371169 370215 369766 369033 367638 365713 363771 362547
52926C62547l0P79N20l91q72n40l2J44K88O74Q25K35p16j294j431j454j182k71
52908C57799P85R94K93l31l46l32q14j306j154n47n8K74O46Q10M58K1L13J327
52890C58832K125J974J113K61k20m65p10r41r17m95QO1m48r52q35r4P48J238J233
52871C61516Q20L33K90R32J813K126J528N15oN07J726K710K792K321K186K588
52855C84697K696J734m9j820l073l657l365k281j336j689l318m856n087m192l213
52840C51191k713k398j928j541j678k240k591k337j766j344j014l69O37J521J901
52825C33331J866J592J002L3j039j791k035j892j597j303r16j90Q35J617J677
52810C31190J253R39R17J062J575K663L685L607K414J131K10r03k342l196k996
$$ plain form
52926 362547 362517 363296 363816 363425 362553 362013 361981 362125 362413 363087 363912 364147 363431 362137 360706 359252 358070 357799
52908 357799 358584 359578 359871 359540 359194 358862 358048 356742 355588 355041 354983 355257 355903 356713 357171 357192 357505 358832
52890 358832 360957 362931 364044 364305 364085 363620 362910 361969 361052 360557 360565 360626 360178 359226 358391 358297 359045 360283 361516
52871 361516 362336 362669 362959 363891 365704 367830 369358 369873 369867 370374 372100 374810 377602 379923 382109 384697
52855 384697 387393 389127 389078 387258 384185 380528 377163 374882 373546 371857 368539 363683 358596 354404 351191
52840 351191 348478 346080 344152 342611 340933 338693 336102 333765 331999 330655 329641 329272 329909 331430 333331
52825 333331 335197 336789 337791 337824 336785 334994 332959 331067 329470 328167 327251 327061 327896 329513 331190
52810 331190 332443 333382 334299 335361 336936 339599 343284 346891 349305 350436 350646 349743 347401 344205 341209
52795C41209k588k679k641j838j055j227j679j165o6J44o74j105m41M82Q92J071
52779C26640J319J209N54K8K13P45R77Q06M20j40o74o56J25J130J685J665J382
52762C37428J067P43L11l14r66j241j052q72j022j043m35L81O24L50J83J06l56
52745C33892q68n50M60R97P32O62J339J916J661J152J131J192P18J91M76J349
52729C46450J901J974K178K727L132L043K618K074J450Q22K58l30r76j471j654
52714C64196j647j514j104n20l17p62j311j328r47p14p41p92q57j075j266j129
52698C48172p36k91L12J193J951K087J799J734J981J903J107M4n15k92L48Q31
52682C61628Q27M59J39J25L04M51N29O11O38M68J24j46m0N09J160J366R80N35
$$ plain form
52795 341209 338621 335942 333301 331463 330408 329181 327502 326337 326271 326415 325741 324636 324195 324677 325569 326640
52779 326640 327959 329168 329722 329750 329963 330708 331685 332491 332911 332771 332097 331441 331566 332696 334381 336046 337428
52762 337428 338495 339238 339549 339235 338269 337028 335976 335104 334082 333039 332604 332985 333609 333959 334142 334248 333892
52745 333892 333024 332474 332934 333931 334663 335325 336664 338580 340241 341393 342524 343716 344434 344625 345101 346450
52729 346450 348351 350325 352503 355230 358362 361405 364023 366097 367547 368369 368627 368297 367321 365850 364196
52714 364196 362549 361035 359931 359411 359094 358332 357021 355693 354746 354032 353291 352499 351642 350567 349301 348172
52698 348172 347436 347145 347457 348650 350601 352688 354487 356221 358202 360105 361212 361256 360741 360449 360797 361628
52682 361628 362455 362914 363053 363178 363482 363933 364462 365073 365711 366179 366303 366157 366117 366626 367786 369152 370132 370667
52664C70667N52P35L64n53j166r24j96M42Q85J140R78M40J99Q24K061L171L627
52647C83246L133J581m96j898j900j166r55j619k429k615k039r67J87R34R70M90
52631C74457L8J28J028K530L775L778K619J594J681K248J870J79j782k907l120
52616C88116l053l194l469l401k687j611p79l70k7M23P17Q77J413K391K934K438
52600C80718J576J288J313P73j20j92Q39J793J616O31j17j08M93J296J870J867
52584C95536J353Q18O60Q67J219J536J653J483J163Q78N76J44k15j83J01J42k68
52567D07463q79j442j909k083j673p96r3l7n06j107j581j743j429q20m87p24j032
52550C89122o30N14J561J801J496J410J694J691R72O2k83j69l29r58j491j582
$$ plain form
52664 370667 371219 371954 372318 371765 370599 369675 369479 369921 370806 371946 372924 373364 373563 374387 376448 379619 383246
52647 383246 386379 387960 387464 385566 383666 382500 381545 379926 377497 374882 372843 371876 372063 372997 373967 374457
52631 374457 374495 374623 375651 378181 381956 385734 388353 389947 391628 393876 395746 395925 394143 391236 388116
52616 388116 385063 381869 378400 374999 372312 370701 369922 369552 369525 369948 370665 371542 372955 375346 378280 380718
52600 380718 382294 383582 384895 385668 385548 385356 386195 387988 389604 390235 390118 390010 390503 391799 393669 395536
52584 395536 396889 397707 398367 399234 400453 401989 403642 405125 406288 407166 407742 407886 407671 407488 407589 407731 407463
52567 407463 406584 405142 403233 401150 399477 398681 398588 398551 398045 396938 395357 393614 392185 391365 390878 390154 389122
52550 389122 388492 389006 390567 392368 393864 395274 396968 398659 399631 399693 399410 399241 398912 397954 396463 394881
52534C94881j495j369q83p3L27qk66M02J521J908J275L86j49l56k67K67J038J487
52516C98626J445J365J605J998K293K578L014L522L898M072M045L721K803J027
52502D36012j388l529m489m374m177m417m527l929k998k376j951j285o02m05m90
52487C95075l16k4j49m50j53P11J250J107Q77R31Q46L98K06Q01J783K414K570
52470D07877K581K543K327K028J969K312K850L226L259L105K970K640J700L40
52456D41727o16r03j396k737m118m371l845l885m691n015m135k777j834j316r62
52441C99126q62q85n45J14L47j34o45o71n70o94p06m15l52p52q85k16N86O77L98
52422C92916N37R38Q95N24N62J019J177Q61P10J115J738K183K453K594K634L044
$$ plain form
52534 394881 393386 392017 391134 391061 391388 391380 391114 391516 393037 394945 396220 396606 396457 396101 395834 396101 397139 398626
52516 398626 400071 401436 403041 405039 407332 409910 412924 416446 420344 424416 428461 432182 434985 436012
52502 436012 434624 431095 426606 422232 418055 413638 409111 405182 402184 399808 397857 396572 395970 395565 395075
52487 395075 394759 394735 394586 394136 393983 394694 395944 397051 397928 398859 399705 400103 400309 401110 402893 405307 407877
52470 407877 410458 413001 415328 417356 419325 421637 424487 427713 430972 434077 437047 439687 441387 441727
52456 441727 441111 440208 438812 436075 431957 427586 423741 419856 415165 410150 406015 403238 401404 400088 399126
52441 399126 398264 397379 396834 396948 397295 397161 396516 395845 395275 394581 393875 393460 393108 392356 391471 391255 391841 392518 392916
52422 392916 393453 394391 395286 395810 396372 397391 398568 399429 400139 401254 402992 405175 407628 410222 412856 415900
52406D15900M523P004R444J1065J2348J4355J7145J9318J9156J6011J0618M314
52394E61201j774o947j0751j2980j3747j3297j1801r587p341n748m910m418l945
52381D53955l423k828k187j641j100l3J752L426M030L910M332N613O672O662N922
52366D85062M982L707K061P37K34J4n92j340j631j508j274p68J49Q81P74J61q5
52349D91564L23J098K075L055L442K949K361K597L295L350K709K497L290M383
52335E28988N012N370N976O803P560Q299R308J0649J2180J3823J5568J7257J8476
52322F65269J8717J7882J6731J6396J7122J7832J7404J6088J5149J5438J6852
52311H50880J8895K1007K2554K3233K3520K4136K5062K5608K5375K4629K3854
$$ plain form
52406 415900 420423 427427 436871 447936 460284 474639 491784 511102 530258 546269 556887 561201
52394 561201 559427 552480 541729 528749 515002 501705 489904 480317 472976 467228 462318 457900 453955
52381 453955 450532 447704 445517 443876 442776 442743 444495 447921 451951 455861 460193 465806 472478 479140 485062
52366 485062 490044 493751 495812 496549 496783 496797 496205 494865 493234 491726 490452 489684 489833 490714 491488 491649 491564
52349 491564 491887 492985 495060 498115 501557 504506 506867 509464 512759 516109 518818 521315 524605 528988
52335 528988 534000 539370 545346 552149 559709 568008 577316 587965 600145 613968 629536 646793 665269
52322 665269 683986 701868 718599 734995 752117 769949 787353 803441 818590 834028 850880
52311 850880 869775 890782 913336 936569 960089 984225 1009287 1034895 1060270 1084899 1108753
52300A108753K3443K3690K4351K4396K2941K0356J7709J5187J2032Q085M429K119
52288A307491J013K50p99k311m082n434n700n116m649m701m677m176l788l994
52274A259327m083l009r36R74K091K833L793N087O646Q428J0201J1556J2366J2903
52260A328177J3327J3473J3345J3436J4328J6018J7921J9421K0224K0323J9819
52249A509812J8846J7494J5734J3518J1028Q718O988N810M818L677K315Q29n37
52236A619050j415j604j356j200j424j984k858m042n133n463m974m477m640n066
52222A573414m904m074l254k812k374j526m44L78P71J050J632K537L330L715M179
$$ plain form
52300 1108753 1132196 1155886 1180237 1204633 1227574 1247930 1265639 1280826 1292858 1300943 1305372 1307491
52288 1307491 1308504 1308754 1307955 1305644 1301562 1296128 1290428 1285312 1280663 1275962 1271285 1267109 1263321 1259327
52274 1259327 1255244 1252235 1251299 1252273 1254364 1257197 1260990 1266077 1272723 1281151 1291352 1302908 1315274 1328177
52260 1328177 1341504 1354977 1368322 1381758 1396086 1412104 1430025 1449446 1469670 1489993 1509812
52249 1509812 1528658 1546152 1561886 1575404 1586432 1595150 1602138 1607948 1612766 1616443 1618758 1619587 1619050
52236 1619050 1617635 1616031 1614675 1613475 1612051 1610067 1607209 1603167 1598034 1592571 1587597 1583120 1578480 1573414
52222 1573414 1568510 1564436 1561182 1558370 1555996 1554470 1554026 1554404 1555175 1556225 1557857 1560394 1563724 1567439 1571618
$$ [...]
##END NTUPLES=NMR SPECTRUM
##END=
