##TITLE=AC1704_ROEFFECT0028_8638039_x7djjFijcj
##JCAMPDX= 6.0         $$ Bruker NMR JCAMP-DX V2.0
##DATA TYPE= NMR SPECTRUM
##DATA CLASS= NTUPLES
##ORIGIN= BRUKER
##OWNER= Administrator
$$ 1.72 TOPSPIN		Version 2.1
$$ 2014-05-22 22:36:33.771 -0700  Administrator@X
$$ Compression mode = diff/dup
##.OBSERVE FREQUENCY= 400.02188249412
##.OBSERVE NUCLEUS= ^1H
##.ACQUISITION MODE= SIMULTANEOUS (DQD)
##.ACQUISITION SCHEME= undefined
##.AVERAGES= 64
##.DIGITISER RES= 22
##SPECTROMETER/DATA SYSTEM= spect
##.PULSE SEQUENCE= noesygpps1d.comp
##.SOLVENT NAME= COFFEE_meoh
##.SHIFT REFERENCE= INTERNAL, COFFEE_meoh, 1, 14.96113
##AUDIT TRAIL= $$ (NUMBER, WHEN, WHO, WHERE, PROCESS, VERSION, WHAT)
$$ ##TITLE= Audit trail, TOPSPIN		Version 2.1
$$ ##JCAMPDX= 5.01
$$ ##ORIGIN= Bruker BioSpin GmbH
$$ ##OWNER= Administrator
$$ $$ E:\/data/COFFEE/nmr/AC1704_ROEFFECT0028_8638039_x7djjFijcj/12/pdata/1/auditp.txt
$$ ##AUDIT TRAIL=  $$ (NUMBER, WHEN, WHO, WHERE, PROCESS, VERSION, WHAT)
(   1,<2014-05-22 22:36:28.787 -0700>,<Administrator>,<X>,<go>,<TOPSPIN 2.1>,
      <created by zg
	started at 2014-05-22 22:24:58.801 -0700,
	POWCHK enabled, PULCHK disabled,
       configuration hash MD5:
       C8 4E 4E 5D D3 5C D8 9E 9F 52 82 E0 59 8A DE 15
       data hash MD5: 64K
       64 D4 B5 02 B0 F4 29 F2 F6 DE 20 D8 FE 91 72 55>)
(   2,<2014-05-22 22:36:31.771 -0700>,<Administrator>,<X>,<proc1d>,<TOPSPIN 2.1>,
      <Start of raw data processing
       efp LB = 0.3 FT_mod = 6 PKNL = 1 PHC0 = 0 PHC1 = 0 SI = 128K 
       data hash MD5: 128K
       5E AD F8 0C 0D AE D2 6D EE 41 91 6E 25 3E AF FF>)
(   3,<2014-05-22 22:36:32.709 -0700>,<Administrator>,<X>,<proc1d>,<TOPSPIN 2.1>,
      <pk PHC0 = -82.97424 PHC1 = 0 
       data hash MD5: 128K
       B3 EC BD 4C E9 5E 8E C7 A0 45 26 89 60 35 7B 5F>)
(   4,<2014-05-22 22:36:33.162 -0700>,<Administrator>,<X>,<proc1d>,<TOPSPIN 2.1>,
      <abs ABSG = 1 
       data hash MD5: 128K
       BC 2E 06 3C F2 1E 78 36 A0 89 83 5E BB 8B 5E 0B>)
(   5,<2014-05-22 22:36:33.271 -0700>,<Administrator>,<X>,<proc1d>,<TOPSPIN 2.1>,
      <abs ABSG = 2 
       data hash MD5: 128K
       E9 AD 15 DB 0A 17 DB 37 05 11 17 92 E8 E1 72 1B>)
(   6,<2014-05-22 22:36:33.381 -0700>,<Administrator>,<X>,<proc1d>,<TOPSPIN 2.1>,
      <abs ABSG = 3 
       data hash MD5: 128K
       5B 89 65 BB D0 AB D6 5C A8 F4 41 22 CF 55 FA F3>)
(   7,<2014-05-22 22:36:33.490 -0700>,<Administrator>,<X>,<proc1d>,<TOPSPIN 2.1>,
      <abs ABSG = 4 
       data hash MD5: 128K
       5F 64 C7 B2 24 9A 2F C3 7C 47 E8 E3 BA 16 60 6A>)
(   8,<2014-05-22 22:36:33.584 -0700>,<Administrator>,<X>,<proc1d>,<TOPSPIN 2.1>,
      <abs ABSG = 5 
       data hash MD5: 128K
       F4 FF FD 20 7B FC 0A 01 7F A8 8B 75 10 59 0A FB>)
$$ ##END=
$$ 
$$ $$ hash MD5
$$ $$ 8D 8E E1 47 42 8C 4B 81 FC 49 49 85 F2 C2 8C 1B
##$RELAX= 
##$RELAX= 
##$RELAX= 
##$RELAX= 
##$RELAX= 
##$RELAX= 
##$RELAX= 
##$RELAX= 
$$ Bruker specific parameters
$$ --------------------------
##$DU= <E:\>
##$EXPNO= 12
$$ [...]
##$TP07= 0
##$TPNAME0= <>
##$TPNAME1= <>
##$TPNAME2= <>
##$TPNAME3= <>
##$TPNAME4= <>
##$TPNAME5= <>
##$TPNAME6= <>
##$TPNAME7= <>
##$TPOAL= (0..7)
0.5 0.5 0.5 0.5 0.5 0.5 0.5 0.5
##$TPOFFS= (0..7)
0 0 0 0 0 0 0 0
##$TUNHIN= 0
##$TUNHOUT= 0
##$TUNXOUT= 0
##$USERA1= <user>
##$USERA2= <user>
##$USERA3= <user>
##$USERA4= <user>
##$USERA5= <user>
##$V9= 5
##$VALIST= <valist>
##$VCLIST= <CCCCCCCCCCCCCCC>
##$VD= 0
##$VDLIST= <DDDDDDDDDDDDDDD>
##$VPLIST= <PPPPPPPPPPPPPPP>
##$VTLIST= <TTTTTTTTTTTTTTT>
##$WBST= 2048
##$WBSW= 25
##$XGAIN= (0..3)
0 0 0 0
##$XL= 0
##$YL= 0
##$YMAX_a= 6321696
##$YMIN_a= -13676574
##$ZGOPTNS= <>
##$ZL1= 120
##$ZL2= 120
##$ZL3= 120
##$ZL4= 120
##$ABSF1= 14.96113
##$ABSF2= -5.597052
##$ABSG= 5
##$ABSL= 3
##$ALPHA= 0
##$AQORDER= 0
##$ASSFAC= 0
##$ASSFACI= 0
##$ASSFACX= 0
##$ASSWID= 0
##$AUNMP= <proc_prof1d_extract.lims>
##$AXLEFT= 0
##$AXNAME= <>
##$AXNUC= <1H>
##$AXRIGHT= 0
##$AXTYPE= 0
##$AXUNIT= <>
##$AZFE= 0.1
##$AZFW= 0.1
##$BCFW= 0
##$BC_mod= 0
##$BYTORDP= 0
##$COROFFS= 0
##$CY= 15
##$DATMOD= 1
##$DC= 0
##$DFILT= <>
##$DTYPP= 0
##$F1P= 0
##$F2P= 0
##$FCOR= 0.5
##$FTSIZE= 131072
##$FT_mod= 6
##$GAMMA= 0
##$GB= 0
##$INTBC= 1
##$INTSCL= 1
##$ISEN= 128
##$LB= 0.3
##$LEV0= 0
##$LPBIN= 0
##$MAXI= 10000
##$MC2= 0
##$MEAN= 0
##$ME_mod= 0
##$MI= 0
##$NCOEF= 0
##$NC_proc= -2
##$NLEV= 6
##$NOISF1= 0
##$NOISF2= 0
##$NSP= 0
##$NTH_PI= 0
##$NZP= 0
##$OFFSET= 14.96113
##$PC= 1
##$PHC0= -82.97424
##$PHC1= 0
##$PH_mod= 1
##$PKNL= yes
##$PPARMOD= 0
##$PPDIAG= 0
##$PPIPTYP= 0
##$PPMPNUM= 2147483647
##$PPRESOL= 1
##$PSCAL= 4
##$PSIGN= 0
##$PYNMP= <proc.py>
##$REVERSE= no
##$SF= 400.020009586246
##$SI= 131072
##$SIGF1= 0
##$SIGF2= 0
##$SINO= 400
##$SIOLD= 131072
##$SPECTYP= <>
##$SREGLST= <1H.CDCl3>
##$SSB= 0
##$STSI= 131072
##$STSR= 0
##$SW_p= 8223.68421052631
##$SYMM= 0
##$S_DEV= 0
##$TDeff= 65536
##$TDoff= 0
##$TI= <>
##$TILT= no
##$TM1= 0
##$TM2= 0
##$TOPLEV= 0
##$USERP1= <user>
##$USERP2= <user>
##$USERP3= <user>
##$USERP4= <user>
##$USERP5= <user>
##$WDW= 1
##$XDIM= 131072
##$YMAX_p= 347484487
##$YMIN_p= -12016
##$CURPLOT= <Network HP LaserJet P1505>
##$CURPRIN= <$Network HP LaserJet P1505>
##$DFORMAT= <normdp>
##$LAYOUT= <+/1D_H.xwp>
##$LFORMAT= <normlp>
##$PFORMAT= <normpl>
##$SURQMSG= 1
$$ End of Bruker specific parameters
$$ ---------------------------------
##NTUPLES= NMR SPECTRUM
##VAR_NAME=  FREQUENCY,     SPECTRUM/REAL,   SPECTRUM/IMAG
##SYMBOL=    X,             R,               I
##VAR_TYPE=  INDEPENDENT,   DEPENDENT,       DEPENDENT
##VAR_FORM=  AFFN,          ASDF,            ASDF
##VAR_DIM=   131072,        131072,          131072
##UNITS=     HZ,            ARBITRARY UNITS, ARBITRARY UNITS
##FACTOR=    0.0627417313425164, 1,          1
##FIRST=     8223.62146879497, 2978,         -64231
##LAST=      0,             4740,            -64222
##MIN=       0,             -12016,          0
##MAX=       8223.62146879497, 347484487,    0
$$ Real data points
##PAGE= N=1
##DATA TABLE= (X++(R..R)), XYDATA
$$ [...]
61670D23330K85o51j371j533j144o52m50k96L72J468K079J540L67j55P28K500
61654D26417L898M165L805L897M668N126M403K961J894J431J002N73Q17J751K294
61639D69102J713P28M68R24J246J151J134J416J499J017M06L56Q86J290J017K30
61623D84583n56j260k229l461m211l867k923k490k878l302l169k948l349m137
61609D43803m443l995l442l434l920m440m680m516l821k655j535j169j711k479
61595C97563k687k353k169k487k833k631k016j579j544j610j468j098p01o68j380
61580C70339k585l230k473q50J92J3o09o17J22R69J331J048L90p1M1L47Q3p67
61562C63673j265p20L58R41P52L63L30P29J353J868J849J183M13K92R01J558J641
$$ plain form
61670 423330 423615 422964 421593 420060 418916 418264 417814 417518 417890 419358 421437 422977 423344 423189 423917 426417
61654 426417 430315 434480 438285 442182 446850 451976 456379 459340 461234 462665 463667 464240 465057 466808 469102
61639 469102 470815 471543 472011 472935 474181 475332 476466 477882 479381 480398 480804 481160 482046 483336 484353 484583
61623 484583 484027 482767 480538 477077 472866 468999 466076 463586 460708 457406 454237 451289 447940 443803
61609 443803 439360 435365 431923 428489 424569 420129 415449 410933 407112 404457 402922 401753 400042 397563
61595 397563 394876 392523 390354 387867 385034 382403 380387 378808 377264 375654 374186 373088 372387 371719 370339
61580 370339 367754 364524 362051 361201 361393 361406 360797 360180 360302 361271 362602 363650 364040 363969 364010 364357 364440 363673
61562 363673 362408 361688 362046 362987 363739 364102 364432 365161 366514 368382 370231 371414 371827 372119 373020 374578 376219
61545C76219J253R03Q10P80O74O96J115J820K359K402K032J593J376J502J873
61530C97407K199K243K134K159K154J539K09j060j475j204r72j012r99q11p61
61515D01750r56j112r70n53L3O39Q99N60p5m33l84k02j3K08K46rNR32K304K835
61495D05704K107J160J089J818K594K941K720J954J103R16J468J944J768J420
61481D30706J586K124K424K397K412K612K842K993K929K376J329L40m1N8O0m14
61465D56733j318k293k788k501j903j814k250k340j710j156j403j992k129j960
61451D29176k025k009j093O27K064K509K262J892J599J400J330J364J461J684
61437D42241K005K186K242K638L497M074L668K697K031J647R02o8l93N3L33k5
$$ plain form
61545 376219 377472 378375 379185 379965 380639 381335 382450 384270 386629 389031 391063 392656 394032 395534 397407
61530 397407 399606 401849 403983 406142 408296 409835 410044 408984 407509 406305 405333 404321 403322 402511 401750
61515 401750 400794 399682 398712 398159 398192 398831 399730 400290 400215 399782 399398 399196 399183 399391 399637 399628 399633 400565 402869 405704
61495 405704 407811 408971 410060 411878 414472 417413 420133 422087 423190 424106 425574 427518 429286 430706
61481 430706 432292 434416 436840 439237 441649 444261 447103 450096 453025 455401 456730 457070 457029 457087 457147 456733
61465 456733 455415 453122 450334 447833 445930 444116 441866 439526 437816 436660 435257 433265 431136 429176
61451 429176 427151 425142 424049 424676 426740 429249 431511 433403 435002 436402 437732 439096 440557 442241
61437 442241 444246 446432 448674 451312 454809 458883 462551 465248 467279 468926 469828 469760 469367 469420 469753 469728
61421D69728k64L39J279J566J141Q23J200K103K987L328K798J497k3j170j763
61406D85569j965j945j758j465j189j103j282j532j447q62j43J88P9p8p1n5j94
61389D70747l94n05m53j23M97J101J347J432J905K763L270K979K496K697L495
61374D93254L983L699L114K750K366J439J26p69p62k09K75N01N70M72J48j73j63
61357E10621J54N16R26J588K365K873L117L533M186M570M436M286M533M796M541
61342E57041M012L838M048M086L667K982K207J416R42J155J784K021J438M13m65
61327E90585r82j222j278j228j116q28k51M93J180J817K498L009L078L016L526
61312F02297M705N795O213O365P008Q090Q813Q747Q339Q240Q489Q588Q127P027
$$ plain form
61421 469728 469464 469803 471082 472648 473789 474612 475812 477915 480902 484230 487028 488525 488502 487332 485569
61406 485569 483604 481659 479901 478436 477247 476144 474862 473330 471883 471021 470878 471066 471145 471067 470996 470941 470747
61389 470747 470353 469848 469395 469272 469769 470870 472217 473649 475554 478317 481587 484566 487062 489759 493254
61374 493254 497237 500936 504050 506800 509166 510605 510731 509962 509200 508991 509266 509767 510337 510809 510957 510784 510621
61357 510621 510775 511291 512217 513805 516170 519043 522160 525693 529879 534449 538885 543171 547704 552500 557041
61342 557041 561053 564891 568939 573025 576692 579674 581881 583297 584239 585394 587178 589199 590637 591050 590585
61327 590585 589603 588381 587103 585875 584759 583931 583680 584173 585353 587170 589668 592677 595755 598771 602297
61312 602297 607002 612797 619010 625375 632383 640473 649286 658033 666372 674612 683101 691689 699816 706843
61298G06843N362L254J033q42k231l454m782n999o722o984p134p239p093o761
61284F57251o643o820o823o221n049l516j797l50K05l6m1R77K486L385L485L554
61268F34047M049M506M328L595K872K547K603K847L224L916N059O365P228P362
61254F94548P017O460N536M140K769K125K228K323J687K94j272k377k831k984
61240G19663l233l496l307k490j443p43p76j613k740l022j693M85J846J876J697
61225G01011K262L141L673M167M963N331M532L323L056L763M425M692N058N498
61211G58895N401M808M433M306L657K424J642J996K932L614L840L794L752M325
61197H09819O012Q265R820J0357J0840J1917J2927J3040J2406J1582J0612R315
$$ plain form
61298 706843 712205 715459 716492 715650 713419 709965 705183 699184 692462 685478 678344 671105 664012 657251
61284 657251 650608 643788 636965 630744 625695 622179 620382 620032 620237 620201 620160 621137 623623 627008 630493 634047
61268 634047 638096 642602 646930 650525 653397 655944 658547 661394 664618 668534 673593 679958 687186 694548
61254 694548 701565 708025 713561 717701 720470 722595 724823 727146 728833 729127 727855 725478 722647 719663
61240 719663 716430 712934 709627 707137 705694 704951 704175 702562 699822 696800 695107 695592 697438 699314 701011
61225 701011 703273 706414 710087 714254 719217 724548 729080 732403 735459 739222 743647 748339 753397 758895
61211 758895 764296 769104 773537 777843 781500 783924 785566 787562 790494 794108 797948 801742 805494 809819
61197 809819 815831 824096 833916 844273 855113 867030 879957 892997 905403 916985 927597 936912
61185I36912P836O273M417K430J162J028J148L25j457l160m077m449m873n610
61171I37905o444o983p134p327q052r164j0036j0400j0514j0499j0184r716r528
61158H21924r419q472o401m260l253l319l467l035k061q27M16J481K402L322L913
61143G88944L464J832j14j443k081k397k451k118j557r48j39J006K263L445M756
61128G92462O310P793R032J0409J2158J3794J4859J5760J7100J8628J9612J9994
61116I57911K0387K1136K2106K3113K3852K3674K2287K0626K0023K0485K0590
61105A196190J9295J7005J4645J2454J0182P796N421K855l03m097q022j1349j3621
61092A248451j4949j5918j7077j8451j9677k0526k1098k1499k1594k1173k0175
$$ plain form
61185 936912 944748 951021 955438 957868 959030 960058 961206 961531 960074 956914 952837 948388 943515 937905
61171 937905 931461 924478 917344 910017 901965 892801 882765 872365 861851 851352 841168 831452 821924
61158 821924 812505 804033 797632 793372 790119 786800 783333 780298 778237 777410 777826 779307 781709 785031 788944
61143 788944 792408 794240 794126 792683 790602 788205 785754 783636 782079 781131 780992 781998 784261 787706 792462
61128 792462 798772 806565 815597 826006 838164 851958 866817 882577 899677 918305 937917 957911
61116 957911 978298 999434 1021540 1044653 1068505 1092179 1114466 1135092 1155115 1175600 1196190
61105 1196190 1215485 1232490 1247135 1259589 1269771 1277567 1282988 1285843 1285540 1281443 1273421 1262072 1248451
61092 1248451 1233502 1217584 1200507 1182056 1162379 1141853 1120755 1099256 1077662 1056489 1036314
61081A036314j8777j7372j6341j5716j5094j4142j3026j2169j1610j0972r994
61070H81101q811p684o683n755m829l851k874k087j560j018j27R60J679J821J891
61055H42173K464L422M182M580N147O355P955R306J0206J1012J2068J3279J4405
61042I46554J5379J6244J6918J7297J7404J7374J7444J7981J9181K0579K1322
61031A143677K1164K0802K0872K1143K1187K1427K2608K4533K6237K7486K9183
61020A400319L1993L5247L7738L9142M0297M2305M5743N0656N7057O5295P5818
61009A921610Q8622J03318J20036J39909J64396J94561K31345K75808L28278L87731
60999C955614M52681N22237N95798O73116P56264Q50305R59654J084624J223250
$$ plain form
61081 1036314 1017537 1000165 983824 968108 953014 938872 925846 913677 902067 891095 881101
61070 881101 872290 864606 857923 852168 847339 843488 840614 838527 836967 835949 835822 836782 838461 840282 842173
61055 842173 844637 848059 852241 856821 861968 868323 876278 885584 895790 906802 918870 932149 946554
61042 946554 961933 978177 995095 1012392 1029796 1047170 1064614 1082595 1101776 1122355 1143677
61031 1143677 1164841 1185643 1206515 1227658 1248845 1270272 1292880 1317413 1343650 1371136 1400319
61020 1400319 1432312 1467559 1505297 1544439 1584736 1627041 1672784 1723440 1780497 1845792 1921610
61009 1921610 2010232 2113550 2233586 2373495 2537891 2732452 2963797 3239605 3567883 3955614
60999 3955614 4408295 4930532 5526330 6199446 6955710 7806015 8765669 9850293 11073543
60990A1073543J371956J513949J603326J573247J379862J048339O70903L51151
60982B0586276J45952N5182N0948R7992J44762J17600m7486l54404p32369j078664
60972A8985789j320056j440205j463116j423308j349448j261266j169387j076292
60964H482711r80597q81685p80768o80132n83439m95330m18815l53584k97994
60955C010367k51489k13833j83382j57959j36691j19419j05071r2313q1147p2187
60945A596876o4835n7888n1574m7277m5256m4192m2983m1633m0268l8668l6958
60934A085344l5585l4370l2601l0186k7812k5852k4062k2333k0823j9326j7483
60923G94911j5579j4244j3323j2062j0416r126q436p727o630n551m883m479m103
$$ plain form
60990 11073543 12445499 13959448 15562774 17136021 18515883 19564222 20235125 20586276
60982 20586276 20732228 20787410 20838358 20936350 21081112 21198712 21151226 20796822 20064453 18985789
60972 18985789 17665733 16225528 14762412 13339104 11989656 10728390 9559003 8482711
60964 8482711 7502114 6620429 5839661 5159529 4576090 4080760 3661945 3308361 3010367
60955 3010367 2758878 2545045 2361663 2203704 2067013 1947594 1842523 1750210 1669063 1596876
60945 1596876 1532041 1474153 1422579 1375302 1330046 1285854 1242871 1201238 1160970 1122302 1085344
60934 1085344 1049759 1015389 982788 952602 924790 898938 874876 852543 831720 812394 794911
60923 794911 779332 765088 751765 739703 729287 720161 711725 703998 697368 691817 686934 682455 678352
60910F78352l730l238k504j813j511j298o88Lm9r01j737k001j845j548j394j953
60894F52145l432m919n317m965n100n872o261o057o235p014p085n605l666k882
60880E77735l462m508n345n703n336m330l306k763k625k710k986l094k531j699
60866E27337j692k494k588j116O50J093N60N87J486K162K016J686J751J897J653
60851E34988J129O88M86N69R12J193R19P5p35r70q11r19j674k805l746m253m529
60834E20517m775m874m723m611m927n548n946n853n474n035m519l859l039k043
60820D55291j078p21j320k321k774k501k125j956j618r60n11p18j288j697j845
60805D31858j900j897j791j580j246q90q85j353j583p75O42J297O88j63k11L49
$$ plain form
60910 678352 674622 671384 668880 667067 665556 664258 663570 663573 663524 662623 660886 658885 657040 655492 654098 652145
60894 652145 648713 643794 638477 633512 628412 622540 616279 610222 603987 596973 589888 584283 580617 577735
60880 577735 574273 569765 564420 558717 553381 549051 545745 542982 540357 537647 534661 531567 529036 527337
60866 527337 525645 523151 520563 519447 520097 521190 521750 522337 523823 525985 528001 529687 531438 533335 534988
60851 534988 536117 536805 537291 537860 538772 539965 540884 540959 540224 539254 538443 537524 535850 533045 529299 525046 520517
60834 520517 515742 510868 506145 501534 496607 491059 485113 479260 473786 468751 464232 460373 457334 455291
60820 455291 454213 453492 452172 449851 447077 444576 442451 440495 438877 437917 437406 436688 435400 433703 431858
60805 431858 429958 428061 426270 424690 423444 422554 421669 420316 418733 417958 418600 419897 420585 420422 420211 420560
60789D20560Q30J157J551J744J322M83j80l93l17k21l98r75j539j434p44l71q20
60772D20255j426j329o50j24k6j4K72R16J710K144J794J014P67J407K206K393
60756D31309K108J818J494R60M90M27N29L48p4l48k70J53P72J058M17q28j466
60739D38897r36j87l09j081j642j944k524l284l599l377l043k679k020j229p77
60724D10266o79n31k64j25n1K08M25Q5p82j577j847j549q43j56j68r36j429p40
60706C99307M54O85k25r68o87j7J47j40l50l84m59o42r56j458j874j632n97N92
60688C90796J276J447J484J525J460J230R37P93J011J487J711J408J210J983L451
60673D13209M226L534K202J509J635J847J714J358P93j62j244j763j481j003r37
$$ plain form
60789 420560 421390 422547 424098 425842 427164 427647 427467 427074 426757 426536 426138 425163 423624 422190 421446 421075 420255
60772 420255 418829 417500 416850 416726 416700 416686 416958 417874 419584 421728 423522 424536 425303 426710 428916 431309
60756 431309 433417 435235 436729 437689 438179 438606 439135 439483 439409 439061 438791 438944 439716 440774 441191 440363 438897
60739 438897 437961 437774 437465 436384 434742 432798 430274 426990 423391 420014 416971 414292 412272 411043 410266
60724 410266 409587 409056 408792 408667 408616 408824 409249 409334 408552 406975 405128 403579 402736 402580 402412 401476 400047 399307
60706 399307 399761 400446 400221 399253 398566 398549 398696 398556 398206 397822 397363 396721 395765 394307 392433 390801 390204 390796
60688 390796 392072 393519 395003 396528 397988 399218 400155 400948 401959 403446 405157 406565 407775 409758 413209
60673 413209 417435 420969 423171 424680 426315 428162 429876 431234 432027 431865 430621 428858 427377 426374 425437
60658D25437j068q00k06j2n02r70o45K10O89N58N18J061J745J938J752J731J920
60641D33356J859J309M43o20j877k991l323k649j542p81o19p38p61n89l28o6K08
60624D20291N54R13J087R01L87j89m48j50N33J072J119Q85P77P75N71K54K38N35
60606D30105O55M49M21Q59J288J175O58Q0n59j185j219l84N53P13M65Q84K035
60589D36993K789K497J874J873K438K821K591J911J133N71M68Q26J373J833K102
60574D64093K144J899J466J190J460K419L836N236O211O823P489Q451R471J0260
60560E32448J0804J1019J0437Q764O528M612L212J832K66j044j738k079k488k953
60546E79620l153k891k134r57L79J483K268L170M637O541Q302R608J0778J2297
$$ plain form
60658 425437 424369 423569 423363 423351 422849 421879 421234 421444 422133 422691 423209 424270 426015 427953 429705 431436 433356
60641 433356 435215 436524 436967 436347 434470 431479 428156 425507 423965 423184 422565 421827 421066 420477 420149 420083 420291
60624 420291 420845 421758 422845 423746 424133 423944 423496 423346 423879 424951 426070 426955 427732 428507 429078 429332 429570 430105
60606 430105 430760 431209 431630 432489 433777 434952 435610 435690 435131 433946 432727 432343 432896 433609 434074 434958 436993
60589 436993 439782 442279 444153 446026 448464 451285 453876 455787 456920 457491 457959 458785 460158 461991 464093
60574 464093 466237 468136 469602 470792 472252 474671 478507 483743 489954 496777 504266 512717 522188 532448
60560 532448 543252 554271 564708 573472 580000 584612 587824 589656 589922 588878 587140 585061 582573 579620
60546 579620 576467 573576 571442 570485 570864 572347 574615 577785 582422 588963 597265 606873 617651 629948
60532F29948J4137J5750J6791J7504J8215J8638J8076J6289J3742J0933P903M536
60520H02462J004k342n182p199q205q518q821r408r865r808r457r125q582p384
60506F99570n500l203p15J680L524M855O601R636J3589J7240J9965K2239K4746
60493H14227K7634L0668L3564L6019L7720L8441L7918L5843L2256K7830K3350
60482A175470J9124J5204J1885R512P895O362M255J035l817j0392j7954k5385
60470A193194l1915l7134m0673m2436m2925m2749m1946m0376l8344l6221l3709
60459G64766l0383k6803k4123k2537k0980j8593j5771j3465j2068j1269j0528
60448E58246r437p991o647n790n095l912k270j024q11j371j957k038j499o13M8
$$ plain form
60532 629948 644085 659835 676626 694130 712345 730983 749059 765348 779090 790023 797926 802462
60520 802462 803466 801124 795942 788743 780538 772020 763199 753791 743926 734118 724661 715536 706954 699570
60506 699570 694070 690867 690152 691832 695356 700211 706812 716448 730037 747277 767242 789481 814227
60493 814227 841861 872529 906093 942112 979832 1018273 1056191 1092034 1124290 1152120 1175470
60482 1175470 1194594 1209798 1221683 1231195 1239090 1245452 1249707 1250742 1246925 1236533 1218579 1193194
60470 1193194 1161279 1124145 1083472 1041036 998111 955362 913416 873040 834696 798475 764766
60459 764766 734383 707580 683457 660920 639940 621347 605576 592111 580043 568774 558246
60448 558246 548809 540818 534171 528381 523286 519374 517104 516080 515269 513898 511941 509903 508404 507791 507839
60433E07839J0o69j535k219k565k486k064j619j289p92l2L96m1r06j266q65j28
60416D89769P46J831K757K931K439J983J845J713J490J487J715J859J963K326
60402E16854K707K561K069J971K290K315J980K107K928L549L381L005L029L165
60388E53911L068L099L431L418K752K364L133M348M643L927L300L284L330K949
60374F00957K475K415K779L172L223K873K467K407K478J886L56j122j230J64J929
60359F27229K934L083L103L704M878N883O065N670N575O093O703P022P406Q101
60345G03449Q493P902O581N303M221K906J229n47k378m426o398p561p614p125
60331G04035o861p016p223p089o539n766m988m320l889l818l907l571k538j455
$$ plain form
60433 507839 507849 507180 505645 503426 500861 498375 496311 494692 493403 492611 492579 492975 492934 492028 490762 489897 489769
60416 489769 490515 492346 495103 498034 500473 502456 504301 506014 507504 508991 510706 512565 514528 516854
60402 516854 519561 522122 524191 526162 528452 530767 532747 534854 537782 541331 544712 547717 550746 553911
60388 553911 556979 560078 563509 566927 569679 572043 575176 579524 584167 588094 591394 594678 598008 600957
60374 600957 603432 605847 608626 611798 615021 617894 620361 622768 625246 627132 627488 626366 625136 625300 627229
60359 627229 630163 633246 636349 640053 644931 650814 656879 662549 668124 674217 680920 687942 695348 703449
60345 703449 711942 719844 726425 731728 735949 738855 740084 739537 737159 732733 726335 718774 711160 704035
60331 704035 697174 690158 682935 675846 669307 663541 658553 654233 650344 646526 642619 639048 636510 635055
60317F35055j191j529j303l8J381K157K841M455O901R181J0886J2498J4289J5743
60303G11326J6267J5847J4849J3666J2730J2287J1941J0794Q434N467K720N7l468
60290H32917q252j3232j6718j7959j7629j6847j6151j5497j4744j3786j2499j0978
60278F58625r599q515p420o172n251n076n246n140m871m834m737m078l369l565
60264E80752m318m106k482q78n47j020j304j540k334l265l281k199q54Q7O37J009
60248E54357J345J785K261K347J841J254J259J791K146J798Q35k18p62n68q2N0
60232E71439o2L33J372K134J923J327J464K666M383N868O471N826M448L575L844
60217F17011M542M751M631M943N828O858P815Q667R176R279R438R939J0304J0116
$$ plain form
60317 635055 633864 632335 631032 630994 632375 634532 637373 641828 648729 657910 668796 681294 695583 711326
60303 711326 727593 743440 758289 771955 784685 796972 808913 819707 828141 833608 836328 836385 832917
60290 832917 824665 811433 794715 776756 759127 742280 726129 710632 695888 682102 669603 658625
60278 658625 649026 640511 633091 626919 621668 616592 611346 606206 601335 596501 591764 587686 584317 580752
60264 580752 576434 572328 569846 568968 568421 567401 566097 564557 562223 558958 555677 553478 552624 552711 553348 554357
60248 554357 555702 557487 559748 562095 563936 565190 566449 568240 570386 572184 573019 572801 572039 571471 571389 571439
60232 571439 571377 571710 573082 575216 577139 578466 579930 582596 586979 592847 599318 605144 609592 613167 617011
60217 617011 621553 626304 630935 635878 641706 648564 656379 665046 674222 683501 692939 702878 713182 723298
60203G23298R827R860R517P971N947N071N664O341N864M384K683J244K65k31o01
60188G97104j305k312l323m428n815o938o963o107n531n681n674m772l601l257
60174G31397l808m347m248l736l335l175k955k495k107k233k677k651j845j026
60160F90759j047j646j884j456q67m25Q0O40Q11M12j26m23n65o71n57j03M00O15
60142F83947O07P53J276J963K331K173K005K604L908M801M450L482L206L974M927
60127G26407N227M838M210L760L679L777L555K864K303K507L251L848M094M208
60113G78528M152L808L578L911M350L978K784J683J090M98m40j358j980k647l572
60098G98363m354m660m696m671m375l726l155l024l142l239l446l912m379m529
$$ plain form
60203 723298 733125 742985 752502 760473 766420 771491 777155 783496 789360 793744 796427 797671 797936 797705 797104
60188 797104 795799 793487 790164 785736 779921 772983 766020 759913 754382 748701 743027 738255 734654 731397
60174 731397 727589 723242 718994 715258 711923 708748 705793 703298 701191 698958 696281 693630 691785 690759
60160 690759 689712 688066 686182 684726 683859 683434 683514 684154 684965 685377 685251 684828 684263 683592 683035 682932 683332 683947
60142 683947 684554 685307 686583 688546 690877 693050 695055 697659 701567 706368 710818 714300 717506 721480 726407
60127 726407 731634 736472 740682 744442 748121 751898 755453 758317 760620 763127 766378 770226 774320 778528
60113 778528 782680 786488 790066 793977 798327 802305 805089 806772 807862 808360 807920 806562 804582 801935 798363
60098 798363 794009 789349 784653 779982 775607 771881 768726 765702 762560 759321 755875 751963 747584 743055
60084G43055m415m237l913l228k265j508j584k745m375n309n103m679n077n884
60070F88733n830m799m086m418m960m778m246m203m547m552m057l457k884k211
60056F29705j701j860k604l182k963j993p24M51J392K150K823L398L807M107M392
60041F37198M529M321L948L894M266M580M359L631K637J491L04o69j382k156l187
60026F67764m157m681m857n074n436n788o161o721p317p475p008o383o233o643
60012E83830p121p243o983o430n506m296l303k923k745k007p52J31J72m3K23R11
59996E35915J532J820J609P30l63n59N91K072K755K967L685M737N066M506L931
59981E70994L686L076J686O4j266k442l558m162l929l205k532k121j985k038j962
$$ plain form
60084 743055 738640 734403 730490 727262 724997 723489 721905 719160 714785 709476 704373 699694 694617 688733
60070 688733 682903 678104 674018 669600 664640 659862 655616 651413 646866 642314 638257 634800 631916 629705
60056 629705 628004 626144 623540 620358 617395 615402 614678 615129 616521 618671 621494 624892 628699 632806 637198
60041 637198 641727 646048 649996 653890 658156 662736 667095 670726 673363 674854 675158 674489 673107 670951 667764
60026 667764 663607 658926 654069 648995 643559 637771 631610 624889 617572 610097 603089 596706 590473 583830
60012 583830 576709 569466 562483 556053 550547 546251 542948 540025 537280 535273 534521 534652 534824 534781 535004 535915
59996 535915 537447 539267 540876 541606 541243 540684 541275 543347 546102 549069 552754 557491 562557 567063 570994
59981 570994 574680 577756 579442 579506 578240 575798 572240 568078 564149 560944 558412 556291 554306 552268 550306
59966E50306j553j184j306j606j454j077j246j815j710n93O06J129J317J634J830
59951E43278J646J428J465J492J379J463J740J576Q45L50N27O62J74k70J09Q01
59935E58665Q03K44J04P12J511K031K235K118J819J874K614L409L359K529J840
59920E85867J731J760J515J228J264J525J628J417J130J111J371J464J011L08
59906F04330N9M24P77N82O4k91m29n71p48p65m86P2P28J197J488K127L471M938
59888F16967N668N788O100O568O301N270M719N309O140O294O233O649P089O848
59874G01943O349O320O317N378L677K260J470Q34J97k04o34j588k722l153k860
59859G23584k716l060l262k841k120j491r12l48LK02O53J444K171K560K760K869
$$ plain form
59966 550306 548753 547569 546263 544657 543203 542126 540880 539065 537355 536762 537368 538497 539814 541448 543278
59951 543278 544924 546352 547817 549309 550688 552151 553891 555467 556312 556662 557189 557851 558025 557755 557864 558665
59935 558665 559468 559712 559816 560528 562039 564070 566305 568423 570242 572116 574730 578139 581498 584027 585867
59920 585867 587598 589358 590873 592101 593365 594890 596518 597935 599065 600176 601547 603011 604022 604330
59906 604330 604389 604813 605590 606172 606236 605945 605516 604945 604197 603432 602946 603018 603746 604943 606431 608558 612029 616967
59888 616967 622635 628423 634523 641091 647392 652662 657381 662690 668830 675124 681357 688006 695095 701943
59874 701943 708292 714612 720929 726307 729984 732244 733714 734548 734745 734541 733907 732319 729597 726444 723584
59859 723584 720868 717808 714546 711705 709585 708094 707182 706834 706837 707039 707692 709136 711307 713867 716627 719496
59843G19496K781K639K985M179N901P351P724O702M867L391K932K943K584J988
59829G78463J996K848L847M248L786K396J88k179l859m698n178n462n185m331
59815G66880l596l459l505l133k454k086k324k930l608m270m866n224n119m539
59801G15767l888l732m199m714m616l899l150k790k725k739k874l272l771l885
59787F65513l269k247j692k137l115l680l569l282l027k319r47L43P76O18P32
59772F38698J354K027K494K949L520M016M257M201L852L408L361M022N102O084
59758F89345O773P121O868N960N090N120N995O776O787O240N657N167M510L475
59744G70884K166R82K92P3L5J29N54J144J260O43m7m8N54J166J563J959K386K620
$$ plain form
59843 719496 722277 724916 727901 732080 737981 745332 753056 759758 764625 768016 770948 773891 776475 778463
59829 778463 780459 783307 787154 791402 795188 797584 797772 795593 791734 787036 781858 776396 771211 766880
59815 766880 763284 759825 756320 753187 750733 748647 746323 743393 739785 735515 730649 725425 720306 715767
59801 715767 711879 708147 703948 699234 694618 690719 687569 684779 682054 679315 676441 673169 669398 665513
59787 665513 662244 659997 658305 656168 653053 649373 645804 642522 639495 637176 636229 636572 637348 637966 638698
59772 638698 640052 642079 644573 647522 651042 655058 659315 663516 667368 670776 674137 678159 683261 689345
59758 689345 696118 703239 710107 716067 721157 726277 732272 739048 745835 752075 757732 762899 767409 770884
59744 770884 773050 774032 774324 774397 774432 774561 775115 776259 777519 778162 778115 778067 778621 779787 781350 783309 785695 788315
59726G88315K541K185J621J132J218K097L381M550N334N438M534K960J826J793
59712H28925K290K539K658L053L378L097K549K470K777K883K900L456M443N074
59698H72492N154N276N673N815N367M770M598M931N418N479M471K302j96k067
59684I29483l256m258n073n295n078n093n545o076o544p163p842q241q412q643
59670H42964q685p975o614n369m607m023l376k738k006j028j32K88N69J335K302
59655H00905K594K231K221K989L813L977L550K734J481J8j112j874k728l690m355
59640H12754m972o288p988q626p699o654o909p995q515q107p433o774n861m793
59626G14140m136m137m479m817n086n321n481n534n449n288n230n308n118m221
$$ plain form
59726 788315 790856 793041 794662 795794 797012 799109 802490 807040 812374 817812 822346 825306 827132 828925
59712 828925 831215 833754 836412 839465 842843 845940 848489 850959 853736 856619 859519 862975 867418 872492
59698 872492 877646 882922 888595 894410 899777 904547 909145 914076 919494 924973 929444 931746 931550 929483
59684 929483 926227 921969 916896 911601 906523 901430 895885 889809 883265 876102 868260 860019 851607 842964
59670 842964 834279 826304 819690 814321 809714 805691 802315 799577 797571 796543 796411 796699 797268 798603 800905
59655 800905 803499 805730 807951 810940 814753 818730 822280 825014 826495 826513 825401 823527 820799 817109 812754
59640 812754 807782 801494 793506 784880 777181 770527 763618 755623 747108 739001 731568 724794 718933 714140
59626 714140 710004 705867 701388 696571 691485 686164 680683 675149 669700 664412 659182 653874 648756 644535
59612F44535k879j945j887k292k426j874o74P02J527J445R84R17J303J610J664
59597F40710J718J749J476J026Q15Q02O72O41J136J779J719J006M66K14m38j360
59581F54131j388j83R80R17j18j346k573l672m091l767l566m003m420m172l726
59566F19003l673l594k860j800j090o70k11Nl55p86n77J33P59J202J602J699J291
59549F10078R23J191J837K270K606L314M281N018N508O101O890P825R073J0713
59535F77628J2486J4331J6455J8195J7721J4018Q527L824J092j32m21pM70K10
59521G84397p00j435j657j688j723j795k398m002o070p500q097q549r112r320
59507G20351r113r043r152q692p353n867m966m528m115l706l437l212k934k632
$$ plain form
59612 644535 641656 639711 637824 635532 633106 631232 630558 631260 632787 634232 635216 636133 637436 639046 640710
59597 640710 642428 644177 645653 646679 647494 648296 648968 649609 650745 652524 654243 655249 655715 655929 655491 654131
59581 654131 652743 652560 653540 654457 654339 652993 650420 646748 642657 638890 635324 631321 626901 622729 619003
59566 619003 615330 611736 608876 607076 605986 605316 605105 605110 604755 603969 603392 603525 604284 605486 607088 608787 610078
59549 610078 611001 612192 614029 616299 618905 622219 626500 631518 637026 643127 650017 657842 666915 677628
59535 677628 690114 704445 720900 739095 756816 770834 779361 783185 784277 784145 783724 783717 784187 784397
59521 784397 783697 782262 780605 778917 777194 775399 773001 768999 762929 755429 747332 738783 729671 720351
59507 720351 711238 702195 693043 684351 676998 671131 666165 661637 657522 653816 650379 647167 644233 641601
59493F41601k127j127J48R88J136J192J688K350K631K569K680L256M137M946N306
59478F71374N030M322L700L545L898M592N375N814N555M830M320M261L947K656
59464G33219Q55p1N46J733K050J378R32J548K703L574M304N433O594O855O192
59449G77845N593N571N564N059M296L451K115J82j559k515l186m260n370n621
59435G87165m918l970l316l005k910k717j967o85L86P91J130K252M145O218Q159
59420G86758R826J0881J1371J2093J3498J4792J5143J5108J5713J6713J7211J7531
59408I56638J8612J9541J7600J1467L093m256q735j0219r295o990m574k539k48
59395I80095K583M545L551q97p098j2612j5966j7127j7003j6489j5812j4683j2988
$$ plain form
59493 641601 639474 638347 638495 639483 640619 641811 643499 645849 648480 651049 653729 656985 661122 666068 671374
59478 671374 676404 680726 684426 687971 691869 696461 701836 707650 713205 718035 722355 726616 730563 733219
59464 733219 734074 734003 734549 736282 738332 739710 740642 742190 744893 748467 752771 758204 764798 771653 777845
59449 777845 783438 789009 794573 799632 803928 807379 809494 809676 808117 805602 802416 798156 792786 787165
59435 787165 782247 778277 774961 771956 769046 766329 764362 763677 764063 764854 765984 768236 772381 778599 786758
59420 786758 796584 807465 818836 830929 844427 859219 874362 889470 905183 921896 939107 956638
59408 956638 975250 994791 1012391 1023858 1026951 1022695 1013960 1003741 994446 987456 982882 980343 980095
59395 980095 982678 987223 990774 989877 982779 970167 954201 937074 920071 903582 887770 873087 860099
59382H60099j1084r362p914o761n975n360m383k730p28J007K114K594K658K653
59368H16828K844L090K980K475K111K400L251M252N215O224P221P952Q312Q505
59354H83660Q775R124R460R920J0811J2100J3167J3386J2873J2279J1837J1170
59342A018562J0117R164Q607P824O037L417Q01j540m070o920r417j0914j1632
59329A020036j2292j3245j4231j4855j5085j5220j5432j5469j4901j3737j2580
59318H62989j1980j1868j1711j1107j0083q984q201p825p457o663n632m982m851
59305G51645m649l992l263k891k583j782m31J159K798M291N325O056P320R546
59291G68549J1823J2746J1980J0198P823M722J161j840l366l437k816k322k228
$$ plain form
59382 860099 849015 839653 831739 824978 819003 813643 809260 806530 805802 806809 808923 811517 814175 816828
59368 816828 819672 822762 825742 828217 830328 832728 835979 840231 845446 851670 858891 866843 875155 883660
59354 883660 892435 901559 911019 920939 931750 943850 957017 970403 983276 995555 1007392 1018562
59342 1018562 1028679 1037843 1046450 1054274 1060311 1063728 1064529 1062989 1058919 1051999 1042582 1031668 1020036
59329 1020036 1007744 994499 980268 965413 950328 935108 919676 904207 889306 875569 862989
59318 862989 851009 839141 827430 816323 806240 797256 789055 781230 773773 767110 761478 756496 751645
59305 751645 746996 743004 739741 736850 734267 732485 732054 733213 736011 740302 745627 751683 759003 768549
59291 768549 780372 793118 805098 815296 823119 827841 829002 827162 823796 820359 817543 815221 812993
59278H12993j985o80J926M983P493R360J1096J2824J4148J4710J4339J2962J0953
59265I25122R270Q515Q076O843M602K073j27j867l085l858m766o344q099q869
59251I27486q211o833n622m891m593m605m698m657m495m134l113j254O27J402
59237H72409R22j0q23j539k111k329k484l219m531n666o228o704p580q527q839
59222H12741q315p414o772o679o845o719o182n733n678n600m990m010l093k278
59208G32433j526j212j518j751j183j71M09M59M61L84q2m95o3J009J771J936J987
59191G32848K005J670J282J460J806J305K16J8J123K123J842Q42J81p4l58o83
59175G47606r20j198j354q45K66J089J211J339K057K807K822K313K036K266K623
$$ plain form
59278 812993 811008 810328 812254 817237 824730 834090 845186 858010 872158 886868 901207 914169 925122
59265 925122 934392 942907 950983 957826 962428 964501 964374 962507 959422 955564 950798 944454 936355 927486
59251 927486 919275 912442 906820 901929 897336 892731 888033 883376 878881 874747 871634 870380 871007 872409
59237 872409 873331 873321 872498 870959 868848 866519 864035 860816 856285 850619 844391 837687 830107 821580 812741
59222 812741 804426 797012 790240 783561 776716 769997 763815 758082 752404 746804 741814 737804 734711 732433
59208 732433 730907 729695 728177 726426 725243 725072 725481 725940 726401 726785 726703 726208 726145 727154 728925 730861 732848
59191 732848 734853 736523 737805 739265 741071 742376 742592 742610 743733 745856 747698 748540 748721 748647 748289 747606
59175 747606 746686 745488 744134 743289 743555 744644 745855 747194 749251 752058 754880 757193 759229 761495 764118
59160G64118K482J251r83l013l569l046l102m354n700o290o686p370p626o841
59146G09271n732n115m620l770l284l999n284n961o025o165o165n258l656k385
59132F41852j787j437j204j229r80L24K402M115N051N816O749P480P909Q510R394
59117F92965J0067J0483J1341J2813J3790J3202J1529J0295J0306J0952J1110
59106H18853J0221Q463O402M646L619L328L333L111K521J782R90m1j311k299k532
59091H61086k261k085k057j767j265j224j926k747k988k829l047m003n229n908
59077H21750n674n087n180o299p545p767o937n959n416n224n405o185p202p526
59063G34344o809n718m865m111l293k803k973l465l729l636l286k769k309k183
$$ plain form
59160 764118 766600 767851 766868 763855 760286 757240 754138 749784 744084 737794 731108 723738 716112 709271
59146 709271 703539 698424 693804 690034 686750 682751 677467 671506 665481 659316 653151 647893 644237 641852
59132 641852 640065 638628 637424 636195 635215 635539 637941 642056 647107 652923 659672 667152 675061 683571 692965
59117 692965 703032 713515 724856 737669 751459 764661 776190 786485 796791 807743 818853
59106 818853 829074 837537 843939 848585 852204 855532 858865 861976 864497 866279 867269 867228 865917 863618 861086
59091 861086 858825 856740 854683 852916 851651 850427 848501 845754 842766 839937 836890 832887 827658 821750
59077 821750 816076 810989 805809 799510 791965 784198 777261 771302 765886 760662 755257 749072 741870 734344
59063 734344 727535 721817 716952 712841 709548 706745 703772 700307 696578 692942 689656 686887 684578 682395
59049F82395k212j930j395j169j355j429j205j113j230j086o71p00j302j528p37
59034F63333M81J424K303L351L943L641L316M091N660O779P017P062P545Q437
59020G28383R466J0385J0965J1173J1199J0910R752P625N313L562K265J104L55
59007H22457L54O83P01N63R82K179L633M630M732M035L290L237L620L478K674
58992H61248K211K583K837J964L27j147k239l025l058k146j220j266j836j739
58978H53494p57L99J464K696L961M851N611O907Q696J0203J1024J1432J1634J1521
58964I43136J1142J0771J0444R911Q948P392N163K552Q0k256m934p757r661j0304
58950I74627j0880j2453j4327j5203j5142j5148j5369j5128j4359j3602j2726
$$ plain form
59049 682395 680183 678253 676858 675689 674334 672905 671700 670587 669357 668271 667600 666900 665598 664070 663333
59034 663333 663814 665238 667541 670892 674835 678476 681792 685883 691543 698322 705339 712401 719946 728383
59020 728383 737849 748234 759199 770372 781571 792481 802233 809858 815171 818733 820998 822102 822457
59007 822457 822811 823494 824195 824758 825740 827919 831552 836182 840914 844949 848239 851476 855096 858574 861248
58992 861248 863459 866042 868879 870843 871170 870023 867784 864759 861701 859555 858335 857069 855233 853494
58978 853494 852737 853136 854600 857296 861257 866108 871719 878626 887322 897525 908549 919981 931615 943136
58964 943136 954278 965049 975493 985404 994352 1001744 1006907 1009459 1009539 1007283 1002349 994592 984931 974627
58950 974627 963747 951294 936967 921764 906622 891474 876105 860977 846618 833016 820290
58939H20290j1030q611o479n192m387l736l361l202k869k318j954j963k078k066
58925G61044j919j649j378j427j828k054j704j083n26K60J483K488K541J985J735
58910G57968K009K498L283M625O116P104P716Q595R836J0990J1935J2878J3761
58897H59314J4431J5056J5761J6218J6287J6455J6899J6884J6085J5597J6463
58886A035450J7869J8188J7285J6289J5638J4773J3427J1751R468O380L368J445
58874A181331O1k072m792o863q307j0311j2775j3935j3061j1749j1680j2566j3066
58861A060215j2689j2039j1931j2809j4348j5476j5455j4873j4757j4960j4629
58850I06249j3920j3765j4030j3564j2221j1199j1039j0855j0043r259r065q918
$$ plain form
58939 820290 809260 800649 794170 788978 784591 780855 777494 774292 771423 769105 767151 765188 763110 761044
58925 761044 759125 757476 756098 754671 752843 750789 749085 748002 747476 747736 749219 751707 754248 756233 757968
58910 757968 759977 762475 765758 770383 776499 783603 791319 799914 809750 820740 832675 845553 859314
58897 859314 873745 888801 904562 920780 937067 953522 970421 987305 1003390 1018987 1035450
58886 1035450 1053319 1071507 1088792 1105081 1120719 1135492 1148919 1160670 1170138 1176518 1179886 1181331
58874 1181331 1181392 1179320 1174528 1167665 1159358 1149047 1136272 1122337 1109276 1097527 1085847 1073281 1060215
58861 1060215 1047526 1035487 1023556 1010747 996399 980923 965468 950595 935838 920878 906249
58850 906249 892329 878564 864534 850970 838749 827550 816511 805656 795613 786354 777289 768371
58838G68371q257p428o906o575o318o314o271n486m059l015k779k570j783q10
58824F99800r7N20J071J145Q46R35J561J988J989K282L077L460K951K358K332
58809G26218K262J471M61o0l80j086j962k570l126l923m488m233l426k794k569
58794F99795k556k655k755k673k541k706k889k177k92J874L378M127M373M170
58780F96473L906M310N369N985N413M216L204K288J090q0p72j352k550m358o001
58765G17141o802o633n857n146m985n132m998m587m399m388l835k500j052q3N11
58750F57255R01J000J024J501K459L415M372N811P453Q219P793P134O967O952
58736G22256O812P100Q065Q881Q782Q174P869Q038Q448Q869Q741P453N539M552
$$ plain form
58838 768371 760114 752686 745780 739205 732887 726573 720302 714816 710757 707742 704963 702393 700610 699800
58824 699800 699703 700223 701294 702439 703285 704220 705781 707769 709758 712040 715117 718577 721528 723886 726218
58809 726218 728480 729951 730412 730352 729972 728886 726924 724354 721228 717305 712817 708584 705158 702364 699795
58794 699795 697239 694584 691829 689156 686615 683909 681020 678843 678551 680425 683803 687930 692303 696473
58780 696473 700379 704689 710058 716043 721456 725672 728876 731164 732254 732174 731402 730050 727500 723142 717141
58765 717141 710339 703706 697849 692703 687718 682586 677588 673001 668602 664214 660379 657879 656827 656744 657255
58750 657255 658156 659156 660180 661681 664140 667555 671927 677738 685191 693410 701203 708337 715304 722256
58736 722256 729068 736168 744233 753114 761896 770070 777939 785977 794425 803294 812035 819488 825027 829579
58722H29579N132O185O562O394O163N709N053N016N933O742O388N224M029K633
58708I06742O11j537l143m598o681r254j1667j3878j6087j7874j8760j9154j9655
58695G65065j9953j9409j8343j7561j6969j5712j3595j1413r864q872p992o993
58683E98389n995n356n289n387m957l940k982k379j637m32P54J365J444J259R51
58668E65808R02J666L087M355N218O246P553Q347Q209P641O775M864J822r35k282
58653F29276k946m167n745o557o307n663n189n104n473n875n503m365l570l704
58639E59108l815k952j705j147j081n44N34J424J826J952J760J112L38j42m34
58624E56234p45q55o05l26j19N40J774K755K921K986L788M909N382N139M780M456
$$ plain form
58722 829579 834711 840896 847458 853852 860015 865724 870777 875793 881726 888468 894856 900080 904109 906742
58708 906742 907353 905816 902673 898075 891394 882140 870473 856595 840508 822634 803874 784720 765065
58695 765065 745112 725703 707360 689799 672830 657118 643523 632110 622246 613374 605382 598389
58683 598389 592394 587038 581749 576362 571405 567465 564483 562104 560467 560035 560789 562154 563598 564857 565808
58668 565808 566710 568376 571463 575818 581036 587282 594835 603182 611391 619032 625807 630671 632493 631558 629276
58653 629276 626330 622163 616418 609861 603554 597891 592702 587598 582125 576250 570747 566382 562812 559108
58639 559108 555293 552341 550636 549489 548408 547864 548398 549822 551648 553600 555360 556472 556810 556668 556234
58624 556234 555489 554634 554029 553703 553584 554124 555898 558653 561574 564560 568348 573257 578639 583778 588558 593014
58608E93014L921L258K794K597K587K684K498J655O61N31J160J267M18k73o7K69
58592F18974J02K43J480L130M291N220O334P096P254P865R607J1268J1453J0665
58578G04982J0216J0158R910R880J0688J1645J1726J1340J1555J2344J3181J4518
58566H42143J6879J9303K0521K1049K2297K4131K5182K5116K4729K4043K2109
58555A087502J8620J4195R246M013n61l484n092o500p958r006r737j0559j1146
58542A069533j1169j1573j3544j6517j8749j9733k0481k1640k2689k3049k2645
58531H67744k1527j9880j8286j7049j5665j3803j2076j0917r600p545n580m564
58519G11252l802k437j369j878l235l636k893k283k168j826j262j258j772j997
$$ plain form
58608 593014 596935 600193 602987 605584 608171 610855 613353 615008 615669 616200 617360 618627 619045 618772 618705 618974
58592 618974 619076 619319 620799 623929 628220 633440 639774 646870 654124 661989 671596 682864 694317 704982
58578 704982 715198 725356 735266 745146 755834 767479 779205 790545 802100 814444 827625 842143
58566 842143 859022 878325 898846 919895 942192 966323 991505 1016621 1041350 1065393 1087502
58555 1087502 1106122 1120317 1129563 1133576 1133015 1129531 1124439 1117939 1109981 1100975 1091238 1080679 1069533
58542 1069533 1058364 1046791 1033247 1016730 997981 978248 957767 936127 913438 890389 867744
58531 867744 846217 826337 808051 791002 775337 761534 749458 738541 728941 721396 715816 711252
58519 711252 707450 705013 703644 701766 698531 694895 692002 689719 687551 685725 684463 683205 681433 679436
58505F79436j796j530q49O54K030J947Q61L92R11J425J544J770K021J674J043
58490F91533J161K141L192M076N220O641Q083R759J1694J2911J2742J2256J2858
58477G94267J4222J5136J5438J5453J4442J1666Q075N066K386p33l482m754n426
58464H81756o848q012p001m492k907k619j869j61J312K383M089O159P145P119
58450H76054P453P834O457L355O31j000l045o085q627r824j0684j1806j2206j1267
58436H27240r699p964n785l618k494k092j039P25J994K776M240O165P014O760
58422H24223P028Q084Q330P117N462L666R62k084l654l748m395o174p341p110
58408H30366o957p790q490q221p603o815n129l099k521l349l308j570n4l4j83
$$ plain form
58505 679436 677640 676110 675261 675915 677945 679892 680753 681145 682056 683481 685025 686795 688816 690490 691533
58490 691533 692694 694835 698027 702103 707323 713964 722047 731806 743500 756411 769153 781409 794267
58477 794267 808489 823625 839063 854516 868958 880624 888699 893765 896151 895418 891936 887182 881756
58464 881756 874908 866896 859895 855403 852496 849877 848008 847847 849159 851542 855631 861790 868935 876054
58450 876054 883507 891341 897798 901153 901784 900784 897739 891654 883027 873203 862519 850713 838507 827240
58436 827240 817541 809577 803792 800174 797680 795588 794549 795274 797268 800044 804284 810449 817463 824223
58422 824223 831251 839335 847665 854782 860244 863910 864872 862788 859134 855386 850991 844817 837476 830366
58408 830366 823409 815619 807129 798908 791305 784490 779361 776262 773741 770392 767084 765514 765460 765426 765243
58393G65243P89K111K791L216L649L393K440J896J912J364K55P7J115J846J696
58378G93793J877K812L346L244L793N155N803N412N588O943Q140Q592R342J0554
58364H74394J0966J0595J0999J2203J2444J1659J1835J3090J2918J0446Q007P155
58352A006711O572N195M043L563K542J079J220L203M494L995L729M870N780N633
58338A062629O306Q693J0735J0993J0917J1661J2150J2014J2830J4658J4927J2739
58326A201252J0583R924Q875O268M088L660L305K005J510K534K903J755J563L454
58312A263679M837M201M012O022Q014Q242Q696J0855J2424J1767J1313J3082J4862
58299A382006J4411J3448J3953J4436J3525J3249J5143J6957J6826J6700J8122
$$ plain form
58393 765243 766032 768143 770934 774150 777799 781192 783632 785528 787440 788804 789059 789136 790251 792097 793793
58378 793793 795670 798482 801828 805072 808865 814020 819823 825235 830823 837766 845906 854498 863840 874394
58364 874394 885360 895955 906954 919157 931601 943260 955095 968185 981103 991549 999556 1006711
58352 1006711 1013283 1018478 1022521 1026084 1028626 1029705 1030925 1034128 1038622 1042617 1046346 1051216 1056996 1062629
58338 1062629 1068935 1077628 1088363 1099356 1110273 1121934 1134084 1146098 1158928 1173586 1188513 1201252
58326 1201252 1211835 1221759 1230634 1236902 1240990 1244650 1247955 1249960 1251470 1254004 1256907 1258662 1260225 1263679
58312 1263679 1268516 1272717 1276729 1282751 1290765 1299007 1307703 1318558 1330982 1342749 1354062 1367144 1382006
58299 1382006 1396417 1409865 1423818 1438254 1451779 1465028 1480171 1497128 1513954 1530654 1548776
58288A548776J8899J7592J6897J8722K0358J9631J9215K1530K3946K3649K2794
58277A772009K4087K5699K5441K5614K8661L2206L3468L4407L7469M0556M1364
58266B120981M2346M6062M9961N1133N1807N4747N7673N7887N7775N9958O1688
58255B712018O0010N7827N8694O0390N9900N9812O3343O7825O9834P1787P6827
58244C418267Q2286Q5121Q8459R5623J03200J07399J11633J20101J29737J36480
58234D478306J43355J54154J65463J73612J82865J97633K13517K25558K38149
58225F172612K56765K77535K95696L16294L44999L76583M04887M35668M76637
58216I357676N23564N70269O23141O90743P68650Q50686R45399J064414J205149
$$ plain form
58288 1548776 1567675 1585267 1602164 1620886 1641244 1660875 1680090 1701620 1725566 1749215 1772009
58277 1772009 1796096 1821795 1847236 1872850 1901511 1933717 1967185 2001592 2039061 2079617 2120981
58266 2120981 2163327 2209389 2259350 2310483 2362290 2417037 2474710 2532597 2590372 2650330 2712018
58255 2712018 2772028 2829855 2888549 2948939 3008839 3068651 3131994 3199819 3269653 3341440 3418267
58244 3418267 3500553 3585674 3674133 3769756 3872956 3980355 4091988 4212089 4341826 4478306
58234 4478306 4621661 4775815 4941278 5114890 5297755 5495388 5708905 5934463 6172612
58225 6172612 6429377 6706912 7002608 7318902 7663901 8040484 8445371 8881039 9357676
58216 9357676 9881240 10451509 11074650 11765393 12534043 13384729 14330128 15394542 16599691
58207A6599691J363833J554847J797506K096118K455502K903285L471507M167941
58199C6410230M989844N947996P044393Q241848R491471J0775786J2093260J3432833
58191A08427661J4817882J6345105J8109685K0113923K2302619K4564886K6444391
58184B51126152K6814894K4202632J7865848Q682355j168030r519856j5313884
58177C02690111j8649282k0143202k0405277j9927279j9135346j8359256j7741778
58170A68328691j7209671j6556501j5600969j4318789j2843241j1346151r933984
58163G0519385q647636p507525o520048n663889m908557m242828l666679l168517
58155B6193706k731942k354210k037321j769728j535481j333090j167509j031329
$$ plain form
58207 16599691 17963524 19518371 21315877 23411995 25867497 28770782 32242289 36410230
58199 36410230 41400074 47348070 54392463 62634311 72125782 82901568 94994828 108427661
58191 108427661 123245543 139590648 157700333 177814256 200116875 224681761 251126152
58184 251126152 277941046 302143678 320009526 328691881 327523851 318003995 302690111
58177 302690111 284040829 263897627 243492350 223565071 204429725 186070469 168328691
58170 168328691 151119020 134562519 118961550 104642761 91799520 80453369 70519385
58163 70519385 61871749 54364224 47844176 42180287 37271730 33028902 29362223 26193706
58155 26193706 23461764 21107554 19070233 17300505 15765024 14431934 13264425 12233096
58147A2233096r11207q05919p21219o52739n89994n32182m84885m45467m06132
58138F683352l67446l35470l08969k82032k55852k35800k20132k03277j87080
58129D287294j77348j72093j64317j53863j45889j40035j31634j21593j14804
58120B965718j10521j03916r5623r0369q7662q2874p6213p1828o9324o4706n8633
58109B054049n5341n4347n1375m6658m4291m4150m2213l8468l6766l7132l5733
58098A567575l2412l1076l2302l2327k9817k7459k6451k5256k3962k4252k5112
58087A257149k3829k1134k0099k0461j9409j7303j7037j8263j7967j6463j6979
58076A048205j9421k0199j8575j7640j8579j9099j8169j7397j7139j5875j3909
$$ plain form
58147 12233096 11321889 10515970 9794751 9142012 8552018 8019836 7534951 7089484 6683352
58138 6683352 6315906 5980436 5671467 5389435 5133583 4897783 4677651 4474374 4287294
58129 4287294 4109946 3937853 3773536 3619673 3473784 3333749 3202115 3080522 2965718
58120 2965718 2855197 2751281 2655658 2565289 2477627 2394753 2318540 2246712 2177388 2112682 2054049
58109 2054049 1998708 1944361 1892986 1846328 1802037 1757887 1715674 1677206 1640440 1603308 1567575
58098 1567575 1535163 1504087 1471785 1439458 1409641 1382182 1355731 1330475 1306513 1282261 1257149
58087 1257149 1233320 1212186 1192087 1171626 1152217 1134914 1117877 1099614 1081647 1065184 1048205
58076 1048205 1028784 1008585 990010 972370 953791 934692 916523 899126 881987 866112 852203
58065H52203j3343j3966j3411j1519j0424j0272r184p386p076q115q203p326p685
58052G24293r098q999p267o595p603p856o386n128n161n371n380o152p155o568
58038F29574m843m458n763o537n954n417n286m403l268l954o320p857p761p733
58024E50020q340q177p190p177q276q351o716n281n164n253m806m584m689m143
58010D61873l115k840k994j991n3R11O37O54J070M45r04q88O76J662J286R92J263
57993D58684Q81j39k25N51K72j196j699o04J63l33p83p30j533l191l590k153j017
57976D43358j351j586o78jm68o85L34J216O76m12q90j049j246r27k57n28j857
57959D33649k576j961j414j976k817l106l215l286k780k106k420l237k712q63
$$ plain form
58065 852203 838860 824894 811483 799964 789540 779268 770084 762698 755622 747507 739304 731978 724293
58052 724293 715195 706196 698929 692334 684731 676875 670489 665361 660200 654829 649449 643297 636142 629574
58038 629574 624731 620273 614510 607973 602019 596602 591316 586913 583645 579691 573371 565514 557753 550020
58024 550020 541680 533503 526313 519136 510860 502509 495793 490512 485348 480095 475289 470705 466016 461873
58010 461873 458758 455918 452924 450933 450880 451791 452428 453082 454152 454597 453693 452805 453481 455143 456429 457421 458684
57993 458684 459565 459426 459201 459752 460024 458828 457129 456525 456688 456355 455572 454842 453309 450118 446528 444375 443358
57976 443358 442007 440421 439743 439742 439274 438589 438923 440139 440815 440403 439513 438464 437218 436291 436034 435506 433649
57959 433649 431073 429112 427698 425722 422905 419799 416584 413298 410518 408412 405992 402755 400043 399180
57945C99180J57l68p00O2P01Q20J887M116N346M641M030N026O258O311O129O657
57929D50253O701N259L616K988K315M13j726k881l840n626p316p719p534p863
57915D27040q124p378o239n627n078l946k935k707k431j306k28l20j111j638k023
57900C75949k550k595j839j119q99l43Q56J480R45O56J619K554K056R73Q13J379
57884C79935J771K229L085L334K203R11R54J775J869J155M85p1p59j002m60j24
57868C97290p42j204j58J742K915L159L167K826J780Q95J326K674L579L635L297
57853D26181K687J800J237J393J585J184P02O76M65n34j486j378p43p32j281j593
57837D30163j594j585j283n10Qk45m97M4P58P34L11K65M14L71O31J569K321K024
$$ plain form
57945 399180 399337 398969 398269 398331 399032 399852 401739 405855 411201 415842 419872 424898 431156 437467 443596 450253
57929 450253 456954 462213 465829 468817 471132 471545 469819 466938 463098 457472 450156 442437 434903 427040
57915 427040 418916 411538 405299 399672 394594 390648 387713 385006 382575 381269 381041 380721 379610 377972 375949
57900 375949 373399 370804 368965 367846 366947 366604 367460 368940 369885 370541 372160 374714 376770 377743 378556 379935
57884 379935 381706 383935 387020 390354 392557 393468 394422 396197 398066 399221 399706 399635 398876 397874 397414 397290
57868 397290 396548 395344 395186 396928 399843 403002 406169 408995 410775 411670 412996 415670 419249 422884 426181
57853 426181 428868 430668 431905 433298 434883 436067 436769 437445 437910 437376 435890 434512 433769 433037 431756 430163
57837 430163 428569 426984 425701 425191 425199 424954 424457 424501 425259 425993 426304 426569 426983 427354 427985 429554 431875 433899
57819D33899J278R81P33k45j525k219k443k717k898k947l641n140o062n468m566
57804C97020m830n584n298m235l861m428m956n043m940m474l401k310j763j291
57790C40606m57P5j29n9J032K001J606P44R43J811K016J800K282L224L649L864
57774C65008M632N166M301K887K679L392L270K052R61J18j405l271m075l850l965
57759C77900m519m196k790j573j015l31N60Q17N46P15J104N99l96k02J305K378
57743C70902K315K256K684K626J918J801K409K107M17p09J35J675K153J860J880
57728C96429J991J397L71k92m95m23J06Q61Q38l11j459j569j127j069j277j075
57712C92896m31L08J093J758J687P22k36l20K05N33N58Q22J692L016M241M742
$$ plain form
57819 433899 435177 436158 436891 436646 435121 432902 430459 427742 424844 421897 418256 413116 407054 401586 397020
57804 397020 392190 386606 381308 377073 373212 368784 363828 358785 353845 349371 345970 343660 341897 340606
57790 340606 340149 340224 340095 340036 341068 343069 344675 345419 346362 348173 350189 351989 354271 357495 361144 365008
57774 365008 369640 374806 379107 381994 384673 388065 391335 393387 394348 394466 393061 389790 385715 381865 377900
57759 377900 373381 369185 366395 364822 363807 363476 364036 364853 365399 366114 367218 367817 367421 367219 368524 370902
57743 370902 373217 375473 378157 380783 382701 384502 386911 389018 389435 388726 388861 390536 392689 394549 396429
57728 396429 398420 399817 400188 399896 399401 398978 399084 399945 400783 400472 399013 397444 396317 395248 393971 392896
57712 392896 392465 392773 393866 395624 397311 398033 397797 397477 397682 398215 398773 399595 401287 404303 408544 413286
57696D13286M456M116M290M416L615K200J164M07j079l250m811n213n268n376
57682D12953m765l088j203M09K522N599Q749J1283J3948J7515K1300K4401K7405
57669E37028L1472L6445M1263M5745N0469N4776N5905N0588L7467J8337k609k1122
57657I35764l4943m3839m8291m9065m7746m6148m4678m2280l8425l4090l0293
57646D75966k6792k3039j9388j6476j4126j1770r406p411n897m807m137l681l037
57633C25999k348k251k768l000k452j817j870k314k436k159j791j346q18n88q69
57618B97172j235j239j101j184j363j365j308j382j424j321j342j675j980j844
57604B77409j347q83p47j013j407j328n97m9n81j755k276j885j538j592j266l07
$$ plain form
57696 413286 417742 421858 426148 430564 434179 436379 437543 437950 436871 433621 428810 423597 418329 412953
57682 412953 408188 405100 403897 404306 406828 412427 421176 432459 446407 463922 485222 509623 537028
57669 537028 568500 604945 646208 691953 742422 797198 853103 903691 941158 959495 956886 935764
57657 935764 900821 856982 808691 759626 711880 665732 621054 578774 540349 506259 475966
57646 475966 449174 426135 406747 390271 376145 364375 354969 347558 341661 336854 332717 329036 325999
57633 325999 323651 321400 318632 315632 313180 311363 309493 307179 304743 302584 300793 299447 298629 298041 297172
57618 297172 295937 294698 293597 292413 291050 289685 288377 286995 285571 284250 282908 281233 279253 277409
57604 277409 276062 275179 274432 273419 272012 270684 270087 270038 269457 267702 265426 263541 262003 260411 259145 258838
57588B58838K46k60r58r44p14j079j658j634j289j531k346k857k682k362k487
57573B36283l046l509l268k245j227j075j547j644j241j216j697j531k15R68P73
57558B14563j48m04rJ7m95o70p3Q16J402J489J197J003J480K429K777K024J071
57541B28469Q51R22L85m68o40r9K71R6k13m63q55j168q36N8O99O01Q2l50n44n63
57521B26235m94m01k27J81O48O84K52M7N47J212J242P46N48J045J831K231J899
57504B38226J139P76J288J909J409q5j039p22k58p46j594j745j489j615j796j308
57488B32350p20j130k139k304j469r83j449j885j530r96j021j261j088o73n50
57473B13152o56n34j58L4j96o00p88p26p64j120j397j037k86j14q45j529j201
$$ plain form
57588 258838 259084 258824 257866 256922 256208 255129 253471 251837 250548 249017 246671 243814 241132 238770 236283
57573 236283 233237 229728 226460 224215 222988 221913 220366 218722 217481 216265 214568 213037 212822 213790 214563
57558 214563 214415 214011 214002 214019 213524 212854 212781 213597 214999 216488 217685 218688 220168 222597 225374 227398 228469
57541 228469 229320 230242 230627 230159 229519 229420 229691 229787 229574 229111 228256 227088 226252 226310 227009 227610 227692 227342 226798 226235
57521 226235 225741 225340 225113 225294 225942 226626 226878 226925 227472 228684 229926 230672 231220 232265 234096 236327 238226
57504 238226 239365 240141 241429 243338 244747 244662 243623 242901 242643 241897 240303 238558 237069 235454 233658 232350
57488 232350 231630 230500 228361 226057 224588 223605 222156 220271 218741 217745 216724 215463 214375 213702 213152
57473 213152 212496 211962 211804 211838 211642 211042 210254 209528 208764 207644 206247 205210 204924 204810 203965 202436 201235
57456B01235j73N39N36Q7o16j384j618q82L06J043J162J118J076R23Q47J092J323
57439B06614J119P88R37J447J711J588J297O89l69j170q09M20J356J570J622J779
57423B20589J613R71L02k06p86j258j015j22M31K9q09j266j143o87j43K46L87
57406B17133N96J211J825J646P13J6K14Q07Q97K22p75j406j208l25M82O29L88
57389B23065L18L33N1k12K89J491K467K728K808L348M240M830M467K940R19k50
57373B53832Q8R75J043L29j24j16m68j439k282k565k614k408j375K62J207P61
57357B45106l01j036j415j534r22N42J909K359K264K339K395J848P63l68j362
57342B52587k032j743k12J559K066R05q98j943j496J07J593J732O20l75l13K47
$$ plain form
57456 201235 201062 201601 202137 202224 201608 200224 198606 197724 198030 199073 200235 201353 202429 203352 204199 205291 206614
57439 206614 207733 208521 209458 210905 212616 214204 215501 216190 215821 214651 213842 214262 215618 217188 218810 220589
57423 220589 222202 223173 223475 223269 222483 221225 220210 220088 220519 220548 219739 218473 217330 216643 216500 216746 217133
57406 217133 217729 218940 220765 222411 223124 223140 223354 224161 225058 225280 224505 223099 221891 221566 222048 222677 223065
57389 223065 223383 223716 223767 223555 223844 225335 227802 230530 233338 236686 240926 245756 250223 253163 254082 253832
57373 253832 253920 254895 255938 256267 256143 256027 255559 254120 251838 249273 246659 244251 242876 243138 244345 245106
57357 245106 244805 243769 242354 240820 239898 240440 242349 244708 246972 249311 251706 253554 254317 253949 252587
57342 252587 250555 248812 248600 250159 252225 253130 252232 250289 248793 248900 250493 252225 252845 252470 252157 252404
57326B52404L27k7j80r8k44n77o04k70m0j22k90l62k99J00R14J591J373L39n30
57307B53405n39p0L9m64j041j036l04P44J568J937K027K149K369K392J811O52
57291B65639l74m60L19R83R18P65J468K832L708L483K633J860J446J489J985K504
57275B91198K491K076J935K217K389K265K386L048L827M382M893N303N031M015
57261C37456L157L048L046K451J794J974K658K694J801R06Q14J428K207K666K466
57246C70566J719J216J681K800L515L322K706K308K338K783L576M293M297L549
57232D10669K856L016L858M517M482M090L975M269M488M131L257K394K016K215
57218D60233K768L333L627L657L722M024M360M442M416M637N122N605O041O562
$$ plain form
57326 252404 252731 252704 252524 252426 252182 251605 251001 250731 250691 250569 250279 249917 249618 249718 250632 252223 253596 253935 253405
57307 253405 252866 252796 252835 252371 251330 250294 249990 250734 252302 254239 256266 258415 260784 263176 264987 265639
57291 265639 265265 264805 265124 266107 267025 267790 269258 272090 275798 279281 281914 283774 285220 286709 288694 291198
57275 291198 293689 295765 297700 299917 302306 304571 306957 310005 313832 318214 323107 328410 333441 337456
57261 337456 340613 343661 346707 349158 350952 352926 355584 358278 360079 360985 361799 363227 365434 368100 370566
57246 370566 372285 373501 375182 377982 381497 384819 387525 389833 392171 394954 398530 402823 407120 410669
57232 410669 413525 416541 420399 424916 429398 433488 437463 441732 446220 450351 453608 456002 458018 460233
57218 460233 463001 466334 469961 473618 477340 481364 485724 490166 494582 499219 504341 509946 515987 522549
57204E22549O962O923O776P304Q606R774J0085R892R996J0697J1820J3156J4343
57191F48883J4836J4532J4084J4128J4557J5059J5995J8125K1582K5677K9571
57180H47029L2815L5314L7208L8714L9914M0694M1041M1154M1171M1141M1331
57169A277526M2102M3248M4015M4074M3992M4412M5204M5885M6341M6681M6830
57158A770310M6812M6979M7375M7378M6547M5415M4657M3995M2687M0787L8976
57147B261918L7399L5667L3909L2838L2688L3015L3623L4711L5961L6552L6457
57136B644738L6779L8139L9719M0522M0874M1687M2884M3617M3727M4033M5174
57125C101893M7089M9676N3201N7859O3575P0313P7969Q5903R3319J00125J06574
$$ plain form
57204 522549 529511 536434 543210 550514 559120 568894 578979 588871 598867 609564 621384 634540 648883
57191 648883 663719 678251 692335 706463 721020 736079 752074 770199 791781 817458 847029
57180 847029 879844 915158 952366 991080 1030994 1071688 1112729 1153883 1195054 1236195 1277526
57169 1277526 1319628 1362876 1406891 1450965 1494957 1539369 1584573 1630458 1676799 1723480 1770310
57158 1770310 1817122 1864101 1911476 1958854 2005401 2050816 2095473 2139468 2182155 2222942 2261918
57147 2261918 2299317 2334984 2368893 2401731 2434419 2467434 2501057 2535768 2571729 2608281 2644738
57136 2644738 2681517 2719656 2759375 2799897 2840771 2882458 2925342 2968959 3012686 3056719 3101893
57125 3101893 3148982 3198658 3251859 3309718 3373293 3443606 3521575 3607478 3700797 3800922 3907496
57114C907496J12070J15708J18592J24196J35117J50107J65687J80355J96143
57105E205471K16449K43690K79080L23307L76993M41334N18732O12501P26057
57096H943614Q62644J024783J212719J423821J654676J902983K166225K439912
57088B1631377K719580L003416L290096L575312L854116M124017M377121M585624
57080E1160659M700776M670265M453220M019945L355003K480832J478049M63002
57072G6781751m70800j292427k018170k666245l230820l690992m032652m259610
57064E5120035m389016m437988m412283m306941m118810l857758l545390l205637
57056B2846212k858522k519417k198987j903245j636240j402309j203660j036911
$$ plain form
57114 3907496 4019566 4135274 4253866 4378062 4513179 4663286 4828973 5009328 5205471
57105 5205471 5421920 5665610 5944690 6267997 6644990 7086324 7605056 8217557 8943614
57096 8943614 9806258 10831041 12043760 13467581 15122257 17025240 19191465 21631377
57088 21631377 24350957 27354373 30644469 34219781 38073897 42197914 46575035 51160659
57080 51160659 55861435 60531700 64984920 69004865 72359868 74840700 76318749 76781751
57072 76781751 76310951 75018524 73000354 70334109 67103289 63412297 59379645 55120035
57064 55120035 50731019 46293031 41880748 37573807 33454997 29597239 26051849 22846212
57056 22846212 19987690 17468273 15269286 13366041 11729801 10327492 9123832 8086921
57048H086921q95193p73542o70013n82365n07026m41561l85408l37494k95480
57039C198839k57875k24899j96675j72323j51283j33702j19074j06116r4460q4729
57029A657703p6578o8303n9043m9637m0720l1545k1542j1430j579R338K2268L4510
57017A363442L9771L2281J1430j7027m4391o4407p5948q1023q1492p8637p4507
57006I29492p1361o9423o6856o2365n6695n1197m6261m1646l7286l3085k8683
56995C64634k4025j9604j5876j2877j0587r012p809o429m654k576j25K761N752
56982B59573Q449J0752J2118J1154P044J068m478q499j1185j2429j1872j0290
56970B51405r252r091q658p308n711m427l059j205R72L496O632R975J2684J4953
$$ plain form
57048 8086921 7191728 6418186 5748173 5165808 4658782 4217221 3831813 3494319 3198839
57039 3198839 2940964 2716065 2519390 2347067 2195784 2062082 1943008 1836892 1742432 1657703
57029 1657703 1581125 1512822 1453779 1404142 1363422 1331877 1310335 1298905 1297326 1306664 1328932 1363442
57017 1363442 1403213 1435494 1446924 1429897 1385506 1321099 1245151 1164128 1082636 1003999 929492
57006 929492 858131 788708 721852 659487 602792 551595 505334 463688 426402 393317 364634
56995 364634 340609 321005 305129 292252 281665 272653 264844 258415 253761 251185 251060 253821 259573
56982 259573 268022 278774 290892 302046 309090 310158 305680 297181 285996 273567 261695 251405
56970 251405 242153 233062 224404 217096 211385 206958 203899 202694 203666 207162 213794 223769 236453 251406
56956B51406J7747K0669K1481J8491J2312M756k747r082j3209j5008j5527j5647
56944B75642j5261j4193j2850j1326q943n439j781J058L347N922Q994J2320J5866
56931B53356J9610K3128K5851K7086K5546J9842J0271n51r598j5639j9331k1786
56919C37785k3614k4806k4997k4042k2525k1283k0377j9171j7390j5389j3389
56908A10802j1296r328p850o555m871l220k643k989k739j078J167L056M676O147
56894G3279O873O668O530P388Q942J0514J2074J3695J4975J5839J6956J8384J8656
56881B30773J6247J1390N620J35m496p710r110r053q277p100n418l151l60K795
56867B12285N954Q850J1825J5412J9419K3139K6568L0376L4541L7938L9415L8123
$$ plain form
56956 251406 269153 289822 311303 329794 342106 346862 344115 335033 321824 306816 291289 275642
56944 275642 260381 246188 233338 222012 213069 207630 205849 206907 210254 216176 225170 237490 253356
56931 253356 272966 296094 321945 349031 374577 394419 404690 404139 394541 378902 359571 337785
56919 337785 314171 289365 264368 240326 217801 196518 176141 156970 139580 124191 110802
56908 110802 99506 90178 82328 75773 70902 67682 65039 62050 59311 58233 59400 62456 67132 73279
56894 73279 80152 86820 93350 100738 109680 120194 132268 145963 160938 176777 193733 212117 230773
56881 230773 247020 258410 264030 264165 259669 251959 242849 233796 225519 218419 213001 209850 209490 212285
56867 212285 218239 227089 238914 254326 273745 296884 323452 353828 388369 426307 465722 503845
56855E03845L2912K3060J0226j880j0627j6177j9587k0832j9722j7208j4415j1286
56843D38309p345k863J708O613J2105J7784K3548L0132L7739M5170N1437N6882
56831G11219O1186O1309N3410L6792J4983o763k4232l5535m1337m3807m4554m3667
56819F99004m1071l7603l3906k9297k3152j6497j0821n877r2P188J5140K2884
56807E45900L0196L6766M1512M2647L8176K7203J1494m953j8699k8750l5416l8734
56795F47342l9056l7851l6433l4603l1705k8104k4408k0206j5045r763n349j315
56783C63504L253P866J1467J4350J7291J9316J8251J3368N926k563j0973j7857
56771D43199k2047k3989k5051k5570k4989k3616k2522k1843k0790j9344j8223
$$ plain form
56855 503845 536757 559817 570043 568163 557536 541359 521772 500940 481218 464010 449595 438309
56843 438309 430964 428101 429809 436422 448527 466311 489859 519991 557730 602900 654337 711219
56831 711219 772405 833714 887124 923916 938899 932136 907904 872369 831032 787225 742671 699004
56819 699004 657933 620330 586424 557127 533975 517478 506657 500780 500688 507876 523016 545900
56807 545900 576096 612862 654374 697021 735197 762400 773894 768941 750242 721492 686076 647342
56795 647342 608286 570435 534002 499399 467694 439590 415182 394976 379931 370168 364819 363504
56783 363504 366757 374623 386090 400440 417731 437047 455298 468666 474592 472029 461056 443199
56771 443199 421152 397163 372112 346542 321553 297937 275415 253572 232782 213438 195215
56760A95215j7187j5127j2082r503q204p523o797o250n997n536m695l901l208
56747H9205k185j018n12p23p21k0P65J037Q45K98o28j438j387o62k99o58r50n08
56729H0441M11J296J960K235J986J564J542J834J925J777J752J793J685J819K600
56714A06620L282K688J065k7K50J229K013K364K263J770J436J713J988J391M24
56699A30469M67J605K384J926Q81R6k93j50Q13K042K271J183j48q19r85q91k82
56682A40569P29J404J477J511J798J884J586J352J227N86o68j685j850j548j293
56667A47079j046p25n10l22J47O34M96j41l95J4M18L39M6j90l78k79L78J110J175
56648A47850Q26R31J383J269N00j18m02q41j132m31Q17J128L32j79N0j53j240
$$ plain form
56760 195215 178028 162901 150819 141316 133112 125589 118792 112542 106545 101009 96314 92413 89205
56747 89205 87020 86002 85490 84767 84046 84026 84791 85828 86673 86971 86343 84905 83518 82856 82557 81899 80949 80441
56729 80441 80852 82148 84108 86343 88329 89893 91435 93269 95194 96971 98723 100516 102201 104020 106620
56714 106620 109902 112590 113655 113628 113878 115107 117120 119484 121747 123517 124953 126666 128654 130045 130469
56699 130469 130936 132541 134925 136851 137732 137828 137535 137385 138198 140240 142511 143694 143546 142727 141742 140851 140569
56682 140569 141298 142702 144179 145690 147488 149372 150958 152310 153537 154123 153455 151770 149920 148372 147079
56667 147079 146033 145308 144798 144476 144623 145257 145753 145612 145217 145231 145649 145988 146034 145844 145466 145187 145565 146675 147850
56648 147850 148676 149607 150990 152259 152759 152641 152239 151398 150266 149835 150652 151780 152112 151933 151983 151830 150590
56631A50590j947j557j139j448j517o02K28j04q19p62m13q27j659j846j424j149
56615A33605r88l97M36P94M97j64r95j642j462n33k8o84j551j245J97J549J966
56598A29355J471M49n30q01j88Q01J649K162K023R67l02m97M78J238R57N03Q83
56581A40618J748K253K297K082J454O50O15J699K906L297L174L068K677J836J481
56566A71855K471M232N645O527P275P848Q100Q438R213J0063J0668J1222J1384
56553B74941R799N855J096k251l576l824l829l824l963m305m580m717n087n634
56539B46101n640m884m200m132m019l218k225j693j348q90r39j953l054l083k158
56524B02665j200o16l78n99j062j002k47K01l83j302j657j671j890k099k065k292
$$ plain form
56631 150590 148643 147086 145947 144499 142982 142380 142608 142504 141685 140923 140510 139683 138024 136178 134754 133605
56615 133605 132617 132220 132656 133450 133947 133783 132788 131146 129684 129151 129123 128439 126888 125643 125840 127389 129355
56598 129355 130826 131275 130745 129944 129756 130557 132206 134368 136391 137358 137056 136559 137037 138275 139232 139735 140618
56581 140618 142366 144619 146916 148998 150452 151102 151717 153416 156322 159619 162793 165861 168538 170374 171855
56566 171855 174326 178558 184203 190730 198005 205853 213953 222391 231604 241667 252335 263557 274941
56553 274941 284740 290595 291691 289440 285864 282040 278211 274387 270424 266119 261539 256822 251735 246101
56539 246101 240461 235577 231377 227245 223226 220008 217783 216090 214742 213852 212913 210960 207906 204823 202665
56524 202665 201465 200849 200471 199872 198810 197808 197561 197762 197379 196077 194420 192749 190859 188760 186695 184403
56508A84403k868k677j080O00P07m86j488j766j885k099k209k270k295j827q20
56493A61940j55l61o44k46K95L12L42R70J507J249J026J823K918K979K187J578
56477A77720J156L99j46L47J271J393Q97Q35J142R21K87J14L69L47J84M82Q60
56460A88578N23q7K2N48M21j85k01L34M87L26P38J503J481P32N04J115J614J656
56442B00109J916K405K172J012j02n98q94j170j017o14p70j462j695j176q42j271
56426A96003j732j272N1J439K056J504K61n02k54J33k05o03K0J203J537Q19P1
56409B00529k97o84q98k17J106J853J547Q87M43K34L89R97J399Q99J2k92k16n52
56391B07139r01k05J161J665J019N27Q73J286J217J141J299J151N61K30N16R40
$$ plain form
56508 184403 181535 178858 177778 178378 179085 178599 177111 175345 173460 171361 169152 166882 164587 162760 161940
56493 161940 161785 161424 160780 160534 160829 161141 161483 162453 163960 165209 166235 168058 170976 173955 176142 177720
56477 177720 178876 179275 179129 179476 180747 182140 183037 183872 185014 185935 186222 186336 186705 187052 187236 187718 188578
56460 188578 189101 189014 189036 189584 190005 189820 189619 189953 190440 190766 191504 193007 194488 195220 195724 196839 198453 200109
56442 200109 202025 204430 206602 207614 207512 206914 206020 204850 203833 203219 202449 200987 199292 198116 197274 196003
56426 196003 194271 192999 193050 194489 196545 198049 198310 197808 197554 197687 197482 196879 196899 198102 199639 200458 200529
56409 200529 200232 199548 198650 198433 199539 201392 202939 203826 204269 204503 204892 205889 207288 208187 208199 207907 207691 207139
56391 207139 206238 206033 207194 208859 209878 210405 211278 212564 213781 214922 216221 217372 217933 218163 218679 219619
56375B19619J161J313J269O87n9j42M29Q10O79M92N02N44P45J259J505Q47j30
56358B31530k70M64J135J397J631J809J618J406J700K097J919J527J632J866J555
56343B53016J237J753K437K067J030O36P75M05j62L23J658K510K834L633M514
56328B78666M036K531J959K756L352L107L187L941L996K731J389Q90O13Q1r5K54
56312C13394L04j09m2P34J222J008Q64J177J625K478M274N997N948M671M570O172
56296C54287P329O751N678N148M341K829J980K647L616L832M102N209O197O038
56282D19984N411N433O114P123Q562R943J0040Q796P828Q155Q987R625J0693J2602
56268E39296J4436J5546J6608J8239K0004K1639K3686K6232K8674L1215L4820
$$ plain form
56375 219619 220780 222093 223362 224049 223990 223848 224277 225087 225766 226258 226760 227304 228049 229308 230813 231660 231530
56358 231530 231260 231724 232859 234256 235887 237696 239314 240720 242420 244517 246436 247963 249595 251461 253016
56343 253016 254253 256006 258443 260510 261540 262176 262951 263356 263194 263517 265175 267685 270519 274152 278666
56328 278666 282702 285233 287192 289948 293300 296407 299594 303535 307531 310262 311651 312541 313154 313235 313140 313394
56312 313394 313698 313589 313547 314281 315503 316511 317375 318552 320177 322655 326929 332926 338874 343545 348115 354287
56296 354287 361616 368367 374045 379193 383534 386363 388343 390990 394606 398438 402540 407749 413946 419984
56282 419984 425395 430828 436942 444065 452627 462570 472610 481406 489234 497389 506376 516001 526694 539296
56268 539296 553732 569278 585886 604125 624129 645768 669454 695686 724360 755575 790395
56257G90395L9234M3112M6596N1506N8338O5428P1882P8740Q6279R2867R7819
56246A522196J02821J08966J14711J18377J20438J21644J21024J17560J11883
56237B559620J04679R5226Q3083O9354N4783L8453J9953R33j6948l3698m9229
56226B926209o2125p1896q0346q8776r5785r9655j01167j02044j02391j01534
56216B020490r9830r7701r4456q9769q4907q0837p6738p1860o7099o3122n8804
56205A135367n3411m8439m5348m3114m0049l6441l3436l0785k7661k4455k1905
56194G30323j9690j7420j5654j4538j3004j0757r245r193r028p440n569m910m883
56181E88992m354l684l379k586q95K39j93q35k75N89N26M29J585L260M170M704
$$ plain form
56257 790395 829629 872741 919337 970843 1029181 1094609 1166491 1245231 1331510 1424377 1522196
56246 1522196 1625017 1733983 1848694 1967071 2087509 2209153 2330177 2447737 2559620
56237 2559620 2664299 2759525 2842608 2911962 2966745 3005198 3025151 3026084 3009136 2975438 2926209
56226 2926209 2864084 2792188 2711842 2623066 2527281 2427626 2326459 2224415 2122024 2020490
56216 2020490 1920660 1822959 1728503 1638734 1553827 1472990 1396252 1324392 1257293 1194171 1135367
56205 1135367 1081956 1033517 988169 945055 905006 868565 835129 804344 776683 752228 730323
56194 730323 710633 693213 677559 663021 650017 639260 630015 620822 611794 604354 598785 593875 588992
56181 588992 584638 580954 577575 574989 574094 574333 574140 573305 573030 573619 574145 574574 576159 579419 583589 588293
56165E88293N604O136N730N671P094Q862R561R779J0475J0973J0769J1339J3818
56152G04104J6810J8845K1045K4841K8956L1492L3351L6735M1681M6819N2270
56141A056949N9136O7145P5137Q2933R0587R6948J00844J02416J01624R7188Q8917
56130B019824P9363P1153O4484N8814N4663N1585M6826L8560K8463J8760R035
56119B541530j615j1781k0005k7633l6639m6650n6769o7916q0424r1556r8523
56108B002019j01874j03130j01448r5756q7937q0571p3540o5887n8724n3113m7469
56097A132570m0347l3534k8981k5241k0348j5701j3276j1532q102m251k581k372
56085I26304j239O04J695K816N141O990O452N224N894P582Q151Q399R949J1397
$$ plain form
56165 588293 593897 600033 605763 611434 618528 627390 636951 646730 657205 668178 678947 690286 704104
56152 704104 720914 739759 760804 785645 814601 846093 879444 916179 957860 1004679 1056949
56141 1056949 1116085 1183230 1258367 1341300 1431887 1528835 1629679 1732095 1833719 1930907 2019824
56130 2019824 2099187 2170340 2234824 2293638 2348301 2399886 2446712 2485272 2513735 2532495 2541530
56119 2541530 2539915 2528134 2508129 2480496 2443857 2397207 2340438 2272522 2192098 2100542 2002019
56108 2002019 1900145 1797015 1695567 1599811 1511874 1431303 1357763 1291876 1233152 1180039 1132570
56097 1132570 1092223 1058689 1029708 1004467 984119 968418 955142 943610 935508 931257 928676 926304
56085 926304 925065 925669 927364 930180 935321 942311 948763 953987 959881 967463 975614 984013 993962 1005359
56071A005359J0925J0316J1966J4296J4620J4089J5097J6380J5560J4075J4536
56060A157219J5561J4512J2918J3797J5791J5466J3417J2577J2598J1394J0235
56049A305485J1617J4057J4527J4036J5300J7088J6672J5618J7185K0182K1296
56038A483063K1273K2800K4746K4703K4623K7549L1364L2359L2201L4526L7692
56027A796899L8095L7640M0263M4074M4900M4499M6981N0231M9795M8221N1150
56016B292748N6739N8746N7744N9289O3202O4904O5521O9999P6821Q0145Q0727
56005C026585Q4210R0181R3710R6018J02330J10799J15184J17040J23312J33341
55995D092710J40573J45618J54837J67366J76726J84087J96458K13033K27163
$$ plain form
56071 1005359 1016284 1026600 1038566 1052862 1067482 1081571 1096668 1113048 1128608 1142683 1157219
56060 1157219 1172780 1187292 1200210 1214007 1229798 1245264 1258681 1271258 1283856 1295250 1305485
56049 1305485 1317102 1331159 1345686 1359722 1375022 1392110 1408782 1424400 1441585 1461767 1483063
56038 1483063 1504336 1527136 1551882 1576585 1601208 1628757 1660121 1692480 1724681 1759207 1796899
56027 1796899 1834994 1872634 1912897 1956971 2001871 2046370 2093351 2143582 2193377 2241598 2292748
56016 2292748 2349487 2408233 2465977 2525266 2588468 2653372 2718893 2788892 2865713 2945858 3026585
56005 3026585 3110795 3200976 3294686 3390704 3493034 3603833 3719017 3836057 3959369 4092710
55995 4092710 4233283 4378901 4533738 4701104 4877830 5061917 5258375 5471408 5698571
55986E698571K40245K59159K81819L00656L18467L44577L77254M07231M36620
55977H664599M75899N24108N71753O21720O86293P65058Q48069R39616J055104
55968A5152219J195979J353783J538276J774150K071293K428998K868868L429614
55960C1813180M127930M958471N929447P054576Q307694R631371J0994561J2397545
55952I5214775J3831291J5302939J6899746J8740761K0855853K3195069K5688972
55945B29729406K8005657K9091883K7265304K1294651J1633546M64040r627112
55938C37857375j7073948k1679812k4019447k4789350k4561899k3754703k2607980
55931A79370236k1212738j9609976j7850931j5985509j4065775j2179741j0435304
$$ plain form
55986 5698571 5938816 6197975 6479794 6780450 7098917 7443494 7820748 8227979 8664599
55977 8664599 9140498 9664606 10236359 10858079 11544372 12309430 13157499 14097115 15152219
55968 15152219 16348198 17701981 19240257 21014407 23085700 25514698 28383566 31813180
55960 31813180 35941110 40899581 46829028 53883604 62191298 71822669 82817230 95214775
55952 95214775 109046066 124349005 141248751 159989512 180845365 204040434 229729406
55945 229729406 257735063 286826946 314092250 335386901 347020447 347484487 337857375
55938 337857375 320783427 299103615 275084168 250294818 225732919 201978216 179370236
55931 179370236 158157498 138547522 120696591 104711082 90645307 78465566 68030262
55924F8030262q895368p559697o411099n441711m632107l946313l361590k876230
55916B4906147k481237k151024j868102j631822j436830j266451j113282r84420
55908A1972979q80360p88611p03209o31185n74385n23050m72561m29557l96263
55899F573798l64809l32003l04546k84775k65434k43318k24454k11312j97822
55890D145325j81440j67811j59183j49957j37772j27732j21831j14998j05210
55881B879391r7089r2073q5351p5782o8768o5962o2188n5827n2472n4697n7567
55870B111615n7849n8623o1231o1649n8441n5907n5728n3683m8076m3384m2092
55859A514952m0689l7210l4963l5367l4629l1117k8679k9125k8601k5053k2410
$$ plain form
55924 68030262 59134894 51575197 45164098 39722387 35090280 31143967 27782377 24906147
55916 24906147 22424910 20273886 18405784 16773962 15337132 14070681 12957399 11972979
55908 11972979 11092619 10304008 9600799 8969614 8395229 7872179 7399618 6970061 6573798
55899 6573798 6208989 5876986 5572440 5287665 5022231 4778913 4554459 4343147 4145325
55890 4145325 3963885 3796074 3636891 3486934 3349162 3221430 3099599 2984601 2879391
55881 2879391 2782302 2690229 2604878 2529096 2460328 2394366 2332178 2276351 2223879 2169182 2111615
55870 2111615 2053766 1995143 1933912 1872263 1813822 1757915 1702187 1648504 1600428 1557044 1514952
55859 1514952 1474263 1437053 1402090 1366723 1332094 1300977 1272298 1243173 1214572 1189519 1167109
55848A167109k3451k5178k4959k4927k6493k6723k4008k1592k1758k1967k0190
55837I05863j8648j8877j8505j6233j4846j5890j6395j4221j1727j1052j0518
55826G38951q895q386j0054j0975r228p322p494p922o794n872o734p458o254m777
55812F30786m745m804l552k254k007j504L5J121J295K516N195O675N808N118O147
55797F45830O678M989K884J805j22m340q736j1126j2504j4154j4861j3723j2494
55784E70126j2492j2192j0361q464p659o686n081n060p597r934r711q423q072
55771D58394p671n904m178l987m001k796j814k615l710l150k047k546m264n513
55757D04198o175o862p008o170n536n992o432n803m992m927m838m106l740m291
$$ plain form
55848 1167109 1143658 1118480 1093521 1068594 1042101 1015378 991370 969778 948020 926053 905863
55837 905863 887215 868338 849833 833600 818754 802864 786469 772248 760521 749469 738951
55826 738951 730056 721670 711616 700641 691413 684091 676597 668675 661881 656009 649275 641817 635563 630786
55812 630786 626041 621237 617685 615431 613424 611920 611955 613076 614371 616887 622082 628757 634565 639683 645830
55797 645830 652508 657497 660381 662186 662064 657724 648988 637862 625358 611204 596343 582620 570126
55784 570126 557634 545442 535081 526617 518958 512272 507191 502131 494534 484600 474889 466466 458394
55771 458394 450723 444819 440641 436654 432653 429857 428043 425428 421718 418568 416521 413975 409711 404198
55757 404198 398023 391161 384153 377983 372447 366455 360023 354220 349228 344301 339463 335357 331617 327326
55743C27326m509l733l307m023m561m122m005m864n115l872k820l187l569k816
55729B72823k221k784l069k076j445k382l174k302j401k296l667l491k495k240
55715B37780k037o59P97O88k53m47k08l96j73J275K473J787K05m89o39j278j548
55698B36878l36J060O18j213k487k584j944m47J631K550J356j91j35P85R79R51
55682B37471J903L058L059K585K973L591L152K328K432K759J896M65LK34m2m31
55666B67436Q6Q00M38l66k21M32M10L39J425K799K772J933K172L332L567K529
55650B89883J540J059L86n21j237k391m663o880p333o500o143o389o072n382n571
55635B33786o386o363n427m831m663l817k333j515j628j567q88k63l7k1n38j898
$$ plain form
55743 327326 322817 319084 315777 311754 307193 303071 299066 294202 289087 285215 282395 279208 275639 272823
55729 272823 270602 267818 264749 262673 261228 258846 255672 253370 251969 249673 246006 242515 240020 237780
55715 237780 235743 235084 235881 236569 236316 235869 235661 235265 235092 236367 238840 240627 240832 240343 239704 238426 236878
55698 236878 236542 237602 238220 237007 234520 231936 229992 229545 231176 233726 235082 234891 234756 235541 236520 237471
55682 237471 239374 242432 245491 248076 251049 254640 257792 260120 262552 265311 267207 267672 267675 267909 267867 267436
55666 267436 267522 268322 268760 268394 268173 268605 269015 269354 270779 273578 276350 278283 280455 283787 287354 289883
55650 289883 291423 292482 292868 292347 291110 288719 284056 277176 269843 263343 257200 250811 244739 239357 233786
55635 233786 227400 221037 215610 210779 206116 202299 199966 198451 196823 195256 194368 194105 194068 194047 193509 191611
55619A91611l072k775j501p42n71M3R49R10k31j366j962k332k368j815j401j953
55603A71424k754k638k056k117k264j224K87L90p03q87K64Q74P4n93J01J158J148
55586A60484J71q08j176n26J310L470M525M196L618L683M238N051O225P469Q130
55571B10060Q223Q417Q945R539J0262J1347J2223J1920J0243P657M393P97j989
55558C12037l165l719n239p607r375j0033j0237j0121r192p823p058o831o092
55545B15545m832m283m813n252m741l758k912k044j082n14n62p54p47p26q59j134
55529A76532j716k693l517l564l053k609k279j871j799k515l502l938l876l714
55515A35886l115j835q92j381k547k748j895j327j520j659j342j005o78M2P41
$$ plain form
55619 191611 188539 185764 184263 183521 182950 182993 183942 184852 184621 183255 181293 178961 176593 174778 173377 171424
55603 171424 168670 166032 163976 161859 159595 158371 158658 159048 158345 157458 157722 158596 158670 158077 158178 159336 160484
55586 160484 160655 159847 158671 158145 159455 162925 167450 171646 175264 178947 183185 188236 194461 201930 210060
55571 210060 218283 226700 235645 245184 255446 266793 279016 290936 301179 308836 313229 314026 312037
55558 312037 308872 305153 299914 292307 282932 272899 262662 252541 243349 235526 228468 221637 215545
55545 215545 210713 206430 201617 196365 191624 187866 184954 182910 181828 181314 180752 179998 179251 178525 177666 176532
55529 176532 174816 172123 168606 165042 161989 159380 157101 155230 153431 150916 147414 143476 139600 135886
55515 135886 132771 130936 130044 128663 126116 123368 121473 120146 118626 116967 115625 114620 113942 113984 114725
55500A14725M38p44j583j458q11j5Q83J390J013L53M07R84J138Q88R29R76J82
55483A19695r23p83P41K027J941R45j93j191j619j055j13J00l56m78j34j27n36
55466A17941o09l23m37r36j075r27j240j751j489o91n56j007p21L59P09j36p75
55449A06336l67J71J07J55Q75J512J416J060P69l4j430k226j547l3J228J840J656
55432A11488N82o46q53j52Q0o08j078o42q6L3M51J622K629K664K241J988J518
55415A21231N13l38m78m11n85n08J32O37N04L28N82O39p7r89j361j415j516j363
55397A15525q46o83j205j487p58K34L21l44o75j47Q96J878K179J345k21j329j325
55380A13358p43l11j12j60o97j424j414m59M19M73K77O47J328J517R23j88j261
$$ plain form
55500 114725 115163 114419 112836 111378 110567 110552 111435 112825 113838 114191 114598 115582 116720 117608 118537 119513 119695
55483 119695 118772 117989 118730 120757 122698 123643 123450 122259 120640 119585 119472 119572 119216 118738 118604 118477 117941
55466 117941 117332 117009 116572 115636 114561 113634 112394 110643 109154 108463 107907 106900 106179 106538 107247 107111 106336
55449 106336 105969 106140 106247 106402 107277 108789 110205 111265 112034 112000 110570 108344 106797 106764 107992 109832 111488
55432 111488 112070 111424 110571 110419 110499 109891 108813 108171 108085 108118 108569 110191 112820 115484 117725 119713 121231
55415 121231 121744 121406 120928 120517 119932 119424 119556 120193 120697 121025 121607 122246 122169 121180 119819 118404 116888 115525
55397 115525 114679 113996 112791 111304 110546 110780 111101 110757 110082 109935 110831 112709 114888 116233 116012 114683 113358
55380 113358 112615 112304 112192 112032 111335 109911 108497 108038 108457 108930 109207 109854 111182 112699 113622 113434 112173
55363A12173j455l54J032J090j84j098p74k68n54r28m93K28L36L8q1j78m76m46
55345A07608J60M45k91j281j457j015o69k32O86J382R07l42j080r08m84l05l41
55328A02783n73r35r31j33J135K111K322J615J70j134j250m08q6q63j406n17R31
55311A02831J332O28J0OK59O14J075J108K52p67p99P0O93N52J70m0k79o92j030
55292A05993j120r96n53L08J224J594J282O56J66J33O38J211R94k65j710k270
55276A07285j780q66j17K70M34P42J391J915J667Q73M71O79O89Q8m09k09J61O
55258A13290m62o87o48n26k54Qj78n63k09R05J396M77p10p99j64J7k99m03k84
55239A09907l67m24j50j91j178k248k055q98l36q07j155n77L00N65J57m66q99
$$ plain form
55363 112173 110718 110364 111396 112486 112302 111204 110430 110162 109608 108680 108187 108415 108751 108789 108708 108530 108054 107608
55345 107608 107768 108213 107922 106641 105184 104169 103500 103268 103954 105336 106243 105901 104821 103913 103429 103124 102783
55328 102783 102210 101275 100344 100211 101346 103457 105779 107394 107564 106430 105180 104772 104686 103823 102417 101900 102831
55311 102831 104163 104791 104801 104807 105066 105680 106755 107863 108115 107348 106549 106619 107312 107864 108034 107994 107715 107023 105993
55292 105993 104873 103877 103324 103632 104856 106450 107732 108388 108554 108687 109325 110536 111530 111265 109555 107285
55276 107285 105505 104639 104522 104792 105226 105968 107359 109274 110941 111814 112285 112964 113653 113741 113332 113123 113284 113290
55258 113290 112828 112141 111493 110967 110713 110721 110543 109980 109771 110676 112072 112549 111839 111040 110876 110893 110594 110191 109907
55239 109907 109540 109116 108966 108775 107597 105349 103294 102396 102060 101253 100098 99521 99821 100386 100543 100077 99178
55222I9178p49K14J537K292J945P70n48j340j236m44L79Q41J079J135P07q2m11
55205A05267J30P87O86M0l77l38m6N04J219J536J108M20K9j66l14o4N64O99n5
55186A11629o70j97O44O23Oo2M21M73j15o15p90r87j009l13O32O37m28j330j206
55167A07343m67J48M61N92O53Q73J313J457Q30p7l49M3L47K83K65M17L51l6l93
55148A14054n20m35j2O54Q13m7j124j240o13m93j110j286k62J222K054J940J185
55131A14780K03m12k15M15O00J13m54p30q80q72l87L17M18k14o70l60J21K4l54
55112A11443k02N82J318J425R28J68m86o85k12P52J566J562P58OJ01Q63J436J378
55094A22701Q58qj131j785j149J86O18o2j53J235K462J777J26k94O34J116M38
$$ plain form
55222 99178 98429 98643 100180 102472 104417 105187 104639 103299 102063 101619 101998 102839 103918 105053 105760 105678 105267
55205 105267 105397 106184 106870 106910 106533 106195 106149 106653 107872 109408 110516 110936 110965 110799 110485 110421 110985 111684 111629
55186 111629 110959 110762 111406 112029 112035 111973 112394 112867 112752 112137 111347 110360 109351 109038 109670 110307 109879 108549 107343
55167 107343 106876 107024 107485 108077 108730 109603 110916 112373 113203 113126 112777 112820 113167 113450 113715 114132 114483 114447 114054
55148 114054 113534 113099 113087 113741 114554 114507 113383 112143 111530 111037 109927 108641 108379 109601 111655 113595 114780
55131 114780 114983 114571 114356 114771 115371 115484 115030 114300 113420 112548 112161 112478 112896 112682 112012 111652 111773 111797 111443
55112 111443 111241 111823 113141 114566 115494 115662 115176 114491 114279 115031 116597 118159 118917 118923 119024 119887 121323 122701
55094 122701 123559 123551 122420 120635 119486 119672 120290 120228 120075 121310 123772 125549 125675 125381 126015 127131 127569
55077A27569k84k65j34m22o63m63k29l15m44l55k40j97q5Mj73m19l11R1M32P26
55057A23823J081J059L54l79m06k32p66j581j486n73n0j35J92J131J504P63r2
55040A24207j84K3j39l97l40k15k38o7L90N16k8o63q11o58n83n77o40r05j075
55021A17616n34N75J290J147O63K15m62j305j533q32K0L18L22M46M70K09O4K55
55003A18944L40J34K67J086J790J501O10K31P30J493J803J409N45j23L8Q29J245
54986A32872O29n76j473j628j171m81l7p2j96J53Q83J401J547J581J340M03q32
54969A34343j318q82m80n63l80N64J503J599J182R47P76K46l09j97N30J116J045
54952A39722M39k57o17n32l61m66o68o44p17j372k107j817m65P29J047J083J394
$$ plain form
55077 127569 127285 127020 126886 126464 125801 125338 125109 124794 124350 123995 123755 123558 123473 123477 123304 122885 122574 122665 123097 123823
55057 123823 124904 125963 126317 125938 125532 125300 124534 122953 121467 120894 120844 120709 120901 122032 123536 124299 124207
55040 124207 124023 124046 123907 123510 123170 122955 122717 122650 123040 123556 123528 122865 122054 121396 120813 120236 119596 118691 117616
55021 117616 117082 117657 118947 120094 120757 120972 120510 119205 117672 116840 116860 117178 117500 117946 118416 118625 118689 118944
55003 118944 119284 119418 119685 120771 122561 124062 124672 124903 125633 127126 128929 130338 130883 130760 130798 131627 132872
54986 132872 133501 132925 131452 129824 128653 128172 128135 128063 127867 128020 128903 130304 131851 133432 134772 135175 134343
54969 134343 133025 132143 131663 131100 130720 131284 132787 134386 135568 136515 137291 137537 137228 137031 137561 138677 139722
54952 139722 140161 139904 139287 138755 138394 137928 137260 136616 135899 134527 132420 130603 130138 130867 131914 132997 134391
54935A34391J614J435J323J575J669J306J114J559K128K376K835M004N296N909
54921A68534N991O054N997N595N212N174N007M202L022J829L13j681l320l836
54907B08093l764m136m971n563n693n550n008m011l266l449m093m179l539k669
54893A48202j654l38P71R66N20M24R44J479J792K327L256M106M465M400M105L763
54877A79528L746M323N109N467N387N362N361M643K679j30k821m578n126m827
54863B04123m383m228m225m107l910l773l665l594l656l591k872j619q42j231
54849A58427k205k738k678k509k352k024j708j737j886j625j002n86o30q56j006
54834A32885j082j103r67n60K52J408K296K141J026j8l84n95j137j424q26K3L7
$$ plain form
54935 134391 136005 137440 138763 140338 142007 143313 144427 145986 148114 150490 153325 157329 162625 168534
54921 168534 174525 180579 186576 192171 197383 202557 207564 211766 214788 216617 216930 215249 211929 208093
54907 208093 204329 200193 195222 189659 183966 178416 173408 169397 166131 162682 158589 154410 150871 148202
54893 148202 146548 146210 146981 147947 148467 148891 149835 151314 153106 155433 158689 162795 167260 171660 175765 179528
54877 179528 183274 187597 192706 198173 203560 208922 214283 218926 221605 221475 218654 214076 208950 204123
54863 204123 199740 195512 191287 187180 183270 179497 175832 172238 168582 164991 162119 160500 159658 158427
54849 158427 156222 153484 150806 148297 145945 143921 142213 140476 138590 136965 135963 135377 134747 133891 132885
54834 132885 131803 130700 129733 129173 129425 130833 133129 135270 136296 136278 135894 135299 134162 132738 131912 131935 131972
54817A31972o15p71l6P91J042R22Q33P69N80K51j40m15k80K14N43M18L27P24J154
54798A38283R59M75N76J183J308O02r3l5M34N29Q6m57p37p68p12n64j27O35J309
54779A42886J429J236J522K516L455L662L435L480L988M805N884O920P171O458
54765A98847N757N950O516O455N972O071O749O878N808L948J692j017l842n850
54751B49934o660o959p407p711p305o369n622n381n275m856m162l608l367l056
54737A72196k337j640j699k284k154p93O55R18M22O71K153L873M752M642M073
54722A83448L737M178N254O021N683M496L210K007O09q88k127l031l574l450k769
54707B02804k538l393m395m287l504l474m241m406l455k471k176j962j411j314
$$ plain form
54817 131972 131357 130586 130550 131341 132383 133305 134138 134907 135487 135738 135598 135183 134903 135117 135660 136078 136405 137129 138283
54798 138283 139242 139717 140293 141476 142784 143386 143293 143258 143692 144221 144307 143850 143113 142345 141633 141069 140942 141577 142886
54779 142886 144315 145551 147073 149589 153044 156706 160141 163621 167609 172414 178298 185218 192389 198847
54765 198847 204604 210554 217070 223525 229497 235568 242317 249195 255003 258951 260643 259626 255784 249934
54751 249934 243274 236315 228908 221197 213892 207523 201901 196520 191245 186389 182227 178619 175252 172196
54737 172196 169859 168219 166520 164236 162082 161289 161944 162862 163284 163955 166108 169981 174733 179375 183448
54722 183448 187185 191363 196617 202638 208321 212817 216027 218034 218643 217755 215628 212597 209023 205573 202804
54707 202804 200266 196873 192478 188191 184687 181213 176972 172566 169111 166640 164464 162502 161091 159777
54693A59777k196l088k827j740j000r43r65p30n15n67p70r09q23m20J57N06L47
54676A43294k11q98j539j978k038j696j061k37N89J048R13M90K38J50r2m83p06
54659A35783o69m79j22L27L55l10r35n23P12J472J104K94p5M7K86M82N32K11m87
54640A38005j138j299p64M38J845K546K002Q19P5j6o9l17l90k21j86k53k6K96
54622A41347L9o48p33M1N76N1q20r15k46L35L61n1o40j033p75O6P00N46K2n4M78
54601A38647J073J177P02l3n27n38l41k44k7N94J126P31m25j184r51l13J20N16
54583A40103J013J119N72K1M7K40l7n13m58J65P46R47R06P24L52j44n92q91r53
54564A43367p60n68o52o97m1J255K195K107J499J185J149Q53K16l62o25n75k13
$$ plain form
54693 159777 157581 154493 151666 149926 148926 147983 147018 146288 145773 145206 144436 143527 142704 142284 142441 142947 143294
54676 143294 143083 142185 140646 138668 136630 134934 133873 133636 134225 135273 136186 136676 136914 137064 136972 136489 135783
54659 135783 135114 134635 134513 134840 135195 134885 133950 133427 134139 135611 136715 137009 136934 136981 137267 137749 138281 138492 138005
54640 138005 136867 135568 134804 135242 137087 139633 141635 142454 142529 142513 142444 142127 141737 141516 141330 141077 141051 141347
54622 141347 141386 140738 140005 140046 140622 140673 139853 138938 138692 139027 139388 139337 138697 137664 136889 136955 137655 138201 138223 138169 138647
54601 138647 139720 140897 141599 141566 141039 140501 140160 139916 139889 140483 141609 142340 141915 140731 139780 139467 139587 140103
54583 140103 141116 142235 142807 142828 142875 143115 143078 142565 142107 142272 143018 143965 144871 145595 145947 145803 145211 144320 143367
54564 143367 142607 142039 141387 140690 140649 141904 144099 146206 147705 148890 150039 150892 151108 150746 150121 149546 149333
54547A49333L58P90Q57P82R47J477K189K631K181O52j069j696j052k58j64l90
54531A57568k34K59O90R99J168Q61K2p35q94p16o24n11k42k05o80j167j080o04
54513A53875j74K93R53J296P79j77o80n68l97m59n58n68m99k42J87M16L21M76
54495A54274J240J863J443L81j28J29K73m8r6N37J064O35l98j048r67o02k95Q2
54477A58339O51J146J203Q97P43J096J683J974J879J759J746J536J037O82P50
54462A77121R17Q43Q09J155J499J177L01l17k61nk03r11j627j830j370n74N5K86
54444A77065K68K26K13K59L62K86k32j007j517j633j661j516o44Q36J744J255
54428A74304J00m23j59O7j21l19k83k24j62J76P25J020R30Q43R87J079Q18K70
$$ plain form
54547 149333 149691 150481 151338 152120 153067 154544 156733 159364 161545 162197 161128 159432 158380 158122 157958 157568
54531 157568 157334 157593 158283 159282 160450 161311 161333 160598 159704 158988 158364 157853 157611 157406 156726 155559 154479 153875
54513 153875 153701 153994 154947 156243 157022 156845 156165 155597 155200 154741 154183 153615 153116 152874 153061 153477 153798 154274
54495 154274 155514 157377 158820 159201 159073 159202 159475 159427 159331 159868 160932 161567 161169 160121 159154 158552 158257 158339
54477 158339 158990 160136 161339 162236 162979 164075 165758 167732 169611 171370 173116 174652 175689 176371 177121
54462 177121 178038 178881 179690 180845 182344 183521 183822 183505 183244 183239 183036 182125 180498 178668 177298 176724 176779 177065
54444 177065 177333 177559 177772 178031 178393 178679 178447 177440 175923 174290 172629 171113 170469 171305 173049 174304
54428 174304 174404 173981 173822 173889 173768 173449 173166 172942 172780 172956 173681 174701 175631 176474 177461 178540 179358 179628
54410A79628l32q31j062q81l43L02Q20J014P38K00mM37R91Q90J79l23j55K68L32
54391A81868K7j93n8K37L82L95O30J245J856J926J475R61N65J4p55j305j314r15
54373A87041k43P79J879K340J929J347J203J153O48n7l59k95k16RO51J311J364
54356B00484R81Q07Q57O04Q0j71j79n55j273j489r62o39j284k231k329j607j195
54339A89899j673k260j903p28R2j75r33j140o28q6P0J08J90K3m55p48n96m06m01
54320A78250j04O93J177N72n57j021o92m49p12j036j094j113j198j045n20M8L56
54303A71555M77O21Q94J253J388Q98q0p67o51j70L4LN8O4r7O0Q40J490J236O68
54283A79774Q59J451J088l33j357j123m07j08K5N45J263J651J533R16o5p54l80
$$ plain form
54410 179628 179296 178465 177403 176522 176179 176481 177301 178315 179053 179253 179249 179686 180677 181567 181746 181423 181268 181536 181868
54391 181868 181895 181702 181644 181881 182263 182658 183288 184533 186389 188315 189790 190751 191316 191330 190575 189270 187956 187041
54373 187041 186798 187577 189456 191796 193725 195072 196275 197428 198076 198019 197660 197365 197149 197158 197809 199120 200484
54356 200484 201465 202272 203129 203733 203813 203642 203463 202908 201635 200146 199184 198545 197261 195030 192701 191094 189899
54339 189899 188226 185966 184063 183335 183427 183252 182319 181179 180551 180465 180535 180643 180833 180856 180401 179653 179057 178651 178250
54320 178250 178146 178839 180016 180588 180031 179010 178318 177869 177157 176121 175027 173914 172716 171671 171151 171199 171555
54303 171555 172032 172653 173547 174800 176188 177086 177006 176239 175588 175418 175452 175455 175513 175577 175480 175540 176380 177870 179106 179774
54283 179774 180633 182084 183172 182839 181482 180359 179952 179844 179869 180414 181677 183328 184861 185777 185712 184958 184578
54266A84578P05J193O19jJ58M86J22n48n69N0N30N68N11M88K54j74l92j49M30
54247A88859J075J477J291M53n10q96n77j72m13j374k336k425j491k24P01J237
54231A84675J501J175K2j240j494o45K88N24L44L10M51M50J24n22j219j435r10
54214A82399k10j10m74n50k68k69n79l79N27J165Q19Q8j72j25m35j151j798k038
54196A76440j676n72Q92J777J615R66M93J24l18m29J24Q19R30N35J39j87n97q30
54178A80245n68j00J17K64P51J357J486J117P04L65j43p94j265j464j454j064
54162A79554j55Q41J295J182Q99N05k75j329k056k045j393m40L86O30K61j18O
54145A77748K86M5o56j118j059q18o18k81J72M20M54P03J289J741J692J412J301
$$ plain form
54266 184578 185283 186476 187095 187094 187252 187738 187860 187312 186743 186793 187323 187891 188402 188890 189144 188970 188578 188429 188859
54247 188859 189934 191411 192702 193155 192645 191749 191172 191000 190587 189213 186877 184452 182961 182737 183438 184675
54231 184675 186176 187351 187373 186133 184639 183994 184282 184806 185150 185460 185911 186361 186485 185963 184744 183309 182399
54214 182399 182189 182079 181605 181055 180787 180518 179939 179560 180087 181252 182071 182159 181987 181862 181427 180276 178478 176440
54196 176440 174764 174192 175084 176861 178476 179442 179935 180059 179741 179312 179436 180255 181185 181720 181859 181672 181075 180245
54178 180245 179677 179577 179694 179958 180709 182066 183552 184669 185373 185738 185595 184801 183536 182072 180618 179554
54162 179554 179399 180240 181535 182717 183616 184121 183846 182517 180461 178416 177023 176583 176969 177599 177860 177742 177748
54145 177748 178034 178079 177423 176305 175246 174428 173810 173529 173701 174121 174575 175278 176567 178308 180000 181412 182713
54128A82713J269R46K58n23j083j218p98J42J310K224K457J949J163Q00J157J873
54112A94639K400K609K738K974L335L826M371M702M568L968L060K000J027M49
54098B36666J76l66j453k438k454j611r10j053j819k647l247l508l275k564j697
54083B07800j022o73o20p15o41j05P03J194R70K78l20n17l89q6L83J009J507J408
54065B10164O38r8J50J441K690K767J641K21o69p91k65N15R16N40j88l81K67J155
54047B20713J604J565J345J115J027J438K518L785M519M593M510M587M580M309
54033B62208M175M608N311N565N268N039N175N137M429L480L013K906K376J218
54019C19908J33k11J38P36J198J184N45k97o86o39r26j875k804l021k818k943
$$ plain form
54128 182713 183982 184928 185186 184663 183580 182362 181564 181706 183016 185240 187697 189646 190809 191609 192766 194639
54112 194639 197039 199648 202386 205360 208695 212521 216892 221594 226162 230130 233190 235190 236217 236666
54098 236666 236842 236476 235023 232585 230131 228520 227610 226557 224738 222091 218844 215336 212061 209497 207800
54083 207800 206778 206105 205485 204770 204129 204024 204727 205921 206891 207169 206849 206332 205943 205857 206240 207249 208756 210164
54065 210164 210802 210704 210854 212295 214985 217752 219393 219614 218945 218154 217889 218404 219320 219860 219672 219291 219558 220713
54047 220713 222317 223882 225227 226342 227369 228807 231325 235110 239629 244222 248732 253319 257899 262208
54033 262208 266383 270991 276302 281867 287135 292174 297349 302486 306915 310395 313408 316314 318690 319908
54019 319908 320041 319830 319968 320704 321902 323086 323631 323334 322648 322009 321083 319208 316404 313383 310565 307622
54003C07622l500m063m485m906n160m838l947k925k082j466j274j727k525k933
53989B61791k648k087j669j271p37m60r03j730j982j259k50K21K81O85J594K391
53973B51967K780L273M196M926M859M573N101O331P108O809N793M291K089m30
53959C13666k130k600k789l498m219m205l792l631l381k313p89P9Jk23R0Q99J886
53942B83051K696K925K574K380K882L491L353K837L045M011M565M081L203K589
53928C27683K125J734J913K839L789M105M030M033M019L831L884M506N201N323
53914C79015N136N404O180O751O686O211N601M871M175L844L829L530K557J277
53900D45067L38r9l89q44j517k391l413m297m631m395m143m394n044n640o109
$$ plain form
54003 307622 304122 300059 295574 290668 285508 280670 276723 273798 271716 270250 268976 267249 264724 261791
53989 261791 259143 257056 255387 254116 253379 252919 252016 250286 248304 247045 246795 247016 247297 247982 249576 251967
53973 251967 254747 258020 262216 267142 272001 276574 281675 288006 295114 301923 307716 312007 314096 313666
53959 313666 311536 308936 306147 302649 298430 294225 290433 286802 283421 281108 280319 280398 280399 280176 280266 281165 283051
53942 283051 285747 288672 291246 293626 296508 299999 303352 306189 309234 313245 317810 321891 325094 327683
53928 327683 329808 331542 333455 336294 340083 344188 348218 352251 356270 360101 363985 368491 373692 379015
53914 379015 384151 389555 395735 402486 409172 415383 420984 425855 430030 433874 437703 441233 443790 445067
53900 445067 445405 445306 444917 444073 442556 440165 436752 432455 427824 423429 419286 414892 409848 404208 398099
53885C98099o714p422p710p252o365n571n050m767m744m943n081m962m728m569
53871C18221m405m147l940l859l650l171k764k734k784k482k046k031k488k972
53857B74748l283l498l449k873k145k027k537k738j975p28J25L26J68j00l66m55
53841B49193l38l06n85r20q66m06N2J57j12n99j146j519j454q69l8N88P70O64
53823B42266N39M60L67L37M74N85L83P2K38R81J642J720J570J760K147K191J834
53806B59566J536J628K201L283M602N417N273M771M834N477N957N917N543M811
53792C20816L649K771L118M258M525L271J803J493J932J898J256P51N12l1r35
53777C51087j571j749k049k836l687m145m397m764n025m712l861l063k789k996
$$ plain form
53885 398099 391385 383963 376253 369001 362636 357065 352015 347248 342504 337561 332480 327518 322790 318221
53871 318221 313816 309669 305729 301870 298220 295049 292285 289551 286767 284285 282239 280208 277720 274748
53857 274748 271465 267967 264518 261645 259500 257473 254936 252198 250223 249495 249620 249946 250114 250014 249648 249193
53841 249193 248855 248549 247964 247044 246178 245772 245824 245981 245869 245270 244124 242605 241151 240282 240244 240832 241602 242266
53823 242266 242805 243265 243632 243969 244443 245028 245411 245483 245721 246702 248344 250064 251634 253394 255541 257732 259566
53806 259566 261102 262730 264931 268214 272816 278233 283506 288277 293111 298588 304545 310462 316005 320816
53792 320816 324465 327236 330354 334612 339137 342408 344211 345704 347636 349534 350790 351541 352053 352022 351087
53777 351087 349516 347767 345718 342882 339195 335050 330653 325889 320864 316152 312291 309228 306439 303443
53763C03443l318l439l272k946k775l012l565m034m087l740l172k534k045j970
53749B59534k206k146j458p83r87j765j863q55K87P65J060J692J924Q63p75j421
53733B51866q58k92l25k74K78O51L68R6N41J274J461J117Q70R78J259J563J731
53716B62304J456P71L13N53J057J038M52l4Q5P32J586K400L039L520L917M082
53700B87271L726K995K622L107L997M365L838K911K343K565L439M299M364L468
53686C35310K242J426J109Q66M58L6k10l32n34r07j247j213p95n29q67j414j325
53669C32074m93K21J45l46m82j47K05K75J69Q8K35P02J220J236N61l10q48j081
53651C33424j245j179n90L52J168J553J403O19n88j427j268m79L6J20M42J219
$$ plain form
53763 303443 300125 296686 293414 290468 287693 284681 281116 277082 272995 269255 266083 263549 261504 259534
53749 259534 257328 255182 253724 252941 251954 250189 248326 247471 247758 248523 249583 251275 253199 254062 253287 251866
53733 251866 251008 250716 250391 250117 250395 251046 251414 251510 252051 253325 254786 255903 256773 257751 259010 260573 262304
53716 262304 263760 264531 264844 265397 266454 267492 267944 267910 267995 268727 270313 272713 275752 279272 283189 287271
53700 287271 290997 293992 296614 299721 303718 308083 311921 314832 317175 319740 323179 327478 331842 335310
53686 335310 337552 338978 340087 340953 341411 341447 341237 340905 340371 339464 338217 337004 336209 335680 334813 333399 332074
53669 332074 331581 331802 331947 331601 331119 330972 331177 331452 331621 331709 331944 332646 333866 335102 335663 335353 334505 333424
53651 333424 332179 331000 330410 330762 331930 333483 334886 335505 334917 333490 332222 331743 331779 331899 332341 333560
53635C33560J642J070J94K73J426K430K336J650J513K144K730K698K386K359K645
53620C61056K918L022K882K430J958K086K812L110K216R61R07K364M106M982M884
53605D02694M191L267K641K722L061K759J850J333J610J912J704J518J774J803
53591D34839R37k66q32p47o20n70l54j49k90n63n87n80q95j220j055p16r30j573
53573D23829j764j222o61p03j129j392j324j119r27o45n7P79J236O70o46j608
53557D13317j568r37k27O85J770K196J386J89j06N74J305J674J935K052J724J327
53541D27296J618K502L064L065L300M276N371N716N263M653M507M995N740O157
53527D87523O202O616P912R528J0639J1361J2275J3108J3091J2458J2427J3557
$$ plain form
53635 333560 335202 336272 336466 336739 338165 340595 342931 344581 346094 348238 350968 353666 356052 358411 361056
53620 361056 363974 366996 369878 372308 374266 376352 379164 382274 384490 385451 386358 388722 392828 397810 402694
53605 402694 406885 410152 412793 415515 418576 421335 423185 424518 426128 428040 429744 431262 433036 434839
53591 434839 435776 435510 434678 433931 433311 432741 432387 432238 431948 431385 430798 430218 429323 428103 427048 426332 425402 423829
53573 423829 422065 420843 420182 419479 418350 416958 415634 414515 413588 412943 412886 413665 414901 415571 414925 413317
53557 413317 411749 410812 410585 411270 413040 415236 416622 416811 416705 417279 418584 420258 422193 424245 425969 427296
53541 427296 428914 431416 434480 437545 440845 445121 450492 456208 461471 466124 470631 475626 481366 487523
53527 487523 493725 500341 508253 517781 528420 539781 552056 565164 578255 590713 603140 616697
53515F16697J5241J6881J8499J9980K0904K1443K2356K3720K4746K5176K5727
53504H51370K6633K7022K6417K5726K5840K6211K5831K4841K4147K4035K4145
53493A132218K4276K4304K3723K2323K0970K0741K1413K1762K1252K0604K0592
53482A374178K1016K1131K0568J9638J8961J8882J9108J9046J8526J7871J7109
53471A586034J5639J3103J0165P785O010M116J703r47l473n810p937r803j1489
53458A605096j3076j4347j4956j4932j4766j5024j6041j7755j9547k0526k0393
53447A423733j9852j9795k0288k0739k0870k0819k0516j9560j7899j6049j4482
53436A212864j3173j1878j0520r163p928o972o268n396l948k146o16M92J685L287
$$ plain form
53515 616697 631938 648819 667318 687298 708202 729645 752001 775721 800467 825643 851370
53504 851370 878003 905025 931442 957168 983008 1009219 1035050 1059891 1084038 1108073 1132218
53493 1132218 1156494 1180798 1204521 1226844 1247814 1268555 1289968 1311730 1332982 1353586 1374178
53482 1374178 1395194 1416325 1436893 1456531 1475492 1494374 1513482 1532528 1551054 1568925 1586034
53471 1586034 1601673 1614776 1624941 1632726 1638736 1642852 1644555 1643608 1640135 1634325 1626388 1616585 1605096
53458 1605096 1592020 1577673 1562717 1547785 1533019 1517995 1501954 1484199 1464652 1444126 1423733
53447 1423733 1403881 1384086 1363798 1343059 1322189 1301370 1280854 1261294 1243395 1227346 1212864
53436 1212864 1199691 1187813 1177293 1168130 1160202 1153230 1146962 1141566 1137618 1135472 1134856 1135348 1137033 1140320
53422A140320M936O231P446R090J1091J2905J4344J5780J7477J9208K0684K2044
53410A301556K3642K5534K7443K9138L0646L2087L3520L5011L6657L8499M0487
53399A654220M2503M4404M6045M7517M9210N1369N3591N5164N6008N6872N8320
53388B215223N9979O1090O1469O1380O0789N9382N7178N4563N1814M9118M6900
53377B838885M5421M4003M1495L7654L3383K9379K5351K0934J6471J2258P696
53366C152930K043m404j0659j6343k1845k7438l2969l8318m3399m7629n0192n1081
53354B810696n1296n1802n2663n3377n3570n3096n1922n0238m8507m7123m6194
53343B250908m5740m5767m6015m5979m5420m4587m3668m2420m0626l8677l7127
$$ plain form
53422 1140320 1145256 1151487 1158933 1168023 1179114 1192019 1206363 1222143 1239620 1258828 1279512 1301556
53410 1301556 1325198 1350732 1378175 1407313 1437959 1470046 1503566 1538577 1575234 1613733 1654220
53399 1654220 1696723 1741127 1787172 1834689 1883899 1935268 1988859 2044023 2100031 2156903 2215223
53388 2215223 2275202 2336292 2397761 2459141 2519930 2579312 2636490 2691053 2742867 2791985 2838885
53377 2838885 2884306 2928309 2969804 3007458 3040841 3070220 3095571 3116505 3132976 3145234 3152930
53366 3152930 3154973 3150569 3139910 3123567 3101722 3074284 3041315 3002997 2959598 2911969 2861777 2810696
53354 2810696 2759400 2707598 2654935 2601558 2547988 2494892 2442970 2392732 2344225 2297102 2250908
53343 2250908 2205168 2159401 2113386 2067407 2021987 1977400 1933732 1891312 1850686 1812009 1774882
53332A774882l5876l4261l1966k9380k6984k4857k2952k1406k0327j9617j9240
53321A488016j9340j9756j9874j9373j8831j8897j9078j8189j6007j3665j2137
53310A292869j1076r672p902o205m453k159M97K741M296N660P137Q394R237J0170
53296A299534J1748J3704J5286J6274J7293J9120K1839K4686K6687K7506K7601
53285A521278K7543K7366K6823K5983K5060K3889K2172K0215J8661J7341J5126
53274A771457J1386P022L505J209o84k959n576q087j0241j2123j4013j6245j8950
53261A705701k1810k4227k5854k6879k7740k8575k9095k9065k8842k9058k9675
53250A404881k9782k8770k7355k6796k7230k7564k7082k6393k6444k7241k8046
$$ plain form
53332 1774882 1739006 1704745 1672779 1643399 1616415 1591558 1568606 1547200 1526873 1507256 1488016
53321 1488016 1468676 1448920 1429046 1409673 1390842 1371945 1352867 1334678 1318671 1305006 1292869
53310 1292869 1281793 1272121 1264219 1258014 1253561 1251402 1251899 1254640 1258936 1264596 1271733 1280127 1289364 1299534
53296 1299534 1311282 1324986 1340272 1356546 1373839 1392959 1414798 1439484 1466171 1493677 1521278
53285 1521278 1548821 1576187 1603010 1628993 1654053 1677942 1700114 1720329 1738990 1756331 1771457
53274 1771457 1782843 1789865 1793370 1794579 1793895 1790936 1785360 1777273 1767032 1754909 1740896 1724651 1705701
53261 1705701 1683891 1659664 1633810 1606931 1579191 1550616 1521521 1492456 1463614 1434556 1404881
53250 1404881 1375099 1346329 1318974 1292178 1264948 1237384 1210302 1183909 1157465 1130224 1102178
53239A102178k8325k7974k6996k5577k4255k3467k3025k2390k1354k0102j8733
53228H39980j7146j5418j3939j3093j2901j2977j2738j1995j1326j1594j2834
53217F94019j3996j4112j3474j3218j3933j5060j5618j5171j4065j3020j2534
53206E39818j2544j2608j2314j1500j0224q899q257q655r361r178q041p251p777
53193D13209q982r566r169q323p397o429n675n371n090m253l269l204m209n058
53179C27214m639l293k256k222k781k989k304j100l80o78j322j192k55K26p13
53164C01316k440l322k493o45P64Q74O5o66q59r61j457j933j579m44L60o0j338
53147B85182k351k441j846j163p34m83j84K00M13K64m7r5K61Q24J370J778J860
$$ plain form
53239 1102178 1073853 1045879 1018883 993306 969051 945584 922559 900169 878815 858713 839980
53228 839980 822834 807416 793477 780384 767483 754506 741768 729773 718447 706853 694019
53217 694019 680023 665911 652437 639219 625286 610226 594608 579437 565372 552352 539818
53206 539818 527274 514666 502352 490852 480628 471729 463472 454817 445456 436278 428237 420986 413209
53193 413209 404227 394661 385492 377169 369772 363343 357668 352297 347207 342954 339685 336481 332272 327214
53179 327214 322575 319282 317026 314804 312023 309034 306730 305630 305250 304572 303250 302058 301803 302029 301316
53164 301316 298876 295554 293061 292416 293180 294054 294119 293453 292594 291633 290176 288243 286664 286220 286580 286520 285182
53147 285182 282831 280390 278544 277381 276647 276164 275980 276180 276593 276857 276810 276715 276976 277800 279170 280948 282808
53130B82808J484R58Q50J291J734J666J294J192J489J764J697J463J412J617J918
53115C04637K290K852L436L420K392Q74k1J62O83N99j22q58j374j946k591k818
53099C11615k373j686j278j183j212j434j994k607k707k108j313j049j604k565
53085B86502l140k749j508j77L86k4p65r29k80N15P47N17M12M80J75o24j246j228
53067B77064j048j257j495j118m14k47p36j164j199j230j363j063j70N69N63K79
53051B65971M40R05J029P90P93J294J859K021J802J503J342J342J372J192O99
53036B84354N5m61p42q87j038j281j546j557j074k47M47P24P14O11M42L28M98
53019B79340Q43Q40K93k35j65K81N16N44Q33J338J439R21M16M89Q65Q49L11j56
$$ plain form
53130 282808 284292 285250 286100 287391 289125 290791 292085 293277 294766 296530 298227 299690 301102 302719 304637
53115 304637 306927 309779 313215 316635 319027 319901 319880 320042 320725 321324 321202 320344 318970 317024 314433 311615
53099 311615 309242 307556 306278 305095 303883 302449 300455 297848 295141 293033 291720 290671 289067 286502
53085 286502 283362 280613 279105 278928 279314 279290 278525 277596 277316 277831 278578 279095 279507 279987 280162 279538 278292 277064
53067 277064 276016 274759 273264 272146 271732 271485 270749 269585 268386 267156 265793 264730 264560 265129 265692 265971
53051 265971 266411 267316 268345 269135 269928 271222 273081 275102 276904 278407 279749 281091 282463 283655 284354
53036 284354 284409 283948 283206 282319 281281 280000 278454 276897 275823 275576 276023 276747 277461 278072 278514 278842 279340
53019 279340 280183 281023 281316 281081 280916 281197 281713 282257 283090 284428 285867 286788 287204 287693 288558 289407 289718 289562
53001B89562O1R12J647J465L96n09k12J057J988J794J103Q92J160J193Q04N03
52985C03816M84L96J94M30J199J588Q57l37o88L3Q73J157J207J457J723J664J373
52968C17426J073P54M85N83J034J238P91J35o5K20O53J164J667J568M66r07j408
52951C26877j056r34j522k092k010j661j625j746j585j156o61o1N26N18l49j354
52935C10109j534q70j23J96J54r5m43o22m54k12j82k7P45J709J717L86j258j939
52917C07257j486p21l53m29o44p92r08j089j211q88O8J147J494Q74nl67k25j21
52899C01601k70m25m12l61l38k10K0R3p0q0M23J144J355P79q1n79o37n94o30n97
52879C00131l64J2M75J052J642J962J839J461J211J333J773K227K347K014J532
$$ plain form
53001 289562 289623 290535 292182 293647 294043 293534 293322 294379 296367 298161 299264 300156 301316 302509 303313 303816
52985 303816 304300 304696 304890 305320 306519 308107 308964 308627 307939 307972 308845 310002 311209 312666 314389 316053 317426
52968 317426 318499 319253 319738 320321 321355 322593 323384 323519 323454 323674 324327 325491 327158 328726 329192 328285 326877
52951 326877 325821 324887 323365 321273 319263 317602 315977 314231 312646 311490 310829 310768 311294 311812 311463 310109
52935 310109 308575 307705 307582 307778 307932 307837 307394 306772 306318 306106 305924 305897 306642 308351 310068 310454 309196 307257
52917 307257 305771 305050 304697 304268 303624 302832 301924 300835 299624 298736 298804 299951 301445 302319 302314 301947 301722 301601
52899 301601 301331 300906 300494 300133 299795 299585 299605 299698 299628 299548 299971 301115 302470 303249 303168 302589 301952 301358 300728 300131
52879 300131 299767 299779 300254 301306 302948 304910 306749 308210 309421 310754 312527 314754 317101 319115 320647
52864C20647J284J205P98j44j098j415j158j026j439k113k535k550k368k173k024
52849C03891j922j858j829j897k127k383k399k198k215k742l360l347k620j861
52835B71133j531j222l36R26J765J777J304P39J28m20m11M39J610K172J726O90
52819B80489k61p44p85o32n21n02m88m97o25o90k84O26J451J674J508J416J289
52802B82424O66l68j165j400j408j500j557j494j527j671j433m76P79J542J428
52787B72840N72o17j500j375k05J040J334Q22N95J183J844J549L14q50j136p70
52771B75640n97j083j824k063j507n47K21N42N11K73j21n70p89m51M17J263J445
52754B70760R65N74Q70J513J684J183O11M59N77O94R58J583K292K538K179J595
$$ plain form
52864 320647 321931 323136 323934 323790 322692 321277 320119 319093 317654 315541 313006 310456 308088 305915 303891
52849 303891 301969 300111 298282 296385 294258 291875 289476 287278 285063 282321 278961 275614 272994 271133
52835 271133 269602 268380 268044 268970 270735 272512 273816 274555 274683 274263 273852 274291 275901 278073 279799 280489
52819 280489 280228 279484 278699 278067 277546 277044 276556 276059 275434 274744 274460 275086 276537 278211 279719 281135 282424
52802 282424 283090 282722 281557 280157 278749 277249 275692 274198 272671 271000 269567 269091 269870 271412 272840
52787 272840 273412 272795 271295 269920 269715 270755 272089 272911 273506 274689 276533 278082 278396 277546 276410 275640
52771 275640 275043 273960 272136 270073 268566 268019 268240 268782 269293 269566 269445 268875 268086 267635 268052 269315 270760
52754 270760 271725 272299 273169 274682 276366 277549 278160 278619 279196 279890 280848 282431 284723 287261 289440 291035
52738B91035J205J081J050R92R93J200J505J527J166R45J373K030J918Q76l5J02
52722C08963Q41J078M69m47j199j720j875j443o82l09o08j026r03k82K82M42L19
52705C01900J22j53n90j078j289j005l47L72R21J185J050N58R7L1J08l15j344
52688C00223k269k480k131j638j004j93L32J34m20n53j30L00M41M83M57J08m74
52671B91186p46n00k14l60p99j099j039n42L82J385J848J591J174J145J329J256
52655B95997J027J173J792K326K322K046K105K631L029K606J369Q9n34n86p29
52640C16663j311k003k305k075j523r58o83q58j227j259p14K4M46N43P45J315
52624C04820J999K298J929J064J16o88j417k017k081j378m36o4k69l45q5j44p91
$$ plain form
52738 291035 292240 293321 294371 295363 296356 297556 299061 300588 301754 302699 304072 306102 308020 308896 308861 308963
52722 308963 309804 310882 311351 310904 309705 307985 306110 304667 303985 303676 303068 302042 301139 300857 301139 301581 301900
52705 301900 302022 301869 301279 300201 298912 297907 297560 297932 298853 300038 301088 301646 301743 301774 301882 301567 300223
52688 300223 297954 295474 293343 291705 290701 290508 290840 290974 290554 290001 289871 290171 290612 291095 291552 291660 291186
52671 291186 290440 289940 289726 289366 288567 287468 286429 285887 286269 287654 289502 291093 292267 293412 294741 295997
52655 295997 297024 298197 299989 302315 304637 306683 308788 311419 314448 317054 318423 318512 317978 317392 316663
52640 316663 315352 313349 311044 308969 307446 306488 305805 304947 303720 302461 301747 301771 302217 302760 303505 304820
52624 304820 306819 309117 311046 312110 312226 311538 310121 308104 306023 304645 304209 304145 303876 303531 303446 303302 302511
52607C02511j142l38J081J856J670J185P08k8p89p18L26J250J217P50P32J000
52591C11271P76M9m44l48M4N04J084J566J542J135R94J320J528J130L68k38m93
52574C21788l44K66J006J170N19k88n98n99p67r09n21J88M36jn68q82j205j733
52556C16958k092j859j158m77j58l04q33j354j319o36J21L50J20k5J83M29K63
52539C08209k87o64l59M73J123J156Q46O56N76M33N05J127J865J805Q18j76m04
52522C17702k9M43Q75J199J103N84K66O33J303J643J683J866K244K541K711K838
52506C39605K696K011J022J78n17j368k320l021l417l670l576k771j513o32o00
52491C22107j110j706k181k345j967j203o06m56m92m09k17K5L90Q23J049J020
$$ plain form
52607 302511 301369 301031 302112 303968 305638 306823 307531 307503 306714 305996 306322 307572 308789 309539 310271 311271
52591 311271 312047 312096 311652 311304 311348 311852 312936 314502 316044 317179 318173 319493 321021 322151 322519 322281 321788
52574 321788 321444 321710 322716 323886 324405 324117 323519 322920 322153 321244 320723 320911 321347 321346 320778 319896 318691 316958
52556 316958 314866 313007 311849 311372 311214 310910 310077 308723 307404 306768 306889 307239 307359 307334 307517 307946 308209
52539 308209 307922 307258 306899 307372 308495 309651 310497 311153 311729 312162 312667 313794 315659 317464 318282 318106 317702
52522 317702 317673 318116 318991 320190 321293 321877 322143 322776 324079 325722 327405 329271 331515 334056 336767 339605
52506 339605 342301 344312 345334 345512 344995 343627 341307 338286 334869 331199 327623 324852 323339 322707 322107
52491 322107 320997 319291 317110 314765 312798 311595 310989 310533 310041 309632 309415 309440 309830 310653 311702 312722
52475C12722J059J382J724J762J623J726K242K871L075K537J519P87R00J591K083
52460C39603J986J533J047O52N13P33Q68J19j557l056l410l018l011l579l692
52445C25731k601r67p5l33j047j549j914k417k761k372j277j48N22P67O28k4q91
52428C09272j086j94R90J398J086R78J417J764J423O05l9m7O21J515J900J582
52412C23185J351K009L078L341K590J941K195K909L470M143N422P032Q256Q767
52398C79689Q492P209M903K215n2j681k863l675m184m647n091m994m001k689k019
52383C66612k246k765k887k302j092K47J053J210J330J875K490K735K897L429
52369C72586L964L817L151K764K854K892K653K402K051J133j57q66o11j68l07
$$ plain form
52475 312722 313781 315163 316887 318649 320272 321998 324240 327111 330186 332723 334242 335029 335929 337520 339603
52460 339603 341589 343122 344169 344821 345334 346067 346935 347054 345497 342441 339031 336013 333002 329423 325731
52445 325731 323130 322163 322088 321755 320708 319159 317245 314828 312067 309695 308418 308270 308792 309559 310187 310163 309272
52428 309272 308186 307992 308982 310380 311466 312444 313861 315625 317048 317653 317614 317567 318188 319703 321603 323185
52412 323185 324536 326545 329623 332964 335554 337495 339690 342599 346069 350212 355634 362666 370922 379689
52398 379689 388181 395390 400293 402508 402456 400775 397912 394237 390053 385406 380315 375321 371320 368631 366612
52383 366612 364366 361601 358714 356412 355320 355567 356620 357830 359160 361035 363525 366260 369157 372586
52369 372586 376550 380367 383518 386282 389136 392028 394681 397083 399134 400267 400110 399244 398633 398465 398158
52354C98158p72q94n64J6Q99K069K999L207K992K988L205L054K297J425J157J798
52338D24034L105M457N255N411N361N521N971O742P933R255R969R910J0052J1388
52324E24364J3516J5177J6003J6771J7870J8584J8350J7747J7636J7996J8361
52313G12375J8882K0022K1518K2494K2627K2447K2467K2660K2869K3039K2909
52302I54309K2134K0953K0174K0137K0178J9505J8145J6610J5043J3183J0891
52291A151262Q274N496K854Q14m22j228k004k630k846k987l725n168o685p558
52277A133447p412o247m519l063k310j652j50K109M093N245O127P438R017J0212
52263A152335J0724J0817J1031J1830J3186J4446J5041J5337J6139J7360J8013
$$ plain form
52354 398158 397386 396492 395928 395944 396843 398912 401911 405118 408110 411098 414303 417357 419654 421079 422236 424034
52338 424034 427139 431596 436851 442262 447623 453144 459115 465857 473790 483045 493014 502924 512976 524364
52324 524364 537880 553057 569060 585831 603701 622285 640635 658382 676018 694014 712375
52313 712375 731257 751279 772797 795291 817918 840365 862832 885492 908361 931400 954309
52302 954309 976443 997396 1017570 1037707 1057885 1077390 1095535 1112145 1127188 1140371 1151262
52291 1151262 1159536 1165032 1167886 1168700 1168278 1167050 1165046 1162416 1159570 1156583 1152858 1147690 1141005 1133447
52277 1133447 1126035 1119788 1115269 1112206 1109896 1108244 1108094 1110203 1114296 1119541 1125668 1133106 1142123 1152335
52263 1152335 1163059 1173876 1184907 1196737 1209923 1224369 1239410 1254747 1270886 1288246 1306259
52252A306259J7779J7539J7915J8104J7020J4863J2681J0864R011P027N360M195
52240A458617L117J698j26k232m326n824o284n999n790o163p069q215r222r543
52226A392639q905p836p239p369p602p285o352n132l917k887k092j398o26K84
52212A324283J322K444L329L516L104L011L905N281O167O535P112P984Q341P840
52198A394174P263P475Q349R157R498R463R296R205R184Q926Q165P162O314N349
52184A508980L598J244n68j299j846l270n289o887p845q793r987j0841j0760r756
52170A436681q265o765n699n238n093m768m086l242k462j857j414r18n1J040J557
52155A389420R90p1n72m21m69j111j604j216l58n5o10j368j607j241o35j36J35
$$ plain form
52252 1306259 1324038 1341577 1359492 1377596 1394616 1409479 1422160 1433024 1442035 1449062 1454422 1458617
52240 1458617 1461734 1463432 1463306 1461074 1456748 1450924 1444640 1438641 1432851 1426688 1419619 1411404 1402182 1392639
52226 1392639 1383734 1375898 1368659 1361290 1353688 1346403 1340051 1334919 1331002 1328115 1326023 1324625 1323999 1324283
52212 1324283 1325605 1328049 1331378 1334894 1337998 1341009 1344914 1350195 1356362 1362897 1370009 1377993 1386334 1394174
52198 1394174 1401437 1408912 1417261 1426418 1435916 1445379 1454675 1463880 1473064 1481990 1490155 1497317 1503631 1508980
52184 1508980 1512578 1513822 1513254 1511955 1510109 1506839 1501550 1494663 1486818 1478025 1468038 1457197 1446437 1436681
52170 1436681 1428416 1421651 1415952 1410714 1405621 1400853 1396767 1393525 1391063 1389206 1387792 1386874 1386823 1387863 1389420
52155 1389420 1390410 1390339 1389767 1389346 1388877 1387766 1386162 1384946 1384588 1384533 1383923 1382555 1380948 1379707 1379072 1378936 1379071
52138A379071K48K81J34l25q22o19O57K294L095K850K745M003O497R083J1092
52123A420284J2892J5026J7351J9319K0644K1460K2039K2670K3523K4368K4633
52112A644209K4140K3500K3364K3473K2986K1673K0179J9105J8419J7970J7919
52101A876937J8255J8374J7653J6176J4439J2585J0411P953N525L141L79l041
52089A998787o778j0093j2345j3428j3869j4476j5525j6368j6177j5002j3682
52078A851044j2723j1802j0493q943p484n998m176k100r3J771L600N242O482P610
52064A811937R196J1248J3086J4281J5179J6201J7129J7532J7485J7333J7016
52053A977623J6140J4687J3070J1509R793P676N064J882j776n323q071j0104j2170
$$ plain form
52138 1379071 1379319 1379600 1379734 1379409 1378587 1377968 1378625 1380919 1384014 1386864 1389609 1393612 1400109 1409192 1420284
52123 1420284 1433176 1448202 1465553 1484872 1505516 1526976 1549015 1571685 1595208 1619576 1644209
52112 1644209 1668349 1691849 1715213 1738686 1761672 1783345 1803524 1822629 1841048 1859018 1876937
52101 1876937 1895192 1913566 1931219 1947395 1961834 1974419 1984830 1992783 1998308 2001449 2001828 1998787
52089 1998787 1992009 1981916 1969571 1956143 1942274 1927798 1912273 1895905 1879728 1864726 1851044
52078 1851044 1838321 1826519 1816026 1807083 1799599 1793601 1789425 1787325 1787232 1789003 1792603 1797845 1804327 1811937
52064 1811937 1821133 1832381 1845467 1859748 1874927 1891128 1908257 1925789 1943274 1960607 1977623
52053 1977623 1993763 2008450 2021520 2033029 2042822 2050498 2055562 2057444 2055668 2050345 2042274 2032170 2020000
52040B020000j4547j6627j7936j8878j9921k0693k0620k0011j9711j9829j9714
52029A811513j9128j8526j8060j7191j5649j4105j3346j3263j3221j3017j2943
52018A643064j3099j3172j2900j2291j1450j0557r996j0124j0752j1239j1246
52007A516238j1205j1836j3349j5349j7406j9421k1395k3085k4189k4779k5278
51996A308946k5925k6494k6663k6505k6341k6231k5892k5128k4195k3584k3521
51985A028467k3718k3561k2635k1179j9949j9489j9586j9598j9129j8202j6924
51974H04497j5447j4176j3589j3546j3197j1862r786p712n892l935j610O68K311
51961F96724L237L817M274M399L903K859J631M90n03j301j697j479p48O6N99J039
$$ plain form
52040 2020000 2005453 1988826 1970890 1952012 1932091 1911398 1890778 1870767 1851056 1831227 1811513
52029 1811513 1792385 1773859 1755799 1738608 1722959 1708854 1695508 1682245 1669024 1656007 1643064
52018 1643064 1629965 1616793 1603893 1591602 1580152 1569595 1559599 1549475 1538723 1527484 1516238
52007 1516238 1505033 1493197 1479848 1464499 1447093 1427672 1406277 1383192 1359003 1334224 1308946
51996 1308946 1283021 1256527 1229864 1203359 1177018 1150787 1124895 1099767 1075572 1051988 1028467
51985 1028467 1004749 981188 958553 937374 917425 897936 878350 858752 839623 821421 804497
51974 804497 789050 774874 761285 747739 734542 722680 712894 705182 699290 695355 693745 694413 696724
51961 696724 699961 703778 708052 712451 716354 719213 720844 721334 720831 719530 717833 716354 715606 715672 716271 717310
51945G17310K102M283P114R489J0947J2242J4240J6505J7594J6750J4615J2170
51933H55361R646O809L755Q48j744m082o291q706j1720j5019j7459j8342j8421
51920G74635j8915j9863k0274j9707j8752j7925j7043j5854j4495j3005j1099
51909E87703q813o740n253l971k389n83J047K278K955K860K094J235P06K35p03
51894E72661k213l995n745p214q138q464q435q266p928p389o719n777m248k255
51880D85875m95O28J599L089M990O613P546P898P931P918Q132Q513Q442P285N097
51865E71061K565L73j202k237l051l908m591m573l830l064k760k521j795q33k48
51850E39386J5M32Q03K96j337l295m686n359n613n654n613n633n663n412m763
$$ plain form
51945 717310 719412 723695 730809 740298 751245 763487 777727 794232 811826 828576 843191 855361
51933 855361 865007 871816 875571 876419 874675 870593 864302 855596 843876 828857 811398 793056 774635
51920 774635 755720 735857 715583 695876 677124 659199 642156 626302 611807 598802 587703
51909 587703 578890 572150 566897 562926 560537 559954 561001 563279 566234 569094 571188 572423 573129 573364 572661
51894 572661 570448 566453 560708 553494 545356 536892 528457 520191 512263 504874 498155 492378 488130 485875
51880 485875 485380 486008 487607 490696 495686 502299 509845 517743 525674 533592 541724 550237 558679 565964 571061
51865 571061 573626 573999 572797 570560 567509 563601 559010 554437 550607 547543 544783 542262 540467 539634 539386
51850 539386 539401 539833 540636 540932 539595 536300 531614 526255 520642 514988 509375 503742 498079 492667 487904
51835D87904l967l254k563j756r13j67N27J300K136K795K909K223Q78n95j706
51820D85751k331k522k203j383l95M04R82J354J247O02J43O31J600J673L36j310
51804D84579k002j745j307r50m26J66L63J09j72k87m52o61m96J30O00L98j29k90
51786D77428j05j92o80r11m38K19K78k54p64r50r94r25m89K56Q54J162J636K574
51768D77705L595M258M755N486O321O755O622O076N068L382J179r50k542l579
51754E24131m264m792n344n963o453o558o275n800n293m861m538m124l234j873
51740D54759o41K8N35J551L033M321N069N487N816O120O525P043P143O192M392
51725E17373K701J738J404J611K616M215N352N042L411J380l38j614k591l376
$$ plain form
51835 487904 483937 480683 478120 476364 475451 475284 475811 477111 479247 482042 484951 487174 488052 487457 485751
51820 485751 483420 480898 478695 477312 476917 477321 478303 479657 480904 481506 481649 482280 483880 485553 485889 484579
51804 484579 482577 480832 479525 478575 478149 478315 478678 478787 478615 478328 477876 477215 476719 476849 477449 477847 477718 477428
51786 477428 477323 477131 476451 475540 475102 475321 475599 475345 474581 473631 472637 471712 471223 471479 472333 473495 475131 477705
51768 477705 481300 485558 490313 495799 502120 508875 515497 521573 526641 530023 531202 530252 527710 524131
51754 524131 519867 515075 509731 503768 497315 490757 484482 478682 473389 468528 463990 459866 456632 454759
51740 454759 454118 454146 454681 456232 459265 463586 468655 474142 479958 486078 492603 499646 506789 512981 517373
51725 517373 520074 521812 523216 524827 527443 531658 537010 542052 545463 546843 546505 544891 542300 538924
51711E38924l880l845l197k451k402l224m262m819m737m052k679q66N69R39M31
51696E00449k42p23j107j418j471j244r76q24p11n10l06m14j104k231l189l444
51680D80535l080k587k153j548o99J32Q61J711K597K953K563K103K340L154L850
51665D92732M236M828O126Q044J0005J1274J1271R934P716N122K366l88k801m592
51651E65873n747o194n691m317k741j565p49j70k78j557l570n273o197o623o689
51636E08512o161n276m950n688o736o919n967m722m077m140m326m063l329k543
51622D39615k024j699j401j274j519j929k025j725j483j670k106k371k320k100
51608D13969j827j464r50l95p1j88n89p33j47J054K304L195L823M562N571O570
$$ plain form
51711 538924 535044 531199 528002 525551 523149 519925 515663 510844 506107 502055 499376 498510 499079 500018 500449
51696 500449 500207 499484 498377 496959 495488 494244 493268 492444 491733 491223 490917 490503 489399 487168 483979 480535
51680 480535 477455 474868 472715 471167 470468 470600 471461 473172 475769 478722 481285 483388 485728 488882 492732
51665 492732 496968 501796 507922 515966 525971 537245 548516 558450 566166 571288 573654 573266 570465 565873
51651 565873 560126 553932 548241 543924 541183 539618 538869 538699 538421 536864 533294 528021 521824 515201 508512
51636 508512 502351 497075 492125 486437 479701 472782 466815 462093 458016 453876 449550 445487 442158 439615
51622 439615 437591 435892 434491 433217 431698 429769 427744 426019 424536 422866 420760 418389 416069 413969
51608 413969 412142 410678 409728 409333 409262 409074 408485 407752 407605 408659 410963 414158 417981 422543 428114 434684
51592D34684P095P044O953P454Q320Q465P121M741K380N17r82k041k257j654q02
51577D87038J2J130K789M617O282Q104J0492J3029J4739J5233J5182J5642J7126
51564F11415J9358K1608K3182K3784K3579K3018K2601K2694K3342K4233K4929
51553H63743K5090K4302K1854J7213J0797L930k284p702j2626j6958k0305k2677
51541H84377k4545k6177k7282k7424k6572k5176k3804k2677k1487j9779j7607
51530F21847j5633j4351j3488j2483j1299j0317r500q315o609n118m674n231n953
51517D98876o117n645m870m097l406k761k210k041k534l511m251m099l126k027
51503D48181j350j069q21m26l8J14Kj33K6N30J032J122Q18O06Q75J452J841J839
$$ plain form
51592 434684 441779 448823 455776 463230 471550 480015 487136 491877 494257 494774 493792 491751 489494 487840 487038
51577 487038 487050 488180 490969 495586 501868 509972 520464 533493 548232 563465 578647 594289 611415
51564 611415 630773 652381 675563 699347 722926 745944 768545 791239 814581 838814 863743
51553 863743 888833 913135 934989 952202 962999 966929 964645 956943 944317 927359 907054 884377
51541 884377 859832 833655 806373 778949 752377 727201 703397 680720 659233 639454 621847
51530 621847 606214 591863 578375 565892 554593 544276 534776 526461 519852 514734 510060 504829 498876
51517 498876 492759 487114 482244 478147 474741 471980 469770 467729 465195 461684 457433 453334 450208 448181
51503 448181 446831 445762 444941 444515 444477 444591 444593 444460 444486 445016 446048 447170 447988 448594 449469 450921 452762 454601
51485D54601J644J427J054M02k65n37m11l37o49j164j512j721k204l178m304n000
51469D37846n032m633m163l773l426l152l108l354l649l526k707j391j58M99N59
51454C96832M08M59Q45J407J915K258K545L002L769M724N569O105O427O863P729
51439D50857R056J0474J1371J1301J0245Q449O026K994j95k486k954j885p94j185
51425E11274l240n794p471p789p245o585o130n749n275m781m422m115l516k403
51411D36759j069j77j00m16l03N09J348J425Q28M24Q27J838K928L813M353M386
51395D57373M030L917M614N872O922P469P993R034J0610J2450J4436J6598J8866
51382E80184K1153K3565K6320K9407L2407L4722L6045L6663L7210L7997L8618
$$ plain form
51485 454601 456245 457672 458726 459128 458863 458326 457915 457578 456929 455765 454253 452532 450328 447150 442846 437846
51469 437846 432814 428181 424018 420245 416819 413667 410559 407205 403556 400030 397323 395932 395774 396273 396832
51454 396832 397240 397699 398544 399951 401866 404124 406669 409671 413440 418164 423733 429838 436265 443128 450857
51439 450857 459913 470387 481758 493059 503304 511753 517779 520773 520578 518092 515138 513253 512459 511274
51425 511274 508034 502240 494769 486980 479735 473150 467020 461271 455996 451215 446793 442678 439162 436759
51411 436759 435690 435513 435413 434997 434694 435203 436551 437976 438804 439228 440055 441893 444821 448634 452987 457373
51395 457373 461403 465320 469934 475806 482728 490197 498190 507224 517834 530284 544720 561318 580184
51382 580184 601337 624902 651222 680629 713036 747758 783803 820466 857676 895673 934291
51371I34291L8228L6058L1563K4465J5120M717n310j4146k1694k8047l3241l7442
51359I44562m0707m2623m2694m1220l9189l7130l4746l1871k9088k6843k4603
51348E53848k1610j8112j5092j2968j1216r297p345n876n161n002m853m220l168
51335D29928k338k186k420k468k199j819j369q89q09j523k653l367l390l047k505
51320C96946j684j022j257k175k443j277L68J015M98j43j89J25M13P38J260J829
51304C93002K198K278J996J231P8r41j219o51J58L78k60j184j626j466j179j012
51288C91781o73M8Q07J248J588K140K583K391J838J887K962M421N420N754N598
51273D29793M977L964L010K516K247J644O83q4k97j91m6L53J334K605L239K536
$$ plain form
51371 934291 972519 1008577 1040140 1064605 1079725 1084442 1079132 1064986 1043292 1015245 982004 944562
51359 944562 903855 861232 818538 777318 738129 700999 666253 634382 605294 578451 553848
51348 553848 532238 514126 499034 486066 474850 465553 458208 452332 447171 442169 437316 433096 429928
51335 429928 427590 425404 422984 420516 418317 416498 415129 414240 413431 411908 409255 405888 402498 399451 396946
51320 396946 395262 394240 392983 390808 388365 387088 387456 388471 388969 388826 388637 388762 389175 389913 391173 393002
51304 393002 395200 397478 399474 400705 400783 399842 398623 397972 398130 398508 398248 397064 395438 393972 392793 391781
51288 391781 391108 391156 391963 393211 394799 396939 399522 401913 403751 405638 408600 413021 418441 424195 429793
51273 429793 434770 438734 441744 444260 446507 448151 448834 448750 448453 448262 448216 448569 449903 452508 455747 458283
51257D58283P61j055k071k315k429k807l151l019k577k501l089l842m050l605
51243D22533k925k327j782j287r78q53o34j80K04J30l05n78l17L09P73N97l32
51226D12048j613k471k303j213R7R41J109P47P2o24r68p71k70J37M13Q66J632
51209D07829K349K598K418K176K024J849J755K179L222M165M126L142K194K044
51195D44070K455K694K440J831R30k66j380j769j296n86k57k15j3K99J38p13j648
51178D46714j843j225n07l39n97o18p4O28P95K29o07j139j254j252j352j470j374
51161D34715r30j07J047K258K986K776J666J66j154j936j975j259j56P50J162
51146D40009J268J248R06N9r36j508j591j582j626j371n79M80J324J656J379N83
$$ plain form
51257 458283 459044 457989 455918 453603 451174 448367 445216 442197 439620 437119 434030 430188 426138 422533
51243 422533 419608 417281 415499 414212 413234 412381 411747 411567 411771 411901 411596 411018 410701 411010 411783 412380 412048
51226 412048 410435 407964 405661 404448 404545 405486 406595 407342 407414 406790 405822 405051 404781 404918 405331 406197 407829
51209 407829 410178 412776 415194 417370 419394 421243 422998 425177 428399 432564 436690 439832 442026 444070
51195 444070 446525 449219 451659 453490 454420 454154 452774 451005 449709 449123 448866 448651 448638 448937 449075 448362 446714
51178 446714 444871 443646 443139 442800 442203 441585 441511 442139 442934 443163 442556 441417 440163 438911 437559 436089 434715
51161 434715 433785 433678 434725 436983 439969 442745 444411 444577 443423 441487 439512 438253 438097 438847 440009
51146 440009 441277 442525 443431 443490 442554 441046 439455 437873 436247 434876 434297 434777 436101 437757 439136 439719
51130D39719k92o64m12N0L99P62J231J506J406J319J668K213K394K190K075K223
51114D57787K286J957J361P92M07K51K66L18M04P72J585K557L227L403L139K468
51098D82980J587J056J269J776J779J154M54m3n25q87o45J68P37N73J64J03K79
51081D91979M07P23J358J650R73p1l04L66R00Q05Q17J594K616L042L022L426M542
51064E17845N833O898P952R205J0384J1282J2397J4409J7127J9417K0354J9992
51052F73095J8795J6824J3948J0641P893O306N734N759N982N792M581K553P19
51039G78622l58j362l217n763p970r119r106p957n960m233m172o004q525j0447
51025F94429j1388j1375j0277q285o306n082m253k918r28J069K712M349O334Q453
$$ plain form
51130 439719 439427 438763 438351 438401 438800 439562 440793 442299 443705 445024 446692 448905 451299 453489 455564 457787
51114 457787 460073 462030 463391 464183 464590 464841 465107 465425 465829 466601 468186 470743 473970 477373 480512 482980
51098 482980 484567 485623 486892 488668 490447 491601 492055 492012 491487 490600 489955 490123 490860 491433 491597 491700 491979
51081 491979 492386 493109 494467 496117 497090 497019 496715 497081 497981 498786 499603 501197 503813 506855 509877 513303 517845
51064 517845 523678 530576 538528 547733 558117 569399 581796 596205 613332 632749 653103 673095
51052 673095 691890 708714 722662 733303 741196 747502 753236 758995 764977 770769 775350 777903 778622
51039 778622 778264 776902 773685 767922 759952 750833 741727 733770 727810 723577 719405 713401 704876 694429
51025 694429 683041 671666 661389 653104 646798 641716 637463 634545 633617 634686 637398 641747 648081 656534
51011F56534J0193J1212J1399J0836R815Q617P259N702M263L386K994K508J592
50998G46310M29q65k443m115n154n137m475l593k200QK307L676M246N114O641
50983G40749Q028Q776R551J1077J3043J4821J6576J8889K1666K4209K6099K7359
50971I40843K8103K8668K9857L2167L5002L7435L9673M2787M6990N1192N4599
50960A367316N7757O1420O5199O8077O9762P0707P1114P0712O9373O7247O4316
50949B103000O0434N5883N1300M6880M2201L7094L2263K8596K6128K4152K2300
50938B530231K0911K0227J9599J7969J5003J1320P551L567j086o355j1693j6781
50926B610463k1914k7570l3891m0576m7151n3263n8874o4049o8534p1746p3406
$$ plain form
51011 656534 666727 677939 689338 700174 709989 718606 725865 731567 735830 739216 742210 744718 746310
50998 746310 746739 745874 743431 739316 734162 729025 724550 720957 718757 718765 721072 724748 728994 734108 740749
50983 740749 748777 757553 767104 778181 791224 806045 822621 841510 863176 887385 913484 940843
50971 940843 968946 997614 1027471 1059638 1094640 1132075 1171748 1214535 1261525 1312717 1367316
50960 1367316 1425073 1486493 1551692 1619769 1689531 1760238 1831352 1902064 1971437 2038684 2103000
50949 2103000 2163434 2219317 2270617 2317497 2359698 2396792 2429055 2457651 2483779 2507931 2530231
50938 2530231 2551142 2571369 2590968 2608937 2623940 2635260 2642811 2646378 2645292 2638937 2627244 2610463
50926 2610463 2588549 2560979 2527088 2486512 2439361 2386098 2327224 2263175 2194641 2122895 2049489
50915B049489p3905p3701p2690p0625o7827o4783o1274n6769n1654m7148m3702
50904A365411m0494l6835l3184l0127k7322k4292k1565j9877j8758j7036j4545
50893A081376j2231j0550q953p103n527m627l933k903j831j272j158r59m19M07
50879A020317J517K851M066M917N665O715Q000R174J0206J1303J2441J3461J4560
50866A125193J6064J7722J8918J9726K1079K3562K6634K9489L2257L5722M0207
50855A406573M5396N1136N7553O4433P1231P7904Q5121R3244J01779J10199J18680
50844B283249J27409J35669J42458J47767J52366J56366J58873J59103J57021
50835C620281J52627J45512J35651J23995J11594R8561Q4630P0387N7171M5733
$$ plain form
50915 2049489 1975584 1901883 1829193 1758568 1690741 1625958 1564684 1507915 1456261 1409113 1365411
50904 1365411 1324917 1288082 1254898 1224771 1197449 1173157 1151592 1131715 1112957 1095921 1081376
50893 1081376 1069145 1058595 1049642 1042539 1037012 1032385 1028452 1025549 1023718 1022446 1021288 1020329 1019910 1020317
50879 1020317 1021834 1024685 1028751 1033668 1039333 1046048 1054048 1063222 1073428 1084731 1097172 1110633 1125193
50866 1125193 1141257 1158979 1177897 1197623 1218702 1242264 1268898 1298387 1330644 1366366 1406573
50855 1406573 1451969 1503105 1560658 1625091 1696322 1774226 1859347 1952591 2054370 2164569 2283249
50844 2283249 2410658 2546327 2688785 2836552 2988918 3145284 3304157 3463260 3620281
50835 3620281 3772908 3918420 4054071 4178066 4289660 4388221 4472851 4543238 4600409 4646142
50825D646142L5703K6612J8923J3644J1243J1238J2787J5299J8308K0972K2001
50814D852872K0199J4891N829o956k2911m0760n9143p7414r5511j13133j29535
50803D348428j44119j56637j66688j73608j77084j77361j74591j68659j59984
50794B849697j49837j39267j28165j16053j03364r1214q0155o9879o0072n0845
50784A860846m2350l4585k7739k2190j8050j4965j2510j0481q887p899p730q275
50772A645185r012r550j0091j1003j2140j3058j3787j4782j6208j7698j8847j9575
50760A479434j9998k0306k0620k0630j9677j7653j5590j4580j4311j3447j1395
50749A291227q896o649m301j168K747O939J1107J5174J8982K2419K5627K8769
$$ plain form
50825 4646142 4681845 4708457 4727380 4741024 4752267 4763505 4776292 4791591 4809899 4830871 4852872
50814 4852872 4873071 4887962 4893791 4886835 4863924 4823164 4764021 4686607 4591096 4477963 4348428
50803 4348428 4204309 4047672 3880984 3707376 3530292 3352931 3178340 3009681 2849697
50794 2849697 2699860 2560593 2432428 2316375 2213011 2121797 2041642 1971763 1911691 1860846
50784 1860846 1818496 1783911 1756172 1733982 1715932 1700967 1688457 1677976 1669089 1661190 1653460 1645185
50772 1645185 1636173 1626623 1616532 1605529 1593389 1580331 1566544 1551762 1535554 1517856 1499009 1479434
50760 1479434 1459436 1439130 1418510 1397880 1378203 1360550 1344960 1330380 1316069 1302622 1291227
50749 1291227 1282331 1275682 1271381 1270213 1272960 1279899 1291006 1306180 1325162 1347581 1373208 1401977
50737A401977L1842L4966L8596M3133M8484N4113N9332O3572O6788O9639P2877
50726A985319P6386P9193Q0595Q0802Q0329P9306P7642P5338P2226O7741O1471
50715B816348N3683M4999L5735K5914J5764N928k696r226j3120j4410j3501j0712
50703B934706o428j627K354M965O854Q740J0204R946P014J277o953j7300k9362
50690B924390m2587n6107o8632p8918q6540r1904r5290r6352r4834r1243q6276
50679B035707q0049p2571o4604n7186n0349m3097l4829k6163j8156j1175m895
50668A572633J020O570J1550J5717J8805K0584K1025K0418J9371J8495J7971J7489
50656A761648J6736J5833J5220J5125J5363J5594J5699J5938J6690J8031J9531
$$ plain form
50737 1401977 1433819 1468785 1507381 1550514 1598998 1653111 1712443 1776015 1842803 1912442 1985319
50726 1985319 2061705 2140898 2221493 2302295 2382624 2461930 2539572 2614910 2687136 2754877 2816348
50715 2816348 2870031 2915030 2950765 2976679 2992443 2998371 2995675 2986449 2973329 2958919 2945418 2934706
50703 2934706 2928278 2926651 2929005 2933970 2940824 2949564 2959768 2969714 2976728 2978005 2971052 2953752 2924390
50690 2924390 2881803 2825696 2757064 2678146 2591606 2499702 2404412 2308060 2213226 2121983 2035707
50679 2035707 1955658 1883087 1818483 1761297 1710948 1667851 1633022 1606859 1588703 1577528 1572633
50668 1572633 1573653 1580223 1591773 1607490 1626295 1646879 1667904 1688322 1707693 1726188 1744159 1761648
50656 1761648 1778384 1794217 1809437 1824562 1839925 1855519 1871218 1887156 1903846 1921877 1941408
50645A941408K0670K1437K2344K3808K5788K8050L0519L3178L5907L8611M1259
50634B262979M3666M5404M6140M5851M4652M2656M0117L7417L4738L1982K9066
50623B704668K5891K1876J6014P831j964j1922k0647k7006l0295l0712k9390k7432
50611B596912k5128k2323j9116j5759j2300q912o212m770m618n738q624j3595
50599B449817j9910k6432l2963m0073m7602n4293n9167o2469o4980o6952o8102
50588A906874o8103o6793o4284o1108n7925n4893n1621m7838m3750l9605l5376
50577A315578l1078k7046k3523k0324j7105j3800j0545p445m555j944M49K845
50565A161507N407Q048J0522J2620J4213J5301J6037J6645J7367J8530K0375K2564
$$ plain form
50645 1941408 1962078 1983515 2005859 2029667 2055455 2083505 2114024 2147202 2183109 2221720 2262979
50634 2262979 2306645 2352049 2398189 2444040 2488692 2531348 2571465 2608882 2643620 2675602 2704668
50623 2704668 2730559 2752435 2768449 2776280 2774316 2762394 2741747 2714741 2684446 2653734 2624344 2596912
50611 2596912 2571784 2549461 2530345 2514586 2502286 2493374 2487162 2482392 2477774 2472036 2463412 2449817
50599 2449817 2429907 2403475 2370512 2330439 2282837 2228544 2169377 2106908 2041928 1974976 1906874
50588 1906874 1838771 1771978 1707694 1646586 1588661 1533768 1482147 1434309 1390559 1350954 1315578
50577 1315578 1284500 1257454 1233931 1213607 1196502 1182702 1172157 1164712 1160157 1158213 1158662 1161507
50565 1161507 1166914 1174962 1185484 1198104 1212317 1227618 1243655 1260300 1277667 1296197 1316572 1339136
50553A339136K4188K4724K4880K5925K8195L0741L2562L3609L4387L5036L5227
50542A668610L4817L4278L4410L5633L7624L9769M2053M5071M9067N3400N7504
50531B132236O1792O6928P2521P7506Q1688Q5928R0741R5706J00448J05189J09842
50520C080525J13504J15441J15861J15030J12351J07055R9281Q9664P8289O4917
50510D091918M9968L4376J8560K255j4498l0901m6003n9288p0479p9191q4958
50499C811759q7503q6902q3566p7924p0044n9805m7645l4797k2482j1132q18P953
50487C237094J4325J7712J7750J3817N328p375k2887l9568n6141p1598q5039r5839
50475B927579j03746j08826j11580j12850j13127j11957j08676j03646r8036r2325
$$ plain form
50553 1339136 1363324 1388048 1412928 1438853 1467048 1497789 1530351 1563960 1598347 1633383 1668610
50542 1668610 1703427 1737705 1772115 1807748 1845372 1885141 1927194 1972265 2021332 2074732 2132236
50531 2132236 2194028 2260956 2333477 2410983 2492671 2578599 2669340 2765046 2865494 2970683 3080525
50520 3080525 3194029 3309470 3425331 3540361 3652712 3759767 3859048 3948712 4027001 4091918
50510 4091918 4141886 4176262 4194822 4197077 4182579 4151678 4105675 4046387 3975908 3896717 3811759
50499 3811759 3724256 3637354 3553788 3475864 3405820 3346015 3298370 3263573 3241091 3229959 3229141 3237094
50487 3237094 3251419 3269131 3286881 3300698 3306026 3298651 3275764 3236196 3180055 3108457 3023418 2927579
50475 2927579 2823833 2715007 2603427 2490577 2377450 2265493 2156817 2053171 1955135 1862810
50465A862810q5832p8133p0162o3180n7223n1275m4809l8331l2484k7318k2625
50454A291438j8318j4196r789m982n19K662M557O177Q354J0882J3111J5041J7301
50441A321719J9989K2136K2647K1492J9517J7238J4448J1069P833N567M202L006
50429A490863J759J023J171J722K104K648M171O730R462J1696J3628J5633J7588
50416A580198J9355K1488K4694K8752L2671L5993L9350M3564M8615N3661N7753
50405A986094O0320O1391O1535O1301O0521N8477N4926N0501M5845M0726L4431
50394B576068K6751J8061Q756r97j1016k1129l1267m1128m9776n6153o0006o1887
50382B296277o2230o0913n7833n3416m8223m2372l5698k8321k0702j3319o512
$$ plain form
50465 1862810 1776978 1698845 1628683 1565503 1508280 1457005 1412196 1373865 1341381 1314063 1291438
50454 1291438 1273120 1258924 1249135 1244153 1243634 1246296 1250853 1257030 1265384 1276266 1289377 1304418 1321719
50441 1321719 1341708 1363844 1386491 1407983 1427500 1444738 1459186 1470255 1478088 1483655 1487857 1490863
50429 1490863 1492622 1493645 1494816 1496538 1498642 1501290 1505461 1512191 1521653 1533349 1546977 1562610 1580198
50416 1580198 1599553 1621041 1645735 1674487 1707158 1743151 1782501 1826065 1874680 1928341 1986094
50405 1986094 2046414 2107805 2169340 2230641 2291162 2349639 2404565 2455066 2500911 2541637 2576068
50394 2576068 2602819 2620880 2629636 2628639 2617623 2596494 2565227 2524099 2474323 2418170 2358164 2296277
50382 2296277 2234047 2173134 2115301 2061885 2013662 1971290 1935592 1907271 1886569 1873250 1866738
50371A866738o17L958O812P625O257K883k051q081j4832k1819k8299l3588l7503
50358A747483m0309m2238m3225m3174m2269m0861l9211l7562l6413l6326l7267
50347A308628l8390l8699l7903l6322l4166l1287k7719k3993k0634j7657j4779
50336I87079j1892r013o088l247j099j38J10Q23K525M419N390N321N109N512O439
50321I91250P313P884Q411R256J0388J1340J1711J1676J1914J2883J4301J5450
50309A123777J5976J6224J6753J7790J9210K0834K2465K3788K4615K5328K6735
50298A353495K9188L2062L4416L5990L7032L7100L4561K7867J7328N284n537j3752
50286A625034j9536k3526k5905k6598k5936k4608k2892k0385j6792j2681q912
$$ plain form
50371 1866738 1866121 1870079 1876891 1884516 1890773 1893656 1891605 1883524 1868692 1846873 1818574 1784986 1747483
50358 1747483 1707174 1664936 1621711 1578537 1536268 1495407 1456196 1418634 1382221 1345895 1308628
50347 1308628 1270238 1231539 1193636 1157314 1123148 1091861 1064142 1040149 1019515 1001858 987079
50336 987079 975187 966174 960086 956839 955740 955602 955712 956535 959060 963479 968869 974190 979299 984811 991250
50321 991250 998563 1006447 1014858 1024114 1034502 1045842 1057553 1069229 1081143 1094026 1108327 1123777
50309 1123777 1139753 1155977 1172730 1190520 1209730 1230564 1253029 1276817 1301432 1326760 1353495
50298 1353495 1382683 1414745 1449161 1485151 1522183 1559283 1593844 1621711 1639039 1644323 1638786 1625034
50286 1625034 1605498 1581972 1556067 1529469 1503533 1478925 1456033 1435648 1418856 1406175 1397263
50275A397263n540j952J966N504Q254J0788J3689J6601J8922K0967K3528K6488
50263A536478K8874L0308L1493L2956L4176L4417L3763L2745L1469K9752K7769
50252A884200K5851K3827K1300J8476J5939J3503R994M664j669p433j2086j6537
50240A980029k1724k7251l1693l4036l4431l3634l2071k9808k7225k5170k4257
50229A658729k4297k4683k5168k5867k6627k6919k6586k6187k6300k6647k6415
50218A373033k5288k3843k2830k2457k2424k2261k1457j9674j7274j5307j4603
50207A145615j4845j4974j4407j3396j2244j0853r354q545q998r973r916q233
50195A009877o026m857n023n421m939l642k528k330k732k844k284j594j465j809
$$ plain form
50275 1397263 1391723 1389771 1391737 1397241 1405495 1416283 1429972 1446573 1465495 1486462 1509990 1536478
50263 1536478 1565352 1595660 1627153 1660109 1694285 1728702 1762465 1795210 1826679 1856431 1884200
50252 1884200 1910051 1933878 1955178 1973654 1989593 2003096 2013090 2017754 2016085 2008652 1996566 1980029
50240 1980029 1958305 1931054 1899361 1865325 1830894 1797260 1765189 1735381 1708156 1682986 1658729
50229 1658729 1634432 1609749 1584581 1558714 1532087 1505168 1478582 1452395 1426095 1399448 1373033
50218 1373033 1347745 1323902 1301072 1278615 1256191 1233930 1212473 1192799 1175525 1160218 1145615
50207 1145615 1130770 1115796 1101389 1087993 1075749 1064896 1055542 1046997 1037999 1028026 1018110 1009877
50195 1009877 1003851 998994 993971 988550 983611 979969 977441 975111 972379 969535 967251 965657 964192 962383
50181I62383j865j208k95J31r7n19p62r11j138j252r01j25O17J062J467K114K776
50164I61477L078L320M303O254Q368R876J1089J2840J5196J7404J9182K1297K4577
50151A118261K8872L3496L8197M3150M8220N2797N6497N9530O2304O4921O7172
50140A673417O8691O9042O7923O5543O2551N9464N6323N3083M9919M6752M2679
50129B315387L6443K7569J6682M673p949k0670l2566m2813n1428n8900o5154o9392
50117B051882p1088p0682o9051o6637o3379n9228n4448m9578m5265m1927l9324
50106A421275l6548l2836k8363k4058k0667j8268j6577j5375j4511j3765j3015
50095A187292j2374j2069j2129j2278j2121j1346r897q025o198m856m191m036
$$ plain form
50181 962383 960518 959310 959015 959146 959049 958530 957768 956857 955719 954467 953566 953441 954058 955120 956587 958701 961477
50164 961477 964555 967875 972178 978432 986800 996676 1007765 1020605 1035801 1053205 1072387 1093684 1118261
50151 1118261 1147133 1180629 1218826 1261976 1310196 1362993 1419490 1479020 1541324 1606245 1673417
50140 1673417 1742108 1811150 1879073 1944616 2007167 2066631 2122954 2176037 2225956 2272708 2315387
50129 2315387 2351830 2379399 2396081 2400754 2392805 2372135 2339569 2296756 2245328 2186428 2121274 2051882
50117 2051882 1980794 1910112 1841061 1774424 1711045 1651817 1597369 1547791 1502526 1460599 1421275
50106 1421275 1384727 1351891 1323528 1299470 1278803 1260535 1243958 1228583 1214072 1200307 1187292
50095 1187292 1174918 1162849 1150720 1138442 1126321 1114975 1105078 1097053 1090855 1085999 1081808 1077772
50083A077772l883l112j424Q71L058M657N808O981Q304R413J0004J0366J1080
50070A139895J2177J2898J2510J1227R988R372R008Q224O845N196L535J952O14
50057A243441k56q36j667l011m438n315n513n334m876l860k248n83N48J274K285
50042A209611L972O088Q310J0779J3763J7016J9853K1802K3040K4225K6120K9148
50030A413727L2975L6598L9197M0939M2653M4778M6978M8687M9538M9196M7351
50019A892617M4240M0714L7431L4201L0410K5890K0951J5785J0172L749l564j1372
50007B141224j8978k6015l2935m0550m8809n6386o1769o4427o4707o3057n9811
49996A603780n5492n0731m5922m1331l7300l4034l1322k8793k6317k3863k1361
$$ plain form
50083 1077772 1073889 1070777 1069353 1070224 1073282 1077939 1083747 1090728 1099032 1108445 1118449 1128815 1139895
50070 1139895 1152072 1164970 1177480 1188707 1198695 1208067 1217075 1225299 1232144 1237340 1240875 1242827 1243441
50057 1243441 1243185 1242349 1240682 1237671 1233233 1227918 1222405 1217071 1212195 1208335 1206087 1205504 1206052 1207326 1209611
50042 1209611 1213583 1219671 1227981 1238760 1252523 1269539 1289392 1311194 1334234 1358459 1384579 1413727
50030 1413727 1446702 1483300 1522497 1563436 1606089 1650867 1697845 1746532 1796070 1845266 1892617
50019 1892617 1936857 1977571 2015002 2049203 2079613 2105503 2126454 2142239 2152411 2156160 2152596 2141224
50007 2141224 2122246 2096231 2063296 2022746 1973937 1917551 1855782 1791355 1726648 1663591 1603780
49996 1603780 1548288 1497557 1451635 1410304 1373004 1338970 1307648 1278855 1252538 1228675 1207314
49985A207314j9060j7657j7491j7994j8453j8957j9796k0342j9534j7488j5571
49974A004971j4686j4325j3606j2387j1056r913r198r039q979q126o352m701m152
49961H78451m420m522m129l668l410l095k430j449m02M80J181K026L414N232O798
49946H70057P505P232N988L757J009j195k177k359k569l023l539m304n622p114
49932H63646q023q303q679r515j0291j0444j0099r718r428r143q838q449p655
$$ plain form
49985 1207314 1188254 1170597 1153106 1135112 1116659 1097702 1077906 1057564 1038030 1020542 1004971
49974 1004971 990285 975960 962354 949967 938911 928998 919800 910761 901782 893656 887304 882603 878451
49961 878451 874031 869509 865380 861712 858302 855207 852777 851328 850926 851406 852587 854613 858027 863259 870057
49946 870057 877562 884794 890782 894539 895548 894353 892176 889817 887248 884225 880686 876382 870760 863646
49932 863646 855623 847320 838641 829126 818835 808391 798292 788574 779146 770003 761165 752716 745061
$$ [...]
##END NTUPLES=NMR SPECTRUM
##END=
