##TITLE=AC1705_ROEFFECT0028_8638437_zhXyscSLqr
##JCAMPDX= 6.0         $$ Bruker NMR JCAMP-DX V2.0
##DATA TYPE= NMR SPECTRUM
##DATA CLASS= NTUPLES
##ORIGIN= BRUKER
##OWNER= Administrator
$$ 1.72 TOPSPIN		Version 2.1
$$ 2014-05-22 21:46:52.690 -0700  Administrator@X
$$ Compression mode = diff/dup
##.OBSERVE FREQUENCY= 400.02188249412
##.OBSERVE NUCLEUS= ^1H
##.ACQUISITION MODE= SIMULTANEOUS (DQD)
##.ACQUISITION SCHEME= undefined
##.AVERAGES= 8
##.DIGITISER RES= 22
##SPECTROMETER/DATA SYSTEM= spect
##.PULSE SEQUENCE= zg30
##.SOLVENT NAME= COFFEE_meoh
##.SHIFT REFERENCE= INTERNAL, COFFEE_meoh, 1, 14.98509
##AUDIT TRAIL= $$ (NUMBER, WHEN, WHO, WHERE, PROCESS, VERSION, WHAT)
$$ ##TITLE= Audit trail, TOPSPIN		Version 2.1
$$ ##JCAMPDX= 5.01
$$ ##ORIGIN= Bruker BioSpin GmbH
$$ ##OWNER= Administrator
$$ $$ E:\/data/COFFEE/nmr/AC1705_ROEFFECT0028_8638437_zhXyscSLqr/10/pdata/1/auditp.txt
$$ ##AUDIT TRAIL=  $$ (NUMBER, WHEN, WHO, WHERE, PROCESS, VERSION, WHAT)
(   1,<2014-05-22 21:46:46.174 -0700>,<Administrator>,<X>,<go>,<TOPSPIN 2.1>,
      <created by zg
	started at 2014-05-22 21:45:40.471 -0700,
	POWCHK enabled, PULCHK disabled,
       configuration hash MD5:
       C8 4E 4E 5D D3 5C D8 9E 9F 52 82 E0 59 8A DE 15
       data hash MD5: 64K
       46 37 E8 FA DB 87 19 7C 15 FA A3 99 EE B3 7E C9>)
(   2,<2014-05-22 21:46:49.033 -0700>,<Administrator>,<X>,<proc1d>,<TOPSPIN 2.1>,
      <Start of raw data processing
       efp LB = 0 FT_mod = 6 PKNL = 1 PHC0 = 0 PHC1 = 0 SI = 32K 
       data hash MD5: 32K
       46 98 52 9F 2B 8A 8E EF 07 BC 4B 90 5B AF 88 3A>)
(   3,<2014-05-22 21:46:49.315 -0700>,<Administrator>,<X>,<proc1d>,<TOPSPIN 2.1>,
      <pk PHC0 = 92.54883 PHC1 = 0 
       data hash MD5: 32K
       0E A6 10 A1 BB C0 CC 90 79 0C AA E6 79 31 06 56>)
(   4,<2014-05-22 21:46:49.393 -0700>,<Administrator>,<X>,<proc1d>,<TOPSPIN 2.1>,
      <abs ABSG = 1 
       data hash MD5: 32K
       ED 15 81 C8 1E 93 21 0B 7C 81 B6 A0 4D 26 52 53>)
(   5,<2014-05-22 21:46:49.471 -0700>,<Administrator>,<X>,<proc1d>,<TOPSPIN 2.1>,
      <abs ABSG = 2 
       data hash MD5: 32K
       D0 91 14 9B 25 D8 57 90 57 0E 3A 4F CD DC DF 83>)
(   6,<2014-05-22 21:46:49.533 -0700>,<Administrator>,<X>,<proc1d>,<TOPSPIN 2.1>,
      <abs ABSG = 3 
       data hash MD5: 32K
       FB 4F D1 B5 28 E7 95 E8 BB 05 5D CF 8E 41 C0 BC>)
(   7,<2014-05-22 21:46:49.596 -0700>,<Administrator>,<X>,<proc1d>,<TOPSPIN 2.1>,
      <abs ABSG = 4 
       data hash MD5: 32K
       B4 50 C5 A3 F6 F2 AF EA 8B C2 49 1E 09 4B 19 FA>)
(   8,<2014-05-22 21:46:49.643 -0700>,<Administrator>,<X>,<proc1d>,<TOPSPIN 2.1>,
      <abs ABSG = 5 
       data hash MD5: 32K
       C2 1C C1 39 11 9B 56 87 DE CF 60 05 1E A0 F5 47>)
$$ ##END=
$$ 
$$ $$ hash MD5
$$ $$ F4 48 63 F7 4C DE A6 14 8C 90 37 91 9F 80 99 49
##$RELAX= 
##$RELAX= 
##$RELAX= 
##$RELAX= 
##$RELAX= 
##$RELAX= 
##$RELAX= 
$$ Bruker specific parameters
$$ --------------------------
##$DU= <E:\>
##$EXPNO= 10
$$ [...]
150 150 150 150 150 150 150 150
##$TP07= 0
##$TPNAME0= <>
##$TPNAME1= <>
##$TPNAME2= <>
##$TPNAME3= <>
##$TPNAME4= <>
##$TPNAME5= <>
##$TPNAME6= <>
##$TPNAME7= <>
##$TPOAL= (0..7)
0.5 0.5 0.5 0.5 0.5 0.5 0.5 0.5
##$TPOFFS= (0..7)
0 0 0 0 0 0 0 0
##$TUNHIN= 0
##$TUNHOUT= 0
##$TUNXOUT= 0
##$USERA1= <user>
##$USERA2= <user>
##$USERA3= <user>
##$USERA4= <user>
##$USERA5= <user>
##$V9= 5
##$VALIST= <valist>
##$VCLIST= <CCCCCCCCCCCCCCC>
##$VD= 0
##$VDLIST= <DDDDDDDDDDDDDDD>
##$VPLIST= <PPPPPPPPPPPPPPP>
##$VTLIST= <TTTTTTTTTTTTTTT>
##$WBST= 2048
##$WBSW= 25
##$XGAIN= (0..3)
0 0 0 0
##$XL= 0
##$YL= 0
##$YMAX_a= 609465
##$YMIN_a= -519304
##$ZGOPTNS= <>
##$ZL1= 120
##$ZL2= 120
##$ZL3= 120
##$ZL4= 120
##$ABSF1= 14.98509
##$ABSF2= -5.573092
##$ABSG= 5
##$ABSL= 3
##$ALPHA= 0
##$AQORDER= 0
##$ASSFAC= 0
##$ASSFACI= 0
##$ASSFACX= 0
##$ASSWID= 0
##$AUNMP= <proc_prof1d_extract_pilot.lims>
##$AXLEFT= 0
##$AXNAME= <>
##$AXNUC= <1H>
##$AXRIGHT= 0
##$AXTYPE= 0
##$AXUNIT= <>
##$AZFE= 0.1
##$AZFW= 0.1
##$BCFW= 0
##$BC_mod= 0
##$BYTORDP= 0
##$COROFFS= 0
##$CY= 15
##$DATMOD= 1
##$DC= 0
##$DFILT= <>
##$DTYPP= 0
##$F1P= 0
##$F2P= 0
##$FCOR= 0.5
##$FTSIZE= 32768
##$FT_mod= 6
##$GAMMA= 0
##$GB= 0
##$INTBC= 1
##$INTSCL= 1
##$ISEN= 128
##$LB= 0
##$LEV0= 0
##$LPBIN= 0
##$MAXI= 10000
##$MC2= 0
##$MEAN= 0
##$ME_mod= 0
##$MI= 0
##$NCOEF= 0
##$NC_proc= -8
##$NLEV= 6
##$NOISF1= 0
##$NOISF2= 0
##$NSP= 0
##$NTH_PI= 0
##$NZP= 0
##$OFFSET= 14.98509
##$PC= 1
##$PHC0= 92.54883
##$PHC1= 0
##$PH_mod= 1
##$PKNL= yes
##$PPARMOD= 0
##$PPDIAG= 0
##$PPIPTYP= 0
##$PPMPNUM= 2147483647
##$PPRESOL= 1
##$PSCAL= 4
##$PSIGN= 0
##$PYNMP= <proc.py>
##$REVERSE= no
##$SF= 400.02
##$SI= 32768
##$SIGF1= 0
##$SIGF2= 0
##$SINO= 400
##$SIOLD= 32768
##$SPECTYP= <>
##$SREGLST= <1H.CDCl3>
##$SSB= 0
##$STSI= 32768
##$STSR= 0
##$SW_p= 8223.68421052631
##$SYMM= 0
##$S_DEV= 0
##$TDeff= 65536
##$TDoff= 0
##$TI= <>
##$TILT= no
##$TM1= 0
##$TM2= 0
##$TOPLEV= 0
##$USERP1= <user>
##$USERP2= <user>
##$USERP3= <user>
##$USERP4= <user>
##$USERP5= <user>
##$WDW= 1
##$XDIM= 32768
##$YMAX_p= 466988755
##$YMIN_p= -818474
##$CURPLOT= <Network HP LaserJet P1505>
##$CURPRIN= <$Network HP LaserJet P1505>
##$DFORMAT= <normdp>
##$LAYOUT= <+/1D_H.xwp>
##$LFORMAT= <normlp>
##$PFORMAT= <normpl>
##$SURQMSG= 1
$$ End of Bruker specific parameters
$$ ---------------------------------
##NTUPLES= NMR SPECTRUM
##VAR_NAME=  FREQUENCY,     SPECTRUM/REAL,   SPECTRUM/IMAG
##SYMBOL=    X,             R,               I
##VAR_TYPE=  INDEPENDENT,   DEPENDENT,       DEPENDENT
##VAR_FORM=  AFFN,          ASDF,            ASDF
##VAR_DIM=   32768,         32768,           32768
##UNITS=     HZ,            ARBITRARY UNITS, ARBITRARY UNITS
##FACTOR=    0.250966925370066, 1,           1
##FIRST=     8223.43324360094, -70505,       -285753
##LAST=      0,             138953,          -100044
##MIN=       0,             -818474,         0
##MAX=       8223.43324360094, 466988755,    0
$$ Real data points
##PAGE= N=1
##DATA TABLE= (X++(R..R)), XYDATA
$$ [...]
19568I6018J31977b52676B40373D5128J37053b5562I4713J27112b08299B39540
19557C7302a30866h342A08916c3797q5232a1881B6598J34811B6695K0081b19569
19545c58999B1887a5283j48897j492D56223a8691B04284q8108b81870B24502c1878
19533e4398b6663a2032j29054c2524o3806m5751f9285m7960b1159l58527h4425
19521a52754L2017b6879D1332M125a46098k09431A9961a93386j08926o828c8610
19509g9441D463b6426q6493N5302k6427m1703A13770c44574E2448J29075A1006
19497a60327E31a86195A77895C0753e5482k8626E8209f1161j75581G001J3157
19486B0158L4411B960i1000k4070C9053M1364a46255M8336K9013r5608A40420
$$ plain form
19568 96018 227995 -252676 240373 45128 182181 -25562 94713 221825 -208299 239540
19557 37302 -130866 -8342 108916 -33797 -119029 -11881 26598 161409 26695 46776 -219569
19545 -358999 21887 -15283 -164180 -165672 456223 -18691 204284 116176 -281870 224502 -31878
19533 -54398 -26663 -12032 -141086 -32524 -96330 -142081 -69285 -117245 -21159 -379686 -84425
19521 -152754 -120737 -26879 41332 45457 -146098 -355529 19961 -193386 -302312 -309140 -38610
19509 -79441 4463 -26426 -112919 -57617 -84044 -125747 113770 -344574 52448 181523 11006
19497 -160327 531 -186195 177895 30753 -55482 -84108 58209 -61161 -236742 7001 20158
19486 20158 54569 2960 -91000 -115070 39053 80417 -146255 -97919 -68906 -164514 140420
19474A14479a88073D5207c7542n9933E5996a27907B3593c53679E4396K34049e2933
19462a83346K4237N3221A50831A3999a22903A22404d39762a62665P5906r7245
19452a84004M6543d2875r6541B16757I8934l8897h0711q2124n9777c596r0437
19441i4033d2344B65045b29571A18559E345b89234B11035b3398A6428c31617I6052
19429i5333k7271B73618j426a22017q0289k77979a19561d7636j30234k1147b3101
19417i1670A01655b24508r3254B21846g4882m7354j90171A26923c31085a22187
19406a0677B3441b49596q3205M3638j09675B14229N3613E4760b47287A981J87047
19395A89028a36126j36090A29322J5641c99603J76588B51900A03524b27327b2654
$$ plain form
19474 114479 -188073 45207 -37542 -97475 55996 -127907 23593 -353679 54396 288445 -52933
19462 -183346 -159109 -105888 150831 13999 -122903 122404 -439762 -162665 -86759 -184004
19452 -184004 -137461 -42875 -139416 216757 98934 60037 -80711 -162835 -222612 -3596 -94033
19441 -94033 -42344 265045 -229571 118559 5345 -289234 211035 -23398 16428 -331617 96052
19429 -95333 -122604 273618 272192 -122017 -202306 -480285 -119561 -47636 -177870 -199017 -23101
19417 -91670 101655 -224508 -317762 221846 -74882 -122236 -312407 126923 -331085 -122187
19406 -10677 23441 -249596 -332801 -289163 -398838 214229 267842 54760 -247287 1981 189028
19395 189028 -136126 -272216 129322 144963 -399603 -223015 251900 103524 -227327 -22654
19384c7531k3708A39448b83949E0689R5205f7531F6808b32741A57577g4783o4553
19373a39336l53225E3586d0914A72922a42293A19476k4194b07516A18603a84383
19362a82474j3131l3837B32340j4262G205K95315E810a59293j55891J38532J2035
19351a64617A27927e43212a75010k31933I1842O41e0116H4428a93012B7815c48608
19339B27995A04046c56528B375e920k94960D76J43639c0298I2385m1864J24125
19328A74646f2757r5062j0758H8135h7051j9053C6837a93903D5735c00658a31410
19316b73354g8683j24873c9976j68136A53949J52771A19514b65129C00012j28733
19306A71279d5806j97779o7099B5166b81990j06313i6148K3539A860a13323B23022
$$ plain form
19384 -37531 -61239 139448 -283949 50689 145894 -67531 66808 -232741 157577 -74783 -139336
19373 -139336 -492561 53586 -40914 172922 -142293 119476 95282 -207516 118603 -184383
19362 -182474 -195605 -229442 232340 218078 7205 302520 5810 -159293 -315184 -176652 -164617
19351 -164617 127927 -543212 -175010 -406943 91842 92483 -50116 84428 -193012 27815 -348608
19339 227995 104046 -356528 2375 -5920 -300880 476 144115 -30298 92385 50521 174646
19328 174646 -62757 -157819 -168577 88135 -87051 -106104 36837 -193903 45735 -300658 -131410
19316 -273354 -78683 -203556 -39976 -208112 153949 306720 119514 -265129 300012 171279
19306 171279 -45806 -243585 -310684 25166 -281990 -388303 -96148 -72609 1860 -113323 223022
19294g0428b0690j2859C2730e2014B03586p8031a21549A89820i4756A51146c72334
19282A39506E3275g1964k3272a7022j08727b4914A77715b48922j1189m9068J42992
19271a66187b9464B06734b5729j94345l0869A6769b24255b6400k3939l31809E548
19259a58011g3470l71350e9095A60044N02162a4836j9207I8288D8821a55310k1877
19248a77187k16565e9765q6576I407a74478A37784d0360A90340a27365I1995b77042
19236c03808C01989d01418A50187B7967b71556e9795A30349f4188j15363m3943
19226b23494J2920A99907a9072A24868n6959a32289j57787D9921a87921j41980
19216c29901C2708M8385R3403A0051a5232A83608o150b66594G3105b74663J16220
$$ plain form
19294 -70428 -20690 -33549 32730 -52014 203586 125555 -121549 189820 -94756 151146 -372334
19282 139506 53275 -71964 -95236 -17022 -125749 -24914 177715 -248922 -260111 -309179 -166187
19271 -166187 -29464 206734 -25729 -220074 -250943 16769 -224255 -26400 -50339 -382148 5548
19259 -158011 -73470 -444820 -59095 160044 662206 -14836 -34043 98288 48821 -155310 -177187
19248 -177187 -393752 -59765 -146341 9407 -174478 137784 -40360 190340 -127365 91995 -277042
19236 -303808 301989 -401418 150187 27967 -271556 -59795 130349 -64188 -179551 -223494
19226 -223494 -210574 199907 -19072 124868 67909 -132289 -290076 49921 -187921 -329901
19216 -329901 32708 81093 174496 10051 -15232 183608 177458 -266594 73105 -274663 -158443
19205a58443c4996A96764r0596b72592d7208Q263k4492j96552I897K2634a06885
19193b36601A01832I445f8142B8438J15857b77039f4855a6718D4743a84977a130
19181a78494F8684a34238K2018L177j16606j67704J55476p790B999K10647e8953
19169A23954a13591M3462D7853a76093j21302B9306j0661d1127k35965N4579A41536
19157c54618a74307g7006m40475a38633L1855b9584j47385M3017A73697J7633
19147A91330a74578I0413a43678K7353F3337f1670A8010h8511A68589h6568K0816
19136f5752r6091A51205a93218K056F3236b83728F954c5822k52339A20936c07406
19124d8154D6608a78957Q8553p3635I544a81223o2343B6574a83560A74520n1578
$$ plain form
19205 -158443 -34996 196764 106168 -272592 -47208 -38945 -63437 -259989 9897 32531 -106885
19193 -236601 101832 9445 -68142 28438 144295 -277039 -64855 -16718 44743 -184977 -1130
19181 -178494 68684 -134238 -112220 -109043 -225649 -393353 -237877 -245667 2999 213646 -58953
19169 123954 -113591 -70129 47853 -176093 -297395 29306 18645 -41127 -277092 -222513 141536
19157 -354618 -174307 -77006 -517481 -138633 -106778 -29584 -176969 -133952 173697 191330
19147 191330 -174578 90413 -143678 -116325 63337 -61670 18010 -88511 168589 -86568 -65752
19136 -65752 -161843 151205 -193218 -191162 63236 -283728 6954 -35822 -288161 120936 -307406
19124 -48154 46608 -178957 -90404 -164039 9544 -181223 -243566 26574 -183560 174520 122942
19113A22942a44557D4750c15892g7676k49062J20973f8161k26702A21748K29786
19103C51534b02719B38195H1889c19661I2792i0970D7479b0077o1313L1478k42446
19092b92358a30936o6854D5108h8879c457l86088a55344M050H0051a64898L9626
19081a25272B1O2326a92235A5787a13616N5880G1584O0618o3999P5797G1600e7944
19068d17739a2535j41947L8963j3299B831a37647I6354g3520k58146A73740b752
19056e06327a60688A25131C6153e617C6641a95288c4098m2103L4689B0783i6675
19044b41753A12941a93307A62948a24553B87215c81372f9950M344h647A22879
19033c25367C3935K77660g8604l12543C9641a16842F3137N6430D2589J07703j6916
$$ plain form
19113 122942 -144557 44750 -315892 -77676 -326738 -205765 -68161 -294863 121748 351534
19103 351534 -202719 238195 81889 -319661 92792 -90970 47479 -20077 -81390 -49912 -292358
19092 -292358 -130936 -197790 45108 -88879 -3457 -389545 -155344 -151294 80051 -164898 -125272
19081 -125272 21 62347 -192235 15787 -113616 -57736 71584 132202 68203 144000 71600 -57944
19068 -417739 -12535 -154482 -115519 -128818 2831 -137647 96354 -73520 -331666 173740 -2752
19056 -506327 -160688 125131 36153 -5617 36641 -195288 -34098 -76201 -41512 20783 -96675
19044 -241753 112941 -193307 162948 -124553 287215 -381372 -69950 -65606 -8647 122879
19033 -325367 33935 311595 -78604 -391147 39641 -116842 63137 119567 42589 150292 133376
19022A33376g8621A71890a49150G2836l3129Q6070A3295J00574J8526M8424H9457
19010i7043H2110C6855K06769a02903d1166B14424A1665E388O141J3715b7380
18998b27042B74398a17466q3635H2217G811J74823b51001B32925m7872b64119
18987B57249e8870B96197e3981l00890A98322d8378n4954e1284E5470a26425M1638
18976h4787Q659j84898A4060M7380b73866Q7425b8319C1213a97546H411a06188
18964a24787k29435a60563f8301B44757D5132e5593k27603b975o1040a3221C60342
18952b04811A56919a08881d4995l48503A62207d5180A03070P3093F8868g6896
18941b95775J1895O2965A83480J1490a51912E2115a91847L6423j60942H922e0788
$$ plain form
19022 133376 -78621 171890 -149150 72836 39707 125777 13295 113869 132395 180819 89457
19010 -97043 82110 36855 243624 -102903 -41166 214424 11665 5388 11529 25244 -27380
18998 -227042 274398 -117466 -201101 82217 7811 182634 -251001 232925 185053 -264119
18987 257249 -58870 296197 -53981 -354871 198322 -48378 -103332 -51284 55470 -126425 -84787
18976 -84787 -76128 -261026 14060 61440 -273866 -186441 -28319 31213 -197546 8411 -106188
18964 -124787 -354222 -160563 -68301 244757 45132 -55593 -283196 -2975 -64015 -13221 360342
18952 -204811 156919 -108881 -44995 -393498 162207 -45180 103070 176163 68868 -76896
18941 -295775 -283880 -220915 183480 194970 -151912 52115 -191847 -155424 -316366 8922 -50788
18929h8524b443G3153b95357J14438M1360M8991j56100F7035O084a00686n5104
18918a55790i552A64281K1015i428k82134M3848A2235f1649k20059J3672c705
18906B99281O9867c57121h6902A28160a16930B3667R8017h3428k8981G5645a80029
18894b13219d4437p5002A32440i2477E80014c04453H146M3011e0401A24217c13499
18882a14240n6968j7280A89775b63494M9950i1972A99164A3514a54378q5521q7155
18871c27054a09194H1288K19002b33444j28532i5961j50770K8740j43042a07119
18860h6059m3152E3659R5234A5507M5064A4470L97125b41890O208D4619b00294
18848A50961c69097A6866h2580G2498a2830p3212p5913c9522B35869a12362E4969
$$ plain form
18929 -88524 -2443 73153 -295357 -180919 -139559 -90568 -246668 67035 73119 -100686 -155790
18918 -155790 -9552 164281 185296 -9428 -291562 -247714 12235 -61649 -281708 -268036 -3705
18906 299281 369148 -357121 -86902 128160 -116930 23667 121684 -83428 -112409 75645 -180029
18894 -213219 -44437 -119439 132440 -92477 580014 -304453 8146 51157 -50401 124217 -313499
18882 -114240 -171208 -188488 189775 -263494 -213544 -91972 199164 13514 -154378 -239899 -327054
18871 -327054 -109194 81288 300290 -233444 -361976 -95961 -246731 -217991 -361033 -107119
18860 -86059 -129211 53659 148893 15507 60571 14470 411595 -241890 -235682 44619 -200294
18848 150961 -369097 16866 -82580 72498 -12830 -86042 -161955 -39522 235869 -112362 54969
18836A00700j1603K2306J47481b99984a37160C59139d92602a08034r0664L3661
18826a65037e371k20417k5793f1742A37758d7516G2611a08529A02405K72078e0239
18814B62882E0854J60837D5252O5392b8878B88018o4050P017h0148k59344e9613
18802a9790j47931k28950a58223k54583A11450b10943c98B7263e4851k2362A56262
18790c99308i3515k1836d8384E1207i1114j05798O7497C8980a45988j85278a3614
18778E3887a62319k53603i8176A32087a63520b8842A36736a65988A18421C5188
18767d7595q1915I2370A136b45146B67432a80232h7861q7504A09189O9522Q4512
18756B63223K0694b74272R6189B40715j04194b4143j83058l5031R2313A87726
$$ plain form
18836 100700 89097 111403 258884 -299984 -137160 359139 -492602 -108034 -198698 -165037
18826 -165037 -5371 -225788 -251581 -61742 137758 -47516 72611 -108529 102405 374483 -50239
18814 262882 50854 211691 45252 110644 -28878 288018 223968 230985 -80148 -339492 -59613
18802 -19790 -167721 -396671 -158223 -412806 111450 -210943 -398 27263 -54851 -77213 156262
18790 -399308 -93515 -115351 -48384 51207 -91114 -196912 -129415 38980 -145988 -331266 -13614
18778 53887 -162319 -415922 -98176 132087 -163520 -28842 136736 -165988 118421 35188
18767 -47595 -129510 92370 1136 -245146 267432 -180232 -87861 -175365 109189 178711 263223
18756 263223 283917 -274272 -178083 240715 136521 -24143 -207201 -242232 -149919 187726
18745G1675f449j41275L2584A085c43250Q8581g0763r5425B386g0493l92945a89571
18732a53350d7470B02205C3015h2233j47034i4043Q966P833C3380b08215j7654
18721b25869o6880a25676F520c36585J53070q5800B1843J4852Q1814b2482q5590
18710a08072A06110C4654j1617a401k03603A03249c6746I882J04953B6460a40878
18698A28474J92515a85531q8144A21734f3930k5501b0848j18005j49881A5392
18687b92373A6657b37153B47170L7533c80176B979O0621Q8396p5596J7076n605
18676H7871e1425C0405b22766O0818b9126j66269J2697g5780K4007j23217b1524
18664D6231b07483A33312b29179Q9394o595C7574b61303i6387A60226b16795F5222
$$ plain form
18745 71675 -6449 -147724 -115140 1085 -343250 -254669 -70763 -166188 2386 -70493 -463438 -189571
18732 -153350 -47470 202205 33015 -82233 -229267 -94043 -85077 -77244 33380 -208215 -225869
18721 -225869 -292749 -125676 6520 -336585 -183515 -269315 21843 36695 118509 -22482 -108072
18710 -108072 106110 34654 23037 -1401 -205004 103249 -36746 9882 114835 26460 -140878
18698 128474 320989 -185531 -273675 121734 -63930 -89431 -20848 -138853 -288734 15392
18687 -292373 16657 -237153 247170 284703 -380176 2979 63600 151996 76400 93476 87871
18676 87871 -51425 30405 -222766 -161948 -29126 -195395 -182698 -75780 -51773 -174990 -21524
18664 46231 -207483 133312 -229179 -139785 -146380 37574 -261303 -96387 160226 -216795 65222
18652B4819b99055E1435a72566l22234A28795k4799a43298d9831l639l2837A94733
18640A83787c9889B80854g2140m7496C4125e8868k33341K4571b6149m7298k19837
18629b93284P9918p7991A90750J76852A31972h813j23191j55346h2846q2936F7963
18617b2951m3391l5459M2099E4253L0451B588O630J05570A8110d7399q4758d2592
18604D40109B18756C2370b65114h1209K2377F3960i3317j29474h5040G1945M8262
18593A20207a15207B00268q8210O815E6376P4943c04890A0290g0782I5136b78599
18581a65841m1187i5325a8040D0551B0149d0998I0026M7629c32235L178J52982
18570a76075j73904h6743H9546a1906j58265K492K0899j06612d225B02453a32621
$$ plain form
18652 24819 -299055 51435 -172566 -494800 128795 103996 -143298 -49831 -53470 -86307 194733
18640 183787 -39889 280854 -72140 -119636 34125 -58868 -292209 -267638 -26149 -73447 -293284
18629 -293284 -213366 -291357 190750 367602 131972 -8813 -132004 -287350 -82846 -165782 67963
18617 -22951 -66342 -101801 -59702 54253 84704 2588 9218 114788 18110 -47399 -132157 -42592
18604 440109 218756 32370 -265114 -81209 -58832 63960 -93317 -222791 -85040 71945 120207
18593 120207 -115207 200268 112058 118873 56376 131319 -304890 10290 -70782 95136 -278599
18581 -165841 -207028 -95325 -18040 40551 20149 -40998 90026 137655 -332235 -329057 -176075
18570 -176075 -349979 -86743 89546 -11906 -170171 -167679 -146780 -253392 -4225 202453 -132621
18558a22820A6724i1742E5073d0554j55611c0328d835k19297d2857A14297C799
18546b79688O0056A65127i4895c9097H1410J98822c7523A59085c44192C33648
18535B05442b6698k59146f0126J4316E622P3032j1764a99683B46955a15517e884
18523A484a25237A62644b5335A54094e36805B05849A0581d75473b1490j35911
18513a57401N0465q0153B58641a05858j75583h7125A93749h4673A48365c93185
18502C8037c37260D2149K99215a94871j81770a63103N34I6748a87334O3731c6732
18490b02444k65792G3683a89759h9075n4925M7034j88498r3805F4428g8343B55117
18478A12745a29161e0382n4542D5800c38860C1631h6653B99254i4595A08208C9569
$$ plain form
18558 -122820 16724 -91742 55073 -40554 -196165 -30328 -4835 -224132 -42857 114297 3799
18546 -279688 -219632 165127 -94895 -39097 81410 280232 -37523 159085 -344192 333648
18535 205442 -26698 -285844 -60126 -45810 5622 78654 66890 -199683 246955 -115517 -5884
18523 1484 -125237 162644 -25335 154094 -536805 205849 10581 -475473 -21490 -157401
18513 -157401 -106936 -187089 258641 -105858 -281441 -87125 193749 -84673 148365 -393185
18502 38037 -337260 42149 341364 -194871 -376641 -163103 -162569 96748 -187334 -123603 -36732
18490 -202444 -468236 73683 -189759 -89075 -144000 -96966 -285464 -379269 64428 -78343 255117
18478 112745 -129161 -50382 -104924 45800 -338860 31631 -86653 299254 -94595 108208 39569
18466a03546k21810f7988c0802C381J79688c0771A99414a4012E54306A26004P0535
18455A96539H9917a34658B22647j05778C9663K1282J60383J99377c34532I3159
18444D2939N9557a14440j78497J02963G6118d23724C9111L777c45653i8454k68408
18433c66862C493N2386b34109g9595k20807B35203c0765p292l5020K8730E298
18421a68095M1913A22473b10261K201f8943q386j85912K6178I1948K7061N5730
18410A74739a63243O6327M2769A14581a05854B02674a50845I3419b60205E6194
18399f750C57534r9280b56362D3413g262j35187B18312a77062D1695J41863B185
18387A24533a23279A09643B7464K903b61005k5119h1602l07987G7943c08156a22950
$$ plain form
18466 -103546 -325356 -67988 -30802 3381 183069 -30771 199414 -14012 554306 126004 196539
18455 196539 89917 -134658 222647 116869 39663 60945 221328 420705 -334532 93159
18444 42939 102496 -114440 -292937 -189974 76118 -423724 39111 42888 -345653 -98454 -366862
18433 -366862 3493 55879 -234109 -79595 -300402 235203 -30765 -38057 -73077 -44347 5298
18421 -168095 -126182 122473 -210261 -208060 -68943 -77329 -263241 -237063 91948 119009 174739
18410 174739 -163243 -96916 -54147 114581 -105854 202674 -150845 93419 -260205 56194
18399 -6750 357534 258254 -256362 43413 -7262 -142449 218312 -177062 41695 183558 2185
18387 124533 -123279 109643 27464 30367 -261005 -286124 -81602 -389589 77943 -308156 -122950
18375a63515A13527c7584A81144q8330b01161f8105k38437c9570m3478q9958e6769
18363A941J06935C1609p172a24638A86359a90212B42700a44491K2648H9534c59140
18351B2817R0807b46818A73166a12301I255c00933g7371n4135N3473J4637E2895
18339C0607J9718L93a18127A63132i54r279j63386C8399b80068A39240D9176K72882
18327C22058a44138G3352a31678B31418a20503k3479C6913d0912E8949O2493b19061
18315a18187L7253j52823J6760B99754a98106m3637i6998p2366g5325n8262B4362
18303c47377C08625F982a68060A37615l569i45l44677o4838i8256k10404K1967
18292b86693K4067A51411F0273P4024g226j60692B1489r299K10991I977b45241
$$ plain form
18375 -163515 113527 -37584 181144 92814 -201161 -68105 -306542 -39570 -83048 -173006 -56769
18363 1941 108876 31609 24437 -124638 186359 -190212 242700 -144491 -121843 89534 -359140
18351 22817 113624 -246818 173166 -112301 9255 -300933 -77371 -131506 -78033 -63396 52895
18339 30607 50325 50718 -118127 163132 -954 -10233 -173619 38399 -280068 139240 49176 322058
18327 322058 -144138 73352 -131678 231418 -120503 -143982 36913 -40912 58949 121442 -219061
18315 -118187 -80934 -233757 -216997 299754 -198106 -241743 -96998 -169364 -75325 -133587 24362
18303 -347377 308625 6982 -168060 137615 134046 -945 -345622 -410460 -98256 -308660 -286693
18292 -286693 -262626 151411 60273 134297 -7226 -167918 21489 12190 223181 9977 -245241
18280F0752f1412m4580H5891M7898a5273B65213c88723J07398C6002c25948R9723
18269b26225j0069f9095n3166k6154A86170b79513g2576j16294k08117A05839
18258C30334d03568a84326P9793B02165I0575Q4201i1365B00826c06466C5773
18247c16243a13103B22134a98222j65740L8237B1529J18163b2622m00614G9694
18236a64846A42295i9807A24462K49313H0266k5117a93343j53221B70874a0737
18225b96989a12018N5119n4905A38057b32133A66480D7218a05021D36723b32424
18214b94849e6833H3591h9371E139b47726C4046e13831B2097a43012k14659A82022
18202C57567b00543c0247r1515B6385b16387a07272A04129J40706D8124M1843
$$ plain form
18280 60752 -61412 -105992 85891 133789 -15273 265213 -388723 -281325 36002 -325948 -226225
18269 -226225 -236294 -69095 -122261 -148415 186170 -279513 -72576 -188870 -396987 105839
18258 330334 -403568 -184326 -104533 202165 90575 174776 -91365 200826 -306466 35773
18247 -316243 -113103 222134 -198222 -363962 -325725 21529 139692 -22622 -423236 79694
18236 -164846 142295 -99807 124462 373775 80266 55149 -193343 -346564 270874 -10737
18225 -296989 -112018 -56899 -111804 138057 -232133 166480 47218 -105021 436723 -232424
18214 -294849 -56833 83591 -89371 5139 -247726 34046 -513831 22097 -143012 -357671 182022
18202 357567 -200543 -30247 -121762 26385 -216387 -107272 104129 244835 48124 89967
18192H9967b66484J25617J0960N0191B6557K749e5876q3885D6707F977Q0578a56955
18179I6715a6988q2691m1527F670e8803C60773a27821B50911c6403A30562c66094
18167B1746M933a83393B55186K49800B37037A07842a41740A39121a73248N4175
18157a19073c3167k25924N4338B64324a81171B09008a97188o492A08638B5616
18146A12472b45018j04461D3370g0156E4423a62493B39420k1519E0974K38389
18136B89363j18548a00593a4643A0661g8307d112r9437J1161B1528a64295g049
18124c83160g7471k3947L4639j21046a4905A23320k7595h9839P32b4631j50541
18113a75172A69406f7973A59155b38084D4526b68792B94964A21767a64338C5425
$$ plain form
18192 89967 -266484 -140867 -129907 -79716 26557 29306 -55876 -139761 46707 6977 87555 -156955
18179 96715 -16988 -99679 -141206 6670 -58803 360773 -127821 250911 -36403 130562 -366094
18167 21746 26679 -183393 255186 504986 237037 107842 -141740 139121 -173248 -119073
18157 -119073 -33167 -259091 -204753 264324 -181171 209008 -197188 -203680 108638 25616
18146 112472 -245018 -349479 43370 -70156 54423 -162493 239420 217901 50974 289363
18136 289363 170815 -100593 -14643 10661 -78307 -4112 -103549 -92388 21528 -164295 -7049
18124 -383160 -77471 -101418 -66779 -187825 -14905 123320 95725 -89839 -89107 -24631 -175172
18113 -175172 169406 -67973 159155 -238084 44526 -268792 294964 121767 -164338 35425
18102f5729p3584A06345a45431M3529D54866a10250B10504A0745P5912c92577
18091a73078M7832k09363a23516d5682B65350r5318a57545j60576e1417k8702
18081h0119j92678A79662g083j9701I5308l5056a26774l8312e1004k3606j14720
18070a89330a7056A81124b96799g6468D154K69843J30434j99042O912n1026c13991
18058d0715n9761a4366m45595L3805e4071j28598P0441A70179e7298A47770h5732
18046a44725A71766E4988f4692m6718L8180b2226p3748b2799A14296J98985b2409
18034a98286A58211a25141B16945n1471Q4804D3656J53943G7488K15609a18429
18023e3917I6484f8203m7514L7597A320a13756B50119a81928A71129F9864j9900
$$ plain form
18102 -65729 -139313 106345 -145431 -101902 454866 -110250 210504 10745 86657 -392577
18091 -173078 -125246 -334609 -123516 -45682 265350 170032 -157545 -318121 -51417 -80119
18081 -80119 -272797 179662 -7083 -26784 95308 60252 -126774 -165086 -51004 -74610 -189330
18070 -189330 -17056 181124 -296799 -76468 4154 273997 404431 205389 212301 161275 -313991
18058 -40715 -100476 -14366 -459961 -426156 -54071 -182669 -112228 170179 -57298 147770 -85732
18046 -144725 171766 54988 -64692 -111410 -73230 -22226 -95974 -22799 114296 313281 -22409
18034 -198286 158211 -125141 216945 165474 250278 43656 197599 77488 293097 -118429
18023 -53917 96484 -68203 -115717 -78120 1320 -113756 250119 -181928 171129 69864 49964
18012D9964b21401B30242F0534a16538k26597B3490J2383Q2439a72099b0184l20240
18001c40424J17265n4000J15075B74854c5283m2606b1491l61240D4616J02086
17991A46702b94840J38474A8125a50616C8441A6046J3812J11286h1156A66143
17980C2367a97675F105d02096A7685c65989J75645j41899d2889j83247M7750B09526
17968A66835J02095h4366B22104A5011a1068B06927d79405C2861c39853c9941
17957F5972a0792l18290a4054A05730g2072P977j40628C0603l990M01262b16312
17945a49806B56623a94300C57447A227K44016N991J09037a37723B47432C3314
17934b32017G3694P9872e41035B7222J35781o6396L6654a4764r8981j25910f5869
$$ plain form
18012 49964 -221401 230242 60534 -116538 -343135 23490 35873 118312 -172099 -20184 -340424
18001 -340424 -223159 -277159 -162084 274854 -35283 -77889 -21491 -382731 44616 146702
17991 146702 -294840 -156366 18125 -150616 38441 16046 29858 141144 -81156 166143
17980 32367 -197675 6105 -402096 17685 -365989 -190344 -332243 -42889 -226136 -178386 209526
17968 166835 268930 -84366 222104 15011 -11068 206927 -479405 32861 -339853 -39941
17957 65972 -10792 -329082 -14054 105730 -72072 -64095 -204723 30603 26613 427875 -216312
17945 -149806 256623 -194300 357447 1227 245243 251234 360271 -137723 247432 33314
17934 -232017 73694 153566 -541035 27222 163003 96607 133261 -14764 -113745 -239655 -65869
17922d13642a27019D30714G2134N1172L75j0051B0710b50862B74466f2825b6546
17910e7949b8485m7098B937N0740K4067b13077c0086G428Q2710B9061a43160C22377
17897b86339a126j00892A96341a72817F0275b9608k63633a39699A50484D4603
17886A0423J8650c11192A89140H3031b49254B10511J19754b7469j8274A36510
17875A38337b56887B00114E979f5892k4091k52395A28290B2047K9860A0472g974
17863B32947F0909J21364O8054E075h7478H4939b27716A6214M4289J7106l196
17852G4413c07706A03993E0663b46825A41372a14535k04649d9107A45244b95790
17841i7170B97784j10017A8982J04811b39013B7416b54j8610l04645F5076l2448
$$ plain form
17922 -413642 -127019 430714 72134 123306 123681 113630 20710 -250862 274466 -62825 -26546
17910 -57949 -28485 -75583 2937 53677 77744 -213077 -30086 7428 90138 29061 -143160 322377
17897 -286339 -1126 -102018 196341 -172817 60275 -29608 -293241 -139699 150484 44603
17886 10423 29073 -311192 189140 83031 -249254 210511 330265 -27469 -45743 136510
17875 138337 -256887 200114 5979 -65892 -89983 -342378 128290 22047 51907 10472 -7974
17863 232947 60909 182273 250327 5075 -87478 84939 -227716 16214 60503 77609 74413
17852 74413 -307706 103993 50663 -246825 141372 -114535 -319184 -49107 145244 -295790
17841 -97170 297784 187767 18982 123793 -239013 27416 -254 -18864 -323509 65076 32628
17830C2628O9575d09149E6050J2086a18838a0356A41952G758d1482j18901G6075
17818A38403c03293A23143e9463A70609F8285k4492c0828A42245c3711j39749
17808a73460G2245a12417C29828c09417M1744A15886c16280I8623l9787c05777
17797e6643K5049j05343j82607f420C19895d76753c7592B15631f6935a7966A15103
17785a89226M2640A48984b24352E0702h0805A1079K51581D0701N8404b86769B36042
17773d1348A26996J58308P452a26542K9355k81522A33687h5157L5912k64350B59273
17761g3605j22561i13A7553a42555O2250j90073o8323f406I6568j0844N6078a18084
17748B22306c62885A21358f5701B20914K35329a98755F3223c82468J88990m0372
$$ plain form
17830 32628 102203 -409149 56050 68136 -118838 -10356 141952 7758 -41482 -160383 76075
17818 138403 -303293 123143 -59463 170609 68285 43793 -30828 142245 -33711 -173460
17808 -173460 72245 -112417 329828 -309417 -267673 115886 -316280 98623 58836 -305777
17797 -56643 -31594 -136937 -319544 -6420 319895 -476753 -37592 215631 -66935 -17966 115103
17785 -189226 -146586 148984 -224352 50702 -80805 11079 262660 40701 99105 -286769 236042
17773 -41348 126996 285304 292756 -126542 -97187 -378709 133687 -85157 -49245 -313595 259273
17761 -73605 -196166 -913 17553 -142555 -80305 -270378 -338701 -6406 96568 85724 141802 -118084
17748 222306 -362885 121358 -65701 220914 456243 -198755 63223 -382468 -193478 -233850
17738b33850r303n7913H5016a06993o8903B24866j10147b2981l08204A67284e9404
17726b77202B95140I9355d065k17666B8428c8417C5450a68133o044M0772I5688
17714a41407b7146k7779j0998F1529c00205R2018Q3717M9870j76344a11148C2660
17702b13131C62003A70830E695A887M516j079J9512R1935a22205j09753Q7038
17691a44920d7656k43510c9390A43878g5134A77063a82494F1569c1949F3361a79879
17679A88767a40814L752A74864o8162P5278b63909A63313a05500B15561m1449
17669A74112b61934J17348J1384j37735a20617A18501b37377O9590e945k30A42720
17657e2583A31700b2710B48292a30299I2659J40550H3730L05610c81240B68417
$$ plain form
17738 -233850 -243153 -301066 85016 -106993 -175896 224866 114719 -22981 -331185 167284 -59404
17726 -277202 295140 99355 -4065 -221731 28428 -38417 35450 -168133 -174177 -133405 95688
17714 -141407 -27146 -54925 -65923 61529 -300205 -208187 -124470 -74600 -250944 -111148 32660
17702 -213131 362003 170830 5695 1887 6403 5324 24836 116771 -122205 -231958 -144920
17691 -144920 -47656 -291166 -39390 143878 -75134 177063 -182494 61569 -31949 63361 -179879
17679 188767 -140814 -137062 174864 106702 181980 -263909 163313 -105500 215561 174112
17669 174112 -261934 -144586 -133202 -270937 -120617 118501 -237377 -167787 -5945 -6175 142720
17657 -52583 131700 -22710 248292 -130299 92659 233209 83730 389340 -381240 268417
17646D8306b55442j3954A00721J3550Q9023g0881A39049m5212c12435H6668N2011
17635A38679m2441A1737b47696C45983b1338B22485b32212A46881m5357M1047
17625A42571n3393N9579a66289j91737Q6399g6612b9948j04295A54228c20566
17614e5573A0645J7329P7564g6729R118B39965p2287C8211a03570A01488a45534
17602G3747a34960b3054A02469J00477K82743b14959C52761f353B35917F8333
17591G1618A8481L8176K31820A7515a50890o2985R3738A9866c4170d865A92306
17579B11213e3769E1317j7907a21149I5147a12148A32884a27665c5620H2406C5859
17567e771C17603A05322B7541e5003A56481E2385J6105L3220M3689a2107B7590
$$ plain form
17646 48306 -255442 -269396 100721 114271 203294 -70881 139049 93837 -312435 86668 138679
17635 138679 96238 11737 -247696 345983 -21338 222485 -232212 146881 101524 142571
17625 142571 89178 148757 -166289 -358026 -271627 -76612 -29948 -134243 154228 -320566
17614 -55573 10645 27974 105538 -76729 -67611 239965 167678 38211 -103570 101488 -145534
17602 73747 -134960 -23054 102469 202946 485689 -214959 352761 -6353 235917 68333
17591 71618 18481 56657 288477 17515 -150890 -213875 -120137 19866 -34170 -4865 192306
17579 211213 -53769 51317 33410 -121149 95147 -112148 132884 -127665 -35620 82406 35859
17567 -5771 317603 105322 27541 -55003 156481 52385 68490 101710 145399 -12107 27590
17555B57139g3190A38983B6365b36305C35014a17432n9226C53867j27413r3925
17545A32529g6392j60740C49298A44183C1813M00936a76436d3894H7570c42759
17534A17625b03059P8244A69316O6719q2537G6508h8113L0684l3844l25401A45573
17522a66852B9327J08431b59884I3471K30926K1444a10973M8522A9851h7331j1863
17511i9194A11919j2747e4572B21075n7784m7843b51479e8555B78615b16757D29683
17499C32425g2243L1067q4564K2051A23505K9285O9399d3212B55778g8552F6820
17487B95472G1688a12775D1597E843K67767O3765j05325J83454a06645p4242e6955
17475e7573I6374L59785k23137l5395Q8488j03146m7958B3895J20803K01598H8707
$$ plain form
17555 257139 -73190 138983 26365 -236305 335014 -117432 -176658 353867 226454 132529
17545 132529 -76392 -237132 349298 144183 31813 432749 -176436 -43894 87570 -342759
17534 117625 -203059 -124815 169316 236035 153498 76508 -88113 -57429 -91273 -416674 145573
17522 -166852 29327 137758 -259884 93471 324397 345841 -110973 -62451 19851 -87331 -99194
17511 -99194 111919 99172 -54572 221075 163291 115448 -251479 -58555 278615 -216757 429683
17499 332425 -72243 -41176 -125740 -103689 123505 152790 222189 -43212 255778 -78552 66820
17487 295472 71688 -112775 41597 5843 273610 337375 232050 415504 -106645 -180887 -56955
17475 -57573 96374 456159 233022 197627 286115 182969 135011 23895 144698 346296 88707
17463e3754D02396j39155r4918K2170a84971d4407D60503B26217q8569L6846K7510
17452B02004J53673k6074n5000n4613J59733A26981q969J88405p1888r3984m3642
17441I6903M49027k37917j8446o8237J50440i7462A43469a16689G2916c9418A53259
17429a29595D82781A04887m6778J75504C7629J92679L0690L27601C7659f543D98305
17417A45997B4384M08532k5245q0092j51404K19852A80320L0784J74268D7730
17406C59677A43835Q6931d8613B23675I3158N50328e7194A78186F6386b06411
17395A13625c1714m2612E6408J65139E1142O6647b09878B94105j39940M8099r5241
17384A07023K87347a9030B95649a58088M6943A42539L03809d2407B03496H3037
$$ plain form
17463 -53754 402396 263241 168323 190493 -184971 -44407 460503 226217 137648 174494 202004
17452 202004 355677 329603 274603 219990 379723 126981 118012 306417 234529 140545 96903
17441 96903 545930 308013 289567 221330 371770 -97462 143469 -116689 72916 -39418 153259
17429 -129595 482781 104887 58109 233613 37629 230308 260998 588599 37659 -6543 498305
17417 145997 24384 432916 407671 327579 176175 396027 180320 211104 385372 47730
17406 359677 143835 230766 -48613 223675 93158 643486 -57194 178186 66386 -206411
17395 113625 -31714 -74326 56408 221547 51142 117789 -209878 294105 154165 202264 107023
17384 107023 394370 -19030 295649 -158088 -111145 142539 446348 -42407 203496 83037
17373E6238K56382h8080q5911A81915G9814J65144C0152M57426b60502B50651
17362C44698A18833c17681K3463H2443m080L72700r3418j58108M7959j07035l1296
17351A09165J86962A06067a11013C35412b59595B08062N7647H5524J11992K09237
17341D06753A11738J27617r7201E9719r079K5793c1250r156C11950m1098G3287
17329E9659Q8416C3681c23712B73328A06071K91747A12105j8893L2262l7101K42016
17318C30389p5587j200e6967A51596J99092l3787a51908A70208b2823D85661B05011
17306A30473D4241O7934A7152O9659e8893A64110L2633d8753C34819b37992a786
17294A14541g2812A71764j2664O4481l0777j3316p7997K79445a78626d5652B69293
$$ plain form
17373 56238 312620 -88080 -173991 181915 79814 244958 30152 487578 -260502 250651
17362 344698 118833 -317681 -294218 82443 78363 451063 357645 199537 247496 140461 109165
17351 109165 296127 106067 -111013 335412 -259595 208062 265709 85524 197516 406753
17341 406753 111738 239355 142154 59719 50640 76433 -31250 -40406 311950 270852 73287
17329 59659 148075 33681 -323712 273328 106071 397818 112105 93212 125474 88373 330389
17318 330389 254802 253602 -56967 151596 350688 316901 -151908 170208 -22823 485661 205011
17306 130473 44241 112175 17152 86811 -58893 164110 196743 -48753 334819 -237992 -1786
17294 114541 -72812 171764 159100 223581 192804 179488 101491 380936 -178626 -45652 269293
17282a65019B09902J07306b88925F6530J8718N748k436J84241j8651J00992G3165
17270B84011e3374A47384R952i947q7247B4289c9475l9866A94863m5730K58103
17259D07236a07735D5467R3357e668I5401K92332j39779J13066D6927L75871j39034
17248B83764H4356A0073J94823l3835J39978n5905q1514o2298K89842E5692J39937
17237A95629E4015R2415m2678J31392c4071F58685A09020M55062A71071f0729
17226c339C07807o2374a36999G3664k1105A6984d7767C15656A9669J37098k3431
17215A33336O7229J64445K0633I237j38O7995a08046A03723P6086J43236Q877
17204C31922j03538l8813L59236D1826K11677P2015l1445h0548B78043J7002L13649
$$ plain form
17282 -165019 209902 317208 -288925 66530 85248 90996 88560 272801 254150 355142 73165
17270 284011 -53374 147384 157336 -9947 -97194 24289 -39475 -79341 194863 149133 407236
17259 407236 -107735 45467 138824 -5668 95401 387733 247954 361020 46927 422798 283764
17248 283764 84356 10073 204896 171061 311039 255134 173620 111322 401164 55692 195629
17237 195629 54015 146430 103752 235144 -34071 658685 109020 564082 171071 -60729
17226 -3339 307807 245433 -136999 73664 52559 16984 -47767 315656 19669 156767 133336
17215 133336 200565 365010 385643 9237 9099 77094 -108046 103723 179809 323045 331922
17204 331922 228384 189571 548807 41826 253503 325518 294073 -80548 278043 295045 608694
17193F08694I7673K78725I1546N06337H4105J48777K67760B49976p9604R2894
17183B63266o4664G2427K66135J49429j37648A69465J4680Q5722J02779L1277
17173D03923d7118B38038N9370q9249J54478A16596K39608F3751N33015k21853
17163C74913J64487R2829B5469K19738I1441l6957L03408O9578p2249A28508J50293
17152B78801J25687r4163j28763J15946C7333L61425q3603M7502a41213B41735
17141B06048J96278j09502M0662J39982j61431I6392Q9055k3773L65734j76010
17131C51398H3311L87486j35528A23637J02724Q6248L5901j44737K08305j5315
17121C96763N3168K0511o8147p8878j58935M40891q6463l6740j6968n6758j24674
$$ plain form
17193 608694 97673 376398 91546 597883 84105 232882 500642 249976 170372 263266
17183 263266 198602 72427 338562 487991 350343 169465 184145 269867 372646 403923
17173 403923 -47118 238038 297408 208159 362637 116596 356204 63751 596766 374913
17163 374913 539400 632229 25469 245207 91441 54484 357892 427470 355221 128508 278801
17152 278801 404488 310325 181562 297508 37333 398758 315155 362657 -141213 241735
17141 206048 402326 292824 333486 473468 312037 96392 185447 161674 527408 351398
17131 351398 83311 470797 335269 123637 226361 312609 348510 203773 412078 396763
17121 396763 449931 470442 402295 323417 164482 605373 518910 482170 465202 408444 283770
17110B83770k1284P4803J32235A14470N26817B25793K29501M1776K84761F6289
17099D30722n2365j34671J83070j73060K91032G5465M54083B37565a25349B17343
17088F86056A68041L97674k05526Q6272B02181J41233J82039k52458J73292P6479
17078E22766k17401o5957O033R5539K00289B07440E3688M60284M2217j45835R1071
17067E01425A48838K38670L13426B61552M00233B94850J64624j93564L83865k77541
17057C72234j09755J26907r1536A10970L17043n8504L56490A06773K30693J56225
17047D93691A99894l6907L44516N4835O7574k73835N2579J41182j62054m7350
17037C40434K46635j00256p1705K7284K57065r0090L1091L4260j68396o3326J61651
$$ plain form
17110 283770 262486 337289 469524 114470 641287 225793 455294 497070 781831 66289
17099 430722 378357 243686 426756 253696 544728 75465 529548 237565 -125349 217343
17088 686056 168041 565715 360189 446461 202181 343414 525453 272995 446287 522766
17078 522766 305365 239408 245441 340980 541269 207440 53688 513972 556189 410354 501425
17067 501425 148838 387508 700934 261552 661785 294850 459474 265910 649775 372234
17057 372234 262479 389386 297850 110970 428013 369509 725999 106773 337466 493691
17047 493691 199894 162987 507503 562338 629912 356077 408656 549838 387784 340434
17037 340434 587069 486813 415108 442392 699457 609367 640458 674718 506322 442996 604647
17026F04647o6940K36461K9644p1566k7474P5111r0274q5972k15735L57852j32169
17015F13585J02495k38155K48752l12901K20223J4188L63315l36636j24859J79698
17005G29705k22035Q8642R2609M3884K34918k05981L8882j20815j06220K69722
16995H43311j96430o5980N1357j58086M81303m19817K66955R5535k79219K21537
16985H40466k1121l11870J38007J9202r9739L07471j23405r4743K70654j57804
16975G67118k4591m8668l5997K72724j62780K35047j17257N6604M2439j70605
16965H14034J08782k61181J25118P0520k8864J80386j24489K37652l05211M06491
16955A223238n09369J11236n9110J2115j00964M53796J4920L36832l87230k51966
$$ plain form
17026 604647 537707 774168 803812 732246 704772 779883 689609 603637 387902 745754 613585
17015 613585 716080 477925 726677 413776 633999 648187 1011502 674866 550007 729705
17005 729705 507670 596312 688921 732805 967723 761742 800624 679809 573589 843311
16995 843311 646881 580901 632258 474172 955475 535658 802613 898148 618929 840466
16985 840466 819345 507475 645482 664684 564945 872416 749011 654268 924922 767118
16975 767118 742527 693859 657862 930586 767806 1002853 885596 942200 984639 814034
16965 814034 922816 661635 786753 857273 828409 1008795 884306 1121958 816747 1223238
16955 1223238 713869 825105 765995 778110 677146 1130942 1145862 1482694 1095464 843498
16945H43498Q4135L15881k1170j54378k1609J38521p6528j30446j70911N82368
16935A389361q2687k33223o0439J0508K1517N3209K80984k40786k1966K75286
16925A391764L80094n28624J98717l08700M30499l13387J98754k6056l0153j40059
16915A252849J26747K3843L6901K07375N7252m11022K38131q9022k20281o8264
16905A154509r6482M89453l8984J52026J72702j2759j74657N7273J17273k79896
16895A540458k9557K43270l8548K50009l88986J13070K42146j79280j72814L62612
16885A942380L2600K0330j01642P5686K2252J9858K26306j12187j75687M40662
16875B390558j67883J14170j36314j31076K58126q0847l1465L56917j73427O7223
$$ plain form
16945 843498 927633 1243514 1222344 1067966 1046357 1184878 1108350 977904 806993 1389361
16935 1389361 1306674 1073451 1013012 1023520 1045037 1098246 1379230 1138444 1116478 1391764
16925 1391764 1771858 1243234 1441951 1133251 1563750 1250363 1449117 1423061 1392908 1252849
16915 1252849 1379596 1403439 1440340 1647715 1704967 1293945 1532076 1443054 1222773 1154509
16905 1154509 1058027 1547480 1508496 1660522 1833224 1820465 1645808 1703081 1820354 1540458
16895 1540458 1510901 1754171 1715623 1965632 1576646 1689716 1931862 1752582 1579768 1942380
16885 1942380 1974980 1995310 1893668 1969354 1991606 2011464 2237770 2125583 1949896 2390558
16875 2390558 2222675 2336845 2200531 2069455 2327581 2246734 2215269 2572186 2398759 2465982
16865B465982Q6222j04576K85685M4627j73416L0035k10965M61787q0295K94124
16855C099210q6435k49002K35851J62362l03226J26897J22441K24750j79749M70936
16845C624035m42926K62063j37267J29553P9742j99540J49996M20312J09175l33773
16835C661370r807L84592p0942k1231L64893k13103j52757K66734J62185R6942
16825D468876r8472O0216J05835M03233O4561O9593l650K57869J6795P8301J11164
16814E534321J38563o2212k8783M62986j02468J84546J94280L41042l37538N79157
16804F903894l07554K50372j32291O26082l69612N55121K85844P6214K91585K7679
16794H207334M01181M60621j65079N91676j72545M16680K28974L62642J47091
$$ plain form
16865 2465982 2552204 2447628 2733313 2777940 2604524 2634559 2423594 2885381 2805086 3099210
16855 3099210 3012775 2763773 2999624 3161986 2858760 2985657 3108098 3332848 3153099 3624035
16845 3624035 3181109 3443172 3305905 3435458 3515200 3315660 3465656 3885968 3995143 3661370
16835 3661370 3651563 4036155 3965213 3943982 4308875 4095772 3943015 4209749 4371934 4468876
16825 4468876 4370404 4430620 4536455 4939688 5004249 5073842 5070192 5328061 5344856 5423157 5534321
16814 5534321 5672884 5610672 5581889 6044875 5942407 6126953 6321233 6662275 6324737 6903894
16804 6903894 6596340 6846712 6714421 7340503 6970891 7526012 7811856 7888070 8179655 8207334
16794 8207334 8608515 9069136 8904057 9495733 9323188 9739868 9968842 10331484 10478575
16785A0478575L96003L78495L20914j37437N97935L77928J97596M03916K33272
16776A3247197P70791K18473M98523L86785N84271P58392J83621Q99904L47677
16767A7895634O66788R49268M62514Q41253P93170R16747R56748O24278J036731
16758B5143131J283175R50819O73990J407966J542639J043241J787178J530728
16750C5362867J667273J711689K102274J679211K388583K256384K541069K535455
16742E2244805L108030K943654L412762L369203L620982M223830M054258M851016
16734H1828540N088163M886424N787018N813345N918268O664858O640286O637889
16726A29264791P272469P370565O487947O896846O832606N679152N355889M448094
$$ plain form
16785 10478575 10874578 11253073 11573987 11436550 12034485 12412413 12610009 13013925 13247197
16776 13247197 14017988 14236461 14734984 15121769 15706040 16464432 16648053 17547957 17895634
16767 17895634 18562422 19511690 19974204 20815457 21608627 22525374 23482122 24106400 25143131
16758 25143131 26426306 27377125 28051115 29459081 31001720 32044961 33832139 35362867
16750 35362867 37030140 38741829 40844103 42523314 44911897 47168281 49709350 52244805
16742 52244805 55352835 58296489 61709251 65078454 68699436 72923266 76977524 81828540
16734 81828540 86916703 91803127 97590145 103403490 109321758 115986616 122626902 129264791
16726 129264791 136537260 143907825 150395772 157292618 164125224 169804376 175160265 179608359
16718A79608359L322871K311917R59649k15852j489035k556327l868681m650246
16710A73422655n709160n576790p376352p074831o961304p532996p107501o930293
16702A19153428o835089o663906o161296n462711n949848n150287m873254m915109
16694G3141928l867247m145258l893222k951133l466574k642641l151532k455350
16686D6568971k523941k154446k271893j598368k152192j632828j440938j580720
16678C1213645j470467j463429r84275j016429j573330q07637p77564j174740
16670B1945774j058340k13805r93632o05308j250093l93805l22654q00335n63528
16661A5744274p82014k49108o87287l36939o60011j03323n23709l08009k23064
$$ plain form
16718 179608359 182931230 185243147 186202796 185986944 184497909 181941582 178072901 173422655
16710 173422655 167713495 162136705 154760353 147685522 140724218 133191222 126083721 119153428
16702 119153428 112318339 105654433 99493137 94030426 88080578 82930291 78057037 73141928
16694 73141928 69274681 65129423 61236201 58285068 54818494 52175853 49024321 46568971
16686 46568971 44045030 41890584 39618691 38020323 35868131 34235303 32794365 31213645
16678 31213645 29743178 28279749 27295474 26279045 24705715 23898078 23120514 21945774
16670 21945774 20887434 20673629 19679997 19074689 17824596 17430791 17108137 16307802 15744274
16661 15744274 14962260 14713152 14025865 13688926 13028915 12925592 12401883 12093874 11870810
16652A1870810q24137l62876l9608n15847p3236m76808l92298J73225k87672l69908
16642H701645k59476j95652l17103l76546j37805Q1686m52485L112O609k10177
16632F843808j63640m25142o9910J57330l89287n60142J31275J1062l7844j43069
16622E354441k28836Q1034j37047l22764K28806l25446j21166j40817l759l49458
16612D034988K33981k83078J77798k19385N3010j98378l31529O14406o49061K8818
16602C461570J80869k30386p3282k24159L9054j38192l95251L72075K38640l9962
16592C190976n52993K50989J3007k88304J60008m3305l24348J20139l0460J01017
16582B596726n3199r6296m7353n4542R4927m06169j780L13615j39687K06710j52680
$$ plain form
16652 11870810 11046673 10683797 10644189 10128342 10055106 9578298 9186000 9359225 9071553 8701645
16642 8701645 8442169 8246517 7929414 7552868 7415063 7496749 7044264 7047376 7053985 6843808
16632 6843808 6680168 6255026 6185116 6342446 5953159 5393017 5524292 5535354 5497510 5354441
16622 5354441 5125605 5206639 5069592 4746828 4975634 4650188 4529022 4388205 4384446 4034988
16612 4034988 4268969 3985891 4163689 3944304 3997314 3798936 3467407 4081813 3432752 3461570
16602 3461570 3642439 3412053 3338771 3114612 3153666 3015474 2620223 2992298 3230938 3190976
16592 3190976 2637983 2888972 2901979 2613675 2773683 2730378 2406030 2526169 2495709 2596726
16582 2596726 2543527 2447231 2399878 2345336 2440263 2034094 2032314 2345929 2206242 2412952 2260272
16571B260272l74710P2590L66090l31221K54859m24010Q8220K2718k56812N9394
16561A737390o665K35002n25612j53260O2567J94074K51232k78655j34321J77332
16551A559084L3301l5139J01292o01186L17313j51390j06829K94533k75410L20885
16541A456454q276J08763j79587j23269L79948n73685M36176m22130L94749k61471
16531A207672j90608j72032L33505o5497K77330J3645k62786j26172K33238m04899
16521H43396J60758k2209L74614j1939m46184J17733j43202P5990L35653k21410
16511A063200k39606k7699K44707l38300J57596j21341K3941J85034J25871n3381
16501A020022M5435j2043k91501j72553J26253k71313N36757k27189j28992M94918
$$ plain form
16571 2260272 1885562 1958152 2324242 1993021 2247880 1823870 1912090 1934808 1677996 1737390
16561 1737390 1730725 1965727 1440115 1286855 1349422 1543496 1794728 1516073 1381752 1559084
16551 1559084 1592385 1557246 1658538 1057352 1374665 1223275 1116446 1410979 1135569 1456454
16541 1456454 1448178 1556941 1377354 1254085 1634033 1060348 1496524 1074394 1469143 1207672
16531 1207672 1017064 845032 1178537 1113040 1390370 1404015 1141229 1015057 1248295 843396
16521 843396 1004154 981945 1356559 1344620 898436 1016169 872967 948957 1284610 1063200
16511 1063200 823594 795895 1040602 702302 859898 738557 762498 947532 1073403 1020022
16501 1020022 1065457 1053414 761913 589360 715613 444300 981057 753868 624876 1119794
16491A119794n22435L06877j27723j8166q0446M4701J56829j77795R2463R876
16481H03975l3180k38455J33249m1539l0636k6192l043K69141p8106j03661j32459
16470E19094J77472B60093K72127m1607j19665L87916C79273K96219k43194J90519
16460F22817N6313J33446k53036L5830k58124n5247K68547m5690J67761B09579
16449I63189D28682j10137A22174N77975k49096K42132k86981J54470J51777k43385
16439D69066Q5748k17723L54184C18037L13671J297J58619l21764O4936F0911
16428F80294k69109l851J0403j9332j35891J40952A50623K92360K27273j63637
16418E06619P2406L30129B38819Q168p1312J04841M8275k0695K03054j19808j6054
$$ plain form
16491 1119794 597359 904236 776513 758347 677901 722602 879431 701636 794099 803975
16481 803975 770795 532340 665589 624050 593414 567222 564179 833320 755214 651553 519094
16470 519094 696566 260093 532220 490613 370948 758864 379273 675492 432298 622817
16460 622817 679130 812576 559540 595370 337246 281999 550546 504856 672617 209579
16449 963189 428682 318545 122174 700149 451053 693185 406204 560674 712451 469066
16439 469066 554814 337091 691275 318037 631708 633005 791624 469860 534796 60911
16428 680294 411185 407334 417737 398405 262514 403466 150623 442983 670256 506619
16418 506619 579025 909154 238819 246987 175675 280516 328791 308096 511150 391342 375288
16407C75288J62043B23143O2653J16315I3908K66223o3370J69427D7337J73444
16397B20781J59465j68772O105f854D54465L7014F4251J82872P1717m2864J75672
16386D51648J32107j54329j49682J08016K65636k09082j03796K48307A79139p42
16376A78397Q3607K80537k57340A33207R5955N0942o9368O6580K8567K21891a72304
16364E60691A60317N74662A44684L60837A0417J3561L51089p2312A29913a58153
16353H5256N4406N3428j8125J90617b46020O9031B09498H7343a8164A55086k0775
16342A34311J3219n2978K59046j40776k509D9066L61983j21691p7028a96853m4258
16331b41111I0702J48188j9802L3760j0556j20891K51918C4473b16883B50598
$$ plain form
16407 375288 537331 223143 285796 402111 93908 360131 296761 466188 47337 220781
16397 220781 380246 211474 217579 -6854 454465 491479 64251 247123 318840 275976 451648
16386 451648 583755 429426 279744 387760 653396 444314 340518 588825 179139 178397
16376 178397 262004 542541 285201 133207 229162 280104 210736 277316 305883 527774 -172304
16364 560691 160317 734979 144684 505521 10417 23978 375067 302755 129913 -158153
16353 85256 139662 193090 174965 365582 -246020 -176989 209498 87343 -18164 155086 134311
16342 134311 147530 94552 353598 212822 210313 49066 411049 289358 212330 -196853 -241111
16331 -241111 90702 238890 219088 252848 242292 121401 373319 34473 -216883 250598
16320C415L62418a75499B2748J16736C9742h145E0900J51646K4163c9187D06442
16308B78473Q953H5971O3308a9392A57741b8689B08969j8082e9245C10634a036
16296A18777J85986A05619J32359G1848p537a48112d1395q981A31493h5552d1064
16284B45940I5938K26229Q9048A03331Q1981a58612C27834q9181a894m0619j04004
16273a46517A01837f2807j20437F682N7043o846N3329h4001A9952J21006f4693
16261b3082C05000k9411a26427B17141A03518h530D2225N1627a65987A02868f473
16249c02833F1244L8263g1929H8683J0482b35017C40243b1137m5449C21496b6072
16237A85429J74821h5031j11979C55256A42343K5334a39643B48428A05470Q4319
$$ plain form
16320 3415 365833 -175499 22748 139484 39742 -8145 50900 202546 226709 -39187 406442
16308 278473 287426 85971 149279 -19392 157741 -28689 208969 190887 -59245 310634 -1036
16296 118777 304763 105619 237978 71848 64311 -148112 -41395 -50376 131493 -85552 -41064
16284 245940 95938 322167 411215 103331 185312 -158612 327834 238653 -1894 -42513 -146517
16273 -146517 101837 -62807 -183244 6682 63725 56879 110208 -84001 19952 140958 -64693
16261 -23082 305000 275589 -126427 217141 103518 -8530 42225 93852 -165987 102868 -6473
16249 -302833 61244 99507 -71929 88683 99165 -235017 340243 -21137 -66586 321496 -26072
16237 185429 360250 -85031 -197010 355256 142343 167677 -139643 248428 105470 189789
16227A89789P0947a97394A9995a3615j38396A81713D0231j682a06415M6578q468
16216f8305B54342c0827A25325B4159e3851j12935D1306a11288B08463c45256
16205i1704g129B38248a21169A05210l647c50587H3739C5117k181a52617C00239
16193e6318A08823a78678o1211B68937j04498a94450A31241O9418I7685q833J2346
16182A01198a04664C7638K34871b943D82213j31628j00588b46219C31502a50932
16171A28518b54582d4289F9474g9806F5346g316m936o7269A33918K2886o8660
16160H8144O3665N411D2127J09604J12779A456b57209m8601f8807D5990L6103
16149H2093b27830A88367q1056a41543I3653a05882o4113g1335l17239A97165
$$ plain form
16227 189789 260736 -197394 19995 -13615 -152011 181713 40231 38549 -106415 -59837 -68305
16216 -68305 254342 -30827 125325 24159 -53851 -166786 41306 -111288 208463 -345256
16205 -91704 -7129 238248 -121169 105210 101563 -350587 83739 35117 32936 -152617 300239
16193 -56318 108823 -178678 -239889 268937 164439 -194450 131241 200659 97685 88852 101198
16182 101198 -104664 37638 272509 -2943 482213 350585 249997 -246219 331502 -150932
16171 128518 -254582 -44289 69474 -79806 65346 -7316 -12252 -79521 133918 156804 88144
16160 88144 151809 157220 42127 151731 264510 1456 -257209 -305810 -68807 45990 82093
16149 82093 -227830 188367 107311 -141543 93653 -105882 -169995 -71335 -388574 197165
16138A45433a83273k1205M0842H6163D0777j9691a54262d1419A15562a54056B16736
16126A39321f1914A8731a12146F4657C2117R7665F2264J3293a27179d035l8449
16115d2484j75087L9207P54E363N9787b14507j04782b4313j81110i1987A32317
16103b17886C2010b49783A86882a1116A53517a35705F0993A3144J50228F2516
16092c1708A51171a88061B65513a78201A88707o8878a50811n3946l4536A28794
16081C0498o881K60158b95256M8081B22540a28904B07569h3539j24660G9789J96695
16070B76484b23800B30377a02514I0280R4944c5114m249C10400j01266m4484F4825
16058F6711h4505D2306a43369E24512g0337j96468e1369k3360L3261B71998A00409
$$ plain form
16138 145433 -183273 -204478 -163636 86163 40777 21086 -154262 -41419 115562 -154056 216736
16126 139321 -61914 18731 -112146 64657 32117 129782 62264 75557 -127179 -4035 -42484
16115 -42484 -217571 -178364 -177610 5363 65150 -214507 -319289 -24313 -205423 -91987 132317
16103 -217886 32010 -249783 186882 -11116 153517 -135705 60993 13144 163372 62516
16092 -31708 151171 -188061 265513 -178201 188707 119829 -150811 -204757 -239293 128794
16081 30498 23617 283775 -295256 -247175 222540 -128904 207569 -83539 -208199 79789 276484
16070 276484 -223800 230377 -102514 90280 185224 -35114 -39363 310400 209134 164650 64825
16058 66711 -84505 42306 -143369 524512 -70337 -266805 -51369 -74729 -41468 271998 100409
16046d3132B05252F038O0537b59877c1341j42314j74502C73311I033P0715h0437
16034I0381j2880b8489j1753a7057B09908a42059j32080F8623a11220B82873b21780
16022i1192C02902Q3671a24080j3329L7347k18230b8128l00821R5460B2313K26569
16011B48882c58744F4730K53882a35674G7925c6078A86549h7672c8179B25795
16000E071L9711b31951g7531l6816B05397j5143c3792F6471c1779B2903j1201
15989A1702i5600j79222B70213C7966J69037N4537J37722A77992J18833L8316
15979C35141K47804e2428j20588k76500a57418n5252A40975B2787a95220H6973
15968i8943c2887D4756L1643K23629c34244f9373k41417B75647j33278e4673g090
$$ plain form
16046 -43132 205252 6038 66575 -259877 -31341 -173655 -348157 373311 9033 79748 -80437
16034 90381 77501 -28489 -40242 -17057 209908 -142059 -274139 68623 -111220 282873 -221780
16022 -91192 302902 386573 -124080 -137409 -100062 -318292 -28128 -328949 -233489 22313 248882
16011 248882 -358744 64730 318612 -135674 77925 -36078 186549 -87672 -38179 225795
16000 5071 44782 -231951 -77531 -114347 205397 190254 -33792 66471 -31779 22903 11702
15989 11702 -95600 -274822 270213 37966 207003 261540 399262 177992 296825 335141
15979 335141 582945 -52428 -173016 -449516 -157418 -212670 140975 22787 -195220 86973
15968 -98943 -32887 44756 76399 300028 -334244 -69373 -310790 275647 142369 -54673 -7090
15956a23826I3686h9350m67919A947K56942c9647k0800C942J11052a74722M7032
15945a27690D1257J91739a60512K1913J4636j33366a13488h530l52712i5231B342
15933a89540l359e5417j35896j5655g5509g378B8478i8729i506E4785M1877a21371
15920b64299m5026G2527a74477h0266F6141j7340a35916J9630a4987l4904o8213
15909a18104M5741B9576J31825F6823a8499j64417A54345o4360J08395b43299
15898f0112J521A2337b65965J21992k32246A88778a73152P4752A88079a92322
15887d47176e8249J8426k03021d3926B66404F9178J25885b87191B1836a11564
15876d52F1780a93378H9134J70082B9284b98181G7109b85140K6785f0787a2176
$$ plain form
15956 -123826 93686 -89350 -557269 1947 258889 -39647 -60447 3942 114994 -174722 -127690
15945 -127690 41257 232996 -160512 -138599 -123963 -257329 -113488 -8530 -361242 -95231 2342
15933 -189540 -192899 -55417 -191313 -206968 -75509 -7378 28478 -98729 -9506 54785 96662 -121371
15920 -264299 -309325 72527 -174477 -80266 66141 48801 -135916 -116286 -14987 -49891 -118104
15909 -118104 -72363 29576 161401 66823 -18499 -182916 154345 89985 198380 -243299
15898 -60112 -58591 12337 -265965 -143973 -376219 188778 -173152 -98400 188079 -192322
15887 -447176 -58249 -39823 -242844 -43926 266404 69178 195063 -287191 21836 -111564
15876 -452 61780 -193378 89134 259216 29284 -298181 77109 -285140 -258355 -60787 -12176
15864a71293l43302b47307B89330A2201a12018b0283F7575K00647N5295A7678
15853I0152J22604a35796A22446J65850g5811A9385a03778A98618b17916J03461
15843a14455j83559C06100r4304c05339b9353E4333d279A8407b43821A32814o90
15832A32124B6682d7569k56080A87575D1525Q7137a80090a3194k21512d9499F8391
15820i5281N261L2656j29563G4977J4997c00716F867R6326b48145J12578A95597
15808C01672r2506b53044c226r6179k2554G1438L0395Q4608b83606A25381g4445
15796A75212e9555K1076B36363Q2261l0493a5960l8897j3445j04651A15795K19189
15785C34984G5077k3899a16322d8974j11345o1692A64080G8634G616N4901A1911
$$ plain form
15864 -171293 -514595 -247307 289330 12201 -112018 -20283 67575 268222 323517 17678
15853 90152 212756 -135796 122446 288296 -75811 19385 -103778 198618 -217916 -114455
15843 -114455 -298014 306100 211796 -305339 -29353 54333 -4279 18407 -243821 132814 132124
15832 132124 26682 -47569 -303649 187575 41525 128662 -180090 -13194 -234706 -49499 68391
15820 -95281 -90020 -57364 -186927 74977 89974 -300716 6867 103193 -248145 -135567 195597
15808 301672 209166 -253044 -3226 -99405 -121959 71438 101833 186441 -283606 125381 -74445
15796 175212 -59555 -38479 236363 318624 288131 -15960 -54857 -68302 -172953 115795 334984
15785 334984 75077 51178 -116322 -48974 -160319 -222011 164080 78634 7616 62517 11911
15773A01647b8551D8364b46840a1619m5074C0832i3510K9427A27732b83529N0055
15762b33474A94444B8156c72987B18662B9479b06695I634a79528A45579R992a4130
15750B05686b65174p7931c0517q6922A89903C4453K25187a88432B47264i2924
15739b3937n1588B41850e6712l19968A32388a91914Q6984A24855b53318d6222
15728C1045c4524l30859D5575a00632r6346L0614j19538J10420A18895f1472B0548
15716a16513K5351b3529F0345g3229A77266J7169A7232a60518p0219A95626h8162
15704I2968J16775n4308a18358A96877a50880J0012N0129A76012c1560n3443C21602
15692e8274j24715G2454E215Q4785K1135c15258a09581C17832a99210f5085j29839
$$ plain form
15773 101647 -28551 48364 -246840 -11619 -56693 30832 -93510 -64083 127732 -283529 -233474
15762 -233474 194444 28156 -372987 218662 29479 -206695 9634 -179528 145579 155571 -14130
15750 205686 -265174 -343105 -30517 -117439 189903 34453 259640 -188432 247264 -92924
15739 -23937 -75525 241850 -56712 -376680 132388 -191914 -104930 124855 -253318 -46222
15728 31045 -34524 -365383 45575 -100632 -196978 -166364 -285902 -175482 118895 -61472 20548
15716 -116513 -91162 -23529 60345 -73229 177266 194435 17232 -160518 -230737 195626 -88162
15704 92968 209743 155435 -118358 196877 -150880 -140868 -90739 176012 -31560 -85003 321602
15692 -58274 -182989 72454 5215 90000 111135 -315258 -109581 317832 -199210 -65085 -194924
15681a94924f289h73A59813e1258A53105J2391c1427k63491a0251j86858A24023
15669b6114A89935c03867h62A20743J56785b02758j16252J02511D6329h2667j42371
15658b25038M4631A31570c46767J18156R9461D54368d23431K05670b221r1202
15648i3423a495G9311j5217b47945B01431q4832a80555C7152a88504J3976E1550
15636B51397j22514a60373g2218r9869O1027k13110E834a26134A46533o6633c79495
15624B67517K1099c6298r1294A3807O6084f0881K7452D2932a34849c615m49158
15613d52773A85004a15116j7571A53132J12588c05297B34167q1019b61793q8941
15603c50734a52605G3550a26339c6046A52258C4040g9553j80159A415g5090C41128
$$ plain form
15681 -194924 -6289 -873 159813 -51258 153105 165496 -31427 -294918 -10251 -197109 124023
15669 -26114 189935 -303867 -862 120743 277528 -202758 -319010 -216499 46329 -82667 -225038
15658 -225038 -180407 131570 -346767 -228611 -129150 454368 -423431 -217761 -2221 -93423
15648 -93423 -1495 79311 64094 -247945 201431 116599 -180555 37152 -188504 -174528 51550
15636 251397 128883 -160373 -72218 -172087 -111060 -324170 5834 -126134 146533 79900 -379495
15624 267517 288616 -36298 -127592 13807 79891 -60881 -33429 42932 -134849 -3615 -452773
15613 -452773 185004 -115116 -132687 153132 265720 -305297 234167 153148 -261793 -350734
15603 -350734 -152605 73550 -126339 -36046 152258 34040 -79553 -259712 1415 -75090 341128
15591A10416f149A61097B6367J236K38808k8642c3226m1255L2167A23598a00358
15579A40314B3757K9539K1994a14685B22160m1093g0049m37564C56366B6884K5457
15568E2341b61872B4678b04986i3543L8717j71004M4554A71467E869J049K65407
15557B72325G7281L9882a00843j06860j97529f2338j28055p3721P9165C66582
15546A94726M9146d5472r0031G9406K36553A49877c7434k28760I9824D547f5890
15534A63083e4487r2681k18853a28706A18941D7960b34263h6847j2361k09164
15524c08372a14737D05742A30916J44713I6755f6788G669L16579I2287a12077
15513b56376G4140C5154e7186o112q7528n9433A36182R2604b00801G1722r19A0845
$$ plain form
15591 110416 -6149 161097 26367 27603 266411 237769 -33226 -74481 -42314 123598 -100358
15579 140314 23757 53296 75290 -114685 222160 181067 -70049 -507613 356366 26884 52341
15568 52341 -261872 24678 -204986 -93543 -54826 -225830 -181276 171467 5869 6918 272325
15557 272325 77281 117163 -100843 -207703 -405232 -62338 -190393 -264114 -184949 366582
15546 194726 243872 -45472 -135503 79406 315959 149877 -37434 -266194 99824 4547 -65890
15534 163083 -54487 -147168 -366021 -128706 118941 47960 -234263 -86847 -99208 -308372
15524 -308372 -114737 405742 130916 275629 96755 -66788 7669 324248 92287 -112077
15513 -256376 74140 35154 -57186 -63298 -150826 -210259 136182 228786 -200801 71722 70803 10845
15500c2720G0641C2020a58930j31526c1704r409j32542h2693d78B25068c18945
15488a1677j92019d0868k1731E8350a10262k5441L3502K5380j38413a9276k60129
15477b79405J25774A15771L31375k19630a98561B90151A18245A5380K36956i1535
15466C0176K59284E6735J69253N7691a08428c9813C16226e8654k00989e258B29125
15454c7459C02989B1364F448J38417q281a84108n2299k6314A42548a61894A45683
15442H2994b12779M3707j0307A04771a3203l0646J9727j17414C38676J9056C1080
15430a77600A48762a05708j96103f0923j22615H0089e0199E0609a24444I9113
15419F6296b21909q6062a20718p1336A49091O7817p9916a3757k9975q3543b7058
$$ plain form
15500 -32720 70641 32020 -158930 -290456 -31704 -41113 -173655 -82693 -478 225068 -318945
15488 -11677 -203696 -40868 -62599 58350 -110262 -135703 -102201 -76821 -215234 -19276 -279405
15477 -279405 -153631 115771 447146 227516 -198561 290151 118245 15380 252336 -91535
15466 30176 289460 56735 225988 283679 -108428 -39813 316226 -58654 -259643 -5258 229125
15454 -37459 302989 21364 6448 144865 136584 -184108 -236407 -262721 142548 -161894 145683
15442 82994 -212779 -169072 -179379 104771 -13203 -43849 -24122 -141536 338676 357732 31080
15430 -177600 148762 -105708 -301811 -60923 -183538 80089 -50199 50609 -124444 99113
15419 66296 -221909 -307971 -120718 -192054 149091 216908 136992 -13757 -43732 -127275 -27058
15407F7930c20762d3622j04004a2963j90193A44972h2290l4925j87323B07128
15396C44632B8254J12646c8066C5714J1733a23327I1001l2044b75099k5319B69587
15384A50688a1225C12771H7868g5749j32381F2853b20736F9670a30794F4290f9412
15372I4804g1651b3712k94888A9664c52919D2083c1357a3563A57834a0440G2754
15360H8860P9951A1267K62181A23689J87345A06015g0918G4691g4885j4422k01271
15349b90578B12049e7282I4536C7958L1173g8641A13793m4540a98405D02099a78445
15337b10730A36905B2849J41275o9192c26023L7676A62505a04470A41337a11786
15326d6291B04738r7061A8209O3164P1345l2647a80233A10648b45152a06954E1468
$$ plain form
15407 67930 -320762 -43622 -147626 -12963 -203156 144972 -82290 -117215 -304538 207128
15396 344632 28254 140900 -38066 35714 47447 -123327 91001 58957 -275099 -300418 269587
15384 150688 -11225 312771 87868 -75749 -208130 62853 -220736 69670 -130794 64290 -69412
15372 94804 -71651 -23712 -318600 19664 -352919 42083 -31357 -13563 157834 -10440 72754
15360 88860 168811 11267 273448 123689 311034 106015 -70918 74691 -74885 -89307 -290578
15349 -290578 212049 -57282 94536 37958 69131 -78641 113793 69253 -198405 402099 -178445
15337 -210730 136905 22849 164124 94932 -326023 -288347 162505 -104470 141337 -111786
15326 -46291 204738 107677 18209 81373 152718 120071 -180233 110648 -245152 -106954 51468
15314b17441M8590B5023O4095M2510h2130A83061b4445C17999O5932a34935d4016
15302A78641b5987m2332b0767q0641A64824a85302D30044h4180a1757F072a15283
15290D7025h6391A71019e53475C17486l3389A23904J169Q8935c80298K7046A94085
15278E3070a76383l8778b3920A83101O0279a01229C29366A15672k204J55447B2609
15266B70207K06632d112G232R2529A6825E104b42791F2010K67288C9348R5522
15255A34870K43979J3564j59647F1741a3336A56367J92883R9941N38457P67021
15245A754669o51977Q16454n09949D47898k14687I9353j7294f882A21840D5439
15234A45611m8153K1993a10659H8543N6573O7973b170j24254M8137A95339J28704
$$ plain form
15314 -217441 -168851 25023 89118 131628 -82130 183061 -24445 317999 383931 -134935 -44016
15302 178641 -25987 -68319 -20767 -101408 164824 -185302 430044 -84180 -11757 6072 -115283
15290 47025 -86391 171019 -553475 317486 284097 123904 125073 214008 -380298 -353252 194085
15278 53070 -176383 -215161 -23920 183101 243380 -101229 329366 115672 113468 268915 22609
15266 270207 476839 -4112 7232 99761 16825 5104 -242791 62010 329298 39348 134870
15255 134870 378849 392413 232766 61741 -13336 156367 349250 449191 987648 1754669
15245 1754669 1102692 1919146 1409197 447898 233211 99353 82059 -6882 121840 45439
15234 145611 97458 119451 -110659 88543 145116 213089 -2170 -126424 -78287 195339 324043
15223C24043a68159G6577J68722n2034A8871h5708K249A30079c0115a2388k59797
15212b72185l5904A26217a79426O3390A71981h1310A4109O300a38955L0858A54039
15200F5553a2719F9783M886J7253l1773a03940D5827a80727a2537F2292K6601
15189H8893J44404a563j47723A2813L5740c0153j8662C18469M9299C238J27634
15178A30872F440L38988A24639e5239k65765A49404c64463e5626C63997c04842
15167B97448b86016G3866A7288d4177A4251c5071D02248n750j51889A2162b12815
15155c5308F8859A4992J43995J6559D1909i605A87157a4357l8250A42731K3669
15144A66400J06266b0473j56251f8362C02886j21470G4942R3084J13869a72312
$$ plain form
15223 324043 -168159 76577 245299 193265 18871 -85708 -83459 130079 -30115 -12388 -272185
15212 -272185 -308089 126217 -179426 -116036 171981 -81310 14109 20409 -138955 -108097 154039
15200 65553 -12719 69783 74669 91922 60149 -103940 45827 -180727 -12537 62292 88893
15189 88893 233297 -1563 -149286 12813 48553 -30153 -48815 318469 367768 3238 130872
15178 130872 6440 345428 124639 -55239 -321004 149404 -364463 -55626 363997 -304842
15167 297448 -286016 73866 17288 -44177 14251 -35071 402248 396498 244609 12162 -212815
15155 -35308 68859 14992 158987 175546 41909 -9605 187157 -14357 -52607 142731 166400
15144 166400 272666 -20473 -176724 -68362 302886 181416 74942 168026 281895 -172312
15133H0383N1462L3766j8544N0746a68214A2162b28345A8681K14813B7483J20097
15122A47580a08047B50146a10486B47733A14317J04488a7540G9317C1283c35199
15111G9237J78067n4403J8842P0540c11723C16135j14853a75406B40071d2398
15100H1681J43101G1062L18073G8456L71059A98906K4358q9523c03086d2777B8383
15088A98837a10009A00816a51478B63186Q0435F8199a05343A99638r5492r732
15078I4414J38627q6749e5189B52324C7205K12365a84965a6060H2289K52385b28841
15066e4137m8058k65368b3905C21800j60095a68258A69297F6920J48472R6132
15056C11524l4644q7300C4036b079H3023b4384C63073n8658J2661l5730a07113
$$ plain form
15133 80383 131845 165611 147067 197813 -168214 12162 -228345 18681 233494 27483 147580
15122 147580 -108047 250146 -110486 247733 114317 218805 -17540 79317 31283 -335199
15111 79237 257304 202901 221743 292283 -311723 316135 201282 -175406 240071 -42398
15100 81681 224782 71062 389135 78456 449515 198906 223264 133741 -303086 -42777 28383
15088 198837 -110009 100816 -151478 263186 343621 68199 -105343 199638 104146 94414
15078 94414 233041 146292 -55189 252324 37205 249570 -184965 -16060 82289 334674 -228841
15066 -54137 -102195 -367563 -23905 321800 161705 -168258 169297 66920 215392 311524
15056 311524 276880 189580 34036 -2079 83023 -24384 363073 304415 317076 281346 -107113
15044a56276d6718C02071J46680j61528K8486D6388J80011F5478J68089Q7222
15034C20789c3113B29126A3507J69597p2541P395L8092b68981A09998a03319R468
15023i3851i557j78022D16119J24477A13230k5440J22781c674A48424a21860A95544
15011B18917M2870J94835d8857A64418q0893i841C98499B2203a25149D62814a06702
14999C02190J27520I3586K70207j26814K1083n120I9171L18326E5866L57397A49595
14987D3622J23759n0344J12501o1554a00081E0121K14725J4391j4543O1799M4715
14976C71208a14970A21431L35142j79160o0129P4317k5483f0530C26835L8604
14966C65439j27373P7682E0026J43954c7817B66867q9338o6884J43533j07636
$$ plain form
15044 -156276 -46718 302071 448751 287223 315709 46388 226399 65478 233567 320789
15034 320789 -33113 229126 13507 183104 110563 117958 156050 -268981 109998 -103319 -93851
15023 -93851 -9557 -187579 416119 540596 113230 87790 210571 -3674 148424 -121860 195544
15011 218917 261787 456622 -48857 164418 83525 -9841 398499 22203 -125149 462814 -106702
14999 302190 429710 93586 363793 236979 258062 252942 99171 417497 55866 413263 149595
14987 43622 167381 117037 229538 167984 -100081 50121 264846 279237 264694 326493 371208
14976 371208 -114970 121431 456573 277413 217284 291601 266118 -60530 326835 365439
14966 365439 238066 315748 50026 193980 -37817 266867 177529 110645 254178 146542
14956A46542F127J97703l8496J41572j16767J01890J75702r6701n1358I9876J09338
14945B09214R7482N3500r4199I0205M58433B56651K53279A97647K73218h173E06031
14933F46953A67890b62630B71786H9896J05551r0898J20581m6789Q8374A10877
14922C31490j60636J48052e2039B15729K5061J4467R6995n7296A40022R9977A14352
14910A63266K12016l5095B4887L79889K3058B07174c8312D39436r3037m9651m8152
14899B48596L12447F4524K16162L00419B02731J57649l522F9082K41650j24040
14889A86692K44884j30799q7065K19539k1324p958o0070A48695K34809K36363
14879F19867k76065k7885P1089j18126A32181M30054p0122j50133J52738d6464
$$ plain form
14956 146542 6127 203830 165334 306906 190139 292029 467731 371030 319672 99876 209214
14945 209214 306696 360196 265997 90205 548638 256651 509930 197647 470865 -8173 506031
14933 646953 167890 -262630 271786 89896 195447 104549 225130 178341 266715 110877
14922 331490 170854 318906 -52039 215729 240790 255257 352252 294956 140022 239999 114352
14910 163266 375282 340187 24887 404776 427834 207174 -38312 439436 346399 296748 248596
14899 248596 561043 64524 280686 581105 202731 360380 356858 69082 310732 186692
14889 186692 431576 300777 213712 433251 411927 403969 343899 148695 383504 619867
14879 619867 343802 315917 387006 268880 132181 562235 492113 341980 494718 -46464
14868C32588J48262Q0083k57136j33403j5165k1719J30187O2105A41658K8821
14858A70479J54773K3321A14072L51800A84747L3602K5248K70267H0016K08149
14848B88165J81239j89280K60050k41182J37413K27925B87368N0175J81745E743
14837C10534Q7650N046L11098A63138J93813n6074J35235A47289B9289L32864
14827C62153O1750A96578K14984A14807K73628K37439j81519l8634A53162K66205
14817D19367j44412K92465A52006N03486k17659m7236j21164O04538m17709l2263
14807D23999O5256J25796A58725L7428M75421B60606L43853J1933j11036j36131
14797C69225n944M17029l63242J74567J35802k06156k46402K46273p2879j06913
$$ plain form
14868 332588 480850 560933 303797 170394 155229 133510 263697 325802 141658 170479
14858 170479 325252 348573 114072 465872 184747 218349 243597 513864 80016 288165
14848 288165 469404 280124 540174 298992 436405 664330 287368 337543 519288 5743
14837 310534 398184 403230 714328 163138 356951 300877 436112 147289 29289 362153
14827 362153 423903 196578 411562 114807 388435 625874 444355 405721 153162 419367
14817 419367 274955 567420 152006 655492 437833 390597 269433 873971 456262 423999
14807 423999 489255 615051 158725 196153 671574 260606 604459 616392 505356 369225
14797 369225 363281 780310 417068 591635 727437 521281 274879 521152 448273 341360
14787C41360J0982K7303A84180K00261m5586L76344B44120M13723r656j16027
14777E32160N9429j46778N7517r511J07038j06543m9567A74899N49586k03681
14767E20804n063J97854o1j45181k26224K69489R558j64761M1893l9620K68170
14756G26858Q8445k98337J27909j27645J64508O5470C06524R2192K05693j61924
14746D42485J11862l9832M03389j27716j13916j97292K18086k67249N74149m42817
14736E61149K32166l43063j14636k5730M95690J301j11498k09692r9955L77049
14726G62781r2385Q1969C67592L50006j35589J28663K22248l42198k17829j32671
14716B40222M61596K7511J08557j77245p4394M0269K3375k6091n8967L18768C26677
$$ plain form
14787 341360 352342 379645 184180 384441 338855 715199 244120 657843 648187 532160
14777 532160 591589 444811 502328 492817 599855 493312 443745 174899 724485 520804
14767 520804 515741 713595 713534 568353 342129 611618 621176 456415 498308 458688 726858
14756 726858 815303 516966 644875 517230 681738 747208 306524 398716 604409 442485
14746 442485 554347 514515 917904 790188 676272 478980 697066 429817 1003966 561149
14736 561149 793315 450252 335616 309886 805576 806877 695379 485687 385732 762781
14726 762781 670396 752365 367592 717598 582009 710672 932920 590722 372893 240222
14716 240222 701818 729329 837886 660641 586247 626516 649891 623800 564833 883601 326677
14704G89487j77928J71139j90782J69423l29085j31508N86478L492j67472o9397
14694F53847J0503L03239j54128k50912O93325n09826L890j60199J52434L7085
14684G79258N5329L7148o2673k63815N89541m05393J08021Q7305K10962m21896
14674G13787J95613O2605k24478K00725J13968k00618N8239K34501O0608n00345
14664G14605M05295q0106k53554m3470M42706j38150J29244k52058k0304j24264
14654G79944P0780J06871J14216P634j62362k94871N78444l52367K02332P3025
14644A123646j64830L37503j69634J4068J37197K6861l08300K81178j52544O4661
14634A189806j12618j61143L56677k85888j63866K30323J91711j39283J8793L97038
$$ plain form
14704 789487 611559 782698 591916 761339 432254 300746 887224 890716 723244 653847
14694 653847 664350 967589 813461 562549 1255874 746048 749938 589739 742173 779258
14684 779258 834587 871735 809062 545247 1134788 729395 837416 924721 1135683 713787
14674 713787 909400 972005 747527 948252 1062220 861602 919841 1154342 1214950 714605
14664 714605 1119900 1039794 786240 742770 1185476 1047326 1176570 924512 904208 779944
14654 779944 850724 957595 1071811 1079445 917083 622212 1200656 848289 1050621 1123646
14644 1123646 958816 1296319 1126685 1140753 1277950 1304811 996511 1277689 1125145 1189806
14634 1189806 1077188 916045 1272722 986834 822968 1053291 1245002 1105719 1124512 1521550
14624A521550o35414L47769j9657K151J426J78807o1465J77496j39982p6854k63401
14613A032426J05971K46822j00788j98068M17769j66331k0473P5895O6765L5845
14603A495833J89369l81027j9294j9473j71387K00215j6591K37529o2424K40824
14593A693574q6539K29274j75725k85986J02503L34842J13347k23778k73057J50150
14583A578605J90136j31012p3600j44390L47261k47643M8707L10931j17338K21017
14573A982674n31306K77041N27352p9905r2827M26050l42944J84117l75825M43531
14563B417958m23157J60545k10011N09603J25897k32101L47307O7125J36072J49265
14553C048503K34141K65558M31542J149939J909125L493408P945504J8479565
$$ plain form
14624 1521550 886136 1233905 1214248 1216399 1217825 1396632 1335167 1512663 1372681 1295827 1032426
14613 1032426 1138397 1385219 1284431 1086363 1504132 1337801 1317328 1393223 1459988 1495833
14603 1495833 1685202 1304175 1284881 1265408 1094021 1294236 1277645 1515174 1452750 1693574
14593 1693574 1607035 1836309 1660584 1374598 1477101 1811943 1925290 1701512 1428455 1578605
14583 1578605 1768741 1637729 1564129 1419739 1767000 1519357 1568064 1878995 1761657 1982674
14573 1982674 1451368 1728409 2255761 2175856 2083029 2509079 2166135 2350252 1974427 2417958
14563 2417958 1994801 2155346 1945335 2454938 2580835 2348734 2696041 2763166 2899238 3048503
14553 3048503 3282644 3548202 3979744 5129683 7038808 10532216 18477720 36957285
14545C6957285Q553611B0219420r940222m227869k906311q01747l45067j13607
14537A884597K6171K0527l54213K63646q325k3416q2057j46657M10100P761l21486
14526A676648L51629L7852l18833L74581J67756m94126L35764k5142J95345L29129
14516B630603m78688Q7582m4431k23K98121m51705N55355j86056L23633k18859
14506B515332L0064J62036k40220R0430K13328M760l07961M15082j56804r7971
14496B628076J77567K64348j83586J51664r3806J49772l95330M74320j00473j19537
14486B953015K61039N2943J47646k24324J58826N9373p942j6095l17914O73210
14476C739777l14196J2659J54790L05850j61428J87902j93535K36654k77113L89416
$$ plain form
14545 36957285 45510896 20219420 10279198 6051329 3145018 2343271 1998204 1884597
14537 1884597 1910768 1931295 1577082 1840728 1832403 1808987 1726930 1580273 1990373 1998134 1676648
14526 1676648 2028277 2066129 1747296 2121877 2289633 1795507 2131271 2106129 2301474 2630603
14516 2630603 2151915 2239497 2195066 2194843 2492964 2041259 2596614 2410558 2734191 2515332
14506 2515332 2545396 2707432 2467212 2557642 2770970 2775730 2467769 2882851 2726047 2628076
14496 2628076 2805643 3069991 2886405 3038069 2944263 3094035 2698705 3173025 3072552 2953015
14486 2953015 3214054 3266997 3414643 3190319 3349145 3408518 3400576 3384481 3066567 3739777
14476 3739777 3425581 3438240 3593030 3898880 3737452 3925354 3731819 3968473 3691360 4080776
14466D080776l89159J74660J63227j45158L92436p7605j43683J52663N74390k22979
14456D559568K9995k17810L5023J02295j55782J80483J2004K79292J48422M0307
14446E013797K2859j23317M53285j4358m44311M21887q5683K82725K15662k35684
14436E506862J44644m2026L00747K27220R9786q0643N1462P4555j12093L6981
14426F207495R4165L02694J6413N4471J36323M05796k55808J0601K87698N5730
14416G315578K14260L32049j37010k6309J46986L07603q4045N99516J6167p0907
14406H613888N2804J56017K92115k63024K39337J97193k7482Q65169m02364K40265
14396I963918R5931o5022L99774K22348K73076L39921K24458m7835m12310P55346
$$ plain form
14466 4080776 3691617 3866277 4029504 3884346 4276782 4199177 4055494 4208157 4782547 4559568
14456 4559568 4589563 4371753 4406776 4509071 4353289 4533772 4545776 4825068 4973490 5013797
14446 5013797 5036656 4913339 5366624 5352266 4907955 5329842 5244159 5526884 5742546 5506862
14436 5506862 5651506 5609480 5910227 6137447 6237233 6156590 6208052 6282607 6170514 6207495
14426 6207495 6301660 6604354 6620767 6675238 6811561 7217357 6961549 6972150 7259848 7315578
14416 7315578 7529838 7861887 7724877 7698568 7845554 8153157 8069112 8668628 8684795 8613888
14406 8613888 8666692 8822709 9114824 8851800 9091137 9288330 9260848 10126017 9723653 9963918
14396 9963918 10059849 9994827 10394601 10616949 10890025 11229946 11454404 11406569 10994259 11749605
14386A1749605M37467j96013L38038j78444L56790N51962L25439Q6043l0237O96167
14376A4136817j91769O20184M60300L4622M42183L90016J15675k14241P47529
14367A6541316P20515L42926J503L74516Q21928j89666Q78697J52597N69053K98494
14357B0511879P72930J33255R43403N4235Q41115K98071R01469J74780Q86598
14348B5517735N79657P08020K63587O61359J236106M50639J160144L61228J379376
14339C2317851P28839Q34473Q13965P08711J515304J015907J668968J026869R36023
14330D1566910J084595J700083J312890J252520J907370J576967J946039J621896
14322E3969270J884019K170249J895958K528363K123231K134639K779638K300121
$$ plain form
14386 11749605 12187072 11991059 12329097 12150653 12507443 13059405 13384844 13470887 13440650 14136817
14376 14136817 13945048 14565232 15025532 15060154 15502337 15892353 16008028 15793787 16541316
14367 16541316 17261831 17604757 17606260 17980776 18802704 18613038 19491735 19644332 20213385 20511879
14357 20511879 21284809 21418064 22361467 22415702 23256817 23554888 24456357 24631137 25517735
14348 25517735 26097392 26805412 27068999 27730358 28966464 29417103 30577247 30938475 32317851
14339 32317851 33046690 33881163 34695128 35403839 36919143 37935050 39604018 40630887 41566910
14330 41566910 42651505 44351588 45664478 46916998 48824368 50401335 52347374 53969270
14322 53969270 55853289 58023538 59919496 62447859 64571090 66705729 69485367 71785488
14314G1785488L261287L141317L400464L256864L550087L693058M075349M420645
14306A00584559M615525N079916N046879N399848N712161O674366O354029O956572
14298A46423855P905270Q055988Q472272R205605R299957J0165074J0623662J1429915
14290B21581598J1658038J2634408J3340581J3937182J4244659J5239157J5660254
14283C18295877J5568051J5961173J6367387J5699742J5652899J5122883J4103278
14276D26771290J2868640J1350926R464390N624537Q59048M9924j186206k60906
14268D65541643n761395n352915o142465j1043043j3276392j4210171j5387985
14261C94367277j5852533j6947693j6765018j7010172j6679236j6010213j5359123
$$ plain form
14314 71785488 75046775 78188092 81588556 84845420 88395507 92088565 96163914 100584559
14306 100584559 105200084 110280000 115326879 120726727 126438888 133113254 139467283 146423855
14298 146423855 154329125 162385113 170857385 180062990 189362947 199528021 210151683 221581598
14290 221581598 233239636 245874044 259214625 273151807 287396466 302635623 318295877
14283 318295877 333863928 349825101 366192488 381892230 397545129 412668012 426771290
14276 426771290 439639930 450990856 460455246 466079783 466938831 466988755 465802549 465541643
14268 465541643 459780248 454427333 448284868 437241825 423965433 409755262 394367277
14261 394367277 378514744 361567051 344802033 327791861 311112625 295102412 279743289
14254B79743289j4693339j2780128j3493880j2324541j2232112j1086451j0400252
14247A92732586j0189831r524924q451337p747351p887319p134747p092598o074283
14239A28630196o108232n452500m836562n312260m548407m581647m272920l320531
14231I0197137l553301l854445l133840l110647l037551k918408k654015k642971
14223F5291959k165482k236418k352830j677812k002585j927071j849706j573414
14215D9506641j847789j103195j209127j454177j344098j398922j297174j069259
14207C8782900p73737j112286j166472j219122j189781r42809p39480l70965q04097
14198C0464151j068852m41012j191547p47789l55764o51825p46394q80794j1877
$$ plain form
14254 279743289 265049950 252269822 238775942 226451401 214219289 203132838 192732586
14247 192732586 182542755 173017831 164566494 156819143 148931824 141797077 134704479 128630196
14239 128630196 122521964 117069464 112232902 106920642 102372235 97790588 93517668 90197137
14231 90197137 86643836 82789391 79655551 76544904 73507353 70588945 67934930 65291959
14223 65291959 63126477 60890059 58537229 56859417 54856832 52929761 51080055 49506641
14215 49506641 47658852 46555657 45346530 43892353 42548255 41149333 39852159 38782900
14207 38782900 38009163 36896877 35730405 34511283 33321502 32378693 31639213 31268248 30464151
14198 30464151 29395299 28954287 27762740 27014951 26659187 26007362 25260968 24380174 24368297
14189B4368297m39336p61134o02427j063152J03179m52170j144982k4921k27037
14180A9756317m65308p02454J98717q18785n09589p2115o53349p332n17617l46023
14170A5862462l56712m98007M32441o52231k44885q7380N2268p14706m39802j39650
14160A3213798j75987k79804k84470o6560m41208n5326P6953n48988p8347n07085
14150A0852976J05636Q8048k16835m67796m8468l92628J91261k36665l86864J68203
14140I656868k02184o80510L66658j97347N7125m85374N7935l38583j0473K54936
14130H479051k87852K1154n16640p1590J42194M4717l78643j48173r4800j49186
14120G040232l51148J82031P5116j3008l03702o6841j06455N5668j69927K815
$$ plain form
14189 24368297 23928961 23167827 22565400 21502248 21605427 21153257 20008275 19983354 19756317
14180 19756317 19291009 18588555 18787272 17968487 17458898 17386783 16733434 16726102 16208485 15862462
14170 15862462 15505750 15007743 15440184 14787953 14543068 14455688 14507956 13793250 13353448 13213798
14160 13213798 13037811 12758007 12473537 12406977 11965769 11910443 11987396 11438408 11360061 10852976
14150 10852976 10958612 11046660 10829825 10362029 10313561 9920933 10112194 9875529 9488665 9656868
14140 9656868 9454684 8774174 9140832 8943485 9000610 8515236 8573171 8234588 8224115 8479051
14130 8479051 8191199 8212353 7695713 7624123 7766317 7811034 7432391 7284218 7189418 7040232
14120 7040232 6689084 6871115 6946231 6933223 6629521 6562680 6456225 6511893 6341966 6344781
14110F344781l51252J17756L70058o74562L44669o70552N70552m95004p3054j91329
14100E292063j37608J18620K85200K63401k89893k87653m4343k07298J24478k33706
14090D883261O3840j8066R9665j54842q8119l66055K3423K04758k22941L6220
14080D461144r9397K05622j93766k951L2879j67013K4681p7999r9832j60234m6593
14069C876541k01890J77150j64840L77711k98115J2049k57166N18363j06784j88695
14059C744324J97922k88687q2384j785k56489L19161j51906j60666L16846n61502
14049C074834J15658J09454k91516r7940M88M31621m91708P0855j71707M70963
14039C221002j79498j79n7722k03413k12153L24017M2703m1506j89323K97913
$$ plain form
14110 6344781 5993529 6111285 6481343 5806781 6151450 5480898 6051450 5556446 5483392 5292063
14100 5292063 5154455 5273075 5558275 5821676 5531783 5244130 5199787 4992489 5116967 4883261
14090 4883261 4947101 4929035 5028700 4873858 4785739 4419684 4443107 4647865 4424924 4461144
14080 4461144 4361747 4567369 4373603 4370652 4403531 4236518 4261199 4183200 4083368 3923134 3876541
14069 3876541 3674651 3851801 3686961 4064672 3766557 3778606 3521440 4039803 3933019 3744324
14059 3744324 3942246 3653559 3571175 3569390 3312901 3632062 3480156 3319490 3636336 3074834
14049 3074834 3190492 3299946 3008430 2910490 2910978 3342599 2850891 2921746 2750039 3221002
14039 3221002 3041504 3041325 2983603 2780190 2568037 2892054 2934757 2893251 2703928 3001841
14029C001841M3559k87174l11408J08055L5445J25862j57597J44817k06634j92836
14019B303930r012k76705R2332p1965M33307m12112N91041k81820n8885k64163
14009B045948K79721j30371Q4737j36965L4061j45588M6428k43602J4386J71257
13999B020012l53277L19390K03362m12888J70866L1552J57788R21K57151k65527
13989B129350Q68380K682106O178163J7939038J7551571k1614890j2702955n332303
13981G698460k260091j185675l62010m92544k09365k87170m2815k70567K64984
13972B853207m91437M0069q4841j74106M0995j7568J5270j23854J32136k62796
13962A927075K31022j79847K1029j55702K48132k10571K5760r1557j41427J69576
$$ plain form
14029 3001841 3045400 2758226 2446818 2554873 2590318 2716180 2558583 2703400 2496766 2303930
14019 2303930 2294918 2018213 2110545 2038580 2471887 2059775 2650816 2368996 2310111 2045948
14009 2045948 2325669 2195298 2280035 2143070 2177131 2031543 2077971 1834369 1848755 2020012
13999 2020012 1666735 1986125 2189487 1776599 1947465 1979017 2136805 2137726 2394877 2129350
13989 2129350 2997730 5679836 11857999 29797037 47348608 25733718 13030763 7698460
13981 7698460 5438369 4252694 3890684 3398140 3188775 2901605 2858790 2588223 2853207
13972 2853207 2361770 2401839 2316998 2142892 2183887 2166319 2181589 2057735 2189871 1927075
13962 1927075 2158097 1978250 1999279 1843577 2091709 1881138 1906898 1815341 1673914 1843490
13952A843490k82142K34993J868J52520k14216q1135J12758k8276K18254k53248
13942A704866j4437j82227K61166l37295L51646l26922K51163k67921J33731o0345
13932A513425j22991K34619j54656K96100q03486M50731p312l553J19223j91439
13922A330661J51096R2374k69913k0065J46099J3496k43835M51618k40787j8256
13912A392488j40949p0452L85727j00970N5806j4644l65983M4444J42695n937
13902A322225j78096L04426L20690p06769K2255L15526j47438l52483K54486P6142
13892A230964j43145O3147J07201k18092j14271m0216J95170j22477k2194L43059
13882A279146K00702j62585j24450k72401L19526j08949J06946n65164L44032
$$ plain form
13952 1843490 1561348 1796341 1798209 1950729 1736513 1655378 1768136 1739860 1958114 1704866
13942 1704866 1690429 1508202 1769368 1432073 1783719 1456797 1707960 1440039 1573770 1513425
13932 1513425 1390434 1625053 1470397 1766497 963011 1413742 1406430 1402877 1522100 1330661
13922 1330661 1481757 1574131 1304218 1284153 1430252 1443748 1199913 1651531 1410744 1392488
13912 1392488 1251539 1181087 1566814 1465844 1521650 1507006 1141023 1185467 1328162 1322225
13902 1322225 1144129 1448555 1769245 1062476 1084731 1400257 1252819 900336 1154822 1230964
13892 1230964 1087819 1150966 1258167 1040075 925804 885588 1080758 958281 936087 1279146
13882 1279146 1479848 1317263 1192813 920412 1239938 1130989 1237935 672771 1016803
13873A016803Q6746k09951L41676J3064l32619J70855l6694k34134L85807K12622
13863A414175k61056J83939n35492J68825l9415J46238K4808j01747M2083p4100
13853I68258j17568K86223j84556J08248m9345l16711R9654K41564k02048L9329
13843H73048m4534N2007p2574J34968o2072l74893L70158K0484j03339N4653N4616
13832I02522j73862K47412q7354q218L06782n48317K25863j28831K5033J41413
13822I02443j28218j9791j98726K30235p9631M43777n09652J58478J89603K77954
13812A266472m90444P226J46159L6625m9488N4470k20310k99105j1391M02469
13802H42683r0108J52207j90056q0577K43203j5170k63318L22163k71459J95312
$$ plain form
13873 1016803 1103549 893598 1235274 1248338 915719 1086574 1049880 815746 1201553 1414175
13863 1414175 1153119 1337058 801566 970391 930976 1077214 1102022 1000275 1042358 968258
13853 968258 850690 1136913 952357 1060605 1011260 694549 794203 1035767 833719 873048
13843 873048 828514 880521 807947 942915 880843 505950 876108 896592 793253 847906 902522
13832 902522 728660 976072 888718 880500 1187282 638965 864828 735997 761030 902443
13822 902443 774225 754434 555708 785943 706312 1150089 640437 798915 988518 1266472
13812 1266472 776028 783254 929413 966038 916550 971020 750710 451605 440214 842683
13802 842683 752575 904782 714726 634149 877352 862182 598864 921027 649568 844880
13792H44880k62737K74592p247Q1654j49971k92354O0011L95477D10021J98366
13782F08387J6826p055J12289L08419k45181k36535K4624K95234k66334l1213
13772E79461B54044N50299l0594j63717k13224J62190k279J15485A78548M27795
13762F06343M8141K26691q1363l30060m2443J14457N08693j85370m20067R6477
13752E41499j23511K64102P9985J15535j76530B96057L74904p9520K88158l84607
13742D94992q8142J18202K17070j73699K17544J02530D27669K30402j50771L6484
13732E43784P200j56655J43654J57454l15099K29563k97927O8818l8963j51522
13722A90307N62680C74652l3701p5525M74420B36252K64452J6751k56146J20464
$$ plain form
13792 844880 582143 856735 849488 931142 781171 488817 548828 944305 410021 608387
13782 608387 625213 618158 730447 1038866 793685 557150 581774 877008 610674 579461
13772 579461 254044 804343 773749 610032 396808 558998 556719 672204 178548 606343
13762 606343 654484 881175 799812 469752 427309 541766 1050459 865089 445022 541499
13752 541499 417988 682090 762075 877610 701080 296057 670961 591441 879599 494992
13742 494992 406850 525052 742122 568423 785967 888497 427669 658071 507300 543784
13732 543784 550984 394329 537983 695437 380338 609901 311974 380792 341829 190307
13722 190307 752987 374652 340951 265426 739846 236252 500704 517455 261309 381773
13712C81773J09932O4799j54740J49103j21343R0909M0847A97829K23307m0089
13702C81047K96667j6746B93885L90718J40238l71896L6602I1567J12260M22206
13692F26033r9913N7914F5904M29904L6287k1720k2370J39060k68921J01051j4353
13681D44842A93049K93974K39272J77665B09966L58986o0488k25911K30576o9395
13671D43734L45879B62706J37644D1083L07860K15577J9543B68913J13286M28392
13661H10591C52268j39918L87292p4057n9808j7101n6626J52112J56637A98262
13650C85483R2900B32279R8756j9145J59303l9993K45210B91418A27472K54891
13640C82363A07566L42842k9687j63941L30302j12808r8119I2806N56239B76434
$$ plain form
13712 381773 491705 556504 401764 550867 429524 520433 561280 197829 421136 381047
13702 381047 677714 660968 293885 684603 824841 452945 489547 91567 203827 626033
13692 626033 526120 584034 65904 495808 532095 510375 488005 627065 358144 459195 444842
13681 444842 193049 487023 726295 903960 209966 568952 508464 282553 513129 443734
13671 443734 789613 262706 400350 41083 348943 564520 584063 268913 382199 810591
13661 810591 352268 212350 599642 525585 465777 448676 392050 544162 700799 198262
13650 385483 478383 232279 331035 311890 471193 431200 676410 291418 127472 382363
13640 382363 107566 450408 420721 256780 587082 474274 376155 92806 649045 276434
13629G29574j45143A36621M59932J28523d7759E37574j03086j25339k3455L66638
13619F52332j1000A74380L70445B59266K4295J07648A85992K93255r9009j03818
13609B76420M55246C01863J5116L95557B62006J69037j3901A12776K44824J9648
13599C77248j09741k2858o7868K84650A95801J18179r4799H1294K57837N2327
13589C91458J829B9083L30700L17342A06121K16086r1109K40763j25269j08344
13579B38248K70296k05499Q2457j7522j80606N47859B27753N2047E3289L41723
13569C95012A04643O9946K08976n11R648G2356M22147j13212k4698L31681F2869
13557B13042J04747o5559P7621m0000K20441E4211K93467J7748g1283B00562M1688
$$ plain form
13629 729574 584431 136621 596553 725076 -47759 537574 434488 309149 285694 652332
13619 652332 641332 174380 544825 259266 283561 391209 185992 479247 380238 276420
13609 276420 731666 301863 316979 712536 262006 431043 417142 112776 357600 377248
13599 377248 267507 244649 176781 461431 195801 313980 219181 81294 339131 391458
13589 391458 393287 29083 359783 677125 106121 322207 231098 471861 346592 238248
13579 238248 508544 303045 385502 367980 187374 735233 227753 279800 53289 395012
13569 395012 104643 174589 383565 383054 392702 72356 494503 381291 356593 688274 62869
13557 213042 317789 252230 329851 289851 510292 54211 347678 365426 -71283 200562 242250
13546B42250K7993M878j16392K05624J09023C2337M81206F1166k592K77188D402
13534B43114E6272M12813j69905j15362j9948b0962I2962e757A07989P5275m1071
13523A42193L01929k17724D3674J47309K03836R0432j37284A25126b1228B15527
13512A82725H1497J79609A7865K36475M0939j19264F1727L0518O5181K57250j29222
13501B85454f3150E76494A85619G0302L43868K9965B10779J37284j45940M12L6777
13490B39312F8118J08936K29649A58198n6581c0573D45568n7689A31392O0370
13480A91762K94688B03148I3833l6324J46526E0697n91K3804K67364H9753J30081
13469B19834k3670P5326J08584j16040J94510B05615n5960b1014B77082H7312
$$ plain form
13546 242250 270243 275121 158729 364353 473376 32337 513543 61166 58574 335762 4402
13534 243114 56272 469085 299180 183818 163870 -20962 92962 -5757 107989 183264 142193
13523 142193 444122 226398 43674 190983 394819 485251 347967 125126 -21228 215527
13512 182725 81497 261106 17865 254340 295279 176015 61727 92245 157426 414676 285454
13501 285454 -63150 576494 185619 70302 414170 444135 210779 348063 202123 202535 239312
13490 239312 68118 177054 406703 158198 101617 -30573 445568 387879 131392 191762
13480 191762 486450 203148 93833 57509 204035 50697 50106 73910 341274 89753 219834
13469 219834 196164 271490 380074 264034 458544 205615 149655 -21014 277082 87312
13458e0662C47648q9116O4204m4022a17685B41402L34519H5300K73879j07171
13448B52008j6515B9346l130K81795a73428D83572B16390J70489Q9852o9032j50119
13437B57580p1963J37778n2668j16085f415C03885M1117b07173C36832Q3966a9063
13425A40117f7230D6222J79081N6625m3414n5793Q6652l0050q2834o434a44557
13413a1249B58000L7987J81396a0240D74335a51077B98947B0599J2211J31810
13403A64620d1301D01518k1585E1673J01727D4467J76305r3846j6720L21120j56034
13392B75292a79535C25872o7819o2683R1633A33684K48973A07913a11290C33796
13381B12304O4179j24024Q8971D5098L3388J79692k2467j11534l9453J43828M2526
$$ plain form
13458 -50662 347648 258532 322736 278714 -117685 241402 575921 85300 359179 252008
13448 252008 235493 29346 26216 308011 -173428 483572 216390 386879 476731 407699 257580
13437 257580 185617 323395 270727 154642 -6415 303885 345002 -207173 336832 420798 -19063
13425 140117 -67230 46222 225303 281928 238514 182721 269373 239323 156489 150055 -144557
13413 -11249 258000 295987 477383 -10240 474335 -151077 298947 20599 32810 164620
13403 164620 -41301 401518 379933 51673 153400 44467 220772 126926 110206 431326 275292
13392 275292 -179535 325872 258053 195370 287003 133684 382657 107913 -111290 333796
13381 212304 276483 152459 241430 45098 78486 258178 235711 124177 84724 228552 271078
13370B71078D0176K08643J84922A49072P0925k647E9946L90382N534m2885I6190
13358C35904J63409r6852d3488E9206J87663M9230j12045J85219A19572J44496
13348B64068M9822A43789j3050N3941O41941B52970j0014p8135J98076J79133
13338E42030c315B12943J18491j46830o158o684J70854A41778Q3844F4970K38038
13327C03008A41484f8279C97717F6801O6874J43205c2806B40734p385K00299j99268
13316B34380o322b92338a28007B68710e39l3216A73098p5437a23377O668C90788
13304c27564A25329O2068h9919B28913i49B33499R7336Q4420B02241k5848F0797
13292A05715K09177m6752K26138G7499K08529e5779C6935P0022d3261A29216c063
$$ plain form
13370 271078 40176 248819 433741 149072 219997 217350 59946 450328 455862 412977 96190
13358 335904 499313 402461 -43488 59206 246869 296099 184054 369273 119572 264068
13348 264068 313890 143789 130739 184680 826621 252970 242956 164821 362897 542030
13338 542030 -3315 212943 331434 184604 178446 171762 342616 141778 225622 64970 303008
13327 303008 141484 -68279 397717 66801 133675 276880 -32806 240734 233349 433648 234380
13316 234380 228058 -292338 -128007 268710 -539 -33755 173098 97661 -123377 -116709 390788
13304 -327564 125329 187397 -89919 228913 -949 233499 330835 415255 202241 176393 60797
13292 105715 314892 268140 494278 77499 286028 -55779 36935 106957 -43261 129216 -3063
13280A96821o4283n3880i3462j03159A95638g7433c6402A6855K43472h300j513
13269i813C07017A26956M91949g7533p6566B31610J80084o9601c22330B94372
13258a44405B7718M39934r3375A00015A9721J89802b87510C09766I7552J70701
13248B68253e2060E1223J21081J55318A28526g4183C13624b00143a1097C02117
13237d4752D8037L00159a2876B56456J30975D4896a43162C12565E2568P3400L7608
13226A63576k8755j2156m3827J02606e313j47750A9768h4727j81422B64729H5067
13214A96982i5711A23407c9928B21651H6274J3077a87020j87458J24629A12762
13203d4389A9580L12094h1453I0457K01437M5543r2396m3556P4306f5606A34980
$$ plain form
13280 196821 132538 78658 -93462 -196621 195638 -77433 -36402 16855 260327 -8300 -9813
13269 -9813 307017 126956 618905 -77533 -154099 231610 411694 342093 -322330 294372
13258 -144405 27718 467652 374277 100015 19721 209523 -287510 309766 97552 268253
13248 268253 -52060 51223 172304 327622 128526 -74183 313624 -200143 -11097 302117
13237 -44752 48037 348196 -12876 256456 387431 44896 -143162 312565 52568 125968 163576
13226 163576 134821 122665 78838 181444 -5313 -153063 19768 -84727 -266149 264729 85067
13214 196982 -95711 123407 -39928 221651 86274 99351 -187020 -374478 -249849 112762
13203 -44389 19580 331674 -81453 90457 291894 337437 245041 201485 275791 -65606 134980
13191B50657a10817C3975f0046A93706f388j5318j11588C41221d0118j25448A54338
13179f3630B08080J23299d2142G8108j8585J54438q301e0752B12226e7924F5342
13167e3843D1080K21241R2035c0360F5540M4037J7734L4748C0827N9161R8784
13156A88772C0785q560a6054k224m577A91184a89380C84202g1157G8757J99081
13145B77838a10212K3651C7288b40316i9220D1485J0271b84429A27010a5513B80781
13133d5521A74229a43276M6242m3997A70905Q674N0577d5065F3231d15876C23826
13121b7517k63586a04975A82010j2953a88615M1361A76533a8020I9762b02875
13110c16349A92029E4849K09391C1906a08280D3221e0872k05450E7757M24448
$$ plain form
13191 250657 -110817 33975 -60046 193706 -6388 -21706 -133294 341221 -40118 -165566 154338
13179 -63630 208080 331379 -42142 78108 59523 213961 205660 -50752 212226 -57924 65342
13167 -53843 41080 262321 354356 -30360 65540 109577 127311 162059 30827 89988 188772
13156 188772 30785 22225 -16054 -18278 -22855 191184 -189380 384202 -71157 78757 277838
13145 277838 -110212 -86561 37288 -240316 -99220 41485 51756 -284429 127010 -15513 280781
13133 -45521 174229 -143276 -97034 -141031 170905 179579 230156 -45065 63231 -415876 323826
13121 -27517 -291103 -104975 182010 169057 -188615 -147254 176533 -18020 99762 -202875
13110 -316349 192029 54849 264240 31906 -108280 43221 -50872 -256322 57757 482205
13100D82205g6480G9218o080J96158A33519R7651b36619B62101F7778Q4082l7902
13089A13958M7344K4270F2024J29409P8899e5390C45494A28204J50785A07470
13078I6837d6817A71527a4008k1908A22635K56306A79323J85720H3928j1932k2560
13067D9436K3866e9170k57939G4205c3849D74576F0319h7823A35614K5653a24560
13055H4579a9697A31066M01667a91687f4068F8754a01067B61120m5679F8206K30864
13044B99070I0100C5840g5745A71249a57311A50936E3809K7470j9686K59947a71618
13032E38582D9719b24277r3004B922a59960C97907g7540a9267C12409d5678o6045
13021a11723C36681A65504G0907Q3425a24187C58513b90126A45118g9653B88249
$$ plain form
13100 482205 -76480 79218 73138 269296 133519 231170 -236619 262101 67778 151860 113958
13089 113958 161302 185572 62024 191433 270332 -55390 345494 128204 278989 107470
13078 96837 -46817 171527 -14008 -35916 122635 378941 179323 365043 83928 71996 49436
13067 49436 73302 -59170 -317109 74205 -33849 474576 60319 -87823 135614 161267 -124560
13055 84579 -19697 131066 532733 -191687 -64068 68754 -101067 261120 215441 68206 299070
13044 299070 90100 35840 -75745 171249 -157311 150936 53809 81279 61593 321540 -171618
13032 538582 49719 -224277 -317281 2922 -159960 397907 -77540 -19267 312409 -45678 -111723
13021 -111723 336681 165504 70907 154332 -124187 358513 -290126 145118 -79653 288249
13010B64582i1330A62065b05299B79322D9564j5854a65681g9423C00233e8197
12999B9295c2190D89612F750O8262K40317a02892A91222F8257O1386R8757a67292
12987f6574E3781a91829L1494D4178a63994H0945h0103A13605K36342h9163a8746
12975b88847A40590e2319I2477e044A29611l6179l2889L24979A60826a15155N2924
12964f2231a6280D1251a10456A94277b1890r804o6372A36474o0872L45618a80672
12952A28822L4646n9399J39979k0962I725K72311a16386a9487E5969A6080g4654
12940d1230l7492A34306a43214A18683D7249J39631C4013J59878r5296e0848p5318
12929a26166A42560a93823B93278G9799J79220F8740b0497D2348b07901c2655
$$ plain form
13010 264582 -91330 162065 -205299 279322 49564 33710 -165681 -79423 300233 -58197
12999 29295 -32190 489612 6750 75012 315329 -102892 191222 68257 129643 228400 -167292
12987 -66574 53781 -191829 -160335 44178 -163994 80945 -80103 113605 349947 -89163 -18746
12975 -288847 140590 -52319 92477 -5044 129611 93432 60543 385522 160826 -115155 -62231
12964 -62231 -16280 41251 -110456 194277 -21890 -31694 -98066 136474 75602 421220 -180672
12952 128822 163468 104069 244048 223086 9725 282036 -116386 -19487 55969 16080 -74654
12940 -41230 -78722 134306 -143214 118683 47249 186880 34013 193891 98595 -50848 -126166
12929 -126166 142560 -193823 293278 79799 259019 68740 -20497 42348 -207901 -32655
12918A9397J04894i0617b7821B89980C1360a73793p7156D9022c720j25661A44620
12906I3065K2963e4756A2472P7533b3519l22128A18819L4747M0737a82536O2809
12895a19727J6213A51897P435M1741q4789D5057b49212B96511E8040a88042D62253
12883a0426A2549k246f2286l49481D9357J32364d3471A80987C0110P605M292J21506
12871A63513E4745a0470k99851A62283k1957J58538b82268B02789a45239r7158
12861b42397J21031I8822l7794J07299a39771B22176k5263a11950q7355A02887
12850F340a83049E9045K7132R0607d11791K02178A58154e4815a2364E7886b1560
12838b54195A39420l3816i59r7940j02239J9860e7926H4O2K12508b29786b9192
$$ plain form
12918 19397 124291 -90617 -27821 289980 31360 -173793 -250949 49022 -3720 -129381 144620
12906 93065 116028 -54756 12472 90005 -23519 -345647 118819 153566 194303 -182536 -119727
12895 -119727 -103514 151897 159332 201073 116284 45057 -249212 296511 58040 -188042 462253
12883 -10426 12549 10303 -62286 -411767 49357 181721 -43471 180987 30110 37715 42007 163513
12871 163513 54745 -10470 -310321 162283 140326 298864 -282268 202789 -145239 -242397
12861 -242397 -121366 98822 61028 168327 -139771 222176 196913 -111950 -199305 102887
12850 6340 -183049 59045 86177 176784 -411791 -209613 158154 -54815 -12364 57886 -21560
12838 -254195 139420 105604 -959 -98899 -201138 -181278 -57926 84 146 212654 -229786 -29192
12825b4847E0847J81461O0884B2145J93013m2993A5236c0094F9260g9332o7231
12814a46563F9357c06546C07652B098K83467a085n9807I1043l755J08237b60645
12802B45220a63683M0274b7430n2375k66200d3133j47948Q9287j4813A96053l4226
12791A61827c799r896f52j22426C01917b01883d5457A82904p2409K7043o4065
12780G3473J07826a84358C81151G3473a07185j3585D3793e0569q1181B34020G1565
12768A58264r177a06044A10324E4822A0037g8297D4022A8091L5844K4436b3556
12756h4010B19436C6469J60727k5305c44382A41215J78731A11195d2772A70273
12745h1980r748A07157J91298c13579B3403J2427J41390C4738L45177K37566b45216
$$ plain form
12825 -24847 50847 232308 293192 22145 215158 172165 15236 -30094 69260 -79332 -146563
12814 -146563 69357 -306546 307652 2098 285565 -1085 -60892 91043 87288 195525 -260645
12802 245220 -163683 -123409 -27430 -79805 -346005 -43133 -191081 -101794 -116607 196053 161827
12791 161827 -3799 -13695 -652 -123078 301917 -201883 -45457 182904 110495 137538 73473
12780 73473 181299 -184358 381151 73473 -107185 -120770 43793 -50569 -131750 234020 71565
12768 158264 149087 -106044 110324 54822 10037 -78297 44022 18091 53935 78371 -23556
12756 -84010 219436 36469 197196 171891 -344382 141215 319946 111195 -42772 170273
12745 -81980 -91728 107157 298455 -313579 23403 35830 177220 34738 379915 617481 -245216
12733A00559M27709B08536q0722a0295A08035a94295F5533c3475A42937b75533
12722a56872b3281l27104e4874j0198B70121c983A56023k9564m7665J61028M36601
12711F76423B83804a645C2981K49671j28127K6766G8434M98384r8605d881C6135
12699a6845A66014J3550K0770a67725H6666J1116I939b05848F0684b5856C14389
12687b47004k2901f6769J37I3034J37884g2708C18775r8140j3362C0944b52930
12675h907B32066A09850J16902b68801d5161m9632A54465B2688J32965P8499N2324
12664B86476q628a56168B68121f1667B90579A11058b1593j29142p6812I6931R5469
12653A92400n1039F0714a51957A73749k6890J81535a00997A830K65981I5369a42275
$$ plain form
12733 100559 528268 208536 127814 -10295 108035 -194295 65533 -33475 142937 -275533
12722 -156872 -23281 -350385 -54874 -65072 270121 -3983 156023 126459 78794 239822 676423
12711 676423 283804 -1645 32981 282652 154525 181291 78434 576818 478213 -4881 36135
12699 -16845 166014 179564 200334 -167725 86666 97782 9939 -205848 60684 -25856 314389
12687 -247004 -269905 -66769 -66632 93034 230918 -72708 318775 220635 207273 30944 -252930
12675 -8907 232066 109850 226752 -268801 -45161 -94793 154465 22688 155653 234152 286476
12664 286476 277848 -156168 268121 -61667 290579 111058 -21593 -150735 -227547 96931 192400
12653 192400 141361 60714 -151957 173749 146859 328394 -100997 1830 267811 95369 -142275
12641C02870e1862B18521b32170B25399L4571p5779b6681A24046O5167c2633A31151
12629A68808E4193J19715F7547K19775g1980K7297B07438c87409C39283j28639
12619B10644p4927i5945J095A50432L1555L3868F7761K86235a60322A13515C3014
12607a93789A4836O3402k7997J9290b23254C77777A71062K0092f6147D56911c9585
12595C13922A690N826k608c27282H3132Q8607C0956K41187n3338c15367A79398
12583e9392I2138a6717B3526c50017D62810p6132j77072n8323a05081A78694E5975
12571b06913h8675o2912C9116f734A30693l1729f2307C12154a2743G90L12462
12560C13252c34948J30450A84315A4583a03194A25487a79461A66745L03260a92109
$$ plain form
12641 302870 -51862 218521 -232170 225399 259970 184191 -26681 124046 189213 -32633 131151
12629 168808 54193 173908 67547 287322 -71980 -44683 207438 -387409 339283 210644
12619 210644 135717 -95945 -94850 150432 181987 215855 67761 353996 -160322 113515 33014
12607 -193789 14836 78238 50241 69531 -223254 377777 171062 191154 -66147 456911 -39585
12595 313922 1690 7516 4908 -327282 83132 171739 30956 272143 218805 -315367 179398
12583 -59392 92138 -16717 23526 -350017 462810 386678 209606 151283 -105081 178694 55975
12571 -206913 -88675 -151587 39116 -6734 130693 98964 -62307 312154 -12743 790 313252
12560 313252 -334948 -204498 184315 14583 -103194 125487 -179461 166745 470005 -192109
12549a71355B1666h3217p6962E01072A38912a46006a0657g01j66068A60474a41014
12537I8545R6641d6172p4019H6725l8410N3922a20701H1663b2035r6037A02682
12525F1630L06066D3134j6392e5576I063d868G0462a16510J4478a0597H4323b65726
12512G018h6755n6809D978K16557e5850A57437L4522A0805b3774A03372B2569
12500a37159p5395A64212E4279a30557B83027j29827E1824f7562j66299c3755
12489B0977h8513B01280O7917A1935L51222D9427O3041G674Q4511a50169A69288
12477b07375b0811B24018a50381G7634J21093g9877j07311j35298c0529I0866
12466g0244F2537c3792A49072a18649B7946a78008p7538B65883E4244J09081J18067
$$ plain form
12549 -171355 21666 -83217 -160179 501072 138912 -146006 -10657 -701 -166769 160474 -141014
12537 98545 195186 -46172 -120191 86725 48315 102237 -120701 81663 -22035 -118072 102682
12525 61630 367696 43134 26742 -55576 9063 -4868 70462 -116510 -102032 -10597 84323 -265726
12512 7018 -86755 -143564 4978 221535 -55850 157437 191959 10805 -23774 103372 22569
12500 -137159 -212554 164212 54279 -130557 283027 153200 51824 -67562 -233861 -33755
12489 20977 -88513 201280 269197 11935 363157 49427 112468 7674 92185 -150169 169288
12477 -207375 -20811 224018 -150381 77634 198727 -79877 -187188 -322486 -30529 90866
12466 -70244 62537 -33792 149072 -118649 27946 -178008 -255546 265883 54244 163325 281392
12455B81392i7113D5604N5667d9286C8839J9836i2641A62721E7729a4402q8205
12444a02607A03036b665j60794l94272a85337K4045o5024A94792g9503r343j63049
12433b51895B0919a08394C5687a46188j19581i0279A85981J37133b50151e1198
12422C9338b93376d179A15996L75164h8336A57573p1100J37592a07968o1825P1353
12411i8440a8623A92099h428q5741b2343A66804J41120O7729F0998b34605p8176
12400c12781B94453J33768a61886k9334L0567D87934a88053B698J96308N3565
12390B52571c713l10135D8410d7822o0350j54349A72699p5842J54902H3845c780
12378c04690h9278B87662c6324D9234a82020A05780a13619B28619a9n264A60302
$$ plain form
12455 281392 -97113 45604 101271 -49286 38839 58675 -92641 162721 57729 -14402 -102607
12444 -102607 103036 -2665 -163459 -557731 -185337 -161292 -226316 194792 -79503 -88846 -251895
12433 -251895 20919 -108394 35687 -146188 -265769 -90279 185981 323114 -250151 -51198
12422 39338 -293376 -4179 115996 491160 -88336 157573 86473 224065 -107968 -169793 -98440
12411 -98440 -18623 192099 -8428 -94169 -22343 166804 307924 375653 60998 -234605 -312781
12400 -312781 294453 428221 -161886 -191220 -160653 487934 -188053 2698 199006 252571
12390 252571 -3713 -313848 48410 -47822 -108172 -262521 172699 96857 251759 83845 -3780
12378 -304690 -89278 287662 -36324 49234 -182020 105780 -113619 228619 -19 -5283 160302
12366A23869F0166J23066E7512b42255C3237j503L5781J8Q3420B8192b13547o31
12354b14178A66357a08837A32908B2625J23758n9616O9464c02284E01500C563
12343D3198e4216k7098F8678J95497a48465R96O1126m6045b8503A82035o3873
12332A18162B5834L71526G3929i0198b9701A13261k9946d7253B3138b63133R5136
12321a67997f5366B24495D5567c9956B307J89746b0234A81700F5573a60950c3709
12309a9278A35970L2918f380q0608a9827C04034c30746A74172K43383b45610H21
12297D880J63890o9689b41932C74302D0189A8880L82131H1526k9688J55784a24835
12285D5762M4685b10019i5976C12162j27269Q3974K60251r4241A94345a74465
$$ plain form
12366 123869 60166 183232 57512 -242255 33237 31734 67515 67533 150953 28192 -213547 -214178
12354 -214178 166357 -108837 132908 22625 146383 86767 156231 -302284 501500 3563
12343 43198 -54216 -81314 68678 264175 -148465 -147469 -86343 -132388 -28503 182035 118162
12332 118162 25834 397360 73929 -90198 -29701 113261 83315 -47253 23138 -263133 -167997
12321 -167997 -65366 224495 45567 -39956 2307 192053 -20234 181700 65573 -160950 -33709
12309 -19278 135970 168888 -6380 -86988 -19827 304034 -330746 174172 417555 -245610 821
12297 4880 168770 99081 -241932 374302 40189 18880 401011 81526 51838 207622 -124835
12285 45762 90447 -210019 -95976 312162 184893 268867 529118 434877 194345 -174465
12274B04637J00365m457K05648A28009j3023a74107M186B78206a86742E7029c7755
12262e4753I4870m5675K09541D6511K73197a34121A27823O1244E2995P4274p494
12251A19775R3322c1368k0599A254K6102q07N6583b3063A18237i396B2718R2681
12239A15399e8126B26745A11015J86595a87531A46677e816a359l1359l1703C1041
12227B44463J97620B02008K17806p8926M53218B09760m1380L34651A8862K94376
12217C13238Q655j41963L5531J83598A89190L85202G3819b37466H3849L95314
12207D79163k28111M5500I2671J25433j6175L1119N9440F0784J63830k6646B1198
12195C66392a9198B51732K63278j35506j17291r6449K69981A68830A2801M5123
$$ plain form
12274 204637 305002 300545 506193 128009 114986 -174107 -169921 278206 -186742 57029 -37755
12262 -54753 94870 49195 258736 46511 319708 -134121 127823 189067 52995 127269 119775
12251 119775 213097 -31368 -51967 1254 27356 26549 83132 -23063 118237 -9396 22718 115399
12239 115399 -58126 226745 111015 297610 -187531 146677 -5816 -1359 -32718 -64421 31041
12227 244463 442083 202008 419814 340888 794106 209760 168380 503031 18862 313238
12217 313238 321893 179930 215461 399059 189190 574392 73819 -237466 83849 479163
12207 479163 251052 296552 92671 218104 201929 233048 292488 60784 224614 197968 21198
12195 366392 -19198 251732 515010 379504 262213 165764 435745 168830 12801 57924
12185E7924L27477q7465N9006b8722A9471L52358h0074H9956l167J3877K8521
12174A29187C9082J95969m4178L10550D3234K11811A1440J86107J15627r9087
12164B14087J64657r7564D159L85965C2898a38718N1835A79199n4085N5580J60439
12153C41133G8373b3072A87589a45066E4406J02446c16960B91209J11946a35356
12142a56214A01717a4262D7855K6206a34950E3252P1561J00854b08917G0010f499
12130B6778L85519H2723M4812E3463J42197C8686m029J30853a9754F8675A3839
12118B53811f2116q7160K7249A16172b23196A29647k3531e3559C93231a22680
12107d4423A66160J1173a08991j60947E3595c07056G4145b11651H9088a78983
$$ plain form
12185 57924 385401 297936 356942 -28722 19471 371829 -80074 89956 86789 100666 129187
12174 129187 39082 235051 190873 501423 43234 255045 11440 197547 313174 214087
12164 214087 378744 281180 4159 390124 32898 -138718 -86883 179199 125114 180694 341133
12153 341133 78373 -23072 187589 -145066 54406 156852 -316960 291209 403155 -135356
12142 -156214 101717 -14262 47855 74061 -134950 53252 124813 225667 -208917 70010 -6499
12130 26778 412297 82723 127535 53463 195660 38686 34657 165510 -19754 68675 13839
12118 253811 -62116 -149276 -122027 116172 -223196 129647 106116 -53559 393231 -122680
12107 -44423 166160 177333 -108991 -269938 53595 -307056 74145 -211651 89088 -178983
12096a23425n4381k257H666g6360B19439L6393J09443B5606J36616B9617b8755
12084B02026o0276j2621e5309O311E46298L21641O34034o13400m17141B00289
12073g7205j2987B5473c47327i1758A03459f7876A74585H4370K961b01506P5662
12062a25844j4089A93117F7395b59877d5287A64550a40445c1092k8339F3785J20066
12051A83851M2183a9059j82717A23726d25896D8474d6357F5129J87659a71664
12040a99941R5747d4808J0971j23454j16503A4975M3003b92037E5437B6479J44328
12029A70807c5962B8705a66063D7545a22801e3538A86966a28343C5515c37461
12018b4398A60665d1528j23893k01844a83447M2364c2611j4125B24953d3429A43433
$$ plain form
12096 -123425 -177806 -180063 8666 -76360 219439 255832 365275 25606 162222 29617 -28755
12084 202026 141750 129129 -55309 -48998 546298 867939 1501973 888573 471432 200289
12073 -77205 -90192 25473 -347327 -91758 103459 -67876 174585 84370 87331 -201506 -125844
12062 -125844 -139933 193117 67395 -259877 -45287 164550 -140445 -31092 -59431 63785 183851
12051 183851 226034 -19059 -201776 123726 -425896 48474 -46357 65129 252788 -171664
12040 -199941 -104194 -44808 -33837 -157291 -273794 14975 57978 -292037 55437 26479 170807
12029 170807 -35962 28705 -166063 47545 -122801 -53538 186966 -128343 35515 -337461
12018 -24398 160665 -41528 -165421 -367265 -183447 -141083 -32611 -46736 224953 -43429 143433
12006c1584B4503d4230I4186b07080j05431A96680A2846K43808b0281r1120k3516
11995a34917A68437a02910f206A38929d13762B13604I5973L3263b62536J18080
11985a44456l2580j00805E0765R7319d9262o9962B13172c9074D3071N0269h5130
11973c66713A6753K2153a7887q9423D21852F1326J92325p6163M3477i6416B19365
11961a60465G2927c18580J32515Q6982k2064C9151g3515O224A16332E7072J60496
11950B17568j06799b48094F7764b5346m2700A29892h5512B2452c91207C5230c65372
11938b05779Q8959j4099p9089m5147o3290a03309A98790a39733A45952L4455G8499
11926A0375J98900J23586A7403b46454A84212E7040d8206B94767b8328B1486b51555
$$ plain form
12006 -31584 24503 -44230 94186 -207080 -312511 196680 12846 256654 -20281 -111401 -134917
11995 -134917 168437 -102910 -6206 138929 -413762 213604 95973 129236 -262536 -144456
11985 -144456 -177036 -277841 50765 148084 -49262 -119224 213172 -39074 43071 93340 -85130
11973 -366713 16753 38906 -17887 -107310 421852 61326 253651 177488 220965 -96416 219365
11961 -160465 72927 -318580 -186065 -99083 -121147 39151 -73515 -67291 116332 57072 217568
11950 217568 110769 -248094 67764 -25346 -68046 129892 -85512 22452 -391207 35230 -365372
11938 -205779 -116820 -130919 -210008 -255155 -318445 -103309 198790 -139733 145952 180407 78499
11926 10375 209275 332861 17403 -246454 184212 57040 -48206 294767 -28328 21486 -251555
11914a25688d5970B70679A17266d62829a4306B3969J2855a29323k44616C27030
11903h5544B71819A32686n1436C946L5112O298c66168a18360J8737q1026b6212
11891A9950K57228a65657D422K14586b30691A16021f9983m7588A7333b12637Q8599
11880a24038b9954a833k86639h3799l1887B9396b22732j21549A20332b91692j09815
11869d01507A43594a34191n3644A63054L2675j4678b34229E1445b97038b6887
11858C6930e9030J928q6227l808E9320L06771b65874c4845k05372P391A28046
11846c12009B21315j05811A949a4419k6161p1012I7913i352D6833l77b6460j34022
11834a60482e5647j5692D6846a23377J8775b9405G0075L78890n0666B7007f3722
$$ plain form
11914 -125688 -45970 270679 117266 -462829 -14306 23969 36824 -129323 -373939 327030
11903 -85544 271819 132686 81250 3946 39058 45356 -366168 -118360 -99623 -180649 -26212
11891 19950 277178 -165657 4422 219008 -230691 116021 -69983 -117571 17333 -212637 -124038
11880 -124038 -29954 -1833 -288472 -83799 -115686 29396 -222732 -344281 120332 -291692 -401507
11869 -401507 143594 -134191 -187835 163054 195729 181051 -234229 51445 -297038 -26887
11858 36930 -59030 -57102 -143329 -147137 59320 366091 -265874 -34845 -240217 -232826 128046
11846 -312009 221315 115504 1949 -14419 -40580 -111592 97913 -9352 46833 46456 -26460 -160482
11834 -160482 -55647 -71339 46846 -123377 -104602 -29405 70075 448965 398299 27007 -63722
11822c77057a72673g0289b8701A29124J01439A6958Q9176D7055a85851A54370
11811C39558d70816a0299n5810j12085D9742d1969A52529n7760a09419B09511
11800F2620O1510O9533n0340a03750A64254c21032B43109l1185c7879j93165R4620
11789a36424n4342D9716a94473c0588m3668A33854f0394B90136a70157O3326n9088
11778a65919h1970n5073f828G2163k6854a84985n8091F5388a38531C2786a38740
11766a72061C9103c3716k56591a16044G1673a3081p8244K867N885C18351E4927
11754a70696I2118a94137p8867e2667A08116h4958B65302A1547K03558C6475b80897
11742B13187c52722a72703m1354E6606g6282F6144a81222A70446f4396K2643A92274
$$ plain form
11822 -377057 -172673 -70289 -28701 129124 230563 16958 106134 47055 -185851 154370
11811 339558 -470816 -10299 -66109 -178194 49742 -41969 152529 94769 -109419 209511
11800 62620 124130 193663 143323 -103750 164254 -321032 243109 211924 -37879 -231044 -136424
11789 -136424 -190766 49716 -194473 -30588 -74256 133854 -60394 290136 -170157 -106831 -165919
11778 -165919 -81970 -137043 -6828 72163 45309 -184985 -243076 65388 -138531 32786 -138740
11766 -172061 39103 -33716 -290307 -116044 71673 -13081 -91325 -88458 -82573 318351 54927
11754 -170696 92118 -194137 -273004 -52667 108116 -84958 265302 11547 215105 36475 -280897
11742 213187 -352722 -172703 -214057 56606 -76282 66144 -181222 170446 -64396 -41753 192274
11730C16722A31284e922H4663L0184b92896i8294A30036J58471a10568K9467B68423
11718G3723L09986H2411g12I2545f3218A26944J48737B6784h4073B24972l0881
11707A94091j7567p5956b66488G5725K23001A16701E5668J83673a49479f3199
11696c2773B99819E1971a81572O2816F9227J48375K55428A3411b86538E3482J47233
11685B00715J29458C7697h8540A51316J73303h606B46310D8133O1215a09538B22962
11673A07290b79112B3317M1566a59460d0370J2620j33421f3036j90365A35319
11662b23297I3897J4318b04377e6941G346a25625A03782c04940C6447e5592A85046
11650B69895j2133j11053L7459f3473p4794q2419d85a27l17340F7278i4595c8329
$$ plain form
11730 316722 131284 -5922 84663 114847 -292896 -98294 130036 288507 -110568 -81101 268423
11718 73723 383709 82411 -712 92545 -63218 126944 275681 26784 -84073 224972 194091
11707 194091 176524 100568 -266488 75725 298726 116701 55668 239341 -149479 -63199
11696 -32773 299819 51971 -181572 -118756 69227 217602 473030 13411 -286538 53482 200715
11685 200715 330173 37697 -88540 151316 324619 -8606 246310 48133 109348 -109538 222962
11673 107290 -279112 23317 64883 -159460 -40370 -27750 -161171 -63036 -253401 135319
11662 -223297 93897 108215 -204377 -56941 7346 -125625 103782 -304940 36447 -55592 185046
11650 269895 257762 146709 184168 -63473 -138267 -220686 -485 -127 -317467 67278 -94595 -38329
11637a11645C33483r8776R9361J913a02175F9465b14699B75261g7980A7582L6203
11626E3785L4722c12410A60137L5249o2002J85056A724L55529A2655b369B69450
11614a57980A38465B5005C715b35496d1485l4638q2117G9704P3550D4705Q2955
11603A27660b57761B55048e9897j21022A14574D6547i3618r6325A61791A7222
11592C2547b5905p5075A70913E2912c0220l9568C77719A34470J08391l1733l8060
11581A73068C7176g2463c4783B92532A28037R7498a40774A79221C5002R9542P3025
11570B07569L01803q3183A16561J61208G4933a20959A34858R6130r4040O4469
11560B01417b44474I3122L2370R0313F7142d33272i4196j148L3300A67096K24168
$$ plain form
11637 -111645 333483 234707 334068 335981 -102175 69465 -214699 275261 -77980 17582 53785
11626 53785 88507 -312410 160137 195386 133384 318440 1724 357253 12655 -2369 269450
11614 -157980 138465 25005 3715 -235496 -41485 -76123 -158240 79704 153254 44705 127660
11603 127660 -257761 255048 -59897 -180919 114574 46547 -93618 -189943 161791 17222
11592 32547 -25905 -100980 170913 52912 -30220 -69788 377719 134470 242861 211128 173068
11581 173068 37176 -72463 -34783 292532 128037 225535 -140774 179221 35002 134544 207569
11570 207569 509372 426189 116561 277769 74933 -120959 134858 230988 136948 201417
11560 201417 -244474 93122 125492 215805 67142 -433272 -94196 -95344 -62044 167096 391264
11549C91264G6216K1805K30896a20859B80882a8367j19961K8213C6152a86345
11538B87253R4703O208l8437l3123D6325L12334A67319i5530A07746j7613D832
11526C32472A7569J64761a09968G5425i3247L9575D15452q7105r9711G5108P9479
11515A54587m0644h8976C8433L07420B7697A78K78943B6261K49917m9040A3196
11503B04448J14631r0872F0214K72926B1928J42001d1802j77138A34326J93608
11493C27934A62908R5612p3333P3766a33753C5779K53177L2608j50594b433A87707
11481B01902d7399F7187J18995J75579A14505L87961b914D02460p2850O3695j0807
11470C82498a13083H9922M3081b39377B55322A07696e3976C07150E2941a08445
$$ plain form
11549 391264 76216 98021 328917 -120859 280882 -18367 -138328 -110115 36152 -186345
11538 287253 381956 388164 349727 316604 46325 358659 167319 -95530 107746 90133 4832
11526 332472 17569 182330 -109968 75425 -93247 -53672 415452 328347 228636 75108 154587
11515 154587 113943 -88976 38433 345853 27697 178 279121 26261 276178 227138 13196
11503 204448 319079 228207 60214 333140 21928 163929 -41802 -218940 134326 327934
11493 327934 162908 258520 185187 258953 -133753 35779 288956 321564 170970 -2433 187707
11481 201902 -47399 67187 186182 361761 114505 502466 -2914 402460 329610 393305 382498
11470 382498 -113083 89922 133003 -239377 255322 107696 -53976 307150 52941 -108445
11459B52333O1958r8606c2627G5696J57229m4095b5302p601m2964K1991j83447
11448b37323A59617J67614B840K10398C5408O3651K62040b3381l129A66739i9778
11436A230J83497P3609F6126K0231K13900F3688h4881B607J1952L1777J19094
11425A65430F6430J6297J77446b2158q4155d8330j90583L9684Q5012k9509G380
11413b9737F6175P4304n8579J43841b4094p2012c0811n9437k35548I4782b3750
11401A50279J9372P3617d4714j11117A66980o7207b5060A64646a50383I9384J3903
11390A13287Q0268F5063P4319c7272G8808c88584f4879p842I7842J05963J2805
11379B16610I5209B5105a04434L4134E1165J13969a35264B17639c56456A3393
$$ plain form
11459 252333 314291 215685 -32627 75696 232925 188830 -25302 -32903 -75867 -53876 -237323
11448 -237323 159617 327231 2840 213238 35408 99059 361099 -23381 -26510 166739 -99778
11436 1230 184727 258336 66126 86357 300257 63688 -84881 2607 14559 46336 165430
11425 165430 66430 82727 260173 -22158 -106313 -48330 -238913 -199229 -114217 -143726 7380
11413 -29737 66175 140479 81900 225741 -24094 -96106 -30811 -90248 -325796 94782 -23750
11401 150279 169651 243268 -44714 -155831 166980 99773 -25060 164646 -150383 99384 113287
11390 113287 193555 65063 139382 -37272 78808 -388584 -64879 -72721 97842 203805 216610
11379 216610 95209 25105 -104434 -70300 51165 165134 -135264 217639 -356456 13393
11368a22945G5402b73796c4781B28768I142f1426k5552L8488j98462J03080J176
11357a42696f6586m4329A53435F9798N7083a18066j1178D1338o592e9206E4224
11345B66166a73985L0643A06713D9019a05993A7943O289h9248F1201d23594J03687
11334c19907G2492N4516m1534P3254J9226a8433B49430d2399G9909a59050b6238
11322b92480a07176N754p5843B35751A09694J34300a32575B66481n1465k6915
11312A88101O0090a93780j069E7117d4813H281J78292a13624A48655a43083o4843
11301b07926a2491j04588G379K4395a56432F1237c01606D4621a8595A19709a47238
11289c00399F4393c0501j97772B2507K9390j5288b0019K465E384K75366j5091
$$ plain form
11368 -122945 75402 -273796 -34781 228768 9142 -61426 -86978 -48490 -246952 -143872 -142696
11357 -142696 -66586 -110915 153435 69798 126881 -118066 -129244 41338 34746 -59206 54224
11345 266166 -173985 -143342 106713 49019 -105993 17943 24232 -89248 61201 -423594 -319907
11334 -319907 72492 127008 85474 158728 177954 -18433 249430 -42399 79909 -159050 -26238
11322 -292480 -107176 -101422 -177265 235751 109694 243994 -132575 266481 215016 188101
11312 188101 248191 -193780 -194849 57117 -44813 8281 186573 -113624 148655 -143083 -207926
11301 -207926 -12491 -117079 7379 31774 -156432 61237 -301606 44621 -18595 119709 -147238
11289 -300399 64393 -30501 -228273 22507 51897 36609 -20019 -17554 5384 280750 265659
11278B65659E0788a34484j8015J7239c4082B5520J57347b288A81626a63965N9452
11267a04513G210A734J44970m0870b1417H3609K0474b15762e1582l9048C6179
11255a32331k1282L3035p3406A26632J66342e6660J8789B38725B4067J25549A0427
11243C66525c64128A23433b14631c9598j88387k15558A25410b20371b1874j96741
11233b18615M9048M9315G2847J42717a39481C23970A58189E0985o469a64055q8267
11222b52322B06458b37744A0287a68163n4130d4535k07874k31985c4032E5441
11211b41521E0849M1153i6580r1547a2486k57385G8759a38236j50192i3468c8725
11199b6344k57267g671D6864b26330b5475p0775k01638A24773g0361D4801J32294
$$ plain form
11278 265659 50788 -134484 -152499 -135260 -34082 25520 182867 -2288 181626 -163965 -104513
11267 -104513 7210 1734 146704 105834 -21417 83609 104083 -215762 -51582 -90630 36179
11255 -132331 -153613 -120578 -193984 126632 292974 -56660 -37871 238725 24067 149616 10427
11243 366525 -364128 123433 -214631 -39598 -227985 -443543 125410 -220371 -21874 -218615
11233 -218615 -169567 -120252 72847 215564 -139481 323970 158189 50985 44516 -164055 -252322
11222 -252322 206458 -237744 10287 -168163 -222293 -44535 -252409 -484394 -34032 55441
11211 -241521 50849 92002 -96580 -188127 -12486 -269871 78759 -138236 -288428 -93468 -38725
11199 -26344 -283611 -7671 46864 -226330 -25475 -96250 -297888 124773 -70361 44801 177095
11188A77095a30576j18849B28572g1004A28914J58933P3404j62090Q4655a72530
11177b18081B86172E4385a0697B05599b12281j06465J02303I9524J9522a8226
11166B34949c6049I2327l746b27827d9312k97585A1040J03308a91877L3612A68671
11154a89118A02529C7177j5298i9547B14206h4169A28205j8369h2480C3405a08287
11142a41521b9568A77014i9559B68214a06006A50160J26787R708j31255p4803
11132H0597E131J57364L4959L6547j0148J16263b7744A44935l0518b40124H9253
11120E31004B46114e2545B48536F9376a05544o5318E1445J64092G3720e8449H341
11108C3433J3806K58452G9344K24353H6344J12261R9931b10771f6525G7631J38284
$$ plain form
11188 177095 -130576 -249425 228572 -71004 128914 287847 361251 199161 283816 -172530
11177 -218081 286172 54385 -10697 205599 -212281 -318746 -216443 99524 119046 -18226
11166 234949 -36049 92327 88581 -227827 -49312 -346897 11040 114348 -191877 -158265 168671
11154 -189118 102529 37177 21879 -99547 214206 -84169 128205 109836 -82480 33405 -108287
11142 -141521 -29568 177014 -99559 268214 -106006 150160 276947 286655 155400 80597
11132 80597 5131 162495 197454 234001 223853 340116 -27744 144935 114417 -240124 89253
11120 531004 246114 -52545 248536 69376 -105544 -170862 51445 215537 73720 -58449 8341
11108 33433 47239 305691 79344 303697 86344 198605 298536 -210771 -66525 77631 215915
11097B15915P2915A40116M978M9961j7134F3693M48095B8760J33652m7616K9415
11086A44211J15446g4900C34213A58201M62271H0348J44670J1881D9808K54362
11076C04170J0748n2015A13900K03853j36390K36339m4035R6779j97067O9507
11066C42886n435J61853k41780M15180C18456M45320C17463L10309J49j86p5964
11055E51771N9490J9757k2714j68483l9307K40663K80498k08323L92410k6073
11045A079689m96076L24059j85633J97183L03988l78328j58777Q04L59226k53803
11035G92332M73999n63860k94697O7007K83681l66600L78366j95304J44528j76992
11025E42460L18897R8995l45434Q4333L35986C18695J97502K84657k16194N34617
$$ plain form
11097 215915 288830 140116 145094 195055 177921 63693 511788 28760 162412 114796 144211
11086 144211 259657 -74900 334213 158201 620472 80348 225018 236899 49808 304170
11076 304170 314918 262903 113900 317753 181363 417702 373667 470446 273379 342886
11066 342886 337451 499304 257524 672704 318456 763776 317463 627772 627921 627735 551771
11055 551771 611261 631018 608304 439821 400514 641177 921675 713352 1105762 1079689
11045 1079689 583613 907672 722039 919222 1223210 844882 686105 686909 1046135 792332
11035 792332 1266331 702471 407774 474781 758462 391862 770228 574924 719452 542460
11025 542460 861357 960352 614918 699251 1035237 318695 516197 800854 584660 1119277
11015A119277m81351J820J37267k80897R4171p7716Q5813k50579L11676J20453
11005G79934m9771r7452n8976J85316k22751J5351N2887j5179o0398j070L64031
10994H91922C88526L36985J89737k84916J71710k4342J1311r103K02934q140k49021
10983G25681N33725j33892M14688k10202j59013P03835p1608K9258L46307j73317
10973B005462L33946N37772K40048m30482O8813J45397j61793j8607k65926l67013
10963B087617j25736J3075n5267J02906p6290J5198M37834n06957q2275K02465
10953B012570k66037K3398m92949J36170l26124k94114l2782l11645L24481B89407
10942F29889A75071K85228i2479C42805A27669K52375r3684F7441L84816B03747
$$ plain form
11015 1119277 637926 639746 777013 496116 590287 512571 598384 347805 659481 779934
11005 779934 730163 632711 573735 759051 536300 551651 604538 589359 528961 527891 891922
10994 891922 388526 725511 915248 630332 802042 777700 789011 779908 982842 974702 725681
10983 725681 1259406 1125514 1540202 1330000 1170987 1874822 1803214 1832472 2178779 2005462
10973 2005462 2339408 2877180 3117228 2686746 2755559 2900956 2739163 2720556 2454630 2087617
10963 2087617 1961881 1974956 1919689 2022595 1946305 1961503 2399337 1892380 1810105 2012570
10953 2012570 1746533 1769931 1276982 1413152 1087028 792914 760132 448487 772968 289407
10942 629889 175071 460299 -92479 342805 127669 380044 286360 67441 452257 203747
10931F3113c7911C7851K48785K66559j89030A38406J7215n5098a68579L6422a3794
10919A6446L94695A70194o3654b40020c4729l7244A94630c35562C39921j33412
10909B06509d5042j34263C09666A14116a48366j10496b4807m1122A15508h6860
10898D3531K06348P5722D1545K01062D9688k1695a33349A01846f1103K2469D5461
10886b66066A64114e3716o8556K5781M4242B48401c3445B27326f2302k36805B1353
10874a82783B55534J77661A876a84262e0914g977A60643h3008D80044i8112E3306
10862d15550C9545j4757L4214f7159B90210a36051j66644C1421b81553A17983
10851A72514K55483E8402a18194A1682O842c64606A00843B2349a46154l9143L779
$$ plain form
10931 63113 -37911 37851 286636 553195 364165 138406 155621 100523 -168579 -132157 -13794
10919 16446 411141 170194 106540 -240020 -34729 -71973 194630 -335562 339921 206509
10909 206509 -45042 -179305 309666 114116 -148366 -258862 -24807 -65929 115508 -86860
10898 43531 249879 325601 41545 242607 49688 27993 -133349 101846 -61103 -38634 45461
10886 -266066 164114 -53716 -122272 -96491 -52249 248401 -33445 227326 -62302 -299107 21353
10874 -182783 255534 433195 1876 -184262 -50914 -7977 160643 -83008 480044 -98112 53306
10862 -415550 39545 24788 59002 -67159 290210 -136051 -302695 31421 -281553 117983
10851 172514 427997 58402 -118194 11682 18524 -364606 100843 22349 -146154 -185297 -181518
10840a81518E7471M4314L3302J58948J19833b077E1050n467M0911f05n1158C13839
10827a36622D38219b7146j57800g5646B30378c9413F8544K46896d68955a95640
10816a3340n27391K57557a28355j8103A73950b6934q5220j33693A31071C870K14176
10805B18046F1655J39124a33484k9682N9319D2766b3338k58267F8112K9460D6867
10793b49137B13018a26428J2636e2599C8327J46331b93375a29668B44765I341
10782A35332a22470d0725r3823k5246J5307F3610j1848h7012A49084m9624J16751
10771B16211a09970d0209A8366K12474H5318N394c50899g3691A26896e7314j39542
10760a96856C67393f7997A36009b93328G9085J5976h0206q9987B513c51703E1715
$$ plain form
10840 -181518 57471 101785 135087 294035 413868 -2077 51050 45583 86494 -605 -51763 313839
10827 -136622 438219 -27146 -184946 -75646 230378 -39413 68544 315440 -468955 -195640
10816 -13340 -540731 -283174 -128355 -146458 173950 -26934 -112154 -245847 131071 3870 218046
10805 218046 61655 200779 -133484 -163166 -103847 42766 -23338 -281605 68112 97572 46867
10793 -249137 213018 -126428 -113792 -52599 38327 184658 -293375 -129668 244765 9341
10782 135332 -122470 -40725 -134548 -159794 -144487 63610 51762 -87012 149084 99460 216211
10771 216211 -109970 -40209 18366 230840 85318 90712 -350899 -73691 126896 -57314 -196856
10760 -196856 367393 -67997 136009 -293328 79085 95061 -80206 -170193 2513 -351703 51715
10748h7845J7612m4327F6430A0187J89778H198J08526O1664b42857A21334B3350
10736a36209j34568a8152k0745d986j23843k5177A22101B5770a11802J182F7863
10724C9344P3258d49165A4681J50810C6952e0333l09506A32425a94443B53623
10713a83137e2141B18301P6555b17382I7203k2434a63280A89129b29770l8774
10703b68544h0946B33364f9307D8842b46510p3842i3884c7783C01850c73267J04600
10692b68667g8308a5147j62273j1686e3265k79864J45581A68741a77224A10608
10681a1895q3619b4219A33260e6891I6871b52052K6354B34745a6739o7766B5603
10669b36393A10874C1643a13139D8575a2986j54209q2219j93655a30969m608j41068
$$ plain form
10748 -87845 -70233 -114560 66430 10187 199965 8198 116724 178388 -242857 121334 23350
10736 -136209 -270777 -18152 -38897 -4986 -128829 -154006 122101 25770 -111802 -110620 67863
10724 39344 112602 -449165 14681 165491 36952 -50333 -359839 132425 -194443 253623
10713 -183137 -52141 218301 294856 -217382 97203 74769 -163280 189129 -229770 -268544
10703 -268544 -80946 233364 -69307 48842 -246510 -320352 -93884 -37783 301850 -373267 -268667
10692 -268667 -78308 -15147 -177420 -189106 -53265 -333129 -187548 168741 -177224 110608
10681 -11895 -95514 -24219 133260 -56891 96871 -252052 -225698 234745 -16739 -84505 25603
10669 -236393 110874 31643 -113139 48575 -12986 -167195 -249414 -443069 -130969 -135577 -276645
10658b76645c1692D2004K03398K1279I8315A050a59893N4293B44272r4487K1701
10647A71486i2776j36413R6961A20424c5261q8960j88410D4943a55557o2694C36863
10635b58025m083E5713a02757C35635b91997a22269a1158B3790c29528d5342j08874
10624a54216H4375h5736q1909A6572c31633J14151L2352B5586b06748n2427N3018
10613b06157H5248B5033d02399D2464a20685d5220A2868b64141A46707i8510q5801
10602a84311N0392q9997B67149b3090j30790j34412a9217j0457C7473b13227A5943
10590g3565j14746M2008c0966D6994d4679j04038C938K41372b5716k03712M8394
10579a81034c8189A06851m3886M0372q260b82812A31100a15865n3108P4943A5229
$$ plain form
10658 -276645 -31692 42004 245402 266681 98315 1050 -159893 -105600 244272 149785 171486
10647 171486 -92776 -229189 -132228 120424 -35261 -124221 -312631 44943 -155557 -218251 336863
10635 -258025 -262108 55713 -102757 335635 -291997 -122269 -11158 23790 -329528 -45342 -154216
10624 -154216 84375 -85736 -167645 16572 -331633 -217482 -185130 25586 -206748 -259175 -206157
10613 -206157 85248 25033 -402399 42464 -120685 -45220 12868 -264141 146707 -98510 -184311
10602 -184311 -133919 -223916 267149 -23090 -153880 -288292 -19217 -29674 37473 -213227 15943
10590 -73565 -188311 -146303 -30966 46994 -44679 -148717 3938 245310 -25716 -229428 -181034
10579 -181034 -38189 106851 62965 103337 95077 -282812 131100 -115865 -168973 -94030 15229
10567F5646e7034k40008B10310o9885j9910N3808g4764j37856A49946a38160l9278
10556a77438C00298G0316J49316F7701R2471a0771j61408F2517J8917N6488Q6106
10545B24028N407D8850b94725B11465b06180Q5404r750r0728D06819A35370E6402
10533A15498a61250M1290G3345j9258d6111p7794j92949C3467J00352e4587P699
10522d6888j01928A13210i8551k72043b4412A29244d2694A5338a34222d5268o223
10511e1491b0596k76046G2064K16033h6027C6770J01973a09113b0698B49602b57070
10499a59442A8369K74111j42842L0210Q0845b22897B52106D9598a58462E9205
10488g6128n9853C6028c3349j77101b5091q6130A93167K6466Q9407l5070J76633
$$ plain form
10567 65646 -57034 -297042 210310 140425 120515 174323 -74764 -212620 149946 -138160 -177438
10556 -177438 300298 70316 219632 67701 160172 -10771 -172179 62517 81434 137922 224028
10545 224028 229435 48850 -294725 211465 -206180 -120776 -130526 -221254 406819 135370 56402
10533 115498 -161250 -119960 73345 54087 -46111 -123905 -316854 33467 133819 -54587 -46888
10522 -46888 -148816 113210 -98551 -370594 -24412 129244 -42694 15338 -134222 -45268 -51491
10511 -51491 -20596 -296642 72064 288097 -86027 36770 138743 -109113 -20698 249602 -257070
10499 -159442 18369 292480 149638 179848 260693 -222897 252106 49598 -158462 59205
10488 -76128 -135981 36028 -33349 -210450 -25091 -111221 193167 219633 309040 273970 450603
10477D50603J40503C2448R4773K82596B5036g0458B50927E7044E144a57006A73237
10465a12995D13262c70401b5305q3505k31556h329k04591e0551q8089l5456B0286
10453b8621A70533a20233j7379A5548J39145n149a39641B76820A19207L0386b15605
10441e6076b2765j16662A67016B625J91295b23904k2474Q6259j74850h8544b2890
10429A11557b69633h0748A49377k5648O2391f4905A9890b29362q7507C4626K2281
10418E6907b21474g872p2036k25667K1189b7053A85808a89030G0013a62247j83352
10407c45599J55218R1210C71976b48711A95719m8583f40426b37148A23564D6749
10396A41169F9072J31309E3588k0905J41878J06270A27091B2765J88233F2091
$$ plain form
10477 450603 591106 32448 127221 409817 25036 -70458 250927 57044 5144 -157006 173237
10465 -112995 413262 -370401 -25305 -108810 -340366 -8329 -212920 -50551 -138640 -174096 20286
10453 -28621 170533 -120233 -137612 15548 154693 149544 -139641 276820 119207 149593 -215605
10441 -56076 -22765 -139427 167016 2625 193920 -223904 -246378 -160119 -334969 -88544 -22890
10429 111557 -269633 -80748 149377 123729 186120 -64905 19890 -229362 -316869 34626 56907
10418 56907 -221474 -7872 -79908 -305575 -284386 -27053 185808 -189030 70013 -162247 -345599
10407 -345599 -190381 -99171 371976 -248711 195719 147136 -640426 -237148 123564 46749
10396 141169 69072 200381 53588 32683 174561 280831 127091 22765 210998 62091
10385b6543q0200A34162m6385N9541L8804A2355J93117Q7471C2569L55669K6626
10374D14864F7511K03275r6932J15513K5606j43367n9644J43504J95940j43778
10364C07628J12926K53458B54745P627i7460D08654o2056j13986o8298M03045
10354E67359D5244K84223m0790Q6251K9008J67774j70959J35537J08497k45528
10344C99257b7910B09474M34808l16911A11211L06370j97063m3842L7608J18462
10334C32746j43462N023a42129F4289K40348G6264g5985j30678C55145j41788
10324B13357k978j04857k4560K66830a07805C45886A623e1005B99475f0535A05493
10312A76346a50470B6782a3195j33193D2259j4592b59168A96600B8996P1065N33508
$$ plain form
10385 -26543 -106743 134162 87777 147318 186122 12355 205472 292943 32569 388238 414864
10374 414864 67511 270786 173854 289367 314973 171606 111962 255466 451406 307628
10364 307628 420554 674012 254745 262372 -97460 408654 346598 232612 164314 567359
10354 567359 45244 329467 288677 374928 403936 571710 400751 536288 644785 399257
10344 399257 -27910 209474 644282 327371 111211 417581 220518 176676 214284 332746
10334 332746 189284 194307 -142129 64289 304637 76264 -75985 -206663 355145 213357
10324 213357 210379 105522 80962 347792 -107805 345886 1623 -51005 299475 -60535 105493
10312 176346 -150470 26782 -13195 -146388 42259 27667 -259168 196600 28996 100061 633569
10301F33569g2762H1727P3142a45589C5297b87256F4028j6644b5212A26541b7776
10289B50063G0775M9745g8345j75331I109R7017b07110l0337i5358F9995f4451
10277b02589j67943I5625Q019A7213d3205r526j32538J7701g5076A44424M8172
10266A92596q0455a33093d4891A37112P9781j01633K55563p6327J46300j74593
10256B66203K10008B24183a7374A12965O2021J83566b3094l741G8412j8613b15438
10244a7764B14169r5547J476n7923J43419a55067k40668e0101A83515c40119A03159
10232B01909q8851b1282l315H890K45049h3055k67943h2709p975j00995G8544
10220a19396n25651i6649B00552f8582A21295B9064Q182a25404j18594c3721m6921
$$ plain form
10301 633569 -72762 81727 154869 -145589 35297 -287256 64028 47384 -25212 126541 -27776
10289 250063 70775 120520 -78345 -253676 9109 106126 -207110 -237447 -95358 69995 -64451
10277 -202589 -370532 95625 103644 17213 -43205 -52731 -185269 -167568 -75076 144424 192596
10266 192596 112141 -133093 -44891 137112 216893 115260 370823 294496 440796 266203
10256 266203 476211 224183 -17374 112965 174986 358552 -23094 -26835 78412 59799 -215438
10244 -17764 214169 118622 120098 62175 205594 -155067 -395735 -50101 183515 -340119 103159
10232 201909 113058 -21282 -24597 8890 253939 -83055 -350998 -82709 -90684 -191679 78544
10220 -119396 -645047 -96649 200552 -68582 121295 29064 37246 -125404 -243998 -33721 -80642
10209h0642K5367j93040J7475f9127j31711j39654P7776A13333m9883K18529j28505
10198A53474c20818J46185J5325l2007H106R7664b19716f5175J4577j14538g5761
10186a40532j15581A56921J06250b1186k34102B6978h7887k3426L4018C7106J80217
10175B17323I4595J9444B680c0490j33096F1574a1127j49295H7780a6045r9856
10164a15901m6318o342c2601j07881j30591a2749k49859D01685F449O0044a07129
10152B6192Q3742g3859E1346a68151j71373E4081B3536d6527B0058J09276A0974
10140a96488G236J55514E4421Q7724a48734m0357R706g0092J3456H0301a30362
10128f7090n15598a20051K3240C1524J74274F2137h5522m1514j48488A36081n2324
$$ plain form
10209 -80642 -55275 -248315 -230840 -69127 -200838 -340492 -262716 113333 63450 281979 153474
10198 153474 -320818 -174633 -159308 -191315 8106 105770 -219716 -65175 -50598 -165136 -75761
10186 -140532 -256113 156921 263171 -21186 -255288 26978 -87887 -111313 -77295 37106 217323
10175 217323 94595 114039 2680 -30490 -163586 61574 -11127 -160422 87780 -16045 -115901
10164 -115901 -162219 -168561 -32601 -140482 -271073 -12749 -262608 401685 6449 66493 -107129
10152 26192 109934 -73859 51346 -168151 -339524 54081 23536 -46527 20058 129334 10974
10140 -196488 7236 162750 54421 142145 -148734 -189091 -179385 -70092 -56636 80301 -130362
10128 -67090 -582688 -120051 -96811 31524 205798 62137 -85522 -127036 -275524 136081 83757
10117H3757d4428A58063l664c19259A98430P8096a25107A64156b12674d1094m4803
10106h5897j58394f5495D67105a23746B4920a6216r7989K7916B27914c8825n5417
10095i4242b917l69104D802K05898b1327j22881B09304e9103k72055j42316A73030
10083a8663G7931h8136j3233j45750A20407J39963b25186Q3366C134Q838n964
10072F008B042M2000e1753k84422d8325F4147d1810k11097k41220e5920C9475
10060f0091j3006A39349b06833d7406l1278A71296b00917H6448a95735A8079c02980
10048B21460D8630J32987D7212e3896n3511R966j9308l08194f8071l7889b0074
10036a73627L5627f8852G7905N7118k7240a18753l13280a14656a3917k98481d76
$$ plain form
10117 83757 -44428 158063 154399 -319259 198430 276526 -125107 164156 -212674 -41094 -85897
10106 -85897 -244291 -65495 467105 -123746 24920 -16216 -114205 -86289 227914 -38825 -94242
10095 -94242 -2917 -372021 4802 210700 -21327 -144208 209304 -59103 -331158 -473474 173030
10083 -18663 77931 -88136 -101369 -247119 120407 260370 -225186 -141820 3134 11972 6008
10072 6008 2042 44042 -51753 -336175 -48325 64147 -41810 -252907 -494127 -55920 39475
10060 -60091 -73097 139349 -206833 -47406 -78684 171296 -200917 86448 -195735 18079 -302980
10048 221460 48630 181617 47212 -53896 -107407 -97441 -116749 -424943 -68071 -105960 -20074
10036 -173627 -138000 -68852 77905 135023 107783 -118753 -432033 -114656 -13917 -312398 -476
10024D1652b07687K6884G2410J33088k0329c15463G0487a12668j07384H5868K5367
10013A11235c08755L8660K9051d5636q6171l5901D2580a84941N6357Q717K258
10002a17609n1138q6442a20666A92662E5274d6928G8805a09484K0717I482a00813
9990c5191k89894G7973J03677b00493h56k30123m9581l78I5636a17464E8084a58982
9977a98679k52921j7990K08002a17158J4158A70003a05117A97057b22254c027
9966B11690q4793a55310k00737J73734A87870h6513A9544d11347d5712a9628j26995
9955a46623M2371n2164H5976P142a1970C9217P8801a05415B23011e9959A06351
9943I9500c30907K1568A27662a6353A85950b06103A93158J33655a04682j17187
$$ plain form
10024 41652 -207687 -180803 72410 205498 185169 -315463 70487 -112668 -220052 85868 111235
10013 111235 -308755 -270095 -241044 -45636 -131807 -167708 42580 -184941 -128584 -119867 -117609
10002 -117609 -168747 -255189 -120666 192662 55274 -46928 78805 -109484 -88767 9482 -100813
9990 -35191 -325085 77973 181650 -200493 -856 -230979 -280560 -280938 95636 -117464 58084 -158982
9977 -198679 -451600 -469590 -261588 -117158 -103000 170003 -105117 197057 -222254 -3027
9966 211690 126897 -155310 -356047 -182313 187870 -86513 19544 -411347 -45712 -19628 -146623
9955 -146623 -104252 -156416 85976 93118 -11970 39217 118018 -105415 223011 -59959 106351
9943 99500 -330907 -309339 127662 -16353 185950 -206103 193158 326813 -104682 -221869
9933b21869J01762k606E4061b1892j53767A85507a88833N370b2999m06149b0984
9921I0692b59859L4941Q0602A78043l4207J21793h7677L0208l7700A38182d1940
9909b56393E1366d42679A72967e56829D0143P6771b13853O9848j79578D4567N7419
9898A01986c86825J53595O9330q5329g6045b6384k12693J7051j39047F8538a02970
9886i1512B8882a66743C38468a28799j11765L2444B37692E60h6995C4379b4214
9874c4836j41210l21064a73121j38214A16308a19444j08897A88208F2990L3563
9864I6553a48223A6053g9309B40491a05434j88255J06052k809p7952B28298O7535
9853B95833b12642F6852n067d82390K33591C4556N5230A910M5033c81843a23279
$$ plain form
9933 -221869 -120107 -122713 54061 -21892 -175659 185507 -188833 -183463 -22999 -429148 -20984
9921 90692 -259859 -224918 -144316 178043 143836 265629 -87677 -57469 -95169 138182 -41940
9909 -256393 51366 -442679 172967 -556829 40143 116914 -213853 -144005 -323583 44567 101986
9898 101986 -386825 -233230 -163900 -249229 -76045 -26384 -239077 -222026 -361073 68538 -102970
9886 -91512 28882 -166743 338468 -128799 -240564 -208120 237692 560 -86995 34379 -24214
9874 -34836 -176046 -497110 -173121 -311335 116308 -119444 -228341 188208 62990 96553
9864 96553 -148223 16053 -79309 240491 -105434 -293689 -187637 -190446 -268398 228298 295833
9853 295833 -212642 66852 61785 -482390 -248799 34556 89786 1910 46943 -381843 -123279
9841b10182c6731A29827J65952a03709j33652F0658g3768A7528c3694m5659A69932
9829e8945l38706i1147C34949j50781B6534O1224e4380k62172a56330A7717f1553
9817b70315A63730B4720Q7708a74168o1065p768i1648q4642B64699b15856K5494
9806a90362B55123E3360J5152b34097g3440l1630J8367c8390o7073j37476E95
9794d43694A60821J418a66935E759P8400a91108r3096J32899A14337a04083p7483
9783a81566h3857i025j57607k23866a36349j7772m3801N2517A18137b0328k07058
9772b27386Q9309a6076g095j2234j50565O0533j39981K000A38657f4118A88557
9760B60001b02614e5776A45317b91778A48633b12914m7262J09983j35246a18169
$$ plain form
9841 -210182 -36731 129827 295779 -103709 -237361 60658 -73768 17528 -33694 -79353 169932
9829 -58945 -397651 -91147 334949 184168 26534 87758 -54380 -316552 -156330 17717 -61553
9817 -270315 163730 24720 112428 -174168 -235233 -243001 -91648 -176290 264699 -215856 -190362
9806 -190362 255123 53360 68512 -234097 -73440 -105070 -86703 -38390 -105463 -242939 595
9794 -443694 160821 162239 -166935 5759 84159 -191108 -284204 -151305 114337 -104083 -181566
9783 -181566 -83857 -9025 -166632 -390498 -136349 -154121 -197922 -145405 118137 -20328 -227386
9772 -227386 -138077 -16076 -7095 -19329 -169894 -109361 -249342 -247342 138657 -64118 188557
9760 260001 -202614 -55776 145317 -291778 148633 -212914 -260176 -150193 -285439 -118169
9749b73145a02685C4484a04763b8661G631f3727H3995a87049O4853c1943p0431
9738a02374F0328h1065b9433j7251n7339A91246F9123J18686D7105a87550A36407
9726D9425b6435k01770a2912j01934j38254J21389B10760C8555b03649A3695f4631
9714A82965c06224C3851c21349j07760C2725M1226b294o7261I2853a8429j68343
9703a86772c4314A01275c3082G1216c35486h0435p6093D1686a21593n1895N3865
9692a19623D4448L239b53877A91778b44917c5718b075I5378j6212a42348A9889
9680a1997C81054a63951A3504c79658i5484A0252e1119C9380h3726A77998f4761
9668c6678A48171a29308J4482J9900C30472H9632K4113c14847a7821G3162B0171
$$ plain form
9749 -273145 -102685 34484 -104763 -28661 7631 -63727 83995 -187049 -122196 -31943 -102374
9738 -102374 60328 -81065 -29433 -46684 -104023 191246 69123 187809 47105 -187550 136407
9726 49425 -26435 -228205 -12912 -114846 -253100 -131711 210760 38555 -203649 13695 -64631
9714 182965 -306224 33851 -321349 -429109 32725 73951 -2294 -69555 92853 -18429 -186772
9703 -186772 -34314 101275 -33082 71216 -335486 -80435 -156528 41686 -121593 -173488 -119623
9692 -119623 44448 47687 -253877 191778 -244917 -35718 -2075 95378 79166 -142348 19889
9680 -11997 381054 -163951 13504 -379658 -95484 10252 -51119 39380 -83726 177998 -64761
9668 -36678 148171 -129308 -114826 -94926 330472 89632 113745 -314847 -17821 73162 20171
9656D5068R9921b05159j04297A01952a04744K8360A28725b62427N1865J04870
9646a05692B00435h1918o2588K2319H1543e48862i3440K2926j44562B0095a19727
9634A16566b3546A10895e7165p9199p894B1990f0595k28214B12272d4741b0775
9622c43177a53929a2252p2502l03055a18596r4913q7560A27338c82931j5485J72829
9611b25587A60811B7337b5693j60533E5715A5984b00944A36904g5728p6435I1281
9599A11096b15539j06113A34119E8834a61004J1800l04685A77893a31810A80710
9588a56685I879a423n52161a43257f0458j89967A57643d06409a32727c7735j72622
9577b10357H9542a94231A14259G578R0283b78474A92193G6723i1984a1130l37298
$$ plain form
9656 45068 144989 -205159 -309456 101952 -104744 -76384 128725 -262427 -210562 -105692
9646 -105692 200435 -81918 -144506 -122187 81543 -548862 -93440 -70514 -215076 20095 -119727
9634 116566 -23546 110895 -57165 -136364 -144258 21990 -60595 -288809 212272 -44741 -20775
9622 -343177 -153929 -12252 -84754 -387809 -118596 -213509 -301069 127338 -382931 -398416 -225587
9611 -225587 160811 27337 -25693 -186226 55715 15984 -200944 136904 -75728 -152163 91281
9599 111096 -215539 -321652 134119 58834 -161004 -149204 -453889 177893 -131810 180710
9588 -156685 9879 -1423 -553584 -143257 -60458 -250425 157643 -406409 -132727 -37735 -210357
9577 -210357 89542 -194231 114259 7578 97861 -278474 192193 76723 -91984 -11130 -348428
9566c48428Q5839A2824g6267k46461R3992i3947A2079a90191E9999a48996C8704
9554a56367B4855K98074a01882I8494m2860a11387A77212K19631A42413a21494
9543H5640d5109J8819B06709J92035B9716g5242K2775j9722l28408D54763b26694
9531d5577i609q271q4342d510j84171c8697j08356f6235A34591b33690B24502
9519b17930J1824N2346j6642B00579c6108A24847d7247C39737a20626e3564Q892
9508d4672B82153g6542j64743d6440C8602a30530e7787j66412Q9723J5796B81664
9496c18942M9955J5927A8955b19142A99424b86249a4867j55398B50563G7313a63964
9484c58736g9592k83279a39644M4727j78140G5031c72713e140C58226c13367D8098
$$ plain form
9566 -348428 -262589 12824 -76267 -322728 -228736 -93947 12079 -190191 59999 -148996 38704
9554 -156367 24855 322929 -101882 98494 55634 -111387 177212 396843 142413 -121494
9543 85640 -45109 -26290 206709 398744 29716 -75242 -52467 -72189 -400597 454763 -226694
9531 -45577 -9609 -17880 -102222 -4510 -188681 -38697 -147053 -66235 134591 -233690 224502
9519 -217930 -206106 -153760 -170402 200579 -36108 124847 -47247 339737 -120626 -53564 -44672
9508 -44672 282153 -76542 -241285 -46440 38602 -130530 -57787 -224199 -134476 -118680 281664
9496 -318942 -268987 -253060 18955 -219142 199424 -286249 -14867 -170265 250563 77313 -163964
9484 -358736 -79592 -362871 -139644 -94917 -273057 75031 -372713 -5140 358226 -313367 48098
9472b5310l55421J10585g4535a8600k83162a16471A52999d6088A0823J00151l0268
9461H0706g1070K611k4651j46970A14669g3419m8804i462A03997b3635j13164
9450a36799A06061l9717O132a72814k6982A47382a30598a6203k07881H5608b13755
9438A52129E465O1048O8551a06459B9612i0043F597N3263a54227J292M3188j92969
9426c02716J28302K1621l3701B6154J9766K178a47299l2921J5605d9945B8968
9414a21709A52952d8197A11679a26560k54666b0469l4997k1915e364r1175p8153
9403a74692B30534e49356J73049D6688J15031M4472E7433N7132i2784j02491P9394
9392a15881J3457B1772i4399C38376F885b27012G5382c37156L3872D2528O6412
$$ plain form
9472 -25310 -380731 -270146 -74535 -18600 -301762 -116471 152999 -46088 10823 110974 80706
9461 80706 -71070 -68459 -93110 -240080 114669 -73419 -122223 -9462 103997 -23635 -136799
9450 -136799 106061 66344 72476 -172814 -199796 147382 -130598 -16203 -224084 85608 -213755
9438 152129 5465 66513 135064 -106459 29612 -90043 6597 59860 -154227 -152935 -109747 -302716
9426 -302716 -174414 -152793 -186494 26154 45920 48098 -147299 -180220 -164615 -49945 28968
9414 -121709 152952 -48197 111679 -126560 -381226 -20469 -55466 -77381 -5364 -96539 -174692
9403 -174692 230534 -549356 -376307 46688 161719 206191 57433 114565 -92784 -195275 -115881
9392 -115881 -102424 21772 -94399 338376 6885 -227012 75382 -337156 -303284 42528 108940
9381A08940a49292f4540c1932k72093a41457a2432o2272k3798B37768a40759q079
9370a48838C17538H9603a92433A17906D5526L28365b10228m1375g7303r9188e6398
9358i8228B9196J58822a75945b9562m3308k82708a16062j96600h6666A01477k3203
9347G8274L1563C4098K26537a89372O3698A2346b29162D813b78370A39924f8725
9335a47331c6685B13069h9615A18938a8260A25168a54342N7108B34397d19475
9324A08649a21006r3942a07123K3837j27930G2794N4607l1516a94332B80621G1465
9312c4385f441A11104i7641G0140L9974b79966A07232C3680a74688g8479k23898
9301c02377A52724m8043a12989G2843a83683j59822O3025I9268a58017A03951
$$ plain form
9381 108940 -149292 -64540 -31932 -304025 -141457 -12432 -74704 -98502 237768 -140759 -148838
9370 -148838 317538 89603 -192433 117906 45526 373891 -210228 -251603 -77303 -176491 -56398
9358 -98228 29196 188018 -175945 -29562 -72870 -355578 -116062 -312662 -86666 101477 78274
9347 78274 109837 34098 260635 -189372 -125674 12346 -229162 4813 -278370 139924 -68725
9335 -147331 -36685 213069 -89615 118938 -18260 125168 -154342 -97234 234397 -419475
9324 108649 -121006 -214948 -107123 -83286 -211216 72794 127401 95885 -194332 280621 71465
9312 -34385 -6441 111104 -97641 70140 110114 -279966 107232 33680 -174688 -78479 -302377
9301 -302377 152724 104681 -112989 72843 -183683 -343505 -280480 99268 -158017 103951
9290H2163C613a87494e3433a2806m6530j00501g0376C8512f272A87862c37133
9278a09438j65117j6340b9479B89440A06970B4433b60411M6198d7451E3811c85719
9266d7213C9823J66423G6762K3241a00401a0461k03574h3003A80314a96745i1738
9254i6185A92526b49909K0176a1301l1070k24256O8881B6180b65256f1442b5508
9242a44534O9850c1300e946j57497o1026A25621a77926c4540A71249a75208a1111
9230c61543a73783d150r147l30720A44533b21258D698J26471g9103a111D64849
9218b03018k12114J42905h5822c30j29929B00739D0010b29993K2547H1481b72950
9206C14311b13980i9136J089c4828A76041a07562C4861a79424A47523J7138d328
$$ plain form
9290 82163 3613 -187494 -53433 -12806 -59336 -159837 -70376 38512 -6272 187862 -337133
9278 -109438 -274555 -290895 -29479 289440 106970 24433 -260411 -214213 -47451 53811 -385719
9266 -47213 39823 206246 76762 100003 -100401 -10461 -214035 -83003 180314 -196745 -91738
9254 -96185 192526 -249909 -229733 -11301 -42371 -266627 -197746 26180 -265256 -61442 -25508
9242 -144534 -74684 -31300 -5946 -163443 -224469 125621 -177926 -34540 171249 -175208 -11111
9230 -361543 -173783 -4150 -13297 -344017 144533 -221258 4698 131169 -79103 -1111 464849
9218 -203018 -415132 -272227 -85822 -330 -130259 200739 40010 -229993 -207446 81481 -272950
9206 314311 -213980 -99136 -98047 -34828 176041 -107562 34861 -179424 147523 164661 -4328
9194b29403k1209N1621C463Q7523d01717J57177c5721J314A61802a5659r0778
9183a06437a3608I3720J2292g9471k39027A4159c19270C5123i8902d342l72019
9172c76361I7498P5073b18740B49444a57918J0943B05174l7398B7985J26138D1535
9160A11548e9103C0967J08242e5671k8714o1142j85294J07212e2264J8477j28983
9149a62770m719q1567A25041b1204k18891N9770q9644A79982a28156D945c7999
9137a93187c3920n9673j59366j00566C83571A63398a55903J4372L4284a1463B3715
9125I5916d8661A93686F497N6982b3842k8442j18506g9485k32450D06039H0181
9113A99773G0534B2296b22284A719f9265g784q2596j69654e4908F7851a39858
$$ plain form
9194 -229403 -250612 -198991 3463 90986 -401717 -244540 -35721 -34407 161802 -15659 -106437
9183 -106437 -13608 93720 106012 -79471 -318498 14159 -319270 35123 -98902 -4342 -376361
9172 -376361 97498 172571 -218740 249444 -157918 -146975 205174 167776 27985 154123 41535
9160 111548 -59103 30967 139209 -55671 -84385 -145527 -330821 -223609 -52264 -33787 -162770
9149 -162770 -167489 -249056 125041 -21204 -240095 -180325 -269969 179982 -128156 4945 -37999
9137 -193187 -33920 -93593 -252959 -353525 383571 163398 -155903 -141531 -107247 -11463 23715
9125 95916 -48661 193686 6497 63479 -23842 -52284 -170790 -79485 -311935 406039 80181
9113 199773 70534 22296 -222284 1719 -69265 -7784 -90380 -260034 -54908 67851 -139858
9101b51231c85C91849b6585k1163j70121A46412a1723A7137J44266C9279J76931
9090B16210h8081j61185i3688A77836a42183O2132l65396a63800H3776f0451B3966
9078a89708I8472b60374D5245b18768D7640J00245a88135A86314a08792j91937
9068c00729A38882d71508C33785k3479A24141D3471a25544E0183b23023e0452
9057f1548a3629l00845C20004i8194p0403B17208b16073I5819b35299f4552k07095
9046b71647B46264a86749H9316a31876k79157A3321J45041e3087k84120A52190
9035B52377e7484E7345a48153I8435d6585k71268A85904a62580A79678a21100
9024F1302R7265c47371R8337l7728Q1441e598r7856k17347b478p5643A26573c03510
$$ plain form
9101 -251231 -385 391849 -26585 -47748 -217869 146412 -11723 17137 161403 39279 216210
9090 216210 -88081 -249266 -93688 177836 -142183 -80051 -445447 -163800 83776 -60451 23966
9078 -189708 98472 -260374 45245 -218768 47640 147885 -188135 186314 -108792 -300729
9068 -300729 138882 -471508 333785 310306 124141 43471 -125544 50183 -223023 -50452
9057 -61548 -13629 -314474 320004 -98194 -168597 217208 -216073 95819 -235299 -64552 -271647
9046 -271647 246264 -186749 89316 -131876 -411033 13321 158362 -53087 -337207 152190
9035 252377 -57484 57345 -148153 98435 -46585 -317853 185904 -162580 179678 -121100
9024 61302 158567 -347371 -249034 -286762 -205321 -5598 -103454 -320801 -2478 -78121 126573 -303510
9011b1674K400A80439c68457f5497C30770b17981A65880a43914A4090a92544j60835
9000c53379f7720j440N738n4158j50831R4152B19392H4592i3674b7153n5820j42727
8988b25700b3064g987j63788F4257a93393k43137K01323P2006G1907a66274A55894
8976a09606j09362A17020b73328A04406a42398E1414E557R2138a1076j94638r390
8965b15104j28008f5537i993j27183I0283f2174F3986j9290O996b02702o6722
8954b69424J29838e2803l47455a34227j29903A26107L47882b56448Q7404e7371
8943d4822A04772R1953A8243b57788f6357r3704N8651e986B75268J06357I1075
8931b15293E1057h941k0603B54696a83535B9024J88849M52158L25553L036273
$$ plain form
9011 -21674 -19274 180439 -368457 -65497 330770 -217981 165880 -143914 14090 -192544 -353379
9000 -353379 -67720 -69160 -63422 -117580 -268411 -174259 219392 84592 -93674 -27153 -82973 -225700
8988 -225700 -23064 -7987 -171775 64257 -193393 -436530 -235207 -163201 71907 -166274 155894
8976 -109606 -218968 117020 -273328 104406 -142398 51414 5557 97695 -11076 -205714 -215104
8965 -215104 -343112 -65537 -9993 -137176 90283 -62174 63986 44696 51692 -202702 -269424
8954 -269424 -139586 -52803 -400258 -134227 -264130 126107 473989 -256448 -169044 -57371
8943 -44822 104772 196725 18243 -257788 -66357 -160061 -101410 -5986 275268 381625 91075
8931 -215293 51057 -8941 -29544 254696 -183535 29024 217873 670031 995584 4031857
8921D031857P565898C891730A267978C94605K0864P0117A91495k9392d60818A33525
8910d1811B82773A18282L10054G0731a56598g6183j03917D23813a68440F6057
8899A20087c71052h7581c3404A98891a92099C47503j71891b47568d7261l04467
8889c51728A65140a7149H673K67699c25156A10799d4550B49075r4520D1859A5351
8877e1481m518G1313k6340a47228L5841F83414A30097b61060F4483n169J1879
$$ plain form
8921 4031857 11597755 3891730 1267978 394605 415469 485586 191495 162103 -460818 133525
8910 -41811 282773 118282 428336 70731 -156598 -76183 -180100 423813 -168440 66057
8899 120087 -371052 -87581 -33404 198891 -192099 347503 175612 -247568 -47261 -351728
8889 -351728 165140 -17149 8673 276372 -325156 110799 -44550 249075 154555 41859 15351
8877 -51481 -55999 71313 44973 -147228 -111387 683414 130097 -261060 64483 59314 71193
$$ [...]
##END NTUPLES=NMR SPECTRUM
##END=
